##TITLE=31Pdec_LY-12Dix.3.B
 CD3CN, 24 sc
 3.06.2021
##JCAMPDX= 6.0         $$ Bruker NMR JCAMP-DX V2.0
##DATA TYPE= NMR SPECTRUM
##DATA CLASS= NTUPLES
##ORIGIN= UXNMR, Bruker Analytische Messtechnik GmbH
##OWNER= root
$$ XWIN-NMR		Version 3.5
$$ Thu Jun  3 10:58:04 2021 Russian Standard Time (UT+4h)  she@DPX200
##.OBSERVE FREQUENCY= 81.013821
##.OBSERVE NUCLEUS= ^31P
##.ACQUISITION MODE= SIMULTANEOUS
##.ACQUISITION SCHEME= undefined
##.AVERAGES= 24
##.DIGITISER RES= 16
##SPECTROMETER/DATA SYSTEM= spect
##.PULSE SEQUENCE= zgpg30
##.SOLVENT NAME= CD3CN
##.SHIFT REFERENCE= (INTERNAL, CD3CN, 0, 248.564)
##AUDIT TRAIL= $$ (NUMBER, WHEN, WHO, WHERE, WHAT)
$$ ##TITLE= Audit trail, XWIN-NMR		Version 3.5
$$ ##JCAMPDX= 5.01
$$ ##ORIGIN= Bruker BioSpin GmbH
$$ ##OWNER= she
$$ F:/spectra/data/she/nmr/P31/1/pdata/1/auditp.txt
$$ ##AUDIT TRAIL=  $$ (NUMBER, WHEN, WHO, WHERE, WHAT)
(   1,<2021-06-03 10:56:29.60 +0400>,<she>,<DPX200>,
      <created by zg, POWCHK disabled, PULCHK disabled
       configuration hash MD5:
       00 E9 B6 7A A2 85 ED C7 34 08 36 98 17 FE 4E 26
       data hash MD5: 32K
       6B 16 7A 57 C4 01 CC 4B 57 B2 E3 D2 FF 01 E2 1F>)
(   2,<2021-06-03 10:56:57.39 +0400>,<she>,<DPX200>,
      <Start of raw data processing
       efp BC_mod = 2 LB = 1 FT_mod = 6 PKNL = 1 PHC0 = -5962.985 PHC1 = 247.0723 SI = 64K 
       data hash MD5: 64K
       D1 6F 9C 3A F6 23 4E 3D 04 E5 41 03 D6 9C 08 44>)
(   3,<2021-06-03 10:57:24.04 +0400>,<she>,<DPX200>,
      <pk PHC0 = -0.265166 PHC1 = 0 
       data hash MD5: 64K
       AB 39 51 F8 D3 6A F3 12 E5 D0 23 E2 D0 AC D7 92>)
(   4,<2021-06-03 10:57:27.07 +0400>,<she>,<DPX200>,
      <abs ABSG = 5 
       data hash MD5: 64K
       1D F0 45 C7 B8 C9 39 DC 03 49 57 40 C6 C5 67 AD>)
$$ ##END=
$$ 
$$ hash MD5
$$ EA 72 7C C3 59 2A CA 8B F7 C4 D7 67 70 66 55 36
##$RELAX= 
##$RELAX= 
##$RELAX= 
##$RELAX= 
##$RELAX= 
##$RELAX= 
##$RELAX= 
##$RELAX= 
$$ Bruker specific parameters
$$ --------------------------
##$DU= <F:/spectra>
##$EXPNO= 1
##$NAME= <P31>
##$PROCNO= 1
##$TYPE= <nmr>
##$USER= <she>
##$AMP= (0..31)
100 100 100 100 100 100 100 100 100 100 100 100 100 100 100 100 100 100 
100 100 100 100 100 100 100 100 100 100 100 100 100 100 
##$AQSEQ= 0
##$AQ_mod= 1
##$AUNM= <au_zg>
##$AUTOPOS= <>
##$BF1= 81.014009
##$BF2= 200.13
##$BF3= 200.13
##$BF4= 200.13
##$BF5= 200.13
##$BF6= 200.13
##$BF7= 200.13
##$BF8= 200.13
##$BYTORDA= 1
##$CFDGTYP= 0
##$CFRGTYP= 5
##$CHEMSTR= <none>
##$CNST= (0..31)
1 1 145 1 1 1 1 1 1 1 1 1 1 1 1 1 1 1 1 1 1 1 1 1 1 1 1 1 1 1 1 1 
##$CPDPRG= <waltz16>
##$CPDPRG1= <>
##$CPDPRG2= <waltz16>
##$CPDPRG3= <>
##$CPDPRG4= <mlev>
##$CPDPRG5= <mlev>
##$CPDPRG6= <mlev>
##$CPDPRG7= <mlev>
##$CPDPRG8= <mlev>
##$CPDPRGB= <>
##$CPDPRGT= <>
##$D= (0..31)
0 1 0 0 0 0 0 0 0 0 0 0.03 2e-05 3e-06 0 0 0 0 0 0 0 0 0 0 0 0 0 0 0 0 
0 0 
##$DATE= 1622703388
##$DBL= (0..7)
120 120 120 11 120 120 24 19 
##$DBP= (0..7)
150 150 150 150 150 150 150 150 
##$DBP07= 0
##$DBPNAM0= <>
##$DBPNAM1= <>
##$DBPNAM2= <>
$$ [...]
##$SUBNAM3= <"">
##$SUBNAM4= <"">
##$SUBNAM5= <"">
##$SUBNAM6= <"">
##$SUBNAM7= <"">
##$SUBNAM8= <"">
##$SUBNAM9= <"">
##$SW= 501.771253377433
##$SWIBOX= (0..15)
0 1 3 0 0 0 0 0 0 0 0 0 0 0 0 0 
##$SW_h= 40650.406504065
##$TD= 32768
##$TD0= 1
##$TE= 0
##$TE2= 300
##$TE3= 300
##$TEG= 300
##$TL= (0..7)
0 120 53 12 22 120 120 120 
##$TP= (0..7)
150 150 150 150 150 150 150 150 
##$TP07= 0
##$TPNAME0= <>
##$TPNAME1= <>
##$TPNAME2= <>
##$TPNAME3= <>
##$TPNAME4= <>
##$TPNAME5= <>
##$TPNAME6= <>
##$TPNAME7= <>
##$TPOAL= (0..7)
0.5 0.5 0.5 0.5 0.5 0.5 0.5 0.5 
##$TPOFFS= (0..7)
0 0 0 0 0 0 0 0 
##$TUNHIN= 0
##$TUNHOUT= 0
##$TUNXOUT= 0
##$USERA1= <user>
##$USERA2= <user>
##$USERA3= <user>
##$USERA4= <user>
##$USERA5= <user>
##$V9= 5
##$VALIST= <valist>
##$VCLIST= <CCCCCCCCCCCCCCC>
##$VD= 0
##$VDLIST= <DDDDDDDDDDDDDDD>
##$VPLIST= <PPPPPPPPPPPPPPP>
##$VTLIST= <TTTTTTTTTTTTTTT>
##$WBST= 1024
##$WBSW= 4
##$XGAIN= (0..3)
0 0 0 0 
##$XL= 0
##$YL= 0
##$YMAX_a= 8336
##$YMIN_a= -8609
##$ZGOPTNS= <>
##$ZL1= 120
##$ZL2= 120
##$ZL3= 120
##$ZL4= 120
##$ABSF1= 248.5645
##$ABSF2= -253.2056
##$ABSG= 5
##$ABSL= 3
##$ALPHA= 0
##$AQORDER= 0
##$ASSFAC= 0
##$ASSFACI= 0
##$ASSFACX= 0
##$ASSWID= 0
##$AUNMP= <proc_1d>
##$AZFE= 0.1
##$AZFW= 0.5
##$BCFW= 0
##$BC_mod= 2
##$BYTORDP= 0
##$COROFFS= 0
##$CY= -3
##$DATMOD= 1
##$DC= 0
##$DFILT= <>
##$DTYPP= 0
##$F1P= 0
##$F2P= 0
##$FCOR= 1
##$FTSIZE= 65536
##$FT_mod= 6
##$GAMMA= 0
##$GB= 0
##$INTBC= 1
##$INTSCL= 5.30512e-09
##$ISEN= 30
##$LB= 1
##$LEV0= 0
##$LPBIN= 0
##$MAXI= 10000
##$MC2= 0
##$MEAN= 0
##$ME_mod= 0
##$MI= 50
##$NCOEF= 0
##$NC_proc= -4
##$NLEV= 6
##$NOISF1= 182.463
##$NOISF2= 159.3651
##$NSP= 0
##$NTH_PI= 0
##$NZP= 0
##$OFFSET= 248.5645
##$PC= 4
##$PHC0= -5963.25
##$PHC1= 247.0723
##$PH_mod= 1
##$PKNL= yes
##$PPARMOD= 0
##$PSCAL= 0
##$PSIGN= 0
##$REVERSE= no
##$SF= 81.014009
##$SI= 65536
##$SIGF1= 159.3651
##$SIGF2= -187.1042
##$SINO= 113.3802
##$SIOLD= 16384
##$SREGLST= <1H.CDCl3>
##$SSB= 0
##$STSI= 65536
##$STSR= 0
##$SW_p= 40650.406504065
##$SYMM= 0
##$S_DEV= 0
##$TDeff= 32768
##$TDoff= 0
##$TI= <>
##$TILT= no
##$TM1= 0
##$TM2= 0
##$TOPLEV= 0
##$USERP1= <user>
##$USERP2= <user>
##$USERP3= <user>
##$USERP4= <user>
##$USERP5= <user>
##$WDW= 1
##$XDIM= 65536
##$YMAX_p= 490868472
##$YMIN_p= -17114818
$$ End of Bruker specific parameters
$$ ---------------------------------
##NTUPLES= NMR SPECTRUM
##VAR_NAME=  FREQUENCY,     SPECTRUM/REAL,   SPECTRUM/IMAG
##SYMBOL=    X,             R,               I
##VAR_TYPE=  INDEPENDENT,   DEPENDENT,       DEPENDENT
##VAR_FORM=  AFFN,          ASDF,            ASDF
##VAR_DIM=   65536,         65536,           65536
##UNITS=     HZ,            ARBITRARY UNITS, ARBITRARY UNITS
##FACTOR=    0.620285442955139, 1,           1
##FIRST=     20137.2065510759, 0,            0
##LAST=      -20513.1999529892, 0,           0
##MIN=       -20513.1999529892, -17114818,   0
##MAX=       20137.2065510759, 490868472,    0
$$ Real data points
##PAGE= N=1
##DATA TABLE= (X++(R..R)), XYDATA
$$ [...]
$$ plain form
35471 846942 587572 334572 378151 696097 893118 614329 -69864 -762174 -1072595 -812058
35461 -812058 -111903 531907 619523 222855 -86274 -50277 -76806 -477534 -777782 -303160
35451 -303160 778752 1550742 1413439 615792 -224366 -692693 -685954 -376386 -141315 -222338
35441 -222338 -438997 -496792 -465603 -581969 -706435 -494366 -80598 -533 -312867 -404404
35431 -404404 76744 672499 886168 961664 1321671 1635625 1201622 143572 -523961 -185778
35421 -185778 616351 996524 805193 495348 276472 -47641 -508044 -784142 -716303 -596270
35411 -596270 -705636 -850690 -664587 -198313 146927 224282 293956 483680 474930 -3293
35401 -3293 -634507 -861042 -668201 -581744 -819004 -906378 -434183 171698 123889 -611745
$$ packed form
35471H46942k59370k53000M3579L17946J97021k78789o84193o92310l10421K60537
35461h12058P00155O43810Q7616l96668l09129L5997k6529m00728l00248M74622
35451c03160J081912P71990j37303p97647q40158m68327O739L09568K35071q1023
35441b22338k16659n7795L1189j16366j24466K12069M13768Q0065l12334r1537
35431d04404M81148N95755K13669P5496L60007L13954m34003j058050o67533L38183
35421a85778Q02129L80173j91331l09845k18876l24113m60403k76098O7839J20033
35411e96270j09366j45054J86103M66274L45240P7355O9674J89724q750m78223
35401c293o31214k26535J92841Q6457k37260q7374M72195O05881m7809p35634
$$ plain form
35391 -611745 -1205376 -1037137 -395084 92698 249909 231600 35209 -352915 -600858 -415606
35381 -415606 -133323 -291316 -686227 -597822 -20729 159956 -480795 -1207473 -1280796 -1042289
35371 -1042289 -1124465 -1248259 -759213 68610 323187 -117051 -465709 -333598 -163987 -241480
35361 -241480 -232927 18878 145344 50349 206327 723226 949299 530576 79881 156120
35351 156120 323688 -3772 -440110 -246956 417292 812760 823073 883948 972564 692521
35341 692521 257276 346955 926200 1198036 891704 599887 556097 127893 -920055 -1614539
35331 -1614539 -1073660 34725 305411 -448281 -999539 -461056 589792 1004831 525721
35322 525721 -55783 26492 638459 1012291 729570 211803 96237 323283 244280 -361934
$$ packed form
35391f11745n93631J68239O42053M87782J57211j8309j96391l88124k47943J85252
35381d15606K82283j57993l94911Q8405N77093J80685o40751p26678p3323K38507
35371a042289q2176j23794M89046Q27823K54577m40238l48658J32111J69611p7493
35361b41480Q553K51805J26466r4995J55978N16899K26073m18723m50695P6239
35351A56120J67568l27460m36338J93154O64248L95468J0313O0875Q8616k80043
35341F92521m35245Q9679N79245K71836l06332k91817m3790m28204j047948o94484
35331a614539N40879J108385K70686p53692n51258N38483J050848M15039m79110
35322E25721n81504Q2275O11967L73832k82721n17767j15566K27046p9003o06214
$$ plain form
35312 -361934 -884530 -721749 -63603 534701 927790 1195899 1049799 177940 -906434
35303 -906434 -1168476 -386259 493081 631504 323466 314155 641492 777250 584989 441937
35293 441937 504730 490235 246692 8258 -52982 -78620 -168401 -180083 -72257 -71830 -283346
35282 -283346 -482378 -535658 -671287 -1035804 -1328131 -1247146 -998708 -912065 -806016 -285538
35272 -285538 452834 712203 261401 -305945 -359255 23636 319349 255080 -12715 -222898
35262 -222898 -278179 -255921 -276479 -341346 -308494 -95392 165131 286031 229887 10473 -407510
35251 -407510 -860183 -880718 -258853 465055 568725 120702 -173901 -62167 -8448 -260394
35241 -260394 -374668 -9243 432969 416025 56869 -174464 -151318 -2361 333911 925120
$$ packed form
35312c61934n22596J62781O58146N98304L93089K68109j46100q71859j084374
35303i06434k62042P82217Q79340J38423l08038r311L27337J35758j92261j43052
35293D41937O2793j4495k43543k38434o1240k5638q9781j1682J07826M27k11516
35282b83346j99032n3280j35629l64517k92327Q0985K48438Q6643J06049N20478
35272b85538P38372K59369m50802n67346n3310L82891K95713o4269k67795k10183
35262b22898n5281K2258k0558o4867L2852K13102K60523J20900n6144k19414m17983
35251d07510m52673k0535O21865P23908J03670m48023k94603J11734N3719k51946
35241b60394j14274L65425M42212j6944l59156k31333K3146J48957L36272N91209
$$ plain form
35231 925120 1427729 1378600 826786 278268 78608 154773 255257 169372 -146102 -410572
35221 -410572 -201580 439135 854345 563027 -84518 -449939 -506477 -664051 -914377 -794242
35211 -794242 -183678 450869 731748 818886 1008186 1234703 1187261 743306 171050 -53595
35201 -53595 286669 780685 704760 -100433 -944628 -1153193 -876377 -630580 -421314 33888
35191 33888 467927 266513 -486325 -949213 -697210 -269134 -265517 -522740 -571880 -412337
35181 -412337 -375524 -569271 -868486 -1182504 -1372071 -1178725 -624930 -233757 -405672 -757321
35171 -757321 -583713 89342 471968 150853 -275750 -65290 560909 745057 289297 -63889
35161 -63889 155965 332029 -271851 -1193528 -1258113 -253071 770606 1004314 805897 775182
$$ packed form
35231I25120N02609m9129n51814n48518j99660P6165J00484q5885l15474k64470
35221d10572K08992O40715M15210k91318o47545l65421n6538j57574k50326J20135
35211g94242O10564O34547K80879Q7138J89300K26517m7442m43955n72256k24645
35201e3595L40264M94016p5925q05193q44195k08565K76816K45797K09266M55202
35191C3888M34039k01414p52838m62888K52003M28076L617k57223m9140J59543
35181d12337L6813j93747k99215l14018j89567J93346N53795L91173j71915l51649
35171g57321J73608O73055L82626l21115m26603K10460O26199J84148m55760l53186
35161f3889K19854J76064o03880r21677o4585J005042J023677K33708j98417l0715
$$ plain form
35151 775182 786899 554435 406711 710888 1085175 1021945 818599 1013347 1378790 1524148
35141 1524148 2058761 3794876 5905494 6373584 4606261 2282160 1074903 761912 323922
35132 323922 -229958 -216642 307622 650582 645387 722952 986891 1044899 732941 366006
35122 366006 251554 398192 640526 694461 256925 -580385 -1222897 -1256543 -1010616 -1047348
35112 -1047348 -1343812 -1424845 -1090579 -552508 -18346 427511 684321 760377 858160 994043
35102 994043 813795 193683 -311895 -160711 320330 370840 -127453 -648871 -925371 -1142832
35092 -1142832 -1298415 -1096055 -585994 -280943 -463881 -863225 -1113859 -1081521 -700147 -16078
35082 -16078 540710 473054 -97863 -583776 -811458 -1125012 -1512417 -1404326 -670387 -80192
$$ packed form
35151G75182J1717k32464j47724L04177L74287o3230k03346J94748L65443J45358
35141A524148N34613J736115K110618M68090j767323k324101j207257l12991m37990
35132C23922n53880J3316N24264L42960n195P7565K63939N8008l11958l66935
35122C66006j14452J46638K42334N3935m37536q37310o42512l3646K45927l6732
35112a047348k96464q1033L34266N38071N34162M45857K56810P6056R7783J35883
35102I94043j80248o20112n05578J51184M81041N0510m98293n21418k76500k17461
35092a142832j55583K02360N10061L05051j82938l99344k50634L2338L81374O84069
35082a6078N56788o7656n70917m85913k27682l13554l87405J08091P33939N90195
$$ plain form
35072 -80192 -244391 -682990 -574308 5731 286587 -8542 -372504 -358662 -114134 26035
35062 26035 29122 76650 240299 380867 282190 -94669 -430848 -294158 282699 686909
35052 686909 435175 -214430 -675278 -835494 -1001183 -1181638 -1027334 -569671 -436522 -997800
35042 -997800 -1702801 -1703509 -931724 -138527 59572 -212451 -450513 -380027 -65914 316726
35032 316726 612520 720845 670829 581262 442084 78303 -508368 -922783 -777998 -249404
35022 -249404 85570 -13561 -194981 -103001 118725 150300 44687 104987 349242 455101
35012 455101 223961 -186051 -499536 -543072 -223727 422148 1079265 1301403 938588 265625
35002 265625 -365389 -811927 -1047564 -1050051 -910947 -820965 -786751 -589168 -215230 -82363
$$ packed form
35072h0192j64199m38599J08682N80039K80856k95129l63962J3842K44528J40169
35062B6035L087M7528J63649J40568r8677l76859l36179J36690N76857M04210
35052F86909k51734o49605m60848j60216j65689j80455J54304M57663J33149n61278
35042i97800p05001p08P71785P93197J98099k72023k38062P0486L14113L82640
35032C16726K95794J08325n0016q9567j39178l63781n86671m14415J44785N28594
35022b49404L34974r9131j81420R1980K21726L1575j05613O0300K44255J05859
35012D55101k31140m10012l13485m3536L19345O45875O57117K22138l62815o72963
35002B65625o31014m46538k35637k487J39104Q9982L4214J97583L73938J32867
$$ plain form
34992 -82363 -522962 -1206912 -1447867 -1047995 -489709 -259475 -335084 -456449 -538682 -546590
34982 -546590 -234545 580235 1549111 1981648 1599805 833910 256072 -17584 -181598 -266666
34972 -266666 -149008 77947 117623 -98174 -302338 -317588 -296617 -370583 -339439 1382
34962 1382 407837 418995 17850 -263442 -4411 548770 746904 293376 -365195 -449200
34952 -449200 305446 1240356 1405369 687220 57287 422981 1426840 1820676 1018014
34943 1018014 -194134 -658279 -157516 571236 833061 578320 130819 -269746 -558862
34934 -558862 -729625 -771803 -665072 -411185 -124166 -13888 -133779 -196191 147185 804665
34924 804665 1239410 1091441 636930 429496 578974 649181 306772 -191550 -339944 -44926
$$ packed form
34992h2363m40599o83950k40955L99872N58286K30234p5609j21365q2233p908
34982e46590L12045Q14780R68876M32537l81843p65895n77838k73656j64014q5068
34972b66666J17658K26955L9676k15797k04164j5250K0971p3966L1144L40821
34962A382M06455J1158m01145k81292K59031N53181J98134m53528o58571q4005
34952d49200P54646R34910J65013p18149o29933L65694J003859L93836q02662
34943A018014j212148m64145N00763P28752K61825k54741m47501m00565k89116
34934e58862j70763m2178J06731K53887K87019J10278j19891o2412L43376O57480
34924H04665M34745j47969m54511k07434J49478P0207l42409m98322j48394K95018
$$ plain form
34914 -44926 299980 333041 55121 -351262 -733842 -914535 -720394 -247595 158356 377701
34904 377701 682998 1169339 1365294 866169 94148 -166693 121749 268439 -3696 -154227
34894 -154227 216776 688988 686097 266914 -167832 -457083 -526052 -181215 387198 410016
34884 410016 -454065 -1340259 -1217751 -390591 -43352 -468904 -769066 -357377 271633 529849
34874 529849 550190 614663 596115 446760 501832 769823 617843 -219677 -935264 -645865
34864 -645865 383509 1180771 1295237 923856 269014 -442398 -642833 23989 996700
34855 996700 1379390 1089564 757830 701469 737517 799238 907718 699729 -108045 -892970
34845 -892970 -756465 42357 361209 -28437 -119158 541038 981097 369914 -630042 -900992
$$ packed form
34914d4926L44906L3061k77920m06383l82580j80693J94141M72799M05951K19345
34904C77701L05297M86341J95955m99125p72021k60841K88442J46690k72135j50531
34894a54227L71003M72212k891m19183m34746k89251o8969L44837N68413K2818
34884D10016q64081q86194J22508Q27160L47239m25552l00162M11689O29010K58216
34874E29849K0341O4473j8548j49355N5072K67991j51980q37520p15587K89399
34864f45865J029374P97262J14466l71381o54842p11412k00435O66822R72711
34855I96700L82690k89826l31734n6361L6048O1721J08480k07989q07774p84925
34845h92970J36505P98822L18852l89646r0721O60196M40059o11183r99956k70950
$$ plain form
34835 -900992 -413304 131390 482997 760751 773022 357061 -26463 92509 354495 161496
34825 161496 -291288 -439672 -402738 -631274 -850174 -478877 84374 -155015 -1066208 -1313217
34815 -1313217 -322430 824169 993397 491621 266671 468186 642271 742390 1013918
34806 1013918 1203078 788610 -59559 -530035 -301031 6220 -219130 -629939 -373809
34797 -373809 652634 1474257 1183763 148202 -374472 168272 943312 930465 254808
34788 254808 -272087 -501834 -927739 -1454766 -1281281 -289779 457846 214434 -288517 26020
34778 26020 904753 1192202 591449 -35673 -74127 133889 182999 302601 705594 946966
34768 946966 566018 -60972 -164595 337299 813736 881241 771229 684012 410235 -128240
$$ packed form
34835i00992M87688N44694L51607K77754J2271m15961l83524J18972K61986j92999
34825A61496m52784j48384L6934k28536k18900L71297N63251k39389r11193k47009
34815a313217R90787J146599J69228n01776k24950K01515J74085J00119K71528
34806A013918J89160m14468q48169m70476K29004L07251k25350m10809K56130
34797c73809J026443Q21623k90494j035561n22674N42744P75040j2847o75657
34788B54808n26895k29747m25905n27027J73485R91502P47625k43412n02951L14537
34778B6020Q78733K87449o00753o27122l8454K08016M9110J19602M02993K41372
34768I46966l80948o26990j03623N01894M76437O7505j10012q7217k73777n38475
$$ plain form
34758 -128240 -500476 -382218 -162541 -382991 -828682 -833969 -391503 -205040 -528048 -741081
34748 -741081 -437473 -163764 -455333 -765095 -227484 864269 1329269 808682 270301
34739 270301 592304 1438988 1920326 1740452 1233380 722521 331657 138432 81223 -116921
34729 -116921 -606203 -1127892 -1307969 -1077438 -617883 -98899 318206 424560 166872 -218659
34719 -218659 -460031 -512227 -447946 -286896 -92542 -27344 -111309 -109324 125434 353789 237612
34708 237612 -164193 -410674 -180863 379464 818727 805260 371644 -229326 -808475 -1234060
34698 -1234060 -1221209 -513706 565423 1178044 946345 466663 372167 330132 -294502 -1136444
34688 -1136444 -1190916 -400253 172341 -99892 -705899 -1122375 -1551957 -2037792 -1901465 -835850
$$ packed form
34758a28240l72236J18258K19677k20450m45691n287M42466J86463l23008k13033
34748g41081L03608K73709k91569l09762N37611J091753M65000n20587n38381
34739B70301L22003Q46684M81338j79874n07072n10859l90864j93225n7209j98144
34729a16921m89282n21689j80077K30531M59555N18984M17105J06354k57688l85531
34719b18659k41372n2196O4281J61050J94354O5198q3965J985K34758K28355j16177
34708B37612m01805k46481K29811N60327M39263j3467m33616o00970n79149m25585
34698a234060J2851P07503J079129O12621k31699m79682r4496m2035o24634q41942
34688a136444n4472P90663N72594k72233o06007m16476m29582m85835J36327J065615
$$ plain form
34678 -835850 284980 537151 210409 103690 201363 -6265 -401271 -450162 -205878 -148348
34668 -148348 -263684 -160968 110709 206463 214086 384036 394501 -171943 -856290 -881382
34658 -881382 -525094 -769983 -1593925 -1868270 -1175044 -474455 -518464 -760404 -482155 4365
34648 4365 59838 -197559 -340060 -501262 -926081 -1154545 -577739 461807 979490 681975
34638 681975 290471 507616 1204709 1701004 1470986 570820 -330422 -412149 477391 1502128
34628 1502128 1627707 704516 -455269 -996124 -767969 -222703 168737 334471 541481
34619 541481 958507 1354407 1384237 1097752 861172 782758 610591 271507 37373 -38860
34609 -38860 -346734 -1033344 -1553712 -1380033 -813312 -546934 -644712 -523036 119476 864137
$$ packed form
34678h35850J120830K52171l26742j06719R7673k07628l95006m8891K44284N7530
34668a48348j15336J02716K71677R5754P623J69950J0465n66444o84347k5092
34658h81382L56288k44889q23942k74345O93226P00589m4009k41940K78249M86520
34648D365N5473k57397j42501j61202m24819k28464N76806J039546N17683k97515
34638F81975l91504K17145O97093M96295k30018r00166r01242q1727Q89540J024737
34628A502128J25579r23191j159785n40855K28155N45266L91440J65734K07010
34619E41481M17026L95900K9830k86485k36580p8414j72167l39084k34134p6233
34609c8860l07874o86610n20368J73679N66721K66378r7778J21676O42512P44661
$$ plain form
34599 864137 1113264 716261 30667 -379622 -160701 452555 757220 336987 -434449 -905815
34589 -905815 -941533 -832008 -660766 -305686 56805 76157 -110516 57254 706028 1303338
34579 1303338 1480391 1502817 1625897 1556304 1024750 437497 372343 704540 831391 615925
34569 615925 498712 679676 778623 468233 -28312 -308405 -302581 -167010 37323 260047
34559 260047 271438 -94657 -570726 -622550 -41388 782749 1219723 970067 315587 -132935
34549 -132935 -4263 445274 598723 198291 -352461 -530835 -354338 -264033 -478657 -764861
34539 -764861 -817070 -580544 -189452 142490 156880 -212612 -583218 -448442 114741 430465
34529 430465 134443 -264579 -81687 577542 1002159 862945 501682 246201 -34886 -503668
$$ packed form
34599H64137K49127l97003o85594m10289K18921O13256L04665m20233p71436m71366
34589i05815l5718J09525J71242L55080L62491J9352j86673J67770O48774N97310
34579A303338J77053K2426J23080o9593n31554n87253o5154L32197J26851k15466
34569F15925j17213J80964R8947l10390m96545k80093N824J35571K04333K22724
34559B60047J1391l66095m76069n1824N81162Q24137M36974k49656o54480m48522
34549a32935J28672M49537J53449m00432n50752j78374J76497R0305k14624k86204
34539g64861n2209K36526L91092L31942J4390l69492l70606J34776N63183L15724
34529D30465k96022l99022J82892O59229M24617j39214l61263k55481k81087m68782
$$ plain form
34519 -503668 -894362 -807911 -257063 364508 742359 838750 725386 474206 203961 13969
34509 13969 -168582 -496468 -912533 -1147474 -1105247 -1042176 -1161490 -1197533 -719311 195470
34499 195470 941119 1105871 854648 441132 -231683 -1187098 -1860017 -1601719 -615605 196334
34489 196334 392579 425273 703693 808755 139819 -987158 -1496908 -834288 330988
34480 330988 844673 311536 -566161 -839883 -352318 208374 260578 45884 153186 572532
34470 572532 706884 298777 -198927 -349734 -326974 -457915 -591307 -369263 121399 446174
34460 446174 487902 599039 1038918 1551631 1641377 1168586 569836 416471 736348 943445
34450 943445 606375 52935 -148485 -82175 -276778 -700724 -711730 -132144 398863 449066
$$ packed form
34519e03668l90694Q6451N50848O21571L77851R6391j13364k51180k70245j89992
34509A3969j82551l27886m16065k34941M2227O3071j19314l6043M78222R14781
34499A95470P45649J64752k51223m13516o72815r55415o72919K58298R86114Q11939
34489A96334J96245L2694K78420J05062o68936j126977n09750O62620J165276
34480C30988N13685n33137q77697k73722M87565N60692N2204k14694J07302M19346
34470E72532J34352m08107m97704j50807K2760j30941j33392K22044M90662L24775
34460D46174M1728J11137M39879N12713Q9746m72791n98750j53365L19877K07097
34450I43445l37070n53440k01420O6310j94603m23946j1006N79586N31007N0203
$$ plain form
34440 449066 428748 773668 1183197 1203368 956749 738460 488588 250669 501353 1319228
34430 1319228 1869911 1538502 952650 935291 1046503 323726 -974561 -1654904 -1389055
34421 -1389055 -939189 -683344 -238179 388384 590566 330857 266347 438928 112833 -706585
34411 -706585 -931804 -171145 433249 -42006 -848025 -819221 -107565 394713 551997 755145
34401 755145 805869 237766 -584001 -797728 -346226 -10824 -218890 -621884 -803285 -681621
34391 -681621 -258690 362697 747127 533083 43602 -74383 227413 393711 145176 -191429
34381 -191429 -248575 -22175 318159 599776 620146 321086 -37526 -197588 -275962 -470623
34371 -470623 -591550 -347909 46494 73940 -339142 -753239 -859316 -742805 -545546 -316853
$$ packed form
34440D49066k0318L44920M09529K0171k46619k18289k49872k37919K50684Q17875
34430A319228N50683l31409n85852j7359J11212p22777j298287o80343K65849
34421a389055M49866K55845M45165O26563K02182k59709o4510J72581l26095q19418
34411g06585k25219P60659O04394m75255q06019K8804P11656N02278J57284K03148
34401G55145N0724n68103q21767k13727M51502L35402k08066m02994j81401J21664
34391f81621M22931O21387L84430k14044m89481j17985L01796J66298k48535l36605
34381a91429n7146K26400L40334K81617K0370k99060l58612j60062p8374j94661
34371d70623j20927K43641L94403K7446m13082m14097j06077J16511J97259K28693
$$ plain form
34361 -316853 -182316 -227357 -232253 54307 416337 395635 -9278 -343117 -394945 -396399 -454032
34350 -454032 -297443 220316 776429 955160 715738 358988 234772 493719 878543 811914
34340 811914 23083 -952938 -1277269 -789493 -95274 294568 432751 504994 462143 266884
34330 266884 78180 -10987 -70465 -44464 228757 575150 530673 48424 -301712 -131163
34320 -131163 205046 197479 -64548 -147214 53343 343582 657131 945256 860282 125683
34310 125683 -833433 -1172066 -617989 229034 662863 554547 187992 -188235 -452837 -547513
34300 -547513 -531886 -539768 -588308 -614815 -708994 -995196 -1239436 -1006297 -384564 -66994 -347569
34289 -347569 -516589 165988 1247794 1599837 1020499 457642 510142 620587 205355 -232889
$$ packed form
34361c16853J34537m5041m896K86560L62030k0702m04913l33839n1828j454n7633
34350d54032J56589N17759N56113J78731k39422l56750j24216K58947L84824o6629
34340H11914p88831r76021l24331M87776O94219L89842J38183P2243m2851j95259
34330B66884j88704q9167n9478K6001K73221L46393m4477m82249l50136J70549
34320a31163L36209p567k62027q2666K00557K90239L13549K88125q4974p34599
34310A25683r59116l38633N54077Q47023M33829j08316l66555l76227k64602r4676
34300e47513J5627p882m8540k6507r4179k86202k44240K33139O21733L17570k80575
34289c47569j69020O82577J081806L52043n79338n62857N2500J10445m15232m38244
$$ plain form
34279 -232889 102430 925574 1219206 782136 510011 1014674 1756829 1900711 1455453 1102486
34269 1102486 1202263 1408476 1190620 486682 -169148 -140888 582810 1216178 979639 53077
34259 53077 -591233 -323835 546869 1369991 1873896 2081443 1955124 1507813 993678 629879
34249 629879 319151 -47704 -232121 33754 506213 611835 165472 -416880 -663536 -537938
34239 -537938 -305708 -136344 -1776 115444 92823 -159201 -459234 -483104 -223511 -115285
34229 -115285 -463533 -907684 -809019 -101797 646599 1014660 1096281 1023117 676785 140607
34219 140607 -72314 333988 915862 1046499 722960 385712 175048 -124343 -510206 -651427
34209 -651427 -408607 -79924 -7635 -185067 -347121 -284440 -4387 317709 511707 553177
$$ packed form
34279b32889L35319Q23144K93632m37070k72125N04663P42155J43882m45258l52967
34269A102486R9777K06213k17856p03938o55830K8260P23698O33368k36539r26562
34259E3077o44310K67398Q70704Q23122N03905K07547j26319m47311n14135l63799
34249F29879l10728l66855j84417K65875M72459J05622m46363n82352k46656J25598
34239e37938K32230J69364J34568J17220k2621k52024l00033k3870K59593J08226
34229a15285l48248m44151R8665P07222P48396L68061Q1621p3164l46332n36178
34219A40607k12921M06302N81874J30637l23539l37248k10664k99391l85863j41221
34209f51427K42820L28683P2289j77432j62054O2681K80053L22096J93998M1470
$$ plain form
34199 553177 484643 244803 -229994 -739914 -950874 -864884 -827104 -935552 -843630 -382742
34189 -382742 47767 76693 -45078 87057 309952 215915 -47746 23146 384321 457786
34179 457786 144960 110853 735974 1375302 1181492 326554 -176621 201559 872104 950380
34169 950380 337552 -307189 -479551 -344607 -320403 -503044 -711183 -837176 -835471 -534180
34159 -534180 134098 764768 789046 229414 -256718 -231977 -4649 -110270 -606118 -1106329
34149 -1106329 -1242275 -899877 -275753 158865 92956 -79014 409829 1582110 2433189
34140 2433189 2151559 1165253 486140 418651 507343 440983 306948 97802 -312596 -655283
34130 -655283 -361272 636016 1645493 1972374 1618668 1096814 834780 914104 1155859 1272023
$$ packed form
34199E53177o8534k39840m74797n09920k10960Q5990L7780j08448R1922M60888
34189c82742M30509K8926j21771J32135K22895r4037k63661P0892L61175P3465
34179D57786l12826l4107O25121O39328j93810q54938n03175L78180O70545P8276
34169I50380o12828o44741j72362J34944K4204j82641k08139j25993J705L01291
34159e34180O68278O30670K4278n59632m86132K4741K27328j05621m95848n00211
34149a106329j35946L42398O24124M34618o5909j71970M88843J172281Q51079
34140B433189k81630r86306o79113o7489Q8692o6360j34035k09146m10398l42687
34130f55283K94011R97288J009477L26881l53706n21854k62034P9324K41755J16164
$$ plain form
34120 1272023 1039639 482964 -85776 -239433 240373 1068903 1568997 1347596 845548
34111 845548 858039 1466726 1897260 1578792 831568 231478 -171983 -575989 -838778 -728867
34101 -728867 -439069 -311087 -280882 -80717 241015 472655 665101 917500 982143 600818
34091 600818 27042 -288203 -321490 -307390 -217319 45152 207443 9479 -210554 36780
34081 36780 557548 746499 499775 173191 -153942 -600952 -854516 -482559 192540 400489
34071 400489 79940 -132649 -21364 77800 254355 966008 1797447 1540108 42340 -1181833
34061 -1181833 -956745 -57588 105499 -433937 -568139 -8674 420330 212996 -205215
34052 -205215 -396872 -525526 -773632 -857108 -516929 -49442 37420 -336738 -814431 -1089264
$$ packed form
34120A272023k32384n56675n68740j53657M79806Q28530N00094k21401n02048
34111H45548J2491O08687M30534l18468p47224o00090m03461m04006k62789J09911
34101g28867K89798J27982L0205K00165L21732K31640J92446K52399O4643l81325
34091F00818n73776l15245l3287J4100R0071K62471J62291j97964k20033K47334
34081C6780N20768J88951k46724l26584l27133m47010k53564L71957O75099K07949
34071D00489l20549k12589J11285R9164J76555P11653Q31439k57339j497768j224173
34061a181833K25088Q99157J63087n39436j34202N59465M29004k07334m18211
34052b05215j91657j28654k48106q3476L40179M67487Q6862l74158m77693k74833
$$ plain form
34042 -1089264 -1167810 -1188985 -1186356 -1124274 -1087364 -1256958 -1608475 -1769987 -1379363 -536851
34032 -536851 285122 738550 801190 558962 100832 -349281 -515540 -393717 -257669 -266355
34022 -266355 -286526 -154940 123450 472530 766598 728782 163096 -592350 -808011 -207614
34012 -207614 573119 643034 -143800 -1038055 -1179847 -416869 592344 1004845 563426 -219713
34002 -219713 -641893 -481842 -49397 237959 147396 -308978 -824366 -932913 -499241 11664
33992 11664 52220 -303789 -495301 -245340 142521 235709 -88570 -630210 -1009511 -889607
33982 -889607 -357261 2534 -263852 -871208 -1163341 -966995 -669460 -543253 -464055 -290126
33972 -290126 -77573 128028 354567 548115 663611 832342 1108285 1205364 904589 549238
$$ packed form
34042a089264p8546k1175K629O2082L6910j69594l51517j61512L90624Q42512
34032e36851Q21973M53428O2640k42228m58130m50113j66259J21823J36048q686
34022b66355k0171J31586K78390L49080K94068l7816n65686p55446k15661O00397
34012b07614P80733O9915p86834q94255j41792P62978J009213M12501m41419p83139
34002b19713m22180J60051M32445K87356r0563m56374n15388j08547M33672N10905
33992A1664M0556l56009j91512K49961L87861R3188l24279n41640l79301J19904
33982h89607N32346L59795k66386o07356k92133J96346K97535J26207P9198J73929
33972b90126K12553K05601K26539J93548J15496J68731K75943R7079l00775l55351
$$ plain form
33962 549238 631855 1028063 1183588 940186 592746 244892 -225987 -615372 -523789 -102905
33952 -102905 11330 -362256 -684597 -495534 65931 611893 848094 573270 -88838 -508809
33942 -508809 -226620 310459 400434 260829 586272 1090411 733354 -481501 -1276911 -1047304
33932 -1047304 -695575 -915586 -983558 -209713 580341 262310 -702728 -925754 -166708 493249
33922 493249 340452 -239224 -693222 -973100 -1107184 -879476 -235560 435497 652114 290794
33912 290794 -318970 -627761 -335716 259215 595584 557405 471357 401841 70000 -396847
33902 -396847 -418753 -7131 -32823 -905740 -1766731 -1708559 -1107795 -896144 -1094103 -1043914
33892 -1043914 -689057 -575351 -753837 -672252 -182434 182385 64671 -239528 -302374 -77075
$$ packed form
33962E49238Q2617L96208J55525k43402l47440l47854m70879l89385R1583M20884
33952a02905J14235l73586l22341J89063N61465N45962K36201k74824o62108m19971
33942e08809K82189N37079Q9975j39605L25443N04139l57057j214855p95410K29607
33932a047304L51729k20011o7972P73845P90054l18031r65038k23026P59046O59957
33922D93249j52797n79676m53998k79878j34084K27708O43916O71057K16617l61320
33912B90794o09764l08791K92045N94931L36369l8179q6048o9516l31841m66847
33902c96847k1906M11622k5692q72917q60991N8172O00764K11651j97959N0189
33892a043914L54857J13706j78486Q1585M89818L64819j17714l04199o2846K25299
$$ plain form
33882 -77075 187588 177003 -300376 -1013595 -1345678 -986346 -365065 -10843 184635 543358
33872 543358 793692 399788 -475468 -1056889 -972617 -555010 -153983 207220 438096 277694
33862 277694 -208388 -498239 -222042 385341 795429 757219 481116 368201 543111 627595
33852 627595 161879 -710656 -1317245 -1316815 -1028441 -722024 -206454 484797 690562 88841
33842 88841 -486960 -60830 1000941 1428204 804442 -23757 -291286 -187955 -203824 -362608
33832 -362608 -450021 -474242 -535253 -538928 -305462 176970 686073 854824 430122 -382209
33822 -382209 -995913 -1073069 -848070 -618770 -300242 148057 286090 -232372 -946272 -1092635
33812 -1092635 -654709 -285965 -310181 -427772 -371644 -236248 -101829 134141 450145 642343
$$ packed form
33882g7075K64663j0585m77379p13219l32083L59332O21281L54222J95478L58723
33872E43358K50334l93904q75256n81421Q4272M17607M01027L61203K30876j60402
33862B77694m86082k89851K76197O07383M10088l8210k76103j12915J74910Q4484
33852F27595m65716q72535o06589M30K88374L06417N15570O91251K05765o01721
33842H8841n75801M26130J061771M27263o23762q28199k67529J03331j5869j58784
33832c62608q7413k4221o1011l675K33466M82432N09103J68751m24702q12331
33822c82209o13704p7156K24999K29300L18528M48299J38033n18462p13900j46363
33812a092635M37926L68744k4216j17591N6128J35396J34419K35970L16004J92198
$$ plain form
33802 642343 649962 622932 661238 744011 832386 818390 570277 260231 314457 723940 833159
33791 833159 253060 -477159 -685794 -537622 -534217 -546554 -213557 91394 -286367 -1062907
33781 -1062907 -1290040 -810455 -438465 -625141 -904028 -816593 -487474 -88927 392322 630029
33771 630029 91285 -972116 -1491825 -958621 -113657 150665 -97732 -277421 -228627 -161528
33761 -161528 -134595 -97548 -129557 -233371 -176461 151661 513011 706282 860554 1082033
33751 1082033 1105745 595377 -363125 -1227943 -1372955 -575475 618244 1173154 618699
33742 618699 -311553 -565376 -113133 220358 85108 -85753 -98941 -351839 -882316 -1000290
33732 -1000290 -377217 256426 111560 -541070 -861776 -594951 -141473 158341 239108 68769
$$ packed form
33802F42343P619k7030L8306Q2773Q8375j3996k48113l10046N4226M09483J09219
33791H33159n80099p30219k08635J48172L405j2337L32997L04951l77761p76540
33781a062907k27133M79585L71990j86676k78887Q7435L29119L98547M81249K37707
33771F30029n38744j063401n19709N33204Q44964K64322k48397j79689M8794O7099
33761a61528K6933L7047l2009j03814N6910L28122L61350J93271J54272K21479
33751A082033K3712n10368r58502q64818j45012P97480J193719N54910n54455
33742F18699r30252k53823M52243L33491j35250j70861j3188k52898n30477j17974
33732a000290O23073O33643j44866o52630l20706K66825M53478K99814Q0767j70339
$$ plain form
33722 68769 -274032 -436672 -144898 374257 634425 453690 63772 -195554 -131656 167661
33712 167661 355282 216243 70876 420688 1133613 1461520 1031634 317715 -110063 -278090
33702 -278090 -423777 -437600 -155259 180749 233240 73544 -32574 -76763 -165121 -203905
33692 -203905 -132593 -203562 -592092 -957924 -858991 -424902 -147031 -132709 -70700 113821
33682 113821 93706 -279942 -671925 -718683 -466230 -153853 173380 572437 885799 840451
33672 840451 480974 236158 413697 809264 1010235 935260 786366 578006 148617 -323579
33662 -323579 -334567 181314 585773 403081 16099 29595 339803 428477 268251 249293
33652 249293 392814 350136 112287 43974 234473 452925 701510 1124629 1402748 1010843
$$ packed form
33722F8769l42801j62640K91774N19155K60168j80735l89918k59326O3898K99317
33712A67661J87621j39039j45367L49812P12925L27907m29886p13919m27778j68027
33702b78090j45687j3823K82341L36008N2491j59696j06118m4189q8358l8784
33692b03905P1312p0969l88530l65832R8933M34089K77871J4322O2009J84521
33682A13821k0115l73648l91983m6758K52453L12377L27233L99057L13362m5348
33672H40451l59477k44816J77539L95567K00971p4975j48894k08360m29389m72196
33662c23579j0988N15881M04459j82692l86982J3496L10208Q8674j60226j8958
33652B49293J43521m2678k37849o8313J90499K18452K48585M23119K78119l91905
$$ plain form
33642 1010843 135588 -457290 -576260 -786347 -1267407 -1415926 -945700 -499392 -646960
33633 -646960 -1039236 -1119227 -969343 -834078 -467034 314904 954109 793274 29997 -632290
33623 -632290 -930393 -1000572 -791443 -267442 109065 -80176 -346140 198068 1454034 2233503
33613 2233503 1723461 468157 -350824 -198031 468493 842807 578500 77057 3467
33604 3467 464568 867788 761917 486301 599075 946252 859958 176665 -516750 -689174
33594 -689174 -410771 -10023 322604 431186 165123 -276175 -338241 221550 917067 1116782
33584 1116782 865396 755169 1038971 1256079 865641 -15380 -731640 -833993 -486491
33575 -486491 -156200 -119418 -334982 -587406 -592076 -127607 689586 1333782 1331045 801981
$$ packed form
33642A010843q75255n92878j18970k10087m81060j48519M70226M46308j47568
33633f46960l92276p9991J49884J35265L67044P81938O39205j60835p63277o62287
33623f32290k98103p0179K09129N24001L76507j89241k65964N44208J255966P79469
33613B233503n10042j255304q18981J52793O66524L74314k64307n01443p3590
33604C467M61101M03220j05871k75616J12774L47177q6294o83293o93415j72424
33594f89174K78403M00748L32627J08582k66063m41298o2066N59791O95517J99715
33584A116782k51386j10227K83802K17108l90438q81021p16260j02353L47502
33575d86491L30291L6782k15564k52424m670M64469Q17193O44196k737n29064
$$ plain form
33565 801981 331045 291092 537038 790525 1008642 1204037 1170192 686827 -85906 -672166
33555 -672166 -760100 -471439 -153084 -42456 -163409 -401905 -575574 -508482 -177784 215816
33545 215816 440620 504681 594338 726454 683542 396737 126548 61843 39043 -25780 223332
33534 223332 984134 1626281 1353899 432082 -68826 199810 470160 166299 -334183 -582487
33524 -582487 -725392 -797502 -357962 486885 716159 -67027 -725262 -315683 242973 -342157
33514 -342157 -1383942 -1117915 428533 1356695 739208 -256167 -462927 -271842 -409088
33505 -409088 -573612 -201685 424604 685762 509496 121947 -374470 -671337 -283174 577934
33495 577934 950449 478109 -6 210391 589710 395953 -76199 -100345 234391 294164
$$ packed form
33565H01981m70936l9953K45946K53487K18117J95395l3845m83365p72733n86260
33555f72166q7934K88661L18355J10628j20953k38496j73669O7092L30698L93600
33545B15816K24804O4061Q9657J32116m2912k86805k70189o4705k2800o4823K49112
33534B23332P60802O42147k72382r21817n00908K68636K70350l03861n00482k48304
33524e82487j42905p2110M39540Q44847K29274p83186o58235M09579N58656n85130
33514c42157j041785K66027J546448R28162o17487r95375k06760J91085j37246
33505d09088j64524L71927O26289K61158j76266l87549m96417k96867L88163Q61108
33495E77934L72515m72340m78115K10397L79319j93757m72152k4146L34736N9773
$$ plain form
33485 294164 7335 -142753 24368 242603 329509 301958 148856 -75278 -168255 -140831
33475 -140831 -325375 -792385 -1080587 -883840 -549911 -480305 -513345 -376094 -279280 -528897
33465 -528897 -947751 -1202680 -1330287 -1435959 -1263180 -611041 154184 542348 602237 643076
33455 643076 598846 213104 -354842 -610768 -302702 407008 1156274 1512817 1178041 354794
33445 354794 -346563 -576726 -515101 -373316 -128695 95779 8159 -236335 -56522 593855
33435 593855 995387 782525 516945 642848 703818 277717 -118326 86971 429738 178663
33425 178663 -377464 -458660 -175516 -263703 -685541 -625629 138894 869239 973759 641499
33415 641499 240865 -150472 -441605 -425473 -197336 -144336 -339585 -404476 -122925 218161
$$ packed form
33485B94164k86829j50088J67121K18235Q6906k7551j53102k24134r2977K7424
33475a40831j84544m67010k88202J96747L33929O9606l3040J37251R6814k49617
33465e28897m18854k54929j27607j05672J72779O52139P65225L88164N9889M0839
33455F43076m4230l85742n67946k55926L08066P09710P49266L56543l34776q23247
33445C54794p01357k30163O1625J41785K44621K24474q7620k44494J79813O50377
33435E93855M01532k12862k65580J25903O0970m26101l96043K05297L42767k51075
33425A78663n56127q1196K83144q8187m21838N9912P64523P30345J04520l32260
33415F41499m00634l91337k91133J6132K28137N3000j95249o4891K81551L41086
$$ plain form
33405 218161 257259 5170 -270369 -386228 -388361 -467088 -702679 -872055 -715640 -430230
33395 -430230 -510427 -957466 -1135208 -689127 -77500 211110 408995 869216 1217917 851657
33385 851657 -18195 -577939 -537859 -354952 -365691 -342703 -23853 413619 595688 403583
33375 403583 76416 -31455 171297 354140 173325 -166730 -126803 335241 636164 435120
33365 435120 85652 -36243 -79854 -235146 -261189 41411 351345 279130 -78406 -388681
33355 -388681 -476977 -208237 473950 1098368 915202 -18430 -679247 -423703 234309 631942
33345 631942 879417 1175246 1120324 537836 160359 566152 1133886 1009868 434276 81962
33335 81962 -231770 -975715 -1569974 -994274 478680 1416047 1094260 193040 -397117 -501585
$$ packed form
33405B18161L9098k52089k75539j15859k133p8727k35591j69376J56415K85410
33395d30230q0197m47039j77742M46081O11627K88610J97885M60221L48701l66260
33385H51657q69852n59744M0080J82907j0739K2988L18850M37472J82069j92105
33375D03583l27167j07871K02752J82843j80815l40055L9927M62044L00923k01044
33365D35120l49468j21895m3611j55292k6043L02600L09934p2215l57536l10275
33355c88681q8296K68740O82187O24418j83166r33632o60817K55544O58012L97633
33345F31942K47475K95829n4922n82488l77477M05793N67734j24018n75592l52314
33335H1962l13732p43945n94259N75700J472954R37367l21787r01220n90157j04468
$$ plain form
33325 -501585 -302993 102928 586656 960634 1164466 1168709 896434 546395 577571 979335
33315 979335 1094750 642032 273548 542474 996618 958231 513491 58300 -378148 -664814
33305 -664814 -285301 737939 1566868 1879513 2311604 2941376 3113392 3839080 7959930
33296 7959930 15612057 21590465 20528790 13694541 7338079 4872913 4231858 2907895
33288 2907895 1613745 1688068 2231814 1854395 1017752 786104 924425 790140 648022
33279 648022 747292 467605 -388462 -792157 -132332 656241 689205 464226 484000 56525
33269 56525 -1176440 -1928923 -1060552 461430 949199 372861 -157846 -377396 -744233
33260 -744233 -1071240 -866736 -531841 -767400 -1207411 -968017 -148541 468027 768781 1093230
$$ packed form
33325e01585J98592M05921M83728L73978K03832M243k72275l50039L1176M01764
33315I79335J15415m52718l68484K68926M54144l8387m44740m55191m36448k86666
33305f64814L79513J023240Q28929L12645M32091O29772J72016P25688M120850
33296G959930P652127N978408j061675o834249o356462k465166o41055j323963
33288B907895j294150P4323N43746l77419q36643k31648J38321j34285j42118
33279F48022R9270k79687q56067m03695O59825P88573L2964k24979J9774m27475
33269E6525j232965p52483Q68371J521982M87769n76338n30707k19550l66837
33260g44233l27007K04504L34895k35559m40011K39394Q19476O16568L00754L24449
$$ plain form
33250 1093230 1112106 309884 -705932 -780929 1922 414427 -38432 -555673 -474133 -143982
33240 -143982 -113633 -352531 -583114 -702106 -648689 -374390 -48369 106503 107016 -25753
33230 -25753 -501043 -1252147 -1563111 -872846 334030 1126322 1327558 1383249 1334087 818685
33220 818685 -22415 -530897 -452916 -141286 162067 509954 694462 275563 -669199 -1451678
33210 -1451678 -1598593 -1256941 -712364 -85265 379796 330407 -136132 -412000 -158112 216256
33200 216256 119450 -447995 -942928 -945274 -556642 -173869 -7613 78096 224046 246680
33190 246680 -82473 -521645 -568772 -251252 -182550 -613245 -979565 -777415 -368013 -390621
33180 -390621 -784685 -982508 -774096 -408860 -103545 -28381 -511737 -1585821 -2507242 -2444578
$$ packed form
33250A093230J8876q02222j015816p4997P82851M12505m52859n17241Q1540L30151
33240a43982L0349k38898k30583j18992N3417K74299L26021J54872N13j32769
33230b5753m75290p51104l10964O90265J206876P92292K01236N5691m9162n15402
33220H18685q41100n08482P7981L11630L03353L47887J84508m18899r44762p82479
33210a451678j46915L41652N44577O27099M65061m9389m66539k75868K53888L74368
33200B16256r6806n67445m94933k346L88632L82773J66256Q5709J45950K2634
33190B46680l29153m39172m7127L17520O8702m30695l66320K02150M09402k2608
33180c90621l94064j97823K08412L65236L05315P5164m83356j074084r21421O2664
$$ plain form
33170 -2444578 -1585860 -891737 -782850 -788202 -541359 -342608 -488916 -748231 -867090 -995503
33160 -995503 -1158895 -859737 177678 1238832 1322412 499714 -133856 37479 359625
33151 359625 -44839 -982785 -1511564 -1272853 -845660 -779695 -919278 -898508 -731562 -509790
33141 -509790 22938 1029038 1994180 2213342 1756072 1336344 1228626 974112 336815
33132 336815 -103896 247745 1042993 1369790 944950 447887 607840 1292271 1693428 1286734
33122 1286734 392759 -252498 -318916 -105342 -35920 -201073 -423428 -503876 -316616 79231
33112 79231 351792 231221 -10492 163646 699120 921804 586524 314373 598789 1037140
33102 1037140 1094990 987118 1101283 1144423 705075 165427 114917 255697 -99689 -746007
$$ packed form
33170b444578Q58718O94123J08887n352K46843J98751j46308k59315j18859j28413
33160i95503j63392K99158J037415J061154Q3580q22698o33570J71335L22146
33151C59625m04464r37946n28779K38711M27193O5965j39583K0770J66946K21772
33141e09790N32728J006100R65142K19162m57270m19728j07718k54514o37297
33132C36815m40711L51641P95248L26797m24840m97063J59953O84431M01157m06694
33122A286734q93975o45257o6418K13574O9422j65153k22355q0448J87260L95847
33112G9231K72561j20571k41713J74138N35474K22684l35280k72151K84416M38351
33102A037140N7850j07872J14165M3140m39348n39648n0510J40780l55386o46318
$$ plain form
33092 -746007 -877452 -479496 -327424 -654496 -909631 -874791 -942567 -1143737 -938914 -221835
33082 -221835 389798 505613 377141 208779 -86896 -312533 -68865 422903 476952 56928
33072 56928 -202247 -190281 -473966 -1068811 -1212298 -698625 -298464 -414361 -445386 -17918
33062 -17918 270315 -2089 -222836 197272 798076 888717 639919 603878 787477 884464
33052 884464 861267 754852 472233 236397 534356 1180065 1229649 353539 -522908 -531385
33042 -531385 -10916 262387 184154 -5683 -364709 -826308 -850683 -239355 338162 311168
33032 311168 60792 157258 414078 381378 150073 13503 -63906 -77387 234147 710966
33022 710966 678008 74770 -238758 69713 95393 -764813 -1650954 -1625587 -1186959 -1208858
$$ packed form
33092g46007j31445L97956J52072l27072k55135L4840o7776k01170K04823P17079
33082b21835O11633J15815j28472j68362k95675k25637K43668M91768N4049m20024
33072E6928k59175J1966k83685n94845j43487N13673M00161j15897l1025M27468
33062a7918K88233k72404k20747M20108O00804R0641k48798l6041J83599R6987
33052H84464k3197j06415k82619k35836K97959O45709M9584q76110q76447q477
33042e31385N20469K73303p8233j89837l59026m61599k4375O11328N77517k6994
33032C11168k50376R6466K56820l2700k31305j36570p7409j3481L11534M76819
33022G10966l2958o03238l13528L08471K5680q60206q86141K5367M38628k1899
$$ plain form
33012 -1208858 -1299011 -584398 577663 1098834 884053 709022 752272 554664 171270 112888
33002 112888 302106 211333 -119159 -242503 -264187 -576937 -860864 -473671 299677 522769
32992 522769 99031 -105960 307407 746222 678923 323408 95339 106946 352182 758619
32982 758619 993706 776382 338653 57582 -182105 -662449 -1135977 -1168113 -932988 -889293
32972 -889293 -878976 -411249 282767 396734 -207564 -733555 -575427 -28941 286287 164808
32962 164808 -168473 -373976 -269258 -55746 -148580 -538418 -655572 -210342 293449 363864
32952 363864 315247 622198 1003506 949522 720713 896616 1230545 939237 23020 -628549
32942 -628549 -478070 98879 552671 769565 852158 851495 805794 671547 289999 -264085
$$ packed form
33012a208858r0153P14613J162061N21171k14781j75031M3250j97608l83394n8382
33002A12888J89218r0773l30492j23344k1684l12750k83927L87193P73348K23092
32992E22769m23738k04991M13367M38815o7299l55515k28069J1607K45236M06437
32982G58619K35087k17324m37729k81071k39687m80344m73528l2136K35125M3695
32972h89293J0317M67727O94016J13967o04298n25991J58128N46486L15228j21479
32962A64808l33281k05503J04718K13512r2834l89838j17154M45230N03791P0415
32952C63864m8617L06951L81308n3984k28809J75903L33929k91308r16217o51569
32942f28549J50479N76949M53792K16894Q2593o63m5701j34247l81548n54084
$$ plain form
32932 -264085 -555597 -379912 -131459 -175744 -305083 -289734 -401828 -776616 -867578 -309872
32922 -309872 270260 205284 -32673 347007 954762 769895 -125148 -663968 -553260 -617798
32912 -617798 -1280490 -1903245 -1921448 -1591093 -1268346 -864189 -378782 -153189 -200659 -18432
32902 -18432 539137 864305 503574 -103827 -254640 87537 440078 563394 630570 787259
32892 787259 922036 898991 793329 764639 736613 374038 -467611 -1386051 -1792616 -1578467
32882 -1578467 -1126462 -747005 -505902 -519264 -868842 -1226053 -1143245 -735342 -467567 -331639
32872 -331639 10898 363232 249766 11710 459912 1311946 1330088 335189 -381339 -156150
32862 -156150 122491 -78791 167666 1316738 1980275 1044671 -222784 26844 1360434
$$ packed form
32932b64085k91512J75685K48453m4285j29339J5349j12094l74788r0962N57706
32922c09872N80132o4976k37957L79680O07755j84867q95043n38820J10708o4538
32912f17798o62692o22755j8203L30355L22747M04157M85407K25593m7470J82227
32902a8432N57569L25168l60731o07401j50813L42177L52541J23316O7176J56689
32892G87259J34777k3045j05662k8690k8026l62575q41649r18440m06565K14149
32882a578467M52005L79457K41103j3362l49578l57211Q2808M07903K67775J35928
32872c31639L42537L52334j13466k38056M48202Q52034J8142r94899p16528K25189
32862a56150K78641k01282K46457J149072O63537r35604j267455K49628J333590
$$ plain form
32853 1360434 1859135 1041604 157419 33043 339212 715839 1091361 1108658 588897 267496
32843 267496 787774 1390037 960256 -88820 -472741 -151835 -186865 -746302 -898577 -320863
32833 -320863 313640 648290 917377 943579 299669 -501512 -385306 620054 1390339 1410380
32823 1410380 1176403 909530 281203 -459990 -496001 161666 548610 293229 91456 367942
32813 367942 619105 408429 -29495 -459226 -934254 -1187437 -711444 296422 964194
32804 964194 933682 692784 601479 448662 115992 -135841 -174381 -77711 275968 957393
32794 957393 1429241 1074351 199101 -322578 -296348 -241231 -314155 -134079 370153 829098
32784 829098 1141723 1511755 1819039 1716634 1296002 960361 740808 375525 -90525 -365378
$$ packed form
32853A360434M98701q17531q84185j24376L06169L76627L75522J7297n19761l21401
32843B67496N20278O02263m29781j049076l83921L20906l5030n59437j52275N77714
32833c20863O34503L34650K69087K6202o43910q01181J16206J005360P70285K0041
32823A410380k33977k66873o28327p41193l6011O57667L86944k55381k01773K76486
32813C67942K51163k10676m37924m29731m75028k53183M75993J007866O67772
32804I64194l0512k40898r1305j52817l32670k51833l8540R6670L53679O81425
32794I57393M71848l54890q75250n21679K6230N5117p2924J80076N04232M58945
32784H29098L12625L70032L07284j02405m20632l35641k19553l65283m66050k74853
$$ plain form
32774 -365378 -377246 -260334 -220706 -671830 -1803269 -2707072 -1975955 278986 2190573
32765 2190573 2600228 2372226 2376582 1873878 315353 -941945 -621730 166689 -278797
32756 -278797 -1334945 -1218045 -123951 229527 -433122 -856565 -723262 -846075 -1118362
32747 -1118362 -560832 631906 1203998 985812 966324 1296537 1155612 522730 197082
32738 197082 193515 -15548 72699 1304866 2845676 2960179 1713576 812268 861386 898614
32728 898614 570063 559475 795154 394599 -456182 -611235 -59517 71219 -363642 -400022
32718 -400022 40621 47295 -409085 -486132 -236971 -361490 -460185 307022 1174674 760958
32708 760958 -241650 42860 1347986 1611870 546548 -67143 259559 98477 -825251
$$ packed form
32774c65378j1868J16912L9628m51124j131439r03803P31117K254941J911587
32765B190573M09655k28002M356n02704j558525j257298L20215P88419m45486
32756b78797j056148J16900J094094L53478o62649m23443J33303j22813k72287
32747a118362N57530J192738N72092k18186j9488L30213j40925o32882l25648
32738A97082l567k09063Q8247J232167J540810J14503j246603r01308M9118L7228
32728H98614l28551j0588K35679m00555q50781j55053N51718J30736m34861l6380
32718d00022M40643O674m56380p7047K49161j24519r8695P67207Q67652m13716
32708G60958j002608K84510J305126K63884j065322o13691L26702j61082r23728
$$ plain form
32699 -825251 -976674 -20461 421548 -232033 -520627 250473 814645 391710 -123861 -170298
32689 -170298 -328035 -496202 302002 1683795 1924660 792606 -62621 -9275 -166025
32680 -166025 -806820 -757083 56853 177510 -648508 -964986 -367435 -65064 -249383 238128
32670 238128 1184916 980025 -215379 -419430 533849 620706 -509727 -791614 351234
32661 351234 930873 193049 -106953 686863 881781 -723 -94220 1053373 1321219 78245
32651 78245 -385294 876410 1599713 570329 -63243 1157252 2309485 1744784 963179
32642 963179 1483238 2132084 1797633 1688437 2511093 2521348 777228 -615057 189630
32633 189630 1994074 3090008 3683284 3962675 2891334 850674 300645 1859380 2909461
$$ packed form
32699h25251j51423R56213M42009o53581k88594P71100N64172m22935n15571m6437
32689a70298j57737j68167P98204J381793K40865j132054q55227N3346j56750
32680a66025o40795M9737Q13936J20657q26018l16478N97551L02371j84319M87511
32670B38128R46788k04891j195404k04051R53279Q6857j130433k81887J142848
32661C51234N79639p37824l00002P93816J94918q82504r3497J147593K67846j242974
32651G8245m63539J261704P23303j029384o33572J220495J152233n64701p81605
32642I63179N20059O48846l34451j09196Q22656J0255j744120j392285Q04687
32633A89630J804444J095934N93276K79391j071341k040660n50029J558735J050081
$$ plain form
32624 2909461 1915104 740508 875768 990436 200761 45541 1121733 1478202 440673
32615 440673 225078 1682593 2429752 1339606 729421 1829495 2362671 1016315 -17213
32606 -17213 614421 963857 57633 15578 1494166 1869411 436016 266864 2284434
32597 2284434 2964160 814289 -587777 828220 1934302 679277 -43186 1534042
32589 1534042 2327022 621681 -304871 1252970 1831895 -148500 -681361 2209462 4501276
32580 4501276 4244238 5550313 9607344 10474618 5662730 1861173 3565049 5309521
32572 5309521 2472245 75488 2596097 4836830 2064043 -498664 2085598 4699384
32564 4699384 2721327 1806429 6289443 9053022 4851280 1792904 6484142 10651256
$$ packed form
32624B909461r94357j174596J35260J14668p89675j55220J076192L56469j037529
32615D40673k15595J457515P47159j090146o10185J100074N33176j346356j033528
32606a7213O31634L49436r06224m2055J478588L75245j433395j69152K017570
32597B284434O79726k149871j402066J415997J106082j255025p22463J577228
32589A534042P92980j705341r26552J557841N78925j980395n32861K890823K291814
32580D501276k57038J306075M057031Q67274m811888l801557J703876J744472
32572E309521k837276k396757K520609K240733k772787k562707K584262K613786
32564D699384j978057r14898M483014K763579m201742l058376M691238M167114
$$ plain form
32556 10651256 7186956 5404965 13496561 21056611 18579681 17794255 29670446 40509956
32548 40509956 37968235 40828117 67299709 95512572 104935693 139268885 258076884
32541 258076884 420172469 490868472 400234856 234762507 126830550 102815681 95481337
32534 95481337 65617202 39115529 37206067 39878682 29403317 18805490 20056051
32527 20056051 21542093 13656093 7102994 10461211 13892400 8991108 3963268 6379871
32519 6379871 9195655 5797795 2611711 5461299 7991531 4390854 565743 2502606
32511 2502606 5291588 3319885 652247 2152014 4077884 2196830 293668 2377693
32503 2377693 4649017 2978772 736361 1850405 3297291 1508649 -553032 535536
$$ packed form
32556A0651256l464300j781991Q091596P560050k476930p85426J1876191J0839510
32548D0509956k541721K859882K6471592K8212863R423121L4333192J18807999
32541B58076884J62095585P0696003r0633616j65472349j07931957k4014869p334344
32534I5481337k9864135k6501673j909462K672615j0475365j0597827J250561
32527B0056051J486042p886000o553099L358217L431189m901292n027840K416603
32519F379871K815784l397860l186084K849588K530232l600677l825111J936863
32511B502606K788982j971703k667638J499767J925870j881054j903162K084025
32503B377693K271324j670245k242411J114044J446886j788642k061681J088568
$$ plain form
32495 535536 1928746 339899 -1418789 36821 2224845 1820708 777164 1772343 2690616
32486 2690616 1129602 -487013 431305 1591168 470533 -618714 898195 2710421
32478 2710421 1963004 478758 859901 1510800 273800 -944500 140432 1623591 1038714
32469 1038714 -59224 509061 1155464 -139927 -1584902 -970310 44451 -722987 -1641877
32460 -1641877 -535139 906427 292984 -876308 -115028 1348308 1065796 1058 426989
32451 426989 1524572 1206102 229796 554008 1528156 1438109 954368 1501237 2093635 1236806
32441 1236806 74368 290645 817738 -26796 -1098950 -556429 476329 -102797 -1430339
32432 -1430339 -1262856 -32851 136227 -772614 -1122840 -772273 -727035 -709820 65834 744739
$$ packed form
32495E35536J393210j588847j758688J455610K188024m04137j043544R95179R18273
32486B690616j561014j616615R18318J159863j120635j089247J516909J812226
32478B710421p47417j484246L81143O50899j237000j218300J084932J483159n84877
32469A038714j097938N68285O46403j295391j444975O14592J014761p67438r18890
32460a641877J106738J441566o13443j169292P61280J463336k82512j064738M25931
32451D26989J097583l18470r76306L24212R74148r0047m83741N46869N92398q56829
32441A236806j162438K16277N27093q44534j072154N42521J032758n79126j327542
32432a430339J67483J230005J69078r08841l50226L50567M5238J7215P75654O78905
$$ plain form
32422 744739 157240 -768928 -468022 534776 799661 636939 1161804 1949716 2025104 1889908
32412 1889908 2240413 2094116 601159 -757167 -297703 959899 1053775 327379 317756
32403 317756 795577 638373 390609 1158405 2028882 1357200 -270786 -983162 -670559
32394 -670559 -571383 -693805 -197881 440723 160452 -483792 -238842 421192 132837 -774279
32384 -774279 -852409 -67084 475382 678784 1141678 1385997 633134 -310747 -175885 420090
32374 420090 1063 -1043305 -1140597 -412461 -398824 -1197080 -1316356 -370749 339215 114875
32364 114875 -242450 -58966 361162 689610 955496 948353 484656 82568 200963 236053
32354 236053 -479436 -1266957 -1093824 -369861 -237602 -612895 -506378 144158 507949 367695
$$ packed form
32422G44739n87499r26168L00906J002798K64885j62722N24865P87912P5388j35196
32412A889908L50505j46297j492957j358326M59464J257602R3876p26396r623
32403C17756M77821j57204k47764P67796Q70477o71682j627986p12376L12603
32394f70559R9176j22422M95924O38604k80271o44244K44950O60034k88355r07116
32384g74279p8130P85325N42466K03402M62894K44319p52863r43881J34862N95975
32374D20090m19027j044368r7292P28136J3637p98256j19276R45607P09964k24340
32364A14875l57325J83484M20128L28448K65886p143m63697m02088J18395L5090
32354B36053p15489p87521J73133P23963J32259l75293J06517O50536L63791j40254
$$ plain form
32344 367695 165588 -70589 -495869 -596672 85099 854779 804874 322330 349947 736363
32334 736363 685695 270333 117014 140476 -72500 -203282 158571 457017 73897 -403573
32324 -403573 -169291 307662 207439 -7367 559900 1466521 1627031 1196553 1167594 1589906
32314 1589906 1708363 1409353 1124642 810090 336399 244491 779558 953310 -6099 -1120808
32304 -1120808 -1104105 -421066 -242045 -285040 399413 1315788 1252028 502867 314005 613691
32294 613691 357176 -297971 -271338 293236 272116 -251246 -170148 369375 50776 -1140009
32284 -1140009 -1647618 -884544 -70035 -73630 -229133 126355 545052 551181 478560 619785
32274 619785 660278 425823 200115 -16700 -604357 -1436867 -1803647 -1407289 -669777 -12826
$$ packed form
32344C67695k02107k36177m25280j00803O81771P69680m9905m82544K7617L86416
32334G36363n0668m15362j53319K3462k12976j30782L61853K98446l83120m77470
32324d03573K34282M76953j00223k14806N67267R06621J60510m30478k8959M22312
32314A589906J18457k99010k84711l14552m73691r1908N35067J73752r59409j114709
32304a120808J6703O83039J79021m2995O84453R16375o3760p49161j88862K99686
32294F13691k56515o55147K6633N64574k1120n23362Q1098N39523l18599j190785
32284a140009n07609P63074Q14509l595j55503L55488M18697O129p2621J41225
32274F19785M0493k34455k25708k16815n87657q32510l66780L96358P37512O56951
$$ plain form
32264 -12826 444764 601527 506865 529696 736540 600423 38186 -56119 737647 1340925
32254 1340925 838830 136745 396911 834688 26405 -1361818 -1380419 63621 1121435
32245 1121435 941498 495520 396240 89321 -448021 -301631 523117 725622 -137554 -808242
32235 -808242 -343652 534046 817316 585765 317670 49400 -161835 -43898 132670 -294821
32225 -294821 -1075073 -1065380 4560 979254 982329 525188 363251 340110 19091 -446275
32215 -446275 -700735 -733661 -582862 -150220 371275 533156 295582 24052 -206717 -568255
32205 -568255 -804032 -493537 42159 62005 -364670 -440599 32858 438992 486836 503961
32195 503961 525310 192176 -302674 -255921 360889 773266 658485 557313 842377 1199797
$$ packed form
32264a2826M57590J56763r4662K2831K06844j36117n62237r4305P93766O03278
32254A340925n02095p02085K60166M37777q08283j388223j8601J444040J057814
32245A121435j79937m45978r9280l06919n37342J46390Q24748K02505q63176o70688
32235h08242M64590Q77698K83270k31551k68095k68270k11235J17937J76568m27491
32225b94821p80252R693J069940R74694L075m57141j61937k3141l21019m65366
32215d46275k54460l2926J50799M32642N21495J61881k37574k71530k30769l61538
32205e68255k35777L10495N35696J9846m26675p5929M73457M06134M7844J7125
32195E03961K1349l33134m94850M6753O16810M12377j14781j01172K85064L57420
$$ plain form
32185 1199797 1316632 1238903 947870 383210 -127439 -257824 -336692 -764524 -1116764 -844648
32175 -844648 -424326 -566160 -760743 -127900 698163 335955 -877744 -1158151 -95900
32166 -95900 800586 690167 474451 743612 717723 104556 60941 1139682 1972782 1316043
32156 1316043 -14571 -581559 -448522 -479575 -586027 -145962 571400 780286 503476
32147 503476 383579 552651 638440 543505 425435 262259 84882 208057 657237 875867
32137 875867 549818 157433 168957 335416 330174 391079 671962 667160 58630 -483294 -191613
32126 -191613 590150 942014 751012 723710 1202927 1714826 1685936 1100811 420322 120500
32116 120500 264276 442276 315418 139730 333686 633565 374846 -336767 -573039 28209
$$ packed form
32185A199797J16835p7729k91033n64660n10649j30385p8868m27832l52240K72116
32175h44648M20322j41834j94583O32843Q26063l62208j213699k80407J062251
32166i5900Q96486j10419k15716K69161k5889o13167m3615J078741Q33100o56739
32156A316043j330614n66988J33037l1053j06452M40065P17362K08886k76810
32147E03476j19897J69072Q5789r4935j18070j63176j77377J23175M49180K18630
32137H75867l26049l92385J1524J66459n242O0905K80883m802o08530n41924K91681
32126a91613P81763L51864j91002k7302M79217N11899k8890n85125o80489k99822
32116A20500J43776J78000j26858j75688J93956K99879k58719p11613k36272O01248
$$ plain form
32106 28209 643394 475667 -126014 -297022 150389 686325 798095 361600 -347272 -740501
32096 -740501 -432032 171299 306251 -32101 -106922 304802 559538 352546 295085 729196
32086 729196 898263 116193 -949392 -1097881 -259298 555551 715919 539055 449773 319769
32076 319769 -143036 -782094 -1065350 -717490 -152811 -112558 -770367 -1437981 -1434002 -956342
32066 -956342 -643100 -575738 -373613 -47465 42732 -36968 73247 182017 -199090 -734148
32056 -734148 -486673 533185 1159170 761397 53346 -248774 -440676 -860087 -995165
32047 -995165 -421489 281057 472447 521292 957670 1285111 753179 -218799 -557660 -143426
32037 -143426 241443 364214 740046 1333416 1254474 166856 -918396 -866687 122418 875392
$$ packed form
32106B8209O15185j67727o01681j71008M47411N35936J11770m36495p08872l93229
32096g40501L08469O03331J34952l38352p4821M11724K54736k06992n7461M34111
32086G29196J69067p82070j065585j48489Q38583Q14849J60368j76864q9282j30004
32076C19769m62805o39058k83256L47860N64679M0253o57809o67614L979M77660
32066i56342L13242O7362K02125L26148R0197p9700J10215J08770l81107n35058
32056g34148K47475J019858O25985l97773p08051l02120j91902m19411j35078
32047i95165N73676P02546J91390M8845M36378L27441n31932r71978l38861M14234
32037a43426L84869J22771L75832N93370p8942j087618j085252N1709R89105P52974
$$ plain form
32027 875392 741183 162650 -146541 -77367 -6230 -113335 -150729 130233 593192 896056
32017 896056 895981 723855 585662 640791 920982 1182524 1022612 401062 -115217 65976
32007 65976 834476 1495972 1516296 938962 242563 1826 433536 1021320 910450 -35477
31997 -35477 -989874 -1331081 -1484175 -2006307 -2423952 -1877312 -561721 451618 675162
31988 675162 551307 420106 103692 -396781 -672740 -576261 -409417 -300711 -40862 350550
31978 350550 515146 320065 5749 -241723 -376682 -274300 43348 187818 2459 29365
31968 29365 650219 1204899 913552 242909 187106 538175 262387 -555687 -687695 189602
31958 189602 950537 892314 705075 1029047 1379864 1212175 890202 832471 696587 201365
$$ packed form
32027H75392j34209n78533l09191O9174P1137j07105l7394K80962M62959L02864
32017H96056p5j72126j38193N5129K80191K61542j59912o21550n16279J81193
32007F5976P68500O61496K0324n77334o96399k40737M31710N87784j10870r45927
31997c5477r54397l41207j53094n22132m17645N46640J315591J013339K23544
31988F75162j23855j31201l16414n00473k75959R6479J66844J08706K59849L91412
31978C50550J64596j95081l14316k47472j34959J02382L17648J44470j85359K6906
31968B9365O20854N54680k91347o70643n5803L51069k75788q18074j32008Q77297
31958A89602P60935n8223j87239L23972L50817j67689l21973n7731j35884m95222
$$ plain form
31948 201365 -115932 231668 762266 723948 161494 -324613 -396499 -84099 429899 743194
31938 743194 460894 -187088 -455858 -40786 600573 998561 1123778 1014376 664582 382014
31928 382014 527535 828201 687402 166410 -155478 -217177 -444174 -789839 -845749 -787468
31918 -787468 -1061362 -1270814 -680958 278486 467357 -70962 -244980 112923 204785 213458
31908 213458 1195635 2737728 2981735 1611732 528190 701928 745511 -222516 -770468
31899 -770468 144295 980589 182374 -1041376 -806398 248183 337464 -236770 109046
31890 109046 1104128 982636 -419563 -1392590 -1109440 -508634 -363225 -382569 -386694 -677448
31880 -677448 -1041105 -838906 -226538 2983 -208578 -217694 5945 -129234 -613490 -848808
$$ packed form
31948B01365l17297L47600N30598l8318n62454m86107p1886L12400N13998L13295
31938G43194k82300o47982k68770M15072O41359L97988J25217j09402l49794k82568
31928C82014J45521L00666j40799n20992l21888o1699k26997l45665n5910N8281
31918g87468k73894k09452N89856R59444J88871n38319j74018L57903R1862Q673
31908B13458R82177J542093K44007j370003j083542J73738M3583r68027n47952
31899g70468R14763Q36294p98215j223750K34978J054581Q9281n74234L45816
31890A09046R95082j21492j402199r73027K83150O00806J45409j9344m125k90754
31880f77448l63657K02199O12368K29521k11561r116K23639j35179m84256k35318
$$ plain form
31870 -848808 -790536 -859745 -854434 -217533 693432 873187 206990 -415063 -498111 -363259
31860 -363259 -246720 -58583 63593 2592 265084 1251074 2193153 2037253 1135279 742510
31850 742510 1004231 870108 13312 -604182 -310106 384514 764284 740678 479481 112119
31840 112119 -50311 182537 415828 280227 203528 630779 933456 323359 -573056 -516602
31830 -516602 278591 528477 182347 505848 1692869 2269023 1421765 251479 -47203
31821 -47203 181459 57383 -419235 -789779 -986017 -1029172 -724947 -217584 -31716 -173288
31811 -173288 -102285 115668 -235882 -1036712 -1077950 85646 1265062 1387145 958798 895915
31801 895915 981434 566873 -70211 -241405 -119075 -386889 -1001064 -1265963 -909836 -309899
$$ packed form
31870h48808N8272o9209N311O36901R10965J79755o66197o22053q3048J34852
31860c63259J16539J88137J22176o1001K62492R85990R42079j55900r01974l92769
31850G42510K61721j34123q56796o17494K94076O94620L79770k3606k61197l67362
31840A12119j62430K32848K33291j35601p6699M27251L02677o10097q96415N6454
31830e16602P95193K49886l46130L23501J187021N76154q47258j170286k98682
31821d7203K28662j24076m76618l70544j96238m3155L04225N07363J85868j41572
31811a73288P1003K17953l51550q00830m1238J163596J179416J22083m28347o2883
31801H95915Q5519m14561o37084j71194J22330k67814o14175k64899L56127N99937
$$ plain form
31791 -309899 148409 306900 64132 -473642 -891777 -962753 -978932 -1230690 -1511101 -1512394
31781 -1512394 -1324961 -1156658 -945930 -631026 -415322 -410178 -408140 -322887 -401956 -679718
31771 -679718 -720462 -282562 248358 469764 504855 545303 400614 -15715 -269327 -31125
31761 -31125 309801 217697 -179576 -402943 -402996 -456416 -555423 -471058 -240488 -76443 70125
31750 70125 397058 815241 1042481 1049145 1047026 1095358 1026518 732591 308854 -48302 -173151
31739 -173151 -67717 39871 -48051 -187179 -122004 -1723 -224580 -709351 -865830 -493448
31729 -493448 -155983 -335250 -724259 -780802 -535162 -361346 -310928 -193863 -41188 29632
31719 29632 181779 564765 835019 539028 -98002 -327669 134513 772599 1023557 906524
$$ packed form
31791c09899M58308J58491k42768n37774m18135p0976j6179k51758k80411j293
31781a512394J87433J68303K10728L14904K15704N144K038Q5253p9069k77762
31771f79718m0744M37900N30920K21406L5091M0448j44689m16329k53612K38202
31761c1125L40926r2104l97273k23367n3n3420r9007Q4365K30570J64045J46568
31750G0125L26933M18183K27240O664k119M8332o8840k93927m23737l57156j24849
31739a73151J05434J07588q7922j39128O5175J20281k22857m84771j56479L72382
31729d93448L37465j79267l89009n6543K45640J73816N0418J17065J52675P0820
31719B9632J52147L82986K70254k95991o37030k29667M62182O38086K50958j17033
$$ plain form
31709 906524 716239 512041 228779 7244 26695 133256 13247 -275694 -326778 -39347
31699 -39347 146578 -49396 -175371 321430 1087681 1161919 353202 -375912 -235567 307517
31689 307517 320635 -204392 -485719 -241454 -46670 -339763 -753810 -703905 -176525 377371
31679 377371 648458 677293 613026 524883 441223 404077 392723 250557 -151438 -613647 -679937
31668 -679937 -220602 270612 296655 52399 24019 124915 -85065 -473814 -509736 -335589
31658 -335589 -621860 -1213502 -1150049 -403675 -210403 -961202 -1218653 27437 1463087
31649 1463087 1334381 166382 -188210 509018 831816 229032 -338676 -300099 -174022
31640 -174022 -133082 424580 1431807 1804532 1092434 176115 -195480 -331226 -559518 -495874
$$ packed form
31709I06524j90285k04198k83262k21535J9451J06561j20009k88941n1084K87431
31699c9347J85925j95974j25975M96801P66251P4238q08717p29114J40345N43084
31689C07517J3118n25027k81327K44265J94784k93093m14047M9905N27380N53896
31679C77371K71087K8835o4267q8143q3660l7146j1354j42166m01995m62209o6290
31668f79937M59335M91214K6043k44256k8380J00896k09980l88749l5922J74147
31658c35589k86271n91642O3453P46374J93272p50799k57451J246090J435650
31649A463087j28706j167999l54592O97228L22798o02784n67708L8577J26077
31640a74022M0940N57662J007227L72725p12098r16319l71595j35746k28292O3644
$$ plain form
31630 -495874 42725 498750 570864 749276 1282241 1583078 1240223 687444 325265 -99264
31620 -99264 -709168 -1032558 -855590 -618952 -480239 11785 797148 977729 266517 -341094
31610 -341094 -96776 383255 351971 176071 372807 455347 -127148 -800067 -803166 -530553
31600 -530553 -712755 -985077 -588804 93037 107366 -348779 -192874 717881 1347855 1088717
31590 1088717 433939 -64830 -473258 -903427 -1142911 -1103588 -984617 -835070 -502538 -66565
31580 -66565 189572 235027 269284 345102 438679 677851 1031561 1074218 601448 121238 94227
31569 94227 85523 -530465 -1362713 -1440081 -677343 48005 229268 202696 245330 137088 -181450
31558 -181450 -340519 -202535 -108236 -223452 -274918 -162727 -210520 -536862 -746878 -541473
$$ packed form
31630d95874N38599M56025P2114J78412N32965L00837l42855n52779l62179m24529
31620i9264o09904l23390J76968K36638J38713M92024P85363J80581p11212o07611
31610c41094K44318M80031l1284j75900J96736Q2540n82495o72919l099K72613
31600e30553j82202k72322L96273O81841J4329m56145J55905R10755O29974k59138
31590A088717o54778m98769m08428m30169k39484L9323J18971J49547L32532M35973
31580f6565K56137M5455L4257P5818R3577K39172L53710M2657m72770m80210k7011
31569I4227q704o15988q32248p7368P62738P25348J81263k6572M2634j08242l18538
31558a81450j59069J37984R4299j15216n1466J12191m7793l26342k10016K05405
$$ plain form
31548 -541473 -139087 171315 416384 605162 479794 -58071 -624628 -769164 -445749 134327
31538 134327 788570 1257275 1162453 450331 -314701 -471129 -37411 318931 134348 -261912
31528 -261912 -195445 409477 843139 544552 -59324 -95413 486400 820098 443637 3485
31518 3485 196434 648174 560328 36049 -116020 266739 439724 -65829 -771993 -1009440
31508 -1009440 -722401 -228500 296879 743607 882037 639826 314985 207237 230277 146582
31498 146582 6870 69793 360450 560607 388029 -29715 -248047 -10408 386818 408659
31488 408659 27237 -109143 485057 1332195 1457408 633787 -278088 -380580 232386 749142
31478 749142 687351 325040 156716 254211 305459 107740 -205843 -431173 -569715 -705173
$$ packed form
31548e41473M02386L10402K45069J88778j25368n37865n66557j44536L23415N80076
31538A34327O54243M68705r4822p12122p65032j56428M33718L56342j84583l96260
31528b61912O6467O04922M33662k98587o03876l6089N81813L33698l76461m40152
31518C485J92949M51740q7846n24279j52069L82759J72985n05553p06164k37447
31508a009440K87039M93901N25379M46728J38430k42211l24841j07748K3040q3695
31498A46582j39712O2923K90657K00157j72578m17744k18332K37639L97226K1841
31488D08659l81422j36380N94200Q47138J25213q23621r11875j02492O12966N16756
31478G49142o1791l62311j68324R7495N1248j97719l13583k25330j38542j35458
$$ plain form
31468 -705173 -768606 -678597 -642173 -976906 -1564734 -1831920 -1475917 -906377 -647397 -544558
31458 -544558 -34782 840985 1225675 504255 -779150 -1482320 -1216533 -657463 -425118
31449 -425118 -215127 497570 1313147 1286449 429691 -89168 371381 913036 496433 -351159
31439 -351159 -284842 768007 1477720 1097210 415904 398946 883665 1175752 1138614 1033919
31429 1033919 861120 515471 207241 147262 118470 -149359 -456150 -430028 -96360 260682
31419 260682 560805 847013 948310 631225 5507 -498923 -527891 -104056 333056 250539
31409 250539 -323132 -605515 -12003 843850 816553 -152624 -984288 -1126727 -1189413 -1552541
31399 -1552541 -1524539 -625778 306804 268193 -419032 -734404 -449414 -5921 507185 1188862
$$ packed form
31468g05173o3433R0009L6424l34733n87828k67186L56003N69540K58980J02839
31458e44558N09776Q75767L84690p21420j283405p03170K65787N59070K32345
31449d25118K09991P12697Q15577k6698q56758n18859M60549N41655m16603q47592
31439c51159O6317J052849P09713l80510o81306j6958M84719K92087l7138j04695
31429A033919j72799l45649l08230n9979k8792k67829l06791K6122L33668L57042
31419B60682L00123K86208J01297l17085o25718n04430k8968M23835M37112q2517
31409B50539n73671k82383N93512Q55853k7297r69177q31664j42439o2686l63128
31399a552541K8002Q98761R32582l8611o87225l15372K84990M43493N13106O81677
$$ plain form
31389 1188862 1606428 1348503 962367 1257676 1940100 2020321 1379125 824144 718817 673790
31379 673790 559485 694958 960973 818796 351818 228122 449128 229331 -589532 -1096908
31369 -1096908 -717732 -44952 254280 404548 754028 925255 535694 72852 176419
31360 176419 539396 407276 -141492 -299133 185326 643566 541034 228933 327022 778142
31350 778142 935268 465739 -199194 -425562 -140657 225379 433440 652013 908355 821035
31340 821035 213003 -405350 -427754 40240 419913 448886 243224 -151327 -673525 -934667
31330 -934667 -653364 -239994 -264001 -510363 -357584 47834 -38340 -590055 -679657 23516
31320 23516 660888 541015 122549 49972 121396 -288 156483 1109377 2237439 2411897
$$ packed form
31389A188862M17566k57925l86136K95309O82424Q0221o41196n54981j05327m5027
31379F73790j14305J35473K66015j42177m66978j23696K21006k19797q18863n07376
31369a096908L79176O72780K99232J50268L49480J71227l89561m62842J03567
31360A76419L62977j32120n48768j57641M84459M58240j02532l12101R8089M51120
31350G78142J57126m69529o64933k26368K84905L66036K08061K18573K56342q7320
31340H21035o08032o18353k2404M67994L79673K8973k05662l94551n22198k61142
31330i34667K81303M13370k4007k46362J52779M05418q6174n51715q9602P03173
31320B3516O37372j19873m18466p2577P1424j21684J56771R52894J128062J74458
$$ plain form
31310 2411897 1574463 725223 426832 246351 -229648 -688857 -700474 -369162 -6828 373005
31300 373005 851855 1245085 1329509 1217690 1170223 1188558 1114375 1019474 1127029 1340932
31290 1340932 1228222 623466 -43945 -258938 -33014 268726 497672 717207 766151 367662
31280 367662 -272726 -527541 -200520 195520 271111 307100 573286 687339 264917 -270826
31270 -270826 -283345 19498 -38663 -400827 -397297 -6513 27496 -490270 -770610 -304187
31260 -304187 336163 489457 401014 543891 631354 161287 -510837 -582437 -93514 112756
31250 112756 -248892 -461791 -17795 476813 179766 -646794 -893343 -153874 631076 371472
31240 371472 -768097 -1644438 -1614392 -1133254 -817504 -585415 -150051 166843 -185557 -1007387
$$ packed form
31310B411897q37434q49240k98391j80481m75999m59209j1617L31312L62334L79833
31300C73005M78850L93230Q4424j11819m7467J8335p4183r4901J07555K13903
31290A340932j12710o04756o67411k14993K25924L01740K28946K19535M8944l98489
31280C67662o40388k54815L27021L96040P5591L5989K66186J14053m22422n35743
31270b70826j2519L02843n8161l62164L530L90784L4009n17766k80340M66423
31260c04187O40350J53294q8443J42877Q7463m70067o72124p1600M88923K06270
31250A12756l61648k12899M43996M94608k97047q26560k46549P39469P84950k59604
31240C71472j139569q76341L0046M81138L15750K32089M35364L16894l52400q21830
$$ plain form
31230 -1007387 -1463045 -1178042 -575973 -43043 552994 1252123 1578613 1224664 695276
31221 695276 682725 1043096 976507 159391 -838718 -1373912 -1531125 -1843196 -2443475 -2847627
31211 -2847627 -2609209 -1918654 -1319552 -951074 -439549 362401 942682 799497 266953
31202 266953 148099 599486 938695 657064 78814 -246942 -323284 -439229 -460861 29742
31192 29742 925428 1456323 1088524 245773 -181909 81909 461081 394309 51849 -74578
31182 -74578 27827 -1222 -121138 137030 789206 1132773 736223 149657 96959 391764
31172 391764 325439 -133949 -289177 163281 640890 462849 -361925 -1297314 -1853572 -1858909
31162 -1858909 -1446926 -894226 -345593 219772 641441 539007 -52355 -412800 -49424
$$ packed form
31230a007387m55658K85003O02069N32930N96037O99129L26490l53949n29388
31221F95276j2551L60371o6589q17116r98109n35194j57213l12071o00279m04152
31211b847627K38418O90555N99102L68478N11525Q01950N80281j43185n32544
31202B66953j18854M51387L39209k81631n78250l25756p6342j15945k1632M90603
31192B9742Q95686N30895l67799q42751m27682K63818L79172o6772l42460j26427
31182g4578J02405k9049j19916K58168O52176L43567l96550n86566n2698K94805
31172C91764o6325m59388j55228M52458M77609j78041q24774r35389n56258n337
31162a858909M11983N52700N48633N65365M21669j02434n91362l60445L63376
$$ plain form
31153 -49424 472408 295772 -418399 -776526 -561731 -401232 -551331 -560428 -332762 -482015
31143 -482015 -1216188 -1810733 -1732193 -1454813 -1531010 -1593939 -1032326 -89163 481649 458649
31133 458649 169726 -187731 -588316 -830998 -777174 -702417 -853245 -921942 -548835 -81397
31123 -81397 -171032 -779919 -1250804 -1286756 -1225045 -1335272 -1443657 -1355782 -1170548 -1046897
31113 -1046897 -1003174 -990178 -866376 -372773 497248 1197322 1151973 547494 129611 213403
31103 213403 399773 327040 140550 32603 -131726 -392863 -353611 287624 1134510 1486444
31093 1486444 1209092 797182 609797 452433 29186 -498415 -630671 -114924 728268
31084 728268 1261416 1098427 462869 -36493 -50864 154393 123135 -121142 -136244 191131
$$ packed form
31153d9424N21832j76636p14171l58127K14795J60499j50099r097K27666j49253
31143d82015p34173n94545P8540K77380p6197o2929N61613R43163N70812k3000
31133D58649k88923l57457m00585k42682N3824P4757j50828o8697L73107M67438
31123h1397q9635o08887m70885l5952O1711j10227j08385Q7875J85234J23651
31113a046897M3723J2996J23802M93603Q70021P00074m5349o04479m17883Q3792
31103B13403J86370p2733j86490j07947j64329k61137L9252O41235Q46886L51934
31093A486444k77352m11910j87385j57364m23247n27601j32256N15747Q43192
31084G28268N33148j62989o35558m99362j4371K05257l1258k44277j5102L27375
$$ plain form
31074 191131 380321 87079 -278510 -106908 473418 754409 459367 23928 -160612 -184261
31064 -184261 -160796 34277 280474 79238 -652241 -1171646 -833380 -14589 446951 403753
31054 403753 374444 607816 803971 676788 272416 -216812 -568216 -605514 -496818 -699769
31044 -699769 -1244984 -1489376 -1065645 -564891 -608456 -779253 -363824 302050 307239 -303695
31034 -303695 -625300 -376077 -120565 -77060 61812 107134 -479999 -1256583 -1043577 124756
31024 124756 743322 103682 -605527 -255744 512417 534911 -114389 -726389 -1257399 -1799912
31014 -1799912 -1690778 -512473 729178 802195 69383 -221438 56385 61076 -252697 -122629
31004 -122629 359897 173763 -820752 -1424961 -881403 114110 681167 922446 1201000 1238770
$$ packed form
31074A91131J89190k93242l65589J71602N80326K80991k95042m35439j84540k3649
31064a84261K3465J95073K46197k01236p31479n19405L38266Q18791M61540m3198
31054D03753k9309K33372J96155j27183m04372m89228l51404l7298J08696k02951
31044f99769n45215k44392M23731N00754m3565j70797M15429O65874N189o10934
31034c03695l21605K49223K55512M3505J38872M5322n87133p76584K13006J168333
31024A24756O18566o39640p09209L49783P68161K2494o49300o12000n31010n42513
31014a799912J09134J178305J241651P3017p32812k90821K77823M691l13773J30068
31004a22629M82526j86134r94515o04209N43558R95513N67057K41279K78554L7770
$$ plain form
30994 1238770 745242 244615 427722 1082466 1409586 1167254 836939 730473 545006
30985 545006 -25064 -640603 -633883 96468 837216 912071 561003 555002 1001446 1143049
30975 1143049 563064 -59175 79616 676491 767617 131113 -502020 -586539 -433585 -610119
30965 -610119 -1150886 -1553036 -1315056 -448314 397801 468989 -250054 -980210 -1146030 -1013529
30955 -1013529 -988480 -827961 -188026 488200 460873 -159716 -603355 -662268 -826346 -1151722
30945 -1151722 -939020 108470 1157690 1220874 438757 -124115 187991 890089 1032139
30936 1032139 423801 -73283 345307 1263967 1529470 875381 308563 598700 1207114
30927 1207114 1277967 909826 659227 475100 76228 -197293 24698 194069 -345226 -1016286
$$ packed form
30994A238770m93528n00627J83107O54744L27120k42332l30315j06466j85467
30985E45006n70070o15539O720P30351P40748P4855l51068o001M46444J41603
30975A143049n79985o22239J38791N96875R1126o36504o33133q4519J52954j76534
30965f10119n40767m02150K37980Q66742Q46115P1188p19043p30156j65820J32501
30955a013529K5049J60519O39935O76226k7327o20589m43639n8913j64078l25376
30945a151722K12702J047490J049220O3184p82117n62872L12106P02098J42050
30936A032139o08338m97084M18590R18660K65503o54089n66818K90137O08414
30927A207114P0853l68141k50599j84127l98872k73521K21991J69371n39295o71060
$$ plain form
30917 -1016286 -787050 8395 89371 -620567 -820815 11413 829803 789343 365171 144447
30907 144447 -128858 -587971 -592695 92224 570534 182114 -377843 -240427 250631 341023
30897 341023 225332 490297 853838 616826 -59764 -392051 -178262 162286 445848 728662
30887 728662 753607 290360 -203905 -116240 339271 487268 309088 326691 542697 411399
30877 411399 -159065 -611066 -600251 -357865 -173576 -147721 -408146 -924772 -1176812 -675260
30867 -675260 245840 820837 915883 964229 980078 547497 -181958 -430953 52627 628916
30857 628916 797105 775566 763389 474028 -153687 -551283 -370867 -85934 -170086 -273568
30847 -273568 121206 707541 755532 221446 -225624 -145214 269539 627860 703337 457818
$$ packed form
30917a016286K29236P95445Q0976p09938k00248Q32228Q18390m0460m24172k20724
30907A44447k73305m59113m724O84919M78310l88420n59957J37416M91058R0392
30897C41023j15691K64965L63541k37012o76590l32287K13789L40548K83562K82814
30887G28662K4945m63247m94265Q7665M55511J47997j78180J7603K16006j31298
30877D11399n70464m52001J0815K42386J84289K5855k60425n16626k52040N01552
30867f75260R21100N74997R5046M8346J5849m32581p29455k48995M83580N76289
30857F28916J68189k1539j2177k89361o27715l97596J80416K84933q4152j03482
30847b73568L94774N86335M7991n34086m47070Q0410M14753L58321P5477k45519
$$ plain form
30837 457818 127771 164563 676344 1084743 797458 78589 -271918 -6265 390507 575082
30827 575082 705120 762440 249140 -967282 -2025226 -1920611 -778870 279726 482572
30818 482572 132134 -15735 368279 1064194 1673075 1881110 1600408 1059958 605339 295255
30808 295255 -93919 -560397 -691324 -227253 470096 844285 814491 650063 398885 -53777
30798 -53777 -462409 -345547 283232 824349 881977 673237 487075 258795 -44690 -143479
30788 -143479 37278 20352 -530628 -1103998 -903837 68228 1038797 1446706 1371242 1055552
30778 1055552 570641 23458 -368735 -541600 -606903 -598219 -518196 -567913 -883390 -1069958
30768 -1069958 -536682 598122 1449091 1403996 770136 178787 -180725 -427544 -517181 -325137
$$ packed form
30837D57818l30047L6792N11781M08399k87285p18869l50507K65653L96772J84575
30827E75082J30038N7320n13300j216422j057944J04615J141741J058596K02846
30818D82572l50438j47869L84014O95915O08881K08035k80702n40450m54619l10084
30808B95255l89174m66478j30927M64071O97349L74189k9794j64428k51178m52662
30798e3777m08632J16862O28779N41117N7628k08740j86162k28280l03485r8789
30788a43479J80757j6926n50980n73370K00161R72065R70569M07909p5464l15690
30778A055552m84911n47183l92193j72865o5303Q684Q0023m9717l15477j86568
30768a069958N33276J134804Q50969m5095o33860n91349l59512k46819q9637J92044
$$ plain form
30758 -325137 32960 305235 367734 179049 -271868 -738153 -735013 -106821 660525 1004125
30748 1004125 942516 878402 1001418 1229266 1480369 1602666 1290097 560906 98516 511397
30738 511397 1351370 1530579 767063 -46594 -103384 335674 569660 493841 467924 525860
30728 525860 355022 -45547 -257213 -70967 207150 242487 143256 220998 482286 622295
30718 622295 462150 151177 -112937 -359936 -688167 -962666 -920540 -568683 -201335 71942
30708 71942 519142 1281574 1938116 1927526 1263640 463695 -121901 -480739 -532334 -135846
30698 -135846 396026 406194 -172532 -525649 -60093 621433 446574 -642058 -1546677 -1352078
30688 -1352078 -293981 694492 990061 694758 357402 435039 848187 1025502 579957
$$ packed form
30758c25137L58097K72275O2499j88685m50917m66285L140O28192P67346L43600
30748A004125o1609o4114J23016K27848K51103J22297l12569p29191m62390M12881
30738E11397Q39973J79209p63516q13657n6790M39058K33986p5819k5917N7936
30728E25860j70838m00569k11666J86246K78117L5337r9231P7742K61288J40009
30718F22295j60145l10973k64114k46999l28231k74499M2126L51857L67348K73277
30708G1942M47200P62432O56542j0590o63886p99945n85596l58838n1595L96488
30698a35846N31872J0168n78726l53117M65556O81526j74859j088632r04619J94599
30688a352078J058097R88473K95569k95303l37356P7637M13148J77315m45545
$$ plain form
30679 579957 -100979 -248998 285523 811297 726910 308404 259781 714990 1087256 874233
30669 874233 241289 -327994 -675030 -974005 -1219659 -1094776 -482965 200795 487674 459436
30659 459436 496503 564601 278108 -303656 -554866 -210966 132485 -144234 -796854 -1139464
30649 -1139464 -972726 -559480 -25690 572565 840641 432313 -257535 -496402 -284777
30640 -284777 -311972 -802634 -1162110 -959615 -558493 -456032 -580674 -588718 -386434 -56403
30630 -56403 313953 501754 299415 -6891 170826 827441 1237310 1005490 627227 623085
30620 623085 755164 606487 343416 285667 222921 -151074 -509482 -305695 343515 831792
30610 831792 907134 758915 496701 146252 -40542 121920 318333 147674 -235384 -452300
$$ packed form
30679E79957o80936j48019N34521N25774q4387m18506m8623M55209L72266k13023
30669H74233o32944n69283l47036k98975k45654J24883O11811O83760K86879k8238
30659D59436L7067O8098k86493n81764k51210L43900L43451k76719o52620l42610
30649a139464J66738M13246N33790N98255K68076m08328o89848k38867K11625
30640b84777k7195m90662l59476K02495M01122J02461j24642q044K02284L30031
30630e6403L70356J87801k02339l06306J77717O56615M09869k31820l78263m142
30620F23085J32079j48677k63071n7749o2746l73995l58408K03787O49210M88277
30610H31792P5342j48219k62214l50449j86794J62462J96413j70659l83058k16916
$$ plain form
30600 -452300 -581177 -832331 -848973 -183204 698485 820726 114705 -484345 -458709 -312606
30590 -312606 -539386 -900087 -1105606 -1366932 -1748917 -1716447 -964369 -136734 -43202 -546123
30580 -546123 -858278 -662452 -328832 -200114 -231832 -286534 -316437 -241492 6194 294603
30570 294603 389575 226394 -81996 -421197 -691531 -756562 -547883 -138810 379870 938103
30560 938103 1314041 1172348 454745 -468418 -1187294 -1565885 -1554336 -1062423 -286500 213502
30550 213502 175877 92696 533179 1233518 1414369 892051 266831 -11960 -129724 -283400
30540 -283400 -225588 150585 284377 -370403 -1364296 -1603244 -722529 420395 811753 426535
30530 426535 26691 118984 502445 750834 763237 730028 776708 821617 750091 611526 560870
$$ packed form
30600d52300j28877k51154j6642O65769Q81689J22241p06021n99050K5636J46103
30590c12606k26780l60701k05519k61326l81985L2470P52078Q27635R3532n02921
30580e46123l12155J95826L33620J28718l1718n4702k9903P4945K47686K88409
30570B94603R4972j63181l08390l39201k70334o5031K08679M09073N18680N58233
30560I38103L75938j41693p17603r23163p18876l78591J1549M91913P75923N00002
30550B13502l7625q3181M40483P00339J80851n22318o25220k78791j17764j53676
30540b83400N7812L76173J33792o54780r93893k38948Q80715J142924L91358l85218
30530D26535l99844R2293L83461K48389J2403l3209M6680M4909p1526j38565n0656
$$ plain form
30519 560870 600660 510793 180077 -112074 -52626 94416 -304730 -1262351 -1899500 -1572415
30509 -1572415 -805574 -503761 -614273 -377514 302833 720746 658349 787508 1436418 1912651
30499 1912651 1631906 1101942 1055257 1275866 1123469 702026 594605 785758 776187 569308
30489 569308 628061 918904 884403 427152 105426 196825 304881 126005 -38745 163627
30479 163627 566203 742855 504491 -7395 -422000 -329594 270417 783592 712052 389090
30469 389090 463329 820025 790846 403655 489327 1298816 1909472 1499323 506777 -68105
30459 -68105 -2464 119746 -109251 -472414 -540803 -169011 362279 559253 228745 -204221
30449 -204221 -190403 162733 261961 -10099 -105525 265935 656325 605831 275930 22672
$$ packed form
30519E60870L9790q9867l30716k92151N9448J47042l99146r57621o37149L27085
30509a572415P66841L01813j10512K36759O80347M17913o2397J29159O48910M76233
30499A912651k80745n29964m6685K20609j52397m21443j07421J91153r571k06879
30489E69308N8753K90843l4501m57251l21726R1399J08056j78876j64750K02372
30479A63627M02576J76652k38364n11886m14605R2406O00011N13175p1540l22962
30469C89090P4239L56696k9179l87191Q5672Q09489O10656m10149r92546n74882
30459f8105O5641J22210k28997l63163o8389L71792N31290J96974l30508m32966
30449b04221J3818L53136R9228k72060r5426L71460L90390n0494l29901k53258
$$ plain form
30439 22672 -132541 -254189 -229430 -129172 -331602 -885642 -1236045 -995487 -500222 -163582
30429 -163582 187809 786540 1231449 992607 279995 -230071 -301646 -201969 -81445 130447
30419 130447 350478 381671 249554 112714 -20757 -156932 -125374 123845 297073 193421
30409 193421 65807 174118 327231 278854 182196 184332 13469 -465462 -744282 -405081
30399 -405081 57440 -76980 -609573 -819391 -681624 -714580 -835428 -467893 253008 524916
30389 524916 246059 175152 438152 99998 -1175309 -2164145 -1706670 -471656 -23253
30380 -23253 -603119 -948312 -196291 1020732 1566873 1163006 437833 72222 241869 727426
30370 727426 1305106 1951126 2645559 3065191 2762166 1798565 912046 723762 949441 777893
$$ packed form
30439B2672j55213j21648K4759J00258k02430n54040l50403K40558M95265L36640
30429a63582L51391N98731M44909k38842p12612n10066p1575R9677J20524K11892
30419A30447K20031L1193j32117j36840j33471j36175L1558K49219J73228j03652
30409A93421j27614J08311J53113m8377r6658K136j70863m78931k78820L39201
30399d05081M62521j34420n32593k09818J37767l2956j20848L67535P20901K71908
30389E24916k78857p0907K63000l38154j275307r88836M57475J235014M48403
30380b3253n79866l45193P52021J217023N46141m03867p25173l65611J69647M85557
30370G27426N77680O46020O94433M19632l03025r63601q86519j88284K25679j71548
$$ plain form
30360 777893 -23440 -788166 -831191 -307113 41366 -194363 -688190 -879034 -642604 -337266
30350 -337266 -278903 -362803 -274907 62143 422318 607096 637458 569748 333698 -75255
30340 -75255 -375474 -227958 285206 622077 353819 -338499 -896094 -1046945 -1038532 -1189217
30330 -1189217 -1432559 -1455104 -1140743 -684583 -331406 -172580 -150168 -92472 193905 666364
30320 666364 938800 688686 159466 -38077 309143 729415 664737 120513 -422841 -553754
30310 -553754 -254617 148492 256827 -21658 -311216 -191908 194154 271887 -146667 -562071
30300 -562071 -531348 -329390 -480243 -880664 -877559 -204000 562003 634070 -69644 -817751
30290 -817751 -871425 -303417 129995 -48096 -468946 -528562 -255691 -116057 -172070 -85377
$$ packed form
30360G77893q01333p64726m3025N24078L48479k35729m93827j90844K36430L05338
30350c37266N8363q3900Q7896L37050L60175J84778L0362o7710k36050m08953
30340g5255l00219J47516N13164L36871k68258o92318n57595j50851Q413j50685
30330a189217k43342k2545L14361M56160L53177J58826K2412N7696K86377M72459
30320F66364K72436k50114n29220j97543L47220M20272o4678n44224n43354j30913
30310e53754K99137M03109J08335k78485k89558J19308L86062P7733m18554m15404
30300e62071L0723K01958j50853m00421L105O73559P66003P2067p03714p48107
30290h17751n3674N68008M33412j78091m20850n9616K72871J39634n6013Q6693
$$ plain form
30280 -85377 95477 -91101 -613847 -800229 -413107 -107528 -339517 -561141 -156948 458019
30270 458019 473130 -60270 -447569 -487482 -539451 -681991 -642435 -442296 -336422 -214166
30260 -214166 184293 580009 492144 155203 209628 523662 316726 -454655 -894701 -624328
30250 -624328 -383282 -712257 -1028694 -678347 -61280 80556 -157385 -185419 82510 375540
30240 375540 747849 1258337 1343673 459246 -837443 -1374131 -907473 -332110 -328549 -669735
30230 -669735 -993078 -1339240 -1579916 -1164126 -5124 1014423 1062840 453394 129493
30221 129493 423179 931220 1311524 1512403 1383661 774175 12880 -328290 -200095 -62283
30211 -62283 -108617 -113521 -63975 -215549 -382706 23770 940732 1430897 971844 201935
$$ packed form
30280h5377J80854j86578n22746j86382L87122L05579k31989k21624M04193O14967
30270D58019J5111n33400l87299l9913n1969j42540L9556K00139J05874J22256
30260b14166L98459L95716q7865l36941N4425L14034k06936p71381m40046K70373
30250f24328K41046l28975l16437L50347O17067J41836k37941k8034K67929K93030
30240C75540L72309N10488Q5336q84427j296689n36688M66658N75363L561l41186
30230f69735l23343l46162k40676M15790J159002J019547M8417o09446l23901
30221A29493K93686N08041L80304K00879j28742o09486p61295l41170J28195J37812
30211f2283m6334m904M9546j51574j67157M06476R16962M90165m59053p69909
$$ plain form
30201 201935 -172751 -406831 -908146 -1221088 -849485 -428584 -817101 -1461899 -1077031 238678
30191 238678 1058144 855118 629387 978641 1113585 462234 -186482 -83439 160989 -250967
30181 -250967 -840581 -756577 -303079 -298628 -567385 -374286 125940 199929 -36651 171885
30171 171885 760429 896522 468793 261278 533457 633833 266189 2780 175283 298372
30161 298372 67765 6703 551136 1244736 1431844 1160054 856765 615617 327188 114311
30151 114311 148017 313658 432329 557998 770428 942837 956912 875578 708878 329497
30141 329497 -159753 -304700 158840 853722 1108331 649770 -173978 -748669 -718274 -280662
30131 -280662 41843 24923 331 325011 826653 1079075 994789 755072 376391 -176991
$$ packed form
30201B01935l74686k34080n01315l12942L71603M20901l88517o44798L84868J315709
30191B38678Q19466k03026k25731L49254J34944o51351o48716J03043K44428m11956
30181b50967n89614Q4004M53498M451k68757J93099N00226P3989k36580K08536
30171A71885N88544J36093m27729k07515K72179J00376l67644k63409J72503J23089
30161B98372k30607o1062N44433O93600J87108k71790l03289k41148k88429k12877
30151A14311L3706J65641J18671J25669K12430J72409J4075q1334j66700l79381
30141C29497m89250j44947M63540O94882K54609m58561q23748n74691L0395M37612
30131b80662L22505j6920k4592L24680N01642K52422q4286k39717l78681n53382
$$ plain form
30121 -176991 -617323 -584484 -185509 151655 225501 66257 -323015 -728294 -588859 238917
30111 238917 933903 707711 -920 -254931 -184068 -626059 -1383817 -1262416 -38911 979549
30101 979549 824093 74318 -351750 -464061 -572559 -453855 26350 317566 26179 -380831
30091 -380831 -438636 -475594 -777653 -779448 -15341 836346 883174 419461 346450 659103 609683
30080 609683 64694 -397366 -573886 -778327 -956051 -665692 -6830 354949 244599 230835
30070 230835 603835 858777 532704 -49163 -258208 3389 290607 198056 -265540 -720530
30060 -720530 -724484 -178930 537451 954804 973585 828003 750724 857508 1167849 1488118
30050 1488118 1457361 988876 495576 384779 497856 371255 -81287 -472315 -448255 -31411
$$ packed form
30121a76991m40332L2839L98975L37164P3846j59244l89272m05279J39435Q27776
30111B38917O94986k26192p08631k54011P0863m41991p57758J21401J223505J018460
30101I79549j55456p49775m26068j12311j08498J18704M80205K91216k91387m07010
30091c80831n7805l6958l02059j795P64107Q51687M6828m63713p3011L12653m9420
30080F09683n44989m62060j76520k04441j77724K90359O58862L61779j10350j3764
30070B30835L73000K54942l26073n81867k09045K61597K87218r2551m63596m54990
30060g20530l954N45554P16381M17353J8781j45582p7279J06784L10341L20269
30050A488118l0757m68485m93300j10797J13077j26601m52542l91028K4060M16844
$$ plain form
30040 -31411 473368 718997 570230 265706 174354 296507 258906 -98684 -485514 -650187
30030 -650187 -679324 -605493 -235947 298333 375274 -240143 -826640 -612866 119639 480180
30020 480180 229433 -83773 -71987 95863 222583 384148 594146 615580 250311 -408704
30010 -408704 -1002638 -1044414 -252884 998501 1825099 1738478 1171387 821148 814551 876218
30000 876218 915012 944605 763165 255495 -264618 -521981 -759617 -1189418 -1339749 -669908
29990 -669908 434113 1051412 949840 657504 450667 114512 -290681 -293690 162144 488697
29980 488697 323535 43721 126395 470946 643223 466547 164535 117511 496370 936526
29970 936526 753290 -162646 -910830 -578231 518844 1237385 1138772 866469 963561 1121513
$$ packed form
30040c1411N04779K45629j48767l04524r1352J22153l7601l57590l86830j64673
30030f50187k9137P3831L69546N34280P6941o15417n86497K13774P32505L60541
30020D80180k50747l13206J1786J67850J26720J61565K09998K1434l65269o59015
30010d08704n93934m1776P91530J251385Q26598q6621n67091l50239o597O1667
30000H76218L8794K9593j81440n07670n20113k57363k37636m29801j50331O69841
29990f69908J104021O17299j01572k92336k06837l36155m05193l009M55834L26553
29980D88697j65162k79814Q2674L44551J72277j76676l02012m7024L78859M40156
29970I36526j83236r15936p48184L32599J097075P18541r8613k72303R7092J57952
$$ plain form
29960 1121513 882373 425830 250351 495150 920362 1264723 1371252 1181204 775306
29951 775306 291747 -189798 -536749 -530642 -241364 -174363 -599834 -996465 -737907 -102671
29941 -102671 101460 -231762 -452549 -294421 -204182 -413266 -530125 -327886 -182696 -386107
29931 -386107 -662481 -696759 -563040 -360565 -34987 179492 -165573 -857022 -927491 50923
29921 50923 1177576 1303122 437318 -472247 -767640 -521120 -56503 385193 608055 502601
29911 502601 112735 -463204 -1057026 -1310848 -982100 -432151 -282530 -472653 -324749 243065
29901 243065 392483 -294294 -990019 -850888 -336381 -378049 -785121 -581335 330144 973109
29891 973109 800104 356015 207342 125730 -228815 -538288 -315544 286291 697324 697027
$$ packed form
29960A121513k39140m56543j75479K44799M25212L44361J06529j90048m05898
29951G75306m83559m81545l46951O107K89278O7001m25471l96631K58558O35236
29941a02671K04131l33222k20787J58128R0239k09084j16859K02239J45190k03411
29931c86107k76374l4278J33719K02475L25578K14479l45065o91449p0469R78414
29921E0923J126653J25546q65804r09565k95393K46520M64617M41696K22862j05454
29911E02601l89866n75939n93822k53822L28748N49949J49621j90123J47904N67814
29901B43065J49418o86777o95725J39131N14507m1668m07072K03786R11479O42965
29891I73109j73005m44089j48673q1612l54545l09473K22744O01835M11033k97
$$ plain form
29881 697027 481993 145301 -423195 -1119016 -1521945 -1367639 -871182 -415486 -111796 110475
29871 110475 139046 -221951 -761245 -883071 -361667 250450 309292 -93398 -419267 -556871
29861 -556871 -805292 -1079865 -856526 -69894 590284 596298 247460 42677 -102905 -512267
29851 -512267 -995661 -1027092 -509190 126903 519938 685236 756490 758814 679364 560086
29841 560086 485917 540772 707271 819778 800542 895013 1334841 1778993 1588700 787542
29831 787542 178427 221398 373964 -23942 -764040 -1240887 -1419682 -1618484 -1685488 -1221375
29821 -1221375 -456959 -69995 -120900 34497 650881 1192951 1298426 1400661 1914621 2399382
29811 2399382 2203520 1624280 1667403 2605748 3408681 2950075 1428969 125088 -158333
$$ packed form
29881F97027k15034l36692n68496o95821m02929J54306M96457M55696L03690K22271
29871A10475K8571l60997n39294j21826N21404O12117N8842m02690l25869j37604
29861e56871k48421k74573K23339P86632O60178O014l48838k04783j45582m09362
29851e12267m83394l1431N17902O36093L93035J65298P1254K324p9450j19278
29841E60086p4169N4855J66499J12507j9236R4471M39828M44152j90293q01158
29831G87542o09115M2971J52566l97906p40098m76847j78795j98802o7004M64113
29821a221375P64416L86964n0905J55397O16384N42070J05475J02235N13960M84761
29811B399382j95862n79240M3123R38345Q02933m58606j521106j303881k83421
$$ plain form
29802 -158333 111760 116294 -148042 -139449 138793 105405 -352957 -644690 -542535 -642347 -1219296
29791 -1219296 -1426320 -495602 831731 1144203 354883 -274986 -90429 165769 -171609
29782 -171609 -552399 -237483 381632 393074 -184026 -491924 -230092 -102634 -713599 -1657261
29772 -1657261 -2063283 -1701633 -1154955 -971412 -981874 -639975 97955 570623 254842 -463200
29762 -463200 -739521 -381414 -24479 -140319 -383808 -206209 293587 545929 313886 -90725
29752 -90725 -318690 -379286 -506994 -825387 -1162336 -1163336 -708754 -204596 -146841 -329790
29742 -329790 27016 1075284 1796666 1239886 -93535 -860741 -681058 -449047 -788429
29733 -788429 -1124310 -701135 224793 812953 767201 428115 83250 -202684 -295396 -136863
$$ packed form
29802a58333K70093M534k64336Q593K78242l3388m58362k91733J02155r9812n76949
29791a219296k07024R30718J327333L12472p89320o29869J84557K56198l37378
29782a71609l80790L14916O19115J1442n77100l07898K61832J27458o10965r43662
29772a657261m06022L61650N46678J83543j0462L41899P37930M72668l15781p18042
29762d63200k76321L58107L56935j15840k43489J77599M99796K52342k32043m04611
29752i0725k27965o0596j27708l18393l36949j000M54582N04158N7755j82949
29742c29790L56806J048268P21382n56780j333421p67206J79683K32011l39382
29733g88429l35881M23175R25928N88160m5752l39086l44865k85934r2712J58533
$$ plain form
29723 -136863 -75271 -487800 -1109508 -1253554 -704542 87864 705241 1121255 1303807 1040588
29713 1040588 401857 -98740 -114743 116623 242728 330718 607203 952969 1033583 772866
29703 772866 388511 74787 -109850 -166289 -168293 -206197 -159754 238056 901001 1240823
29693 1240823 843203 58173 -458269 -591011 -703108 -845720 -573946 332305 1379444
29684 1379444 1835032 1502095 851939 481992 553146 750805 756383 648145 672586 701256
29674 701256 294267 -573739 -1268510 -1279720 -897781 -712000 -739514 -564793 -156285 30162
29664 30162 -246860 -682682 -839261 -527257 196260 1029625 1465938 1248961 790767 738718
29654 738718 1135811 1421746 1252784 857711 535332 267117 -44024 -333232 -499476 -500321
$$ packed form
29723a36863O1592m12529o21708j44046N49012P92406O17377M16014J82552k63219
29713A040588o38731n00597j6003K31366J26105Q7990K76485L45766Q0614k60717
29703G72866l84355l13724j84637n6439k004l7904M6443L97810O62945L39822
29693A240823l97620p85030n16442j32742j12097j42612K71774R06251J047139
29684A379444M55588l32937o50156l69947P1154J97659N578j08238K4441K8670
29674G01256m06989q68006o94771j1210L81939J85781k7514J74721M08508J86447
29664C0162k77022m35822j56579L12004P23517Q33365M36313k16977m58194n2049
29654G38718L97093K85935j68962l95073l22379k68215l11141k89208j66244q45
$$ plain form
29644 -500321 -331591 -197904 -527447 -1345161 -1831340 -1194242 96335 766742 497719
29635 497719 295195 818901 1328399 910060 -79628 -641410 -624217 -653993 -906685 -923912
29625 -923912 -603521 -486955 -855420 -1217772 -1024038 -426903 16164 97850 50419 13406
29615 13406 -213142 -770798 -1328315 -1346787 -774139 -199335 -131556 -348931 -259315 251873
29605 251873 715495 748456 427129 11597 -282684 -229715 222101 635637 441951 -242663
$$ packed form
29644e00321J68730J33687l29543q17714m86179O37098J290577O70407k69023
29635D97719k02524N23706N09498m18339r89688n61782J7193k9776k52692j7227
29625i23912L20391J16566l68465l62352J93734N97135M43067Q1686m7431l7013
29615A3406k26548n57656n57517j8472N72648N74804O7779k17375Q9616N11188
29605B51873M63622L2961l21327m15532k94281N2969M51816M13536j93686o84614
$$ [...]
##END NTUPLES=NMR SPECTRUM
##END=
