##TITLE=31Pdec_LY-12Dix.2.B
 CD3CN, 24 sc
 2.06.2021
##JCAMPDX= 6.0         $$ Bruker NMR JCAMP-DX V2.0
##DATA TYPE= NMR SPECTRUM
##DATA CLASS= NTUPLES
##ORIGIN= UXNMR, Bruker Analytische Messtechnik GmbH
##OWNER= root
$$ XWIN-NMR		Version 3.5
$$ Wed Jun  2 10:33:34 2021 Russian Standard Time (UT+4h)  she@DPX200
##.OBSERVE FREQUENCY= 81.013821
##.OBSERVE NUCLEUS= ^31P
##.ACQUISITION MODE= SIMULTANEOUS
##.ACQUISITION SCHEME= undefined
##.AVERAGES= 24
##.DIGITISER RES= 16
##SPECTROMETER/DATA SYSTEM= spect
##.PULSE SEQUENCE= zgpg30
##.SOLVENT NAME= CD3CN
##.SHIFT REFERENCE= (INTERNAL, CD3CN, 0, 248.564)
##AUDIT TRAIL= $$ (NUMBER, WHEN, WHO, WHERE, WHAT)
$$ ##TITLE= Audit trail, XWIN-NMR		Version 3.5
$$ ##JCAMPDX= 5.01
$$ ##ORIGIN= Bruker BioSpin GmbH
$$ ##OWNER= she
$$ F:/spectra/data/she/nmr/P31/1/pdata/1/auditp.txt
$$ ##AUDIT TRAIL=  $$ (NUMBER, WHEN, WHO, WHERE, WHAT)
(   1,<2021-06-02 10:31:04.84 +0400>,<she>,<DPX200>,
      <created by zg, POWCHK disabled, PULCHK disabled
       configuration hash MD5:
       00 E9 B6 7A A2 85 ED C7 34 08 36 98 17 FE 4E 26
       data hash MD5: 32K
       92 59 C7 67 39 5E 94 F0 61 9B 2E 06 09 91 AE 65>)
(   2,<2021-06-02 10:31:57.45 +0400>,<she>,<DPX200>,
      <Start of raw data processing
       efp BC_mod = 2 LB = 1 FT_mod = 6 PKNL = 1 PHC0 = -6345.645 PHC1 = 1047.47 SI = 64K 
       data hash MD5: 64K
       D6 1D B4 A8 27 E4 B0 04 88 C7 FB C7 5B F7 DD E7>)
(   3,<2021-06-02 10:32:15.09 +0400>,<she>,<DPX200>,
      <pk PHC0 = -17.30154 PHC1 = 0 
       data hash MD5: 64K
       08 3E 61 AA BC 98 76 36 45 D2 10 9D 64 1C EB 3C>)
(   4,<2021-06-02 10:32:18.43 +0400>,<she>,<DPX200>,
      <abs ABSG = 5 
       data hash MD5: 64K
       2F 18 FE D1 CA C4 2B B1 FB 1A F9 F4 EE D3 F3 A7>)
(   5,<2021-06-02 10:33:01.48 +0400>,<she>,<DPX200>,
      <pk PHC0 = 348.2916 PHC1 = -697.8 
       data hash MD5: 64K
       2A 8E E3 5B EC 3A 4A E7 70 7A F5 D3 3C 55 5D 76>)
(   6,<2021-06-02 10:33:05.34 +0400>,<she>,<DPX200>,
      <abs ABSG = 5 
       data hash MD5: 64K
       41 12 19 33 81 61 74 05 56 FC 8C 36 54 90 1F C3>)
$$ ##END=
$$ 
$$ hash MD5
$$ 42 7D CD 9C F8 BC 3F 8D 9C B1 F2 1D 77 21 3E F6
##$RELAX= 
##$RELAX= 
##$RELAX= 
##$RELAX= 
##$RELAX= 
##$RELAX= 
##$RELAX= 
##$RELAX= 
$$ Bruker specific parameters
$$ --------------------------
##$DU= <F:/spectra>
##$EXPNO= 1
##$NAME= <P31>
##$PROCNO= 1
##$TYPE= <nmr>
##$USER= <she>
##$AMP= (0..31)
100 100 100 100 100 100 100 100 100 100 100 100 100 100 100 100 100 100 
100 100 100 100 100 100 100 100 100 100 100 100 100 100 
##$AQSEQ= 0
##$AQ_mod= 1
##$AUNM= <au_zg>
##$AUTOPOS= <>
##$BF1= 81.014009
##$BF2= 200.13
##$BF3= 200.13
##$BF4= 200.13
##$BF5= 200.13
##$BF6= 200.13
##$BF7= 200.13
##$BF8= 200.13
##$BYTORDA= 1
##$CFDGTYP= 0
##$CFRGTYP= 5
##$CHEMSTR= <none>
##$CNST= (0..31)
1 1 145 1 1 1 1 1 1 1 1 1 1 1 1 1 1 1 1 1 1 1 1 1 1 1 1 1 1 1 1 1 
##$CPDPRG= <waltz16>
##$CPDPRG1= <>
##$CPDPRG2= <waltz16>
##$CPDPRG3= <>
##$CPDPRG4= <mlev>
##$CPDPRG5= <mlev>
$$ [...]
##$SUBNAM3= <"">
##$SUBNAM4= <"">
##$SUBNAM5= <"">
##$SUBNAM6= <"">
##$SUBNAM7= <"">
##$SUBNAM8= <"">
##$SUBNAM9= <"">
##$SW= 501.771253377433
##$SWIBOX= (0..15)
0 1 3 0 0 0 0 0 0 0 0 0 0 0 0 0 
##$SW_h= 40650.406504065
##$TD= 32768
##$TD0= 1
##$TE= 0
##$TE2= 300
##$TE3= 300
##$TEG= 300
##$TL= (0..7)
0 120 53 12 22 120 120 120 
##$TP= (0..7)
150 150 150 150 150 150 150 150 
##$TP07= 0
##$TPNAME0= <>
##$TPNAME1= <>
##$TPNAME2= <>
##$TPNAME3= <>
##$TPNAME4= <>
##$TPNAME5= <>
##$TPNAME6= <>
##$TPNAME7= <>
##$TPOAL= (0..7)
0.5 0.5 0.5 0.5 0.5 0.5 0.5 0.5 
##$TPOFFS= (0..7)
0 0 0 0 0 0 0 0 
##$TUNHIN= 0
##$TUNHOUT= 0
##$TUNXOUT= 0
##$USERA1= <user>
##$USERA2= <user>
##$USERA3= <user>
##$USERA4= <user>
##$USERA5= <user>
##$V9= 5
##$VALIST= <valist>
##$VCLIST= <CCCCCCCCCCCCCCC>
##$VD= 0
##$VDLIST= <DDDDDDDDDDDDDDD>
##$VPLIST= <PPPPPPPPPPPPPPP>
##$VTLIST= <TTTTTTTTTTTTTTT>
##$WBST= 1024
##$WBSW= 4
##$XGAIN= (0..3)
0 0 0 0 
##$XL= 0
##$YL= 0
##$YMAX_a= 4697
##$YMIN_a= -11409
##$ZGOPTNS= <>
##$ZL1= 120
##$ZL2= 120
##$ZL3= 120
##$ZL4= 120
##$ABSF1= 248.5645
##$ABSF2= -253.2056
##$ABSG= 5
##$ABSL= 3
##$ALPHA= 0
##$AQORDER= 0
##$ASSFAC= 0
##$ASSFACI= 0
##$ASSFACX= 0
##$ASSWID= 0
##$AUNMP= <proc_1d>
##$AZFE= 0.1
##$AZFW= 0.5
##$BCFW= 0
##$BC_mod= 2
##$BYTORDP= 0
##$COROFFS= 0
##$CY= -3
##$DATMOD= 1
##$DC= 0
##$DFILT= <>
##$DTYPP= 0
##$F1P= 0
##$F2P= 0
##$FCOR= 1
##$FTSIZE= 65536
##$FT_mod= 6
##$GAMMA= 0
##$GB= 0
##$INTBC= 1
##$INTSCL= 5.30512e-09
##$ISEN= 30
##$LB= 1
##$LEV0= 0
##$LPBIN= 0
##$MAXI= 10000
##$MC2= 0
##$MEAN= 0
##$ME_mod= 0
##$MI= 50
##$NCOEF= 0
##$NC_proc= -3
##$NLEV= 6
##$NOISF1= 182.463
##$NOISF2= 159.3651
##$NSP= 0
##$NTH_PI= 0
##$NZP= 0
##$OFFSET= 248.5645
##$PC= 4
##$PHC0= -6014.655
##$PHC1= 349.67
##$PH_mod= 1
##$PKNL= yes
##$PPARMOD= 0
##$PSCAL= 0
##$PSIGN= 0
##$REVERSE= no
##$SF= 81.014009
##$SI= 65536
##$SIGF1= 159.3651
##$SIGF2= -187.1042
##$SINO= 113.3802
##$SIOLD= 16384
##$SREGLST= <1H.CDCl3>
##$SSB= 0
##$STSI= 65536
##$STSR= 0
##$SW_p= 40650.406504065
##$SYMM= 0
##$S_DEV= 0
##$TDeff= 32768
##$TDoff= 0
##$TI= <>
##$TILT= no
##$TM1= 0
##$TM2= 0
##$TOPLEV= 0
##$USERP1= <user>
##$USERP2= <user>
##$USERP3= <user>
##$USERP4= <user>
##$USERP5= <user>
##$WDW= 1
##$XDIM= 65536
##$YMAX_p= 369882981
##$YMIN_p= -25130403
$$ End of Bruker specific parameters
$$ ---------------------------------
##NTUPLES= NMR SPECTRUM
##VAR_NAME=  FREQUENCY,     SPECTRUM/REAL,   SPECTRUM/IMAG
##SYMBOL=    X,             R,               I
##VAR_TYPE=  INDEPENDENT,   DEPENDENT,       DEPENDENT
##VAR_FORM=  AFFN,          ASDF,            ASDF
##VAR_DIM=   65536,         65536,           65536
##UNITS=     HZ,            ARBITRARY UNITS, ARBITRARY UNITS
##FACTOR=    0.620285442955139, 1,           1
##FIRST=     20137.2065510759, 0,            0
##LAST=      -20513.1999529892, 0,           0
##MIN=       -20513.1999529892, -25130403,   0
##MAX=       20137.2065510759, 369882981,    0
$$ Real data points
##PAGE= N=1
##DATA TABLE= (X++(R..R)), XYDATA
$$ [...]
##PAGE= N=2
##DATA TABLE= (X++(I..I)), XYDATA
35692h4982K63259J37901j71577k99301j65088M2048K22789L82799M20969K22182
35682I70999j03415l15348l10502j39400R1625J82803m9820m12766l79615J90223
35672b75216O75852M56891j94860m86641k02787J33116J44278M9721J12027J76817
35662E89198K7966j81592j61693P5815K66885K56304J17622j2134p7243j02914
35652G98214j17588r6780k2092J5308r3986k43863j79319R1522K10315l616k15433
35641A42682p0336K29223K45001O510q2378O3124J16548n8137j99816j27194O388
35630B71615M7674N3562N1533n5639k27251k57603j21464k6848l2413M2347K19609
35619c4878K45475K3907j81059j59350n0419l3306k7737P9639J79668J37688L3393
$$ plain form
35692 -84982 178277 316178 144601 -154700 -319788 -277740 -54951 327848 748817 970999
35682 970999 867584 552236 241734 102334 193959 376762 326942 -85824 -465439 -275216
35672 -275216 400636 857527 662667 176026 -26761 106355 250633 300354 412381 589198
35662 589198 617164 435572 273879 349694 616579 872883 990505 978371 901128 798214
35652 798214 680626 583846 561754 577062 483076 239213 59894 151416 361731 358115 142682
35641 142682 72346 301569 546570 553080 470702 533826 650374 592237 392421 265227 271615
35630 271615 319289 372851 424384 368745 141494 -116109 -237573 -264421 -296834 -254487 -34878
35619 -34878 210597 234504 53445 -105905 -156324 -189630 -217367 -137728 41940 179628 213021
35608B13021Q222M8033O1015J0846j02134k09564j30004J78442L65840Q1370l95562
35597A29525m16321P0469L88657J61455j44654l8787K18839J40712j67208k58081
35587H4606o9397J27438K14498J84593q4200n11581n91085n0146N50070M97784
35577C52580k5205k61582n7337M2137j77595k73227K0639L40570L23561J10793
35567C95334l2890j09409j50473l3835K14395L15303J52587m8768j12982j15756
35557D73506p5097J29966L77744L03731j12886m19898l70233k45851k53677j46386
35547c39081J90648L29033k1399l98408k48629J80344K60765J204p2536J22123
35537D064J35552j58906l36006j60261P1083J05984R7340J62794J05241j39714
$$ plain form
35608 213021 221243 269276 330291 341137 239003 29439 -100565 77877 443717 525087 129525
35597 129525 -286796 -216327 172330 333785 189131 150344 369183 509895 342687 84606
35587 84606 15209 142647 357145 541738 457538 -54043 -645128 -695274 -145204 352580
35577 352580 327375 65793 8456 50593 -127002 -400229 -379590 -39020 284541 395334
35567 395334 362444 253035 102562 68727 283122 598425 751012 702244 589262 473506
35557 473506 398409 528375 906119 1209850 1096964 677066 306833 60982 -192695 -339081
35547 -339081 -148433 180600 159201 -239207 -487836 -307492 -46727 -45523 -118059 4064
35537 4064 139616 -19290 -355296 -515557 -444474 -338490 -241150 -78356 26885 -112829
35527a12829k34572L8056L55360L22000O1126l8551O5950J05227j0079j12510
35517D39178j18354j01145n7680Q1526K08572J15170j37928k22320j8890J71347
35507C59476O2841j84877k09915J1512J50037L4829r9888O974K34011K53167Q130
35496F26297k19186k13796p4791J1532M8272J40531K67123L01805J95347Q957
35486A092091j75686k77091k29596r3946m8932j33927j28880J12455L42439K17326
35476F76253j55969l09980p3635K08563K19441R6095J12137K03960R3452k56812
35466H13505n64840n61348k42052J64879L79638K93273Q6789K8845J14702Q6941
35456F00332j17909k07612O162K48669J61267j56193l10477j94044m4789R072
$$ plain form
35527 -112829 -347401 -309345 46015 368015 429141 390590 456540 561767 551688 439178
35517 439178 320824 219679 161999 243525 452097 567267 429339 207019 188129 359476
35507 359476 422317 237440 27525 39037 189074 223903 124015 130989 365000 618167 626297
35496 626297 407111 193315 118524 130056 178328 318859 585982 887787 1083134 1092091
35486 1092091 916405 639314 409718 315772 266840 132913 4033 116488 458927 676253
35476 676253 520284 210304 136669 345232 564673 660768 772905 976865 1070317 813505
35466 813505 248665 -312683 -554735 -389856 -10218 283055 369844 398689 513391 600332
35456 600332 482423 274811 280973 529642 690909 534716 224239 30195 -14594 -5522
35446e522Q7497K15868K01974k5076k32911j96618M838J35252Q6834q8845k86467
35435a03176l72770k36756O6468L08125L14463J42203k3979p4590l6225k691l4105
35424e3033o8101M5628L29399N44293M30025O3889k00477j73238k1705K4222l2370
35413H88532n3518n554K7584j3150r7548j39140o7021P6080J32516K7501q4770
35402F91512k9563R2250M0849j56620k16999n4433P8719J0869p8696K3311K22958
35391F24157K92276J95054O1129l512N4077K11380K77224P5453j73559l0347L87040
35380A970372K69927p77154j874998j775381m90650O76221P88177K83156P8105
35371h52225K88818L48085K6462k74722j98712Q7347K21526J41935N2291N8188
$$ plain form
35446 -5522 81975 297843 499817 474741 241830 45212 50050 185302 272136 183291 -103176
35435 -103176 -475946 -712702 -646234 -338109 -23646 118557 94578 19988 -16237 -18928 -53033
35424 -53033 -121134 -75506 253893 798186 1228211 1292100 1091623 918385 896680 920902 888532
35413 888532 835014 829460 857044 843894 746346 607206 540185 616265 748781 776282 691512
35402 691512 661949 754199 795048 638428 421429 366996 445715 456584 377888 401199 624157
35391 624157 916433 1111487 1172616 1169104 1223181 1434561 1711785 1787238 1613679 1583332 1970372
35380 1970372 2240299 1463145 -411853 -2187234 -2677884 -2001663 -1213486 -930330 -852225
35371 -852225 -563407 -215322 -188860 -463582 -662294 -574947 -353421 -211486 -159195 -101007
35361a01007N7475l0142j05996m5162J01855J84791J74071J47955Q1619j34940
35351C30519m11513m34793r2248K87511L38397J35216J5126O7261J10904Q5134
35341D31514J01838J33142J7599j77276j69970N0782J23570j22539l43027j77696
35331a32063J97809L30475J09010j93348l62680m00680l03841k6181L05646M26897
35321d8956K77552R9835R3612J49107M7269j98098l44618k28043M2623K11176
35311A01459J53113N034m31J75511L13598K06154p7027k79937k65459j14813M2559
35300B59761J51028J74550P9107p2881j41808r6162o0515j07138j37667p6002
35290b7727k7204q4626j19803J5657J88805J63311J5359L4956K05019J76724j12823
$$ plain form
35361 -101007 -43532 -73674 -179670 -224832 -122977 61814 235885 383840 465459 330519
35351 330519 -80994 -515787 -608035 -320524 17873 153089 168215 235476 346380 431514
35341 431514 533352 666494 684093 506817 336847 387629 511199 388660 45633 -132063
35331 -132063 65746 396221 505231 311883 -50797 -451477 -755318 -781499 -475853 -48956
35321 -48956 228596 328431 422043 571150 618419 420321 75703 -152340 -109717 101459
35311 101459 254572 259606 259175 434686 748284 954438 877411 597474 332015 217202 259761
35300 259761 410789 585339 664446 591565 449757 353595 293080 185942 48275 -27727
35290 -27727 -54931 -139557 -259360 -243703 -54898 108413 123772 158728 363747 540471 427648
35279D27648k24845J02441M41059K57966k60501m73629k22800M8682P2671O0484
35269B29176J31621M1754k54353l17727Q3630M41059J89635l71717m40946J26651
35259a41217O13891M52384q1476l65673k22451N4755J92411J62928M9695o1059
35249F54188p8649K8510J47675J06624j17706l30687l12518p4018J34306J06939
35239B64664p5846j70961q4460O9059J81964K43528K14129L7896j62973j52580
35229C64420N5761J54161m84j54441q3592K9950p1974k63611k49214n5803M9597
35218b25230N411l9497n9739j28621j47965J9884K16501J73263j7969l1019J31786
35207a03195J56325O891L044K11688K69064P244k07989m8332K56584L00130J01174
$$ plain form
35279 427648 202803 305244 746303 1004269 743768 270139 47339 96021 168692 229176
35269 229176 360797 402551 148198 -169529 -85899 355160 544795 173078 -267868 -141217
35259 -141217 472674 925058 843582 477909 255458 310213 502624 665552 715247 654188
35249 654188 575539 604049 751724 858348 740642 409955 97437 23419 157725 264664
35239 264664 188818 17857 -66603 2456 184420 427948 642077 679973 517000 364420
35229 364420 420181 574342 573858 419417 335825 365775 293801 30190 -219024 -274827 -225230
35218 -225230 -219819 -259316 -319055 -447676 -595641 -575757 -359256 -185993 -203962 -234981 -103195
35207 -103195 53130 60021 63065 274753 543817 551061 343072 294740 551324 851454 952628
35196I52628j8105N1127J31317P4784j03110l11709m16495k91157J588J95587
35186B66455J25036p3349j65187q3983R3605K62513K87617Q3715j99403k74531
35176C22488j00284N3155J7864n3792j1776L9692q553m7355J5711N9275K691r194
35164B79922R2589J05433o1371j11850J69193M45962K66232k22639m59986k69714
35154B33771o208N8172K4674P032p3385j99730j50300J25479L12408J35230k29536
35143B37607l53411o6471L76533N78487L64005p9986l75708l14615n5693R2002
35133D02750M7903O448J17578K63273K11347q4228l98187m49384k05036N5152
35123c2384N4332j20173j22200J55948M01261L18853M5399q4702k4748k07r6120
$$ plain form
35196 952628 934523 985650 1116967 1191751 1088641 776932 360437 69280 70868 266455
35186 266455 391491 318142 152955 68972 162577 425090 712707 796422 597019 322488
35176 322488 222204 275359 293223 239431 227655 267347 258794 211439 227150 286425 289116 279922
35164 279922 372511 477944 416573 304723 473916 919878 1186110 963471 503485 233771
35154 233771 227563 285735 310409 317441 244056 44326 -105974 19505 331913 467143 237607
35143 237607 -115804 -182275 194258 772745 1136750 1056764 681056 366441 310748 402750
35133 402750 450653 457101 574679 837952 1049299 965071 566884 117500 -87536 -32384
35123 -32384 21948 -98225 -220425 -64477 336784 655637 701036 616334 591586 591379 495259
35112D95259j48629n0724Q5488J31379J16786J24914J42637Q9593o8928k65193
35102F52582l51230k18312M7483J97591R4308j17686j99426q7894J16480L07818
35092D41714L80676K12172j59337m31258l40933k3869J59105J17699R2883K01773
35082F50625K18390m1146l42817k97520P9391L36187J78186j29486j53077N4714
35072E53447L3452l16145m66888n4192M42975L22678k54381m59451o2428K32793
35062b8140n5974m15887j86584L88423N61265J63754l03376m25481j87989K51867
35052b38122O05067M84263r2614m75498k06326K19824Q3586l63440k95859K55782
35042b3337L97128j25420m72023r8612L90055L18503M627M3030K35653O2729k94257
$$ plain form
35112 495259 346630 295906 381394 512773 629559 754473 897110 986703 917775 652582
35102 652582 301352 83040 130523 328114 422422 304736 105310 17416 133896 441714
35092 441714 822390 1034562 875225 443967 103034 79165 238270 355969 448852 650625
35082 650625 869015 827869 485052 187532 266923 603110 781296 651810 498733 553447
35072 553447 586899 270754 -196134 -250326 192649 515327 260946 -198505 -260933 -28140
35062 -28140 -84114 -500001 -686585 -298162 263103 426857 123481 -302000 -489989 -238122
35052 -238122 366945 851208 758594 283096 76770 296594 380180 16740 -279119 -23337
35042 -23337 373791 248371 -223652 -322264 67791 386294 390921 433951 669604 732333 438076
35031D38076k75349L6730P9969j76316k21259L4791R4852k13350l94866j11285
35021g08007K61366K46096k3971r3477J29394L47836L50043J87942j5679j82225
35011D99318k43981j78449n5230N4083J55356K42221K26290O9819r8858j35676
35001E34893q8093j11099k03808j83727L9720K89111L07779P5624j56339j60415
34991C43646K719P0862p9336k52907j63628J81463M30147K86814j05606l19137
34981C95037j70156P3931R6221m0604n8813O5260Q3516p9585j71555p372K38826
34970D24706K97708J49992n7315k31466k87000j04866K22739L26292L1591k99255
34960D73126k38916P5781J87345L7206l8948M6725L9822q8545m6918J76875J81820
$$ plain form
35031 438076 162727 199457 279426 103110 -118149 -83358 11494 -201856 -596722 -708007
35021 -708007 -446641 -200545 -224516 -317993 -188599 159237 509280 697222 681543 499318
35011 499318 255337 76888 21658 75741 231097 473318 699608 769427 670569 534893
35001 534893 446800 335701 131893 -51834 -12114 276997 584776 660400 504061 343646
34991 343646 346365 417227 337891 84984 -78644 102819 532966 819780 714174 395037
34981 395037 224881 298812 395033 354429 295616 360876 444392 364807 193252 185880 424706
34970 424706 722414 872406 815091 583625 296625 191759 414498 740790 772381 473126
34960 473126 234210 309991 497336 534542 495594 542319 582141 493596 446678 623553 805373
34949H05373j55216l86988k06915M1044m1404k44655j67892O5791P0607p3772
34939b94027M0744L89320M80233J23418k69860k83560l916K15686J96391M324
34929E98753j91682k27154p5794Q5266R6617N6460J31203K15270Q3515j74296
34919E98158k43389j11868r3610k46605k20445J23964L82306K10376j03868p4256
34909B20763K38455L67692J78375r224m209J527j46250k81778k31510j08187q6743
34898A38911j12453m5606P8295J47937J89060K48697J94759q9533l82086l19975
34888D8006M7935K34785j9266l45526k48725J97973M69166L06015n614r8675K3129
34877F09203J12712M7008r1753j80613j61751n1315N9662O8105j6545q1122p8209
$$ plain form
34949 805373 650157 263169 56254 97298 55894 -188761 -356653 -290862 -220255 -294027
34939 -294027 -253283 136037 616270 739688 469828 186268 182352 398038 594429 598753
34929 598753 407071 179917 104123 189389 286006 342466 473669 688939 772454 598158
34919 598158 354769 242901 149291 -97314 -317759 -193795 188511 398887 295019 220763
34909 220763 459218 826910 1005285 996061 991852 993379 847129 565351 333841 225654 138911
34898 138911 26458 -19148 59147 207084 396144 644841 839600 750067 367981 48006
34888 48006 95941 330726 311460 -34066 -282791 -84818 384348 690363 684749 586074 609203
34877 609203 721915 768923 677170 496557 334806 283491 343153 411258 394713 313591 235382
34866B35382p0907n9891O4754K83519L40025P5175k64999l09480p6345P7213J745
34855B96191o8192M1392J50553O5154o5526j0653J12556J2269k54961k98240K3779
34844D322L54560L14306j9997k80140k65052m9742K06581L47328K27181j25531
34834G13816m02989l04141P1708L14171J97544r5476k59539j81821O5096L43424
34824D61793M82496L62513O6336j74515k45886k34719k20268j61887m6909M8140
34814C37094J13482K11327K57355O4495k80571l95494j47571J01320N8730k8061
34804B92106J54935L56771J29260l55713m61090m4894L23546K26044o9209j57212
34794C94544r3280j11537j32818L8687K65441K32098n0010k38415j40075P1859
$$ plain form
34866 235382 164475 104584 169338 452857 792882 868057 603058 293578 217233 294446 296191
34855 296191 227999 269391 419944 485098 419572 408919 521475 533744 278783 -19457 4322
34844 4322 358882 673188 653191 373051 107999 58257 264838 612166 839347 713816
34834 713816 310827 6686 78394 392565 590109 494633 235094 53273 118369 461793
34824 461793 944289 1306802 1373138 1198623 952737 718018 497750 335863 288954 337094
34814 337094 450576 661903 919258 983753 703182 307688 160117 261437 320167 292106
34804 292106 447041 803812 933072 577359 116269 71375 394921 620965 551756 394544
34794 394544 301264 189727 56909 95596 361037 593135 543125 304710 164635 236494
34784B36494J45253N2254n0551m6102K1571K4560o9318j37696q3529p915o1539
34773B3482j65736q5406K01269M16387L30722K4502k49531k94652n3458L12377
34763D59956M17934K9051n01991n24861N0440N56571M50427J3055j63293m5036
34753G42253m9376k75177l70508j50117J13627J17080q8223k48466k06247L3360
34743c81794L27664M29968J98203j72077l05326r0324J98144K58971P5131j72378
34733C66182l17123k71957n5153J60387J64166l7066j90702r4292J76989L86412
34723B87843L73534J39520j74498l37632j96948J14412K56815P7186j83463j97565
34713A59204K6459J83674Q6059j30258k19655j04938J01008K36085J98263J6107
$$ plain form
34784 236494 381747 434001 383450 337348 358919 383479 314161 176465 92936 85021 23482
34773 23482 -142254 -227660 -26391 389996 720718 745220 495689 201037 147579 459956
34763 459956 877890 906941 404950 -119911 -69471 487100 937527 950582 787289 742253
34753 742253 692877 417700 47192 -102925 10702 127782 39559 -208907 -415154 -381794
34743 -381794 -54130 375838 574041 401964 96638 6314 204458 463429 538560 366182
34733 366182 49059 -222898 -278051 -117664 46502 9436 -181266 -275558 -98569 287843
34723 287843 661377 800897 626399 288767 91819 206231 463046 540232 356769 159204
34713 159204 185663 369337 455396 325138 105483 545 101553 337638 535901 552008
34703E52008j26810m1354K07009K96093L9159l13398l56757p3646J40819K7694
34693C50817k09422k42348o4787Q2016P6440N825k3515R951P2617Q8501N920o5910
34681H6105N1704K75360K62130p2790l26441j78638J04448J23134N880R9091K42699
34670F72682K4622l60987k84293K37075M36016J0232l56917r7272L49337L06271
34660I36766q5006k49345j47944j38750j95320j1705K95549L02929K3071j15475
34650F14770q059J9167j37617j97598p1294l2546j62299j38920J94151M88969
34640E68724L87948K9799j96387j62636m1402O24l6131m9051K3155Q2323m1406
34629E65560k84703k97681Q2171M74876M00936m6974l47057k73410p0504M2902
$$ plain form
34703 552008 425198 383844 590853 886946 926105 612707 255950 182304 323123 350817
34693 350817 141395 -100953 -165740 -83724 -7284 -1459 -24974 -15023 57594 146095 152015 86105
34681 86105 137809 413169 675299 602509 276068 97430 201878 325012 330892 429983 672682
34670 672682 697304 336317 52024 289099 725115 735347 378430 281158 630495 936766
34660 936766 851760 602415 454471 315721 120401 108696 404245 707174 730245 614770
34650 614770 606711 625878 488261 290663 219369 186823 24524 -114396 79755 568724
34640 568724 956672 986471 790084 627448 586046 586670 550539 501488 524643 606966 565560
34629 565560 280857 -16824 65347 540223 941159 894185 547128 273718 203214 246116
34619B46116R9768J07079j6586j69747j37308K2718N5885j9095L3715J45044J6539
34608C84128k28830r9108L98381N98653J84382k84031k47053L6649N8412p9425
34598G22158J8385K61640K68376O6812k7306l7610k13217m30906l37283k1704
34588B69345O5116j36250k15817k2702J14148K2152k2379J45918K38505K3421
34578D81457k43485k28746k4383R8109J50045K71148L31606J01485k78038l85256
34568B73942r6873K41402K94339J24298j8474p1848j33268j79615o0604K08764
34558E82063L59885K05056p1298j41186J1452R2566l7084j66956j16047m0080
34548F78371j40887k82075j93595O5104J73814M1909q5395k4712J32784K44987
$$ plain form
34619 246116 345884 452963 436377 266630 129322 152040 207925 188830 222545 367589 384128
34608 384128 155298 56190 454571 1053224 1237606 953575 706522 743171 801583 722158
34598 722158 740543 1002183 1270559 1337371 1310065 1272455 1059238 628332 291049 269345
34588 269345 334461 198211 -17606 -40308 73840 95992 73613 219531 458036 481457
34578 481457 237972 9226 -15157 82952 232997 504145 835751 937236 659198 273942
34568 273942 177069 418471 712810 837108 818634 746786 613518 433903 373299 582063
34558 582063 941948 1147004 1075706 934520 945972 1038538 1001454 834498 718451 678371
34548 678371 537484 255409 61814 126918 300732 342641 257246 232534 365318 610305
34538F10305K76889J85972n9210k72423j75654J44158K27131j20252m84515m01384
34528f8983J2490K93575K83698J93212J53201Q5499k3699o6558m6609q3361j65265
34517E67200j56856o1791k0549m0011P84O3846k3460k12372k23498J5817K40465
34506A49575K65802K09715J59117j6897l00787l44775K0724M05449L66220N0450
34496I64593p8619M1983R6583l796m3853P21r6666l06876k65081J28559M41966
34485H79514K86505j50574l93295k63663L7233K43409K19868l137k23357k17216
34475D15287j0868J35902Q9355q51J3537N6726J3419o9284r8622p3420R5J29839
34463F01115J93018K5593k38977k27861J12018L45262J71762j14933j08824P4587
$$ plain form
34538 610305 887194 1073166 1013956 741533 565879 710037 937168 816916 332401 -68983
34528 -68983 -56493 237082 520780 713992 867193 952692 928993 862435 815826 732465 567200
34517 567200 410344 348553 328004 287993 288777 352623 329163 116791 -106707 -90890 149575
34506 149575 415377 625092 784209 767312 466525 121750 142474 547923 914143 964593
34496 964593 885974 927957 1024540 1020744 976891 977612 880946 574070 308989 437548 879514
34485 879514 1166019 1015445 622150 358487 395720 639129 858997 855860 632503 415287
34475 415287 404419 540321 629676 628825 642362 699088 712507 643223 544601 471181 471276 601115
34463 601115 794133 819726 580749 352888 464906 810168 981930 866997 758173 832760
34453H32760N1681j64560k16711k2277J08213j0696j76886j39989O6427K25556
34443E53518K02835N8176k1453O6732J56114q177l31327l83407l2407K58177P8304
34432E97085k82680k70801Q1061K54824Q1422p9691J715J18223P5132j4476l5007
34421E26807p0030j35815p1094J33085K16943M9945j42068j33297k1885n549n9550
34410B87492l9189O2240J27780P4210r7287k82651k79921J269L17287L18792M2447
34399E32469j06763N1500K08658N9703k28483k86935q1709R1630N4717n6375l7889
34388B00523J06510J95962J17795k4411n6096P669j4037j52475k04634p8177K7567
34377A26196j4130P268K33367L56772Q8154k42189j15681K92244L22018r8503
$$ plain form
34453 832760 884441 719881 503170 480893 589106 578410 401524 261535 327962 553518
34443 553518 756353 814529 793076 859808 1015922 1007745 676418 293011 260604 518781 597085
34432 597085 314405 43604 124665 379489 460911 381220 382935 501158 576290 561814 526807
34421 526807 456777 320962 249868 382953 599896 649841 507773 374476 352591 347042 287492
34410 287492 248303 310543 438323 512533 415246 132595 -147326 -146057 171230 490022 532469
34399 532469 425706 477206 685864 745567 517084 230149 148440 240070 294787 238412 200523
34388 200523 307033 502995 620790 596379 540283 547952 533915 381440 176806 98629 126196
34377 126196 112066 119334 352701 709473 797627 555438 439757 732001 1054019 955516
34367I55516l08647J8653L71545K56197p3237j51657m5175p7797k15507k15656
34357E14235j08150p1303l8800J51356L71224L41566N5249k30777l23760j89977
34347D70863J24767M40625M72737J51936k15300k98305j13219J01913J96068J44805
34337A476890j5716j56098j53145r7935j52404j84106O6024M04062K92268k91945
34327A187895o65933l91302J35091L78192L81194L60215J69827k70665n34446
34318G50068k94416O7382P7587n4752M6169J22506j84800m42311l5618O22709
34308F74524N62227j89511o06938k61414J56992J00537q7522k3822N6768n6707
34298C25134o2844K10621L81655K04946K9598J01329P6782k48362m00619l9981
$$ plain form
34367 955516 646869 665522 1037067 1293264 1220027 1068370 1023195 945398 729891 514235
34357 514235 406085 334782 295982 447338 818562 1160128 1215377 984600 660840 470863
34347 470863 595630 1036255 1508992 1660928 1445628 1147323 1034104 1136017 1332085 1476890
34337 1476890 1461174 1305076 1151931 1053996 901592 717486 783510 1187572 1479840 1187895
34327 1187895 521962 130660 265751 643943 1025137 1385352 1555179 1284514 750068
34318 750068 455652 523034 600621 545869 592038 714544 529744 87433 51815 674524
34308 674524 1236751 1047240 440302 178888 335880 436417 348895 325073 381841 325134
34298 325134 262290 472911 854566 1059512 1089110 1190439 1267221 1018859 618240 578259
34288E78259L12679Q6866l29060k12093K64030L22938j07168l05404K4974L14628
34278I50649J02967k62394k45940O8937J95728k3675k63187j86607J52919L91018
34268H80415K62376p7691k11063J4999K69594J88581j30261l10323k28071p2832
34258E85724L0499J32926K18094J67207Q711p2455l3637l0501j09005r9391P2604
34247H70776K08399J32640k3537l4518N1461j4045k69239m29947k72431K3979
34237B43538Q4566j48703l11238j11283K41694L10874M1816j82945j11115O9646
34227A26850J13629J05722K25720L53795K31373r5050k99871k15752J1652J84749
34217G42817K29532J27888q0322k24682j68638m6943r2531k32455j57884J58993
$$ plain form
34288 578259 890938 977804 648744 436651 700681 1023619 916451 611047 636021 950649
34278 950649 1053616 791222 545282 614219 809947 786272 523085 336478 489397 880415
34268 880415 1142791 1065100 854037 869036 1138630 1327211 1196950 886627 658556 585724
34258 585724 616223 749149 967243 1134450 1143161 1070706 1037069 1006568 897563 798172 870776
34247 870776 1079175 1211815 1188278 1153760 1205221 1191176 921937 491990 219559 243538
34237 243538 328104 179401 -131837 -243120 -1426 309448 351264 168319 57204 126850
34227 126850 240479 346201 571921 925716 1157089 1062039 762168 546416 558068 742817
34217 742817 972349 1100237 1019915 795233 626595 579652 487121 254666 96782 255775
34207B55775L53456K00104o1256j18946k0171K6160J7823M6139L0870j09417j91671
34196D28866k5471J90040J13302j65776k18090N5784K83071K25416R2624Q6884
34186A066650N5697j41724k88233j54257R7772J88038J47193J30624O3956j31016
34176A034700k05469M4275K80117N9804l66363l48563R9510K60025j30249m34479
34166B93308j56364K76494K67041p431k8248J45828R5321j32798j46897J4424
34156F20678l7706k49722j47697K87161M75623J56875j99822j71704J6333J9007
34146G69026k5625J33047K98361J45799j72433k45272o0672K7883r2300j71252
34136F06562q0812q747p9709j19395M7220K90701L39438J28015j43031k43898
$$ plain form
34207 255775 609231 809335 748079 629133 608962 635122 652945 699084 729954 620537 428866
34196 428866 403395 593435 706737 540961 322871 378655 661726 887142 979766 1066650
34186 1066650 1122347 980623 692390 538133 635905 823943 971136 1101760 1165716 1034700
34176 1034700 829231 873506 1153623 1213427 847064 498501 598011 858036 727787 293308
34166 293308 136944 413438 680479 673048 644800 790628 885949 753151 606254 620678
34156 620678 582972 333250 185553 472714 948337 1105212 905390 733686 750019 769026
34146 769026 743401 876448 1174809 1320608 1148175 902903 842231 870114 777814 606562
34136 606562 525750 517003 437294 317899 365119 655820 995258 1123273 980242 736344
34126G36344j42824j1292j0765q2116k7178J69248K47726L3280k53320k59503
34116C99600k739J50011J4978j57723o6821K20014L89127K85660K5691k09089
34106A048709l14480k41863j0721K32264L02349J74597J530r3736j35562j69613
34096G93474j50419m6878M8015L1406o5597j59616k37520k54530m8810L95827
34086C05352P03493M71436j08952l79715q3388K80924J88434j91363l41223j64657
34076F80341J4664K8151j5884q1644k22346k84674m9611L12244L76772J24795
34066H82808L683J97429L03901j7528m82502n81352k45138J86785M22839L75449
34056A046374R6157j82044j61284J14948K18926m6272k93203j40754J62896J51536
$$ plain form
34126 736344 593520 582228 571463 489347 462169 631417 879143 912423 659103 399600
34116 399600 396861 546872 561850 404127 337306 557320 946447 1232107 1257798 1048709
34106 1048709 734229 492366 481645 713909 1016258 1190855 1192385 1098649 963087 793474
34096 793474 643055 596177 644192 675598 610001 450385 212865 -41665 -90475 305352
34086 305352 1008845 1480281 1371329 991614 908226 1189150 1377584 1186221 844998 680341
34076 680341 695005 723156 707272 625628 403282 118608 68997 381241 758013 882808
34066 882808 886491 1083920 1387821 1370293 887791 306439 61301 248086 670925 1046374
34056 1046374 1142531 960487 799203 914151 1133077 1086805 793602 652848 815744 967280
34046I67280r3828j29943O9030J09499r7411k07752r0995k9135j38813j42134
34036B15798Q0406K15234N7879j26006p4031O2773R1447J28827K30502J21416
34026A004245k56763l79857R7492O05757M00162k42303l97963N1582K69060j35096
34016A016316m97231k54027J60702J40901p9057M4925L44795K56659j52748k88003
34006F93232k0238J80360R2204J2285J02131J24603j1678m6729Q9598Q4311j78152
33995A121927l65572k80918j72747j79473k3683L61862M79476N9617l15075m2153
33985F43261M63130L51328l00490n85899j74239K62978J84666q2642p5092N2862
33975G39863j5987j08792O3691K69077R3183l06776l79644l1205K45476J31039
$$ plain form
34046 967280 873452 743509 812539 922038 824627 616875 525880 496745 357932 215798
34036 215798 296204 511438 569317 443311 369280 432053 523500 652327 882829 1004245
34026 1004245 747482 367625 465117 1070874 1471036 1228733 830770 882352 1151412 1016316
34016 1016316 519085 265058 425760 566661 487604 532529 877324 1133983 981235 693232
34006 693232 672994 853354 945558 957843 1059974 1184577 1172899 1126170 1215768 1300079 1121927
33995 1121927 756355 475437 302690 123217 99534 461396 940872 1000489 685414 643261
33985 643261 1106391 1457719 1157229 571330 397091 660069 844735 762093 687001 739863
33975 739863 723876 615084 678775 947852 1041035 734259 354615 323410 568886 699925
33965F99925j01669p2630J71505L14151K17951J6755j06065q8454j9461n7540
33955I74468k21364k68773K3558M38293M56262m3187n06511l95269P6969K62401
33945G96847k135k44898j35314P1287M4183r3167n5347J00910J36048O8030O1414
33934G47858M0865j57856l52478j97387K07178L63849J17195j10282K1812K93828
33924I74582L28134J09581j39868k94088k88922n7145K48959K68737n4886k69780
33914H25304l3359L52331L86237Q4894j59556k15525k40797k25796j0423K79730
33904A043040K84133m8582l46213l20729q7694Q3007P9087l5696j09877j4230
33894E26246J70075J69578p8368k19971K4080L58080K99634q2513k87816j59965
$$ plain form
33965 699925 598256 525626 697131 1011282 1229233 1245988 1139923 1051469 1032008 974468
33955 974468 753104 484331 507889 946182 1402444 1359257 852746 457477 534446 796847
33945 796847 794712 549814 414500 485787 529970 436803 381456 482366 618414 686444 747858
33934 747858 788723 630867 278389 81002 288180 652029 769224 658942 680754 974582
33924 974582 1302716 1412297 1272429 978341 689419 632274 881233 1149970 1095084 825304
33914 825304 791945 1144276 1530513 1615407 1455851 1240326 999529 773733 763310 1043040
33904 1043040 1327173 1278591 932378 611649 523955 606962 686049 650353 540476 526246
33894 526246 696321 865899 787531 567560 591640 949720 1249354 1166841 879025 719060
33884G19060l6027j18395k06911j38527k8102M1801J44907K20439Q5576j54851
33874E28970j57731P5250J40241q1502j95318L833J30790j20904l86276j84214
33864b46861K89633M56084K23401L9774J56386L12957K06575p9059k26467p3649
33854A058774K24592L45691J28194k06925k70810K060K48244J63885j00383k04407
33844A388915j04382m3438j44118k37766j22298J40563K59299O0039k32504k08863
33834G55447J48349L27614k7501n22735n07133j4176L14990K10123O3076J34498
33824H82552J22627j80988l97398j64251K22463K63256J5940q9251N0719J69648
33814H95317J26560K4385n1894p8238K027J35319R8920j46087k78034r3891J07134
$$ plain form
33884 719060 683033 564638 357727 219200 191098 232899 377806 598245 683821 528970
33874 528970 371239 446489 586730 505228 309910 313743 444533 323629 -62647 -246861
33864 -246861 42772 498856 722257 762031 918417 1231374 1437949 1358890 1132423 1058774
33854 1058774 1283366 1629057 1757251 1550326 1279516 1281576 1529820 1693705 1593322 1388915
33844 1388915 1284533 1241095 1096977 859211 736913 877476 1136775 1196814 964310 755447
33834 755447 903796 1231410 1203909 681174 174041 159865 474855 684978 748054 882552
33824 882552 1005179 824191 426793 262542 485005 748261 764201 674950 725669 895317
33814 895317 1021877 1046262 994368 916130 918157 1053476 1152396 1006309 728275 634384 741518
33803G41518j0586k35888j35480K42890M55701L15037K5877k02539k77413j01416
33793H17701K48114L74459M1874l62025l26909o309O1174j32295j00953K19173
33783H34004L24475L1557j95445m9715J29833J6063j28133M1498L17972K96234
33773A618343L5114j01548m4997k3582r8810r8084L8571J65515J78517J16649
33763A785688K2504j13262k63652l46017k91956r4695J54399K76078J84509N7405
33753A371001J23226K65645J27781l02665n53222l14928Q8764J79191K719l8720
33743I48792J48763K78674J94366L3953j09694k85564l84498j60657K90005M62592
33733A416732J16339l03343k55105J23844K50574j5526j93735M8473L89251L45601
$$ plain form
33803 741518 730932 495044 359564 602454 1058155 1373192 1399069 1196530 919117 817701
33793 817701 1065815 1440274 1482148 1120123 793214 786905 848079 715784 614831 834004
33783 834004 1158479 1190036 994591 944876 1074709 1090772 962639 1004137 1322109 1618343
33773 1618343 1653457 1551909 1506912 1483330 1384520 1286436 1325007 1490522 1669039 1785688
33763 1785688 1808192 1694930 1431278 1085261 793305 698610 853009 1129087 1313596 1371001
33753 1371001 1494227 1759872 1887653 1584988 1031766 716838 805602 984793 987512 948792
33743 948792 1097555 1376229 1570595 1604548 1494854 1209290 824792 664135 954140 1416732
33733 1416732 1533071 1229728 974623 1098467 1349041 1333515 1139780 1188253 1577504 1923105
33723A923105m0551l16740k44639O29J77022K21733J42535o9859l26931m19886
33713A046418k34050Q8939K70768J53847j45711l07000j06491K75276L86204Q2254
33703A510454k09457o3270K89772K80306j15503l20877n4071K58166J87510p4842
33693A688188j55740j27518k39020l47661j50153K16092L32478J57220J8571J3642
33683A406099n8565j64384m696L60019M07054o8608n40998m63350k3090K03422
33673A052903P5136o3807K988J31235J53771Q2331m5501k08836k60476m3119K83258
33662A159883L28635J3419k57206j45841J40651J86027k0031j32391j2805J28196
33652A388537J51860J73306K17065O1056l44563o03531l45786K05486M81732K96870
$$ plain form
33723 1923105 1882554 1565814 1321175 1321804 1498826 1720559 1863094 1793235 1466304 1046418
33713 1046418 812368 901307 1172075 1325922 1180211 873211 766720 1041996 1428200 1510454
33703 1510454 1300997 1237727 1527499 1807805 1692302 1371425 1317354 1575520 1763030 1688188
33693 1688188 1532448 1404930 1165910 818249 668096 884188 1216666 1373886 1392457 1406099
33683 1406099 1347534 1183150 1178454 1538473 1945527 1876919 1335921 872571 849481 1052903
33673 1052903 1128039 1064232 1067220 1198455 1352226 1434557 1389056 1180220 919744 876625 1159883
33662 1159883 1488518 1501937 1244731 1098890 1239541 1425568 1405537 1273146 1260341 1388537
33652 1388537 1540397 1713703 1930768 1991824 1647261 1043730 697944 903430 1385162 1682032
33642A682032j837q4466j3526j0214j20028k30334k44865j40313L9958J99754
33632A076161K79566L15264L16864J75728j47536m35913m33579j92267J6931P7057
33622A048276Q5041J13690J61020K50830L25040J68702k42120m94886k66680P9916
33612A228829k2329l97018l49069J67195M06057M4580k82582n1066L10757K05430
33602A260784j45721j71520P4492J28795j9235J1910K62263L97885L01023J40589
33592B241265m0037k87122l95377j26766K90458L73734O5530k40052k97729k00864
33582A383040l1668K12817L62086J98830j22195j96933L5601K02059N7587k05074
33572A896150k88485j43648Q4152K36656K26943J08707M0474N6715O97j65428
$$ plain form
33642 1682032 1680195 1595729 1582203 1571989 1451961 1221627 976762 836449 876407 1076161
33632 1076161 1355727 1670991 1987855 2163583 2016047 1580134 1146555 954288 971219 1048276
33622 1048276 1133317 1247007 1408027 1658857 1983897 2152599 1910479 1415593 1148913 1228829
33612 1228829 1206500 809482 460413 627608 1033665 1078245 795663 744597 1055354 1260784
33602 1260784 1115063 943543 1018035 1146830 1127595 1139505 1401768 1799653 2100676 2241265
33592 2241265 2201228 1914106 1518729 1391963 1682421 2056155 2121685 1881633 1583904 1383040
33582 1383040 1351372 1564189 1926275 2125105 2002910 1805977 1841578 2043637 2101224 1896150
33572 1896150 1607665 1464017 1548169 1784825 2011768 2120475 2160949 2217664 2218361 2052933
33562B052933k00479L2093K56336J65984r5078j71238l1954P0081J8366j02949
33552A994095k00561j64546J02952M07928L44684n9616k11953J57440M76959K18118
33542C065500k20240j64148K72913N20502N11325N08330L93017M225k29913M8729
33532D710240L09177P0558O7339R66878J415311n57123m062715n550656l326067
33523e957058J01659J442523O73597L6245M06008P49247M80569K35061L29978
33514a502171K31355j67129j77172L62828O18564J33429l52865r2051M78276M59821
33504g115j29561m58266j13457M25082N38278K15251j01684j44684o2702q4428
33494G6714j52918n2050J96279L12017J66417m3827j26073j31741j30033k8635
$$ plain form
33562 2052933 1852454 1884547 2140883 2306867 2211789 2040551 2008597 2078678 2097044 1994095
33552 1994095 1793534 1628988 1731940 2139868 2484552 2424936 2212983 2370423 2847382 3065500
33542 3065500 2845260 2681112 2954025 3474527 3985852 4494182 4887199 4891424 4661511 4710240
33532 4710240 5019417 5089975 5157314 6124192 7539503 6982380 2919665 -2630991 -5957058
33523 -5957058 -5855399 -4412876 -3739279 -3703034 -3297026 -2547779 -2067210 -1832149 -1502171
33514 -1502171 -1270816 -1437945 -1615117 -1252289 -633725 -500296 -853161 -945212 -466936 -7115
33504 -7115 -136676 -594942 -708399 -283317 254961 470212 368528 223844 161142 76714
33494 76714 -76204 -128254 68025 380042 546459 502632 376559 244818 114785 86150
33484H6150J72525K22695j4458k62379j90258J08823K83992K18182P6187p416
33474F94043k3437K1605Q3427N9134l1335p528J49603J68632q2619k88243j17715
33463F25567K42927L45176J07707j59420k41165j85728p8586K2583k314j84476
33453D92271k91537r4371K64625M50858L90182K44798N7402k11879l72441j58229
33443G71679K73892M10553O7799l30841l27957j0169J82690L2888k66865l90775
33433D12894j91163K03797M92194M41146J10605j88242k09535k5546Q1277l5917
33423A091510k15496k03744Q041J83915J91949J72066K41925K37483n657k60421
33413A441571j52056K39370M04315J07315k94034l80156j94908l6669L021M3142
$$ plain form
33484 86150 258675 481370 466912 204533 14275 123098 407090 625272 701459 694043
33474 694043 670606 692211 775638 834772 803437 795909 945512 1114144 1031525 743282 625567
33463 625567 868494 1213670 1321377 1161957 920792 735064 656478 679061 676747 492271
33453 492271 200734 106363 370988 821846 1212028 1456826 1514228 1302349 929908 771679
33443 771679 1045571 1456124 1523923 1193082 865125 854956 1037646 1070534 803669 412894
33433 412894 221731 425528 917722 1358868 1469473 1281231 1071696 1046150 1127427 1091510
33423 1091510 876014 672270 680311 864226 1056175 1228241 1470166 1707649 1701992 1441571
33413 1441571 1289515 1528885 1933200 2040515 1746481 1366325 1171417 1134748 1137769 1180911
33403A180911J33990J98180J53059l1529k83641l88609j87260J38076K15395j5745
33393A112827k24716j82856k3715Q6537J83702K60333J54468j10454k21683l7453
33383I96990J83064K21020J94290J84722J4416k89556k85498J85395N36281K24759
33373B165883l60379m41885j8018K21398J3959j70117J4455K86399K74504M0441
33363B026640j48027j80982p3069J12061J85329j4359l07058l25873m9859J55354
33353A380157R8852j1838j8222o7390k18665j96206J48068M38554K35463k91249
33343A497524n44520k92787Q3871J67225j490j15016m3277J01780K00996K32985
33333A287291K02816J32982J04030J56767J74838L7176j24431n7308J72177J65821
$$ plain form
33403 1180911 1314901 1513081 1666140 1634611 1350970 962361 775101 913177 1128572 1112827
33393 1112827 888111 705255 681540 768077 951779 1212112 1366580 1256126 1034443 996990
33383 996990 1180054 1401074 1595364 1780086 1794502 1504946 1219448 1404843 1941124 2165883
33373 2165883 1805504 1363619 1345601 1566999 1580958 1410841 1425296 1711695 1986199 2026640
33363 2026640 1878613 1697631 1624562 1736623 1921952 1907593 1600535 1274662 1224803 1380157
33353 1380157 1479009 1467171 1448949 1381559 1162894 966688 1114756 1553310 1788773 1497524
33343 1497524 953004 660217 744088 911313 909823 794807 751530 853310 1054306 1287291
33333 1287291 1490107 1623089 1727119 1883886 2058724 2095900 1971469 1914161 2086338 2252159
33323B252159k12167n26516l50627Q8826K41101M3692o7048Q9742J89804Q372
33313A757338k05470j78232m6304o1987j56624r5144J20465K65619K06112J7311
33303A623084j24329p0405J65023L45703K34377r6892l44597l51166j95065M2895
33293A228628L06226L96525J53016j93647k47621n2598k0274k09338k14161Q7170
33283A233926K56770L7998j76939J1236L69497M44062K17969m6329k67591m45356
33273A635243m16518j11062K14509L32267L44074L46078J73200j88154l58065
33264A971572j43744O0610q2327k43263j2673L13397J98008j97541k65592M0310
33254A638757J81399m2536k36982j27948P3176J29149R4429N2420l9972j37728
$$ plain form
33323 2252159 2039992 1513476 1162849 1251675 1492776 1536468 1469420 1559162 1748966 1757338
33313 1757338 1551868 1373636 1327332 1265345 1108721 1013577 1134042 1399661 1605773 1623084
33303 1623084 1498755 1428350 1593373 1939076 2173453 2076561 1731964 1380798 1185733 1228628
33293 1228628 1534854 1931379 2084395 1890748 1643127 1590529 1570255 1360917 1146756 1233926
33283 1233926 1490696 1528694 1351755 1362991 1732488 2176550 2394519 2348190 2080599 1635243
33273 1635243 1218725 1107663 1322172 1654439 1998513 2344591 2517791 2329637 1971572
33264 1971572 1827828 1888438 1806111 1562848 1550175 1863572 2061580 1864039 1598447 1638757
33254 1638757 1820156 1777620 1540638 1412690 1485866 1615015 1709444 1761864 1721892 1584164
33244A584164r6942M8330J14485R1917J15968J27997o0353l34306k98195J46485
33234A439550N62739M94937K6549l40339k68883O7818K31586O2096j36397m5067
33224B094589J94755K25805O2353J3426P3973o3995l36749k79117J37058L09420
33214B431518j9879k82845m9324K01924q9753n51770m54828J15404M53142L21460
33204B075049J00576M1831O0141J18842K01972P0179l64500o26250k56692L95130
33194A816278O01657K79800o5918k15518l39306l97368j81072J32056J74008N7010
33184A861627J54579L24024J09703l47304m18809k7946K30851R4471m2595M8749
33174A987350O4445j43879k26881K1971K91826L01043J84342R9868l2339j83050
$$ plain form
33244 1584164 1487222 1535552 1650037 1741954 1857922 1985919 1925566 1591260 1293065 1439550
33234 1439550 2002289 2497226 2523775 2183436 1914553 1982371 2213957 2276053 2139656 2094589
33224 2094589 2289344 2515149 2577502 2590928 2664901 2600906 2264157 1985040 2122098 2431518
33214 2431518 2411639 2128794 2079470 2281394 2191641 1639871 1185043 1300447 1753589 2075049
33204 2075049 2175625 2217456 2277597 2396439 2598411 2668590 2304090 1677840 1421148 1816278
33194 1816278 2417935 2697735 2631817 2416299 2076993 1679625 1498553 1630609 1804617 1861627
33184 1861627 2016206 2340230 2449933 2102629 1683820 1655874 1886725 1981196 1938601 1987350
33174 1987350 2051795 1907916 1681035 1703006 1994832 2295875 2480217 2580085 2547746 2364696
33164B364696j15850J42470K16578j9688k20133j37111L6722R0382J13741J91451
33154B663258J92562O6068k8964n1855j66297l58355l57171r1518J48519J67740
33144B183987J32216K12054K78968J48576j12367k75885k06467K5331J78425O0781
33134B625619j76935j59265J49020L02633M3398k76168k80793j46737j37983m9108
33124A893681L01605M99708J72263k36075j33302J83096P6883k19021j9084M59000
33114B978754L60372k70835m76027m203K92397m1059l48522q5520L00351K47957
33104B953665m3490j54318j06593j7475K16050M80610L75346o6262k76161q4243
33094C277129N103k14174k45642J22153K89888j33869n71324l71032J91351M45242
$$ plain form
33164 2364696 2248846 2391316 2607894 2588206 2368073 2230962 2267684 2358066 2471807 2663258
33154 2663258 2855820 2921888 2892924 2841069 2674772 2316417 1959246 1867728 2016247 2183987
33144 2183987 2316203 2528257 2807225 2955801 2843434 2567549 2361082 2386413 2564838 2625619
33134 2625619 2448684 2289419 2438439 2741072 2784470 2508302 2227509 2080772 1942789 1893681
33124 1893681 2195286 2694994 2867257 2631182 2497880 2680976 2757859 2538838 2519754 2978754
33114 2978754 3339126 3068291 2592264 2588061 2880458 2839399 2490877 2405357 2705708 2953665
33104 2953665 2910175 2755857 2649264 2631789 2847839 3328449 3703795 3637533 3361372 3277129
33094 3277129 3282232 3068058 2822416 2944569 3234457 3100588 2529264 2158232 2349583 2794825
33084B794825L02743J06007j4559p9457Q970K00630J77499j19160l00670j88407
33074B888421j06402j93785p8342L49529N24174R8393l81979k98469R5216J75903
33064C072659o9172j95722p0450Q7636J48225R7129q6977k37772m9942L80806
33054C076420N24907K20895l7447N6544J31639r3552k44620l3244J22506j23185
33044C600863k97762P6467M97911K21571m43699n54357k0273L09529K5929k94469
33034C121710j06380L03788L74537R5422j14765n9747O2991M8625l0608k457Q7115
33023C780231K8227j67141j92427P3274K88071J48664j04699r7758L3569n1748
33013C738263j91479Q608L54730K89116j19355k31313P5432K27349o010j63726
$$ plain form
33084 2794825 3097568 3203575 3189016 3109559 3118529 3319159 3496658 3377498 3076828 2888421
33074 2888421 2782019 2588234 2509892 2859421 3383595 3481988 3100009 2801540 2896756 3072659
33064 3072659 3003487 2807765 2737315 2824951 2973176 3070305 2983328 2745556 2695614 3076420
33054 3076420 3601327 3822222 3784775 3841319 3972958 3879406 3634786 3601542 3724048 3600863
33044 3600863 3303101 3379568 3877479 4099050 3655351 3100994 3080721 3390250 3416179 3121710
33034 3121710 3015330 3319118 3693655 3789077 3674312 3614565 3677556 3726181 3695573 3693116 3780231
33023 3780231 3808458 3641317 3448890 3522164 3810235 3958899 3854200 3756442 3790011 3738263
33013 3738263 3546784 3555392 3910122 4199238 4079883 3848570 3924002 4151351 4145341 3981615
33003C981615m868R2080n7768o7508K15483L13195m6489m06199l19856J8822K54841
32992C973348L50448K83093n3992l67838j30564M76942O02325L8899l79154j18341
32982D675166K46068J07828j90424j19224J08960R1199M874J14012J43384j60597
32972E021246m24183k57538O8449J51746J16629J80521J38297j49473l11696p0882
32962D463116K32653K20022M3485n3031j52049k48870p9992K58692K55207r0645
32952D848588j15020L41319N52469J67889j64857j3960O6681l17838n58467j65104
32942D641700K83993K02939K1389K14052L03672j32604m28791M8152O22703L82085
32932F159290k55662l13182Q8940J51408r6180k8584K64802J86938j54394j39938
$$ plain form
33003 3981615 3976747 4068827 4011059 3943551 4159034 4472229 4425740 4019541 3699685 3718507 3973348
32992 3973348 4323796 4606889 4552897 4185059 4054495 4531437 5133762 5172661 4793507 4675166
32982 4675166 4921234 5029062 4838638 4719414 4828374 4919573 4924447 5038459 5181843 5021246
32972 5021246 4597063 4339525 4407974 4559720 4676349 4856870 4995167 4845694 4533998 4463116
32962 4463116 4695769 4915791 4959276 4906245 4754196 4505326 4425334 4684026 4939233 4848588
32952 4848588 4733568 5074887 5627356 5795245 5630388 5616428 5683109 5365271 4806804 4641700
32942 4641700 4925693 5128632 5150021 5364073 5667745 5535141 5106350 5154502 5777205 6159290
32932 6159290 5903628 5590446 5679386 5830794 5734614 5706030 5970832 6157770 6003376 5863438
32922E863438J77281J84659j57532k93090n4610J91087K45213J96147M1338j81238
32912F212693j84924Q3466J78918r1955k26439R1219L48727J25097r0800K05816
32902F651818N53725L24306j60683k26077L4255J25185R0100K27087L78138K80922
32892H278776J26356J08213K311k36570j85862J84188K25665k29536m08365P1341
32882G936517M80759K87565L3175J53685J59087j88895j89451M03853O62728J20231
32872I859254k91345N6047L60841M3096j10755L70684N61845K6412j06112N96470
32862A1366437O00861q34216j780128o59548R12105P55218l11806k48703N79493
32853A0379713M94927j84278L5064P95921O57248m1269N3127N53863J79956n18819
$$ plain form
32922 5863438 6040719 6225378 6067846 5774756 5720146 5911233 6156446 6352593 6393931 6212693
32912 6212693 6027769 6111235 6290153 6198198 5971759 6062978 6411705 6536802 6446002 6651818
32902 6651818 7205543 7529849 7369166 7143089 7177344 7302529 7392629 7619716 7997854 8278776
32892 8278776 8405132 8513345 8515656 8279086 8093224 8277412 8503077 8273541 7865176 7936517
32882 7936517 8417276 8704841 8738016 8891701 9050788 8861893 8672442 9076295 9739023 9859254
32872 9859254 9567909 9623956 9984797 10027893 9917138 10287822 10849667 10876079 10769967 11366437
32862 11366437 11967298 11133082 9352954 8693406 9605511 10360729 10048923 9800220 10379713
32853 10379713 10874640 10690362 10725426 11521347 12178595 12137326 12190453 12744316 12924272 12405453
32843A2405453j38886P22412M91123l22670n5433Q88373P81652j48919k55377
32834A4367728L58757K75719k50285J32841R28784O01370k86150O78R37430O42388
32824A7709260m04600j28614J150322J200089Q080l06245N28757P68809K47022
32815B0772880M08364J022255O40322n9955O47819J649425M94729j705788j576649
32806B2293402O55013J550174N54492M46005J628680J533623J22069K86611K077743
32797C1147812K303353P05935N88269K346153K617667R89991R79617K999715L309420
32788D7987932J541039J821654M504565M870725K444285K745505O649467P760106
32780H0325278M652835N003000J1457350J4982971J1193788J1544933K4703424
$$ plain form
32843 12405453 12266567 12988979 13480102 13157432 13101999 13990372 14772024 14623105 14367728
32834 14367728 14726485 15002204 14751919 14884760 15813544 16414914 16128764 16129442 17066872 17709260
32824 17709260 17304660 17176046 18326368 19526457 19534537 19228292 19757049 20525858 20772880
32815 20772880 21181244 22203499 22843821 22783866 23431685 25081110 25575839 23870051 22293402
32806 22293402 22948415 24498589 25053081 25499086 27127766 28661389 28783458 29070069 31147812
32797 31147812 33451165 34157100 34745369 37091522 39709189 40699180 41678797 44678512 47987932
32788 47987932 49528971 51350625 55855190 60725915 63170200 65915705 72565172 80325278
32780 80325278 84978113 89981113 101438463 116421434 127615222 139160155 163863579
32773A63863579L4981222J5828687l6324573r3689248j22229193j07120415n8104421
32766b02794362k081671L1592960L2010409J5733585P102336J0848856J3492812
32759i4095075Q182415L245816N012748P527221M967966J746754L007232N142556
32751e5262367L421627Q55050J861445L892939K740388M70994J010574K686088
32743c8323262J929630K15608Q34323K381720J658652q1876L08076J820722J446455
32734b7809952k5110K23956J544874J288598o381J56213J317231J078486k36616
32725b2468701l59463N91442O94335J03144M09843J130122O26691m01662m9707
32716a9723956J069969Q64033k97795k85159Q15054R81405N0170k05365M92947
$$ plain form
32773 163863579 198844801 214673488 178348915 84659667 -37569526 -144689941 -202794362
32766 -202794362 -204876033 -173283073 -141272664 -125539079 -118436743 -107587887 -94095075
32759 -94095075 -85912660 -82666844 -77654096 -70126875 -65158909 -63412155 -60404923 -55262367
32751 -55262367 -51840740 -50985690 -49124245 -45231306 -42490918 -42019924 -41009350 -38323262
32743 -38323262 -36393632 -36178024 -35343701 -32961981 -31303329 -31385205 -31077129 -29256407 -27809952
32734 -27809952 -27835062 -27611106 -26066232 -24777634 -24784015 -24627802 -23310571 -22232085 -22468701
32725 -22468701 -22828164 -22236722 -21542387 -21439243 -21029400 -19899278 -19272587 -19674249 -19723956
32716 -19723956 -18653987 -17789954 -18087749 -18372908 -17557854 -16576449 -16526279 -16731644 -16238697
32707a6238697O52508J7791j50237K97418K76534j51048Q6746P36229N72461j22643
32697a4022938M1945Q90747R07458P178l62122J51939M11583M0604j26666J16870
32687a1943402J13043p5282K16408O47502L02432m23968l01264N26976P41752
32678a0195803J36404k11230K3257Q1848j90428j36505K27460K12908q1740O9769
32668a0064060N00606L91011j16058j49592K10290J20131l28334k52160L08474
32659i379692M54040J02886J6602K60151J98477r9200J197L16567J52881k15908
32649h191999K2484N39471L14803m11758m18601L27731N80314l4459n13398k98402
32639h083814M3802J66527L97941O41329L34378k78401k88117K78989M39986j1694
$$ plain form
32707 -16238697 -15586189 -15568398 -15718635 -15421217 -15144683 -15295731 -15208985 -14472756 -13900295 -14022938
32697 -14022938 -13980993 -13090246 -12182788 -12175610 -12537732 -12385793 -11974210 -11933606 -12060272 -11943402
32687 -11943402 -11830359 -11905641 -11689233 -11041731 -10739299 -11163267 -11464531 -10937555 -10195803
32678 -10195803 -10059399 -10270629 -10247372 -10165524 -10355952 -10492457 -10264997 -10052089 -10133829 -10064060
32668 -10064060 -9563454 -9172443 -9288501 -9438093 -9227803 -9107672 -9436006 -9688166 -9379692
32659 -9379692 -8925652 -8822766 -8806164 -8546013 -8347536 -8446736 -8445539 -8128972 -7976091 -8191999
32649 -8191999 -8169515 -7630044 -7315241 -7726999 -8145600 -7817869 -7237555 -7272014 -7785412 -8083814
32639 -8083814 -8040012 -7873485 -7475544 -6834215 -6499837 -6778238 -7066355 -6787366 -6347380 -6359074
32629f359074k17430J15914K72439l1904j91308J6238N3134j96599j73294J77441
32619f534443K45772p965N3065M26894L79667j27032k75319R7198J99686k03685
32609e746162l69142j3328J90624k5943k2286M01726M68806j62059o56877l48525
32599f283166K41771L74145J42719l9835j60061k63712j58594J01284J44951k56
32589e900754J19382M79264M93776O0168k14076p2907K2102j40157j26553K32775
32579e046980M42384K16868n5161n4348K3039K5706R9795J75702k8166l35447
32569d536608k48468J35557K05846p3293r1397K67705L97315O1103k53542k68055
32559d403837k45291k32201L5774L30197R0723m48550m22351J81026M08456j6384
$$ plain form
32629 -6359074 -6576504 -6460590 -6188151 -6220055 -6411363 -6395125 -6341991 -6538590 -6711884 -6534443
32619 -6534443 -6288671 -6296636 -6243571 -5816677 -5437010 -5564042 -5839361 -5742163 -5542477 -5746162
32609 -5746162 -6115304 -6128632 -5938008 -5963951 -5986237 -5584511 -5115705 -5277764 -5934641 -6283166
32599 -6283166 -6041395 -5667250 -5524531 -5564366 -5724427 -5988139 -6146733 -6045449 -5900498 -5900754
32589 -5900754 -5781372 -5302108 -4808332 -4748164 -4962240 -5035147 -5013045 -5153202 -5279755 -5046980
32579 -5046980 -4604596 -4387728 -4442889 -4497237 -4474198 -4448492 -4348697 -4172995 -4201161 -4536608
32569 -4536608 -4785076 -4649519 -4443673 -4516966 -4608363 -4340658 -3943343 -3882240 -4135782 -4403837
32559 -4403837 -4649128 -4881329 -4845555 -4515358 -4424635 -4873185 -5295536 -5114510 -4706054 -4722438
32549d722438k33071J71155M43961J07613j66621J50664M58092J54538k81786
32540c917893k19251L4970n1736k36702q4359J54175P6224q3925J8452J11563
32530d198482j38120l87766j74201K63516L97526K19860L5710j15297k64124j79525
32520d540903K10853M72217K51632j62035l05243j64293M8770K85357M50751K99609
32510c153285q0458j91489J05060K95930O7439j61489K602K52369J73775n0476
32500b740022p1141L046n5925r9428M2869J48089J5519j28342o8328O548n3557
32489c000672k9446J44298Q7410l29993n78201k82457J23078J35520J2540K00132
32479c517791M53372K83943j19868k02498J8539Q1203n8026l5999J50606J06436
$$ plain form
32549 -4722438 -4955509 -4784354 -4340393 -4232780 -4399401 -4248737 -3790645 -3636107 -3917893
32540 -3917893 -4137144 -4102174 -4153910 -4390612 -4474971 -4320796 -4244572 -4328497 -4310045 -4198482
32530 -4198482 -4336602 -4724368 -4898569 -4635053 -4237527 -4017667 -3981957 -4097254 -4361378 -4540903
32520 -4540903 -4330050 -3857833 -3606201 -3768236 -4073479 -4237772 -4189002 -3903645 -3452894 -3153285
32510 -3153285 -3233743 -3425232 -3320172 -3024242 -2956803 -3118292 -3115690 -2863321 -2689546 -2740022
32500 -2740022 -2811163 -2808117 -2864042 -2963470 -2920601 -2772512 -2756993 -2885335 -2953663 -2947115 -3000672
32489 -3000672 -3030118 -2885820 -2798410 -3128403 -3706604 -3989061 -3865983 -3730463 -3717923 -3517791
32479 -3517791 -3064419 -2780476 -2900344 -3102842 -3084303 -3003100 -3061126 -3097125 -2946519 -2840083
32469b840083k24967m12313k21346O2125J29682O4061Q4674J69809J34280m5131
32459c099209j54304k8764J58889O8104k83059m11876l5016M26945M18172R0478
32449b849640K0465K35383K07931j82621m16674k03811J00711J64308J24788J29340
32439b669820L9504j41421j34152O6059Q8673j24747j59273R3955J80679p6199
32429b836742j91105J20906L86924J70977k03249k47599n8398N1212J25983K48803
32419b432288J73823j69457l02351R9384N75305N20284M7224l27487m52492m57263
32409b725318l07063o644J16721j11424k90867k8836L94606M69252K25365K5089
32399b239119q9410k77492m09313k53690N1012J99040J87280J69158R3938j00734
$$ plain form
32469 -2840083 -3065050 -3477363 -3698709 -3636584 -3506902 -3442841 -3358167 -3188358 -3054078 -3099209
32459 -3099209 -3253513 -3282277 -3123388 -3055284 -3338343 -3750219 -3785235 -3358290 -2940118 -2849640
32449 -2849640 -2829175 -2593792 -2385861 -2568482 -2985156 -3188967 -3088256 -2923948 -2799160 -2669820
32439 -2669820 -2630316 -2771737 -2905889 -2839830 -2751157 -2875904 -3035177 -2941222 -2760543 -2836742
32429 -2836742 -3027847 -2906941 -2520017 -2349040 -2552289 -2799888 -2858286 -2807074 -2681091 -2432288
32419 -2432288 -2258465 -2427922 -2730273 -2630889 -2055584 -1535300 -1488076 -1815563 -2268055 -2725318
32409 -2725318 -3032381 -3039025 -2922304 -3033728 -3324595 -3353431 -2958825 -2489573 -2264208 -2239119
32399 -2239119 -2328529 -2606021 -3015334 -3269024 -3218012 -3018972 -2831692 -2662534 -2568596 -2669330
32389b669330k13280r3809N6061O4111J14116L12741L46133J0661l36151l33114
32379b741861j90748k02358j53680J81557M21216J52907k56462j88875J93545
32370b784759K39769q5781k09304M0871K22588R6621n8381l5563J4760P159Q9818
32359b462202K53268K28157o9940l43788l00071J345K48667J87684j26020l02416
32349b685316l1734M02057L77655j42145m40809j03987L16068J77438k51264l15657
32339b697694m1924Q8561Q1526K87041N19097K32805m32965o68452j98758K99232
32329b531531K38155r5611j45281O9612J35317o2364k33341j47387P4803J45621
32319b552007j4466j49523q27K76085K79701r886j46879P1822K60281J07802q1921
$$ plain form
32389 -2669330 -2882610 -2976419 -2920358 -2856247 -2742131 -2429390 -2083257 -2072596 -2408747 -2741861
32379 -2741861 -2932609 -3134967 -3288647 -3107090 -2685874 -2532967 -2789429 -2978304 -2784759
32370 -2784759 -2544990 -2630771 -2840075 -2799204 -2576616 -2479995 -2538376 -2573939 -2559179 -2552020 -2462202
32359 -2462202 -2208934 -1980777 -2050717 -2394505 -2694576 -2693231 -2444564 -2256880 -2382900 -2685316
32349 -2685316 -2717050 -2314993 -1937338 -2079483 -2520292 -2624279 -2308211 -2130773 -2382037 -2697694
32339 -2697694 -2739618 -2651057 -2569531 -2282490 -1763393 -1530588 -1963553 -2632005 -2830763 -2531531
32329 -2531531 -2293376 -2388987 -2534268 -2464656 -2329339 -2391703 -2625044 -2772431 -2697628 -2552007
32319 -2552007 -2566473 -2715996 -2716823 -2440738 -2161037 -2170923 -2317802 -2245980 -1985699 -1877897 -1959818
32308a959818L7328J88933l5935l83599l11648Q5669K32515J0423j58470r8613
32298b393215o0155j14725m6216J05079M6361j26912M4480N47830P31035K47289
32288a019149l91626n45910k73118n3204m7893l4151J29502L15559L37160J48344
32278a434486j18814k43855j31371N5590R8965K1770J560M8088J3510r8171j00403
32267a887617O8232K40874K67016J63577N621j43092j84768o2555J04350J19426
32257a308936n5522k85686m37588m42375k66161K8897K59220K91091J78550N2195
32247a986315j8697p04R3560J22918k5269j63288q087K93289K69967j22790l65154
32236a910570j89188L1471O853J5493K28627K16530k51844n45848j04958M95653
$$ plain form
32308 -1959818 -1922490 -1733557 -1769492 -2153091 -2464739 -2379070 -2146555 -2136132 -2294602 -2393215
32298 -2393215 -2453370 -2568095 -2614311 -2509232 -2462871 -2589783 -2545303 -1997473 -1266438 -1019149
32288 -1019149 -1410775 -1956685 -2229803 -2283007 -2330900 -2365051 -2235549 -1919990 -1582830 -1434486
32278 -1434486 -1553300 -1797155 -1928526 -1872936 -1773971 -1752201 -1750641 -1702553 -1689043 -1787214 -1887617
32267 -1887617 -1819385 -1578511 -1311495 -1147918 -1142297 -1285389 -1470157 -1532712 -1428362 -1308936
32257 -1308936 -1364458 -1650144 -2087732 -2530107 -2796268 -2767371 -2508151 -2217060 -2038510 -1986315
32247 -1986315 -2005012 -2005716 -1912156 -1789238 -1814507 -1977795 -1985882 -1692593 -1422626 -1545416 -1910570
32236 -1910570 -2099758 -2068287 -2061434 -2045941 -1817314 -1600784 -1852628 -2398476 -2503434 -2007781
32226b007781L52013k81612l68837K32109N73208J50232m06132m17931n4978J91954
32216b037755K05443O6665k00647l97191j99152K83446N00975K47139n6054o5939
32206a653070K4035j8292m6741P2905J32123k9269k01244j69788m2740L7586J32220
32195a762275K25261J05326k18067l70202j53793J33730J91002J45684K07214
32186a496120K51695Q8223j56420k39096j48581L51J72415K95718K20378J688
32176a009749p8456K9870K1381k07042k96081l1500K20196R6896j36861o1394
32166a452740J40856J0264l24447k89637J61859L99851Q4304l07023k11165K13249
32156a574629L93379J59488j58110k97212l12912k68049o4576K73190M44463K46008
$$ plain form
32226 -2007781 -1655768 -1937380 -2306217 -2074108 -1500900 -1350668 -1756800 -2174731 -2229709 -2037755
32216 -2037755 -1832312 -1765647 -1966294 -2363485 -2562637 -2279191 -1778216 -1531077 -1587131 -1653070
32206 -1653070 -1629035 -1647327 -1694068 -1621163 -1489040 -1518309 -1719553 -1889341 -1932081 -1894495 -1762275
32195 -1762275 -1537014 -1431688 -1649755 -2019957 -2173750 -2040020 -1849018 -1703334 -1496120
32186 -1496120 -1244425 -1156202 -1312622 -1551718 -1700299 -1699948 -1527533 -1231815 -1011437 -1009749
32176 -1009749 -1088205 -1058335 -1036954 -1243996 -1540077 -1571577 -1351381 -1254485 -1391346 -1452740
32166 -1452740 -1311884 -1301620 -1626067 -1915704 -1753845 -1353994 -1269690 -1576713 -1787878 -1574629
32156 -1574629 -1181250 -1021762 -1179872 -1477084 -1789996 -2058045 -2122621 -1849431 -1404968 -1158960
32146a158960p7555j38636L2100M9803k02686l74342j94122J08716J66493J373
32136a787816r1499p10J61936L25486M37046L00749j78251o38347n61989P509
32126b025886M22844K45209k13588l56269o3243K59263K65717M6692r7794p0877
32116a587932l0437q1762j05033N756R8204j951j13475Q2820M50624M62396r838
32105h30628m27160l56903o2927K1888k9623N1624J46090K8897q1849J18371L59984
32094a062236J70030k58318k87836J23359L34993M1668l13802k99759n3838J16362
32084a489377J56511R8823n1376j18171Q6586L20876J58139k53546l07085O3161
32074a335459K18954r9120l06076q154K61843l6094m47848k32915L76932N02103
$$ plain form
32146 -1158960 -1236515 -1375151 -1343051 -1293248 -1495934 -1870276 -2064398 -1955682 -1789189 -1787816
32136 -1787816 -1879315 -1880025 -1718089 -1392603 -955557 -654808 -833059 -1471406 -2033395 -2025886
32126 -2025886 -1603042 -1357833 -1571421 -1927690 -1990933 -1731670 -1465953 -1419261 -1517055 -1587932
32116 -1587932 -1618369 -1700131 -1805164 -1799408 -1701204 -1703155 -1816630 -1733810 -1283186 -820790 -830628
32105 -830628 -1257788 -1614691 -1677618 -1655730 -1685353 -1633729 -1487639 -1458742 -1540591 -1422220 -1062236
32094 -1062236 -892206 -1150524 -1438360 -1315001 -980008 -938340 -1252142 -1551901 -1605739 -1489377
32084 -1489377 -1332866 -1234043 -1285419 -1403590 -1317004 -996128 -837989 -1091535 -1398620 -1335459
32074 -1335459 -1116505 -1215625 -1521701 -1529855 -1268012 -1304106 -1751954 -1984869 -1607937 -1105834
32064a105834o606l71278r9913L47272L27096r8414l65813j92646J47377K30968
32054a187791j7707k63240j74283J48617K96176J08853j20291j07649K1610J0467
32044a285238q7780m2535J29136J90248O9905o9480j26047j51849j47375k1128
32034a542143J89187K78205J53521j7255n5665k7990r7476k14300j64799N8051
32024a440664J59043m7598l14316k87493m0510N0474p0166n9910J74743K29715
32014a646682j13179l96929j35390L83637M91767J33461j24320O660K15838K00371
32004i84766M3525j05298k37815k66963o1824J92864J38620j48026j93025Q3572
31994a539136J69699j91032n00358k38622L44009O10446L92912M0969j51497j67917
$$ plain form
32064 -1105834 -1112440 -1483718 -1583631 -1236359 -909263 -1007677 -1373490 -1566136 -1418759 -1187791
32054 -1187791 -1205498 -1468738 -1643021 -1494404 -1198228 -1089375 -1209666 -1317315 -1295705 -1285238
32044 -1285238 -1373018 -1415553 -1286417 -1096169 -1026264 -1095744 -1221791 -1373640 -1521015 -1542143
32034 -1542143 -1352956 -1074751 -921230 -938485 -994150 -1022140 -1119616 -1333916 -1498715 -1440664
32024 -1440664 -1281621 -1329219 -1643535 -1931028 -1971538 -1921064 -1991230 -2051140 -1876397 -1646682
32014 -1646682 -1759861 -2156790 -2292180 -1908543 -1416776 -1283315 -1407635 -1400975 -1185137 -984766
32004 -984766 -941241 -1046539 -1284354 -1551317 -1613141 -1420277 -1281657 -1429683 -1622708 -1539136
31994 -1539136 -1369437 -1560469 -2060827 -2299449 -1955440 -1344994 -952082 -911113 -1062610 -1230527
31984a230527p5599M6124Q2933L1485M8679J85830K61590J63082L3422k1633j26478
31973f01092l08964l03227P829K53126P0169k90917l01281N6721K97743J81527
31963i38366p979L077P6073k5754k11424j97095O0263K76925J90241j25312l38025
31952a237376k21801J07660L29921K49520m4770l01357l30704j52236L1267N6197
31942a513679J0027R3458K50554J83156j43368l24785j16694J07047q7857m35683
31932a977824l21096K34872N61281L39400M345r955J44470J57114P0959L5057
31922g61377n0653k78983m27739k63333O4986K42279K25787J97467K25944K21963
31912f03659J33522n313j51068k57438k78507k24733j34325j335J47867J80776
$$ plain form
31984 -1230527 -1306126 -1260002 -1177069 -1145584 -1096905 -911075 -649485 -486403 -452981 -474614 -601092
31973 -601092 -910056 -1213283 -1205454 -952328 -882159 -1173076 -1474357 -1417636 -1119893 -938366
31963 -938366 -946345 -943268 -867195 -892949 -1104373 -1301468 -1241205 -964280 -774039 -899351 -1237376
31952 -1237376 -1459177 -1351517 -1021596 -772076 -816846 -1118203 -1448907 -1601143 -1569876 -1513679
31942 -1513679 -1503652 -1410194 -1159640 -976484 -1119852 -1444637 -1561331 -1454284 -1542141 -1977824
31932 -1977824 -2298920 -2064048 -1502767 -1163367 -1159022 -1168977 -1024507 -867393 -796434 -761377
31922 -761377 -812030 -1091013 -1518752 -1782085 -1717099 -1474820 -1249033 -1051566 -825622 -603659
31912 -603659 -470137 -475450 -626518 -883956 -1162463 -1387196 -1521521 -1522856 -1374989 -1194213
31902a194213M6010p0321j4003N2824n1532j21570J15999M21225L13478j39831
31892f41934l86785k40848n5429o886J25710L35141K43940j70523l81794j53769
31882a333177P2046j8319p7379J79483L45638L921m67852m22218O1746L26630
31872a329481Q7786k88439l57206n8611L17569L97729Q5279k38275j31386K40194
31862a274841K77969j17487l46652n1464L44029L52004R9170r0758k30317l67257
31852a405604k97912k2847N1100j89722k39575J69856N08406L16144L507J04983
31842a001664L28878J33589k59459k73454J0966R8525j873N6727J64315k2953
31832g66403k95458j75065J84536K14134p9829j57108R3802K19751J8274k18634
$$ plain form
31902 -1194213 -1148203 -1218524 -1232527 -1179703 -1231235 -1352805 -1236806 -815581 -502103 -641934
31892 -641934 -1028719 -1269567 -1324996 -1331882 -1206172 -871031 -627091 -797614 -1179408 -1333177
31882 -1333177 -1261131 -1279450 -1356829 -1177346 -831708 -827787 -1295639 -1717857 -1656111 -1329481
31872 -1329481 -1241695 -1530134 -1887340 -1945951 -1628382 -1230653 -1145374 -1383649 -1515035 -1274841
31862 -1274841 -996872 -1114359 -1461011 -1512475 -1168446 -816442 -717272 -808030 -1038347 -1405604
31852 -1405604 -1703516 -1726363 -1675263 -1864985 -2104560 -1934704 -1426298 -1110154 -1106647 -1001664
31842 -1001664 -672786 -539197 -798656 -1072110 -1061144 -962619 -964492 -907765 -743450 -766403
31832 -766403 -1061861 -1236926 -1052390 -838256 -918085 -1075193 -981391 -761640 -743366 -962000
31822i62000k77471k21298o5280J74066K32336l1101k26443p614K45577L7239
31812a101989k89383p8692M37401M63988j454k01007M5769J29122j50777k60031
31802a007053n819J03705j38356k45760J5528K03981Q2731L8223K33779K21644
31792d97397j58467l47520l8646K31675K6166k25294l1151K80385J79071j45239
31782g26417j85038K2813J08915N7957N6419J460k33897l56510p0533L22018L16134
31771f86679j3897j82923p2142J4202l4888J324J97397L16857K03380J3424l7973
31760b81918L6814M6555j23480l33343l06295j1731J76122o3848m75241n09425
31750a845790j00794K69392L11077K37533K29636J24870j20608j69641J44439
$$ plain form
31822 -962000 -1239471 -1460769 -1526049 -1351983 -1119647 -1150748 -1377191 -1384805 -1139228 -1101989
31812 -1101989 -1391372 -1470064 -1032663 -568675 -570129 -771136 -725367 -596245 -747022 -1007053
31802 -1007053 -1012872 -909167 -1047523 -1293283 -1277755 -1073774 -991043 -952820 -719041 -497397
31792 -497397 -655864 -1003384 -1042030 -810355 -784189 -1009483 -1040634 -760249 -581178 -726417
31782 -726417 -911455 -888642 -779727 -721770 -665351 -663891 -897788 -1254298 -1324831 -1002813 -686679
31771 -686679 -700576 -883499 -955641 -941439 -976327 -975003 -777606 -460749 -257369 -243945 -281918
31760 -281918 -245104 -198549 -322029 -655372 -961667 -973398 -797276 -861124 -1336365 -1845790
31750 -1845790 -1946584 -1677192 -1366115 -1128582 -898946 -774076 -894684 -1064325 -919886
31741i19886M21521K51645j48960k65222j9612K04774J41106q6905k03674p2414
31731f97627K05387L63666K25643p1300k31633j72609n7018m066j1959j01516
31721e53032k39877k09870Q6545L05032Q1771l24295l42404K5665K38081J09519
31711h22865j196N0365j8593k26748j74117J84743L40895R0083j24604l9355O421
31700g34971j62697j50090J89341L00820j19733m67605j89963K73528K53963m8446
31690h55853l9708K03936K00598m387j8959Q3743m6647k75164j98568O2246N4164
31679h34599j67442j39421J60166K84853J02991o1689o6783j12953k54051k96269
31669a385197k01536j17377m3214R5036J51991J564j00260J06087L44439K10442
$$ plain form
31741 -919886 -498365 -246720 -395680 -660902 -680514 -475740 -334634 -421539 -625213 -697627
31731 -697627 -492240 -128574 97069 25769 -205864 -378473 -435491 -439557 -451516 -553032
31721 -553032 -792909 -1002779 -916234 -611202 -529431 -853726 -1196130 -1170465 -932384 -822865
31711 -822865 -824061 -773696 -792289 -1019037 -1193154 -1008411 -667516 -577433 -702037 -741392 -734971
31700 -734971 -897668 -1047758 -858417 -557597 -677330 -1144935 -1334898 -1061370 -807407 -855853
31690 -855853 -895561 -691625 -491027 -495414 -514373 -430630 -477277 -752441 -951009 -888763 -834599
31679 -834599 -1002041 -1141462 -981296 -696443 -593452 -655141 -721924 -834877 -1088928 -1385197
31669 -1385197 -1586733 -1704110 -1747324 -1652288 -1500297 -1498733 -1598993 -1492906 -1148467 -938025
31659i38025r0219o3582J86827J34161j99596k41850J14835K85529k9517l47966
31649a189403j81631K59329M65456L07623L0228j22954o7848R6730J27175q4108
31639c59403k86450k00357K3892K9337j72416k63233j59926m2117P1049K79507
31629a080117M10130J96095j85600k87655p9917P1523O9470J42638K66015J69626
31619c07792n2814k0990J86644Q5279l01696l55277Q8728L88941J42630j74297
31609c20644o8016J66194O2016j81359j24479R3713K7075k76335l61298q9917
31599a073050K35758L64619K93784Q6960j47376k11002n2142Q7045J3057j18928
31589e21275j02663l6083p3110p0543J48145L84630L26695P0662k7208P0569O2761
$$ plain form
31659 -938025 -1028244 -1091826 -904999 -770838 -970434 -1212284 -1097449 -811920 -841437 -1189403
31649 -1189403 -1371034 -1111705 -646249 -338626 -308398 -431352 -499200 -402470 -275295 -359403
31639 -359403 -645853 -846210 -822318 -792981 -965397 -1228630 -1388556 -1430673 -1359624 -1080117
31629 -1080117 -669987 -473892 -659492 -947147 -1027064 -955541 -886071 -743433 -477418 -307792
31619 -307792 -360606 -381596 -194952 -109673 -411369 -766646 -677918 -288977 -146347 -320644
31609 -320644 -388660 -222466 -160450 -341809 -466288 -372575 -345500 -621835 -983133 -1073050
31599 -1073050 -837292 -472673 -178889 -91929 -239305 -450307 -502449 -415404 -402347 -521275
31589 -521275 -623938 -660021 -733131 -803674 -655529 -270899 55796 126458 99250 169819 232580
31578B32580j57664l42055l08106j90193j64332j82050j13702J7692Q5981N5643
31568a066206J0522J4398L3154L0901P5761K30970L48815J73990k43225m67502
31558h58422k36813J12162J02759j73168k30630K5926J95093O3390j11140r7452
31548a208295O788J03968K52461L43307J23152k66255l05922Q4792L11451K9034
31538e25519k76956j08820J95483O1729l09668k74518J67315L77381R8775k28679
31528h23477k26217m2507O7868J20988J78582J52087K3194m4166K6978Q3284j0523
31517d93909j71101k27335j03255J48910L55370L01673j8179k96393k52722l825
31507g60766J25939O3104j4457n1134j65329l38931l64698j56796J22341K87686
$$ plain form
31578 232580 74916 -267139 -575245 -765438 -929770 -1111820 -1225522 -1207830 -1121849 -1066206
31568 -1066206 -1055684 -1041286 -1008132 -977231 -901470 -670500 -321685 -147695 -390920 -858422
31558 -858422 -1095235 -983073 -880314 -1053482 -1284112 -1258186 -1063093 -999703 -1110843 -1208295
31548 -1208295 -1201507 -1097539 -845078 -501771 -378619 -644874 -950796 -866004 -554553 -525519
31538 -525519 -802475 -911295 -715812 -654083 -963751 -1238269 -1070954 -693573 -594798 -823477
31528 -823477 -1049694 -1092201 -1024333 -903345 -724763 -572676 -549482 -593648 -566670 -483386 -493909
31517 -493909 -665010 -892345 -995600 -846690 -491320 -189647 -207826 -504219 -756941 -760766
31507 -760766 -634827 -571723 -586180 -637314 -802643 -1141574 -1506272 -1663068 -1540727 -1253041
31497a253041K95425J80671J7904p0271l3126K3766K1628N5063J65993J54258
31487d41730r7641k90785q9670K82003K79260j52796m72152l14100O6071K59813
31477i71727K15603R1643n7609k10788k48497j19231L7123R4246J04835J38196
31467i26206J32639M0352m4658l2980J9718K5595N108L3253J31794K48511K74658
31456i2216J29277p7184q8508J19093J83902j37426m97887l92037O7558K90124
31446d95304P6605j80802j97248j25519p4246J17150M11656M47622J50793o7075
31436F3632j5737n0724l22625l43696J53852N32291J47299n33491n51580R1701
31426h29078M87991K06999k46877l96764l68982l24533q8884L25511M65515J05027
$$ plain form
31497 -1253041 -957616 -776945 -759041 -829312 -862438 -838672 -817044 -761981 -595988 -441730
31487 -441730 -539371 -830156 -919826 -637823 -358563 -511359 -983511 -1297611 -1231540 -971727
31477 -971727 -756124 -664481 -722090 -932878 -1181375 -1300606 -1263483 -1169237 -1064402 -926206
31467 -926206 -793567 -753215 -797873 -830853 -811135 -785540 -780432 -747179 -615385 -366874 -92216
31456 -92216 37061 -40123 -128631 -9538 174364 36938 -460949 -852986 -785428 -495304
31446 -495304 -418699 -599501 -796749 -922268 -996514 -879364 -467708 -20086 130707 63632
31436 63632 47895 -2829 -325454 -669150 -515298 16993 164292 -369199 -920779 -829078
31426 -829078 -341087 -134088 -380965 -777729 -1146711 -1471244 -1560128 -1234617 -769102 -664075
31416f64075l17810l15544j1022J79323J75369J64727J66726M8504j64683k94981
31406a033466k51457q5403R4807J63445Q0643R657J22270K68036J43626j69673
31396f57515k44855k660J07866j43989l37614q4457L06324L27202O7922m2317
31386g04093N74j09798k95920j84111J68708K94844J05806J7407J59286J16604
31376d30693k79389n26392k24312K42673K99302N4688J5783K06923K08850m4887
31366d77454j59631j2985J5487k56439m28048j61463K24613K43123N163j8430
31356a026064J79921J50897j79611k93177R1296M99354L90373l9764k24758j10654
31346e62187j04262k78137k53780P3127K86218J22087j23009j28789l4616n8453
$$ plain form
31416 -664075 -981885 -1297429 -1308451 -1129128 -953759 -789032 -622306 -573802 -738485 -1033466
31406 -1033466 -1284923 -1370326 -1275519 -1112074 -1031431 -1021774 -899504 -631468 -487842 -657515
31396 -657515 -902370 -905030 -797164 -941153 -1278767 -1363224 -1056900 -729698 -661776 -704093
31386 -704093 -703519 -813317 -1109237 -1293348 -1124640 -829796 -723990 -706583 -547297 -430693
31376 -430693 -710082 -1236474 -1460786 -1218113 -918811 -864123 -848340 -641417 -432567 -477454
31366 -477454 -637085 -650070 -634583 -891022 -1319070 -1480533 -1255920 -1012797 -1007634 -1026064
31356 -1026064 -846143 -695246 -874857 -1168034 -1076738 -577384 -187011 -226775 -451533 -562187
31346 -562187 -666449 -944586 -1198366 -1125239 -839021 -716934 -839943 -968732 -1003348 -1061801
31336a061801n4071J43032K86655J07415j54429j08709J17929J19669n3809l916
31326f62035K51144K58336p5473k95633j53561L8761K7089K7528K18347L30047
31316c5450J22785j56558k04036j68997k95632l92083j59246K03812K57393K8714
31306g99298o4242Q4894J63544L2320p2292o076N5181j0296n0016M4119J18353
31295e03809L7384q3373r8898o0699o0614n6315j0864j0653p8015n0119J66202
31284h09773L71890L15209N0020j46735j52822j06082j51382k45798k41736o6150
31274a183359J97870L52790K38474q4157l31845k71598J3541K18549J82323O0219
31264f07193P6338J92344J61717q0100k51091r3709J98860J82433j96051m56576
$$ plain form
31336 -1061801 -1115872 -972840 -686185 -578770 -733199 -841908 -723979 -604310 -658119 -662035
31326 -662035 -410891 -152555 -228028 -523661 -677222 -638461 -611372 -583844 -365497 -35450
31316 -35450 87335 -69223 -273259 -442256 -737888 -1129971 -1289217 -1085405 -828012 -799298
31306 -799298 -863540 -778646 -615102 -582782 -655074 -661150 -605969 -616265 -666281 -622162 -503809
31295 -503809 -466425 -549798 -648696 -709395 -770009 -826324 -837188 -847841 -925856 -975975 -809773
31284 -809773 -437883 -122674 -72654 -219389 -372211 -478293 -629675 -875473 -1117209 -1183359
31274 -1183359 -985489 -632699 -394225 -478382 -810227 -1081825 -1068284 -849735 -667412 -607193
31264 -607193 -530855 -338511 -176794 -256894 -507985 -601694 -402834 -220401 -416452 -873028
31254h73028k50761J11899J13195j93499k80779K4665K95173K06603K4892R9405
31244g22235K48937P9962l08235m23687j30654J66650J62262N3406J23689K62494
31234d87411J81231r8245k68793j67819N9764J99757J81596O5040l3051q344J09280
31223b66995J33694m8500k72312k76079n6314J39088J59302R1720M0206j5036
31213c71226p1670l8847P1720Q3540p5033k07816j17157J06146K21870J50490
31203b47983r682j56691k20275j44543K449K7778j13113j92020m5190J41876J27467
31192h29927Q786K0985J09255O9568j6532Q0593K42082J24027k20104l50501j57408
31181i19176m0245j96438k59864N8053M38856M52361K02533N9436N2039k3485
$$ plain form
31254 -873028 -1123789 -1011890 -898695 -1092194 -1372973 -1348308 -1053135 -846532 -821640 -722235
31244 -722235 -473298 -393336 -701571 -1125258 -1255912 -1089262 -927000 -873594 -749905 -487411
31234 -487411 -306180 -404425 -673218 -841037 -781273 -581516 -399920 -334880 -367931 -376275 -266995
31223 -266995 -133301 -181801 -454113 -730192 -786506 -647418 -488116 -396396 -356190 -371226
31213 -371226 -442896 -481743 -410023 -326483 -401516 -609332 -726489 -620343 -398473 -247983
31203 -247983 -257665 -414356 -634631 -779174 -776725 -748947 -862060 -1054080 -1099270 -957394 -829927
31192 -829927 -821141 -800156 -690901 -621333 -637865 -557272 -315190 -191163 -411267 -761768 -919176
31181 -919176 -959421 -1155859 -1415723 -1357670 -918814 -466453 -263920 -204484 -152445 -175930
31171a75930j20785l8647J37668J39230p577k0323J35273J74473j7998j79393
31161B5991q5693P9531l1214m22207o70046m05670J83332M93188K38927j48792
31151g42653j18299K02736K49020m0067j38871J21786K35454o5351k81455j4411
31141e92111K89935J04359k36534j23435K46617K37866r6177j68917N2345O1620
31131b24432j68084j43251J54076J94136o6337n8530K80813K74200k61809n43444
31121e62662r6622M16251K93788j04511j08812J23826O7895j47929p7698J04637
31111i1837p6841m20289k93199K63253N25672J91675k50580l34805j62219k0135
31101f69305J4388k8755r4479k9109K16291L60653J58273j32457j12763O5739
$$ plain form
31171 -175930 -296715 -335362 -197694 -58464 -66041 -86364 48909 223382 205384 25991
31161 25991 -59702 19829 -11385 -433592 -1103638 -1509308 -1325976 -832788 -593861 -742653
31151 -742653 -860952 -658216 -409196 -449263 -588134 -466348 -230894 -296245 -577700 -592111
31141 -592111 -302176 -197817 -434351 -557786 -311169 -73303 -169480 -338397 -286052 -224432
31131 -224432 -392516 -535767 -381691 -187555 -253892 -312422 -31609 242591 -19218 -562662
31121 -562662 -659284 -243033 50755 -53756 -162568 -38742 29153 -118776 -196474 -91837
31111 -91837 -168678 -588967 -882166 -618913 -93241 98434 -152146 -486951 -649170 -669305
31101 -669305 -654917 -683672 -778151 -807260 -590969 -230316 -72043 -204500 -317263 -251524
31091b51524n0151l67303l25142J39230M10162J61134j59748j09357P9816Q006
31081d64877j99372j75928N1184J75041J33233R7216Q9680K138r2077l570K07493
31070a79839K44856J2033k10073j37420J19075J86733p1959l53379l02639j0396
31060g03008R5567j27909l07133j06709K55139L47474J76287R3259J64296R4199
31050a8538j93563l63470k04651K9086L3760r9297r8346O0559J87276J78733P1485
31039d16966q3848k13539j85131M4552K97725L22793O0157k86392m13029j70558
31029a044236K55874M58638K26605j88481l67405k13001L9378J98246K41476J51380
31019b41526n1934j59844j2631J47819k6942l60942l24508R4375K71934q1536
$$ plain form
31091 -251524 -301675 -668978 -994120 -854890 -444728 -283594 -443342 -552699 -472883 -464877
31081 -464877 -664249 -840177 -788993 -613952 -480719 -383503 -293823 -291685 -383762 -387332 -179839
31070 -179839 65017 77050 -133023 -270443 -151368 35365 -36594 -389973 -692612 -703008
31060 -703008 -607441 -735350 -1042483 -1149192 -894053 -546579 -370292 -277033 -112737 -18538
31050 -18538 -212101 -575571 -780222 -751136 -717376 -816673 -915019 -854460 -667184 -488451 -416966
31039 -416966 -500814 -714353 -899484 -854932 -557207 -234414 -174257 -460649 -873678 -1044236
31029 -1044236 -788362 -329724 -103119 -291600 -659005 -872006 -832628 -634382 -392906 -241526
31019 -241526 -293460 -453304 -465935 -318116 -345058 -706000 -1030508 -936133 -664199 -745735
31009g45735m21094k08698K65563L97309J90673R5016J98401J88380r612j17203
30999a67000j7765P6595J0387j25779k13528k16109r2959J13931J76053l9300
30989d95474k72988j92150R3439K07396J08484Q1716J71000J06207j52070k72288
30979f16728q9161J44687K06938K08059K56149K03231l1679k22366j88806j06203
30969b35879j84329k91973j98055K1972J28531J06198J05797J19883K3529j27567
30959e31893j34609J5478J10897L4915q1680q2918j341K9823k0975n5544K519
30948g15328R0216Q7804J1105J5273J35245J65157k5488j96694n8710K00042J22130
30937a69248k58259l63250L4519L81755J73054k47812k36570J41052K83452N6593
$$ plain form
31009 -745735 -1166829 -1375527 -1109964 -712655 -521982 -426966 -228565 -40185 -49797 -167000
30999 -167000 -184765 -108170 -97783 -223562 -437090 -653199 -746158 -632227 -456174 -495474
30989 -495474 -768462 -960612 -867173 -659777 -551293 -469577 -298577 -192370 -344440 -616728
30979 -616728 -705889 -561202 -354264 -146205 109944 313175 281496 59130 -129676 -235879
30969 -235879 -420208 -712181 -910236 -888264 -759733 -653535 -547738 -427855 -404326 -531893
30959 -531893 -666502 -651024 -540127 -505212 -586892 -669810 -671151 -641328 -662303 -717847 -715328
30948 -715328 -625112 -537308 -526203 -510930 -375685 -210528 -236016 -432710 -491420 -291378 -169248
30937 -169248 -427507 -790757 -756238 -374483 -201429 -449241 -685811 -544759 -261307 -204714
30927b04714p1289J02952K01147j7649k36567j66798l3773j14878k25274q6598
30917h53441J36805J30474m251L6110J66628O0501k09753k27166N4113J92079
30907e17901r037j64310L5421K86672J68509j65815k43795j5405J36516N0255
30897d38890k2563P6943J54942O6642L628J35035K50794P2037k68472l91503k30959
30886e92366r2768j47239j83525J2485K85019L07595K7349k74058l22678j20921
30876a101107J20227K20891J80102J23606J28074J27097L2944r1095r5645J3054
30866c41852M6636q2874k05470j46173n127K061j02396j05360Q723n746k25268
30855a162846l22739k061M84905N72406J34613l01759k40056J35188K48884n0274
$$ plain form
30927 -204714 -276003 -173051 28096 10447 -226120 -392918 -426691 -541569 -766843 -853441
30917 -853441 -716636 -586162 -590413 -554303 -387675 -327174 -536927 -764093 -709980 -517901
30907 -517901 -526938 -691248 -655827 -369155 -200646 -366461 -610256 -625661 -489145 -438890
30897 -438890 -461453 -384510 -229568 -162926 -159298 -24263 226531 298568 30096 -361407 -592366
30886 -592366 -685134 -832373 -1015898 -1003413 -718394 -410799 -383450 -657508 -980186 -1101107
30876 -1101107 -980880 -759989 -579887 -456281 -328207 -201110 -168166 -259261 -354906 -341852
30866 -341852 -295216 -378090 -583560 -729733 -734860 -732799 -835195 -940555 -931832 -937578 -1162846
30855 -1162846 -1485585 -1487646 -1002741 -430335 -295722 -597481 -837537 -702349 -453465 -503739
30845e03739l03966j23708K57313L31788L3518j97244m8771K41720K33596j17944
30835a97437m01320k66163J48511L81508J93520j62763k71588p2910J01412J9209
30825e28021j32225o2785J55647J98359j932j46644k5317J78264J61991r2885
30815b95548l32771l22450k6757L74101N68864L60886p2557l10820j74435Q2962
30805a48525J61531P7975j3825j23905k91372l37557p9219L03831M33776K39034
30795B21744L809p7806j01895j72095k04485j18303J205M7267L5753J4133l0037
30784c80710q9464r0662K14J16787J73616J28851j7203j77284j74844N9381L20660
30773a30658L32534R5409j36828j92494j07917K7290J26755O6961j46189k29685
$$ plain form
30845 -503739 -807705 -931413 -674100 -342312 -308794 -506038 -554809 -313089 -79493 -197437
30835 -197437 -598757 -864920 -716409 -334901 -141381 -304144 -575732 -648642 -547230 -528021
30825 -528021 -660246 -723031 -567384 -369025 -370957 -517601 -542918 -364654 -202663 -295548
30815 -295548 -628319 -950769 -977526 -603425 -34561 326325 253768 -57052 -231487 -148525
30805 -148525 13006 90981 77156 -46749 -338121 -675678 -754897 -451066 -17290 221744
30795 221744 225553 147747 45852 -126243 -330728 -449031 -447826 -400559 -364806 -350673 -380710
30784 -380710 -470174 -560836 -560622 -443835 -270219 -141368 -158571 -335855 -510699 -451318 -130658
30773 -130658 201876 297285 160457 -32037 -139954 -112664 14091 81052 -65137 -294822
30763b94822L5880L59286K32947k94686n90073l11279J34956K40033P5126L459
30753d09173O3028K9846j33120k63535k85522k04314K5127L37298M43235J93835
30743b03295j04619o7943K12498L30537J52763j08892l04166m43547m57584k51055
30733a245303J4784O5637n1159l6098J43682J95434K7891o3970J07951L04169
30723e36982K40488M872j39110j38890j05162n2453O4992J63941J10507n1017
30713d38814j31296n2301P2791J27444J31710J38185Q6550j07794l24854k71676
30703g70055J20948M64995L32525j36045l69220j64342M2287j03433k97068r0239
30693i69647L48609M77377J92948j07805j79815j38274o2110R4847J88966R050
$$ plain form
30763 -294822 -258942 100344 333291 38605 -551468 -862747 -727791 -487758 -412632 -409173
30753 -409173 -346145 -316299 -449419 -712954 -998476 -1202790 -1177663 -840365 -397130 -203295
30743 -203295 -307914 -375857 -163359 167178 319941 211049 -93117 -536664 -994248 -1245303
30733 -1245303 -1230519 -1164882 -1216041 -1252139 -1108457 -913023 -885132 -949102 -841151 -536982
30723 -536982 -296494 -291622 -430732 -569622 -674784 -727237 -662245 -498304 -387797 -438814
30713 -438814 -570110 -622411 -549620 -422176 -290466 -152281 -65731 -173525 -498379 -770055
30703 -770055 -649107 -184112 148413 12368 -356852 -521194 -478907 -582340 -879408 -969647
30693 -969647 -621038 -143661 49287 -58518 -238333 -376607 -438717 -343870 -154904 -145854
30683a45854k33609q8707L47341M20627q4264n29562l54424J16957K52873M9528
30673b49094n1450N0546R6062L6783N4465R7293o8471l49793l60556k8868K58616
30662e14467K24448L3299p4641j30153k22750k33559k9561K52601L50146K11252
30652a33385J0873j05596j35027j07730k3587P5093Q6966j2764q3320K2374K08277
30641a97826J84095j41490m38401l18052J26160L81440J68108k07407k81209j2066
30631g36648K55386K67844Q9997q0604j32131p8246p891M275m365O4941J80453
30620a76989J70512Q3j03429L6527K46424K25995k9260k58661l21431k98911k36849
30609g45989o1630J87764K85359J01934j88579l00613j39668J55292L73280L74878
$$ plain form
30683 -145854 -379463 -468170 -120829 299798 215534 -314028 -668452 -551495 -298622 -249094
30673 -249094 -300544 -249998 -153936 -117153 -62688 34605 -33866 -383659 -744215 -773083 -514467
30662 -514467 -290019 -256720 -331361 -461514 -684264 -917823 -947384 -694783 -344637 -133385
30652 -133385 -122512 -228108 -363135 -470865 -494452 -419359 -332393 -345157 -428477 -406103 -197826
30641 -197826 -13731 -155221 -593622 -911674 -785514 -404074 -235966 -443373 -724582 -736648
30631 -736648 -481262 -213418 -123421 -204025 -336156 -414402 -422293 -418018 -422383 -357442 -176989
30620 -176989 -6477 -6394 -109823 -73296 173128 399123 369863 111202 -210229 -509140 -745989
30609 -745989 -807619 -619855 -334496 -232562 -421141 -721754 -861422 -706130 -332850 42028
30599D2028J75522m5369j00634j7038j4437k04818m09005l66938o6414K38053
30589g69050L08166J46179m6789p3234Q7570K57227K24199k4136k65379k90505
30579d45752j39788k640O2353J47121K38478J63264j04935k94029j92337K944
30569e65321k4325j77089o9040L13336M86581J69846k61898l04202k1762J23463
30559c30411l9712k45314k52933j11254M3718J69544K50271K51691J85828R9270
30549B0698J6386k6959M239K3369r5305k22199o7170K66430K48704k35572n04351
30538e71730o3540N01394L60589k21264l28033N4922O4841m34946n19234J71429
30528i85572O71549K28594m45737l54332J98699K55287j64329k30797K05034M26989
$$ plain form
30599 42028 217550 172181 71547 54509 40072 -164746 -573751 -940689 -1007103 -769050
30589 -769050 -460884 -314705 -361494 -434728 -347158 -89931 134268 110132 -155247 -445752
30579 -445752 -585540 -588180 -525827 -378706 -140228 23036 -81899 -375928 -568265 -565321
30569 -565321 -589646 -766735 -835775 -522439 -35858 133988 -127910 -432112 -453874 -330411
30559 -330411 -370123 -615437 -868370 -979624 -935906 -766362 -516091 -264400 -78572 20698
30549 20698 37084 10125 14364 37733 -57572 -279771 -346941 -80511 168193 -67379 -571730
30538 -571730 -635270 -133876 226713 5449 -322584 -267662 -202821 -637767 -1157001 -985572
30528 -985572 -314023 -85429 -531166 -885498 -686799 -431512 -595841 -826638 -621604 -194615
30518a94615J12173k32228k16383r7721j38691j46066N5436K40872J78720N431
30508d33072m3807K4919P9989P8272L4149l8075r1449j01880j22842j46692m9598
30497h10086J44822J70485n4653j83930K2293K18072K064l49145k70133J56716
30487i53495L19488O4170j23584J9753J52190j9492k67507k64408m2646J76774
30477i38757K68873J80063o2849k43039j60764M5644J10584Q9129J85454K63377
30467b62285O0019k13832j17677K16054K26161j00575j67803J79073L46561N250
30457A70946l69838l33742j17160k2722J11354L57895L05242k00390n45481k37860
30447h81756K48215K22781j13092r3508K59603L49856N4850j55260p6541j5112
$$ plain form
30518 -194615 -82442 -314670 -531053 -628774 -767465 -913531 -858095 -617223 -438503 -433072
30508 -433072 -476879 -451960 -371971 -293699 -259550 -297625 -389074 -490954 -613796 -760488 -810086
30497 -810086 -665264 -494779 -549432 -733362 -711069 -492997 -490933 -840078 -1110211 -953495
30487 -953495 -634007 -569837 -693421 -673668 -521478 -540970 -808477 -1072885 -1115531 -938757
30477 -938757 -669884 -489821 -552670 -795709 -956473 -910829 -800245 -711116 -525662 -262285
30467 -262285 -202266 -416098 -533775 -317721 -91560 -192135 -359938 -180865 165696 170946
30457 170946 -198892 -532634 -649794 -672516 -561162 -203267 101975 -98415 -643896 -881756
30447 -881756 -633541 -410760 -523852 -617360 -357757 -7901 46949 -108311 -184852 -199964
30437a99964j45537k50634j80239o4610k63O6940J22350R9566P9135J44699J53777
30426a74780m235j02260O3751K21246K6989k71748j75545K01209K69761n9030
30416d642k45208n6192P1302j61848l89951k16938J41518K62637J69202J52818
30406b77302K27459J76289k2735j78320k04157j72708j13292K722J03201M5266
30396d13577j68330l25884k14615J26395L87237K87345o8445k50261l0651K87890
30386c82896K68906o0647k86185k09989n5454n3757j44475j68666r0751O6069
30376a117845K70922L91655K80408K6263j09147o4766k3323k4669J24164M10190
30366A63852M49469L2295m50762m67465n3126K78704K37219L2474l3607M6740
$$ plain form
30437 -199964 -345501 -596135 -776374 -840984 -841247 -774307 -651957 -552391 -473256 -328557 -174780
30426 -174780 -179015 -281275 -217524 3722 30711 -241037 -416582 -215373 54388 -4642
30416 -4642 -249850 -306042 -234740 -396588 -786539 -1003477 -861959 -599322 -430120 -277302
30406 -277302 -49843 126446 103711 -74609 -278766 -451474 -564766 -562044 -458843 -413577
30396 -413577 -581907 -907791 -1122406 -996011 -608774 -321429 -389874 -640135 -670786 -382896
30386 -382896 -113990 -174637 -460822 -670811 -726265 -780022 -924497 -1093163 -1183914 -1117845
30376 -1117845 -846923 -455268 -174860 -148597 -257744 -322510 -345833 -370502 -246338 163852
30366 163852 613321 645616 194854 -272611 -325737 -47033 190186 222660 189053 235793
30356B35793Q4965k2813k04481k93572j64606J24663L22795K16853j15393l74065
30346a89861l62569j60057L1199J13226J37157J92876K96418L58668K59349j1994
30336F64412k92216l74156k18242M44P5186k5235j46018j24897L4211J64208J13065
30325a29238p9106k03659j10833J07517K18324J29797j1561n3327o4756j96246
30315c93088l64899k91355Q7061M41088M43483J93960M9089J23017J96741R4548
30305E79645r7750k24457k47649j79050k2188J38387J64334N3736n7811j27148
30295a9951k29714l12415j91486R1784K03321r840k46811j88905L9003J23481
30285g41533N6384M2717R1899O9538L6363J48020K84709J80277r3431j75401J1398
$$ plain form
30356 235793 320758 297945 93464 -200108 -364714 -240051 82744 299597 184204 -189861
30346 -189861 -552430 -712487 -681288 -568062 -430905 -238029 58389 417057 676406 664412
30336 664412 372196 -1960 -220202 -219758 -144572 -169807 -315825 -440722 -406511 -242303 -129238
30325 -129238 -208344 -412003 -522836 -415319 -196995 -67198 -78759 -132086 -196842 -393088
30315 -393088 -757987 -1049342 -962281 -521193 -77710 116250 165339 288356 485097 579645
30305 579645 481895 257438 9789 -169261 -191449 -53062 111272 165008 107197 -19951
30295 -19951 -249665 -562080 -753566 -661782 -458461 -468301 -715112 -904017 -865014 -741533
30285 -741533 -685149 -642432 -550533 -480995 -444632 -296612 -11903 168374 74943 -100458 -89060
30274h9060J37670J6634j17422m5016Q4876O4206j8516O12L6715m9924j34214
30263a13439k6956J35916N2789k37610l50467j07960J96288K17175K1238n7396
30253b70422R9827K64694K04869j2235j41699j00119n1229j34779k34075j37240
30243e12408J19037K43986Q4812j41021j42840L5422J05350k2167j26151m5089
30233d01069Q5220Q2293q831o8246j34595k47178k27314N4640L06209J22414l38539
30222g74996m59320o0924K99955J89624m2463J02972M02614K78542k06564m05830
30212f76390r3082K45813K24100N9575O6003J54159J14355q440r1057j50627j65168
30201c20759o088K48674K84431L9114j48253r3636n4593j96263k31680L8279K69241
$$ plain form
30274 -89060 48610 65244 -52178 -97194 -12318 51888 33372 33984 70699 20775 -113439
30263 -113439 -140395 -4479 48310 -189300 -539767 -647727 -451439 -234264 -213026 -270422
30253 -270422 -170595 94099 298968 286733 145034 44915 -6314 -141093 -375168 -512408
30243 -512408 -393371 -149385 -64573 -205594 -348434 -313012 -207662 -229829 -355980 -401069
30233 -401069 -315849 -233556 -242387 -310633 -445228 -692406 -919720 -865080 -558871 -436457 -774996
30222 -774996 -1234316 -1295240 -995285 -805661 -848124 -745152 -342538 -63996 -270560 -676390
30212 -676390 -769472 -523659 -299559 -239984 -173981 -19822 94533 86093 -4964 -155591 -320759
30201 -320759 -326847 -78173 206258 245372 97119 3483 -51110 -247373 -479053 -440774 -171533
30190a71533J13983j69663j58694L3231N0673j8137J17744K70021M0442l57234
30180b49167k98546K12534M50345P3940l59829k78380R8307K22398M6494n7881
30170a39785N9834J90405J57984L6270k0958J1224J0827j35774l41987l57448
30160e29408j04930J40084J07872n7875m1709J03921M6894k22431l07435j2157
30150h77174L55459M34118K37001j8428k02231k33473l9537K57896L54394J35488
30140D03513j60164k74906k12709q1945Q2016J98704J12854j38339k61892r6790
30130d29658J45753K01535R5823j3919j11502k20389k30933p4483Q4487O7349
30120d85937l6508l2213N8229P4591J8062J4013L2268q8269l25703m27417k46854
$$ plain form
30190 -171533 -57550 -227213 -385907 -352676 -302003 -320140 -202396 67625 108067 -249167
30180 -249167 -547713 -335179 115166 189106 -170723 -449103 -350796 -128398 -81904 -139785
30170 -139785 -79951 110454 268438 304708 283750 294974 305801 170027 -171960 -529408
30160 -529408 -634338 -494254 -386382 -444257 -485966 -382045 -335151 -557582 -865017 -877174
30150 -877174 -521715 -87597 149404 130976 -71255 -304728 -344265 -86369 268025 403513
30140 403513 243349 -31557 -244266 -326211 -244195 -45491 67363 -70976 -332868 -429658
30130 -429658 -283905 -82370 13453 -466 -111968 -332357 -563290 -637773 -553286 -485937
30120 -485937 -522445 -554658 -496429 -421838 -403776 -389763 -357495 -445764 -771467 -1198884 -1445738
30109a445738N4995K38683K75990K89894L01587K01823k7192k16612k23277j32108
30099f81955j14158j48680o6419J40923K64983J90353N6850J7401K7820m467n3845
30088c71194r0888j67259k48261j76279N1001K13726K38431L21258M78577L66045
30078F15157j26913n02646l21349J14879K55346J33040J05101R7923j50317l50733
30068a30512l1465M78783L75442k86003n59385r9120L11499Q6556k69705j49570
30058b73480J33331J6839k91083k48789N9143J65473N6770L9267O0193j25840
30048d08176l29373j63021K25820L17127M3104j66613j33759j15554j98016r9864
30038a028325K56487M81029K72664j17905k43566m9549J34104P2927j01725j10300
$$ plain form
30109 -1445738 -1390743 -1152060 -876070 -586176 -284589 -82766 -109958 -326570 -549847 -681955
30099 -681955 -796113 -944793 -1011212 -870289 -605306 -414953 -358103 -340702 -312882 -317349 -371194
30088 -371194 -462082 -629341 -877602 -1053881 -1002880 -789154 -550723 -229465 249112 615157
30078 615157 488244 -14402 -335751 -220872 34474 167514 272615 370538 220221 -130512
30068 -130512 -161977 316806 692248 406245 -153140 -252260 59239 145795 -123910 -273480
30058 -273480 -140149 -123310 -414393 -663182 -604039 -438566 -381796 -342529 -282336 -408176
30048 -408176 -737549 -900570 -674750 -357623 -314519 -481132 -614891 -730445 -928461 -1028325
30038 -1028325 -771838 -290809 -18145 -136050 -379616 -429165 -295061 -222134 -323859 -434159
30028d34159R3861K55657J59907o8760j56947q5843n9800j15327p9223O1932J01770
30017c26932o274p1515m8491r0382j26318J21555N25608N11327p2414n79323m53809
30006f16968K285J96425J06989O8363J19747J20535J45563K18103L4117m51994
29996e6835n80217J41852J046438J025317P2337p32584p23883l04092m8313K3266
29986a36714O9950L4815p3315l6320J64944K29971K7518j92589k28360j70749
29976c10849r6310P0759K55598K08945n2348j72318K077J67799M1818k27731l17385
29965d29945j46171J09893K22945O5731k44244l59747r1415K81206L61499J90681
29955c9567J00073J30355M4076j53347k00407p9854l9655r9844m2753Q0267k0973
$$ plain form
30028 -434159 -340298 -84641 75266 6506 -150441 -236284 -296084 -411411 -490634 -428702 -326932
30017 -326932 -333206 -404721 -453212 -543594 -669912 -548357 -22749 488578 416164 -163159 -616968
30006 -616968 -614683 -418258 -311269 -242906 -123159 -2624 142939 361042 395159 -56835
29996 -56835 -637052 -495200 551238 1576555 1648892 916308 192425 -111667 -159980 -136714
29986 -136714 -66764 -31949 -105264 -141584 23360 253331 280849 88260 -140100 -310849
29976 -310849 -407159 -336400 -80802 128143 75795 -96523 -94446 73353 115171 -112560 -429945
29965 -429945 -576116 -466223 -243278 -177547 -421791 -781538 -872953 -591747 -230248 -39567
29955 -39567 60506 190861 234937 81590 -118817 -198671 -238326 -338170 -380923 -300656 -321629
29944c21629k70838k31436J51179L78243J77147r6440q0758P8045J08631M1209
29934f6647k8995j59556k64688n1390M40478O68785L05443k59716m66581k77230
29924a60097j043K03234L03649K16565N182n4871P5850L7076l12156n13222j81879
29913c81712L06008L27228o6323l01127j81914n9743j51180k30282p9965J66953
29903f52057K66996J64371m3782k31198k73869j24754J01915K28872J93330N6591
29893c13585r4497j73076j08667P1601K48411L33268K93660R2883k07878l39680
29883a97560j09493K18584J87002j75940l62135j57402P9587Q8958J16785L35931
29873B4317L97130K5148l83349l17254K8309Q9787j43070j83659Q1446K20179
$$ plain form
29944 -321629 -592467 -823903 -672724 -294481 -117334 -213774 -294532 -216487 -107856 -66647
29934 -66647 -95642 -255198 -519886 -571276 -130798 537987 843430 583714 117133 -160097
29924 -160097 -161140 42094 345743 562308 567490 512619 588469 625545 313389 -199833 -381712
29913 -381712 -75704 251524 185201 -115926 -297840 -357583 -508763 -739045 -819010 -652057
29903 -652057 -385061 -220690 -264472 -495670 -769539 -894293 -792378 -563506 -370176 -313585
29893 -313585 -408082 -581158 -689825 -618224 -369813 -36545 257115 349998 142120 -197560
29883 -197560 -307053 -88469 98533 -77407 -439542 -596944 -517357 -428399 -311614 24317
29873 24317 421447 446595 63246 -254008 -225699 -135912 -278982 -462641 -381195 -161016
29863a61016q53k58203k14618O290Q6940l3936j62100j27869N4226K16210J97310
29852c97619K9172r4540p8279j3444N0353J89984L47780K80010l1675k24742q0130
29841b3130J07232O809k15504k40893j61613k10631k00934J63789N82908M35757
$$ plain form
29863 -161016 -161869 -420072 -634690 -628400 -541460 -575396 -737496 -865365 -811139 -594929 -397619
29852 -397619 -368447 -462987 -541266 -554710 -504357 -314373 33407 313417 281742 57000 -23130
29841 -23130 84102 90911 -124593 -365486 -527099 -737730 -938664 -774875 -191967 243790
$$ [...]
##END NTUPLES=NMR SPECTRUM
##END=
