##TITLE=31Pdec_LY-11.Dix.1B
 CD3CN, 24 sc
 1.06.2021
##JCAMPDX= 6.0         $$ Bruker NMR JCAMP-DX V2.0
##DATA TYPE= NMR SPECTRUM
##DATA CLASS= NTUPLES
##ORIGIN= UXNMR, Bruker Analytische Messtechnik GmbH
##OWNER= root
$$ XWIN-NMR		Version 3.5
$$ Tue Jun  1 10:50:28 2021 Russian Standard Time (UT+4h)  she@DPX200
##.OBSERVE FREQUENCY= 81.013821
##.OBSERVE NUCLEUS= ^31P
##.ACQUISITION MODE= SIMULTANEOUS
##.ACQUISITION SCHEME= undefined
##.AVERAGES= 24
##.DIGITISER RES= 16
##SPECTROMETER/DATA SYSTEM= spect
##.PULSE SEQUENCE= zgpg30
##.SOLVENT NAME= CD3CN
##.SHIFT REFERENCE= (INTERNAL, CD3CN, 0, 248.564)
##AUDIT TRAIL= $$ (NUMBER, WHEN, WHO, WHERE, WHAT)
$$ ##TITLE= Audit trail, XWIN-NMR		Version 3.5
$$ ##JCAMPDX= 5.01
$$ ##ORIGIN= Bruker BioSpin GmbH
$$ ##OWNER= she
$$ F:/spectra/data/she/nmr/P31/1/pdata/1/auditp.txt
$$ ##AUDIT TRAIL=  $$ (NUMBER, WHEN, WHO, WHERE, WHAT)
(   1,<2021-06-01 10:49:17.98 +0400>,<she>,<DPX200>,
      <created by zg, POWCHK disabled, PULCHK disabled
       configuration hash MD5:
       00 E9 B6 7A A2 85 ED C7 34 08 36 98 17 FE 4E 26
       data hash MD5: 32K
       AA 23 13 30 15 61 ED 70 07 B5 90 75 5D E8 55 EA>)
(   2,<2021-06-01 10:49:20.48 +0400>,<she>,<DPX200>,
      <Start of raw data processing
       efp BC_mod = 2 LB = 1 FT_mod = 6 PKNL = 1 PHC0 = -6084.889 PHC1 = 490.8726 SI = 64K 
       data hash MD5: 64K
       04 0E 8C 7C AE 87 57 90 34 D2 D2 AE 5D AA 2B 39>)
(   3,<2021-06-01 10:49:44.93 +0400>,<she>,<DPX200>,
      <pk PHC0 = -28.64179 PHC1 = 59.6 
       data hash MD5: 64K
       1B 12 37 D4 96 65 D3 C3 5C 44 29 68 E4 6C 54 FE>)
(   4,<2021-06-01 10:49:47.98 +0400>,<she>,<DPX200>,
      <abs ABSG = 5 
       data hash MD5: 64K
       F7 36 13 EA 61 53 D4 BC 91 19 0F A3 D2 9D 53 26>)
$$ ##END=
$$ 
$$ hash MD5
$$ 2F 1D 43 53 95 62 DE D4 24 46 F4 45 60 13 E0 BA
##$RELAX= 
##$RELAX= 
##$RELAX= 
##$RELAX= 
##$RELAX= 
##$RELAX= 
##$RELAX= 
##$RELAX= 
$$ Bruker specific parameters
$$ --------------------------
##$DU= <F:/spectra>
##$EXPNO= 1
##$NAME= <P31>
##$PROCNO= 1
##$TYPE= <nmr>
##$USER= <she>
##$AMP= (0..31)
100 100 100 100 100 100 100 100 100 100 100 100 100 100 100 100 100 100 
100 100 100 100 100 100 100 100 100 100 100 100 100 100 
##$AQSEQ= 0
##$AQ_mod= 1
##$AUNM= <au_zg>
##$AUTOPOS= <>
##$BF1= 81.014009
##$BF2= 200.13
##$BF3= 200.13
##$BF4= 200.13
##$BF5= 200.13
##$BF6= 200.13
##$BF7= 200.13
##$BF8= 200.13
##$BYTORDA= 1
##$CFDGTYP= 0
##$CFRGTYP= 5
##$CHEMSTR= <none>
##$CNST= (0..31)
1 1 145 1 1 1 1 1 1 1 1 1 1 1 1 1 1 1 1 1 1 1 1 1 1 1 1 1 1 1 1 1 
##$CPDPRG= <waltz16>
##$CPDPRG1= <>
##$CPDPRG2= <waltz16>
##$CPDPRG3= <>
##$CPDPRG4= <mlev>
##$CPDPRG5= <mlev>
##$CPDPRG6= <mlev>
##$CPDPRG7= <mlev>
##$CPDPRG8= <mlev>
##$CPDPRGB= <>
##$CPDPRGT= <>
##$D= (0..31)
0 1 0 0 0 0 0 0 0 0 0 0.03 2e-05 3e-06 0 0 0 0 0 0 0 0 0 0 0 0 0 0 0 0 
0 0 
##$DATE= 1622530157
##$DBL= (0..7)
120 120 120 11 120 120 24 19 
##$DBP= (0..7)
150 150 150 150 150 150 150 150 
##$DBP07= 0
##$DBPNAM0= <>
##$DBPNAM1= <>
##$DBPNAM2= <>
$$ [...]
##$SUBNAM3= <"">
##$SUBNAM4= <"">
##$SUBNAM5= <"">
##$SUBNAM6= <"">
##$SUBNAM7= <"">
##$SUBNAM8= <"">
##$SUBNAM9= <"">
##$SW= 501.771253377433
##$SWIBOX= (0..15)
0 1 3 0 0 0 0 0 0 0 0 0 0 0 0 0 
##$SW_h= 40650.406504065
##$TD= 32768
##$TD0= 1
##$TE= 0
##$TE2= 300
##$TE3= 300
##$TEG= 300
##$TL= (0..7)
0 120 53 12 22 120 120 120 
##$TP= (0..7)
150 150 150 150 150 150 150 150 
##$TP07= 0
##$TPNAME0= <>
##$TPNAME1= <>
##$TPNAME2= <>
##$TPNAME3= <>
##$TPNAME4= <>
##$TPNAME5= <>
##$TPNAME6= <>
##$TPNAME7= <>
##$TPOAL= (0..7)
0.5 0.5 0.5 0.5 0.5 0.5 0.5 0.5 
##$TPOFFS= (0..7)
0 0 0 0 0 0 0 0 
##$TUNHIN= 0
##$TUNHOUT= 0
##$TUNXOUT= 0
##$USERA1= <user>
##$USERA2= <user>
##$USERA3= <user>
##$USERA4= <user>
##$USERA5= <user>
##$V9= 5
##$VALIST= <valist>
##$VCLIST= <CCCCCCCCCCCCCCC>
##$VD= 0
##$VDLIST= <DDDDDDDDDDDDDDD>
##$VPLIST= <PPPPPPPPPPPPPPP>
##$VTLIST= <TTTTTTTTTTTTTTT>
##$WBST= 1024
##$WBSW= 4
##$XGAIN= (0..3)
0 0 0 0 
##$XL= 0
##$YL= 0
##$YMAX_a= 1974
##$YMIN_a= -9770
##$ZGOPTNS= <>
##$ZL1= 120
##$ZL2= 120
##$ZL3= 120
##$ZL4= 120
##$ABSF1= 248.5645
##$ABSF2= -253.2056
##$ABSG= 5
##$ABSL= 3
##$ALPHA= 0
##$AQORDER= 0
##$ASSFAC= 0
##$ASSFACI= 0
##$ASSFACX= 0
##$ASSWID= 0
##$AUNMP= <proc_1d>
##$AZFE= 0.1
##$AZFW= 0.5
##$BCFW= 0
##$BC_mod= 2
##$BYTORDP= 0
##$COROFFS= 0
##$CY= -3
##$DATMOD= 1
##$DC= 0
##$DFILT= <>
##$DTYPP= 0
##$F1P= 0
##$F2P= 0
##$FCOR= 1
##$FTSIZE= 65536
##$FT_mod= 6
##$GAMMA= 0
##$GB= 0
##$INTBC= 1
##$INTSCL= 5.30512e-09
##$ISEN= 30
##$LB= 1
##$LEV0= 0
##$LPBIN= 0
##$MAXI= 10000
##$MC2= 0
##$MEAN= 0
##$ME_mod= 0
##$MI= 50
##$NCOEF= 0
##$NC_proc= -4
##$NLEV= 6
##$NOISF1= 182.463
##$NOISF2= 159.3651
##$NSP= 0
##$NTH_PI= 0
##$NZP= 0
##$OFFSET= 248.5645
##$PC= 4
##$PHC0= -6113.531
##$PHC1= 550.4726
##$PH_mod= 1
##$PKNL= yes
##$PPARMOD= 0
##$PSCAL= 0
##$PSIGN= 0
##$REVERSE= no
##$SF= 81.014009
##$SI= 65536
##$SIGF1= 159.3651
##$SIGF2= -187.1042
##$SINO= 113.3802
##$SIOLD= 16384
##$SREGLST= <1H.CDCl3>
##$SSB= 0
##$STSI= 65536
##$STSR= 0
##$SW_p= 40650.406504065
##$SYMM= 0
##$S_DEV= 0
##$TDeff= 32768
##$TDoff= 0
##$TI= <>
##$TILT= no
##$TM1= 0
##$TM2= 0
##$TOPLEV= 0
##$USERP1= <user>
##$USERP2= <user>
##$USERP3= <user>
##$USERP4= <user>
##$USERP5= <user>
##$WDW= 1
##$XDIM= 65536
##$YMAX_p= 298768222
##$YMIN_p= -2335884
$$ End of Bruker specific parameters
$$ ---------------------------------
##NTUPLES= NMR SPECTRUM
##VAR_NAME=  FREQUENCY,     SPECTRUM/REAL,   SPECTRUM/IMAG
##SYMBOL=    X,             R,               I
##VAR_TYPE=  INDEPENDENT,   DEPENDENT,       DEPENDENT
##VAR_FORM=  AFFN,          ASDF,            ASDF
##VAR_DIM=   65536,         65536,           65536
##UNITS=     HZ,            ARBITRARY UNITS, ARBITRARY UNITS
##FACTOR=    0.620285442955139, 1,           1
##FIRST=     20137.2065510759, 0,            0
##LAST=      -20513.1999529892, 0,           0
##MIN=       -20513.1999529892, -2335884,    0
##MAX=       20137.2065510759, 298768222,    0
$$ Real data points
##PAGE= N=1
##DATA TABLE= (X++(R..R)), XYDATA
$$ [...]
35787f08261l3617N33887P95289L57414j87254j94034L3179j49137n71517n11462
$$ -608261 -641878 -107991 687298 1044712 857458 663424 696603 547466 -24051 -535513
35777e35513J20154O25844N18339M5236k98108k79957M0108L74543L40266j18104
$$ -535513 -415359 210485 728824 774060 475952 195995 236103 610646 950912 832808
35767H32808n54555n85442l78267k16424L2052M72025O30659J02816n64192n05163
$$ 832808 278253 -307189 -685456 -901880 -869828 -397803 232856 335672 -228520 -733683
35757g33683J24742L84134M2450j79236N4390J92073p2674k09931J13903L43174
$$ -733683 -608941 -224807 -182357 -361593 -307203 -115130 -187804 -397735 -283832 59342
35747E9342J1215l80917j99768K49777K83659k2628p7732J72162K39487k1220
$$ 59342 70557 -310360 -510128 -260351 23308 680 -77052 95110 334597 313377
35737C13377k42248j93836j7621J39695K23599R8089k32020l54570M9144N49562
$$ 313377 71129 -122707 -140328 -633 222966 321055 89035 -265535 -216391 333171
35727C33171M34494k00439n03295j17227L02036J09168l90217m77974p9446K57384
$$ 333171 767665 567226 63931 -53296 248740 357908 -32309 -510283 -589729 -332345
35717c32345K22357N0543r19j5936j28080k07146o8550J84447K69338J17569m8909
$$ -332345 -109988 -59445 -60364 -76300 -204380 -411526 -480076 -295629 -26291 91278 42369
35706D2369m7080M4805O7288K8811M7652J39947J99988J40399m7619l01879m63860
$$ 42369 -4711 40094 107382 136193 183845 323792 523780 664179 616560 314681 -149179
35695a49179l65946q0417O4476q9768k50124q2450K50559L19421R1047o8559k0338
$$ -149179 -515125 -595542 -531066 -620834 -870958 -953408 -702849 -383428 -292381 -360940 -381278
35684c81278N726n3479N3446L33789L72856O484l02810j39844K17969K64434L5807
$$ -381278 -375552 -429031 -375585 -41796 331060 337544 34734 -105110 112859 377293 413100
35673D13100o9930P090m393j37298j37372L8517J16504n1400k72323l00108j08507
$$ 413100 343170 350260 345867 208569 71197 109714 226218 174818 -97505 -397613 -506120
35662e06120J34447K09199L8188j37986K7872M39820N28994M9293m58896m15276
$$ -506120 -371673 -162474 -124286 -262272 -234400 205420 734414 783707 324811 -90465
35652i0465m8160O1907l6193J31727M67763L64775k02855n10052k20860R7703
$$ -90465 -138625 -76718 -112911 18816 486579 851354 648499 138447 -82413 15290
35642A5290m7567l10644j91682J30567K09217P8866J5120m4449k36176k76879
$$ 15290 -32277 -342921 -534603 -404036 -194819 -115953 -100833 -145282 -381458 -658337
35632f58337J12474N50663M54082j4758j78713L9722J7220m45162o81685k00585
$$ -658337 -545863 4800 458882 444124 265411 305133 322353 -122809 -804494 -1005079
35622a005079M82176N70017J12988j77097n639K08152R3511j42935j21737J42001
$$ -1005079 -522903 47114 160102 -16995 -22634 185518 279029 136094 14357 156358
35612A56358L33346L02078J68385L0345j86348n12617p29132n47117j926M70723
$$ 156358 489704 791782 960167 990512 804164 291547 -437585 -984702 -986628 -515905
35602e15905M73023J27640l1197K73730O39259M32377l52709r53995p23309M7728
$$ -515905 -42882 84758 53561 327291 966550 1398927 1046218 92223 -631086 -583358
35592e83358M77055J99870k35936j81587K61833M85808K34738j52885k93930j83298
$$ -583358 -106303 93567 -142369 -323956 -62123 423685 658423 505538 211608 28310
35582B8310j4003J12461J60506P4999j11134k24660j47991K4998J25732J15182
$$ 28310 14307 126768 287274 362273 251139 26479 -121512 -96514 29218 144400
35572A44400P4972P9373J38649J95662J50259k5400j98930k27878j78795k26935
$$ 144400 219372 298745 437394 633056 783315 757915 558985 331107 152312 -74623
35562g4623l54897l73990k49863j32717k6118K33725N54743N35781P7345l22875
$$ -74623 -429520 -803510 -1053373 -1186090 -1212208 -978483 -423740 112041 189386 -133489
35552a33489k33192P0194O2532j85098j72701J40074K35373r7883l82509j77316
$$ -133489 -366681 -296487 -233955 -419053 -591754 -451680 -216307 -314190 -696699 -874015
35542h74015K78831M66747K88404K9749j16710j39904j4743K17256K99508N8105
$$ -874015 -595184 -128437 159967 189716 73006 -66898 -81641 135615 435123 493228
35532D93228k30349j50222J98807K78706q4105m11665k93691J5398O0204q7649
$$ 493228 262879 112657 311464 590170 506065 94400 -199291 -183893 -123689 -211338
35522b11338l9028J73326J35638j79255k79919K7976K44645n2361m88303m25375
$$ -211338 -250366 -77040 58598 -120657 -400576 -372600 -127955 -180316 -668619 -1093994
35512a093994Q5317M23598L06091L4468q7518n3535J16744M08660N27317J45272
$$ -1093994 -1008677 -585079 -278988 -244520 -332038 -385573 -268829 139831 667148 812420
35502H12420m49268n44542m9337K77816k9848m16631k25820K24966K03500j89843
$$ 812420 363152 -181390 -230727 47089 17241 -399390 -625210 -400244 -196744 -386587
35492c86587j72869M29960Q52826M86797l03524p14732m49982J01571L72985J49467
$$ -386587 -559456 -129496 723330 1210127 906603 191871 -258111 -156540 216445 365912
35482C65912k56132l24443N4637M06241L02276m8107j63674j8440M7486k7772
$$ 365912 109780 -214663 -160026 246215 548491 500384 336710 318270 365756 337984
35472C37984r929Q9508K0880j67371j72544l9732j13959l22182j71813L51484
$$ 337984 328055 417563 438443 271072 98528 58796 -55163 -377345 -549158 -197674
35462a97674N68759J16967m40931m37553j8353K32892J66576O2792M7753q340
$$ -197674 371085 488052 47121 -390432 -408785 -175893 -9317 53475 101228 92888
35452I2888j66654l33749l79773j72867K76998O12223M35994n7576k39453J6110
$$ 92888 -73766 -407515 -787288 -960155 -683157 -70934 365060 307484 68031 84141
35442H4141J48725r4544k12075Q4950K39765j68446n38423j84914M45296M77415
$$ 84141 232866 138322 -73753 11197 250962 82516 -455907 -640821 -195525 281890
35432B81890N6294p686K74206J37307m71960p20075l11978N5333l7621q0015L05887
$$ 281890 338184 330498 604704 742011 270051 -450024 -762002 -706669 -744290 -824305 -518418
35421e18418O10760L27188j92947l71539k39919p5144J75546N10836N03982j9240
$$ -518418 92342 419530 226583 -144956 -384875 -460019 -284473 226363 730345 711105
35411G11105m31170j35476M59541N30757P9900j84489l745J75481O6264n4185
$$ 711105 279935 144459 604000 1134757 1214657 1030168 1026423 1201904 1268168 1213983
35401A213983R2747L95485O59235Q28621P70068K73962n26441j079612r88938
$$ 1213983 1306730 1702215 2361450 3190071 3960139 4234101 3707660 2628048 1639110
35392A639110m62160l2760J4012j80947l23707k91027j90836j46104r8629N6762
$$ 1639110 1176950 1144190 1158202 977255 653548 362521 171685 25581 -73048 -16286
35382a6286K04313J26399q8401r5214J26103J37805k51270n56726l06387J83589
$$ -16286 188027 314426 226025 130811 256914 394719 143449 -413277 -719664 -536075
35372e36075K55182q9598k40226M1958L16853K27131O221O149J52824J51862m8240
$$ -536075 -280893 -370491 -610717 -568759 -251906 -24775 -18554 -12405 140419 292281 244041
35361B44041k48167k74981j05016J41941K44851Q6537j36353j13700J27557K19040
$$ 244041 -4126 -279107 -384123 -242182 2669 89206 -47147 -160847 -33290 185750
35351A85750k7412l44287l76063j15475J55080K02270K8950j51367r7046J71692
$$ 185750 158338 -185949 -562012 -677487 -522407 -320137 -291187 -442554 -539600 -367908
35341c67908L14359J06161j66207p7101K38450K24021k02444m25129l6748N16580
$$ -367908 -53549 52612 -113595 -190696 47754 271775 69331 -355798 -392546 124034
35331A24034N59683P9637m11473o00198n26126k58428J16274L40271K56695J10119
$$ 124034 683717 763354 351881 -248317 -774443 -1032871 -916597 -576326 -319631 -209512
35321b09512J69026K23661m3102l45012r7429N71571Q13407K50026m71944o34792
$$ -209512 -40486 183175 140073 -204939 -302368 269203 1082610 1332636 860692 225900
35311B25900l72404k03817j58428N2020L37300L47425J21054J2205L5754j32340
$$ 225900 -146504 -350321 -508749 -456729 -119429 227996 349050 361255 397009 264669
35301B64669m80623n61515k02967J87419K44288J34126J63227K74988K49626J12659
$$ 264669 -215954 -777469 -980436 -793017 -548729 -414603 -251376 23612 273238 385897
35291C85897K6446o248m7322l7298K6920n1086l32106m83619k16327K04553K91774
$$ 385897 412343 406095 358773 321475 348395 297309 -34797 -518416 -734743 -530190 -238416
35280b38416N0313q8909J5486O1031q8990j37611J16749L93398L42944N9687j00133
$$ -238416 -188103 -277012 -261526 -200495 -289485 -427096 -310347 83051 425995 485682 385549
35269C85549k3678Q9620N2853j15372k59193k24952l663K02599J68397n9647k06141
$$ 385549 361871 451491 504344 388972 129779 -95173 -98836 103763 272160 212513 6372
35258F372j40867j3123L8270O6417J09353O4918o8102p7493J20254K51083N9591
$$ 6372 -134495 -147618 -109348 -42931 66422 131340 63238 -14255 105999 357082 416673
35247D16673k59134k96769J337K91828L11990J41385k1529j18047k01291k92062
$$ 416673 157539 -139230 -137893 153935 465925 607310 585781 467734 266443 -25619
35237b5619l33230k44972k6728J80823K05029N1597p8422k4419J67372L29736
$$ -25619 -358849 -603821 -630549 -449726 -244697 -193100 -271522 -295941 -128569 201167
35227B01167L15733P2294k58082l46184m3714K74465R0607m77532p09172k61703
$$ 201167 516900 589194 331112 -15072 -58786 215679 306286 -171246 -880418 -1142121
35217a142121L34982M52000J84341L23k2172q6254j18041P5594K77440J13106
$$ -1142121 -807139 -355139 -170798 -170475 -192647 -278901 -396942 -321348 -43908 69198
35207F9198k43816k38626J74898M10845J32342k88384l83370k00415o5926r5879
$$ 69198 -174618 -413244 -238346 172499 304841 16457 -366913 -567328 -633254 -729133
35197g29133j68726j27642J26486N01430O31249K43747l60110n73499k82466K8025
$$ -729133 -897859 -1025501 -899015 -397585 233664 477411 117301 -456198 -738664 -710639
35187g10639M2551p422J00652J74168M2922o9968K7256J06218n6065k21803q1737
$$ -710639 -668088 -675510 -574858 -400690 -357768 -427736 -400480 -294262 -350327 -572130 -653867
35176f53867K06387K98706K16207J78224J39825l1567j47451N209J40834j53214
$$ -653867 -447480 -148774 67433 245657 385482 353915 206464 211673 352507 199293
35166A99293o13745n35662J26230N57268K33670l11854k81583K62996N74950K86592
$$ 199293 -414452 -950114 -823884 -266616 -32946 -344800 -626383 -363387 211563 498155
35156D98155k15499m33585l23998j25159J9588P1453k7035k32807k89708n739
$$ 498155 282656 -150929 -474927 -600086 -580498 -509045 -536080 -768887 -1058595 -1064334
35146a064334L90159M45489R4617k05899j02387J67283J77408k1327l7940J73308
$$ -1064334 -674175 -228686 -134069 -339968 -442355 -275072 -97664 -118991 -156931 16377
35136A6377K43599M3387q9380M5306J46160l4158j82113P9701M73347L80250k24628
$$ 16377 259976 303363 213983 259289 405449 371291 189178 268879 742226 1122476 897848
35125H97848o69903m72014R9284M60202L74544J5483l51657n28086l91936J4903
$$ 897848 227945 -244069 -144785 315417 689961 705444 353787 -174299 -566235 -551332
35115e51332M24379N01388J35336m05435o44019l38310K09513M44309K34393K7495
$$ -551332 -126953 374435 509771 104336 -539683 -877993 -668480 -224171 10222 37717
35105C7717J66074L43950R9163l85038m89753j11825J62229m4478l61447l05525
$$ 37717 203791 547741 646904 261866 -227887 -339712 -177483 -221961 -583408 -888933
35095h88933m11J29240N6304Q6279K67142L15464J02933j50462k09060p8003J07991
$$ -888933 -889344 -760104 -703800 -617521 -350379 -34915 68018 -82444 -291504 -369507 -261516
35084b61516K34383K25250R8907J408J7290P722j50425k58737m4977L27199L89920
$$ -261516 -27133 198117 297024 298432 315722 323444 173019 -85718 -130695 196504 586424
35073E86424O9857j69984n4723P4016j32982l87064j99580K76983M03432l313
$$ 586424 656281 486297 431574 505590 372608 -14456 -214036 62947 466379 463066
35063D63066m18434l89819q8982J14936K12660L75861N11503L59063q5464n22568
$$ 463066 44632 -345187 -434169 -319233 -106573 269288 780791 1139854 1054390 531822
35053E31822o70149m52999J5831M43509M69014K2987m72890n07059p5977L23133
$$ 531822 -138327 -591326 -575495 -131986 337028 360015 -112875 -619934 -695911 -372778
35043c72778L02112j5907k38806j62089J00598L09247L11543J24003j08367k21888
$$ -372778 -70666 -86573 -325379 -487468 -386870 -77623 233920 357923 249556 27668
35033B7668j42706O3614K24578J95924K6816p8506n1422p5300k26620j95460K52534
$$ 27668 -115038 -51424 173154 369078 395894 317388 265966 190666 -35954 -231414 21120
35022B1120O73636L94609l91476o91789j58002K97609j10074p50144n38093L26698
$$ 21120 694756 1089365 697889 6100 -151902 145707 35633 -714511 -1252604 -925906
35012i25906O71689J91076j88330J11040M83867K75994j98938l33607j67395m3845
$$ -925906 -254217 -63141 -251471 -140431 343436 619430 420492 86885 -80510 -124355
35002a24355O8555K85852L29113k6521l99924l09130P2838K32732J12597L0107
$$ -124355 -55800 230052 559165 532644 132720 -176410 -103572 129160 241757 271864
34992B71864M5417k1761j20543n6021Q8531J03387O9823J51872J68611r9359l73258
$$ 271864 317281 295520 174977 118956 207487 310874 380697 532569 701180 601821 228563
34981B28563k40491J01077J16134j50239j47899J82172K57304j37966m33920j86786
$$ 228563 -11928 89149 205283 55044 -92855 89317 346621 208655 -225265 -412051
34971d12051K32864K87090Q5256N3177J67036O4234k70352m33924k05687J56328
$$ -412051 -179187 107903 193159 246336 413372 477606 207254 -226670 -432357 -276029
34961b76029K88625J54845k4j3969j222j34933l07501k07646J80825M12146J57729
$$ -276029 12596 167441 167417 153448 152226 17293 -290208 -497854 -317029 95117 252846
34950B52846k71867l51331j14711k6701j65908j21257K19696L90766J13167k00634
$$ 252846 -19021 -370352 -485063 -511764 -677672 -798929 -579233 -188467 -75300 -275934
34940b75934r7453J96923J82617j00314j93658J424J06268o5812k00295q688K81080
$$ -275934 -373387 -176464 6153 -94161 -287819 -286395 -180127 -245939 -446234 -454922 -173842
34929a73842K37746j24874l12912j9736L97771L42610j87307n21137k16151K98650
$$ -173842 63904 -60970 -373882 -393618 4153 346763 159456 -361681 -577832 -279182
34919b79182L27417r3053l10561q0275J42341L9444o5911J31539K98409L602m81363
$$ -279182 48235 -44818 -355379 -435654 -293313 -253869 -319780 -188241 110168 113770 -367593
34908c67593n02582J3972M65224M22236J08544n1717K8909J72950K59435K72483
$$ -367593 -870175 -856203 -390979 31257 139801 88084 116993 289943 549378 821861
34898H21861J85471k2165k71708m06530l24560r0762R1163P8956l1854l7896N2843
$$ 821861 1007332 985167 713459 306929 -17631 -108393 -17230 61726 29872 -8024 44819
34887D4819J3839k07593l15882p5667K91576L79998J47435r7706j85672k32058
$$ 44819 58658 -148935 -464817 -540484 -248908 131090 278525 180819 -4853 -236911
34877b36911k82452j57558K04175N18627M83344J71277j03417j94572j86803j32931
$$ -236911 -519363 -676921 -472746 45881 529225 700502 597085 402513 215710 82779
34867H2779J2021J83568J91953J6976j01485l0829K382k16173m31950k19108L04600
$$ 82779 94800 278368 470321 487297 385812 354983 357365 141192 -290758 -509866 -205266
34856b05266N17655J79785j80446n5183K74805K10654k21963m61444l04298j12163
$$ -205266 312389 492174 311728 256545 531350 742004 520041 58597 -245701 -357864
34846c57864j09867o6082J62132K86515O4434k74373l66960j88409N5200K27194
$$ -357864 -467731 -533813 -371681 -85166 -20732 -295105 -662065 -850474 -795274 -568080
34836e68080K43537N3099j50332j9421L99401N62313J81274k75196k31669J60399
$$ -568080 -324543 -271444 -421776 -441197 -41796 520517 701791 426595 194926 355325
34826C55325L14560Q9876j55144k37468l08692l75381k21744J07251K46382Q9928
$$ 355325 669885 759761 604617 367149 58457 -316924 -538668 -431417 -185035 -95107
34816i5107j119K21589M70960L37628j29452n01135m68482r2584L09922M11986
$$ -95107 -96226 125363 596323 933951 804499 303364 -165118 -257702 52220 464206
34806D64206J50174j60779j51241J07781J60615j83316n28298m18863M4522L81845
$$ 464206 614380 453601 302360 410141 570756 387440 -140858 -559721 -515199 -133354
34796a33354L66388J84300M6580m0748j02316p8417Q739r467j95572l35869j94532
$$ -133354 233034 417334 463914 423166 320850 242433 251172 241705 46133 -289736 -484268
34785d84268J42358L48944K59414K4401j38454j78676j38239j8871J32576J35080
$$ -484268 -341910 7034 266448 290849 152395 -26281 -164520 -183391 -50815 84265
34775H4265j21567m23969m08468l2930L11325K60948p7615k72448q0397K99932
$$ 84265 -37302 -461271 -869739 -902669 -591344 -330396 -408011 -680459 -760856 -460924
34765d60924M70507K50232j61162m06155l34993j08199P1461K08524L79621M65764
$$ -460924 9583 259815 98653 -307502 -642495 -750694 -679233 -470709 -91088 374676
34755C74676K58672j65966m28386k94858L3654J97753J03397n1370p1235L2923
$$ 374676 633348 467382 38996 -255862 -222208 -24455 78942 27572 -43663 -10740
34745a0740R3576j6298k12034k55451n5975J74220K10116J39750J62944J86478
$$ -10740 82836 66538 -145496 -400947 -456922 -282702 -72586 67164 230108 416586
34735D16586j8566l05963k55750J38421L55213J04859k45640k72065r7736n9067
$$ 416586 398020 92057 -163693 -25272 329941 434800 189160 -82905 -180641 -239708
34725b39708j38705j29827n8497k6185R7524L85395N04995J54234l41328l93185
$$ -239708 -378413 -508240 -566737 -592922 -495398 -110003 394992 549226 207898 -185287
34715a85287q453K41177P7586j67944j46407O0839J98275J75317L5576j34797
$$ -185287 -193740 47437 125023 -42921 -189328 -128489 69786 245103 280679 145882
34705A45882k05130j31266o5735j12681r6664J21610K77823P8148k17814j27179
$$ 145882 -59248 -190514 -256249 -368930 -465594 -343984 -66161 11987 -205827 -333006
34695c33006K27646K47073j54468l56419k0776L62010K45280j78705l51607j26890
$$ -333006 -105360 141713 -12755 -369174 -389950 -27940 217340 38635 -312972 -439862
34685d39862K02857L56281K24668j40748m36537k97748J74065M11386J67861r7724
$$ -439862 -237005 119276 343944 203196 -233341 -531089 -357024 54362 222223 124499
34675A24499L2979K45013M3614l57513l39832J04496L33080M9224k77759j77303
$$ 124499 157478 402491 446105 88592 -251240 -146744 186336 235560 -42199 -219502
34665b19502J26647R9774l12097o08862l69055K64093P45558O87048K27595j47742
$$ -219502 -92855 6919 -305178 -914040 -1283095 -1019002 -273444 413604 641199 493457
34655D93457j41319P4911J38037n8598l02053l64480k33532n4540M8472P0285
$$ 493457 352138 427049 565086 506488 204435 -160045 -393577 -448117 -399645 -329360
34645c29360Q7012J38257J65174R9733j9546r1808p9973j6949N1517M1423j31972
$$ -329360 -242348 -104091 61083 160816 141270 49462 -30511 -47460 4057 45480 -86492
34634h6492l47725k84208J23946M19577J78755l15365m24313r1443J46794Q9466
$$ -86492 -434217 -718425 -594479 -174902 3853 -311512 -735825 -827268 -680474 -591008
34624e91008J24900L84485L79355j26211n43457l11608K21147L97115K72497L21095
$$ -591008 -466108 -81623 297732 171521 -371936 -683544 -462397 -65282 207215 528310
34614E28310M60782J96526m04813o84284l76904N1707J63006N4566k1150k7395
$$ 528310 989092 1185618 780805 96521 -280383 -228676 -65670 -11104 -32254 -59649
34604e9649J9295J35776J68359q7391m66453n43988k48557M7751J17975J13379
$$ -59649 -40354 95422 263781 176390 -290063 -834051 -1082608 -1034857 -916882 -803503
34594h03503J37174P5475k9552N9574K90307L04761P6464R430J90985J67459k13192
$$ -803503 -666329 -590854 -620406 -560832 -270525 34236 110700 120130 311115 478574 265382
34583B65382l94510k9928L18704N1256m30791l54869J27470J98932k25000l38646
$$ 265382 -129128 -159056 159648 210904 -219887 -574756 -447286 -248354 -473354 -812000
34573h12000J90692O25475L12869l03930l94439M0120K94366M7240l03014l57450
$$ -812000 -621308 4167 317036 13106 -381333 -341213 -46847 393 -302621 -660071
34563f60071k26155j65704j06017J68925N56392O71835L68231k4240j17480K8239
$$ -660071 -886226 -1051930 -1157947 -989022 -432630 239205 607436 583196 465716 493955
34553D93955M0030j80189k95614n8033K80424L02769r087l16899m15202l76079
$$ 493955 533985 353796 58182 149 280573 583342 574255 257356 -157846 -533925
34543e33925k61727k6797K54358L70412K80310J74588J22952o4090m52877p22214
$$ -533925 -795652 -822449 -568091 -197679 82631 257219 380171 316081 -136796 -859010
34533h59010n34853j9225L68904L83460J82363N3601J33071L38931M27074J88596
$$ -859010 -1393863 -1413088 -1044184 -660724 -478361 -424760 -291689 47242 474316 662912
34523F62912k48556m33005j21205L26909L78657O9473o9983J61369L30322O5130
$$ 662912 414356 -18649 -139854 187055 565712 635185 565202 726571 1056893 1122023
34513A122023l57799m46410k06714k1946j3032K6645J27642N0745k23845l36445
$$ 1122023 764224 317814 111100 89154 76122 102767 230409 281154 57309 -279136
34503b79136p1132K83377L32500R1673j44704k48206k86710k52484p7366J27403
$$ -279136 -350268 -66891 265609 357282 212578 -35628 -322338 -574822 -652188 -524785
34493e24785J41740k9825j38155m4175J24731K21218K54633K37286Q7129j62367
$$ -524785 -383045 -412870 -551025 -595200 -470469 -249251 5382 242668 329797 167430
34483A67430k52730j7720L11354L53179P6465j81704j99787j30199j83499k68471
$$ 167430 -85300 -103020 208334 561513 637978 456274 256487 126288 -57211 -325682
34473c25682j42333J78084L73959K21902j20455l12518k29215m9279L8030Q8790
$$ -325682 -468015 -289931 84028 305930 185475 -127043 -356258 -405537 -367507 -278717
34463b78717K72736N34685N51647J34107m30022o31980l59132m2279p3488k87888
$$ -278717 -5981 528704 1080351 1214458 784436 152456 -206676 -248955 -322443 -610331
34453f10331k56932N5618K71042J96833O4965O6598L0273j98779l82804k37780
$$ -610331 -867263 -811645 -540603 -343770 -278805 -212207 -181934 -380713 -763517 -1001297
34443a001297P0437J65343N1675N1711K23347K88782J58356P2117J17689M7830
$$ -1001297 -930860 -765517 -713842 -662131 -438784 -150002 8354 80471 198160 245990
34433B45990k34431m11459k30990Q5488K02148J50063J43957J71103R9313M28
$$ 245990 11559 -399900 -630890 -545402 -343254 -193191 -49234 121869 221182 221610
34423B21610K9546J22951J15999K5725n6496j83211l69040l88249j02178J92936
$$ 221610 251156 374107 490106 515831 459335 276124 -92916 -481165 -583343 -390407
34413c90407J31197j68487l11933k20523o8316J70286N49735O95532K12635m86509
$$ -390407 -259210 -427697 -739630 -960153 -1028469 -858183 -308448 387084 599719 113210
34403A13210n27230J45786O09646L14647j94265k69167q4893m9454k4111J87735
$$ 113210 -414020 -268234 341412 656059 461794 192627 107734 58280 34169 221904
34393B21904K11023k33298n53560j02252O15893N70112j68403n09193n1683L89335
$$ 221904 432927 199629 -353931 -456183 159710 729822 561419 52226 543 389878
34383C89878J91170j89138j67243M6658N4558K4852J76533J59828l07720p07135
$$ 389878 581048 391910 224667 271325 325883 350735 527268 687096 379376 -327759
34373c27759m17480K33117M33218J29024n2989M4582l7084l49231l03469K71445
$$ -327759 -745239 -512122 -78904 50120 -2869 41713 4629 -344602 -648071 -376626
34363c76626O63665L12577l29821m85968j19886K21693K78368K20099J30926r7993
$$ -376626 287039 599616 269795 -216173 -336059 -114366 164002 384101 515027 417034
34353D17034l98560m85839k38725J50196M07617L76383P3015k48581k36399J10146
$$ 417034 18474 -467365 -706090 -555894 -148277 228106 301121 52540 -183859 -73713
34343g3713L06705J4331l87027k89009K03972L68404o5029m95838l30780K03816
$$ -73713 232992 247323 -139704 -428713 -224741 143663 78634 -417204 -747984 -544168
34333e44168M72035L01378M0841m4257k2165m295M2001J42830K08494J44619l7240
$$ -544168 -72133 229245 270086 225829 203664 199369 241370 384200 592694 737313 700073
34322G00073k31474k99874j77744J5469O6966n0654j23262k2571P9832p06j24994
$$ 700073 468599 168725 -9019 6450 73416 22762 -100500 -123071 -43239 -43945 -168939
34311a68939l5720J93385K10752r6830m04464l62216k7148K41978K24495N1547
$$ -168939 -204659 -11274 199478 102648 -301816 -664032 -691180 -449202 -224707 -173160
34301a73160p336J13253K18794J47998M541k9396m454q8118j92341o7571J85248
$$ -173160 -180496 -67243 151551 299549 304090 274694 270240 182122 -10219 -77790 107458
34290A07458J31172k75802m48986j3566N26259M84744K9523j31526R7065J16132
$$ 107458 238630 -37172 -486158 -499724 26535 511279 540802 409276 506341 622473
34280F22473k88805n57751k76372J75009K52269J1284j56600j46447r3327j8140
$$ 622473 333668 -224083 -500455 -325446 -73177 -61893 -218493 -364940 -458267 -476407
34270d76407R9266J36888M5164J4026J44086K11169M3713j50708j49437j03380
$$ -476407 -377141 -240253 -195089 -181063 -36977 174192 217905 67197 -82240 -185620
34260a85620k00666k43789O164L19494L07463M7191q5303m3554o6151j30556J514
$$ -185620 -386286 -630075 -623911 -304417 3046 50237 -35066 -78620 -144771 -275327 -273813
34249b73813K40282K18153q4914k77684j90271q1390j04837m6992K22416M48347
$$ -273813 -33531 184622 99708 -177976 -368247 -449637 -554474 -601466 -379050 69297
34239F9297L57512K2648l03235m50504l34432J3607L28137L14491M0669j54855
$$ 69297 426809 449457 146222 -304282 -638714 -625107 -296970 17521 58190 -96665
34229i6665j45231o9179M3473K48614L24857j829m33285l47282K00687M41002
$$ -96665 -241896 -311075 -267602 -18988 305869 304040 -129245 -476527 -275840 165162
34219A65162R1782j95321J0343J61434k29361n83407j88629M59659L33053m33739
$$ 165162 256944 61623 71966 233400 4039 -579368 -767997 -308338 24715 -409024
34209d09024o63292O6784Q13150O84375j7080m40022k98597N9782K30823P0494
$$ -409024 -1072316 -1005532 -192382 491993 474913 34891 -263706 -203924 26899 97393
34199I7393k38682k78141J28873N27718L70202j07172j65227K57119M09113l8892
$$ 97393 -141289 -419430 -290557 237161 607363 500191 334964 592083 1001196 962304
34189I62304m43534k46949J76462K47392P4214J0872o7748l50552m72479q9381
$$ 962304 518770 271821 448283 695675 769889 780761 713013 362461 -110018 -199399
34179a99399L42223J85878k87859l07338J17031K45355j16266l41829j01926J49889
$$ -199399 142824 328702 40843 -266495 -149464 95891 -20375 -362204 -464130 -314241
34169c14241P4219J818J89807K44111j79931o45204m96290J76797O73834N95075
$$ -314241 -240022 -238204 -48397 195714 15783 -629421 -1125711 -948914 -275080 319995
34159C19995J82350j34487j82225q4555q0391k60505m12658k77211L2463J49978
$$ 319995 502345 367858 185633 101078 20687 -239818 -652476 -929687 -897224 -747246
34149g47246L5867M6984L03234M34310J93799j19500j78658j46481k72168l51634
$$ -747246 -711379 -664395 -361161 73149 266948 147448 -31210 -177691 -449859 -801493
34139h01493q4066L16401L90060J32585o2483k5944Q1627J59949K07642R1388
$$ -801493 -885559 -569158 -179098 -46513 -108996 -134940 -53313 106636 314278 405666
34129D05666k46813m54746j54520L91628N25811J06762l35361l85131j63646R3663
$$ 405666 158853 -295893 -450413 -58785 467026 573788 238427 -146704 -310350 -216687
34119b16687L32345M20686J39877l50291n17517j73224K51448L76075L53871L97878
$$ -216687 115658 536344 676221 325930 -191587 -364811 -113363 262712 616583 1014461
34109A014461L08194j05884n14137m70217r5427J06700j8758j56233o7957J07949
$$ 1014461 1322655 1216771 702634 232417 136990 243690 224932 68699 742 108691
34099A08691J32682j8607j69268j48180R063N0456j71451l86877j98819K66200
$$ 108691 241373 222766 53498 -94682 -85619 -35163 -206614 -593491 -792310 -526110
34089e26110L92521m7535m61758k23508M39755P63947M45974q9040l01158o3272
$$ -526110 -133589 -181124 -642882 -866390 -426635 337312 783286 694246 393088 329816
34079C29816L46072M98388J55986m28133p02116m82267j68155q9095l0423K37687
$$ 329816 675888 1174276 1330262 902129 200013 -282254 -450409 -539504 -569927 -332240
34069c32240L96859Q9052l59631l73017m3204Q2642k9918Q3034M42954N07464
$$ -332240 64619 153671 -205960 -578977 -622181 -539539 -569457 -486423 -43469 463995
34059D63995J06207k54097k33670j18638j66628j47910J12287L13215J92379k8174
$$ 463995 570202 316105 82435 -36203 -202831 -350741 -238454 74761 267140 238966
34049B38966p8056o5871j22109q3400R4032Q0204k50368m47272j58278K60163
$$ 238966 160910 95039 -27070 -110470 -16438 63766 -186602 -633874 -792152 -531989
34039e31989L13923J36507J22760J90878N1648j16120K7814K40676J6758m78806
$$ -531989 -218066 -81559 41201 232079 283727 167607 195421 436097 452855 -25951
34029b5951n72219j51364J99659J98474K04155L74442K88830k11036n26628j96659
$$ -25951 -598170 -749534 -549875 -351401 -147246 227196 516026 304990 -221638 -418297
34019d18297K75185J43412m02343n05974N8553N68873M16895j07727l53727j90716
$$ -418297 -143112 300 -402043 -908017 -849464 -280591 136304 28577 -325150 -515866
34009e15866J1205L2700K2242J12625J89858J44720P8587Q9633P0103o1904j12220
$$ -515866 -504661 -471961 -449719 -337094 -147236 -2516 76071 165704 235807 173903 61683
33998F1683J06279L65047K72290j04991l02668j90936j55980l83380m86977j84323
$$ 61683 167962 533009 805299 700308 397640 206704 50724 -332656 -819633 -1003956
33988a003956J53713J11583l2316K08000O00800M84696j32682n08698k59328J65265
$$ -1003956 -850243 -738660 -770976 -562976 37824 522520 389838 -118860 -378188 -212923
33978b12923K65156J25046J4761p7173j83611j14914J59257K87099O3806j74873
$$ -212923 52233 177279 192040 114867 -68744 -183658 -24401 262698 326504 151631
33968A51631p1719J67470J29009j45393l00717k60338k07696j30204J23777L95668
$$ 151631 79912 247382 376391 230998 -69719 -330057 -537753 -667957 -544180 -148512
33958a48512L21766o3970k76308n8309K54827K33466p7908l09412k77190j08772
$$ -148512 173254 109284 -167024 -225333 29494 262960 185052 -124360 -401550 -510322
33948e10322L5951J45252K55257L18756K43602K8872j85822k44287j50648o8696
$$ -510322 -474371 -329119 -73862 244894 488496 517368 331546 87259 -63389 -132085
33938a32085j09958j85927j41840J5966J29101J06262K5876j529K1450L0857L2756
$$ -132085 -242043 -427970 -569810 -553844 -424743 -318481 -292605 -294134 -272684 -241827 -209071
33927b09071Q5238J57671J24313l4617j31268j3334J63356J27246n9156m8628
$$ -209071 -123833 33838 158151 123534 -7734 -21068 142288 269534 210378 161750
33917A61750K02015K65836q0540l92274j98520J89014J07546l65996m70376L1145
$$ 161750 363765 629601 549061 156787 -41733 147281 254827 -111169 -581545 -550400
33907e50400M35466J77227l36002m08013m0014K89799M01629L87636J57159l33121
$$ -550400 -114934 62293 -273709 -681722 -721736 -431937 -30308 357328 514487 181366
33897A81366o18384k05704N52014P59413K17587l10327k51244J4889r5534m05499
$$ 181366 -437018 -642722 -90708 668705 886292 575965 324721 339610 244076 -161423
33887a61423l06912K40322O11694L85836j40332m08927k64627J1450J44312J21453
$$ -161423 -468335 -228013 383681 769517 629185 220258 -44369 -32919 111393 232846
33877B32846M9085l7373j24145j17211L5549J71309O9757j96520k91634p7580
$$ 232846 281931 244558 120413 3202 38751 210060 279817 83297 -208337 -285917
33867b85917J76329J76122j7420j58039j55913n5512J22113K89085K48967J202
$$ -285917 -109588 66534 49114 -108925 -264838 -320350 -198237 90848 339815 341017
33857C41017j24504P1222K92696J96181m0893m4417P9124n4360l60521l79564
$$ 341017 216513 287735 580431 776612 735719 691302 770426 716066 355545 -24019
33847b4019r5054J4630j63670j62992J97122M16960J51552j87192j34213P1757
$$ -24019 -119073 -104443 -268113 -431105 -233983 182977 334529 147337 13124 84881
33837H4881l192j84597m7511K57415K42895l9063p6909J89060K27463k04050o37967
$$ 84881 81689 -102908 -150419 106996 349891 310828 233919 422979 650442 446392 -191575
33826a91575n69629r3178L54450N17034L88011Q5613j40084o0611J89955K04768
$$ -191575 -761204 -854382 -499932 17102 405113 490726 350642 290031 479986 684754
33816F84754r6903k81755n4051K31599Q2738l31008l65348J43248N75526L52410
$$ 684754 587851 306096 252045 483644 566382 235374 -129974 13274 588800 941210
33806I41210k81077n91560l08264J06472J51618p5603j41288M2443J42485q301
$$ 941210 660133 68573 -239691 -133219 18399 -57204 -198492 -156049 -13564 -21865
33796b1865j22351O9011L44298K96219n2320k77818j57081R2179K08812K15305
$$ -21865 -144216 -75205 269093 565312 512992 235174 78093 170272 379084 594389
33786E94389K30935K18459R5821o5716j21076l0889J38378K84390K76577N2549
$$ 594389 825324 1043783 1139604 1073888 952812 921923 1060301 1344691 1621268 1673817
33776A673817k13756k31996L391J49484J4205j26531L0688K85742K20278j11749
$$ 1673817 1460061 1228065 1231456 1380940 1395145 1268614 1299302 1585044 1805322 1693573
33766A693573k22146P0116L73926L34204J05995q715n2618k12480l72252k61676
$$ 1693573 1471427 1541543 1915469 2249673 2355668 2346953 2294335 2081855 1709603 1447927
33756A447927N3511K07945O0516j41631j63407n2704O2219J63807K12316Q3571
$$ 1447927 1501438 1709383 1769899 1628268 1464861 1412157 1474376 1638183 1850499 1934070
33746A934070j86194l16153j54923M6923o763j73530o6488L08746M61462P6477
$$ 1934070 1747876 1431723 1276800 1323723 1316960 1143430 1076942 1385688 1847150 1923627
33736A923627m92564o01887q4718N47062O71675K19692k81823l04072J03629M06353
$$ 1923627 1431063 829176 744458 1291520 1963195 2182887 1901064 1596992 1700621 2106974
33726B106974K51799j12394k12947R468J93706J39832O0721J46151J96472m5810
$$ 2106974 2358773 2246379 2033432 2042900 2236606 2376438 2437159 2583310 2779782 2733972
33716B733972m02433m35479o4504L05245L15210N0422j87258k59732j88689J9778
$$ 2733972 2331539 1896060 1831556 2136801 2452011 2502433 2315175 2055443 1866754 1886532
33706A886532L00214L92347P8651m22921n77094j71481L66197M81329J75053q3063
$$ 1886532 2186746 2579093 2657744 2234823 1657729 1486248 1852445 2333774 2508827 2425764
33696B425764n4474n830j88395l74332k04276J87101K83996o1543l68930j94208
$$ 2425764 2371290 2365460 2177065 1802733 1598457 1785558 2069554 2008011 1639081 1444873
33686A444873K34911L49578M9261j86961j6508K85073K42459j46763m27264l00986
$$ 1444873 1679784 2029362 2078623 1891662 1875154 2160227 2402686 2255923 1828659 1527673
33676A527673L0254J83590O5875q9167n8655J11545J78227j2971l10516l61157
$$ 1527673 1557927 1741517 1807392 1718225 1659570 1771115 1949342 1936371 1625855 1264698
33666A264698j6189L95782L72883j32354n86486n17751j01720J22749j9482k15123
$$ 1264698 1248509 1644291 2017174 1884820 1298334 780583 678863 801612 782130 567007
33656E67007k16052j39475j19832k0626K70385N14217L93830q864k93017k56289
$$ 567007 350955 211480 91648 71022 341407 855624 1249454 1240590 947573 691284
33646F91284r1399n5636j43896j53901L6059L13459M32189K79635L0089o6309
$$ 691284 599885 544249 400353 246452 282511 595970 1028159 1307794 1337883 1271574
33636A271574l3716j11653l08134l07481O597K51392P8508k54653k56845L8967
$$ 1271574 1237858 1126205 818071 510590 517187 768579 847087 592434 335589 374556
33626C74556J76823M5030p259J44929J69677r2821k92642j45431J04242J35259
$$ 374556 551379 596409 589150 734079 903756 810935 518293 372862 477104 612363
33616F12363O6084J20235J34308j14036l59362j87305K29648L17654q605k28387
$$ 612363 678447 798682 932990 818954 459592 272287 501935 819589 810984 582597
33606E82597p3097Q5644n4570j70327J15430M98292L75755k07921n62713l30770
$$ 582597 509500 595144 540574 370247 485677 983969 1359724 1151803 589090 258320
33596B58320M5131L6480k04433j67636J69055L02218Q517k78908j15760K85327
$$ 258320 303451 339931 135498 -32138 136917 439135 447652 168744 52984 338311
33586C38311L89458J32449o1548R50L1929j50764k55359l4230K06971N2455l07513
$$ 338311 727769 860218 798670 799620 831549 680785 425426 391196 598167 650622 343109
33575C43109l11918J01113L90280K45807J4312P0994K19100P5840k65254l92491
$$ 343109 31191 132304 522584 768391 782703 853697 1072797 1148637 883383 490892
33565D90892k19066l0720L5218J21939K39955J50857j87405m15036k39599J40761
$$ 490892 271826 241106 276324 398263 638218 789075 601670 186634 -52965 87796
33555H7796L21835K15792N5534J9867Q6221J58253J36354m6869k79882k87108
$$ 87796 409631 625423 680957 700824 787045 945298 1081652 1034783 754901 467793
33545D67793p79K29579P3841k59845k78192J00086M69019N34639M00323K32983
$$ 467793 467014 696593 770434 510589 232397 332483 801502 1336141 1736464 1969447
33535A969447O7441L1681L21213P70677Q86054N73675M47553J055344K077304
$$ 1969447 2036888 2068569 2389782 3160459 4046513 4620188 5067741 6123085 8200389
33526H200389K637836K202122Q99177p47628k056348k438614j889036j110955
$$ 8200389 10838225 13040347 13939524 13191896 11135548 8696934 6807898 5696943
33518E696943p88377q52772p89978m64199k03941k07713l29239m10670m26122
$$ 5696943 4908566 4055794 3265816 2801617 2597676 2389963 2060724 1650054 1223932
33509A223932l25379r6406O6851j333j27623o9852M3004n9872k82697l42638k91082
$$ 1223932 898553 802147 868998 867665 740042 670190 713194 653322 370625 27987 -263095
33498b63095l29782k77951J41520O01101M92452n4019k58722R3265L40996P6938
$$ -263095 -592877 -870828 -729308 -128207 364245 310226 51504 144769 485765 562703
33488E62703k33129j34845P5476J997j21412N3966K77683J30432k21743l06156
$$ 562703 329574 194729 270205 272202 150790 204756 482439 612871 391128 84972
33478H4972r4698O4391M8655J7708L6384L8912K3026j2425j34277k67002j94852
$$ 84972 -9726 54665 103320 121028 157412 196324 219350 206925 72648 -194354 -389206
33467c89206M7247J59189J27976K91500O09902M99851k03222p65557n84415q6670
$$ -389206 -341959 -182770 -54794 236706 846608 1346459 1143237 377680 -206735 -293405
33457b93405M5825m7692J10428L09597M7564m10723l72748P9027K24357k2943
$$ -293405 -247580 -295272 -184844 124753 172317 -238406 -611154 -532127 -307770 -330713
33447c30713P683M91873P09189K00848m75830n70029j28787K44597K15108m9396
$$ -330713 -323030 168843 878032 1078880 603050 33021 -95766 148831 363939 314543
33437C14543k11270j02730J20511J27937j31403k63864J5510L85683L63315K2398
$$ 314543 103273 543 121054 248991 117588 -146276 -130766 254917 618232 640630
33427F40630j93162j65917j05334o6553j6282j37996m61835m76457J50618P44966
$$ 640630 447468 281551 176217 109664 93382 -44614 -506449 -982906 -832288 -87322
33417h7322M19602m84123p70248j58582M12018L57909J83480L32892M22356J27949
$$ -87322 332280 -151843 -922091 -1080673 -668655 -310746 -127266 205626 627982 755931
33407G55931j30076O671J64151k4514k40076j26006O9047P2327J33517M02770
$$ 755931 625855 632526 796677 772163 532087 406081 475128 547455 680972 1083742
33397A083742M43748N435l78201k35501M0201m7240j87276O5211L30688O3668
$$ 1083742 1527490 1532925 1154724 919223 959424 912184 724908 790119 1120807 1184475
33387A184475l50460j95876K70229K24348k52706k71266L34157O96046L12814
$$ 1184475 834015 638139 908368 1132716 880010 608744 942901 1638947 1951761
33378A951761k45664l36794r7093P5398J77608L39088M63609M80693M87082M01353
$$ 1951761 1706097 1369303 1272210 1347608 1525216 1864304 2327913 2808606 3295688 3697041
33368C697041q72m85895m17383K44485O32033J58247n48843n49936R078K06109
$$ 3697041 3696169 3210274 2792891 3037376 3669409 3827656 3278813 2728877 2737955 2944064
33358B944064j78690l94994j4192L73520J46297l45240l69904K3068J59090j32178
$$ 2944064 2765374 2370380 2356188 2729708 2876005 2530765 2160861 2183929 2343019 2210841
33348B210841l16151j42516o5054l58781n11705n4635N23584M08695k89955o85340
$$ 2210841 1894690 1752174 1687120 1328339 816634 761999 1285583 1694278 1404323 718983
33338G18983l88765J13392L58342M16708L73715O3165l95796m84188q7026J89086
$$ 718983 330218 443610 801952 1218660 1592375 1655540 1259744 775556 688530 877616
33328H77616p7044m57089l91679m7033R9663O8172J44496K17606K2478k23105
$$ 877616 800572 343483 -48196 -95229 4434 72606 217102 434708 457186 234081
33318B34081j20419J40453J7258m37577n63927j03047M08394M35711J19168q7399
$$ 234081 113662 254115 271373 -166204 -730131 -833178 -424784 10927 130095 42696
33308D2696m0248R5080J68228J14009r4370l38273l44321P008M30326M82409Q8870
$$ 42696 2448 97528 265756 379765 285395 -52878 -397199 -390191 40135 522544 611414
33297F11414l11441k68737Q8853J90598j71441m69694j75481L91940M68920l562
$$ 611414 299973 31236 120089 310687 139246 -330448 -505929 -113989 354931 351369
33287C51369k88347j4905K60965j0131n02902n81639k53567J2861Q1915J77773
$$ 351369 63022 48117 309082 298951 -203951 -785590 -1039157 -1026296 -944381 -766608
33277g66608L30771L40177J81104J5742r8526j73702j34826j0268k8722j94945
$$ -766608 -435837 -95660 85444 101186 2660 -171042 -305868 -316136 -344858 -539803
33267e39803j03279M03685P62755M31274k19749m02704p0105J32461o3075k63714
$$ -539803 -643082 -239397 523358 954632 734883 332179 262074 394535 331460 67746
33257F7746j97888p0619l2647O7461K38102K19866M041l1054K66594N09784L28585
$$ 67746 -130142 -200761 -233408 -165947 72155 292021 296062 265008 531602 1041386 1369971
33246A369971j06460l66843l14083j47112p4038j02154q1867Q1869K33183J09030
$$ 1369971 1263511 896668 582585 435473 361435 259281 177414 259283 492466 601496
33236F01496k26179l37457k5785L08908K31235r5186k47052k30008l14406m13718
$$ 601496 375317 37860 12075 320983 552218 457032 209980 -20028 -334434 -748152
33226g48152k24030J42373K66175J11543L2552J18108J07001l5890l1454J72113
$$ -748152 -972182 -829809 -563634 -452091 -419539 -301431 -194430 -230320 -261774 -89661
33216h9661K99474K45491J75826J07577r9690l21385k66712j3608R0002M1355
$$ -89661 209813 455304 631130 738707 639017 317632 50920 37312 127314 168669
33206A68669J16806K34173O5570k13256o8947L91291M03643k30205p28786n02232
$$ 168669 285475 519648 585218 371962 303015 694306 1097949 867744 138958 -363274
33196c63274K3431J94370M5933o1663r3343r6648J19420N19621N89382J08215
$$ -363274 -339843 -145473 -99540 -161203 -254546 -351194 -231774 287847 877229 985444
33186I85444l34352j90697J78459J55896q9670k577K85324J75804k77760l93868
$$ 985444 651092 460395 638854 794750 705080 702503 987827 1163631 885871 492003
33176D92003k5648J81471r7809l07275K9132M43581K24628m18638n90161k2468
$$ 492003 466355 647826 550017 242742 271874 715455 940083 521445 -68716 -91184
33166i1184N00188K56423l74279m54633J66202O47189L69227k26000l66199o3028
$$ -91184 409004 665427 291148 -163485 2717 649906 1019133 793133 426934 363906
33156C63906O5594j64252l03654r1167J64787J70261O8189N4320L9271m7169l1237
$$ 363906 429500 265248 -38406 -129573 35214 205475 273664 327984 367255 320086 288849
33145B88849J40777J93140j2665j52430O0635L49572K59286j36384l43619j74879
$$ 288849 429626 622766 610101 457671 518306 867878 1127164 990780 647161 472282
33135D72282L9180p127j74242j43076R8856K46271J31424q675J15270L39535K19172
$$ 472282 511462 504335 330093 187017 285873 532144 663568 654893 770163 1109698 1328870
33124A328870k52897n18887k77558J8247r3598k76903K9768N55396N25905o8218
$$ 1328870 1075973 557086 279528 297775 204177 -72726 -42958 512438 1038343 970125
33114I70125m09291j32283J93391Q8233j46624j17773J4162J1002L7650K02436
$$ 970125 560834 428551 621942 710175 563551 445778 459940 470942 508592 711028
33104G11028J97337j20951l27880j03741K01092J81296M6403J19936J73043r9020
$$ 711028 908365 787414 459534 355793 556885 738181 784584 904520 1077563 978543
33094I78543l78824k18176J26831J04140j55962n9950L97120N89574K59575j71063
$$ 978543 599719 381543 508374 612514 456552 396602 793722 1383296 1642871 1471808
33084A471808l57556m24351m61049k67009J45739L29279J6294m13222m06343O7179
$$ 1471808 1114252 689901 228852 -38157 107582 436861 453155 39933 -366410 -299231
33074b99231N53730O62853L62630j11484m38757m10131j18861J01718M6621j28089
$$ -299231 254499 917352 1279982 1168498 729741 319610 200749 302467 349088 220999
33064B20999j58507o6146r3675k55026k24137J48292M39877J53597m63776n99282
$$ 220999 62492 -3654 -97329 -352355 -576492 -428200 11677 165274 -298502 -897784
33054h97784j2636N38632L84700m8782O3286N96051O41531n2703o65845n13274
$$ -897784 -910420 -371788 12912 -35870 27416 623467 1264998 1212295 546450 33176
33044C3176O9380L89237L26410J74064L4343j39957k14992m1077K16525K47760
$$ 33176 102556 491793 818203 992267 1026610 886653 671661 630584 847109 1094869
33034A094869k871l11135m31052k65548O5014K68196J74300k9200q3548p1484
$$ 1094869 1091998 780863 349811 84263 149277 417473 591773 562573 479025 407541
33024D07541j99919l11756j05876K43040K65073k3543j41065L8486J53597R3078
$$ 407541 207622 -104134 -210010 33030 298103 274560 133495 171981 325578 418656
33014D18656J28986K17365j5436m10789k95196L39443O00895Q3348m32732k50130
$$ 418656 547642 765007 749571 338782 43586 383029 983924 1067272 634540 384410
33004C84410J57752O1148l03722k78327O3873J88256P4942Q7781K01866J20735
$$ 384410 542162 603310 299588 21261 85134 273390 348332 436113 637979 758714
32994G58714r4832j70094j40080j70262j45485N0829J91311J24951J30367L53939
$$ 758714 663882 493788 353708 183446 37961 88790 280101 405052 535419 889358
32984H89358L87481k3490l71554j50955K59603K03782j94046l33876j38330Q504
$$ 889358 1276839 1253349 881795 730840 990443 1194225 1000179 666303 527973 536477
32974E36477J6874O6510Q7300p8799k50841k14414j37422j66150m6100L06622
$$ 536477 553351 619861 707161 628362 377521 163107 25685 -140465 -186565 120057
32964A20057M00531k6149l91647j90188J09894p4735l43656o0403M13736L52740
$$ 120057 520588 494439 102792 -87396 22498 -52237 -395893 -456296 -42560 310180
32954C10180J2286J30705M98098L11128l17970n14430j57432L6805j12046o2078
$$ 310180 322466 453171 951269 1262397 944427 429997 272565 309370 197324 135246
32944A35246K32889J73840k64260l45625J53098N49970M02658P9124o2762j61215
$$ 135246 368135 541975 277715 -67910 85188 635158 1037816 1116940 1054178 892963
32934H92963k85137k23720l7258m3336j51023J0428K87109J80427j86762k16940
$$ 892963 607826 384106 346848 303512 152489 162917 450026 630453 443691 226751
32924B26751O4150O6795j92998q5624L66528L69601k53796o65097l30064K72506
$$ 226751 290901 357696 164698 79074 445602 815203 561407 -103690 -433754 -161248
32914a61248N84010O31071M59568q6672o75720n77434J60400N78383K34298j94643
$$ -161248 422762 1053833 1513401 1426729 751009 173575 333975 912358 1146656 952013
32904I52013j40453K1418j35380l12201j77231P794J3115J13058M00160L88177
$$ 952013 811560 832978 697598 385397 208166 215960 229075 342133 742293 1130470
32894A130470j49402o38861n33067n9867K92585M10359L02231j02605n29600m31807
$$ 1130470 981068 342207 -190860 -250727 41858 452217 754448 651843 122243 -309564
32884c09564J32375L95556K0234l84905k63873J13344K84126K80429K64878J56884
$$ -309564 -177189 218367 238601 -146304 -410177 -296833 -12707 267722 532600 689484
32874F89484N726Q3778K95826J86165k07958k85744P6101K65771J8708j51659
$$ 689484 695210 778988 1074814 1260979 1053021 767277 843378 1109149 1127857 976198
32864I76198L8749J53997j2089M6566N47822Q38548M13220k65774n29485l78692
$$ 976198 1014947 1168944 1156855 1203421 1751243 2589791 3003011 2737237 2207752 1829060
32854A829060j29259J08511J93916o9266l95669k41631J99858J57112l53001m34094
$$ 1829060 1699801 1808312 2002228 1932962 1537293 1295662 1495520 1652632 1299631 865537
32844H65537J01578L14414k03286n51952q4576N05341M54760J28003P9208J2855
$$ 865537 967115 1281529 1078243 526291 441715 947056 1401816 1529819 1609027 1621882
32834A621882l90045o01402j58545M07113M24132P4510j94577l96413m86315q6261
$$ 1621882 1231837 630435 471890 879003 1303135 1377645 1183068 786655 300340 214079
32824B14079O04311O72118l9781m49547M4085N78329L77340j0218L3901L9504
$$ 214079 818390 1490508 1450727 1001180 1045265 1623594 2000934 1990716 2024617 2064121
32814B064121l62795m08496M04124J110763Q06650K50929N57607J288607J260840
$$ 2064121 1701326 1292830 1696954 2807717 3614367 3865296 4422903 5711510 6972350
32805F972350M10328m45830r30271j053445o73936l4222P6909m03666m62206K56353
$$ 6972350 7382678 6936848 6006577 4953132 4279196 4244974 4321883 3918217 3456011 3712364
32795C712364P11074L25791m449K64349L12828j32539N8896J085198J340268M05614
$$ 3712364 4423438 4749229 4744780 5009129 5321957 5189418 5248314 6333512 7673780 8079394
32785H079394K86305J782232K602351J535059J229232L582899N738029M904485
$$ 8079394 8365699 10147931 12750282 14285341 15514573 19097472 24835501 29739986
32777B9739986L981842P024102J1807441J3684111J5534778K5875656M5186858
$$ 29739986 33721828 40745930 52553371 66237482 81772260 107647916 152834774
32770A52834774O0388045N6249754K9295649j0081291m4773135o0016176n2223096
$$ 152834774 213222819 269472573 298768222 288686931 243913796 183897620 131674524
32763A31674524l2571471j7733978j4095116j4366469j0739909n220652l524131
$$ 131674524 99103053 81369075 67273959 52907490 42167581 36946929 33422798
32756C3422798n020995m929610k686071j660126k503279k661827j599139j298158
$$ 33422798 28401803 23472193 20786122 19125996 16622717 13960890 12361751 11063593
32748A1063593j890472j403907J25655M48418p66336j347769n26843L5351m27344
$$ 11063593 9173121 7769214 7894869 8343287 7576951 6229182 5702339 5737690 5310346
32739E310346o61286j57564m6369n89907n65113J89053K56597o33277r38051j24250
$$ 5310346 4649060 4491496 4445127 3855220 3290107 3479160 3735757 3102480 2164429 2040179
32729B040179L45972k55887o38311q145M21183k73195r74445n11576L54642M06796
$$ 2040179 2386151 2130264 1491953 1483808 1904991 1631796 657351 145775 500417 907213
32719I07213l1954k2787K79891K22100l2946k4657P983k51167l58283P9284M81191
$$ 907213 875259 852472 1132363 1354463 1321517 1296860 1304843 1053676 695393 774677 1255868
32708A255868J75464m37787n51503k26618r2569k23715j81926J20227L43088L21326
$$ 1255868 1431332 993545 442042 215424 122855 -100860 -282786 -162559 180529 501855
32698E01855J87956O2674l617K2983L3667j05705j90297J17282N96269N77835
$$ 501855 689811 752485 748868 771851 805518 699813 509516 626798 1223067 1800902
32688A800902l8625n21256l68866M521M9243p6685L2373K32525R9011l10485n11196
$$ 1800902 1762277 1241021 872155 876676 925919 849234 881607 1114132 1213143 902658 391462
32677C91462k76434J29382L31976K10880n5403j83282r5704j8906j19036j87865
$$ 391462 115028 244410 576386 787266 731863 548581 452877 433971 314935 127070
32667A27070N474K25409R4470k11245j58981K65228M86448K31026j11094j76454
$$ 127070 132544 357953 452423 241178 82197 347425 833873 1064899 953805 777351
32657G77351j11367j36560j45913k3227P1083J7213j5652R9023J71519M290k62503
$$ 777351 665984 529424 383511 360284 431367 448580 432928 531951 703470 707760 445257
32646D45257l26871r2618K53116M08583K03004j85062l43866j35020R7718N4147
$$ 445257 118386 25768 278884 687467 890471 705409 361543 226523 324241 378388
32636C78388o9182O119J07535k0759j44156N6852K91531R1863k76533j60479L38195
$$ 378388 309206 315325 422860 402101 257945 314797 606328 698191 421658 261179 599374
32625E99374M63052O2363j78658P9806L29732J83146j4324O1499J12535j42374
$$ 599374 1062426 1124789 946131 1025937 1355669 1538815 1524491 1585990 1698525 1556151
32615A556151l76359k27522N1841K2698k65274m57743m14795j98546J25205L83097
$$ 1556151 1179792 952270 1004111 1026809 761535 303792 -111003 -309549 -184344 198753
32605A98753L30508L3185j39557q2949r3948k68225k72054L4493K72834J66607
$$ 198753 529261 562446 422889 339940 245992 -22233 -294287 -259794 13040 179647
32595A79647k115Q7267K68592K54409J17181L9309m0830j87860k35522j11241
$$ 179647 177532 264799 533391 787800 904981 944290 903460 715600 480078 368837
32585C68837l1971r3922p1848R2798P2151k41969m01788q6203L39902M01394K16530
$$ 368837 336866 242944 171096 263894 336045 94076 -307712 -393915 -54013 347381 563911
32574E63911J44829J48456L2496n6945N6289R7697k29165o00957m78998L5866
$$ 563911 708740 857196 889692 832747 889036 986733 757568 156611 -322387 -286521
32564b86521L55719K76063J08643M0879m5788j35632k1231K41650K97328J9322
$$ -286521 69198 345261 453904 494783 448995 313363 292132 533782 831110 850432
32554H50432k96341l58072j92579K5222J82127K18187J28811L26r6977j80773
$$ 850432 554091 196019 3440 28662 210789 428976 557787 558113 461136 280363
32544B80363k07445n0621J94586J73478j78226l67230l1827M04714K97389k31388
$$ 280363 72918 22297 216883 390361 212135 -155095 -186922 217792 515181 283793
32534B83793m80119k24038P7840J23290J34085K58058K52348J1666j45130k0573
$$ 283793 -196326 -420364 -342524 -219234 -85149 172909 425257 436923 291793 271220
32524B71220J08430N842r7347M2534K01442Q6007j13944l8053K12371K31379m6207
$$ 271220 379650 385492 288145 330679 532121 618128 504184 466131 678502 909881 863674
32513H63674l14445m26776n02467n21250k67225K33699O05237N90021L27205M6918
$$ 863674 549229 122453 -380014 -901264 -1168489 -934790 -329553 260468 587673 634591
32503F34591k00638l61374k51224J29625M04744K52151j23132k54391o3697P2362
$$ 634591 433953 72579 -178645 -49020 355724 607875 484743 230352 166655 239017
32493B39017r2718l28558k72957Q1321L87477L43083k061l01131k56265N9003
$$ 239017 146299 -182259 -455216 -373895 13582 356665 354604 53473 -202792 -143789
32483a43789K70526J54461r2578j63973q1594q0518j57018p6884J55554K16441
$$ -143789 126737 281198 188620 24647 -56947 -137465 -294483 -371367 -215813 628
32473F28j6536k08951o0181K35791L04025J48078O9981J56523J82992J3228j89881
$$ 628 -15908 -224859 -285040 -49249 254776 402854 472835 629358 812350 825578 635697
32462F35697k13725o6543O9873M8098j25875l18331l91958l16252j40124R4079
$$ 635697 421972 355429 425302 473400 347525 29194 -362764 -679016 -819140 -725061
32452g25061L10898L50563J58743j9017Q5645K99860J93398k04967l33424M5804
$$ -725061 -414163 -63600 95143 76126 161771 461631 655029 450062 116638 162442
32442A62442L87650J38236m31336o48447l99409j23040l3891P0915K85843M16888
$$ 162442 550092 688328 256992 -391455 -790864 -913904 -947795 -876880 -591037 -174149
32432a74149L68451K65955J47471o5238k57899j95571M2276R9796j03727k51104
$$ -174149 194302 460257 607728 542490 284591 89020 131296 231092 127365 -123739
32422a23739j56757k8498n0940p3216P7370K61119K38366K5347j51195j29934
$$ -123739 -280496 -308994 -359934 -433150 -355780 -94661 143705 169052 17857 -112077
32412a12077O7154K77409K99972P6892k07856l27916k74046j68872k0440K09711
$$ -112077 -44923 232486 532458 609350 401494 73578 -200468 -369340 -389780 -180069
32402a80069L74224K62845n6961k78806k35004k5899J75377K33182O4212k14712
$$ -180069 194155 457000 400039 121233 -113771 -139670 35707 268889 333101 118389
32392A18389k85702m5745J59099M0265j34041J0256K52504J24820k09816j50593
$$ 118389 -167313 -213058 -53959 -13694 -147735 -137479 115025 239845 30029 -120564
32382a20564K89852M08351n3497m48313k24248K56200L32630p477k59430j48428
$$ -120564 169288 577639 524142 75829 -148419 107781 440411 432934 173504 25076
32372B5076J53856L46532K54779n6426k76782j68277P5224Q7137q6532r9770K7697
$$ 25076 178932 525464 780243 723817 447035 278758 353982 441119 354587 254817 282514
32361B82514o1687l28467l12201J2785J04989j65322k05308K34120N01491J26688
$$ 282514 220827 -107640 -419841 -407056 -302067 -467389 -672697 -438577 62914 189602
32351A89602l11269j30288L09247K62660j27383j65098J55474K19776q6191k67635
$$ 189602 -121667 -251955 57292 319952 192569 27471 182945 402721 316530 48895
32341D8895j69941j44222k37236p3201L25946M07242P171l08999j32025J85481
$$ 48895 -121046 -265268 -502504 -575705 -249759 157483 164654 -144345 -276370 -90889
32331i0889J60626j02291k16615j33373o2686n4935j2529N8443Q2187P6567R3804
$$ -90889 69737 -32554 -249169 -382542 -445228 -500163 -512692 -454249 -372062 -295495 -201691
32320b01691J05555P1309J6249k6224l7199K7750J50080J57466o1894k91498k12219
$$ -201691 -96136 -24827 -8578 -34802 -72001 -44251 105829 263295 201401 -90097 -302316
32309c02316J03232K38113L4607j74757o8558K18730L32851J57547j44986l70764
$$ -302316 -199084 39029 73636 -101121 -169679 49051 381902 539449 394463 23699
32299B3699l75640r8798L17251N27090K96574j97575n02974l35146J60603N62669
$$ 23699 -351941 -450739 -133488 393602 690176 492601 -10373 -345519 -184916 377753
32289C77753N49485J58383k78734m44854k87738J260J79845J17263j25841l18954
$$ 377753 927238 1085621 806887 362033 74295 75555 255400 372663 246822 -72132
32279g2132k57249n26J80408J46347L5976o64j8160q3669p3854J15487L17032
$$ -72132 -329381 -329907 -149499 -3152 32824 32160 14000 -69669 -143523 -28036 288996
32268B88996L04502J38238L1688k1232j76741l63893l28749p6896P3696j8560
$$ 288996 593498 731736 763424 742192 565451 201558 -127191 -204087 -130391 -148951
32258a48951r0158R9033L66880L69092R3989j46076j43842J853J00706R0036k074
$$ -148951 -239109 -140076 226804 595896 689885 543809 399967 401820 502526 592562 590488
32247E90488j40772k33313j33648J39765K79675J2292m57369n88310j92665K83798
$$ 590488 449716 216403 82755 222520 502195 514487 57118 -531192 -723857 -440059
32237d40059L56407J10923o5678j08198k10537l15090j80802Q9563J35291j3296
$$ -440059 -83652 27271 -38407 -146605 -357142 -672232 -853034 -763471 -628180 -641476
32227f41476N3125L47099L52455q2166l65558r1519K56471Q8354l13563k90207
$$ -641476 -588351 -241252 111203 29037 -336521 -428040 -171569 -83215 -396778 -686985
32217f86985Q6709J83812r9423k05285J02975L76492K60743J2675k2331N6927
$$ -686985 -600276 -416464 -515887 -721172 -618197 -241705 19038 31713 9382 66309
32207F6309J3366p9150m1146K0355j18684l57886l22123J12146N49532M82462
$$ 66309 79675 525 -40621 -20266 -138950 -496836 -818959 -706813 -157281 325181
32197C25181p3926n29574m22689j0633J28489k5267O4198N36150P74864L33002
$$ 325181 251255 -278319 -701008 -711641 -583152 -608419 -544221 -8071 766793 1099795
32187A099795l27998n27247l47310l01527l72915j39853L25797M84811K35898
$$ 1099795 771797 244550 -102760 -404287 -777202 -917055 -591258 -106447 129451
32178A29451L7072N2683o9077l97522m49669l7352K85940N9629l45435l14108
$$ 129451 166523 219206 150129 -247393 -697062 -734414 -448474 -388845 -734280 -1048388
32168a048388R8259L44995K05982m3553j18697N522K04036K95247J35833j63531
$$ -1048388 -950129 -605134 -399152 -442705 -561402 -555880 -351844 -56597 79236 -84295
32158h4295k74207r2179P0237l7572j80183o033L49645M17319Q6442k21065j35828
$$ -84295 -358502 -450681 -380444 -418016 -598199 -604232 -254587 162732 249174 28109 -107719
32147a07719J76939K73858L2027j99012q0492K20670K26747j49590l98683j23429
$$ -107719 69220 343078 375105 176093 95601 316271 543018 393428 -5255 -128684
32137a28684L27624L34575p2582k92617j04300O3125o9116j66251Q4837L97267
$$ -128684 198940 533515 460933 168316 64016 127141 58025 -108226 -23389 373878
32127C73878L48556L3254j73056j94723j81749j15883P7842K28479J46164j2610
$$ 373878 722434 755688 582632 387909 206160 90277 168119 396598 542762 530152
32117E30152o82O6650p1333l04637l06242r5185K1967M258P7574K01584P0186
$$ 530152 529470 596120 524787 220150 -86092 -181277 -159310 -155052 -77478 124106 194292
32106A94292k73138l55225r355K87913J14145k58452k95497J556J50386p6496
$$ 194292 -78846 -434071 -443426 -155513 -41368 -299820 -595317 -593761 -443375 -519871
32096e19871l57895k93777J01729M70140N31630L50909K08618K37543K44488j0280
$$ -519871 -877766 -1171543 -1069814 -599674 -68044 282865 491483 729026 973514 963234
32086I63234l98765m98076j48449K71881K96680n0074l24736k23416J35661M47975
$$ 963234 564469 66393 -82056 189825 486505 436431 111695 -111721 23940 471915
32076D71915N31823L80954Q9041j94415l26595k67672j07324k131q7384l58807
$$ 471915 1003738 1384692 1473733 1279318 952723 685051 577727 575596 488212 129405
32066A29405n80102m38809N6451M44684K98371k12171m91397k54174J84114M02380
$$ 129405 -450697 -889506 -833055 -388371 -90000 -302171 -793568 -1047742 -863628 -461248
32056d61248L55011K20466O4669j01129j41720L2557K36372K16468J6249j03894
$$ -461248 -106237 114229 178898 77769 -63951 -31394 204978 421446 437695 333801
32046C33801m9794L3519K6104m9293j36785j74090o4935J74334L21768K23177
$$ 333801 284007 317526 343630 294337 157552 -16538 -81473 92861 414629 637806
32036F37806M6557L957k5309k32029l88321j24230L50752L93165r6424m42853
$$ 637806 684363 688320 663011 430982 42661 -81569 269183 662348 565924 123071
32026A23071k02109J73604Q1986l02543l78892o5234J84638J43851L6189K9810
$$ 123071 -79038 94566 176552 -125991 -504883 -570117 -385479 -241628 -205439 -175629
32016a75629k010j35978j94805k7698K40127L51341J87813j28195l20245j97282
$$ -175629 -177639 -313617 -508422 -536120 -295993 55348 243161 114966 -205279 -402561
32006d02561J06788K35948M7070k10301k59134j36024j3704P8797J42394N6756
$$ -402561 -295773 -59825 -12755 -223056 -482190 -618214 -631918 -553121 -410727 -353971
31996c53971j79273k72967k1870L10272L40874J31890L9108J27538J42888R000
$$ -353971 -533244 -806211 -828081 -517809 -176935 -45045 -5937 121601 264489 273489
31986B73489n4669N4485J40451L0173j69561k24787m2540K34198L24791Q8100
$$ 273489 218820 273305 413756 443929 274368 49581 7041 241239 566030 654130
31976F54130k33459k34826Q9116K81546Q8534j66871j39477j781m9133j45392
$$ 654130 420671 185845 274961 556507 645041 478170 338693 336912 287779 142387
31966A42387m8743N1205j03462k31188P0436N08246M28367j26064m42242k33197
$$ 142387 93644 144849 41387 -189801 -119365 388881 817248 691184 248942 15745
31956A5745L7546K8709j4692J13416J61625n6754k69067k02662k284J00722J47786
$$ 15745 53291 82000 67308 180724 342349 285595 16528 -186134 -188418 -87696 60090
31945F0090K20399K00856J4496j76813k12542j22313Q575J01295K4289j94279
$$ 60090 280489 481345 495841 319028 106486 -15827 -7252 94043 118332 -75947
31935g5947j82919K82547P03694L91526m36270q04454l48431K08915J98247j07238
$$ -75947 -258866 23681 727375 1118901 682631 -121823 -470254 -261339 -63092 -170330
31925a70330j29257J27581K93092K44100O9595j66616k87060m7082L89045M89334
$$ -170330 -299587 -172006 121086 365186 434781 268165 -18895 -65977 323068 812402
31915H12402J48043r9396M1652J45435j28392l88431k05539J15986P0366k17798
$$ 812402 960445 861049 902701 1048136 919744 531313 325774 441760 512126 294328
31905B94328l10685k03831j52940j15933M5076J39488q174j24730M4420J90809
$$ 294328 -16357 -220188 -373128 -489061 -443985 -304497 -312671 -437401 -392981 -202172
31895b02172m2773l55839k37330J86812L97169K92011J19559j03739m28690n15629
$$ -202172 -244945 -600784 -838114 -651302 -254133 37878 157437 53698 -374992 -890621
31885h90621q1866M26352L73958m8135j46362J03346Q4884l11225m81891j52068
$$ -890621 -972487 -546135 -172177 -220312 -366674 -263328 -178444 -489669 -971560 -1123628
31875a123628K24466K95869K74965L29031K20349j28699l22548r2912K67260L67620
$$ -1123628 -899162 -603293 -328328 703 221052 92353 -230195 -323107 -55847 311773
31865C11773K14537J6619j21632j38529j7023M1663j63837l97332k38566J83650
$$ 311773 526310 542929 421297 282768 265745 307408 143571 -253761 -492327 -308677
31855c08677K84661l7180j95803J12191L82047J39974k52435j54438L66919O36856
$$ -308677 -24016 -61196 -256999 -144808 237239 377213 124778 -29660 337259 974115
31845I74115K76787m06401q36299o85187p3867N28407O79554L62656p0727l35851
$$ 974115 1250902 844501 8202 -676985 -750852 -222445 457109 819765 749038 413187
31835D13187l86274k13402J55092M25872K37278k75956n14732j93049K89879M49113
$$ 413187 26913 -186489 -31397 394475 631753 355797 -158935 -351984 -62105 387008
31825C87008L06195J42308K1321j39259k95192l54364l21059j73015J48621M60228
$$ 387008 693203 835511 856832 717573 422381 68017 -253042 -426057 -277436 182792
31815A82792L79969j11161m80736l11167J32524L13004J36674q1361j49819j32570
$$ 182792 562761 451600 -29136 -340303 -207779 105225 241899 160538 10719 -121851
31805a21851q5130L817P7885P4914N1496N7725J1869j17146j63379q631J86903
$$ -121851 -206981 -203164 -125279 -50365 1131 58856 70725 -46421 -209800 -218431 -31528
31794c1528K16241J25051N1497n8267k96150m87232l49676P9654M33274M32580
$$ -31528 184713 309764 361261 302994 6844 -480388 -830064 -750410 -317136 115444
31784A15444J52011j18366j52195L2776J97853J56176K9652O0218J67486J0435
$$ 115444 267455 149089 -3106 29670 227523 383699 413351 473569 641055 651490
31774F51490m08184n88536k40138K19280K45235m1656j05842J49216K98548J24780
$$ 651490 243306 -345230 -585368 -366088 -120853 -162509 -268351 -119135 179413 304193
31764C04193p9981m5332O4245l2079k82334l91143k16230Q1020K23849R7270j28808
$$ 304193 224212 178880 243125 211046 -71288 -462431 -678661 -597641 -373792 -276522 -405330
31753d05330j79761k3493Q0753j0918o0069J74098M55014L40503j14019l45278
$$ -405330 -585091 -608584 -527831 -538749 -598818 -424720 30294 370797 256778 -88500
31743h8500p0481L04684K78003o4345k50953j08403R3539J00816l4917j48649
$$ -88500 -158981 145703 423706 359361 108408 5 93544 194360 159443 10794
31733A0794j86387j46552J1125K65091M52815M21086K00564n7793k50201l26858
$$ 10794 -175593 -322145 -311020 -45929 406886 827972 1028536 970743 720542 393684
31723C93684k28309J5459J83050Q3460j23844r4770J60500K29677n0002k58874
$$ 393684 165375 180834 363884 447344 323500 228730 389230 618907 568905 310031
31713C10031l9038K66498J26136k54397j89141L25090M62030j63811p91641n81724
$$ 310031 270993 537491 663627 409230 220089 545179 1007209 843398 51757 -529967
31703e29967J63703N06391K33651m4997n039P286j99087k19761J89297N07594
$$ -529967 -366264 140127 373778 328781 323742 331028 131941 -87820 101477 609071
31693F09071J50881n57295p16586q2999N68735M65920j75915m94599j17426M21495
$$ 609071 759952 202657 -513929 -596928 -28193 437727 261812 -232787 -350213 71282
31683G1282M52554L2525k38728j06037L8840j72930m97625m56365o2151K23322
$$ 71282 523836 556361 317633 211596 250436 77506 -420119 -876484 -938635 -715313
31673g15313J75923M9314Q9888J87531J53061L4776m1802j11908k29378k70388
$$ -715313 -539390 -490076 -400188 -212657 -59596 -24820 -66622 -178530 -407908 -678296
31663f78296j10206J31985K40285J95591J24596N2376q0436k20834k38557j27278
$$ -678296 -788502 -656517 -416232 -220641 -96045 -43669 -124105 -344939 -583496 -710774
31653g10774Q620J23653K12265J91183J6831j37243o9473J13426J22366n4066
$$ -710774 -702154 -578501 -366236 -175053 -158222 -295465 -364938 -251512 -129146 -183212
31643a83212j20365M5329K01119J43727o626q1056j24284j78953r5823J74736
$$ -183212 -303577 -258248 -57129 86598 79972 -1084 -125368 -304321 -400144 -225408
31633b25408L50986J92471r1395j36870L0986J07618L3878J3929P2144J2427j61387
$$ -225408 125578 318049 226654 89784 120770 228388 262266 276195 348339 360766 199379
31622A99379j89528o597J21163L9271m9064M8246J86833J32219r1165k88183l49016
$$ 199379 9851 3254 124417 163688 114624 162870 349703 481922 390757 102574 -246442
31611b46442k53036N565L20867M49764K58700r1414l19813k98998r8343J09054
$$ -246442 -499478 -493913 -173046 276718 535418 444004 124191 -174807 -273150 -164096
31601a64096J27658j07206l80535l60406J1946M34384N89583M25568Q9172k07003
$$ -164096 -36438 -143644 -524179 -884585 -872639 -438255 151328 576896 666068 459065
31591D59065k39366M5481L54411L11559m9263l23521l00183j69567j23156j17039
$$ 459065 219699 265180 619591 931150 881887 558366 258183 88616 -34540 -151579
31581a51579j21361k08110k69395o7731K89124L82360J65780R7185L43774M34321
$$ -151579 -272940 -481050 -750445 -818176 -529052 -146692 19088 116273 460047 894368
31571H94368P3429k75588j26409K20908J97605j26833k87241k27501k10337k03407
$$ 894368 967797 692209 565800 786708 984313 857480 570239 342738 132401 -71006
31561g1006j7568J63872M5546j80340j32181N8115L259j75008o4297K15596J91677
$$ -71006 -88574 75298 120844 -59496 -191677 -133562 -130303 -305311 -369608 -154012 37665
31550C7665n9350j7895K92630K97403p6803k23362Q6906L31631J89244K6982Q2494
$$ 37665 -21685 -39580 253050 550453 473650 250288 337194 668825 858069 885051 967545
31539I67545k1556m68098p00538k80471L20054M17112J17106k3080N4705j7727
$$ 967545 945989 477891 -222647 -503118 -183064 234048 351154 328074 382779 365052
31529C65052k47211k28398J50752M65752L06444k19614o05753m56071J02003N10165
$$ 365052 117841 -110557 40195 505947 812391 592777 -12976 -469047 -367044 143121
31519A43121M03236N5771m7724N4715n1364l66114m40751j84702l2000j26631
$$ 143121 546357 602128 554404 609119 557755 191641 -249110 -433812 -465812 -592443
31509e92443n2795L21504M57013M6627l66304k29760J52664K23505R6292J70179
$$ -592443 -645238 -323734 133279 179906 -186398 -416158 -263494 -39989 56303 226482
31499B26482K84396N7560k65439j57032J94803R8922m59084o88242j89556M48801
$$ 226482 510878 568438 302999 145967 340770 439692 -19392 -707634 -897190 -448389
31489d48389N32641J63837q6459L283J87280K26210J42213N1308l6608j76602
$$ -448389 84252 248089 161630 164913 352193 578403 720616 771924 735316 558714
31479E58714l09045k48006L9008K45735P7560k57734k81496l549L4989l41881
$$ 558714 249669 1663 40671 286406 363966 106232 -175264 -178813 -143824 -485705
31469d85705n55252j54044M18773M82694J47435L7872K49224K93143J0291j73331
$$ -485705 -1040957 -1195001 -776228 -293534 -146099 -108227 140997 434140 444431 271100
31459B71100j2991J44804l0737k99198k33164J13349K60507l7544m33862l89957
$$ 271100 258109 402913 372176 72978 -160186 -46837 213670 176126 -257736 -647693
31449f47693J35852N73074M28601p2817l17537j55953J1189j2112N2869L03903
$$ -647693 -511841 61233 489834 417017 99480 -56473 -45284 -57396 -4527 299376
31439B99376L40666l9832l81186k70347j3273n6097j76010Q0425M84438M08203
$$ 299376 640042 600210 219024 -51323 -64596 -120693 -296703 -216278 268160 676363
31429F76363j30989m45514k03221J57396J37612k02955m71603m21632j04593K21399
$$ 676363 545374 99860 -103361 54035 191647 -11308 -482911 -904543 -1009136 -787737
31419g87737L24947K70675L00200L54143R8767l68335m02554J76690N74616J66977
$$ -787737 -462790 -192115 108085 462228 560995 192660 -209894 -33204 541412 708389
31409G08389m23582k53060M15156N41373j9710m11386k54283p7597j59115o4420
$$ 708389 284807 31747 446903 988276 968566 557180 302897 225300 66185 1765
31399A765L46938M83289M2369l98517l13704o760M6044l4693N7569J99090J43184
$$ 1765 348703 831992 874361 475844 162140 155380 201424 166731 224300 423390 566574
31388E66574j2688r5537j67328k24396n6751K68765L01322p2293l39047j64350
$$ 566574 553886 458349 291021 66625 9874 278639 579961 507668 168621 4271
31378D271Q3002L1712n9793J16862K80446J02156j23285j3388J41564j13885m87279
$$ 4271 87273 118985 59192 176054 456500 558656 435371 421983 563547 449662 -37617
31367c7617l31367K53220N03004J31793l27936l72893j01449J60010K69389J78423
$$ -37617 -368984 -115764 387240 519033 191097 -181796 -283245 -123235 146154 324577
31357C24577j15740l84473l07506P2833L52010L07277J31914M1599l0705k01330
$$ 324577 208837 -175636 -483142 -410309 -58299 248978 380892 422491 391786 190456
31347A90456l64038l35850j13219J52989L17100K85474M2418k57094l32408o8258
$$ 190456 -173582 -509432 -622651 -469662 -152562 132912 175330 -81764 -414172 -482430
31337d82430K69353K59018j71550n73695m52656J19320N60377M95477J74657K6456
$$ -482430 -213077 45941 -125609 -699304 -1151960 -1032640 -472263 23214 197871 224327
31327B24327N9324J631j66687k17594j14274m2013l3725L9927J26159N3303o9396
$$ 224327 283651 285282 118595 -98999 -213273 -255286 -289011 -249084 -122925 -69622 -139018
31316a39018K4516K18067J12873k55771l77400r4476J32341L7657N206L24113
$$ -139018 -114502 103565 216438 -39333 -416733 -511209 -378868 -341211 -336005 -11892
31306a1892N79862L11982j88232l23891r4020M2634m0549p0441M3650J07679O8932
$$ -11892 567970 879952 691720 367829 273809 316443 275894 205453 249103 356782 425714
31295D25714P6952J33249P1698j12443k33763k05955j09993k6968r643j10455
$$ 425714 502666 635915 707613 595170 361407 155452 45459 18491 8848 -101607
31285a01607k46713k05356K4163J50393L2425n7874R2543K29447O3464k01322
$$ -101607 -348320 -553676 -529513 -379120 -346695 -404569 -312026 -82579 -19115 -220437
31275b20437k09732n1427l3540j04391k9186P6974k8121j31035J54429O10880
$$ -220437 -430169 -481596 -515136 -619527 -648713 -571739 -599860 -730895 -576466 34414
31265C4414O05462P3003l62487l51611k31228k68717j66926K98026O94975M97178
$$ 34414 639876 712879 350392 -1219 -232447 -501164 -668090 -370064 324911 822089
31255H22089j11615m72026l15831J220N2678j84298l94120k72201J66191N33412
$$ 822089 710474 238448 -77383 -76163 -23485 -207783 -601903 -874104 -707913 -174501
31245a74501M30766n1170l64328j78481J63975J07683l25309n27802j28241M78057
$$ -174501 256265 205095 -159233 -337714 -173739 -66056 -391365 -919167 -1047408 -569351
31235e69351O22323K20022j61910r6919J65861J50625j23426k29559k9840J51213
$$ -569351 52972 272994 111084 14165 180026 330651 207225 -22334 -52174 99039
31225I9039R4255j0365N266l1617k27907k60899J62137O99164O83409n922p42135
$$ 99039 193294 182929 188195 156578 -71329 -332228 -170091 529073 1212482 1206560 464425
31214D64425q53539k95825L87230O12850K83517j53169k35926n7678n6734k63288
$$ 464425 -389114 -684939 -297709 315141 598658 445489 209563 151885 95151 -168137
31204a68137k27829J45034K85501j17915m63002j30008M39934L73479k29496m52417
$$ -168137 -395966 -250932 34569 -83346 -546348 -676356 -236422 137057 -92439 -544856
31194e44856l7950K74469L8393k20796k022L14574J68625k38640l35091q8465
$$ -544856 -582806 -308337 -269944 -490740 -492762 -178188 -9563 -248203 -583294 -671759
31184f71759R3805R3917J19993J82651R6144o2065l902K38053K89798L6388j69262
$$ -671759 -577954 -484037 -364044 -181393 -85249 -147314 -151216 86837 376635 413023 243761
31173B43761o9159Q6353l9099k92168k47917R5060K50860l1116l60472k85488
$$ 243761 174602 260955 221856 -70312 -318229 -223169 27691 -3425 -363897 -649385
31163f49385K3211Q4508q2564k1069K86686K58525l03494o86447k42458N63165
$$ -649385 -626174 -541666 -624230 -645299 -358613 -100088 -403582 -1090029 -1332487 -769322
31153g69322P45961J93598k55872p3502L29161L68346Q0209j38772j43703o3062
$$ -769322 -23361 170237 -85635 -159137 170024 538370 618579 479807 336104 273042
31143B73042K5016J45873K74660L01708J14412k82884o45250o07317j28252L29686
$$ 273042 298058 443931 718591 1020299 1134711 851827 206577 -400740 -528992 -199306
31133a99306L45777J05398O7593K40461K54829M4065r8997j10936k15830l58639
$$ -199306 146471 251869 319462 559923 814752 858817 759820 648884 433054 74415
31123G4415k08274J50591J84400k01340l93313l1382L83095K95958l8803p2679
$$ 74415 -133859 16732 201132 -208 -393521 -424903 -41808 254150 215347 142668
31113A42668J11808M5778k43476k80075L1302K46819R7316j48355j60809j280
$$ 142668 254476 300254 56778 -223297 -191995 54824 152140 3785 -157024 -158304
31103a58304Q0996M0981L3626J32348K02100P1893k06365l56951k20345J761K6931
$$ -158304 -77308 -36327 -2701 129647 331747 403640 197275 -159676 -380021 -378260 -351329
31092c51329o7692K1439K80014L44406R0827j38100n9347J62855K58120K29470
$$ -351329 -419021 -397582 -117568 226838 317665 179565 120218 283073 541193 770663
31082G70663J59687j8839k89298m03003k54776j05635j43856j48952P6248K76109
$$ 770663 930350 911511 622213 219210 -35566 -141201 -285057 -434009 -357761 -81652
31072h1652J52765r2382r1953N8585J8750j28735K899L68199M40429K185m82534
$$ -81652 71113 -21269 -113222 -54637 -35887 -164622 -161723 206476 646905 649090 166556
31061A66556m85493p8703K37167J75097p2293j51486R978J56830R7736j1393M0157
$$ 166556 -318937 -397640 -160473 14624 -57669 -209155 -199177 -42347 55389 43996 84153
31050H4153Q8536j61813n05299l72289K55328O34459K92031k68173l50164p8156
$$ 84153 172689 10876 -494423 -866712 -611384 23075 315106 46933 -303231 -381387
31040c81387l3940k54412k77966R140K42762K26361J28644P1485K1850L7999J60194
$$ -381387 -415327 -669739 -947705 -938565 -695803 -469442 -340798 -269313 -247463 -209464 -49270
31029d9270J64639j00958l06452j04628J96601Q0727k41019j25589L55112M51376
$$ -49270 115369 14411 -292041 -396669 -200068 -119341 -360360 -485949 -130837 320539
31019C20539q804l20225q9364J71943J9933j86763l0700K15263J63687J7431Q7376
$$ 320539 311735 -8490 -97854 74089 94022 -92741 -123441 91822 255509 272940 360316
31008C60316J47858q4339l01789j13412K03098J61409n7781N2515L48160K06821
$$ 360316 508174 423835 122046 8634 211732 373141 315360 367875 716035 922856
30998I22856l93523p45932m48340R9367L83989L83245K76089O1759k43132m00069
$$ 922856 529333 -216599 -664939 -565572 -181583 201662 477751 539510 296378 -103691
30988a03691k43559M1465J59185O2753p6428j23244q2752l8523m8911n5157O9066
$$ -103691 -347250 -305785 -146600 -83847 -160275 -283519 -366271 -404794 -453705 -508862 -439796
30977d39796K99393M07001K66636P2498M0893O2668o3436k10777j19660Q6974
$$ -439796 -140403 266598 533234 605732 646625 709293 645857 435080 315420 402394
30967D02394L9652k23564k34769J38537L85659Q5593m36751n55041j92011J68401
$$ 402394 442046 218482 -16287 122250 507909 593502 156751 -398290 -590301 -421900
30957d21900J95446N3974L0450J46255K55694L01712L01666J94428r7434m40504
$$ -421900 -226454 -172480 -142030 4225 259919 561631 863297 1057725 960291 519787
30947E19787n03324j36236L43574M44575R3288k75168l01142j39804j30611k45332
$$ 519787 16463 -119773 223801 668376 761664 486496 185354 45550 -85061 -330393
30937c30393j74547J38259L88350L47497J25384n8994j30085j19143p4307n4480
$$ -330393 -504940 -366681 21669 369166 494550 435556 305471 186328 112021 57541
30927E7541m8977P7195L54211M89962J88203l39019n48964l03452k2430j20k6859
$$ 57541 8564 85759 439970 929932 1118135 779116 230152 -73300 -95730 -95850 -122709
30916a22709Q9329J01931j89513m22551j44857M21499O10185K20822k70874m07868
$$ -122709 -33380 68551 -120962 -543513 -688370 -266871 343314 564136 293262 -114606
30906a14606k36441m2537L0291m800p0834m6011J04758K06207J04407k2073J06668
$$ -114606 -351047 -393584 -363293 -368093 -438927 -484938 -380180 -173973 -69566 -91639 15029
30895A5029L47721K40202k69709o13401l34686K81253O00462M32107J17517k6476
$$ 15029 362750 602952 333243 -280158 -614844 -333591 266871 698978 816495 790019
30885G90019k5088l2726q0928j13773j13930j04332q8230m6585R973J3757q9881
$$ 790019 764931 732205 651277 537504 423574 319242 231012 184427 194400 208157 118276
30874A18276k26384k26129m8028J25954J38691Q3132R8811Q3268j03170k52161
$$ 118276 -108108 -334237 -382265 -256311 -117620 -34488 64323 147591 44421 -207740
30864b07740l3968L92864M67765N0108l21437k29312L3112L0370r6019J6586K10075
$$ -207740 -241708 151156 618921 669029 347592 118280 151392 181762 85743 102329 312404
30853C12404M3097l82441m74690n3776L74414L75610J26368M607N6743J11015
$$ 312404 355501 -26940 -501630 -555406 -180992 194618 320986 325593 382336 493351
30843D93351J00880L7167j01985k57809k71161j21773J6211N8023J02516J56037
$$ 493351 594231 631398 529413 271604 443 -121330 -105119 -47096 55420 211457
30833B11457P4008r2965n5795K05076K68718q6448m31541k82711J40852K37509
$$ 211457 285465 192500 136705 341781 610499 524051 92510 -190201 -49349 188160
30823A88160q4681l52910k85507q6505L1020J26103K33834K20018P8951J0613
$$ 188160 103479 -249431 -534938 -621443 -590423 -464320 -230486 -10468 68483 79096
30813G9096O4261N9794j0981R0372L44096L39884o2979l80963k18492N5740j22036
$$ 79096 143357 203151 192170 282542 626638 966522 903543 522580 304088 359828 237792
30802B37792n54502n42887J4409M61125L77509R0878m41j7600j86940l30509j93780
$$ 237792 -316710 -859597 -845188 -384063 -6554 84324 83883 66283 -120657 -451166 -644946
30791f44946P3174J83201J77050K11171J54630j35573l61966j40161L26262M69050
$$ -644946 -571772 -388571 -211521 -350 154280 18707 -343259 -483420 -157158 311892
30781C11892J94534n1866n1761n4738j74552j56543N9997J34301m6910j00011
$$ 311892 506426 454560 402799 348061 173509 16966 76963 211264 164354 64343
30771F4343J43504K20951j84686n64632l01544L16169M98641J40841j26259R680
$$ 64343 207847 428798 244112 -320520 -622064 -305895 192746 333587 207328 217008
30761B17008J55748l6840l61816m76375l39571n6372K97087N33746M25032O4765
$$ 217008 372756 335916 -25900 -502275 -841846 -898218 -601131 -67385 357647 422412
30751D22412j72715j46164p8169j03738q5186K6980O8714K2905P7841J91326O3697
$$ 422412 249697 103533 25364 -78374 -163560 -136580 -67866 -44961 32880 224206 287903
30740B87903k75654l56139M088L47660K72927N762q7383r1099k08711k67638o2965
$$ 287903 12249 -343890 -339802 7858 280785 286547 199164 108065 -100646 -368284 -431249
30729d31249J56510O9693j41508j10998R1639J78287K02176L41687L88821P2352
$$ -431249 -274739 -205046 -346554 -457552 -365913 -187626 14550 356237 745058 817410
30719H17410l23470l14465j7007P5918n2860n4068j5958k92739n95040k49087
$$ 817410 493940 179475 162468 238386 185526 131458 115500 -177239 -772279 -1021366
30709a021366N21278O41814j38424o81181j52307O88886P01412N8327k54977n7587
$$ -1021366 -500088 141726 3302 -677879 -830186 -141300 560112 618439 363462 305875
30699C05875J1026k13588k21035J04516K18131j10604l94832k68376k1867J4152
$$ 305875 316901 103313 -117722 -13206 204925 94321 -300511 -568887 -590754 -576602
30689e76602J6575K26407M42064L56955O0393j49460j89972j46225m2321Q3109
$$ -576602 -560027 -333620 108444 465399 525792 376332 186360 40135 -2186 80923
30679H0923R1101m9861j79475k25463k91503l12875q034N59325P84613L11221
$$ 80923 172024 122163 -57312 -282775 -574278 -887153 -895187 -335862 448751 759972
30669G59972l27423l83268L3447J73845j70086l97472j06580K90920K70341p807
$$ 759972 432549 49281 82728 256573 86487 -310985 -417565 -126645 143696 135889
30659A35889l3442K39049L67084Q4591l72923n89407l85724O1497L74378L09987
$$ 135889 102447 341496 708580 793171 420248 -169159 -554883 -493386 -119008 190979
30649A90979L6956n0793J27141K17367P09k20647r5751J87605K02299j9528q9071
$$ 190979 227935 177142 304283 521650 522359 301712 205961 393566 595865 576337 487266
30638D87266J6163r6079m72668n83231j25006M13719L99438n9422l24194j44158
$$ 487266 503429 407350 -65318 -648549 -773555 -359836 39602 -19820 -344014 -488172
30628d88172J03313O2854j30563j51837L9582K09963J92191N4379l4259l188P4307
$$ -488172 -384859 -322005 -452568 -604405 -564823 -354860 -162669 -108290 -142549 -145737 -71430
30617g1430R3302K2043j14512k73759l48366j88726J65939L73894J65333k08814
$$ -71430 21872 43915 -70597 -344356 -692722 -881448 -715509 -341615 -176282 -385096
30607c85096k36885J02350K51672q4438m29463k11823L73331O36632L45632p7290
$$ -385096 -621981 -519631 -267959 -352397 -781860 -993683 -620352 16280 361912 284622
30597B84622k43612k12411j64910q8977N6034J62819J33714K2172q3126j45729
$$ 284622 41010 -171401 -336311 -425288 -369254 -206435 -72721 -50549 -133675 -279404
30587b79404j09155O2720K31045J85410l6601j44533J7179K72062L70699K57406
$$ -279404 -388559 -325839 -94794 90616 54015 -90518 -73339 198723 569422 826828
30577H26828J8134k36511l63739k63071m3815N9491M730j3505J03002J94123J05697
$$ 826828 844962 608451 244712 -18359 -62174 -2683 2047 -11458 91544 285667 391364
30566C91364p9588j74454q6957J59896M13991L85280p1078o05413o35828r3453
$$ 391364 311776 137322 50365 210261 624252 1009532 938454 333041 -302787 -396240
30556c96240M15685L70502n7055l57119l16599m5515K96313M81072K44258k85780
$$ -396240 19445 389947 332892 -24227 -340826 -386341 -90028 391044 635302 349522
30546C49522m95790p3055M11641K60504k62424l03169K29624N08045J11286l22529
$$ 349522 -146268 -219323 192318 452822 190398 -112771 116853 624898 736184 413655
30536D13655j57775K47880K05416j89875l19289r3751J0521j51070j97478J9632
$$ 413655 255880 503760 709176 519301 200012 106261 116782 -34288 -231766 -212134
30526b12134J42493j4801j18543N6277J84708k1336k44260q6517J90355O1738
$$ -212134 -69641 -84442 -202985 -146708 38000 16664 -227596 -314113 -123758 -62020
30516f2020l38511l76989L4973K67397K156k45125M623L84090K80414j58534k61109
$$ -62020 -400531 -777520 -742547 -475150 -472994 -718119 -713496 -329406 -48992 -207526 -468635
30505d68635J16095M18094K64006r4222k94020l20158k39206M9774M80828O09031
$$ -468635 -352540 65554 329560 235338 -58682 -378840 -618046 -568272 -87444 521587
30495E21587J44651n09672o68499k33168K17737K15174o6674j78465j7666J46135
$$ 521587 666238 156566 -511933 -745101 -527364 -312190 -378864 -557329 -574995 -428860
30485d28860J31516O3901J05082J77413J05365q3293j99247k03970k41306k99211
$$ -428860 -297344 -233443 -128361 49052 154417 71124 -128123 -332093 -573399 -872610
30475h72610j13231L94072Q02533O42023N6077l18880j49286K29140L23113Q8777
$$ -872610 -985841 -591769 210764 852787 908864 589984 440698 669838 992951 1081728
30465A081728j30205r5711O9622P3264j84330m46361l56912O7135L59067J47848
$$ 1081728 951523 855812 925434 998698 814368 368007 11095 78230 437297 585145
30455E85145l61291o61758n52527k07451J86750M96315M94493J14376k29094p9221
$$ 585145 223854 -437904 -990431 -1197882 -1011132 -514817 -20324 94052 -135042 -214263
30445b14263L35122L79402J6182j54995M2635O2862l14557m75441l6435L57658
$$ -214263 120859 500261 516443 361448 404083 466945 152388 -323053 -359488 -1830
30435a830L7019n23318m21786K22950N09017J97378o2426Q1737K09181o332k56628
$$ -1830 35189 -488129 -909915 -686965 -177948 19430 -42996 38741 247922 241590 -15038
30424a5038j97808L6059J82958K13016J35869q7536k83999j81173Q9882Q9445
$$ -15038 -212846 -176787 6171 219187 355056 267520 -16479 -197652 -107770 -18325
30414a8325k10436l24709l3274K86061L13203K25960K20533J33479j25287k62329
$$ -18325 -228761 -553470 -586744 -300683 12520 238480 459013 592492 467205 204876
30404B04876j02942M1375r6898k54705j03525J67690J82940r186r3672j4084O2087
$$ 204876 101934 143309 46411 -208294 -311819 -144129 38811 29625 -64047 -78131 -16044
30393a6044Q4817P3813l8994j92873r8196L03899N82910L97202J9154j23614r0634
$$ -16044 68773 142586 103592 -89281 -187477 116422 699332 1096534 1115688 992074 901440
30382I01440j40217j55455N7958K04794r1496n22300m62561O147K00184n3702
$$ 901440 761223 605768 663726 868520 777024 254724 -207837 -201690 -1506 -55208
30372e5208k01606K8547J96095m008j95927l3892J70737M3455j39555P1149M53914
$$ -55208 -256814 -228267 -32172 -36180 -232107 -265999 -95262 -51807 -191362 -120213 333701
30361C33701L95088j34534m97404l23250j505l8971l08846k83623J38067M27268
$$ 333701 728789 594255 96851 -226399 -227904 -266875 -575721 -859344 -721277 -294009
30351b94009J62932l18926l45202J28820M26472J49068k11567l3587M50731N02857
$$ -294009 -131077 -450003 -795205 -666385 -239913 -90845 -302412 -335999 114732 617589
30341F17589J0154l82435k72867j132R562j41841j45144L8124K68707M56120M67163
$$ 617589 627743 245308 -27559 -28691 -19129 -160970 -306114 -267990 717 456837 924000
30330I24000J50953l27569n20429k86253j3132l3592j72801j33140K4790Q5831
$$ 924000 1074953 747384 226955 -59298 -72430 -106022 -278823 -411963 -387173 -301342
30320c01342O1759P3217J05445J19461J43470Q7756j80143m29689k19723L28746
$$ -301342 -239583 -166366 -60921 58540 202010 289766 109623 -320066 -539789 -211043
30310b11043M98586M9653l26317j07479J90209o8709m94534l33807K17000L67384
$$ -211043 287543 337196 10879 -96600 93609 24900 -469634 -803441 -586441 -219057
30300b19057P7523j5074J69282R5289k42609k40105J29135J48131l51440n82920
$$ -219057 -141534 -156608 12674 107963 -134646 -374751 -245616 -97485 -448925 -1031845
30290a031845q8684N28946O26660L82877J47044j94054o19591n91865M2649N19720
$$ -1031845 -1120529 -591583 35077 417954 564998 370944 -248647 -840512 -797863 -278143
30280b78143K48447k52364k50033N3773R1083j0832J35644K58069m5619l39075
$$ -278143 -29696 -282060 -532093 -478320 -387237 -398069 -262425 -4356 -49975 -389050
30270c89050m251N13584K99123m28443n53229J32432O09724K85828k11111k24010
$$ -389050 -393301 120283 419406 -9037 -562266 -429834 179890 465718 254607 30597
30260C0597M20K4546l6259J3779j1706j86331j70856J49830L40231J27678j55430
$$ 30597 31017 55563 19304 33083 21377 -164954 -335810 -185980 154251 281929 126499
30249A26499k08708k08265k45125k7121M01023L84012k93636p76680k97147O09576
$$ 126499 -82209 -290474 -535599 -562720 -161697 222315 -71321 -848001 -1145148 -535572
30239e35572Q61409L60633r1244j10126p1218k29106l08357p3991K76372M18768
$$ -535572 325837 686470 595226 485100 413882 184776 -123581 -197572 78800 497568
30229D97568K33029j76794n10278m44772n1830J91563Q4049K1784K69620L97150
$$ 497568 730597 553803 43525 -401247 -453077 -261514 -177465 -155681 113939 511089
30219E11089J0435m28020k65078K26487K68725j25525k29974J10033K59918n0983
$$ 511089 521524 93504 -171574 54913 323638 198113 -31861 78172 338090 287107
30209B87107l12617j94688m2599r9895n3253K52870L94496J18354j52338n3706
$$ 287107 -25510 -220198 -262797 -362692 -415945 -163075 231421 349775 197437 143731
30199A43731Q5754j17150l79311k61625N3067J12113k8347P208K07355K53100
$$ 143731 229485 112335 -266976 -528601 -475534 -363421 -391768 -384560 -177205 75895
30189G5895J23617O4447O9640q2195l36972l90689j99102m3773o0634n7901J36257
$$ 75895 199512 263959 333599 251404 -85568 -476257 -675359 -719132 -779766 -837667 -701410
30178g01410M15169N45700M14923J25681n7686M4085K53947K13188p0895j69078
$$ -701410 -286241 259459 674382 800063 742377 786462 1040409 1253597 1182702 1013624
30168A013624P0877J63766k77021p83256n84387K35566P48646M02122l09690n82318
$$ 1013624 1084501 1248267 971246 187990 -396397 -160831 587815 989937 680247 97929
30158I7929k95776J3223o0270l28522l21700J02807N61070N88535K08307j17679
$$ 97929 -197847 -184624 -244894 -573416 -895116 -792309 -231239 357296 565603 447924
30148D47924r2438J18099K42319K26285O7273k78697n80864l67511L34729P28406
$$ 447924 355486 473585 715904 942189 1009462 730765 149901 -217610 117119 845525
30138H45525K54437m97991n73043o0965J06372l24190n53584o1621N77825O40958
$$ 845525 1099962 601971 28928 -32037 74335 -249855 -803439 -865060 -287235 353723
30128C53723K92117J17005J58827N1385k28887l62899k69535j58782r2691N6906
$$ 353723 645840 762845 921672 973057 744170 381271 111736 -47046 -139737 -82831
30118h2831K56643L10792K01967R9933M0503r4042k73441l03433j51284j5080
$$ -82831 173812 484604 686571 786504 827007 732965 459524 156091 4807 -10273
30108a0273m323K112R0099J30873J0089j33775q3896J19281J97331L416k66340
$$ -10273 -14596 -12484 77615 208488 218577 84802 906 120187 317518 320934 54594
30097E4594l14057j09865J14684K23339L33769N25283N82941K63981k78265o13390
$$ 54594 -259463 -369328 -254644 -31305 302464 827747 1410688 1674669 1396404 783014
30087G83014n66406l57998j86522J6866K97404M50480L17572R2306O4674J86343
$$ 783014 216608 -141390 -327912 -311046 -13642 436838 754410 846716 911390 1097733
30077A097733J47024j73163n46726o81209m97521j41695J47186J95806L7444j09785
$$ 1097733 1244757 1071594 524868 -156341 -653862 -795557 -648371 -452565 -415121 -524906
30067e24906p3252R6392K21504K02044P3639n4135o9865K8447O1955j39506m26274
$$ -524906 -598158 -501766 -280262 -78218 -4579 -58714 -128579 -100132 -38177 -177683 -603957
30056f03957m08707L4920N27985O37370L73631O9431p0276p8201l2523m037r2794
$$ -603957 -1012664 -977744 -449759 187611 561242 630673 560397 482196 449673 445636 352842
30045C52842k75749l08595l1956L01818K88219p0736l42442k19781J36459L50961
$$ 352842 77093 -231502 -263458 38360 326579 255843 -86599 -306380 -169921 181040
30035A81040K32105j17110m16227m16759j41353J00161P2536p7432n7658J24186
$$ 181040 413145 296035 -120192 -536951 -678304 -578143 -505607 -583039 -640697 -516511
30025e16511K10088J17049J1617j5639l4570l3058P8083J98114J35981J5836J58614
$$ -516511 -306423 -189374 -177757 -193396 -227966 -261024 -182941 15173 151154 166990 325604
30014C25604M57645L71049k19275o43374l46011K66325M13942P4012j16313N7593
$$ 325604 783249 1154298 935023 291649 -54362 211963 625905 699917 583604 641197
30004F41197J15159k18472n08686l23694N8805R6133j90274l06586n7959K26631
$$ 641197 756356 537884 29198 -294496 -235691 -139558 -329832 -636418 -694377 -467746
29994d67746K36380N9555o7520q5194l8269Q5593K58800L11058J20263j73539
$$ -467746 -231366 -171811 -239331 -324525 -362794 -277201 -18401 292657 412920 239381
29984B39381l08381k03849N862J72736K21938J13897r0925j78996j3916K03629
$$ 239381 -69000 -272849 -266987 -94251 127687 241584 150659 -28337 -42253 161376
29974A61376J57580r4431j57003R9832L09130J58611j42805k12856l8606J38499
$$ 161376 318956 224525 67522 167354 476484 635095 492290 279434 240828 379327
29964C79327K31436K38021L806m80301p29467k92207M34526N60364l8833m82395
$$ 379327 610763 848784 852590 372289 -357178 -649385 -214859 345505 306672 -175723
29954a75723j63386L82130L43045j60427l67416o1130K22367R9379j62881j69120
$$ -175723 -339109 43021 386066 225639 -141777 -202907 19460 118839 -44042 -213162
29944b13162M2176J60710M4845j77232k84488j40201J87347M35168L80096P2753
$$ -213162 -170986 -10276 34569 -142663 -427151 -567352 -380005 55163 435259 508012
29934E08012k43074l93263l56700j82140K9695J45898J55062K04722L33394L11627
$$ 508012 264938 -128325 -485025 -667165 -637470 -491572 -336510 -131788 201606 513233
29924E13233l0006m50720n53991l06545k3852R3235J09894R2684J7145m8258L6659
$$ 513233 483227 32507 -521484 -828029 -851881 -758646 -648752 -556068 -538923 -587181 -550522
29913e50522K36768L63965L60360L16432K23693j1717l10019m58497m19885l30859
$$ -550522 -313754 50211 410571 727003 950696 938979 628960 170463 -249422 -580281
29903e80281k23952n4268N7424j8886p5149J87704N92277O62156L65695J09868
$$ -580281 -804233 -858501 -801077 -819963 -895112 -707408 -115131 547025 912720 1022588
29893A022588l4415l91817q26697o68325J35557O38776K66248k24904M8401O22654
$$ 1022588 988173 596356 -230341 -898666 -763109 -124333 141915 -82989 -34588 588066
29883E88066M46183l77582p85044m72948j96268l06433k17632L45279O86150K89799
$$ 588066 1034249 656667 -128377 -601325 -797593 -1104026 -1321658 -976379 -290229 -430
29873d30k72290k60876J24478K61109J28625O8679p57l24470n92633l11006K78456
$$ -430 -272720 -533596 -409118 -148009 -19384 49295 48538 -275932 -868565 -1179571 -901115
29862i01115M39687O5308j91019K5702K91513J91246l5619K0037K56549K62389
$$ -901115 -461428 -396120 -587139 -561437 -269924 -78678 -114297 -94260 162289 424678
29852D24678m8388l34321k67171J13565M40631L71730j4646k43440l5390K59556
$$ 424678 376290 41969 -225202 -111637 328994 700724 686078 442638 407248 666804
29842F66804J32838k99563m40220j19009J79530J15480m3572j3754K217j97880
$$ 666804 799642 500079 59859 -59150 120380 235860 192288 178534 180751 -17129
29832a7129l10298k8348L18878K18659j87822l34104j31266K161n4030L5581L44390
$$ -17129 -327427 -355775 -36897 181762 -6060 -340164 -471430 -469269 -523299 -487718 -143328
29821a43328M68117K28020L625Q0467J80047j4802l02658l14807p3593J69674
$$ -143328 324789 552809 556434 636901 816948 802146 499488 184681 111088 280762
29811B80762L39238M15628K35893j77829l94579j45131J50789m7055n18996n71794
$$ 280762 620000 1035628 1271521 1093692 699113 553982 704771 657716 138720 -433074
29801d33074q9025L43627L62580K29360J92241P9264k13293l80311k13413m970
$$ -433074 -522099 -178472 184108 413468 605709 684973 471680 91369 -122044 -127014
29791a27014n2093j24174J24828M80736M08476j37846o04089n59669j66460J62629
$$ -127014 -179107 -303281 -178453 302283 710759 572913 -31176 -590845 -757305 -594676
29781e94676K77239K95359K80258J40337j43731l57555k65426M2488J98965L3093
$$ -594676 -317437 -22078 258180 398517 254786 -102769 -368195 -325707 -126742 -93649
29771i3649k00275k17968j08223o8131J7114L10052N17039K20557l29845m18461
$$ -93649 -293924 -511892 -620115 -688246 -671132 -361080 155959 376516 46671 -371790
29761c71790L4767K77376r3868m69171k20274K84027L13441o2332k04040K3530
$$ -371790 -337023 -59647 -153515 -622686 -842960 -558933 -245492 -307824 -511864 -488334
29751d88334J90654J42741J33153J76921J5029k46610j82035J61341K11839j89429
$$ -488334 -297680 -154939 -21786 155135 170164 -76446 -258481 -97140 114699 -74730
29741g4730m72138k48842Q2571N0776j14665O6657M82484N88946K27062k06151
$$ -74730 -546868 -795710 -713139 -662363 -777028 -710371 -227887 361059 588121 381970
29731C81970l39493k01321j9233O0401K0942n8959n5077P7406K34383K80267J85040
$$ 381970 42477 -158844 -178077 -117676 -96734 -155693 -210770 -133364 101019 381286 566326
$$ [...]
##END NTUPLES=NMR SPECTRUM
##END=
