##TITLE=31Pdec_LY-11Dix.5.B
 CD3CN, 24 sc
 4.06.2021
##JCAMPDX= 6.0         $$ Bruker NMR JCAMP-DX V2.0
##DATA TYPE= NMR SPECTRUM
##DATA CLASS= NTUPLES
##ORIGIN= UXNMR, Bruker Analytische Messtechnik GmbH
##OWNER= root
$$ XWIN-NMR		Version 3.5
$$ Fri Jun  4 12:28:40 2021 Russian Standard Time (UT+4h)  she@DPX200
##.OBSERVE FREQUENCY= 81.013821
##.OBSERVE NUCLEUS= ^31P
##.ACQUISITION MODE= SIMULTANEOUS
##.ACQUISITION SCHEME= undefined
##.AVERAGES= 24
##.DIGITISER RES= 16
##SPECTROMETER/DATA SYSTEM= spect
##.PULSE SEQUENCE= zgpg30
##.SOLVENT NAME= CD3CN
##.SHIFT REFERENCE= (INTERNAL, CD3CN, 0, 248.564)
##AUDIT TRAIL= $$ (NUMBER, WHEN, WHO, WHERE, WHAT)
$$ ##TITLE= Audit trail, XWIN-NMR		Version 3.5
$$ ##JCAMPDX= 5.01
$$ ##ORIGIN= Bruker BioSpin GmbH
$$ ##OWNER= she
$$ F:/spectra/data/she/nmr/P31/1/pdata/1/auditp.txt
$$ ##AUDIT TRAIL=  $$ (NUMBER, WHEN, WHO, WHERE, WHAT)
(   1,<2021-06-04 12:27:32.65 +0400>,<she>,<DPX200>,
      <created by zg, POWCHK disabled, PULCHK disabled
       configuration hash MD5:
       00 E9 B6 7A A2 85 ED C7 34 08 36 98 17 FE 4E 26
       data hash MD5: 32K
       26 F3 AD 84 7B 6F 1B BA C8 98 2C C3 04 2B 53 B6>)
(   2,<2021-06-04 12:27:38.01 +0400>,<she>,<DPX200>,
      <Start of raw data processing
       efp BC_mod = 2 LB = 1 FT_mod = 6 PKNL = 1 PHC0 = -6042.656 PHC1 = 434.4749 SI = 64K 
       data hash MD5: 64K
       03 32 F0 AC 5C 1A 17 B4 79 12 3F 82 A8 2C BA 36>)
(   3,<2021-06-04 12:28:06.18 +0400>,<she>,<DPX200>,
      <pk PHC0 = -285.7586 PHC1 = 532.6004 
       data hash MD5: 64K
       50 B9 FF 35 80 94 B3 04 82 66 E7 29 95 43 EB C0>)
(   4,<2021-06-04 12:28:09.87 +0400>,<she>,<DPX200>,
      <abs ABSG = 5 
       data hash MD5: 64K
       8E 44 18 B3 5C B5 5B EA 35 B0 BF 84 22 D0 9E E5>)
$$ ##END=
$$ 
$$ hash MD5
$$ 1A FB 6D 64 3B E9 07 AA E8 25 0B 5C BE BC 80 4B
##$RELAX= 
##$RELAX= 
##$RELAX= 
##$RELAX= 
##$RELAX= 
##$RELAX= 
##$RELAX= 
##$RELAX= 
$$ Bruker specific parameters
$$ --------------------------
##$DU= <F:/spectra>
##$EXPNO= 1
##$NAME= <P31>
##$PROCNO= 1
##$TYPE= <nmr>
##$USER= <she>
##$AMP= (0..31)
100 100 100 100 100 100 100 100 100 100 100 100 100 100 100 100 100 100 
100 100 100 100 100 100 100 100 100 100 100 100 100 100 
##$AQSEQ= 0
##$AQ_mod= 1
##$AUNM= <au_zg>
##$AUTOPOS= <>
##$BF1= 81.014009
##$BF2= 200.13
##$BF3= 200.13
##$BF4= 200.13
##$BF5= 200.13
##$BF6= 200.13
##$BF7= 200.13
##$BF8= 200.13
##$BYTORDA= 1
##$CFDGTYP= 0
##$CFRGTYP= 5
##$CHEMSTR= <none>
##$CNST= (0..31)
1 1 145 1 1 1 1 1 1 1 1 1 1 1 1 1 1 1 1 1 1 1 1 1 1 1 1 1 1 1 1 1 
##$CPDPRG= <waltz16>
##$CPDPRG1= <>
##$CPDPRG2= <waltz16>
##$CPDPRG3= <>
##$CPDPRG4= <mlev>
##$CPDPRG5= <mlev>
##$CPDPRG6= <mlev>
##$CPDPRG7= <mlev>
##$CPDPRG8= <mlev>
##$CPDPRGB= <>
##$CPDPRGT= <>
##$D= (0..31)
0 1 0 0 0 0 0 0 0 0 0 0.03 2e-05 3e-06 0 0 0 0 0 0 0 0 0 0 0 0 0 0 0 0 
0 0 
##$DATE= 1622795252
##$DBL= (0..7)
120 120 120 11 120 120 24 19 
##$DBP= (0..7)
150 150 150 150 150 150 150 150 
##$DBP07= 0
##$DBPNAM0= <>
##$DBPNAM1= <>
$$ [...]
##$SUBNAM3= <"">
##$SUBNAM4= <"">
##$SUBNAM5= <"">
##$SUBNAM6= <"">
##$SUBNAM7= <"">
##$SUBNAM8= <"">
##$SUBNAM9= <"">
##$SW= 501.771253377433
##$SWIBOX= (0..15)
0 1 3 0 0 0 0 0 0 0 0 0 0 0 0 0 
##$SW_h= 40650.406504065
##$TD= 32768
##$TD0= 1
##$TE= 0
##$TE2= 300
##$TE3= 300
##$TEG= 300
##$TL= (0..7)
0 120 53 12 22 120 120 120 
##$TP= (0..7)
150 150 150 150 150 150 150 150 
##$TP07= 0
##$TPNAME0= <>
##$TPNAME1= <>
##$TPNAME2= <>
##$TPNAME3= <>
##$TPNAME4= <>
##$TPNAME5= <>
##$TPNAME6= <>
##$TPNAME7= <>
##$TPOAL= (0..7)
0.5 0.5 0.5 0.5 0.5 0.5 0.5 0.5 
##$TPOFFS= (0..7)
0 0 0 0 0 0 0 0 
##$TUNHIN= 0
##$TUNHOUT= 0
##$TUNXOUT= 0
##$USERA1= <user>
##$USERA2= <user>
##$USERA3= <user>
##$USERA4= <user>
##$USERA5= <user>
##$V9= 5
##$VALIST= <valist>
##$VCLIST= <CCCCCCCCCCCCCCC>
##$VD= 0
##$VDLIST= <DDDDDDDDDDDDDDD>
##$VPLIST= <PPPPPPPPPPPPPPP>
##$VTLIST= <TTTTTTTTTTTTTTT>
##$WBST= 1024
##$WBSW= 4
##$XGAIN= (0..3)
0 0 0 0 
##$XL= 0
##$YL= 0
##$YMAX_a= 2477
##$YMIN_a= -2676
##$ZGOPTNS= <>
##$ZL1= 120
##$ZL2= 120
##$ZL3= 120
##$ZL4= 120
##$ABSF1= 248.5645
##$ABSF2= -253.2056
##$ABSG= 5
##$ABSL= 3
##$ALPHA= 0
##$AQORDER= 0
##$ASSFAC= 0
##$ASSFACI= 0
##$ASSFACX= 0
##$ASSWID= 0
##$AUNMP= <proc_1d>
##$AZFE= 0.1
##$AZFW= 0.5
##$BCFW= 0
##$BC_mod= 2
##$BYTORDP= 0
##$COROFFS= 0
##$CY= -3
##$DATMOD= 1
##$DC= 0
##$DFILT= <>
##$DTYPP= 0
##$F1P= 0
##$F2P= 0
##$FCOR= 1
##$FTSIZE= 65536
##$FT_mod= 6
##$GAMMA= 0
##$GB= 0
##$INTBC= 1
##$INTSCL= 5.30512e-09
##$ISEN= 30
##$LB= 1
##$LEV0= 0
##$LPBIN= 0
##$MAXI= 10000
##$MC2= 0
##$MEAN= 0
##$ME_mod= 0
##$MI= 50
##$NCOEF= 0
##$NC_proc= -6
##$NLEV= 6
##$NOISF1= 182.463
##$NOISF2= 159.3651
##$NSP= 0
##$NTH_PI= 0
##$NZP= 0
##$OFFSET= 248.5645
##$PC= 4
##$PHC0= -6328.415
##$PHC1= 967.0753
##$PH_mod= 1
##$PKNL= yes
##$PPARMOD= 0
##$PSCAL= 0
##$PSIGN= 0
##$REVERSE= no
##$SF= 81.014009
##$SI= 65536
##$SIGF1= 159.3651
##$SIGF2= -187.1042
##$SINO= 113.3802
##$SIOLD= 16384
##$SREGLST= <1H.CDCl3>
##$SSB= 0
##$STSI= 65536
##$STSR= 0
##$SW_p= 40650.406504065
##$SYMM= 0
##$S_DEV= 0
##$TDeff= 32768
##$TDoff= 0
##$TI= <>
##$TILT= no
##$TM1= 0
##$TM2= 0
##$TOPLEV= 0
##$USERP1= <user>
##$USERP2= <user>
##$USERP3= <user>
##$USERP4= <user>
##$USERP5= <user>
##$WDW= 1
##$XDIM= 65536
##$YMAX_p= 371054686
##$YMIN_p= -15575559
$$ End of Bruker specific parameters
$$ ---------------------------------
##NTUPLES= NMR SPECTRUM
##VAR_NAME=  FREQUENCY,     SPECTRUM/REAL,   SPECTRUM/IMAG
##SYMBOL=    X,             R,               I
##VAR_TYPE=  INDEPENDENT,   DEPENDENT,       DEPENDENT
##VAR_FORM=  AFFN,          ASDF,            ASDF
##VAR_DIM=   65536,         65536,           65536
##UNITS=     HZ,            ARBITRARY UNITS, ARBITRARY UNITS
##FACTOR=    0.620285442955139, 1,           1
##FIRST=     20137.2065510759, 0,            0
##LAST=      -20513.1999529892, 0,           0
##MIN=       -20513.1999529892, -15575559,   0
##MAX=       20137.2065510759, 371054686,    0
$$ Real data points
##PAGE= N=1
##DATA TABLE= (X++(R..R)), XYDATA
$$ [...]
37575 355202 -674667 -937197 -429483 -96069 -395608 -737332 -521535 -57619 -20337 -426201
37565 -426201 -661308 -362286 164377 397637 160835 -330759 -742744 -849244 -674243 -519928
37555 -519928 -689122 -1041278 -1018964 -357115 413708 545502 60695 -299977 -105104 352148
37545 352148 747852 1138044 1409945 1123621 437501 396332 1476737 2518328 2139076
37536 2139076 722032 -166165 12275 411928 464469 492447 631340 559387 521360 1223766
37526 1223766 2382398 2796399 2288515 2052515 2498949 2430701 1257228 317867 701821
37517 701821 1301665 653524 -587452 -836098 -196275 69414 -129101 -11967 18010 -1072460
37507 -1072460 -2525508 -2297911 -286668 1171432 666208 -452593 -520510 40057 37614
37498 37614 -319218 -148374 247065 -102788 -972307 -1109711 -173414 759900 814442 447598
37488 447598 522198 920500 762008 -161262 -856872 -419931 567134 678279 -332892 -1096811
37478 -1096811 -613049 311975 417077 -115739 -283954 -112671 -440035 -1199160 -1440749
37469 -1440749 -1018947 -770096 -900872 -675284 36054 372664 66985 -20105 514006 880058
37459 880058 596286 354344 602637 588584 -224668 -970968 -681326 219818 757854 844665
37449 844665 869756 752733 448065 537218 1239356 1662015 1152013 549268 863737 1510121
37439 1510121 1253072 247975 -350003 -312545 -326600 -396287 115737 920306 878924 -114415
37429 -114415 -743618 -205811 634834 597706 -211162 -797026 -726392 -562904 -981044 -1792690
37419 -1792690 -2075909 -1412867 -668773 -845794 -1385029 -872992 414697 422288 -1426739
37410 -1426739 -2787784 -1744786 165977 422988 -496714 -343374 728789 466598 -1286449
37401 -1286449 -2125242 -1250038 -724577 -1538209 -1732579 -191996 779724 -854859 -3121129
37392 -3121129 -2967035 -1135391 -800629 -2370707 -3087209 -1673922 -152009 -339936 -1243398
37383 -1243398 -1158078 -343024 -100893 -505716 -521271 287044 1327471 1959629 2073300 1837447
37373 1837447 1431593 1008801 680805 566160 785596 1167136 1127260 310107 -754258
37364 -754258 -1172644 -825584 -403283 -328775 -316739 -111932 8034 -267388 -793422 -1217997
37354 -1217997 -1289165 -791538 293291 1382718 1630182 980612 387095 609949 1247630
37345 1247630 1390251 860521 287019 152200 297903 380851 393335 527543 692999 440833
37335 440833 -446695 -1364942 -1291577 -66550 1100516 970832 -76406 -497083 279934
37326 279934 1039684 473425 -1117202 -2450289 -2964451 -3031657 -2864641 -2261622 -1479722
37317 -1479722 -1390816 -2322075 -3339738 -3208485 -1788996 -104860 795067 737060 333817
37308 333817 294010 797751 1399019 1552590 1209119 688117 8483 -1164461 -2650653
37299 -2650653 -3375470 -2526750 -881260 -186835 -1077121 -2294087 -2339427 -1290810 -383406
37290 -383406 -212420 -187532 250008 709538 573445 113644 242718 1226102 2189099 2154670
37280 2154670 1298853 817568 1535077 2923776 3669667 3039280 1474007 -13571 -682767
37271 -682767 -365635 577826 1396340 1424786 737568 86268 -23301 152911 247170 416751
37261 416751 802272 860321 94612 -806512 -595261 697590 1558765 956152 -406737
37252 -406737 -1277576 -1399402 -1147642 -437008 928727 2220303 2252529 926317 -598184
37243 -598184 -1395555 -1639932 -1793199 -1773870 -1386677 -911357 -656422 -379857 181211 506019
37233 506019 -180285 -1552752 -2157220 -1148165 451936 817841 -531829 -2207217 -2593078
37224 -2593078 -1535910 -229403 152769 -571659 -1644306 -2023643 -1213421 224395 1154570
37215 1154570 1119008 794401 878278 1018086 526431 -237790 -203296 733624 1374775 820519
37205 820519 -440994 -1360643 -1475765 -920303 -88699 352201 -38069 -545244 192282
37196 192282 2204855 3745793 3554883 2477746 1856590 1484416 592599 -140751 493660
37187 493660 1777612 1597969 -445691 -2352965 -2587780 -1928409 -1748078 -1965702 -1724717
37178 -1724717 -1008804 -510063 -551838 -931843 -1290050 -1112497 -42609 1352602 1913945
37169 1913945 1457703 1111399 1539402 1886677 1304979 508408 689006 1623366 2050936
37160 2050936 1469064 458105 -427772 -1058561 -1264860 -927756 -393191 -47408 289685
37151 289685 875755 1326645 1131554 499508 -47186 -452488 -733562 -451397 443371 910618
37141 910618 186591 -756774 -533047 412240 545340 -128699 -138250 743604 939727 -301743
37131 -301743 -1665035 -1936360 -1646411 -1575526 -1289453 -392044 241796 -79486 -399643 366320
37121 366320 1472532 1529624 819344 662586 1045428 746726 -372303 -1060508 -825215
37112 -825215 -696704 -1383028 -2121038 -2051718 -1563420 -1451395 -1612427 -1423982 -857271 -450039
37102 -450039 -489027 -788639 -1054261 -1058090 -706187 -300902 -477898 -1445284 -2397493 -2111157
37092 -2111157 -261504 2011753 3014927 2081388 251966 -758698 -312323 657193 943421
37083 943421 406661 -303094 -850227 -1345528 -1620471 -1234730 -355178 100912 -411872 -1267615
37073 -1267615 -1410945 -621094 368016 877400 994177 1158464 1342890 1042900 150069
37064 150069 -605977 -537784 -55229 -142297 -815559 -977880 -76029 1008672 1266743 896818
37054 896818 603223 402844 115868 289113 1376238 2530540 2599332 1966957 1912130 2358847
37044 2358847 2008885 815267 430459 1595679 2836663 2712449 1844659 1528758 1634267
37035 1634267 1304501 757198 838415 1372891 1415201 811762 209443 -262567 -1057694 -2022221
37025 -2022221 -2301723 -1557089 -378215 573977 1069692 1034060 596301 333821 621048
37016 621048 847243 225718 -718408 -610840 698076 1728413 1463606 743269 871679
37007 871679 1699317 1957328 1007371 -528992 -1636465 -1793146 -1152664 -314571 176350
36998 176350 375013 787565 1496642 1853721 1432444 870791 1127875 2073864 2513290 1732190
36988 1732190 461621 -6276 691803 1742143 2185287 1780126 885415 -50059 -674943
36979 -674943 -797755 -649244 -840317 -1579179 -2090813 -1450409 -910 820687 319538
36970 319538 -597722 -905572 -984323 -1767235 -2958218 -3326415 -2654693 -2141281 -2548364 -3030300
36960 -3030300 -2438290 -1007959 46312 148212 -254404 -700004 -1240273 -1811707 -1830828
36951 -1830828 -949197 138858 281193 -707590 -1753161 -1901776 -1479928 -1354491 -1457888
36942 -1457888 -939952 256027 993083 509398 -480161 -867581 -622063 -422595 -406250
36933 -406250 -180090 268037 522364 386156 -113489 -1020256 -2014038 -2171913 -1135553
36924 -1135553 -67908 -268274 -1187567 -1206752 -197612 288149 -526002 -1685067 -2369738
36915 -2369738 -2975005 -3621772 -3332975 -1825944 -621495 -957055 -1815014 -1588701 -695130
36906 -695130 -735304 -1712106 -2016546 -1009465 189368 651804 765389 1001266 971782 362219
36896 362219 -274875 -343766 -42706 179791 303268 344466 -43557 -958280 -1704055 -1451843
36886 -1451843 -176200 1431958 2639777 2925073 2026992 324849 -1059049 -1113356 61306
36877 61306 1407435 2031550 1903919 1510505 1187828 975337 900045 1069588 1385597 1410996
36867 1410996 845978 96570 -28739 666551 1452946 1651079 1508545 1637590 1939807
36858 1939807 1794700 1193968 881271 1173571 1352359 650143 -646137 -1565083 -1618511
36849 -1618511 -1126095 -575690 -171205 14503 -77221 -291581 -269109 125447 569543 667544
36839 667544 409556 38670 -363724 -823304 -1105059 -889816 -424871 -460101 -1182125 -1683075
36829 -1683075 -1059553 265008 998389 631301 -86666 -340156 -182910 -94119 -252195
36820 -252195 -527322 -687475 -428849 263479 690912 91302 -1111802 -1557314 -773470
36811 -773470 148379 181245 -294018 -427420 -201667 79344 666804 1631786 2079934 1406458
36801 1406458 684315 1340620 2896466 3585388 2960740 2207041 1882411 1174663 -195109
36792 -195109 -1066905 -653125 140641 173362 -245245 -131523 553162 1059855 1040840 715632
36782 715632 298615 -24260 45022 476841 726708 468451 60425 -112363 -155304 -97429
36772 -97429 425938 1307989 1582370 746815 -196717 -26047 868847 1030292 42948 -1008192
36762 -1008192 -1175107 -725626 -369717 -228675 32066 525842 944022 840768 38966
36753 38966 -1077304 -1760336 -1630344 -1090157 -757569 -665959 -366071 307346 931257 952611
36743 952611 249414 -735811 -1351648 -1337339 -1033242 -794764 -419009 344177 944389 549348
36733 549348 -588526 -1274656 -1051421 -640708 -438711 83387 900796 873770 -319630
36724 -319630 -1162967 -595077 84289 -601925 -1492403 -499389 1684142 2340641 1060794
36715 1060794 467868 2014128 3714279 3311348 1496662 352102 277062 283063 177950
36706 177950 584244 1350550 1538425 829384 -149275 -740364 -746295 -335774 -74878 -568892
36696 -568892 -1532558 -1876700 -1263775 -698135 -877569 -1014017 -294571 519201 243515 -822792
36686 -822792 -1565293 -1923088 -2544218 -3105681 -2648323 -1333907 -267396 290925 955068
36677 955068 1561353 1208121 72391 -541616 -300496 -290608 -877260 -861539 389776 1563280
36667 1563280 1278897 95456 -561097 -475645 -443119 -769682 -1157827 -1531781 -1907579 -1846281
36657 -1846281 -954304 392124 1519058 2230288 2536751 2254500 1570090 1290167 1682295
36648 1682295 1775338 785218 -454721 -635602 33317 274830 -178678 -324457 391626
36639 391626 1359112 1876221 1846776 1319155 348996 -555687 -781568 -519074 -498664 -829337
36629 -829337 -990500 -921845 -1096544 -1474220 -1434586 -876515 -390840 -261287 -300507 -629848
36619 -629848 -1383504 -1660048 -322899 1897407 2797598 1762998 686519 957648 1351540
36610 1351540 287809 -1447674 -2078906 -1724539 -1816521 -2375442 -2067961 -760946 97189
36601 97189 -139835 -434331 -32614 400547 333720 500848 1435877 2112814 1360339 -138403
36591 -138403 -643244 159634 793772 225624 -711925 -683055 216974 793334 622855 497695
36581 497695 862020 934161 109089 -699569 -358355 401760 -162832 -1887495 -2473386 -809394
36571 -809394 1243994 1556593 655471 314727 475971 -284704 -1831494 -2321962 -1111907
36562 -1111907 201820 172009 -710759 -1309238 -1518513 -1771441 -1884046 -1321037 -108147
36553 -108147 1063944 1345982 360285 -1087851 -1233889 665197 2841174 2920972 1211546
36544 1211546 310624 1239847 2059866 1109222 -513828 -1094850 -1060539 -1728845 -2698451
36535 -2698451 -2585274 -1498906 -737926 -541819 -91419 574225 558321 -68098 -250934
36526 -250934 188471 418289 430425 1164861 2431388 2587598 1057514 -506433 -605048
36517 -605048 10504 -137367 -821625 -682332 506840 1622585 1926821 1740398 1484548
36508 1484548 1170889 922605 1056131 1449506 1581217 1380463 1337244 1532941 1269664 104580
36498 104580 -1287057 -1846240 -1417790 -747981 -375591 -136457 210797 492199 520837 495688
36488 495688 588307 506841 -11526 -537826 -404501 285821 757266 662788 394482 214187
36478 214187 -117862 -572155 -554017 110419 654125 499191 222702 581314 1165639 1028837
36468 1028837 283450 500 641045 1563129 2063416 2002090 1392326 296650 -763601
36459 -763601 -1146033 -927747 -598781 11609 1384420 2798213 2570816 413560 -1688813
36450 -1688813 -1836647 -470674 696379 1080018 1302884 1520844 1167922 272092 -313345
36441 -313345 -242616 -192131 -679736 -1237628 -1230819 -811094 -504478 -328828 109347 903990
36431 903990 1714079 2194851 2204567 1730244 973921 418191 432988 821353 1062648 979377
36421 979377 798325 551032 -63358 -983295 -1486448 -1105959 -478669 -576991 -1262411 -1452255
36411 -1452255 -811318 -313019 -657675 -1058592 -495268 456063 240100 -1354989 -2662817
36402 -2662817 -2249329 -667300 424742 282831 -404351 -685715 -390783 33471 297998
36393 297998 585827 1096790 1515182 1269086 375943 -368827 -313028 292845 792101 985881
36383 985881 1039335 931365 620989 429028 557886 544078 -34101 -646183 -553808 -142703
36373 -142703 -339161 -912140 -775956 10762 186964 -432152 -392826 874833 1680976 522418
36363 522418 -1453342 -1991558 -800712 488641 767540 298435 -434057 -1200242 -1547402
36354 -1547402 -1186160 -754587 -1053889 -1714752 -1725930 -973712 -61627 981697 2361105
36345 2361105 3219678 2397661 449811 -799822 -795132 -561314 -354279 866521 2987052
36336 2987052 3935450 2544277 431873 -347783 44749 418441 840233 1877135 2765621
36327 2765621 2429810 1555441 1585189 2174785 1760791 388722 -226410 425820 853238
36318 853238 110918 -804950 -861216 -553967 -624118 -704022 -334058 -80129 -480747 -900841
36308 -900841 -588948 -14784 -6878 -304800 -131111 427398 764171 908832 1157404 1079276
36298 1079276 198109 -734733 -559777 393497 664085 -114202 -805198 -724893 -476656 -453946
36288 -453946 -78167 732455 800496 -500607 -1861414 -1793160 -880454 -776412 -1525298 -1589738
36278 -1589738 -479954 344422 -281230 -1450069 -1573552 -668352 -156522 -712844 -1335616
36269 -1335616 -736793 1005787 2559251 2787477 1729539 258280 -807521 -1095332 -554823
36260 -554823 579475 1709102 2174426 1819083 1042656 267720 -312045 -446908 134591
36251 134591 1127379 1612396 1068991 43481 -615297 -754535 -640895 -195940 695445
36242 695445 1429252 1176180 112100 -676402 -593431 -77568 344322 709540 1062127 1037079
36232 1037079 474265 -91743 -912 801085 1813738 2380899 1968610 622341 -704215
36223 -704215 -919105 -109977 548087 376071 -121909 -421849 -838850 -1641391 -2217825 -1923046
36213 -1923046 -1066514 -320308 154020 255662 -507132 -2029571 -3015083 -2592337 -1781172
36204 -1781172 -1931738 -2414568 -1657620 -31442 460986 -551157 -1118876 -167447 830187
36195 830187 527418 25490 782598 1765447 880370 -1564773 -3041095 -2282958 -657864
36186 -657864 157672 175310 222228 432118 409513 70755 -360986 -724173 -917905 -961759
36176 -961759 -1171258 -1712837 -1978945 -1188649 292049 1136724 806826 162698 -25980
36167 -25980 -122891 -577049 -893638 -578265 -259275 -767506 -1701056 -2041579 -1738026 -1489009
36157 -1489009 -1312670 -672441 115869 39001 -892195 -1452464 -1102784 -755030 -1071226 -1302092
36147 -1302092 -686881 112985 66041 -596024 -927154 -759832 -490478 -1712 878122 1317503
36137 1317503 409426 -1015075 -1099471 356304 1493945 1108836 218767 142769 450077
36128 450077 43260 -765151 -728488 306188 1233525 1382231 1158164 981232 693592 261205
36118 261205 133101 509383 909285 822830 309536 -263464 -580575 -334849 543882 1374069
36108 1374069 1132260 -195837 -1337746 -1386081 -1064234 -1476559 -2127002 -1445557 740063
36099 740063 2595804 2624914 1456568 482027 -224718 -1309462 -2182039 -1467032 531530
36090 531530 1597550 538679 -1113913 -1376594 -525671 -155543 -512062 -525638 -21798
36081 -21798 -176 -653592 -875491 -152849 602520 667833 496356 420133 -154270 -1315235
36071 -1315235 -1796752 -760761 736417 1349967 1428749 1922615 2328702 1549419 143561
36062 143561 -240985 578159 1221845 1144212 1189192 1546941 1133368 -347770 -1474862 -1162623
36052 -1162623 -229249 63309 -181629 -178149 62674 -7492 -476524 -1084138 -1622420 -1572249
36042 -1572249 -276168 1765919 2821954 2095494 916190 683132 788432 59844 -804095
36033 -804095 -196871 1589192 2613046 2209993 1616641 1493025 914669 -504371 -1419035
36024 -1419035 -815634 233686 185297 -729189 -1212645 -996453 -813680 -830560 -500166 249829
36014 249829 900279 1306461 1700544 1841514 1305505 612177 794158 1597461 1437056 -219601
36004 -219601 -1631356 -986933 1018923 2086872 1366715 260288 175518 810381 1158297
35995 1158297 1142057 1379507 1921324 2132489 1638195 694707 -274463 -922720 -901237 -214184
35985 -214184 394224 167559 -455989 -219991 1038356 1768237 728244 -1087360 -1605659
35976 -1605659 -434845 711418 436058 -646496 -1128835 -744768 -231438 93870 523307
35967 523307 909908 538114 -680978 -1749842 -1832558 -1357874 -1279118 -1669038 -1747525 -1086048
35957 -1086048 -80222 724552 1121477 1046143 589030 322821 873119 1891907 2217503
35948 2217503 1478339 747444 961272 1465989 1073115 -64634 -830762 -1026529 -1471528
35939 -1471528 -2219636 -2156073 -859860 392985 262354 -943155 -1962713 -2200107 -1824251
35930 -1824251 -971907 172631 965134 912512 424590 191608 162554 -51004 -155506 423705
35920 423705 1338154 1610038 1155130 960149 1511108 1993810 1482611 196792 -902389
35911 -902389 -1235171 -866964 -33518 1110451 2321929 3073318 2680744 950412 -1144759
35902 -1144759 -1978373 -1039396 237214 160681 -1071386 -1858618 -1496084 -745108 -184349
35893 -184349 556623 1574574 2106888 1852906 1697091 2290229 2927737 2725239 1966521
35884 1966521 1298391 476525 -911680 -2172447 -2229337 -1191595 -51907 768211 1413211
35875 1413211 1584290 908188 69417 125255 735536 556315 -481090 -872464 44398
35866 44398 959404 698115 60731 378566 1288910 1365507 386706 -459496 -495436 -379617
35856 -379617 -781277 -1298634 -1274366 -1024907 -1496117 -2811965 -3783729 -3180290 -1268249
35847 -1268249 325617 383391 -615077 -1201721 -574110 845617 2166523 2743974 2337489
35838 2337489 1263284 369143 208678 284506 -184249 -875573 -742161 197606 687509
35829 687509 219070 -124221 461556 1056537 573530 -290466 -129148 783140 786612 -622989
35819 -622989 -2015482 -2003100 -854761 166053 191685 -762896 -1934777 -2235251 -1199450
35810 -1199450 387598 1402354 1763785 2097859 2293692 1648181 505712 288026 1325574
35801 1325574 1971227 806053 -1257913 -2170577 -1394888 -251896 58042 -274608 -400103
35792 -400103 -21818 385385 260068 -276894 -404335 366909 1240221 895963 -624640
35783 -624640 -1652473 -1001552 459510 1063764 469707 -352419 -686015 -610205 -372352
35774 -372352 -264643 -843930 -2169037 -3005200 -2041474 45012 1058071 174362 -904800
35765 -904800 -379120 1185833 1849297 1012774 -59153 -194469 306392 412634 -280961
35756 -280961 -1260978 -1741558 -1371021 -529657 -3722 -150553 -433899 -115283 649153 915975
35746 915975 310659 -286992 120653 1200770 1637727 857027 -266978 -608953 -109891
35737 -109891 476088 678917 611802 434834 111124 -328239 -713947 -931689 -873784 -342911
35727 -342911 601521 1397877 1590541 1479520 1547318 1495638 741774 -257171 -341164 485116
35717 485116 756928 -320341 -1591787 -1627356 -678748 53381 265778 456083 575856
35708 575856 101601 -796414 -1321657 -1172770 -631136 217144 1275717 1722915 784996
35699 784996 -816876 -1475862 -848692 -122692 11888 225681 955112 1372399 739270
35690 739270 -349909 -930001 -910267 -554663 268318 1319853 1418966 -96813 -1977245
35681 -1977245 -2446782 -1591162 -1038001 -1488204 -2001449 -1838231 -1556919 -1718421 -1710177 -785525
35671 -785525 492558 898880 331906 -13628 685753 1807763 2156706 1373134 81946
35662 81946 -1019547 -1744502 -2208688 -2502147 -2665259 -2712144 -2583349 -2252922 -1871442 -1590030
35652 -1590030 -1336633 -1077932 -1115946 -1575165 -1758573 -884894 449509 623458 -753723
35643 -753723 -2055928 -1878793 -963936 -754651 -1031650 -572550 445999 550970 -580384
35634 -580384 -1485846 -1010571 397961 1782251 2687734 2758163 1737073 356264 -107533
35625 -107533 346951 432589 -146767 -54732 1210311 1947003 729125 -1156066 -1427268
35616 -1427268 -17499 1133408 886492 -127139 -1001091 -1464883 -1351452 -499921 620133
35607 620133 1143353 814934 120789 -475108 -806391 -776952 -525319 -532843 -936226 -1104556
35597 -1104556 -551153 188091 300014 -158859 -582096 -730848 -569477 155219 1266482
35588 1266482 1789476 1294350 919248 1823194 3255157 3586221 2771183 2203525 2384177
35579 2384177 2380305 1628991 741820 293564 142134 191885 619937 1119130 1051313 542568
35569 542568 343529 503512 341245 -160953 -175053 547430 1256750 1446122 1365449 1120438
35559 1120438 506689 -10502 531603 2023899 3098049 2959455 2292142 1945120 1858103
35550 1858103 1689530 1367589 659129 -594393 -1502868 -834978 826039 1249169 -308467
35541 -308467 -1707890 -818267 1550808 2963714 2549193 1432627 723098 510272 496018
35532 496018 410648 -46206 -805252 -1171598 -668074 141812 301878 -340803 -1112376 -1402343
35522 -1402343 -1161795 -782751 -713743 -898239 -675937 180282 628576 -357257 -1842937
35513 -1842937 -1775676 49524 1528152 1244957 214289 -133758 67261 225351 637720
35504 637720 1334195 1129628 -545308 -2173388 -2170269 -1177104 -647601 -400600 438816 1171192
35494 1171192 499829 -926336 -1278004 -468953 -57261 -437078 -425483 280968 499127
35485 499127 -198194 -675758 -240458 358379 534480 761267 1188198 1008237 47252 -508177
35475 -508177 54912 708229 315316 -545871 -555436 308762 834815 277055 -914455 -1853575
35465 -1853575 -2031760 -1482249 -622518 40361 251246 117400 3129 366844 1325038
35456 1325038 2144182 1732557 105623 -1295760 -1410626 -914958 -863798 -867007 -14430 1053453
35446 1053453 755975 -963053 -2507741 -2994018 -3064371 -3177840 -2823986 -1898419 -1251929
35437 -1251929 -1204632 -899421 153510 1120818 1176925 744242 714619 1297409 2133230 2706700
35427 2706700 2361819 910852 -543469 -542954 736108 1683066 1619543 1429272 1506835 927714
35417 927714 -538796 -1370443 -445138 1172636 1851010 1593824 1392768 1452935 1333955
35408 1333955 1027355 780742 546768 420056 774116 1305578 1055332 68892 -312836
35399 -312836 374623 832458 314560 54974 952038 1623470 657065 -771215 -702785 480367
35389 480367 1062862 1025573 1554615 2360900 2156373 1294259 1241867 1710711 1098464 -253576
35379 -253576 -216912 1304532 1727934 -47132 -1639449 -868049 958483 1338300 316461
35370 316461 -178431 477051 1144172 1053911 649175 492033 617096 897690 1159541 1070008
35360 1070008 565925 127799 89741 51543 -490218 -1315093 -1795381 -1686205 -1169397 -480232
35350 -480232 111424 284238 -35882 -603346 -1171339 -1552634 -1508608 -1179060 -1384556 -2546930
35340 -2546930 -3456232 -2428582 104075 1610010 678448 -1107694 -1423024 -186732 832866
35331 832866 593733 -225574 -399069 597039 2241215 3293094 2878063 1655348 1231803
35322 1231803 1995967 2514184 1762351 823937 1238682 2589260 3124854 2205307 732824
35313 732824 -464953 -1279493 -1544485 -1025127 -277963 -300355 -1078116 -1467087 -758591 464703
35303 464703 1207938 1061163 244502 -598875 -637223 320712 1205423 753119 -737632 -1632703
35293 -1632703 -1110824 -123263 132641 -215665 -216329 524474 1539216 2107776 1701848 232412
35283 232412 -1693009 -3037213 -3217453 -2580645 -1886074 -1555725 -1439997 -982372 312986
35274 312986 2111342 3093144 2289444 540357 -271553 403196 1173270 849912 100188
35265 100188 182019 958057 1277930 792418 214450 -1528 -119397 -252170 -79728 330590
35255 330590 328288 -292302 -796709 -539540 70228 170234 -414911 -1195929 -1837918 -2290879
35245 -2290879 -2274997 -1399705 59056 1135652 1255545 874015 669888 566179 135566
35236 135566 -349926 -113058 836101 1433106 969744 101129 -152481 84108 -190563 -1289768
35226 -1289768 -2356877 -2504324 -1737654 -585424 532968 1288104 1399014 1037750 811146
35217 811146 907955 720868 -154730 -1002947 -833654 106985 584988 171487 -174437 307013
35207 307013 892240 443330 -803283 -1487927 -1003205 -156064 186573 199099 388634 553030
35197 553030 208654 -375109 -432073 109642 479415 217085 -207815 -179942 232941 597132
35187 597132 825648 1149948 1629829 2051568 2179555 1892680 1243253 543525 174991 165289
35177 165289 197351 128620 155897 373950 643033 1044750 1858826 2799600 3006275 2327613
35167 2327613 1895632 2644235 3882639 4340513 4170136 4680937 6186745 7347533 6899282
35158 6899282 5059522 2912719 1259824 402365 250636 225747 -285148 -1030663 -1101763
35149 -1101763 -335304 233029 -257736 -1372439 -2138432 -2287897 -2172164 -1978728 -1650538
35140 -1650538 -1222056 -754676 -259806 25382 -201760 -566795 -121924 1322982 2664607
35131 2664607 2905340 2406687 2041751 1817419 1280710 694287 651898 850825 435916 -527649
35121 -527649 -1071271 -888616 -768723 -1177670 -1441933 -889388 -5540 247480 -214520 -615372
35111 -615372 -471085 -85605 145113 385564 968845 1611214 1569234 723581 -40980 -21763
35101 -21763 197554 -377933 -1490890 -1949279 -1550766 -1334727 -1636990 -1458713 -515733 -271571
35091 -271571 -1598341 -2841339 -2021177 69656 1027367 422825 -23003 420831 590496
35082 590496 -54816 -337181 410461 1003309 379432 -695127 -1051561 -890292 -937828 -998363
35072 -998363 -593621 -123546 -177255 -397847 -111266 532708 989849 1249681 1441652 1209634
35062 1209634 433438 -98918 243467 816292 724159 413467 1052445 2644975 3908740
35053 3908740 3922795 2952028 1720280 704572 109591 -162674 -502883 -1071975 -1464423
35044 -1464423 -1288917 -744603 -240908 60155 -57884 -901797 -2063217 -2426706 -1719562
35035 -1719562 -1154952 -1601833 -2061249 -1191036 477560 1308235 956832 466236 374795
35026 374795 323729 322009 763627 1200722 709822 -353960 -513507 612502 1718245 1866057
35016 1866057 1715519 2091147 2606717 2505378 1866274 1197200 609955 63204 -265984
35007 -265984 -426023 -853669 -1579194 -1905784 -1383596 -504663 56868 315926 576961 695830
34997 695830 343179 -304572 -671924 -509395 -228737 -499290 -1505082 -2561355 -2700656
34988 -2700656 -1802627 -764544 -310593 -222383 -154515 -388789 -1029078 -1315667 -814511 -497568
34978 -497568 -1339655 -2564636 -2797167 -2279168 -2162080 -2190581 -1235944 177813 301263
34969 301263 -791803 -1077922 54562 857036 416253 214980 1238252 1935188 779025
34960 779025 -1121857 -1802726 -1207588 -440770 212030 757470 481876 -651079 -965330
34951 -965330 582736 2293720 2051847 579984 90420 715024 820112 180332 108158
34942 108158 624873 214731 -1267452 -1867070 -426201 1736065 2825614 2648239 1920381
34933 1920381 931065 -211795 -1028654 -1189401 -975385 -768291 -618769 -529960 -597960 -746656
34923 -746656 -791725 -710004 -471499 18829 364616 -226547 -1551910 -1968381 -421197 1846406
34913 1846406 2847070 2369114 1568014 853582 -64935 -599877 256681 2017614 3037951
34904 3037951 2782300 2176441 1819326 1499673 1360959 1788450 2197791 1719033 995338
34895 995338 1376034 2400307 2270268 941123 330573 989154 1064488 -494433 -2042549
34886 -2042549 -1838749 -558011 203253 244083 150091 -175240 -921852 -1465547 -1315519 -989680
34876 -989680 -965161 -832861 -369284 -240722 -737008 -1056061 -763467 -655611 -1216600 -1585208
34866 -1585208 -1098920 -484444 -394963 -164497 743390 1401083 868813 -238014 -897952
34857 -897952 -1159064 -1248462 -620169 707300 1302287 404270 -511355 33955 1063600
34848 1063600 809899 -410300 -1050527 -982328 -1104666 -1225960 -638300 -108848 -930815
34839 -930815 -2422156 -2691115 -1661283 -1097332 -1713446 -2419254 -2460693 -2213529 -1733543
34830 -1733543 -567141 757700 992452 207630 -256259 -98395 -396888 -1317650 -1509777
34821 -1509777 -431315 565483 298681 -651623 -1209012 -1257603 -1081576 -649214 -205365
34812 -205365 -419047 -1252544 -1706236 -1220937 -344939 337173 829250 1025470 688746 440170
34802 440170 1328344 2946098 3470555 2224387 745783 528569 1079029 1123390 480497
34793 480497 -258763 -816622 -1019472 -486877 561081 1109192 787340 542714 1041145
34784 1041145 1415550 576696 -1122365 -2488051 -2933754 -2457991 -1094787 618235 1484912
34775 1484912 1062156 532530 1140070 2421135 2999371 2467405 1423941 291405 -755081
34766 -755081 -1213321 -787121 -133627 -35558 -198157 120641 702686 716842 171598 -128142
34756 -128142 72375 253666 195406 288113 744587 1322115 1789008 1924243 1264523 -236516
34746 -236516 -1476989 -1214724 160552 924349 262382 -815375 -1113313 -758104 -493045
34737 -493045 -357107 96527 802377 1274131 1462526 1728455 1983086 1599905 409884
34728 409884 -817464 -1286097 -1115478 -861486 -501196 304053 1104543 902150 -210514
34719 -210514 -738856 185640 1445658 1635986 1259836 1790902 3075286 3413705 2222118
34710 2222118 868435 455446 377781 -204977 -878765 -917963 -617398 -684675 -1120456 -1549571
34700 -1549571 -1910967 -2077406 -1591057 -519622 240629 239745 164134 508319 588828 -173509
34690 -173509 -1023910 -1077034 -836714 -1270834 -2178014 -2754696 -3005777 -3231941 -2907905 -1627210
34680 -1627210 -469854 -684312 -1520705 -1255891 -45420 309899 -569554 -985001 -20124
34671 -20124 994850 761348 20889 138129 1007302 1587483 1526169 1048054 -7008 -1751255
34661 -1751255 -3204585 -2854676 -415187 2581493 4099055 3324143 1222768 -440793
34653 -440793 -757893 -365967 -341590 -717755 -688958 -85194 262884 -186539 -842486 -826565
34643 -826565 -89280 698551 933561 446086 -556519 -1628507 -2355474 -2542571 -2009953
34634 -2009953 -565483 1307886 2173116 1004352 -1266157 -2557395 -2065000 -887257
34626 -887257 -111853 521046 1551021 2513744 2610577 1994982 1532981 1615006 1849765 1735037
34616 1735037 1197426 632510 604466 1209866 1684488 1168310 -39934 -687334 -254703
34607 -254703 360590 284595 -27642 345705 1225075 1521091 770834 -291271 -710461 -296684
34597 -296684 481189 1197210 1816653 2411093 2754570 2522467 1957644 1835956 2352244 2557406
34587 2557406 1636536 305198 -102456 327028 257658 -657989 -1192212 -646309 -94408
34578 -94408 -666971 -1798753 -2269424 -2029114 -1762104 -1349978 -138600 1578720 2605906
34569 2605906 2378849 1522431 872341 727006 1030473 1508859 1568659 758830 -535187
34560 -535187 -1403681 -1508679 -1382173 -1546403 -1809102 -1640006 -954933 -277769 -133481 -369995
34550 -369995 -272737 476762 1234218 1260925 912735 1146371 1870848 1860184 648126 -594644
34540 -594644 -758405 -377390 -560295 -1120774 -941124 209362 1322539 1485341 730763
34531 730763 -295219 -818962 -338454 763637 1290354 613618 -352641 -311703 662253
34522 662253 1379144 1202085 553399 40681 3294 649023 1665784 1970850 905024
34513 905024 -561085 -939245 -300934 47576 -201041 6857 1054908 1860800 1637189
34504 1637189 1024955 749930 423128 -421238 -1164186 -1018747 -349257 -96733 -427123
34495 -427123 -771747 -732510 -236708 707452 1725921 2067644 1566152 1072814 1203702 1257930
34485 1257930 322908 -1024184 -1267145 -85708 1124506 1035329 -128697 -1149745 -1251122
34476 -1251122 -669280 -159904 -153250 -257376 327919 1691221 2758445 2410879 883699
34467 883699 -504335 -967556 -1002827 -1417661 -2190053 -2627585 -2305799 -1475763 -682649 -279799
34457 -279799 -301643 -578076 -846103 -837876 -454676 61718 295492 177384 182857 709986
34447 709986 1384962 1433120 733952 -7886 -232286 -82342 183102 605878 924885 347441
34437 347441 -1217456 -2235789 -1034322 1808123 3663211 2828278 451126 -1063512
34429 -1063512 -874577 -148626 -107897 -654478 -1066293 -1169515 -1224194 -1138701 -565286 330935
34419 330935 932906 1105953 1327186 1588313 1020654 -698740 -2320882 -2457381 -1531276
34410 -1531276 -1005707 -977653 -209675 1292212 1668193 46755 -1761331 -1835734 -974673
34401 -974673 -1120799 -2051954 -1898390 -452984 488559 223784 152903 973884 1144327 -507083
34391 -507083 -2461590 -2554302 -1090328 -76271 -154291 -218017 252909 346892 -585212 -1852178
34381 -1852178 -2447629 -2117979 -1139999 28657 666030 286653 -525161 -651214 -5474
34372 -5474 367354 -42837 -557563 -717201 -1121817 -2117198 -2765840 -2213217 -1232144 -1138882
34362 -1138882 -1717473 -1575821 -321743 980808 1557198 1781351 1969463 1598248 436400
34353 436400 -538158 -310138 665933 1087481 637171 256967 601294 1091170 852939 5855
34343 5855 -536500 -354739 -88828 -547113 -1554434 -2084654 -1585746 -769840 -700231 -1290696
34333 -1290696 -1308203 -34546 1601369 2000012 744380 -1002625 -1878749 -1627635 -929796
34324 -929796 -378441 -1945 322682 383891 -195570 -1355407 -2376555 -2461856 -1586146 -642174
34314 -642174 -576313 -1346431 -1864923 -1120564 661081 2157169 2335856 1502861 737834
34305 737834 506486 312646 -313760 -1145807 -1831728 -2458391 -3003533 -2842123 -1646306
34296 -1646306 -380622 -349711 -1353156 -1888616 -1317909 -667755 -867906 -1365026 -1265564
34287 -1265564 -876571 -1054316 -1666990 -1827020 -1296896 -627901 -139768 223665 187705 -619771
34277 -619771 -1709644 -2073798 -1682927 -1648860 -2562239 -3592030 -3710669 -3003755 -2187647
34268 -2187647 -1525530 -914288 -526719 -607171 -898416 -926568 -700901 -567225 -487111 -57233
34258 -57233 699860 1083588 517491 -646880 -1409088 -1192814 -452879 -68129 -237032 -328213
34248 -328213 55882 343068 -217276 -1377180 -2188980 -2328490 -2327658 -2446930 -2178630 -1183569
34238 -1183569 13847 687970 686624 203756 -556847 -1080365 -662696 528943 1181351
34229 1181351 399398 -976237 -1428222 -674117 380408 1184963 1935718 2569812 2528242
34220 2528242 1733875 879836 429771 78551 -470210 -866734 -679906 -131868 133172
34211 133172 -218412 -886950 -1165775 -545971 617388 1250100 821219 164265 367773
34202 367773 1160572 1353476 700544 119698 5061 -310465 -1027222 -1233824 -542355 -75180
34192 -75180 -782603 -1846729 -1925081 -1067434 -153189 700247 1707002 2133825 1156365 -434474
34182 -434474 -1118047 -965414 -1235249 -1795941 -1111113 873413 2065638 1313278 114223
34173 114223 52476 430537 29847 -462738 207510 1325475 1191823 -95834 -977299
34164 -977299 -1060808 -1265665 -1583248 -955981 463924 1118959 547119 23580 123239 -232957
34154 -232957 -1390904 -1770072 -456967 912636 648547 -193351 388203 1894067 2049012
34145 2049012 420789 -1034765 -1043989 -499129 -478480 -633543 -283222 283146 412583 58498
34135 58498 -435377 -751401 -484732 524492 1513304 1437203 549811 239355 933976 1408815
34125 1408815 775111 -104206 -88494 461631 521810 174525 268805 831433 1069305 729899
34115 729899 371733 355260 480553 604616 824457 1033015 949612 585085 167918 -236074
34105 -236074 -540162 -396788 250007 761089 678568 547897 937820 1130841 80681 -1580482
34095 -1580482 -2042170 -964807 -30250 -339308 -859080 -415980 222703 -267341 -1280519
34086 -1280519 -957770 916118 2326173 1627549 -458302 -1906707 -1614066 -94483 1434630
34077 1434630 2158421 2137677 1989935 2038324 1896533 1191574 414956 391750 992885 1193745
34067 1193745 584363 20740 388032 1390567 2065621 1961419 1294463 415263 -327359
34058 -327359 -592869 -492078 -691476 -1541017 -2450207 -2677087 -2305898 -1780621 -985103 247526
34048 247526 1087539 421338 -1374376 -2594776 -2421977 -1845155 -1922693 -2233756 -1795617
34039 -1795617 -652740 314398 607604 406010 97200 93574 613401 1147530 796302 -342177
34029 -342177 -989045 -601610 -411177 -1433113 -2519029 -2035672 -699311 -654085 -1963148
34020 -1963148 -2290911 -498909 1592098 2000374 1318826 1292416 2049728 2359161 1815701
34011 1815701 1221012 1147343 1362773 1489723 1299747 630789 -180316 -236668 640941 1129798
34001 1129798 68952 -1549256 -1701972 -292352 644465 -31569 -983281 -656068 298060
33992 298060 190748 -970526 -1496830 -592983 522448 445420 -555941 -1192363 -945799
33983 -945799 -374739 18312 342032 735466 1000853 1048203 1117228 1295467 1373197 1447440
33973 1447440 1974407 2754738 2654132 1143213 -559737 -947425 -299356 -23106 -332001
33964 -332001 -224431 279391 -154516 -1655394 -2277358 -850563 903449 721666 -914962
33955 -914962 -1696141 -936945 -122420 -241867 -561848 -352428 -110609 -375023 -643545 -338535
33945 -338535 62051 -259003 -1145876 -1613905 -1038625 291761 1601299 2234698 1986641
33936 1986641 1102725 -28828 -1148115 -2000347 -2208694 -1667213 -916208 -656249 -919539
33927 -919539 -1130339 -930551 -523669 -244152 -191469 -252653 -152194 380357 1148845 1467759
33917 1467759 1063838 671117 1096677 1976632 2225633 1554440 722152 345146 297976 338786
33907 338786 495717 674444 621619 452259 539873 751917 493550 -337227 -1136634 -1493402
33897 -1493402 -1592426 -1570042 -1253280 -801839 -830412 -1510181 -2202730 -2337736 -2024354 -1471583
33887 -1471583 -512401 835701 1967857 2390479 2352494 2315774 2252181 1939927 1532219 1289584
33877 1289584 1026511 347662 -653936 -1298058 -954778 295116 1596353 2035739 1598876
33868 1598876 1158035 1200299 1031485 -85314 -1448780 -1637048 -547173 483823 685636
33859 685636 691515 1011630 1019930 234491 -519385 -259030 602657 877755 265718 -534559
33849 -534559 -981866 -1064072 -768399 -46552 732381 970657 548345 -76629 -454602 -522690
33839 -522690 -480857 -550071 -801231 -1110518 -1348191 -1496684 -1371072 -574316 704257 1248445
33829 1248445 168740 -1490897 -1784438 -622399 -22189 -1068839 -2156944 -1347058 738691
33820 738691 1798038 939821 -475046 -786341 294349 1825865 2565592 1862281 302645
33811 302645 -686473 -363765 547043 1013030 974210 834697 437507 -468995 -1294959 -1255081
33801 -1255081 -659513 -502270 -899023 -933195 -94058 973220 1309611 667762 -385491
33792 -385491 -1019992 -856288 -368283 -329180 -720237 -736027 -88991 503131 563206 632189
33782 632189 1112637 1344864 823534 398688 997090 1871669 1562049 159595 -833168
33773 -833168 -705788 -242334 -252206 -635808 -1016583 -1257658 -1220378 -849153 -512975 -533750
33763 -533750 -539109 -51577 548966 502377 -174926 -857295 -1263679 -1350432 -749739 594192
33753 594192 1682212 1552193 728199 373974 465305 179917 -355081 -329879 9779 -358070
33743 -358070 -1244198 -1284805 -144668 954343 1186035 1069600 1176832 1387563 1745507
33734 1745507 2558646 3274837 2721842 902824 -787476 -1459142 -1476457 -1128787 -161776
33725 -161776 1017275 1326177 712387 342144 665684 885447 704682 807933 1162268
33716 1162268 802837 -125744 -231304 522389 403790 -926079 -1362464 137123 1546794
33707 1546794 1122010 287842 849017 1563608 355925 -1777632 -2179676 -702044 582183
33698 582183 1033257 1760841 2746237 2697434 1747577 1458943 1933443 1598128 225050 -463384
33688 -463384 206608 782285 425492 312446 1178336 1687977 707321 -618206 -638580 342673
33678 342673 918869 810209 792370 1174652 1609011 1837917 1652822 725007 -663244 -1412451
33668 -1412451 -987779 -280774 -202788 -218021 618199 1851365 2197080 1558512 1098804 1310573
33658 1310573 1313371 434310 -565348 -502523 590742 1494000 1202403 -174111 -1725831
33649 -1725831 -2455447 -1739559 282733 2442467 3132230 1809780 -195216 -997240 -288926
33640 -288926 530811 452439 119991 490907 1191223 1190907 502728 42798 71289 -53713
33630 -53713 -569475 -866557 -591938 -256018 -351829 -570190 -289093 621018 1707390 2256246
33620 2256246 1697567 245397 -862053 -447335 1144573 2318510 2147609 1396002 1382249
33611 1382249 2392410 3546843 3841404 3045534 1814389 1042503 981338 1128578 1113303
33602 1113303 1199750 1533291 1594898 1157817 1037110 1767812 2241962 1205847 -360723
33593 -360723 -289571 1392579 2246717 1059337 -408623 -260047 882291 1390098 1137840
33584 1137840 878387 436779 -669510 -1708822 -1579262 -566814 262125 769260 1292598
33575 1292598 1221309 -102336 -1526630 -1180867 682545 1939831 1787701 1610632 2258037
33566 2258037 2604889 1765437 854277 1201593 2235759 2577356 2171417 1892752 1843494
33557 1843494 1504358 1058520 1178742 1769115 2128937 2185740 2458959 2935596 3064488 2834997
33547 2834997 2854451 3323686 3852054 4291515 4823151 5214729 5005710 4516907 4618115 5315866
33537 5315866 5679622 5435154 5409368 5940980 6174204 5684746 5472700 6214512 6740216 5769350
33527 5769350 4247700 4116623 5233000 5545988 4406270 3653812 4721883 6398977 6622801
33518 6622801 5281902 3958472 3672451 4130228 4750065 5238949 5287842 4696996 3888012
33509 3888012 3573811 3822373 3984477 3600940 2918269 2449300 2409281 2663954 2960752 3139570
33499 3139570 3246215 3434440 3759887 4231767 4991352 6056869 6914100 6924123 6250036
33490 6250036 5727909 5616450 5274965 4480986 4149591 4978776 6135981 6276212 5364432
33481 5364432 4467704 4086235 3768514 3247785 2920776 3117655 3725352 4599575 5603182
33472 5603182 6201676 5776473 4466081 3103840 2296048 2087600 2359970 2844841 2906428
33463 2906428 2167003 1315049 1442778 2563533 3615874 3929756 3786397 3523120 3132110
33454 3132110 2902491 3351466 4147902 4126320 2876634 1452501 1001021 1500003 2340148
33445 2340148 3298431 4292248 4906485 4885503 4575960 4318750 3935280 3315002 2883725 2887273
33435 2887273 2801876 2135590 1318494 1091848 1407969 1632658 1549379 1511245 1779265 2240573
33425 2240573 2629514 2630899 1997935 955928 240705 350464 958274 1355418 1246742 890985
33415 890985 741707 1119087 1900907 2439860 2218178 1627022 1530176 2039764 2476241 2589174
33405 2589174 2825060 3154153 2803565 1711915 1122280 1922850 3335654 4081442 3954157
33396 3954157 3400078 2524510 1567547 1432122 2493158 3634215 3722299 3312103 3554800
33387 3554800 4191903 4243492 4051107 4735115 5910132 5957315 4680415 3739041 4009972
33378 4009972 4353460 3732568 2909291 3007983 3691794 3920942 3614102 3455296 3641004 3762290
33368 3762290 3583519 3255559 2999445 2964598 3101166 3037925 2577785 2304361 2921927 3980723
33358 3980723 4298666 3803775 3686310 4302781 4366210 3075990 1718123 1906392 3246547
33349 3246547 4144669 4205270 4335506 4888137 5202829 4935371 4552662 4377852 4174215 3806990
33339 3806990 3450702 3081959 2581945 2330117 2839837 3812260 4441091 4644725 5001428
33330 5001428 5407890 4974110 3606812 2578247 2879353 3865382 4228980 3636462 2721911
33321 2721911 2062915 1885804 2286007 2961206 3060311 2053498 581145 -179502 168483
33312 168483 1090739 2034470 2843140 3428001 3742662 4089631 4817305 5652167 5941751 5701526
33302 5701526 5835558 7025633 8831010 10283888 11249120 12898341 16566830 21798093
33294 21798093 25578717 24421126 18031444 10386424 6049749 5589090 5787092 4197694
33286 4197694 1773179 514579 428737 239526 -211926 -129003 338013 213303 -441079
33277 -441079 -495163 282025 804199 547319 339365 728020 1001924 651376 512209 1373072
33267 1373072 2442720 2411412 1362977 472185 282613 392823 510665 740856 996141
33258 996141 1060246 1101368 1303944 1232263 469682 -346526 -175481 848129 1582665 1632386
33248 1632386 1731846 2144771 1927693 430051 -1415146 -2093131 -1248589 173031 1047364
33239 1047364 833546 -293906 -1539660 -2086943 -2004316 -2107384 -2571637 -2386033 -867577
33230 -867577 915737 1263704 143598 -699718 -66749 1214224 1591187 885324 353211
33221 353211 874781 1806950 1908641 990839 127703 239467 997750 1455626 1319978 989589
33211 989589 582589 -218969 -1247395 -1634751 -949203 117811 699459 800966 859217
33202 859217 880754 744180 804933 1297647 1570658 972433 222319 674610 2228009 3252833
33192 3252833 2873336 2066059 1958313 2231747 2036069 1477754 1173600 1079903 860240 863009
33182 863009 1623792 2794029 3621247 4087512 4438220 4065741 2375179 533853 546116
33173 546116 2313043 3423177 2540683 1240357 1402643 2467789 2875418 2859743 3701776
33164 3701776 4932115 4598901 2373573 332948 109587 946516 1357273 1290556 1574826
33155 1574826 2189543 2268131 1433573 298455 -227464 253797 1247590 1649176 890284
33146 890284 -135112 -24011 1160118 1888948 1483078 1197243 2210875 3665862 3887763
33137 3887763 2779363 1689614 1378132 1437922 1515382 1774622 2064819 1790782 913841
33128 913841 193137 109491 237595 -42173 -765206 -1502356 -1778546 -1283409 -122703 1116395
33118 1116395 1956626 2546696 3117632 3252032 2445673 1137803 256612 -111025 -547169
33109 -547169 -875857 -219098 1226016 1801589 516425 -1447442 -2207757 -1427380 -272534
33100 -272534 253225 65502 -488563 -1026331 -1193351 -910622 -433417 116414 875557 1617606
33090 1617606 1659103 878524 115611 -128189 -629307 -2097920 -3528837 -3214517 -1204673
33081 -1204673 557000 692398 -168659 -723946 -722510 -772866 -1176274 -1605950 -1577136 -840535
33071 -840535 357388 1176545 791896 -628193 -1966193 -2397412 -2123663 -1678012 -1138696
33062 -1138696 -446769 89539 197497 130856 182939 82735 -495209 -1151079 -1244833 -986632
33052 -986632 -1223746 -2093426 -2663511 -2169766 -999981 -115778 29680 -347624 -866593
33043 -866593 -1212117 -1123026 -604104 -89818 -60038 -458492 -697867 -301704 553323 1194262
33033 1194262 1166827 753844 622285 909915 978969 336325 -569530 -989406 -1011831 -1296238
33023 -1296238 -1806506 -1806459 -1276194 -1216842 -2014939 -2574151 -1936871 -845805 -561454 -861338
33013 -861338 -602833 176369 312369 -370846 -598101 337567 1485337 1749597 1309187
33004 1309187 865938 544770 274457 276707 373168 -256074 -1725865 -2756056 -2350537 -1333151
32994 -1333151 -1056239 -1381375 -1355589 -1240013 -2106977 -3610459 -3996595 -2670432 -1155833
32985 -1155833 -882086 -1375758 -1471308 -1184740 -1352538 -2151117 -2979761 -3384906 -3281600 -2604437
32975 -2604437 -1505315 -667972 -712759 -1347167 -1623565 -1007203 136328 967230 832970
32966 832970 -195614 -1149303 -914083 450172 1589954 1537866 955902 963983 1297416 809610
32956 809610 -396882 -765074 437533 1927195 2239761 1685115 1417154 1387442 635081
32947 635081 -723581 -1326423 -621911 217239 18704 -784272 -1041104 -597913 -239077
32938 -239077 -416831 -892108 -1316044 -1406733 -853396 184664 794631 386040 -228106 179703
32928 179703 1373619 1922547 1321741 534809 178623 -399920 -1573758 -2296544 -1598720
32919 -1598720 -272612 162883 -405901 -771693 -255031 676313 1483439 2182716 2810915
32910 2810915 3089645 2783891 1882347 501657 -878258 -1363039 -565824 610787 925800
32901 925800 407900 123167 385938 270389 -805344 -1997927 -2147463 -1304512 -487148
32892 -487148 -306472 -457711 -404661 -25922 456226 822080 971013 854001 483885 49293
32882 49293 -134903 27436 204907 55124 -185187 81369 943927 1789929 2127590 2090820
32872 2090820 1891718 1364316 486015 -156156 33522 904147 1795575 2183971 1827349
32863 1827349 830228 -92814 -125351 418714 230222 -963213 -1508623 -51371 2229916
32854 2229916 3036633 2040203 994812 1026274 1469824 1529026 1482421 1698101 1731889 1152749
32844 1152749 395950 103540 183540 53420 -548496 -1290625 -1501022 -674742 869183
32835 869183 1927531 1517148 -37487 -1547510 -2213693 -1932746 -846237 598091 1526508
32826 1526508 1489651 1120853 1118398 1097768 473350 -201391 -167299 -111394 -1123676 -2379504
32816 -2379504 -1917037 226170 1744994 1327535 181506 -295421 -364429 -563569 -389327
32807 -389327 388015 689056 -182960 -1069111 -573088 834828 1631248 1335565 608381
32798 608381 -12127 -362800 -273930 80032 10656 -720180 -1421883 -1605543 -1699625 -1913021
32788 -1913021 -1469172 19567 1419233 1478559 519396 -401802 -1099884 -1717717 -1493974
32779 -1493974 224362 2224856 2459410 819654 -662887 -612571 89678 23729 -580593
32770 -580593 -250495 1624645 3893092 4886016 4107720 2417770 790863 -488389 -1260483
32761 -1260483 -1011432 234619 1231544 942396 268551 931411 2811083 4027490 3733398
32752 3733398 3014411 2647044 1924567 518236 -380424 24823 660053 334788 -390845
32743 -390845 -429161 -32581 -89549 -639968 -1342495 -2286310 -3082829 -2433154 -121890 1738948
32733 1738948 1171824 -907460 -2095073 -1792387 -1279730 -1183372 -803697 257262 1409398
32724 1409398 1974532 1679124 593560 -505628 -433607 735954 1284638 317777 -597746
32715 -597746 185338 1641289 1687633 515698 32837 668719 1100046 807703 624149
32706 624149 866467 1051602 1356019 2248618 2801505 1643311 -366089 -818422 568848
32697 568848 1403876 406739 -651995 85952 1749116 2334421 1549179 546964 -57904
32688 -57904 -484396 -798303 -827483 -676024 -515779 -208312 334038 821322 1028597 1140822
32678 1140822 1360546 1616069 1859139 2155537 2304955 1890678 928619 58612 -100507
32669 -100507 446173 1112957 1214825 600984 -37175 138897 978496 1510125 1425140 1490037
32659 1490037 2089789 2459962 2050692 1517957 1456933 1307544 648877 446504 1610225
32650 1610225 3241140 3805476 3302862 2804115 2537374 1975817 1292723 1215954 1740389
32641 1740389 2182561 2141835 1511562 280996 -756919 -174335 2063107 3894182 3766217
32632 3766217 2700032 2401654 2753721 2779991 2571201 2387673 1379588 -710968 -2074410
32623 -2074410 -1327781 -18732 -236339 -1248094 -1190879 -585285 -1094416 -2065978 -1645535
32614 -1645535 -404044 -467465 -1675177 -1936846 -958655 -383476 -599673 -556554 -365980
32605 -365980 -952072 -1527768 -591084 1001607 1166699 286899 444406 1506358 1497103 418314
32595 418314 58137 367490 -253674 -1381930 -1080746 301934 682613 249928 947298
32586 947298 2315209 2053627 501404 269186 1562442 2162335 1847746 2484243 4060799
32577 4060799 5069456 6146485 8545852 9980365 7442020 3216059 2092081 3483237
32569 3483237 2884659 323835 -7526 1902928 1881862 -27613 547620 3599937 4487197
32560 4487197 2943497 3340379 5401959 4438485 1506355 2574183 6662640 6765619 3821029
32551 3821029 6268710 13810386 16903298 15235721 19209468 28946308 32392419 30795836
32543 30795836 41715404 66308999 83486465 95920278 147578996 257878402 362678998
32536 362678998 371054686 276232326 163877878 106023485 91910655 76738064 52450756
32529 52450756 39348073 39437839 36053742 25972808 20653740 21631492 19354741 13040876
32521 13040876 11063473 13563361 12334227 6818721 4703374 7280547 8071210 5609602
32513 5609602 4954939 6623615 5723385 2281575 1621851 4086446 4454850 2063642 1900077
32504 1900077 4869236 6089484 3979441 2549668 3387010 3363709 1737155 1876480 4177930
32495 4177930 4408979 1171370 -1426762 -648468 1136774 1545687 1569929 1922212 1054029
32486 1054029 -1119010 -1962610 -496678 866223 458752 -384381 -387598 -193855 -207218
32477 -207218 176645 527596 -348434 -1829918 -2199584 -1726611 -1820955 -1793610 -184508 1508101
32467 1508101 724561 -1214014 -799066 1468477 1746989 -288159 -799695 1304698 2433916
32458 2433916 755299 -756771 175364 1415847 750170 -297020 223003 1113545 608919
32449 608919 -367149 -135566 867953 1347214 1282092 1114415 688017 268201 690053 1583891
32439 1583891 1518735 513492 91633 457070 299380 -251220 443287 2136910 2571423
32430 2571423 1452880 1041977 1856634 1571943 -431178 -1307255 517579 2472242 2033393
32421 2033393 541801 306843 824047 574571 78405 421544 820690 213033 -514878
32412 -514878 -169055 581967 739512 925986 1791896 2231155 1247112 -15623 -83426 528412
32402 528412 660383 629638 1172085 1726140 1520277 1008370 735132 306782 -156520 589115
32392 589115 2546520 3534657 2381190 1015137 1395562 2399296 2048446 946139 922978
32383 922978 1776380 1970859 1436027 1221466 1316278 1035529 651920 580210 -29912 -1786868
32373 -1786868 -3186213 -2433368 -245544 1257229 1564670 1613739 1558459 900461 87905
32364 87905 -111578 -125807 -556283 -600820 453856 1278473 422036 -842110 -271514 1538503
32354 1538503 2000237 711288 -238176 -30968 -109599 -1035043 -1336003 -355715 362791
32345 362791 -304858 -1223538 -1026182 -211280 41110 -242745 -270369 243984 1111906 2046536
32335 2046536 2404689 1549600 3523 -759539 -150547 885650 1423886 1638652 1875648
32326 1875648 1836914 1391668 1203789 1758893 2476997 2460280 1580915 383845 -508496 -568923
32316 -568923 345056 1472923 1615874 580302 -452841 -438748 266997 678284 661052
32307 661052 951051 1926975 3003105 3328597 2744427 1877986 1418882 1520874 1989970
32298 1989970 2764849 3803890 4664742 4821928 4413478 3965861 3336471 1890910 -31172
32289 -31172 -1014560 -529168 195991 110065 -60408 679949 1635500 1514146 624337 255622
32279 255622 435314 95695 -841545 -1346083 -1122843 -828035 -481228 520976 1692003
32270 1692003 1667465 509544 -72031 622568 1261563 903199 555252 1150433 1692447
32261 1692447 983125 -136279 -25321 1161338 1862372 1563980 1206193 1362764 1544536
32252 1544536 1366615 1109774 936496 646648 432333 853110 1715720 1894097 802150
32243 802150 -591075 -791763 515436 2226935 3054823 2642439 1579302 655460 216469
32234 216469 148916 293496 632161 1058052 1281034 1147900 799539 345405 -240636 -640949
32224 -640949 -162711 1209217 2183283 1494916 -281443 -1243685 -584234 509638 688123
32215 688123 113424 -315955 -419092 -459359 -192539 637059 1343958 1102899 408908 411842
32205 411842 968635 893775 223818 446041 1903171 2785483 1823056 381270 335854 1158166
32195 1158166 1009606 -151216 -700096 -208349 24633 -563252 -858551 -139645 735342
32186 735342 1003423 1261748 2040723 2459868 1537713 -98066 -998294 -739223 44372
32177 44372 889981 1719918 2210239 1967437 1241137 722252 663925 697050 433889 -76507
32167 -76507 -349996 212045 1654936 3036934 3208778 2176011 1049095 501051 121753
32158 121753 -415930 -577438 21424 709775 662551 54489 -415176 -562215 -578060 -394221
32148 -394221 121294 763660 1298401 1660063 1494708 313785 -1396845 -2176532 -1423385
32139 -1423385 -315156 -91861 -382452 -223610 206859 86743 -569310 -1153311 -1553074
32130 -1553074 -1817146 -1414841 -135087 896155 502596 -736003 -1354971 -1160746 -1006030
32121 -1006030 -927198 -279412 552189 496077 -130011 164186 1410436 1672945 -98801
32112 -98801 -2328417 -2884946 -1669682 -197638 418118 155067 -494155 -951902 -870559
32103 -870559 -520780 -420491 -409715 137699 984518 957520 -274098 -1341170 -892378 565337
32093 565337 1419142 1048832 276600 -56858 -97394 -394833 -900097 -995480 -440812 145353
32083 145353 91167 -310974 -266037 95613 -236000 -1329597 -1741994 -623366 761569
32074 761569 898696 404508 867693 2047594 2238769 1139244 242978 260460 228023 -382235
32064 -382235 -678911 -207672 65471 -423213 -703769 -59356 575693 250132 -299518 52788
32054 52788 894409 1038079 385654 -293350 -776123 -1313631 -1647358 -1276569 -408821 276594
32044 276594 546579 639811 773919 1123034 1710170 1939550 1101891 -226218 -458533 664625
32034 664625 1369951 450580 -861092 -953697 -372706 -544180 -1124898 -739334 351952
32025 351952 554628 -337093 -845260 -315585 223841 5730 -426159 -542080 -645457 -873350
32015 -873350 -767002 -345423 -350093 -945079 -1357404 -1238118 -1187950 -1491445 -1548829 -1083310
32005 -1083310 -728544 -851955 -940635 -728329 -755596 -1175331 -1210608 -538885 307 -84963
31995 -84963 15617 849541 1481400 1151998 948596 2131046 3682637 3485825 1524694
31986 1524694 -76180 -217578 -87977 -815130 -1634119 -1334778 -225617 493091 516427
31977 516427 509739 843634 1212997 1348168 1343061 1282052 1090974 796487 533628 264713
31967 264713 -181128 -731335 -997516 -697005 -6912 618194 941247 1143201 1451898 1660212
31957 1660212 1282896 314455 -459868 -248443 775427 1625337 1560033 674134 -453937
31948 -453937 -1263220 -1387860 -846258 -184175 -10653 -263206 -335911 -19233 204889 -25165
31938 -25165 -422793 -640928 -824327 -1168776 -1463615 -1556701 -1738560 -2070826 -1887480 -778060
31928 -778060 370028 328008 -658524 -1092612 -354783 422611 -61450 -1686031 -3329112
31919 -3329112 -4133722 -3854792 -2599975 -874788 478309 923233 644385 113447 -375084
31910 -375084 -560274 -202091 411029 505839 -156605 -828387 -851206 -642044 -961717 -1671013
31900 -1671013 -1972252 -1581275 -922348 -381342 -73946 -169577 -721663 -1274530 -1296573 -910248
31890 -910248 -589094 -322682 200955 763184 820950 496068 453983 704124 450073 -576480
31880 -576480 -1471974 -1302662 -272385 676960 950271 642165 234127 239748 764559 1245920
31870 1245920 1069350 512899 458605 1045441 1398063 994458 446384 395944 466938 81805
31860 81805 -363393 -108343 611355 836479 334002 -238911 -638458 -1456083 -2864525 -3812437
31850 -3812437 -3184109 -1353975 108102 207355 -531388 -957611 -662948 -163770 -14696
31841 -14696 -219759 -547556 -972596 -1507048 -1864966 -1687440 -1033982 -344654 47888 120267
31831 120267 -15950 -156533 47815 780157 1652486 1950035 1362634 280512 -554191
31822 -554191 -475229 725995 2341040 2916497 1634422 -484792 -1515069 -881287 86067
31813 86067 80868 -541539 -573077 288802 1212836 1429865 1035395 695057 914050 1531719
31803 1531719 1833680 1386698 725152 725822 1302757 1452988 801998 265677 712333 1747641
31793 1747641 2470409 2746689 2932856 2857913 1998515 453198 -994782 -1682181 -1460248
31784 -1460248 -582421 313430 506113 25823 -243681 149458 439965 -107083 -851296
31775 -851296 -754601 -153322 -217808 -916626 -977974 71604 1240487 1687604 1640768 1323229
31765 1323229 405191 -778662 -859855 613734 1938917 1294765 -683966 -1752731 -1084863
31756 -1084863 -41029 35526 -596016 -1060979 -1274059 -1623628 -1971694 -1806634 -1146347
31747 -1146347 -638480 -756168 -1289006 -1661687 -1479340 -732607 270134 1053491 1245408
31738 1245408 907282 572976 778599 1449886 1841038 1243692 -189502 -1433647 -1551129
31729 -1551129 -698647 -40912 -477841 -1487536 -1542664 118406 2413597 3528036 2956299
31720 2956299 1854362 1346518 1290759 1129925 1123011 1787317 2577142 2311450 955209 -140758
31710 -140758 -128937 200960 -226085 -1136249 -1465495 -953636 -216989 417754 1114776 1653933
31700 1653933 1408574 436901 -266179 10826 888937 1652740 2116959 2290247 1894642
31691 1894642 922473 120109 67537 132701 -714369 -2185371 -2759507 -1609982 431992
31682 431992 2073546 2873608 3008869 2613546 2005042 1885580 2503676 3020276 2496745
31673 2496745 1259483 521511 787785 1378078 1510039 1156073 737992 591212 899206
31664 899206 1645789 2412268 2565988 1806888 357983 -1258612 -2355148 -2317635 -1304210
31655 -1304210 -472457 -760038 -1549776 -1393801 -53615 1159151 1254973 740723 519819
31646 519819 639386 769868 1012938 1395199 1312137 451375 -290715 131719 1293076 1800414
31636 1800414 1233256 499187 265286 168206 -119121 -93450 633595 1303497 786938 -823099
31626 -823099 -2115169 -1952177 -680970 458498 773327 576431 377043 219700 67027
31617 67027 257082 939268 1389932 751825 -585498 -1267901 -807410 -153503 -82730 -121734
31607 -121734 231431 334499 -416693 -1140719 -696262 194034 -228014 -1902017 -2736122
31598 -2736122 -1646046 -87992 277481 -100804 31367 374394 -210815 -1269627 -1032962
31589 -1032962 726629 1926968 1014900 -849988 -1581343 -1084625 -904352 -1517084 -1748853
31580 -1748853 -1032084 -479953 -857446 -939973 661843 2939294 3500745 1904971 260585
31571 260585 268242 1271645 1860766 1929546 2100675 2239607 1821864 1097828 691671 494763
31561 494763 41525 -429310 -404104 -228038 -591260 -1089332 -613237 776002 1655526 1215859
31551 1215859 275635 -97331 80208 312703 619479 1181190 1666976 1652912 1268982 843450
31541 843450 332157 -330933 -727704 -435994 255683 700397 757217 753874 779392 658197
31531 658197 589956 1106109 2117359 2563513 1565709 -260262 -1229874 -486003 991485
31522 991485 1641233 1221916 831554 1184847 1744052 1805555 1557761 1439447 1194911 466306
31512 466306 -198594 -8796 671124 758844 271999 452629 1738196 2794057 2296173
31503 2296173 815687 25150 519999 1321530 1364778 683413 296 -292703 -413137
31494 -413137 -641624 -838532 -691230 -310575 -169507 -304963 -95044 728424 1360648 983768
31484 983768 196217 364452 1593669 2433474 1855799 515602 -392528 -609924 -561398
31475 -561398 -436927 -245868 -187659 -275356 -82943 501138 781552 208539 -647079 -829076
31465 -829076 -316606 189546 478841 932254 1547490 1748888 1243853 372199 -444421 -943623
31455 -943623 -726668 446491 1851799 2120292 867857 -594121 -780718 160414 861343
31446 861343 702599 505533 1099749 1993887 2052989 1063413 -74867 -558127 -375633 176401
31436 176401 834927 995858 -45185 -1835798 -2588550 -1249089 833957 1480332 567405
31427 567405 -264 864679 2110101 2382927 1742214 886846 -16344 -821661 -840989 106839
31417 106839 949487 792555 337752 655983 1237755 721585 -839693 -1980143 -1982066 -1540743
31407 -1540743 -1190969 -630981 -28217 -465722 -2206577 -3691809 -3391998 -1911127 -1104169
31398 -1104169 -1529943 -1950835 -1332752 -280014 -63346 -872982 -1660513 -1570998 -992646
31389 -992646 -916095 -1520728 -1927902 -1481985 -701714 -447954 -584857 -304345 351534 306640
31379 306640 -917246 -2291805 -2605327 -2020181 -1578798 -1647549 -1705968 -1432085 -1089369 -792940
31369 -792940 -202772 772836 1560085 1578606 981694 469272 593991 1374695 2289610 2535532
31359 2535532 1679914 270664 -555570 -318916 293489 424878 142522 107339 497157
31350 497157 842284 807998 595836 535307 667733 766682 510420 -269086 -1246738 -1728192
31340 -1728192 -1438993 -878891 -491530 14928 845058 1210215 364883 -833055 -829706 216633
31330 216633 546587 -407886 -1103736 -473964 326607 -49839 -926530 -940865 -314470 -46484
31320 -46484 111802 949491 1855184 1642238 780782 672447 1045853 373803 -1183695 -1712229
31310 -1712229 -753658 -115718 -723092 -1039854 182027 1706574 1888540 1214823 1121576
31301 1121576 1630048 1802953 1508291 1211136 870206 382179 296522 866104 1253768 834922
31291 834922 303945 310844 166075 -701434 -1231083 -389194 760815 594214 -373622 -441809
31281 -441809 309226 302706 -641363 -1048486 -430092 54886 -166012 -269964 112763 185465
31271 185465 -323038 -526426 -45848 328552 216848 284273 728478 789961 421498 722546
31261 722546 1881624 2409497 1470532 344435 327922 693781 175440 -828904 -1110805
31252 -1110805 -654769 -208707 257798 1072843 1617596 1235672 755468 1314125 2097508
31243 2097508 1237761 -1053736 -2277853 -1096511 787925 1157518 285447 112559 1265299
31234 1265299 2379521 2259704 1402001 907685 782548 192164 -935855 -1630506 -1474702
31225 -1474702 -1476154 -2455551 -3275870 -2121741 524168 1839603 310011 -1982747 -2008397
31216 -2008397 181976 1701645 827235 -960022 -1385551 -412071 223739 -256753 -770163
31207 -770163 -268157 633127 670085 -60310 -193638 832242 1911250 1945401 1410203 1378247
31197 1378247 1729840 1510906 660050 84997 125393 205621 78420 159703 454839 427962
31187 427962 201976 545849 1288196 1183530 -66329 -1122927 -1074304 -672369 -600880 -152353
31177 -152353 1071011 1725958 721240 -642307 -465013 800726 1238719 559583 131508
31168 131508 385606 437850 168978 471542 1258913 1301024 390279 -249828 -100421 18089
31158 18089 -127316 322342 1202457 823590 -1291191 -3067205 -2681401 -1108663 -349348
31149 -349348 -511424 -364552 285211 608674 505414 664256 1190460 1552005 1650366 1773560
31139 1773560 1741936 1146421 160303 -778156 -1653456 -2378706 -2299279 -1300049 -688896 -1588468
31129 -1588468 -3030906 -3225497 -2284369 -1892082 -2427330 -2395175 -1033034 410098 706333
31120 706333 337777 222347 116840 -586711 -1484622 -1731570 -1314463 -775668 -216038 525041
31110 525041 1139055 1126573 488486 -486014 -1696581 -2884766 -3346344 -2769766 -1930477
31101 -1930477 -1731378 -1921463 -1636913 -882019 -442545 -460031 -207820 542899 968692 452180
31091 452180 -416903 -704767 -442960 -399176 -822015 -1083796 -607254 327394 907596 702309
31081 702309 42050 -464689 -601802 -608958 -663664 -540858 81462 1081187 1787294 1447568
31071 1447568 -79462 -1901123 -2492523 -1027966 1496520 2941471 2231147 567436
31063 567436 -6023 1033645 2344144 2571800 1813290 1067682 878949 976138 939495 721697
31053 721697 480560 204719 -246624 -691127 -444678 981824 2906472 3735011 2707547
31044 2707547 1050417 675023 1831844 2861096 2401744 982778 -21153 -222891 -239423
31035 -239423 -408514 -485179 -489659 -851014 -1451942 -1382649 -192530 1191967 1468638 548968
31025 548968 -531139 -1066975 -1222625 -1111386 -358552 895228 1406944 224793 -1692023
31016 -1692023 -2284303 -845970 1244546 2409313 2535292 2319417 1879827 889217 -408541
31007 -408541 -1244379 -1278446 -832033 -246115 379730 850539 879352 501360 37335 -357961
30997 -357961 -673783 -638588 87316 1228463 1940731 1749092 1049858 504193 288254 147847
30987 147847 -99240 -377732 -553055 -631829 -726859 -816853 -627122 41072 897728 1416451
30977 1416451 1473364 1241355 526021 -896077 -2120167 -1577033 616416 2056434 1017307
30968 1017307 -1109180 -1886831 -1289187 -1020138 -1165689 -192623 1740875 2319361 702851
30959 702851 -924908 -681246 412552 690040 587172 1161742 1632378 727843 -733190
30950 -733190 -1014868 -413418 -641337 -1721543 -1899834 -629200 606993 766782 536078
30941 536078 593681 351773 -780713 -2210616 -2990702 -2853894 -1936048 -451092 932511
30932 932511 1354307 834205 253280 11729 -342729 -881228 -770016 499429 2203140
30923 2203140 3198037 2990030 1758196 132825 -794237 -167560 1467794 2444411 1824150
30914 1824150 349506 -684907 -787025 -268560 343256 626845 660381 1189447 2650432
30905 2650432 4077819 3998259 2444127 915834 236190 -210889 -834508 -961404 -242153
30896 -242153 477960 531125 435654 670858 656865 -61602 -753114 -705047 -454518 -684206
30886 -684206 -875731 -292229 589407 926925 994390 1461343 1907230 1502480 609831 238606
30876 238606 337159 91320 -430804 -434719 39183 220423 133597 480683 1039323 801407
30866 801407 -125628 -416652 227787 320900 -1166022 -3105179 -3665959 -2490580 -600387
30857 -600387 986382 1692157 1215448 -96775 -1168765 -1295864 -992601 -1128568 -1652536
30848 -1652536 -1863961 -1560045 -1111175 -590452 375792 1835225 3178002 3718409 3271242
30839 3271242 2173959 1103847 812973 1560559 2687020 3141153 2631336 1970100 2058579
30830 2058579 2776646 3197165 2775361 1937615 1425015 1415862 1546644 1543450 1444437 1279340
30820 1279340 955501 561627 435155 740867 1231093 1589119 1756459 1729370 1329372 528486
30810 528486 -161002 -55481 852798 1708798 1671638 883379 321067 600036 1175324 1067568
30800 1067568 237271 -370608 -285530 -231285 -826028 -1299605 -518155 1117207 2002810 1507886
30790 1507886 613727 235780 176218 167150 683411 1923264 2982455 2971766 2231557 1591786
30780 1591786 1118044 487153 -39912 -45802 114481 -143960 -481942 -72098 941897 1418745
30770 1418745 758099 -306415 -671273 -138904 462944 257143 -614605 -1008188 -219020
30761 -219020 796180 490933 -977650 -1757280 -991302 -84931 -431704 -1270049 -1099020
30752 -1099020 -70197 580589 607057 641998 729042 611916 831970 1778821 2273841 1098581
30742 1098581 -549304 -402937 1258643 1820893 384419 -950038 -540960 517780 707055
30733 707055 407906 417019 96465 -1179527 -2246116 -1739207 -376165 193721 -40536
30724 -40536 128657 756581 680428 -392363 -1416971 -1678023 -1515757 -1266153 -725791 85070
30714 85070 646914 691515 446133 20650 -670568 -1300576 -1273212 -676371 -359877 -782391
30704 -782391 -1379268 -1396187 -900107 -618328 -992158 -1606373 -1528804 -303995 1291350 1788507
30694 1788507 661677 -860490 -1115596 46756 1224230 1288172 563012 15398 -79285
30685 -79285 -184721 -572911 -907187 -736399 11362 1134722 2398895 3421145 3628996
30676 3628996 2818041 1680599 1240770 1641614 2000705 1659636 993351 642500 574545
30667 574545 447680 342560 485028 749991 1104622 1930768 3087764 3384269 2138173
30658 2138173 615408 467293 1221059 1044452 -252765 -993038 -559290 -418708 -1559543
30649 -1559543 -2879107 -3122047 -2665465 -2204571 -1323453 183178 1008956 28901 -1769508
30640 -1769508 -2654259 -2535289 -2388138 -2158691 -1054860 580741 1454520 1189527 545723
30631 545723 -5016 -539727 -777061 -346947 183690 -46197 -619482 -305470 909314
30622 909314 1622230 969542 -429559 -1564806 -1916441 -1247021 243867 1486447 1487768
30613 1487768 779899 681930 1133539 773444 -619611 -1432953 -594591 821688 1211076
30604 1211076 459165 -524536 -1221442 -1481839 -984869 208853 1151828 1016311 211794
30595 211794 -277075 -271687 -345039 -684016 -796303 -317200 460859 946436 854479 441590
30585 441590 249650 552651 1082024 1439735 1597636 1675331 1494984 894550 269957 138209
30575 138209 293007 110877 -409555 -686908 -531264 -230171 231083 1061673 1843959 1912773
30565 1912773 1545937 1561144 1708768 950612 -427617 -714844 547886 1516243 751616
30556 751616 -583344 -659140 211605 431442 -130750 -138879 838497 1684192 1473840 514950
30546 514950 -422086 -836963 -500406 301602 658823 114406 -432209 29648 854667 611748
30536 611748 -477978 -633141 734473 2017718 1795102 727780 127538 -114205 -863724
30527 -863724 -1793807 -1559775 185673 2101813 2734681 2065545 1187671 914004 1097326
30518 1097326 1161006 892403 493123 35672 -657739 -1439817 -1647550 -953038 -27704 271635
30508 271635 115988 356601 1130294 1701106 1701621 1559978 1490196 1079076 311433 4900
30498 4900 533822 988505 489647 -343163 -247983 830516 1817902 2140535 2152061 2024455
30488 2024455 1405836 418193 -69213 357328 991903 1052551 689731 416996 209338 -139050
30478 -139050 -299566 125207 747455 841498 473624 344072 558208 474648 -63921 -301781
30468 -301781 169612 564383 56333 -816133 -820857 171150 1020459 967077 526584 449789
30458 449789 593257 401720 -12964 12162 675735 1431623 1749479 1667045 1448872 1100389
30448 1100389 516566 -92722 -296326 -36062 124022 -388932 -1324985 -1720884 -1048924
30439 -1048924 -2659 253906 -470348 -1171127 -966593 -196887 51404 -771612 -2123192
30430 -2123192 -2900415 -2393743 -979389 39438 -311419 -1415599 -1611715 -342434 888416
30421 888416 365285 -1555067 -2902848 -2559067 -1282619 -351034 -223656 -746941 -1658675
30412 -1658675 -2386220 -2147522 -897849 333020 582377 18877 -544598 -702198 -536527
30403 -536527 -138207 374103 709521 799259 988110 1368501 1378747 634973 -312133 -744566
30393 -744566 -854102 -1235934 -1692104 -1516008 -774941 -306010 -458445 -760938 -838392 -735835
30383 -735835 -340276 477574 1057190 442613 -1019893 -1728280 -936754 276591 722546
30374 722546 644036 752655 809740 264173 -492037 -680243 -415025 -336349 -401278 -129421
30364 -129421 282974 180562 -426807 -943454 -1171980 -1241044 -827440 406901 1747728
30355 1747728 2030446 1359639 1024679 1523172 1883679 1338374 533733 464904 1066030 1488374
30345 1488374 1177259 221557 -828479 -1212023 -636197 111584 -36968 -876369 -1119476
30336 -1119476 -411400 -10068 -846002 -1968489 -1823236 -305067 1357414 2137253 1780292
30327 1780292 459066 -1179090 -2050387 -1663024 -846092 -691588 -1121316 -1302894 -1088766
30318 -1088766 -1043595 -1232968 -1029696 -229744 489679 475362 -112832 -622267 -638673 -296468
30308 -296468 -74117 -195773 -140467 814314 2298927 2798809 1540395 -219915 -723443
30299 -723443 -27484 354599 -152383 -520887 1727 681562 552524 -121035 -418526 -154813
30289 -154813 99594 38491 -69901 16009 199891 399855 746430 1212212 1346778 742622
30279 742622 -291551 -917454 -781000 -445152 -469929 -495341 104005 964253 1065561 267206
30269 267206 -517591 -783354 -899355 -849930 69297 1612090 2100612 722591 -953638
30260 -953638 -1158603 -501747 -697372 -1628333 -1693845 -623665 145026 -110504 -512929 -340663
30250 -340663 55323 404422 994469 1658424 1786290 1611162 1897932 2141944 988106
30241 988106 -1066384 -1523057 532762 2668036 2360649 381965 -713940 -129094 945768
30232 945768 1599590 1785425 1265215 -142762 -1457678 -1299634 200509 1543875 1928908
30223 1928908 1979917 2326670 2596860 2183286 1263590 689770 1157616 2479332 3501502
30214 3501502 3114965 1635416 599057 773942 1178547 760308 124235 469628 1514644
30205 1514644 1874541 1187754 491454 524318 913397 1176084 1387175 1562040 1334282 622914
30195 622914 -94432 -478643 -723904 -1048164 -1306446 -1282275 -957152 -440928 -164 -55091
30185 -55091 -702514 -1369034 -1409554 -910782 -458216 -330361 -401903 -558694 -667397 -425411
30175 -425411 218703 827390 1140914 1459820 1804197 1464451 261908 -580309 -60874
30166 -60874 821743 434938 -863724 -1235674 -274491 510614 274816 -29122 383091 823506
30156 823506 608405 300787 547647 979028 1149305 1312501 1360697 332159 -1881364
30147 -1881364 -3565465 -3267419 -1867749 -1196813 -1443600 -1417148 -705544 -1822 320309
30138 320309 462979 277612 -513524 -1310044 -1179902 -331613 217564 289450 460741 449112
30128 449112 -725588 -2706534 -3646744 -2742045 -1382009 -939166 -901187 -341206 151732
30119 151732 -388243 -1214182 -779417 685639 1356261 569887 -372182 -519057 -668299
30110 -668299 -1607137 -2406264 -1751888 -72958 1010604 861634 185115 -448305 -1070072
30101 -1070072 -1341263 -563818 883838 1356154 -4525 -1862286 -2231408 -888405 634793
30092 634793 1123753 844289 712222 1120960 1795664 2291086 2387703 2222176 2103507 2100781
30082 2100781 1968231 1624855 1370038 1314688 1019822 226485 -441887 -245696 432770 491442
30072 491442 -262967 -806683 -449436 174776 137232 -466722 -859961 -780145 -656706 -821213
30062 -821213 -1162611 -1512113 -1832295 -1946460 -1530711 -598494 287213 565288 323010 120284
30052 120284 204564 263712 124481 287357 1255220 2499666 2761703 1530893 -306564
30043 -306564 -1475760 -1456120 -502990 731289 1283123 430634 -1248652 -2130379 -1530652
30034 -1530652 -641248 -675100 -1047966 -636036 50293 -341806 -1539508 -1897750 -1059988
30025 -1059988 -393991 -463604 -57965 1492787 2843367 2629019 1518148 986246 1102477
30016 1102477 822075 -250830 -1513902 -2260098 -2129861 -1270481 -609816 -1116103 -2259017
30007 -2259017 -2370543 -1184760 -510774 -1369733 -2221491 -1659739 -1138778 -2651384 -4925680
29998 -4925680 -4794413 -1905249 787363 1354827 990527 1196583 1471319 944211 175691
29989 175691 -98672 -395598 -1259341 -1920553 -1514803 -560394 11551 328671 905962 1436975
29979 1436975 1480101 1551513 2308044 3285837 3569665 3100557 2298206 1130005 -310088
29970 -310088 -1082862 -593575 179601 69041 -326042 288611 1417628 1351102 89434
29961 89434 -454125 433336 1028986 -36395 -1554257 -1633112 -468497 318346 227300 161045
29951 161045 576213 874879 656362 304439 64092 -420783 -1198503 -1486133 -740452 251974
29941 251974 169954 -1031265 -1863458 -1177064 304331 1002992 724302 819474 1888483
29932 1888483 2552977 1511758 -130329 -201844 1210568 1701336 186199 -1348059 -875167
29923 -875167 527875 373657 -1372070 -2235622 -876524 1189826 1944692 1335170 620569
29914 620569 459262 591667 664131 499103 6294 -533566 -513720 158059 730978 613385
29904 613385 171348 -27302 -169687 -641249 -1010346 -520550 618945 1363435 1243996
29895 1243996 826139 664890 571796 178960 -372181 -651713 -513333 -242177 -337031 -1107171
29885 -1107171 -2191603 -2652304 -2000716 -920145 -350002 -91439 765482 2083673 2504725
29876 2504725 1391026 -129491 -683016 -299031 195209 536935 795239 520027 -606096
29867 -606096 -1638510 -1224233 403118 1450341 806856 -715117 -1667044 -1615395 -1131969
29858 -1131969 -869561 -1071056 -1472547 -1426306 -626550 182218 -101092 -1400756 -2415597
29849 -2415597 -2291540 -1448078 -504270 495612 1297093 1114273 -53539 -884302 -525115
29840 -525115 128673 95079 88098 1076925 2113641 1629663 222710 -160870 462279 161165
29830 161165 -1367495 -2000882 -710867 724851 786993 502226 956718 889041 -917327
29821 -917327 -2776247 -2350471 -331810 987941 1631884 3137640 4570205 3156712 -784808
29812 -784808 -3277807 -2251810 -415683 -855972 -2667174 -3245379 -2565264 -2401793 -2832918
29803 -2832918 -2384963 -967729 -144404 -645265 -1601952 -2180856 -2321050 -1977344 -1159804
29794 -1159804 -586397 -856790 -1164626 -279512 1392014 2250448 1861483 1260627 938768
29785 938768 267771 -810536 -1231495 -513071 406022 630167 364152 3835 -521494
29776 -521494 -903360 -309969 1081171 1648414 451064 -1239019 -1648872 -898321 -451846
29767 -451846 -790832 -1000874 -519596 -41262 -365446 -1138372 -1222786 -67814 1579862
29758 1579862 2388816 1860309 867409 558576 949667 1092230 504341 -239445 -408854
29749 -408854 48015 733863 1281998 1440188 1188851 865523 709269 419989 -204701 -532062
29739 -532062 -2631 527616 -214623 -1599746 -1519314 414487 1919371 1257069 -286147
29730 -286147 -530776 373637 603827 -369707 -1324715 -1404669 -1014051 -640500 -176842 436265
29720 436265 938847 1248970 1479554 1543485 1406422 1435956 1770431 1773086 981485 119005
29710 119005 124978 604655 410729 -545668 -1290842 -1377899 -1210861 -894220 -81839 962787
29700 962787 1421683 1223781 1147863 1448717 1511724 1081310 684488 540686 163978 -594412
29690 -594412 -1172347 -1347587 -1612364 -2058246 -1927271 -851513 346618 688264 176104
29681 176104 -519933 -809588 -337435 764002 1510975 942791 -314749 -478638 936744
29672 936744 2311878 2230210 1330095 925347 998132 822893 612452 1052283 1768308 1715533
29662 1715533 829436 16537 -316685 -494987 -432730 437875 1876602 2606596 1864490
29653 1864490 424803 -395129 -262765 23900 -367144 -1336556 -1936239 -1427428 -230024
29644 -230024 536341 540567 603718 1196524 1440148 493021 -779830 -810679 334976 1066042
29634 1066042 727642 426977 943961 1303184 437298 -815840 -725083 831006 2204148
29625 2204148 2270704 1679050 1446015 1304738 280694 -1500875 -2524280 -1666320 265542
29616 265542 1318692 638390 -581067 -607661 759886 2103898 2209146 1365962 670639
29607 670639 560843 564585 291530 34855 185450 512484 496268 219988 388724 1310846
29597 1310846 2313306 2535725 2016434 1522380 1452295 1456696 1161355 694967 303275 -45689
29587 -45689 -341005 -233058 502370 1439450 1844540 1443023 601297 -92148 -224617 206584
29577 206584 693496 616106 38981 -185058 515602 1533902 1721999 761076 -535499
29568 -535499 -1156136 -763772 158651 646057 22632 -1178459 -1423021 16709 1792926
29559 1792926 1948092 506359 -508438 198656 1614102 2083612 1509918 1026794 1203774
29550 1203774 1566152 1544194 1013429 57790 -1046410 -1697066 -1485713 -809135 -383773
29541 -383773 -239270 176010 937037 1396946 1129427 514262 183754 366018 940379 1681886
29531 1681886 2269697 2457499 2383884 2352446 2275110 1811908 1087568 661654 671734 662062
29521 662062 431647 322332 437141 429674 423118 1118266 2364590 2725631 1470276 -1466
29511 -1466 -49228 719814 512340 -649334 -986258 2136 665055 -83453 -1103368 -1058984
29501 -1058984 -450525 -356852 -530403 -221702 179550 -53347 -325712 418224 1620778
29492 1620778 1612921 95931 -1432266 -1819652 -1413010 -892996 -362544 3707 -322968
29483 -322968 -1259960 -1875903 -1703786 -1415710 -1629189 -1892886 -1528842 -769280 -318162 -295279
29473 -295279 -317264 -274140 -379903 -620129 -640755 -172595 620008 1146705 837714 -108593
29463 -108593 -611979 97429 1341487 1815096 1420202 1243976 1640726 1622400 638051 -319546
29453 -319546 -256591 225580 -35478 -927252 -1449958 -1379719 -1287131 -1189877 -453684 911904
29443 911904 1903254 1704525 523906 -836986 -1608709 -1256049 186014 1787694 2345815
29434 2345815 1604556 499855 82189 537330 1309804 1810759 1868213 1682485 1415606
29425 1415606 863838 -184396 -1233000 -1304986 -236555 845242 894462 255405 -88840
29416 -88840 -43742 -259892 -820937 -1121080 -941223 -654765 -362927 199877 806608 767087
29406 767087 65523 -409377 -81139 648123 1228879 1650751 1948883 1847152 1378546 1133353
29396 1133353 1348840 1406961 818954 102275 23988 494421 919888 1210089 1637953 1993659
29386 1993659 1741987 980587 488640 700996 1211544 1440828 1299660 995673 610366
29377 610366 163752 -160992 -165568 68077 238779 187875 75070 139646 350878 415977
29367 415977 177458 -140624 -250502 -261268 -534116 -1049333 -1238567 -650602 411506 1167354
29357 1167354 1211221 882324 765586 985757 1131651 858428 373434 127397 129616 -46662
29347 -46662 -494478 -710385 -470569 -484143 -1448635 -2670073 -2557323 -716636 1265866
29338 1265866 1652128 564179 -503074 -762907 -821642 -1271080 -1544841 -818686 406888
29329 406888 544686 -1015776 -2772680 -2751603 -1039597 215739 -446008 -1975187 -2445795
29320 -2445795 -1765907 -1533241 -2382002 -2899970 -1731067 326504 1268530 376366 -1176152
29311 -1176152 -1973817 -1733481 -988618 -195467 479047 916751 1019628 840110 545032
29302 545032 266624 40426 -151524 -292783 -282120 -39754 312416 504934 408967 107196
29292 107196 -362356 -1026888 -1581767 -1393310 -333712 719603 867807 496916 748166
29283 748166 1606879 1590885 -49811 -1803712 -1709713 -125791 761403 92036 -654586
29274 -654586 -304890 25827 -1133134 -2917131 -3152748 -1554206 -53017 78062 -330625
29265 -330625 -202130 132938 -758 -233836 65988 565865 630018 480166 601981 614762
29255 614762 -91195 -1021317 -1087996 -250053 483680 625337 721544 1198927 1631395 1429412
29245 1429412 635876 -163278 -356665 184062 769892 402034 -912144 -1825278 -1269739
29236 -1269739 130228 1053998 1276033 1437011 1605052 1338490 805174 523886 283292
29227 283292 -352798 -822902 -375208 261092 -161481 -988311 -375937 1437321 2003216
29218 2003216 493553 -762364 198016 2087339 2637607 1905944 1398550 1329349 828785
29209 828785 -43469 -449413 -362605 -357444 -342758 -10389 32355 -869853 -1907186 -1715510
29199 -1715510 -470817 355606 52317 -802694 -1484198 -1537455 -570136 1004709 1583603
29190 1583603 260349 -1442652 -1428794 -129348 191768 -1019468 -1885482 -1077074 492284
29181 492284 1379420 1244877 311505 -1108564 -2003066 -1215826 720019 1773892 1062805
29172 1062805 -130120 -548353 -590626 -976320 -1350916 -1255806 -1160432 -1440232 -1456716 -702893
29162 -702893 146984 315057 93548 31105 -73311 -435846 -531384 -50213 321961 54675
29152 54675 -230534 91786 473709 255017 -45574 295005 801859 659489 216897 307763
29142 307763 709116 621874 161881 57361 303341 366823 293773 385796 254276 -503379
29132 -503379 -1143025 -680629 400285 753030 175415 -409756 -690679 -1151187 -1698608
29123 -1698608 -1705860 -1397598 -1605473 -2082247 -1695628 -497027 75533 -542466 -1170516 -795599
29113 -795599 142007 961277 1760347 2510531 2532175 1699121 905490 552649 -111592 -1291837
29103 -1291837 -1733663 -702017 436180 67987 -1237877 -1715401 -1055123 -441994 -399268
29094 -399268 -243958 368665 798420 543431 -47708 -431380 -488894 -372013 -283406 -357788
29084 -357788 -350223 198450 1010738 953802 -340629 -1496584 -1183205 -204020 -299807 -1329539
29074 -1329539 -1497357 -379607 304794 -454591 -1232753 -450570 1106591 1566148 795915
29065 795915 294851 677072 887420 73617 -1081386 -1446548 -1013121 -689199 -906635
29056 -906635 -1072440 -445812 839599 1922948 2291672 2298944 2369535 2122683 959143 -628923
29046 -628923 -1267987 -530657 310268 -12507 -998221 -1194639 -304091 595853 786398 709245
29036 709245 805630 649523 -125114 -855576 -709637 -75966 -137667 -1153959 -2068764 -1999572
29026 -1999572 -1311282 -820330 -614091 -265549 249714 573224 666132 792588 912487 775599
29016 775599 552376 614565 703280 229181 -464815 -233856 1043972 1921895 1421668 499047
29006 499047 397577 605347 -43667 -1059618 -987850 -15382 221204 -501103 -535877 667030
28996 667030 1362232 390649 -766887 -418062 550675 281712 -930809 -1348979 -818528
28987 -818528 -738390 -1313549 -1187382 -10087 796820 425722 -59378 328463 923868 789716
28977 789716 331974 420935 919135 1150158 1015836 661943 -214870 -1677617 -2740699
28968 -2740699 -2317269 -686186 826593 1389601 1201237 783218 461593 402536 583960
28959 583960 784790 888376 970053 944011 607468 191849 163233 232958 -481962 -1826971
28949 -1826971 -2239448 -876432 881664 1186996 181958 -565910 -426618 -78360 43795
28940 43795 155995 174649 -146857 -150590 1150436 3225698 4192052 3240946 1656723 964217
28930 964217 1237993 1757098 2163990 2281818 1790363 857024 293874 411413 473497 -89709
28920 -89709 -763143 -968766 -1166917 -1998492 -2968695 -3018600 -2042267 -906310 -201018 173142
28910 173142 328013 142391 -236124 -281553 322719 1280611 1910876 1666376 617198 -461475
28900 -461475 -788881 -474970 -288955 -454808 -361142 270319 760418 563026 204420 391487
28890 391487 842411 872929 608446 642935 863903 617895 -150132 -850643 -1220628 -1467707
28880 -1467707 -1522584 -1006139 32261 1061489 1722945 1900275 1349993 83409 -1059247
28871 -1059247 -1165877 -537227 -275577 -631394 -803863 -426587 -67348 6720 354416 1172810
28861 1172810 1726127 1636297 1716613 2656180 3698709 3599003 2323401 887932 -42175
28852 -42175 -503116 -557134 -203379 195892 207954 -27697 -103995 -118619 -415389 -711712
28842 -711712 -352072 517229 889605 284117 -545788 -693459 -276588 10215 80608 496875
28832 496875 1420838 2158648 1966632 942110 -157029 -761838 -870754 -721213 -471597
28823 -471597 -252481 -171194 -114874 118964 312052 -129462 -1261614 -2171774 -2038446 -1288597
28813 -1288597 -966715 -1172934 -1036120 -224980 533812 705174 719092 1009654 1201460 955442
28803 955442 853414 1571298 2708002 3313039 3198001 2891226 2624706 2251650 1953249
28794 1953249 2125817 2617057 2839352 2577887 1989354 991387 -479259 -1729779 -1845460
28785 -1845460 -1026583 -399283 -348617 -113312 636406 958205 48472 -1408502 -2119973
28776 -2119973 -1790071 -1099117 -617853 -491596 -746506 -1138119 -1043459 -223218 637397 836287
28766 836287 690000 841358 968722 297573 -797843 -989164 28595 968172 807987
28757 807987 125261 -70230 175026 328623 587718 1368176 2105184 1849180 886120 496800
28747 496800 1015932 1386426 981652 597151 927770 1221205 544494 -471266 -518180 246679
28737 246679 466043 -109258 -196819 743092 1373099 550473 -692451 -542608 948112
28728 948112 2006527 1633808 628488 82959 78770 216592 434109 723411 702679 71785
28718 71785 -831069 -1321101 -1038917 -228078 397210 159139 -725550 -961585 363697 2193458
28708 2193458 2464950 915541 -334172 304287 1642807 1596957 327620 -172003 761392
28699 761392 1520794 736197 -799549 -1411909 -676674 507913 1221446 1151513 491923
28690 491923 -93682 161843 1170111 1755598 959086 -768911 -2225927 -2909161 -3144808
28681 -3144808 -3139228 -2764307 -2162373 -1708890 -1324733 -613860 209547 382520 -140446 -356806
28671 -356806 308612 976415 567624 -476091 -757113 1636 548253 -35430 -1053085
28662 -1053085 -1307147 -746475 -260711 -290864 -498781 -670698 -1084350 -1792182 -2232307 -1924697
28652 -1924697 -1087668 -197619 650008 1515418 2143190 2301302 2335925 2686134 2929711 2129830
28642 2129830 320814 -1179545 -1429150 -1107174 -1337940 -1833665 -1312862 373801 1770632
28633 1770632 1834135 1344246 1575087 2409212 2794283 2526389 2322596 2241341 1373743 -481752
28623 -481752 -1952498 -1673445 -45848 1359794 1674700 1244891 672916 233859 106538
28614 106538 343071 538231 201637 -455217 -705397 -342869 84985 157275 21284 -175463
28604 -175463 -543871 -880725 -631928 110496 316727 -623162 -1843332 -2053517 -1184467
28595 -1184467 -163399 585568 1426275 2388665 2789097 2246040 1294134 588808 87625
28586 87625 -515535 -970943 -655342 515170 1747472 2055129 1204242 -31278 -610025
28577 -610025 -328271 -99284 -905114 -2506816 -3495806 -2737598 -589994 1399652 1903940
28568 1903940 919990 -382432 -850319 -397107 182450 357137 461015 988291 1693227
28559 1693227 1828064 1087716 -96196 -1091257 -1540163 -1443393 -1137002 -1053494 -1170146 -923326
28549 -923326 -63476 741229 739044 232854 139337 597734 864893 543795 13325 -446055
28539 -446055 -1014276 -1576142 -1515049 -674585 226163 548383 434444 229196 -34386 -188717
28529 -188717 186764 897105 945261 -121129 -1358813 -1602783 -880802 -26871 451745
28520 451745 444680 -98623 -765925 -635287 465585 1323952 968036 243511 542549 1529077
28510 1529077 1604545 406228 -662339 -495365 440574 1142894 1253648 926357 495841
28501 495841 503723 1139545 1556736 773215 -642565 -973422 286992 1699040 1937927
28492 1937927 1363933 896752 500693 -271958 -1090794 -1216662 -591116 202314 704397
28483 704397 795420 577769 439630 735983 1131055 909425 147033 -323462 -385085 -913223
28473 -913223 -2072049 -2657613 -1997266 -1188970 -1281824 -1475190 -628218 537190 587291 -70718
28463 -70718 90070 827117 289219 -1723797 -2945214 -1925949 -222232 -44992 -1151174
28454 -1151174 -1567653 -544526 716337 960010 241247 -662844 -1267802 -1527038 -1518579
28445 -1518579 -1365227 -1338138 -1778607 -2710222 -3519482 -3377040 -2254981 -1149401 -834232
28436 -834232 -842738 -422801 -40028 -743423 -2156590 -2533057 -1203621 358813 638431
28427 638431 69231 -65167 244966 9847 -899081 -1520811 -1357848 -1006478 -1060404 -1301799
28417 -1301799 -1304647 -1160334 -1204337 -1442516 -1599957 -1509557 -1203373 -748791 -186834 368484
28407 368484 664045 475665 -45157 -334404 -18582 518558 573972 103512 -271695 -291970
28397 -291970 -386615 -699736 -573130 391928 1375782 1247069 84772 -991579 -1329542
28388 -1329542 -1318939 -1481945 -1686415 -1455832 -642872 378610 1030420 1073915 911722 1083750
28378 1083750 1377811 963623 -322953 -1495123 -1705915 -1317623 -991492 -488080 567802
28369 567802 1353798 678628 -1066643 -2178902 -1928409 -1269546 -1074765 -982954 -444487
28360 -444487 291070 825379 1216948 1339839 655049 -666159 -1360533 -712724 185687
28351 185687 -222663 -1892298 -3335590 -3465585 -2506144 -1393552 -955000 -1386319 -1968483
28342 -1968483 -1626315 -246841 1000252 1127367 542281 244633 466509 810837 1091277
28333 1091277 1217678 858472 111384 -84957 807626 1848568 1859675 1175649 919803
28324 919803 1053936 619604 -378692 -915425 -719737 -545693 -561887 -60027 926069 1290461
28314 1290461 673278 139573 362175 494723 -303689 -1414312 -1749327 -1226010 -433147
28305 -433147 262523 555995 141007 -457786 -71221 1276035 1895894 809853 -639735
28296 -639735 -814464 -218142 -323766 -977140 -880538 -54585 207126 -333794 -504014 160003
28286 160003 669730 329801 -271876 -457710 -338670 -97256 354278 597438 -134528 -1525604
28276 -1525604 -2159020 -1519472 -759625 -748162 -657113 443656 1698743 1562390 149174
28267 149174 -881868 -563054 432540 1057510 1098624 934489 846542 870952 891000 672026
28257 672026 86069 -620906 -1030958 -1036945 -872877 -653683 -179349 647911 1396107 1383377
28247 1383377 476594 -613723 -1112809 -1097271 -1151236 -1190181 -470412 911100 1520226 440945
28237 440945 -1160163 -1482963 -553505 111651 -84132 -347873 -342615 -674550 -1186357 -645498
28227 -645498 1010396 1822686 466043 -1612132 -2173882 -1261970 -683660 -1147685 -1627365
28218 -1627365 -1316320 -652395 -288563 -270566 -454336 -810458 -1116301 -1034726 -571944 61697
28208 61697 850747 1620900 1631880 394368 -1282077 -1957631 -1272288 -233963 169242
28199 169242 -75222 -404373 -346504 212925 873339 942837 333497 -77287 377339 1035579
28189 1035579 827825 -58719 -485338 -105178 336016 379093 378191 559966 656840 658090 888173
28178 888173 1129688 708074 -279441 -851818 -607061 -301830 -568907 -1031195 -1169155 -1128725
28168 -1128725 -1103281 -788503 -96637 352401 126597 -273158 -184894 290200 707229 1000525
28158 1000525 1165541 820393 -193252 -1231998 -1580591 -1411286 -1377984 -1580171 -1585111 -1243514
28148 -1243514 -823001 -407018 266910 1273711 2147104 2216582 1274372 -80745 -892322
28139 -892322 -829019 -530799 -672006 -1006920 -903955 -472284 -288546 -210026 449285 1518438
28129 1518438 1908740 1229811 358466 2306 -216588 -757191 -1322444 -1610751 -1843988
28120 -1843988 -1905447 -1069848 600646 1684383 1199226 9880 -561818 -561265 -714440 -882883
28110 -882883 -566378 -201211 -517673 -1132378 -1161800 -782049 -799281 -1091271 -936689 -558558
28100 -558558 -773552 -1284435 -982540 -15807 130762 -990049 -1866809 -1150496 528353
28091 528353 1621419 1600375 1068432 610172 264857 -163297 -711944 -1063056 -746706 193330
28081 193330 1004859 1185569 1235232 1729126 2128596 1577154 514905 180521 635056 720976
28071 720976 91715 -228498 310274 853113 704758 497405 922324 1379796 906717 -278625
28061 -278625 -1076401 -890253 -62966 654424 633742 -144555 -840479 -568917 382978 949794
28051 949794 1000525 1506055 2637553 3037641 1778435 -121447 -1120956 -1115921 -926955 -733950
28041 -733950 -246607 228434 170309 -80439 247085 1092629 1684360 1676425 1326514 832952
28031 832952 311895 118189 377478 515532 28379 -649761 -820488 -594914 -433913 -161233
28021 -161233 502853 907798 235360 -974837 -1369107 -771621 -362594 -812580 -1478787
28012 -1478787 -1659687 -1493698 -1308572 -1119793 -1096841 -1535509 -2019078 -1589291 -190151
28003 -190151 959801 908417 45828 -831495 -1650587 -2599662 -3281209 -3142074 -2347996 -1568783
27993 -1568783 -1132691 -853388 -473349 47392 476894 417467 -192333 -661845 -182450 1058849
27983 1058849 2071422 2452062 2712715 2988312 2501187 934603 -649632 -1162177 -976045
27974 -976045 -1055822 -1250079 -667199 609016 1482709 1530522 1548527 2154216 2819177 2726717
27964 2726717 1873972 864334 111198 -358852 -689079 -1087508 -1636774 -2022153 -1788585
27955 -1788585 -1013575 -326709 -103237 -100700 -112735 -426289 -1189920 -1795981 -1531979 -646574
27945 -646574 -139373 -487912 -1115459 -1233202 -750360 -136333 238343 290724 -3688 -598090
27935 -598090 -1119951 -999863 -101920 912228 1146737 494462 -92555 432123 2005026
27926 2005026 3399864 3418514 2004716 169486 -983454 -1074383 -513377 45472 368675
27917 368675 797401 1589636 2202669 1749338 361672 -569135 -119886 762604 541466
27908 541466 -567113 -820241 383566 1513718 1254669 513305 881803 2049565 2298677
27899 2298677 1170346 37532 -65077 244021 -42289 -903449 -1717767 -2212938 -2376037
27890 -2376037 -2079920 -1369830 -662913 -284016 -216826 -449025 -937487 -1130467 -392356 830587
27880 830587 1225593 431357 -314390 94971 1194651 1881325 1837309 1286823 314397 -685794
27870 -685794 -836463 -50242 458426 -21005 -452661 105510 623069 -193331 -1380625
27861 -1380625 -1134859 -49680 -355434 -2080743 -2746163 -1387859 -183703 -921126 -2217622
27852 -2217622 -1917416 -416947 315413 -202005 -773264 -654405 -208435 163170 390954
27843 390954 307001 -111901 -372688 -155200 95035 19313 140669 936413 1807766 1960958
27833 1960958 1656419 1520663 1263764 293017 -901651 -1260944 -784483 -501902 -991088
27824 -991088 -1860561 -2438962 -2174155 -859068 665468 793053 -723127 -1803730 -705036
27815 -705036 1207384 1296216 -345427 -1104797 17409 1042074 359735 -941220 -1197194
27806 -1197194 -625618 -295859 -259297 -171793 -467649 -1386226 -1869348 -987860 288453 263468
27796 263468 -1026606 -1908149 -1345391 55092 1118740 1198516 413335 -353737 10817
27787 10817 1516123 2664224 2232044 977580 572905 1300348 1997978 1984775 1706364
27778 1706364 1501395 1052115 319108 -110812 7676 198456 225451 561708 1451343 2274489
27768 2274489 2372976 1907271 1400734 969534 538983 395628 917920 1922659 2732721
27759 2732721 2860006 2370483 1637662 929236 246810 -459900 -944848 -757695 97690
27750 97690 858308 811789 289301 295551 1108861 1819136 1477434 247409 -883161 -1199343
27740 -1199343 -750677 4087 651782 930265 680031 -43729 -747657 -650969 513137
27731 513137 1853767 2053120 981190 -44179 -53799 231169 -357149 -1495607 -1855732
27722 -1855732 -1194676 -579438 -503028 -252210 448858 654961 -86323 -530081 504785
27713 504785 2077523 2298136 1091414 256973 780266 1537056 1136109 -94705 -737374
27704 -737374 -214761 704993 1022164 452421 -635502 -1666536 -2169068 -2035286 -1626568
27695 -1626568 -1390944 -1295044 -902532 -136543 404923 245451 -169472 -58141 453859 475620
27685 475620 -138205 -375050 322068 981401 556168 -360208 -536724 -225808 -658681 -1639723
27675 -1639723 -1542586 -46275 1041630 564017 -134948 551643 1873087 2010416 940497
27666 940497 184949 323491 553054 380721 30304 -639288 -1875995 -2751227 -1972091
27657 -1972091 -173056 469678 -623792 -1557012 -976750 -99675 -504860 -1550642 -1638268
27648 -1638268 -869251 -608475 -1081957 -1234668 -734641 -428747 -693200 -794938 -262247
27639 -262247 291846 218050 -201654 -384144 -388807 -672382 -1268903 -1658005 -1342305 -412433
27629 -412433 387486 301449 -492867 -855961 -46919 1178332 1469797 668150 -131855 -247952
27619 -247952 -181640 -496100 -875384 -852528 -745405 -1141443 -1862931 -2125047 -1537879 -448231
27609 -448231 548767 1005239 706582 -176045 -1073527 -1475286 -1312859 -721609 221598 1159879
27599 1159879 1305317 304097 -1006598 -1497604 -1279591 -1410918 -2037525 -1984651 -683752
27590 -683752 644739 694429 67993 266780 1217551 1354354 111427 -1246435 -1638430
27581 -1638430 -1500601 -1429684 -980991 67299 541265 -519431 -1993585 -2128584 -1244563
27572 -1244563 -1089002 -1789071 -1611169 -29379 1144296 569951 -572517 -623154 3048
27563 3048 -146332 -1073368 -1554696 -1227753 -910338 -1126674 -1567372 -1814154 -1611265 -747420
27553 -747420 429641 895836 310688 -187783 322402 914223 380535 -426113 149049
27544 149049 1496553 1353780 -484467 -1589478 -626126 757481 811803 217641 268046
27535 268046 479824 -112801 -765402 -170669 1166986 1660965 1122059 697919 764246 612285
27525 612285 36993 -342165 -284828 -86971 348350 1255267 1948041 1437006 105897 -611085
27515 -611085 -300182 83862 87336 456599 1509351 2211574 1630603 259679 -837519
27506 -837519 -1362981 -1609550 -1687599 -1569946 -1355639 -1007000 -328652 481987 863128 726384
27496 726384 588396 637918 476318 69138 17553 418904 394798 -614165 -1918906 -2624940
27486 -2624940 -2799987 -2847556 -2521013 -1511036 -383723 97051 144086 439575 804262
27477 804262 457727 -504341 -935932 -123708 1300823 2153447 1921835 1099401 654405
27468 654405 1147680 2098347 2387527 1543305 282868 -527447 -894989 -1151972 -1035660
$$ [...]
##END NTUPLES=NMR SPECTRUM
##END=
