##TITLE=31Pdec_LY-11Dix.4.B
 CD3CN, 24 sc
 4.06.2021
##JCAMPDX= 6.0         $$ Bruker NMR JCAMP-DX V2.0
##DATA TYPE= NMR SPECTRUM
##DATA CLASS= NTUPLES
##ORIGIN= UXNMR, Bruker Analytische Messtechnik GmbH
##OWNER= root
$$ XWIN-NMR		Version 3.5
$$ Fri Jun  4 10:17:13 2021 Russian Standard Time (UT+4h)  she@DPX200
##.OBSERVE FREQUENCY= 81.013821
##.OBSERVE NUCLEUS= ^31P
##.ACQUISITION MODE= SIMULTANEOUS
##.ACQUISITION SCHEME= undefined
##.AVERAGES= 24
##.DIGITISER RES= 16
##SPECTROMETER/DATA SYSTEM= spect
##.PULSE SEQUENCE= zgpg30
##.SOLVENT NAME= CD3CN
##.SHIFT REFERENCE= (INTERNAL, CD3CN, 0, 248.564)
##AUDIT TRAIL= $$ (NUMBER, WHEN, WHO, WHERE, WHAT)
$$ ##TITLE= Audit trail, XWIN-NMR		Version 3.5
$$ ##JCAMPDX= 5.01
$$ ##ORIGIN= Bruker BioSpin GmbH
$$ ##OWNER= she
$$ F:/spectra/data/she/nmr/P31/1/pdata/1/auditp.txt
$$ ##AUDIT TRAIL=  $$ (NUMBER, WHEN, WHO, WHERE, WHAT)
(   1,<2021-06-04 10:15:36.71 +0400>,<she>,<DPX200>,
      <created by zg, POWCHK disabled, PULCHK disabled
       configuration hash MD5:
       00 E9 B6 7A A2 85 ED C7 34 08 36 98 17 FE 4E 26
       data hash MD5: 32K
       92 51 16 69 0C 61 4A E0 F6 ED 81 88 AF F1 C7 EC>)
(   2,<2021-06-04 10:16:05.98 +0400>,<she>,<DPX200>,
      <Start of raw data processing
       efp BC_mod = 2 LB = 1 FT_mod = 6 PKNL = 1 PHC0 = -5961.463 PHC1 = 251.8705 SI = 64K 
       data hash MD5: 64K
       94 51 12 E0 9B F0 8C AC 8D 62 87 7C 9D ED 2E 85>)
(   3,<2021-06-04 10:16:24.53 +0400>,<she>,<DPX200>,
      <pk PHC0 = 36.59926 PHC1 = -77.20001 
       data hash MD5: 64K
       BF 91 EE 6A 9A B4 43 A7 C1 86 4C 7C 57 F8 3E F9>)
(   4,<2021-06-04 10:16:32.92 +0400>,<she>,<DPX200>,
      <abs ABSG = 5 
       data hash MD5: 64K
       33 22 FF 55 3A 0E 69 D3 F2 F1 58 FD 2A 6F 70 12>)
$$ ##END=
$$ 
$$ hash MD5
$$ 4C 7D FE 3E 04 CE AB F6 CE 8E 02 4C 87 40 BA 01
##$RELAX= 
##$RELAX= 
##$RELAX= 
##$RELAX= 
##$RELAX= 
##$RELAX= 
##$RELAX= 
##$RELAX= 
$$ Bruker specific parameters
$$ --------------------------
##$DU= <F:/spectra>
##$EXPNO= 1
##$NAME= <P31>
##$PROCNO= 1
##$TYPE= <nmr>
##$USER= <she>
##$AMP= (0..31)
100 100 100 100 100 100 100 100 100 100 100 100 100 100 100 100 100 100 
100 100 100 100 100 100 100 100 100 100 100 100 100 100 
##$AQSEQ= 0
##$AQ_mod= 1
##$AUNM= <au_zg>
##$AUTOPOS= <>
##$BF1= 81.014009
##$BF2= 200.13
##$BF3= 200.13
##$BF4= 200.13
##$BF5= 200.13
##$BF6= 200.13
##$BF7= 200.13
##$BF8= 200.13
##$BYTORDA= 1
##$CFDGTYP= 0
##$CFRGTYP= 5
##$CHEMSTR= <none>
##$CNST= (0..31)
1 1 145 1 1 1 1 1 1 1 1 1 1 1 1 1 1 1 1 1 1 1 1 1 1 1 1 1 1 1 1 1 
##$CPDPRG= <waltz16>
##$CPDPRG1= <>
##$CPDPRG2= <waltz16>
##$CPDPRG3= <>
##$CPDPRG4= <mlev>
##$CPDPRG5= <mlev>
##$CPDPRG6= <mlev>
##$CPDPRG7= <mlev>
##$CPDPRG8= <mlev>
##$CPDPRGB= <>
##$CPDPRGT= <>
##$D= (0..31)
0 1 0 0 0 0 0 0 0 0 0 0.03 2e-05 3e-06 0 0 0 0 0 0 0 0 0 0 0 0 0 0 0 0 
0 0 
##$DATE= 1622787336
##$DBL= (0..7)
120 120 120 11 120 120 24 19 
##$DBP= (0..7)
150 150 150 150 150 150 150 150 
##$DBP07= 0
##$DBPNAM0= <>
##$DBPNAM1= <>
$$ [...]
##$SUBNAM3= <"">
##$SUBNAM4= <"">
##$SUBNAM5= <"">
##$SUBNAM6= <"">
##$SUBNAM7= <"">
##$SUBNAM8= <"">
##$SUBNAM9= <"">
##$SW= 501.771253377433
##$SWIBOX= (0..15)
0 1 3 0 0 0 0 0 0 0 0 0 0 0 0 0 
##$SW_h= 40650.406504065
##$TD= 32768
##$TD0= 1
##$TE= 0
##$TE2= 300
##$TE3= 300
##$TEG= 300
##$TL= (0..7)
0 120 53 12 22 120 120 120 
##$TP= (0..7)
150 150 150 150 150 150 150 150 
##$TP07= 0
##$TPNAME0= <>
##$TPNAME1= <>
##$TPNAME2= <>
##$TPNAME3= <>
##$TPNAME4= <>
##$TPNAME5= <>
##$TPNAME6= <>
##$TPNAME7= <>
##$TPOAL= (0..7)
0.5 0.5 0.5 0.5 0.5 0.5 0.5 0.5 
##$TPOFFS= (0..7)
0 0 0 0 0 0 0 0 
##$TUNHIN= 0
##$TUNHOUT= 0
##$TUNXOUT= 0
##$USERA1= <user>
##$USERA2= <user>
##$USERA3= <user>
##$USERA4= <user>
##$USERA5= <user>
##$V9= 5
##$VALIST= <valist>
##$VCLIST= <CCCCCCCCCCCCCCC>
##$VD= 0
##$VDLIST= <DDDDDDDDDDDDDDD>
##$VPLIST= <PPPPPPPPPPPPPPP>
##$VTLIST= <TTTTTTTTTTTTTTT>
##$WBST= 1024
##$WBSW= 4
##$XGAIN= (0..3)
0 0 0 0 
##$XL= 0
##$YL= 0
##$YMAX_a= 7888
##$YMIN_a= -7962
##$ZGOPTNS= <>
##$ZL1= 120
##$ZL2= 120
##$ZL3= 120
##$ZL4= 120
##$ABSF1= 248.5645
##$ABSF2= -253.2056
##$ABSG= 5
##$ABSL= 3
##$ALPHA= 0
##$AQORDER= 0
##$ASSFAC= 0
##$ASSFACI= 0
##$ASSFACX= 0
##$ASSWID= 0
##$AUNMP= <proc_1d>
##$AZFE= 0.1
##$AZFW= 0.5
##$BCFW= 0
##$BC_mod= 2
##$BYTORDP= 0
##$COROFFS= 0
##$CY= -3
##$DATMOD= 1
##$DC= 0
##$DFILT= <>
##$DTYPP= 0
##$F1P= 0
##$F2P= 0
##$FCOR= 1
##$FTSIZE= 65536
##$FT_mod= 6
##$GAMMA= 0
##$GB= 0
##$INTBC= 1
##$INTSCL= 5.30512e-09
##$ISEN= 30
##$LB= 1
##$LEV0= 0
##$LPBIN= 0
##$MAXI= 10000
##$MC2= 0
##$MEAN= 0
##$ME_mod= 0
##$MI= 50
##$NCOEF= 0
##$NC_proc= -4
##$NLEV= 6
##$NOISF1= 182.463
##$NOISF2= 159.3651
##$NSP= 0
##$NTH_PI= 0
##$NZP= 0
##$OFFSET= 248.5645
##$PC= 4
##$PHC0= -5924.864
##$PHC1= 174.6705
##$PH_mod= 1
##$PKNL= yes
##$PPARMOD= 0
##$PSCAL= 0
##$PSIGN= 0
##$REVERSE= no
##$SF= 81.014009
##$SI= 65536
##$SIGF1= 159.3651
##$SIGF2= -187.1042
##$SINO= 113.3802
##$SIOLD= 16384
##$SREGLST= <1H.CDCl3>
##$SSB= 0
##$STSI= 65536
##$STSR= 0
##$SW_p= 40650.406504065
##$SYMM= 0
##$S_DEV= 0
##$TDeff= 32768
##$TDoff= 0
##$TI= <>
##$TILT= no
##$TM1= 0
##$TM2= 0
##$TOPLEV= 0
##$USERP1= <user>
##$USERP2= <user>
##$USERP3= <user>
##$USERP4= <user>
##$USERP5= <user>
##$WDW= 1
##$XDIM= 65536
##$YMAX_p= 385074416
##$YMIN_p= -42276999
$$ End of Bruker specific parameters
$$ ---------------------------------
##NTUPLES= NMR SPECTRUM
##VAR_NAME=  FREQUENCY,     SPECTRUM/REAL,   SPECTRUM/IMAG
##SYMBOL=    X,             R,               I
##VAR_TYPE=  INDEPENDENT,   DEPENDENT,       DEPENDENT
##VAR_FORM=  AFFN,          ASDF,            ASDF
##VAR_DIM=   65536,         65536,           65536
##UNITS=     HZ,            ARBITRARY UNITS, ARBITRARY UNITS
##FACTOR=    0.620285442955139, 1,           1
##FIRST=     20137.2065510759, 0,            0
##LAST=      -20513.1999529892, 0,           0
##MIN=       -20513.1999529892, -42276999,   0
##MAX=       20137.2065510759, 385074416,    0
$$ Real data points
##PAGE= N=1
##DATA TABLE= (X++(R..R)), XYDATA
$$ [...]
35474e95283j01550m40887k42305K89742M08155Q57l24531k30335J4934J59155
$$ -595283 -696833 -1137720 -1380025 -1090283 -682128 -681271 -1005802 -1236137 -1221203 -1062048
35464a062048K25536J45624j80272m25082j29658M75604O45126K31494q8479J08660
$$ -1062048 -836512 -690888 -871160 -1296242 -1425900 -950296 -305170 -73676 -162155 -53495
35454e3495L95837K69427j08974l04896k41323r3161M8674J33563J01069K8355
$$ -53495 342342 611769 502795 197899 -43424 -136585 -87911 45652 146721 175076
35444A75076O238j22683m52658n44080O1119Q80187Q90500L5079n74567k66044
$$ 175076 181314 58631 -394027 -938107 -876988 3199 893699 928778 354211 88167
35434H8167L01886L24987L2931J6533J49851m228k78531k15810R3081K24976J50391
$$ 88167 390053 715040 747971 764504 914355 910127 631596 415786 508867 733843 884234
35423H84234O9274j42518o21311r44291o05599J29406N34339M29358K23151J15543
$$ 884234 953508 810990 189679 -754612 -1360211 -1230805 -696466 -267108 -43957 71586
35413G1586l1474j24293J11163M76923M04958j60093o04045n36153k59243j37739
$$ 71586 40112 -84181 26982 503905 908863 748770 144725 -391428 -650671 -788410
35403g88410o4528J23390K00321l0102k24688O2753N84041N80028j52743q41639
$$ -788410 -852938 -729548 -529227 -559329 -784017 -721264 -137223 442805 290062 -551577
35393e51577o84267Q2168N11743K58130k0106K46324O28596M12334k08489m19955
$$ -551577 -1235844 -1153676 -641933 -383803 -403909 -157585 471011 883345 674856 254901
35383B54901j02509K5781l16561m60843O4637O70118N85899P424l14990j90608
$$ 254901 152392 178173 -138388 -599231 -534594 135524 721423 728847 413857 223249
35373B23249p775K5837k1062k02047n00524m74159J61497P80044N35389k53491
$$ 223249 215474 241311 220249 18202 -482322 -956481 -794984 -14940 520449 266958
35363B66958l91808L42920O99761j54664j191105r05125M36226J104204L63595
$$ 266958 -124850 218070 917831 763167 -427938 -1333063 -896837 207367 570962
35354E70962n57295l35662N89216Q31322J35304m03705r8777L81036J73420m70675
$$ 570962 13667 -321995 267221 1098543 1233847 830142 731365 1112401 1285821 815146
35344H15146o74494k44641K06382K21791n6537l20158l97121j47583M06587Q25709
$$ 815146 140652 -103989 102393 324184 267647 -52511 -449632 -597215 -190628 635081
35334F35081O30490j4500m62303m45220k72113j65263j0947J39691r888l64094
$$ 635081 1265571 1251071 788768 343548 71435 -93828 -104775 34916 25028 -339066
35324c39066l69052J04101M29206J67194k47030k28326Q1508K05887J47594K03003
$$ -339066 -708118 -604017 -174811 -7617 -254647 -482973 -401465 -195578 -47984 155019
35314A55019L04775J69117j29724k97265l41270m24968l85546L3096N84249P20603
$$ 155019 459794 628911 499187 201922 -139348 -564316 -949862 -916766 -332517 388086
35304C88086L56798p4140k93591l95844l97991j31462K86600L83691j5011m46821
$$ 388086 744884 670744 377153 -18691 -416682 -548144 -261544 122147 107136 -339685
35294c39685m11995k8833K25022K22387K55873M39789M46045K9482m61465m58821
$$ -339685 -751680 -780513 -555491 -333104 -77231 362558 808603 838085 376620 -82201
35284h2201J4446L15742O5445l52619m25122k41071j68554j43026J28477M52297
$$ -82201 -67755 247987 313432 -39187 -464309 -705380 -873934 -1016960 -888483 -436186
35274d36186L33780j41066l12232M5113L89939L12387J10053J38795J93344n153
$$ -436186 -102406 -243472 -555704 -510591 -120652 191735 301788 440583 633927 628774
35264F28774j84021P4548N79710O84638J07187p11889j033312n01855M55283R13626
$$ 628774 444753 519301 1099011 1783649 1890836 1178947 145635 -356220 99063 1012689
35254A012689L92014n27129q60105m18391J33986L29567L51512M03652L47114
$$ 1012689 1404703 877574 17469 -400922 -266936 62631 414143 817795 1164909
35245A164909J39448k9905k12941o26386r65227o04661K94464P66503M36403J0392
$$ 1164909 1304357 1274452 1061511 435125 -530102 -1134763 -840299 -73796 362607 372999
35235C72999O750K1827k36041k78645J03651K07266k99337n23604J72770Q53382
$$ 372999 379749 401576 165535 -113110 -9459 197807 -101530 -625134 -452364 401018
35225D01018M23517m90169n03585L12357O86685K28923k24173j65952M5799J57417
$$ 401018 824535 334366 -169219 143138 829823 1058746 834573 668621 714420 871837
35215H71837K88584K64993j81471o19567m30636M0295J6955k45498R8994P25907
$$ 871837 1160421 1425414 1243943 624376 193740 234035 250990 5492 104486 830393
35205H30393M13471p87427j307313m26369O52242P42721K74431J36467J99622
$$ 830393 1243864 456437 -850876 -1277245 -625003 117718 392149 528616 728238
35196G28238j7553k33152j11L44840K86698N6058R0563J71193o3596l01829j20263
$$ 728238 710685 477533 477422 822262 1108960 1165018 1255581 1426774 1363178 1061349 941086
35185I41086J25983j34085o20323n92266m3639L54173L39861K70205L03496J64425
$$ 941086 1067069 932984 312661 -279605 -323244 30929 370790 640995 944491 1108916
35175A108916j92817l62714j22863K05369K27535m2890l12608l38022m3801M17462
$$ 1108916 916099 553385 430522 635891 863426 820536 507928 169906 126105 543567
35165E43567O43075K88729m53537q87982n29635K91459P39919M25541j33611j63022
$$ 543567 1186642 1475371 1021834 133852 -395783 -104324 635595 1061136 927525 764503
35155G64503L72106P34450M19137j83972l72014o4370K09015P4945k94779m63177
$$ 764503 1136609 1871059 2290196 2106224 1734210 1669840 1878855 1953800 1659021 1195844
35145A195844r8564P86828J645610J626264M20310j194839k027348j636753n76603
$$ 1195844 1097280 1884108 3529718 5155982 5576292 4381453 2354105 717352 140749
35136A40749L22999N75370J88690l57753m58742p7577J57966r2536k87769R4529
$$ 140749 463748 1039118 1227808 870055 411313 333736 491702 399166 111397 205926
35126B05926N92580M89010L4538m9700O8690l38825j035885r45763O8839Q39269
$$ 205926 798506 1287516 1322054 1272354 1341044 1002219 -33666 -979429 -910590 -71321
35116g1321O54605J99888K32857M23438J72232l29141n67206n16996l61095n0734
$$ -71321 583284 783172 1016029 1439467 1611699 1282558 715352 198356 -162739 -213473
35106b13473L08204K94690q0543j57512L12387O18726K01691m22716n23943k47733
$$ -213473 94731 389421 308878 151366 463753 1082479 1284170 861454 337511 89778
35096H9778j07595m4598J88394K90627n1590l69376o0630N26282N52815k8574
$$ 89778 -17817 -62415 125979 416606 365016 -4360 -64990 461292 1014107 985533
35086I85533n04639n13897l16842j07092J55486L11229J46173p4398Q1778L98408
$$ 985533 480894 -33003 -349845 -456937 -301451 9778 155951 81553 163331 561739
35076E61739K17534m84503r10188n10477L06597P64876O11606J92031q9146j50546
$$ 561739 779273 294770 -615418 -1125895 -819298 -54422 557184 749215 660069 509523
35066E09523j63599k27593k12262k9104Q1267j26833l70668j55145L43173L83234
$$ 509523 345924 118331 -93931 -123035 -41768 -168601 -539269 -694414 -351241 31993
35056C1993j49455m30443J4466M84827J91036n18167p63863m12432M9049M14032
$$ 31993 -117462 -547905 -533439 -48612 142424 -375743 -1139606 -1552038 -1502989 -1088957
35046a088957O87323N64848r1035o16680l54365K04788J10990m58943m67518K14939
$$ -1088957 -401634 163214 72179 -544501 -898866 -694078 -583088 -1042031 -1509549 -1294610
35036a294610N65807J17495l13884n3708L53138J53410l47697l07204L61438R11342
$$ -1294610 -728803 -611308 -925192 -978900 -625762 -472352 -820049 -1127253 -765815 145527
35026A45527P43375j1903p31766q35586k73251L52726L95611l6019k43535N3171
$$ 145527 888902 876999 145233 -690353 -963604 -610878 -215267 -251286 -494821 -441650
35016d41650L79862L32801J60905J92582J99925j77078p09769q11141l56882J54142
$$ -441650 -61788 271013 431918 624500 824425 647347 -62422 -873563 -1230445 -1076303
35006a076303K54137J8969j26604O2217M07631N66653M53871K77724J53714m8127
$$ -1076303 -822166 -803197 -929801 -867584 -459953 106700 560571 838295 992009 943882
34996I43882l16617l08414J07249M32875J75243l55840m91886k54669k10650l64365
$$ 943882 627265 318851 426100 858975 1034218 678378 186492 -68177 -278827 -643192
34986f43192j08983N65618P74486Q7980o56211n24556J85531N17255K57870k2154
$$ -643192 -752175 -186557 587929 675909 19698 -504858 -319327 197928 455798 433644
34976D33644k0717J4624n2822l7584Q1350O1318j22947j87558l2842Q7179j364
$$ 433644 412927 427551 374729 337145 418495 479813 356866 169308 136466 223645 222281
34965B22281j37266j04735J08377L73370M84643K09082l89827p40597l34782M62073
$$ 222281 85015 -19720 88657 462027 946670 1155752 765925 25328 -309454 152619
34955A52619O90910M9443o59703o20197m8962K84994J83514P2941J55115J64902
$$ 152619 843529 892972 233269 -386928 -435890 -150896 32618 105559 260674 425576
34945D25576o693m7892K10417M20478J96761l23933o69599n80598j66961K82700
$$ 425576 418883 370991 581408 1001886 1198647 874714 205115 -375483 -542444 -259744
34935b59744M64847K54925o1416L780M62659O65500J34992o75782r09823m07400
$$ -259744 205103 460028 398612 402392 865051 1530551 1665543 989761 79938 -327462
34925c27462K28120N41443O03578M90353O0643n49085q16807n40960j63332o8863
$$ -327462 -99342 442101 1045679 1536032 1596675 1047590 230783 -310177 -473509 -542372
34915e42372n3973J36114K51263K2493k36085j11314J62011Q7631k15861k26173
$$ -542372 -596345 -460231 -208968 -186475 -422560 -533874 -371863 -284232 -500093 -726266
34905g26266O0037J61506Q487K3584K50935K16086j38594j88738L19297O99151
$$ -726266 -666229 -504723 -496236 -472652 -221717 -5631 -144225 -332963 -13666 685485
34895F85485L62763k00694j83139K68534L44853j07172m07649j85656R6919j7831
$$ 685485 1048248 847554 664415 932949 1277802 1170630 762981 577325 674244 656413
34885F56413k82553k55900l3052l886j73907k07031k8505O2308q7924k29884j17983
$$ 656413 373860 117960 84908 81022 -92885 -299916 -328421 -266113 -354037 -583921 -701904
34874g01904J14063K11654K39222M46409P42882O72445P6063n06298m29766J75374
$$ -701904 -587841 -376187 -136965 309444 1052326 1724771 1800834 1294536 864770 1040144
34864A040144N15574J85350k97352k57645J63233K41008k47335o82464m84125
$$ 1040144 1555718 1741068 1443716 1186071 1349304 1590312 1342977 660513 176388
34855A76388P4825K49475j92867p10384o69019k1476P25871J023395O96534K1659
$$ 176388 251213 500688 307821 -402563 -1071582 -1093058 -367187 656208 1352742 1374401
34845A374401n03204n38725j52873K91211M68335K83140j69956o70019r09989
$$ 1374401 871197 332472 179599 470810 939145 1222285 1052329 382310 -527679
34836e27679o89091j64969K39414L05587K65000M17893O36219N12397m745m24007
$$ -527679 -1216770 -1381739 -1142325 -836738 -571738 -153845 482374 994771 990026 566019
34826E66019l18350J08515L24387K01398Q0917J04840m9217n08105p22635j92475
$$ 566019 247669 356184 680571 881969 962886 1067726 1018509 510404 -212231 -404706
34816d04706N72549N45536l29841r30539n31288J88992K87189o178J42429O55866
$$ -404706 167843 713379 383538 -547001 -1078289 -889297 -602108 -608286 -465857 190009
34806A90009O88301J02966l17641k13469r4978j98217j7241N34194N88925k88267
$$ 190009 878310 981276 663635 450166 355188 156971 139730 673924 1262849 974582
34796I74582j117259q46424O0059M16268J09818m3938J48163Q5435l60884n74942
$$ 974582 -142677 -989101 -929042 -512774 -402956 -446894 -298731 -213296 -574180 -1149122
34786a149122k88498N6014J89107L46526N38445L79128r8583k93304j640K42835
$$ -1149122 -1437620 -1381606 -1192499 -845973 -307528 71600 -26983 -320287 -321927 -79092
34776g9092J13421o90J95397L40534J34122o7931R9963L55710K90804L4685j12345
$$ -79092 34329 33639 229036 569570 703692 635761 735724 1091434 1382238 1416923 1304578
34765A304578k16239l62951k71203J69901M30237N4859n13690n21473n6654R9549
$$ 1304578 1088339 725388 454185 624086 1054323 1109182 595492 74019 17365 116914
34755A16914l31770p61471o11830r292N30969O99790N20501J72030j42596k71540
$$ 116914 -214856 -976327 -1588157 -1597449 -1066480 -366690 153811 325841 183245 -88295
34745h8295j60826J37250M22533L76151j19104o71465p14338k25526K44715L59907
$$ -88295 -249121 -111871 310662 686813 567709 -103756 -818094 -1043620 -798905 -438998
34735d38998L55799M25898K92633k16566o37694m54202R3254L36682J38433k2146
$$ -438998 -83199 342699 635332 418766 -218928 -673130 -579876 -243194 -104761 -126907
34725a26907J47585L63266K47916j47369m31542l15833Q5627L51511K06714j36925
$$ -126907 20678 383944 631860 484491 52949 -262884 -177257 174254 380968 244043
34715B44043k65419j32913l4112n1125P739Q4745j21865m74135l83253K22061
$$ 244043 -21376 -154289 -188401 -239526 -231787 -147042 -268907 -743042 -1126295 -904234
34705i04234O18739M06521J58361L60697M75258q6632p18088m46333M05513N98069
$$ -904234 -285495 121026 279387 640084 1115342 1028710 310622 -135711 269802 867871
34695H67871j24669p22041n24071n3348R3710J06196K51381K64793J5115m9089
$$ 867871 743202 21161 -502910 -556258 -462548 -356352 -104971 159822 174937 125848
34685A25848K49056K71864l83071r60392n70805L55721O42680J14000k86394o5311
$$ 125848 374904 646768 263697 -696695 -1267500 -911779 -269099 -155099 -441493 -506804
34675e06804K12921J01940J8280L12365M73883m094o09646n20073P9327L02805
$$ -506804 -293883 -191943 -173663 138702 612585 608491 -1155 -521228 -441901 -139096
34665a39096k345r1511L61582P21283M45558j20989m13206m03896k38211K03456
$$ -139096 -141441 -232952 128630 849913 1295471 1174482 761276 357380 119169 322625
34655C22625P85924Q00016p1768r52755p96512R7661M88133m8144o65571n81111
$$ 322625 1108549 1908565 1836797 884042 87530 185191 673324 625180 -40391 -621502
34645f21502j3297L83896L39119j544l28943l02823J36594N38069M27509m1665
$$ -621502 -634799 -250903 88216 86672 -242271 -545094 -408500 129569 557078 515413
34635E15413l64951m21598l87214j89233K39750M52643J02407k03564K85091J003496
$$ 515413 150462 -271136 -658350 -847583 -607833 -155190 -52783 -256347 28744 1032240
34625A032240P00943m86511j026185l15774M40590K18639l59754l28284Q5104
$$ 1032240 1733183 1246672 220487 -95287 345303 563942 204188 -124096 -38992
34616c8992J66448k4795n2382L6773P8567K65686N37870L27862l78205o60014
$$ -38992 127456 102661 50279 87052 165619 431305 969175 1297037 918832 258818
34606B58818j22298K80960j94618p44191l53849M78222O30995J57646j39381k29097
$$ 258818 136520 417480 222862 -521329 -875178 -396956 234039 391685 252304 23207
34596B3207n58683q17227m18011K11745K07243k13159j46919L81673N60124K92233
$$ 23207 -535476 -1352703 -1770714 -1558969 -1351726 -1564885 -1711804 -1330131 -770007 -477774
34586d77774K15018L82408K51022j36542k25874q9560k32331m09878J8142O68378
$$ -477774 -262756 119652 370674 234132 8258 -81302 -313633 -723511 -705369 -36991
34576c6991N06659l40955o16473O5352O70608M89369N4923p0458j44565l96683
$$ -36991 469668 128713 -487760 -422408 248200 737569 792492 722034 577469 180786
34566A80786m74226k37740j05267j87074n2017K94247K34175k73209l95983J93280
$$ 180786 -293440 -531180 -636447 -823521 -875538 -581291 -347116 -620325 -1016308 -823028
34556h23028O61750L10020l86040o28171m02267j47429Q794J50542K54237L53255
$$ -823028 -161278 148742 -237298 -865469 -1267736 -1415165 -1406371 -1255829 -1001592 -648337
34546f48337N18164M87163n3895p06768o53826J14243O88888N63918K04074O3824
$$ -648337 -130173 356990 303095 -403673 -1057499 -943256 -254368 309550 513624 577448
34536E77448m3173k61595k63972Q7307L99710M14021L15416J73828j63181m76867
$$ 577448 534275 272680 8708 96015 495725 909746 1225162 1398990 1235809 758942
34526G58942l40209J985j18846n45108m00879L49718O83278J99873k61344j72904
$$ 758942 418733 420718 301872 -243236 -644115 -294397 388881 588754 327410 154506
34516A54506j54325n81339o72582J20727R46291P97357Q761m84638n60335n87177
$$ 154506 181 -581158 -1253740 -1133013 -186722 610635 619396 134758 -425577 -1012754
34506a012754m41493J07565N99430M65200p1j01293J71181K61121m4110m27210
$$ -1012754 -1454247 -1346682 -747252 -282052 -282123 -383416 -212235 48886 4776 -422434
34496d22434n14911j60331M18673O22506J33211l71582j830Q24128Q10765r3448
$$ -422434 -937345 -1097676 -679003 -56497 76714 -294868 -296698 527430 1338195 1244747
34486A244747m85320J07475L17369o64931j470296p21955O12807P44102j63629
$$ 1244747 759427 866902 1184271 519340 -950956 -1672911 -1060104 -316002 -479631
34477d79631n71048j35132J85888J04427K01478L70993j19090r67161r21298K10704
$$ -479631 -1050679 -1185811 -999923 -895496 -694018 -323025 -442115 -1409276 -2330574 -2119870
34467b119870J106843Q69591J38274j75537j16187j08530j09833N5817K02812
$$ -2119870 -1013027 -143436 -5162 -180699 -296886 -405416 -515249 -459432 -256620
34458b56620J52291R3670J77691J68586j59409n95595p30786m26488Q8869M53044
$$ -256620 -104329 -10659 167032 335618 176209 -419386 -1150172 -1576660 -1487791 -1034747
34448a034747M68545K55262M8000j33213l58377m03859l451M95300M26811q4631
$$ -1034747 -566202 -310940 -262940 -396153 -754530 -1158389 -1161840 -666540 -239729 -324360
34438c24360j59050L91300O36776Q1059m28722j39311L00873K2578n02438l33325
$$ -324360 -483410 -92110 544666 625725 197003 57692 358565 381143 -121295 -454620
34428d54620K64504L88927J38170K10156L46518k08578r61948o18994O66231J200506
$$ -454620 -190116 198811 336981 547137 893655 685077 -276871 -895865 -229634 970872
34418I70872K82727p48383o17263J34201L47115O1390Q2279M70676N33859J8794
$$ 970872 1253599 505216 -112047 22154 369269 430659 512938 983614 1517473 1536267
34408A536267n28801n54399j08341L44956M13684N8238m39346p36326o64686k51879
$$ 1536267 1007466 453067 344726 689682 1103366 1161604 722258 -14068 -678754 -930633
34398i30633L03449O19683L94583j52657m24087k15706N3684R3141J64993M18325
$$ -930633 -627184 -7501 387082 234425 -189662 -405368 -351684 -258543 -93550 324775
34388C24775M40107j751l83788k31892Q1890M1915j11475K7296J51823j24586
$$ 324775 764882 763131 379343 147451 229341 271256 159781 187077 338900 214314
34378B14314l40636O4640N86032L80056k71637m54396k12003k99720n96555k49300
$$ 214314 -126322 -61682 524350 904406 632769 178373 -33630 -333350 -929905 -1179205
34368a179205O13680Q22636N8957n90506l67674J36518J96572M7892J73762M43541
$$ -1179205 -565525 257111 316068 -274438 -642112 -505594 -309022 -261130 -87368 356173
34358C56173N46959N18845L71628o4670n69897n65436o4284J91111j20044m17388
$$ 356173 903132 1421977 1793605 1728935 1159038 593602 529318 720429 600385 182997
34348A82997k52736J4664N498l4691J31455K19227N8057J7150K55735K56278k84426
$$ 182997 -69739 -55075 -49577 -84268 47187 266414 324471 341621 597356 853634 569208
34337E69208p48543m76228J67658L33770o5512l61483j91994Q3315L5366k34740
$$ 569208 -179335 -655563 -487905 -154135 -219647 -581130 -773124 -689809 -654443 -889183
34327h89183k99828j9295K23013R622m16042l11463M67483R89195M24351o55510
$$ -889183 -1189011 -1208306 -985293 -975671 -1391713 -1703176 -1235693 -246498 177853 -477657
34317d77657r24594q7056Q09371Q53667K73594j79336j57847J63107L73626J33456
$$ -477657 -1402251 -1489307 -679936 173731 447325 267989 110142 273249 646875 780331
34307G80331l93447n24325L1378N41370K33928m24766l80251L16557N79727J9705
$$ 780331 386884 -137441 -106063 435307 669235 244469 -135782 180775 760502 780207
34297G80207n34330l91784J55093N42649N63921J54666n41423q61346l45993K91646
$$ 780207 245877 -145907 9186 551835 1115756 1270422 728999 -132347 -478340 -186694
34287a86694M4771o60686n01949M92952Q58336R3739n65804k89808J47134L5082
$$ -186694 -141923 -802609 -1304558 -811606 46730 140469 -425335 -715143 -568009 -532927
34277e32927n5364L45865N52668R9287k52377K4445J49002m06894p04189k2302
$$ -532927 -588291 -242426 310242 409529 157152 181597 330599 -76295 -780484 -802786
34267h02786O15370J41117n90705k58992N90470N45730j94261l17079K22715L06808
$$ -802786 -187416 -46299 -637004 -895996 -305526 240204 45943 -271136 -48421 258387
34257B58387k06866l77553p0064r1455m19848j03478Q44665J149093L05695n73696
$$ 258387 51521 -326032 -396096 -487551 -907399 -1010877 -166212 982881 1288576 714880
34247G14880n08113K0620R5728l02643o09397n50138k04451K36486M70471L16280
$$ 714880 206767 227387 323115 20472 -588925 -1139063 -1343514 -1107028 -636557 -320277
34237c20277L8971j7760J800j69746k68665M9848M14378K67245j01183k7033L00621
$$ -320277 -281306 -299066 -297266 -467012 -735677 -685829 -271451 -4206 -105389 -132422 168199
34226A68199J84875k43318k45371J18260R9852k58934j26636N41204P91705K70070
$$ 168199 353074 109756 -135615 -17355 82497 -176437 -303073 238131 1029836 1299906
34216A299906k79449l73303l63455l88446j00003K45395j39922r78472r15075
$$ 1299906 1020457 647154 283699 -104747 -204750 40645 -99277 -1077749 -1992824
34207a992824L01492J160520O95402p7834j0437L72874J42631k90440j20740K51183
$$ -1992824 -1691332 -530812 164590 86756 76319 449193 591824 301384 180644 431827
34197D31827M8195l44081j55267K21047k6005m87993k19169M66270M88906q3012
$$ 431827 480022 135941 -19326 201721 175716 -312277 -531446 -65176 423730 340718
34187C40718k45459P2467K5705l70797k16176M33030M47486l18026n77671J94290
$$ 340718 95259 167726 193431 -177366 -393542 39488 486974 168948 -408723 -214433
34177b14433P69274K07663n88433m58257J30276O9812m44754l75421L11571O36624
$$ -214433 554841 762504 174071 -284186 -153910 -84098 -528852 -904273 -592702 43922
34167D3922K45750j55050n6501J62037K1475l17927l98796p8907M09749P03690
$$ 43922 289672 134622 78121 240158 261633 -56294 -455090 -533997 -124248 579442
34157E79442N18652j08087p32241q77436n09603J3953L83700N36264N10695L36845
$$ 579442 1098094 990007 257766 -619670 -1129273 -1115320 -731620 -195356 315339 652184
34147F52184P0810j67579k06100N7518M12322L80515j67712o26990m07724Q1076
$$ 652184 722994 555415 349315 406833 819155 1199670 1031958 404968 -2756 78320
34137G8320k9271n75615m57181N01402R92624K42363n90627j73006Q01510O66897
$$ 78320 49049 -526566 -983747 -482345 510279 752642 162015 -10991 790519 1457416
34127A457416n39237j144107m47377M17011M58000J04784m399r6314l73592k62749
$$ 1457416 918179 -225928 -673305 -256294 201706 306490 302091 205777 -167815 -430564
34117d30564N19587J106668O80767k08858n13987k63483k38833n17553m26804
$$ -430564 89023 1195691 1876458 1667600 1153613 890130 651297 133744 -293060
34108b93060K09967P39119O29853N4079n21032p67134n48359k8742L27973K60753
$$ -293060 -83093 656026 1285879 1339958 818926 51792 -496567 -525309 -197336 63417
34098F3417N4988J6466p5533m75609p85162m49976K81172O34489M23112J38279
$$ 63417 118405 134871 59338 -416271 -1201433 -1651409 -1370237 -735748 -312636 -174357
34088a74357N785k29644n09928l04156M54931R82376O37225j74099n44704k18056
$$ -174357 -168572 -398216 -908144 -1212300 -757369 225007 862232 688133 143429 -74627
34078g4627K17745J48855l71243p61966o02691r0057K56601K73626K58084L52261
$$ -74627 143118 291973 -79270 -841236 -1443927 -1533984 -1277383 -1003757 -745673 -393412
34068c93412K76201o4348k07404J41978M69596J91146l27667k94786J95181L02453
$$ -393412 -117211 -181559 -388963 -246985 222611 413757 86090 -208696 -13515 288938
34058B88938j42508l64014J3549L15691k2991m61492j78779O39073J048961O29193
$$ 288938 146430 -217584 -204035 111656 88665 -372827 -551606 87467 1136428 1765621
34048A765621j12913n41811n92435n61627n36420k99438K10873N92396M25339
$$ 1765621 1652708 1110897 518462 -43165 -579585 -879023 -668150 -75754 349585
34039C49585l2306p6104L49588L94454l96790j151220q33515J30027M43927p7590
$$ 349585 317279 241175 590763 985217 588427 -562793 -1396308 -1266281 -822354 -899944
34029h99944l37374J84514O72799M59140O4174J08740K23759j07245m61403k12448
$$ -899944 -1237318 -1052804 -380005 79135 143309 252049 475808 368563 -92840 -305288
34019c05288K68784J92993k77305l06212J60342K86513k46443p03661m64963O3915
$$ -305288 -36504 156489 -120816 -427028 -266686 19827 -226616 -930277 -1395240 -1331325
34009a331325J69954j05442j79380J13066L43695K21639J1364O1959K57651K37706
$$ -1331325 -1161371 -1266813 -1446193 -1333127 -989432 -767793 -756429 -694470 -436819 -199113
33999a99113k377j04236N6247J60793j0127k08516j64724n0551j21602k11386
$$ -199113 -201490 -305726 -249479 -88686 -98813 -307329 -472053 -522604 -644206 -855592
33989h55592m4777K16204K68355K51520M17826M64838k3977o23915m78066L05051
$$ -855592 -900369 -684165 -415810 -164290 253536 718374 694397 70482 -407584 -102533
33979a02533O43701R3353n16599m45558p4268O421L6742M19379P30289L43793
$$ -102533 541168 634521 117922 -327636 -401904 -395483 -358741 60638 790927 1134720
33969A134720m06256o26041j82573K18815J57524o8359j12015j2581R1953J46499
$$ 1134720 728464 102423 -80150 138665 296189 227830 115815 103234 195187 341686
33959C41686M1663k34122l26456J03991P35993Q48503K89165l36627n62838o00407
$$ 341686 383349 149227 -177229 -73238 662755 1511258 1800423 1463796 900958 300551
33949C00551p22400o50285n7512O33819O08645j68433p23026l09020N48981P43094
$$ 300551 -421849 -1072134 -1129646 -495827 112818 -55615 -778641 -1087661 -538680 204414
33939B04414R3278m59212k18886L64122M90530J46563r4545k3279P9866O3652
$$ 204414 297692 -161520 -380406 -16284 474246 620809 526264 502985 582851 646503
33929F46503L4798m3563l10479n91117n35209j55105K25973M73603O13682M72497
$$ 646503 681301 637738 327259 -263858 -799067 -954172 -728199 -254596 359086 831583
33919H31583n4568n11588l45914K05254L98905R7738j72244k32722m26917p02610
$$ 831583 777015 265427 -80487 124767 523672 621410 449166 216444 -210473 -913083
33909i13083m78314L12008R14271Q24988L84997J5659l17364n59940l60541J72999
$$ -913083 -1391397 -1079389 -165118 659870 1044867 1060526 743162 183222 -177319 -4320
33899d320L40953n3119k80578J27665N70929L47849k76793n95756m43056r2309
$$ -4320 336633 283514 2936 130601 701530 1049379 772586 176830 -266226 -358535
33889c58535K64273M47543K63545n9734j8154K94431K20601k89377n04052k41454
$$ -358535 -94262 353281 616826 557092 538938 833369 1053970 764593 260541 19087
33879A9087k12089n41916k98999P26315J179696K01370r77876q69077K952K28202
$$ 19087 -193002 -734918 -1033917 -307602 872094 1073464 95588 -773489 -770537 -542335
33869e42335r7996Q0993N84727L09153o09360q55343j10969N65180O00843N02503
$$ -542335 -640331 -559338 25389 334542 -274818 -1130161 -1241130 -675950 -75107 427396
33859D27396M40794r9461r23001r69841q7221M87002O5936l85319J02843R12541
$$ 427396 868190 768729 -154272 -1124113 -1211334 -724332 -658396 -1043715 -940872 -28331
33849b8331Q79044Q1547m26872j82462K86883L82338P4590k98163m35587k92665
$$ -28331 850713 932260 505388 322926 609809 992147 1066737 768574 332987 40322
33839D0322p8628J0209K6745O8866M972k47901l56977J8443N62829N99634L1974
$$ 40322 -38306 -28097 -1352 67514 72486 -175415 -532392 -513949 48880 648514 680488
33828F80488n21328n45828j53497K05944K00759j34194l42547N238N76099N08430
$$ 680488 159160 -386668 -540165 -334221 -133462 -267656 -610203 -604965 -28866 479564
33818D79564k52132o17121p874N57635P1710o44353k03832Q82987Q23193n49598
$$ 479564 227432 -389689 -397563 160072 231782 -412571 -616403 266584 1089777 540179
33808E40179j379579n94063O50498R30475M22516P320j86972m09997m65124j67095
$$ 540179 -839400 -1433463 -782965 147510 570026 577346 390374 -19623 -484747 -651842
33798f51842J27887J61093K27572M26626K69365l67209p40857l70802J45937J49076
$$ -651842 -523955 -362862 -135290 291336 560701 193492 -547365 -918167 -772230 -623154
33788f23154n0611Q1028K84488R9826j80844n5397K31961J56676j26340j42261
$$ -623154 -673765 -592737 -308249 -208423 -389267 -444664 -212703 -56027 -182367 -324628
33778c24628O253m6849j11008J75898M71007J86565l71936l08356M30555Q46012
$$ -324628 -318375 -365224 -476232 -300334 170673 357238 -14698 -323054 107501 953513
33768I53513L06123n71275p72619j28151O07758O37570j09590r45936j115811
$$ 953513 1259636 688361 -84258 -212409 395349 1032919 923329 -22607 -1138418
33759a138418n85025r347J54035J63256L85551O03678M07631l6726k15988j02513
$$ -1138418 -1723443 -1732790 -1578755 -1415499 -1029948 -426270 -18639 -55365 -271353 -373866
33749c73866j08871k36453K1013P10906J009519K69641r01025j219263l26780
$$ -373866 -482737 -719190 -698177 12729 1022248 1291889 390864 -828399 -1155179
33740a155179P33224Q10853j2117p21513o98354k36867J50913L41183L82035K41940
$$ -1155179 -421955 388898 376781 -344732 -1043086 -1279953 -1129040 -787857 -405822 -163882
33730a63882N8381J42016M02991K92260k77966n54709p7876M22842J00951n66574
$$ -163882 -105501 36515 439506 731766 453800 -100909 -178785 244057 345008 -221566
33720b21566m87649K35358M66012n6667l15832K09490O62798K78041l69577l54050
$$ -221566 -709215 -473857 -7845 -64512 -380344 -170854 491944 769985 400408 46358
33710D6358J90395M70303K57399n0454j82146j70693r3279j00638l59673o32130
$$ 46358 236753 707056 964455 914001 731855 561162 467883 367245 7572 -624558
33700f24558m01574K42592M83315q881m40380q7834N61409O38268K50657R0598
$$ -624558 -1026132 -783540 -300225 -309106 -749486 -837320 -275911 362357 613014 703612
33690G03612J61068n5779m29788k85542L44721O04265J30520m08164l99277j31893
$$ 703612 864680 808901 379113 93571 438292 1042557 1173077 764913 365636 233743
33680B33743j33617k89796j60053K11986L35196k2539n40771p34045m26960J28347
$$ 233743 100126 -189670 -349723 -137737 197459 174920 -365851 -1099896 -1526856 -1398509
33670a398509M92601M33847J29696p1467n2334M2794J22512K47142L74954K92773
$$ -1398509 -905908 -472061 -342365 -413832 -466166 -423372 -300860 -53718 321236 614009
33660F14009k9056k41183m5265L14085L23546o0505l47798l00869l19351o89317
$$ 614009 584953 343770 298505 612590 936136 875631 527833 226964 -92387 -781704
33650g81704q91579l03840O50996R02140L04421j20010J91762M73207J7240n23609
$$ -781704 -1673283 -1977123 -1326127 -423987 -119566 -239576 -47814 425393 442633 -80976
33640h0976k42300L59578J42948o27066n31104O54063J375257N94503o37457p49331
$$ -80976 -323276 36302 179250 -447816 -978920 -324857 1050400 1644903 1007446 258115
33630B58115J69591P68133M09419k93070o58443p04068o67618m93489q3268L25337
$$ 258115 427706 1195839 1605258 1312188 653745 -50323 -717941 -1211430 -1294698 -969361
33620i69361L43024o4281m12683j72455N57129J026101O82235j33513o33989n54415
$$ -969361 -626337 -690618 -1103301 -1275756 -718627 307474 989709 856196 222207 -332208
33610c32208k80449j54163j32781p2418J14261N07657R33509Q53935R0469n83800
$$ -332208 -612657 -766820 -899601 -972019 -857758 -350101 583408 1437343 1527812 944012
33600I44012l55345L24452L25159l56574n68249O5792N02485N6699m71930k41003
$$ 944012 588667 913119 1238278 881704 313455 379247 881732 938431 466501 225498
33590B25498K19399P0500l05684o2647N08521M50935j72158l67376J31119M98053
$$ 225498 444897 515397 209713 147066 655587 1106522 934364 566988 698107 1196160
33580A196160K06132k66208l43303j01018J61033L57666L56774m9295o14273p03946
$$ 1196160 1402292 1136084 792781 691763 852796 1210462 1567236 1517941 903668 199722
33570A99722k34487N1426l10155o74280j95837P88379J068156K31415p12351o67294
$$ 199722 -34765 16661 -293494 -967774 -1163611 -375232 692924 924339 211988 -455306
33560d55306J56134O71799L81828k03794m70752l52340j4071M34681O74486K84483
$$ -455306 -299172 372627 754455 550661 79909 -272431 -286502 148179 822665 1107148
33550A107148m92119p27082o9193N97693M09795j98366l14690m1176p1662k52140
$$ 1107148 615029 -112053 -181246 416447 826242 627876 313186 272010 200348 -51792
33540e1792J11256P41144O52855l6549r1400P47806J187738M77876l90681m12664
$$ -51792 59464 800608 1453463 1416914 1325514 2073320 3261058 3738934 3348253 2935589
33530B935589j27818l76060o89677k38073N27089N69322j2424l21331k56884l94981
$$ 2935589 2807771 2431711 1742034 1503961 2031050 2600372 2587948 2266617 2009733 1614752
33520A614752n80169q9926Q12549R04477j15282r92761o96553J48559L02984k95214
$$ 1614752 1034583 944657 1757206 2661683 2546401 1553640 857087 1005646 1308630 1013416
33510A013416n93336p871P91618Q13325K9122o03322l43458M38126Q04260M68771
$$ 1013416 420080 412209 1203827 2017152 2046274 1442952 1099494 1537620 2341880 2810651
33500B810651J4722p7351n2842l10714o98878p57691l58083K32604O88455P86933
$$ 2810651 2825373 2748022 2695180 2384466 1685588 927897 569814 802418 1490873 2277806
33490B277806M84089L7698j84844j53369j51413k62317k73501j30195j869J33278
$$ 2277806 2761895 2799593 2614749 2461380 2309967 2047650 1774149 1643954 1642085 1775363
33480A775363L94221M84917K4598n46661l22038N88166R68497L15572l53114j48807
$$ 1775363 2169584 2654501 2679099 2132438 1810400 2398566 3367063 3682635 3329521 3180714
33470C180714L25280J51755l47576l41807O924k2364l40873l23948m3067m6477
$$ 3180714 3505994 3657749 3310173 2968366 2975290 2952926 2612053 2288105 2245038 2198561
33460B198561k13753J1400M54074M15041o7464k61070l935J32589l9792q6825
$$ 2198561 1984808 1996208 2450282 2865323 2797859 2536789 2532854 2665443 2625651 2538826
33450B538826Q2525J4827l52813m88139k09920J2182q9684k46585l45263n79410
$$ 2538826 2621351 2636178 2283365 1795226 1585306 1597488 1507804 1261219 915956 336546
33440C36546o90936l9892J151750J594849O37309o24474p69699m77L07517k98689
$$ 336546 -354390 -394282 757468 2352317 2989626 2365152 1595453 1594976 1902493 1603804
33430A603804p78451k72258N91332O39791j46194o62228k92380L01073K80450
$$ 1603804 825353 553095 1144427 1784218 1638024 975796 683416 984489 1264939
33421A264939j48984k38079L0324J2311l75249m31577J34121O34567M45365q2813
$$ 1264939 1115955 877876 908200 920511 545262 113685 247806 882373 1327738 1244925
33411A244925k62756n4150J33165J54116J12082J3784q2553M9111L47602L30564
$$ 1244925 982169 928019 1061184 1215300 1327382 1341166 1258613 1307724 1655326 1985890
33401A985890j50432n22705l55487o3296j53136l29697q8451K88450J88278k21553
$$ 1985890 1835458 1312753 957266 893970 740834 411137 322686 611136 799414 577861
33391E77861k37607K01338M42333J90086j17138p1409J95701L77764L82083K45715
$$ 577861 340254 541592 983925 1174011 1056873 985464 1181165 1558929 1941012 2186727
33381B186727l283l28270o64979q39415n36511K61972Q25572L57893o97592r23845
$$ 2186727 2183444 1855174 1190195 350780 -185731 76241 901813 1259706 562114 -361731
33371c61731Q1914R78824O35375k01661k12542M05345M66081j75265n55125l00276
$$ -361731 -279817 699007 1334382 1132721 920179 1325524 1791605 1616340 1061215 760939
33361G60939j4441L767J61317N51296O48084K56829j63656l35341m75528o06561
$$ 760939 746498 750265 911582 1462878 2110962 2367791 2204135 1868794 1393266 786705
33351G86705l91724J10811L13869J3371k40373R27M18791M50729O3633k98372
$$ 786705 394981 505792 819661 833032 592659 593586 1012377 1463106 1526739 1228367
33341A228367k99080m2925R6296m9814j85469J3101K88769J45670k13243r3020
$$ 1228367 929287 886362 982658 932844 747375 760476 1049245 1194915 981672 888652
33331H88652L83177K26804o85235j040189j11489Q35719M06048o69135o87834
$$ 888652 1271829 1498633 813398 -226791 -338280 497439 903487 234352 -453482
33322d53482L24271Q08308K21582l58279j95205J41045N6657j59653j17400K8363
$$ -453482 -129211 679097 900679 542400 347195 488240 544897 385244 267844 296207
33312B96207P7288J35029K36852K52188K04519J60385N321j66668O3503N78390
$$ 296207 373495 508524 745376 997564 1202083 1362468 1367789 1201121 1264624 1843014
33302A843014N40167j49019k94628N77445J057120L87622N97914L459166O426453
$$ 1843014 2383181 2234162 1939534 2516979 3574099 3961721 4559635 8018801 14445254
33293A4445254N069214m97373n077279n038846k307103n20496l23402m10780n85620
$$ 14445254 19514468 19017095 13939816 8900970 6593867 6073371 5749969 5339189 4753569
33284D753569j226663j493061n79116L96720j2092j027457q29805M27231R35173
$$ 4753569 3526906 2033845 1454729 1851449 1839357 811900 -17905 409326 1344499
33275A344499J79972m88667k24054K11825J0266m77731n61033k09140J77172L20050
$$ 1344499 1524471 1035804 811750 1023575 1033841 556110 -4923 -214063 -36891 283159
33265B83159J65602j01484j40790P8258J24702j89811l78845p0867K80070J46832
$$ 283159 448761 347277 206487 284745 409447 219636 -159209 -230076 49994 196826
33255A96826j15400J04893N09091L03919m32465p65686k92330L34157M24561J31546
$$ 196826 81426 186319 695410 999329 566864 -198822 -491152 -156995 267566 399112
33245C99112N0021L76664P27070O13378j0960o60002q34950n90499l44805k04399
$$ 399112 449133 825797 1552867 2166245 2155285 1495283 660333 69834 -274971 -479370
33235d79370O8561M06862L60698j42993n47699m40832n0910K60447M27815L78256
$$ -479370 -410809 -3947 356751 213758 -333941 -774773 -825683 -565236 -137421 240835
33225B40835l1909m88554l61219K62627M80545k1210l42628J78217P49754L03471
$$ 240835 208926 -279628 -640847 -378220 102325 81115 -261513 -83296 666458 969929
33215I69929p76053j193523o30540K2685J92227L02326P67696J186666R43316
$$ 969929 193876 -999647 -1630187 -1607502 -1415275 -1112949 -345253 841413 1784729
33206A784729R9768o90358r09654n71679k9774M01323O05078N53691K39851j74903
$$ 1784729 1884497 1194139 284485 -287194 -316968 84355 689433 1243124 1482975 1308072
33196A308072l61711k22026p5336j36044r2783L12438O08235K04448n35447o81455
$$ 1308072 946361 724335 648999 512955 420172 732610 1340845 1545293 1009846 328391
33186C28391j25543L19305K33424M6761N3724l0319k74197k58084Q8374K90511
$$ 328391 202848 522153 755577 802338 856062 825743 551546 293462 381836 672347
33176F72347K43215L40562M56355k2781p90869o28771N52277J125793J71258r18013
$$ 672347 915562 1256124 1712479 1689698 898829 270058 822335 1948128 2119386 1201373
33166A201373n48616N70783O55215l18068q08804k94108J78010j1042j72162K36993
$$ 1201373 652757 1223540 1878755 1560687 751883 457775 635785 624743 452581 689574
33156F89574O65469N21966J23785n718n988k38294n16856l73113J78956O05951
$$ 689574 1355043 1877009 2000794 1995076 1989088 1750794 1233938 860825 1039781 1645732
33146A645732N20686J10031j39255k2649J88891J72361j1166j20198j67125k37398
$$ 1645732 2166418 2276449 2137194 2114545 2303436 2475797 2464631 2344433 2177308 1939910
33136A939910o6275N63855J086520O57804m67183j002269m28220K38573M6220
$$ 1939910 1873635 2437490 3524010 4181814 3714631 2712362 2284142 2522715 2568935
33127B568935m66896k85213M16857O48993J63417l83417n65715n50885m53724
$$ 2568935 2102039 1816826 2233683 2882676 3046093 2662676 2096961 1546076 1092352
33118A092352j70852J49476J74413m8188j62326j29687k41151m89357m45046J15290
$$ 1092352 921500 1070976 1245389 1197201 1034875 905188 664037 174680 -270366 -155076
33108a55076Q07016J006949M90567l23747p49591n51558k14873k60280m73608
$$ -155076 651940 1658889 2149456 1825709 1076118 524560 309687 49407 -424201
33099d24201l06934J19636J72813j41829j03413M39589O97038K65966j62166k8303
$$ -424201 -731135 -611499 -438686 -580515 -683928 -244339 452699 718665 556499 528196
33089E28196J29848k48395n88848j27139O43796O03184k85656r45460o98047Q3839
$$ 528196 658044 409649 -179199 -306338 337458 940642 654986 -290474 -988521 -904682
33079i04682P28895Q96215N32686j20864n38693m56976k58865l48996m59040j53502
$$ -904682 -175787 720428 1253114 1132250 593557 136581 -122284 -471280 -930320 -1083822
33069a083822L16798L73408O8613o0133P1082O1430j30038p5447K88999M05166
$$ -1083822 -767024 -393616 -325003 -385136 -314054 -252624 -382662 -458109 -169110 236056
33059B36056p1464o64527o39896N7834P17270O90863J41846k02914k9033J81010
$$ 236056 164592 -499935 -1139831 -1081997 -364727 326136 467982 265068 236035 417045
33049D17045j5557k39535O2000N35148L75308k66779l92010K08036N29998m8795
$$ 417045 401488 161953 223953 759101 1134409 867630 475620 683656 1213654 1164859
33039A164859q11692q83251m15111L0403L78167O19990L60532m02062p93685k24344
$$ 1164859 353167 -530084 -945195 -914792 -536625 83365 443897 41835 -751850 -976194
33029i76194O06327P05627K01519r2394J4656J05497M7395Q630r3234l95672o21484
$$ -976194 -369867 335760 537279 444885 459541 565038 612433 621063 527829 132157 -489327
33018d89327m50189o3079K14874M21785O08069M86158j1267l53015j76730R6412
$$ -489327 -939516 -1002595 -787721 -365936 242133 728291 717024 364009 187279 283691
33008B83691j1510k66609k70821j69899k00874j62497M2369J5854l35439l55444
$$ 283691 272181 5572 -265249 -435148 -636022 -798519 -756150 -740296 -1075735 -1431179
32998a431179K80320Q07453N12229j13740k27571O4789J58474K6185m2389j19001
$$ -1431179 -1150859 -343406 168823 55083 -172488 -107699 50775 76960 34571 -84430
32988h4430k26671J0669N06094M05952m49047q30232j3731P85282K94990o12062
$$ -84430 -311101 -300432 205662 611614 162567 -667665 -681396 103886 398876 -213186
32978b13186l57007O30719O80476k23419n06125K11964N67385q4589o51989k83046
$$ -213186 -570193 60526 741002 517583 11458 223422 790807 706218 54229 -228817
32968b28817L34981L49362L8698J0773J90488K64888K77247K58805J616m13942
$$ -228817 106164 455526 494224 504997 695485 960373 1237620 1496425 1498041 1084099
32958A084099n22154j76688K32899L95920L40204R6687k68080l86393l0483L49121
$$ 1084099 561945 385257 618156 1014076 1354280 1450967 1182887 796494 766011 1115132
32948A115132K31258j02707r8284L8974j89915m48246o3342N95994N08833l24972
$$ 1115132 1346390 1243683 1145399 1184373 994458 546212 482870 1078864 1587697 1262725
32938A262725q65203o78655l46172j77638J66951N99887M58410k41278o00536
$$ 1262725 397522 -281133 -627305 -804943 -637992 -38105 420305 179027 -421509
32929d21509k55160J20517P8888M3065K81033L58317J06720O3076L87574L92667
$$ -421509 -676669 -556152 -477264 -434199 -153166 205151 311871 374947 762521 1155188
32919A155188k07135n87494j25981M92851L72995j70633k84339o1157k27654o82859
$$ 1155188 948053 360559 234578 727429 1100424 929791 645452 584295 356641 -326218
32909c26218n46939K91260P84533K91356l58960q0900P61417Q31249j38536q65611
$$ -326218 -873157 -581897 202636 493992 135032 54132 815549 1646798 1508262 642651
32899F42651m37341L16216J96226m40089l66250L82734N90193J2203j97915M07896
$$ 642651 205310 521526 717752 277663 -88587 294147 884340 896543 698628 1106524
32889A106524O91573p1053q19854m46330L79087M28718o6501o5496L88866M18585
$$ 1106524 1798097 1727044 907190 460860 839947 1268665 1202164 1136668 1525534 1944119
32879A944119l5481k34252n4134j06252n50308q51744o73834k04767K58404M31398
$$ 1944119 1908638 1674386 1620252 1514000 963692 111948 -561886 -766653 -508249 -76851
32869g6851R3743m28423l79440K70037N51229K9396l65163J04540O66330L88304
$$ -76851 16892 -411531 -790971 -520934 30295 59691 -305472 -200932 465398 853702
32859H53702k02993j58164J97434L2237l75520k80970L8454n3004j50567L57507
$$ 853702 650709 492545 689979 722216 346696 65726 104180 51176 -99391 258116
32849B58116P94264J95352q46613j022505l84626P9511K78107O61066P43969q5333
$$ 258116 1052380 1247732 401119 -621386 -1006012 -926501 -648394 12672 756641 671308
32839F71308r15091m88284N37142N97810r1739j36347L09302m8455q45112m33507
$$ 671308 -243783 -732067 -194925 402885 311146 174799 484101 435646 -409466 -842973
32829h42973R55422J252178N8601o74638o0438L78684l48880j025307o25055k2127
$$ -842973 112449 1364627 1423228 748590 688152 1066836 717956 -307351 -932406 -954533
32819i54533j9419J50760R70652J285589L20926p11958n80232m4130l23329r12204
$$ -954533 -973952 -823192 147460 1433049 1753975 1042017 461785 417655 94326 -817878
32809h17878n89080M25700R12998N58755O9419j07119r8087m8227l1372j28831
$$ -817878 -1406958 -981258 -68260 490495 559914 452795 354708 306481 275109 146278
32799A46278j35687K51512O88014M27882m25842q71925m95328K9631J86747K21246
$$ 146278 10591 262103 950117 1377999 952157 80232 -415096 -385465 -198718 22528
32789B2528K10804j79122o24392k07050R14831J306608M09415m91138k81902L24482
$$ 22528 233332 54210 -570182 -777232 137599 1444207 1853622 1362484 1080582 1405064
32779A405064J75073m58311n79141j34910K16340L90097P73774J151857P31688
$$ 1405064 1580137 1121826 542685 407775 624115 1014212 1787986 2939843 3671531
32770C671531p06516k250306k610700j381266M18546J259408P63747L6505N050
$$ 3671531 2965015 714709 -1895991 -3277257 -2858711 -1599303 -835556 -799051 -794001
32761g94001J85833j63308n53695j46234N93595O01222O7217l562L04807P9729
$$ -794001 -608168 -771476 -1325171 -1471405 -877810 -276588 -209371 -212933 91874 171603
32751A71603n07198l87738L59040N17304j00629l45325J76886N07570J72255j26941
$$ 171603 -335595 -723333 -364293 153011 52382 -292943 -116057 391513 563768 436827
32741D36827m5039j30029m12250j39642O14832P41139j624m93414k03128N099
$$ 436827 391788 261759 -150491 -290133 324699 1065838 1064214 570800 367672 372771
32731C72771l70272n32247K5566M93682J91079k45095r430N64013O60809J84689
$$ 372771 2499 -529748 -504182 -10500 180579 -64516 -73946 490067 1150876 1335565
32721A335565l15019l64053P2179M94699K50822n05325p46125j26242K84979j97784
$$ 1335565 1020546 656493 728672 1223371 1474193 968868 222743 96501 381480 183696
32711A83696n33691J68947P73219L8711q66083j76848J223468J122160k61529
$$ 183696 -349995 -181048 592171 630882 -235201 -412049 811419 1933579 1672050
32702A672050p92116j65977l5766o41329n06854M53641O64581n5411k08812L49436
$$ 1672050 879934 713957 678191 36862 -469992 -16351 648230 592819 384007 733443
32692G33443J56341p76135p59612K77529M89045l76906m23442P70512J264116
$$ 733443 889784 113649 -645963 -368434 120611 -256295 -679737 90775 1354891
32683A354891L27646l55451J693K0794p62240p94991L33309Q01481j14689p05422
$$ 1354891 1682537 1327086 1328779 1349573 587333 -207658 125651 927132 812443 107021
32673A07021p8651L26206k40216l92885M62013Q18748O1788k77514L94114M88376
$$ 107021 28370 354576 114360 -278525 183488 1002236 1064024 786510 1180624 1669000
32663A669000n39403q85380K06113Q98848J45759n23725j17970R0605n23769n46817
$$ 1669000 1129597 244217 450330 1349178 1494937 971212 853242 943847 420078 -126739
32653a26739M13364N90686m54198o69579N51039R21679m38333j061278L87805
$$ -126739 286625 877311 423113 -246466 304573 1226252 787919 -273359 114446
32644A14446J476269L06035j140725o20396O98522Q55764L69145L42002J59569
$$ 114446 1590715 1896750 756025 135629 834151 1689915 2059060 2401062 2560631
32635B560631n77249n86198N53832J189508O43733M20428Q88929K77067j526305
$$ 2560631 1983382 1397184 1951016 3140524 3784257 4204685 5093614 5370681 3844376
32626C844376k033865o26831J67087n22063l60443J161863J165340r68794j655836
$$ 3844376 1810511 1183680 1350767 828704 468261 1630124 2795464 1826670 170834
32617A70834N37355J955561K96488j414219o40713L01601o25146j111595M67601
$$ 170834 708189 2663750 2960238 1546019 905306 1206907 581761 -529834 -62233
32608f2233J307057l64094j397027L55163J627172j62717j856617m82581J182198
$$ -62233 1244824 880730 -516297 -161134 1466038 1303321 -553296 -1035877 146321
32599A46321J21878j197115K7376J350604J50105r75503N19340J759909P5793
$$ 146321 268199 -928916 -901540 449064 599169 -376334 143006 1902915 1978708
32590A978708j428542J96067J807747K36068j451096l2758J437008j67348j543420
$$ 1978708 550166 746233 2553980 2790048 1338952 1306194 2743202 2575854 1032434
32581A032434N14308K463773R67722k78327J849172K771039j100711m172594j257663
$$ 1032434 1546742 4010515 4978237 4699910 6549082 9320121 8219410 4046816 2789153
32572B789153K382222M35551k853428j137385J867154J73829k345747J19049L092363
$$ 2789153 5171375 5606926 2753498 1616113 3483267 3657096 1311349 1430398 4522761
32563D522761M31211k817918J45464L936463J109823k651685O15437M597316N95640
$$ 4522761 4953972 2136054 2281518 6217981 7327804 4676119 5291556 9888872 10484512
32554A0484512m056684Q35999P285926L424000k299011L393237J0792573M843196
$$ 10484512 6427828 7263827 14549753 17973753 15674742 19067979 29860552 34703748
32546C4703748j757944J0429492K5468167J7502689J0467184N1412495J16432792
$$ 34703748 32945804 43375296 68843463 86346152 96813336 148225831 264658623
32539B64658623J12761552P654241j06075414j23509496n9721901r887632j3127008
$$ 264658623 377420175 385074416 278999002 155489506 95767605 85879973 72752965
32532G2752965k5675561j3439895J951129k370885j0760695n306066K215091k149814
$$ 72752965 47077404 33637509 35588638 33217753 22457058 17150992 19366083 17216269
32524A7216269p985833l096703L436358M39162m587761j702997K798515L02040
$$ 17216269 9230436 6133733 9570091 10009253 5421492 3718495 6517010 6819050
32516F819050l464801q40844K724968J36266l375467r53662K538051M08288k916322
$$ 6819050 3354249 2513405 5238373 5374639 1999172 1045510 3583561 3991849 1075527
32507A075527q61677K657591J137001k257919j374883J354521N23175j667539
$$ 1075527 213850 2871441 4008442 1750523 375640 1730161 2253336 585797
32499E85797m13670J966033P54247j903603j282795J047348Q26286p56192j93439
$$ 585797 172127 2138160 2892407 988804 -293991 753357 1579643 823451 630012
32490F30012J134236J33593j440290m32416J315185M74438j335254p89973Q08990
$$ 630012 1764248 1897841 457551 25135 1340320 1814758 479504 -310469 498521
32481D98521L92986q70433j86722J223863O36494p64765k75038J045920M95426
$$ 498521 891507 21074 -165648 1058215 1694709 929944 654906 1700826 2196252
32472B196252j138012j217246L3342O09183M54438M62365K4520j113869j130921
$$ 2196252 1058240 -159006 -125664 483519 937957 1400322 1424842 310973 -819948
32463h19948O09105J485955o9220j436696k78707J282419N80578q73955m95273
$$ -819948 -210843 1275112 1205892 -230804 -509511 772908 1353486 479531 -15742
32454a5742O83613M33430l87748N3636P57839K6809j007083o10621J59571k71977
$$ -15742 667871 1101301 713553 767189 1525028 1551837 544754 -65867 93704 -178273
32444a78273p70753J12922J007500L03083o40225j48701M83705l23745j127242
$$ -178273 -949026 -836104 171396 474479 -165746 -314447 169258 -154487 -1281729
32435a281729k29305Q84808L62603m03844M30446J382064M15164r93171m72906
$$ -1281729 -1511034 -626226 -263623 -667467 -237021 1145043 1560207 567036 94130
32426I4130Q37386M80628p91924o64118M08434M18779k64523K5818P41442L06597
$$ 94130 931516 1412144 620220 -43898 364536 783315 518792 544610 1286052 1592649
32416A592649n90160l40039L84630Q6243m56174J43684P76310j49730j267535
$$ 1592649 1002489 662450 1047080 1133323 677149 820833 1597143 1447413 179878
32407A79878m51266J111302Q21452p30905r42442J57202L40685n61003o63984
$$ 179878 -271388 839914 1661366 930461 -11981 145221 485906 -75097 -739081
32398g39081K27695M83719q6120j38362L39464J65498l84227l1031P75943M74705
$$ -739081 -511386 -27667 -113787 -252149 87315 252813 -131414 -162445 613498 1088203
32388A088203o35940q37037k8962L74526J75290L46335O87636J82993o79890n32001
$$ 1088203 452263 -384774 -413736 -39210 136080 482415 1170051 1353044 673154 141153
32378A41153K95604L15570l78348l97425K81024L81461k29452m78825j85955r2129
$$ 141153 436757 752327 373979 -23446 257578 639039 409587 -69238 -255193 -347322
32368c47322j67496J11222L29916q0390l80380J97286O85361J4268p48034j59680
$$ -347322 -514818 -403596 -73680 -154070 -534450 -337164 348197 362465 -385569 -545249
32358e45249Q07588M13351n77931k39486Q71472O32049p36135j012640O5355N07068
$$ -545249 262339 675690 97759 -141727 729745 1361794 625659 -386981 -321626 185442
32348A85442k52587n83998J26200N08897k7875l23592J40944L66350m8548k02461
$$ 185442 -67145 -651143 -524943 -16046 -43921 -367513 -226569 139781 91233 -111228
32338a11228J70700K29131r1263J16721O66830K65603r67103j239597j3806R88454
$$ -111228 59472 288603 197340 314061 980891 1246494 279391 -960206 -974012 14442
32328A4442N37494l60175m42877j09324k31704n34048l25029K08349M41420L16574
$$ 14442 551936 191761 -251116 -360440 -592144 -1126192 -1451221 -1242872 -801452 -484878
32318d84878J88420K01133K57016K08070m0065k79966r8337L73579L61989l14152
$$ -484878 -296458 -95325 161691 369761 329696 49730 -48607 324972 686961 372809
32308C72809o88106j27739N39291M08588K1582K38049N58994Q0595o99484o37383
$$ 372809 -315297 -443036 96255 504843 526425 764474 1323468 1404063 704579 67196
32298F7196J34692N72323M13363R2157l45628q41923o70546L52761R52031K38170
$$ 67196 201888 774211 1187574 1279731 934103 92180 -578366 -225605 726426 964596
32288I64596o18607k92544L59290q6347q97142m89612N88217O28482r0501O1352
$$ 964596 345989 53445 412735 326388 -570754 -1060366 -472149 156333 65832 127184
32278A27184Q60052O09630n41747o85024L83895P47907k10037q10625j45418M99444
$$ 127184 987236 1596866 1055119 370095 753990 1501897 1291860 481235 335817 835261
32268H35261J41180l39407q7692L32645L36966K76163K45101l02229j098533r91396
$$ 835261 976441 637034 549342 881987 1218953 1495116 1740217 1437988 339455 -651941
32258f51941N0933O18129J47786k40143J60472N08693J40346k80199j69916l5332
$$ -651941 -601008 17121 164907 -75236 85236 593929 734275 454076 284160 248828
32248B48828k54623l00449M8375J06191l65466n36656L5083O00536N62002L89568
$$ 248828 -5795 -306244 -257869 -151678 -517144 -1053800 -1018717 -418181 143821 533389
32238E33389N12502M74842r0841o76209p25179l78276M8375M72998O69780L79644
$$ 533389 1045891 1520733 1429892 753683 28504 -349772 -301397 171601 841381 1221025
32228A221025n2567p3929P1543k20463o38491l80209L04984M21405l2143j49816
$$ 1221025 1168458 1094529 1166072 945609 307118 -73091 231893 653298 621155 471339
32218D71339J32732J7784m46255l80170J37156J06103m41412m25847J50758R2302
$$ 471339 604071 621855 175600 -204570 -67414 38689 -402723 -828570 -677812 -585510
32208e85510o33484n72409O03013J314166P18388L6745K42991M51379j64952p21517
$$ -585510 -1218994 -1791403 -1188390 125776 844164 880909 1123900 1575279 1410327 688810
32198F88810l16939K41057o8387o05219k38585O72674R44685M19343j31146l12322
$$ 688810 371871 612928 544541 -60678 -299263 373411 1318096 1737439 1606293 1293971
32188A293971k53459j3315K90641K87019p5113l29265k84731k94530m56269m46138
$$ 1293971 1040512 1027197 1317838 1604857 1529744 1200479 915748 621218 164949 -281189
32178b81189l38361m93461n11271L16994J338165J027725m35656j004070Q9547
$$ -281189 -619550 -1113011 -1624282 -1307288 30877 1058602 622946 -381124 -291577
32169b91577J023944L48395p24701n06318M40999N88759N0377o6462J42954j65993
$$ -291577 732367 1080762 356061 -150257 290742 879501 929878 863416 1006370 840377
32159H40377o69921l67799M51430N56887j28283m52296l053L76567J46654k06453
$$ 840377 170456 -197343 254087 810974 682691 230395 227342 603909 750563 544110
32149E44110k40220k11957l47221l58017m1720K92846K99366O7234o4949Q4700
$$ 544110 303890 91933 -255288 -613305 -655025 -362179 -62813 4421 -60528 24172
32139B4172L66723M18801R1571k34631j22588J43270j16510p58252p67702J91293
$$ 24172 390895 809696 901267 666636 544048 687318 570808 -187444 -955146 -763853
32129g63853J047853P70799j90995o65269l73344J5318M3198j11132j73769j05686
$$ -763853 284000 1054799 863804 198535 -174809 -159491 -116293 -227425 -401194 -506880
32119e06880L3972J57569J81229J76579K61538K77172k2183m20364m29215q1493
$$ -506880 -472908 -315339 -134110 42469 304007 581179 558996 138632 -290583 -372076
32109c72076J08813K8798N0802J80590L5495k11942N7272O21640M63558m69987
$$ -372076 -263263 -234465 -183663 -3073 32422 -179520 -122248 499392 962950 492963
32099D92963q72623j35200N35177M6254p44556m14557P29870J175310M57167m64433
$$ 492963 -379660 -514860 20317 66571 -677985 -1092542 -362672 812638 1269805 805372
32089H05372p75704n51061r5230L95952N89539L00729o2115m4999Q9447j34153
$$ 805372 29668 -521393 -616623 -220671 368868 669597 607482 562483 651930 517777
32079E17777m65601l40849M2584m621m60113n89908j45453L08625L57393K49560
$$ 517777 52176 -288673 -246089 -250710 -710823 -1300731 -1446184 -1137559 -780166 -530606
32069e30606K87459L70933L45232K58134J07522j89460m57759l68116j955J57664
$$ -530606 -243147 127786 473018 731152 838674 649214 191455 -176661 -178616 -20952
32059b0952l8559j43544J60966M87739K81266l04140n21919n1035M91137L10311
$$ -20952 -59511 -203055 -42089 445650 726916 422776 -99143 -150178 340959 651270
32049F51270m84593r53993n34666K25947M25245j3070l66011j78506K24023L53603
$$ 651270 166677 -787316 -1321982 -1096035 -670790 -683860 -1049871 -1228377 -1004354 -650751
32039f50751K19503J46367K37782K90288J41052p2563m6181K75273M82102J28095
$$ -650751 -431248 -284881 -47099 243189 384241 311678 265497 540770 1022872 1150967
32029A150967n96459r64611o31748o1639J91128J72664J78067J91698J17181J19857
$$ 1150967 554508 -410103 -1041851 -1103490 -912362 -739698 -561631 -369933 -252752 -132895
32019a32895K68108K69046J0327j46112n1167p1480j94782K47258J181805J199361
$$ -132895 135213 404259 414586 268474 217307 145827 -48955 198303 1380108 2579469
32009B579469m20306k052145j684834J49615J169947O25537j22367j23608O2382
$$ 2579469 2159163 107018 -1577816 -1428201 -258254 367283 244916 121308 183690
32000A83690k4261N5428L81353L05489j70648k24322J42744o9558q83995r51256
$$ 183690 159429 214857 596210 901699 731051 506729 649473 579915 -304080 -1255336
31990a255336J54747J003344O07843k3363K16168O47966J98046o50390p93229
$$ -1255336 -1100589 -97245 510598 487235 703403 1351369 1549415 899025 105796
31981A05796l75898k56198l93470j82742K10552J65996j76976j73026J95875M06028
$$ 105796 -270102 -526300 -919770 -1102512 -891960 -725964 -902940 -1075966 -880091 -474063
31971d74063K88907M9338k29788m25286k04228L50420N28213M2950l63234m7267
$$ -474063 -185156 -135818 -365606 -790892 -995120 -644700 -116487 -73537 -436771 -484038
31961d84038N02380N04200P4033k01473k52835l29728l94250l78699m47542m61704
$$ -484038 18342 522542 596575 395102 142267 -187461 -581711 -960410 -1407952 -1869656
31951a869656N0360Q58731R42191Q9006n06052o5159N20951K80013k07466l3767
$$ -1869656 -1819296 -960565 -18374 70632 -435420 -500579 20372 300385 92919 59152
31941E9152L02938q6322o60576l23502N52018O88147M2111k98650p0202k5653
$$ 59152 362090 275768 -384808 -708310 -156292 531855 573966 275316 205114 179461
31931A79461l07677k40121K16565L09278n6958j08485L31622M74720k8767n07333
$$ 179461 -128216 -368337 -151772 157506 100548 -7937 323685 798405 769638 262305
31921B62305m51671k11765j41053k6053K36995K86583K6299p4901J95266L80480
$$ 262305 -189366 -401131 -542184 -568237 -331242 -44659 -18360 -93261 102005 482485
31911D82485J50863j32420n0536K09212K22753k5897k01061p0815K74790M82137
$$ 482485 633348 500928 450392 659604 882357 856460 655399 584584 859374 1341511
31901A341511K13656m15620q14848o20594k00563o9890r6151J58917N36377M12886
$$ 1341511 1555167 1139547 324699 -295895 -496458 -566348 -662499 -503582 32795 445681
31891D45681k89754q57219o59542J58106R21858J042662M33911l71475o35047
$$ 445681 155927 -701292 -1360834 -1202728 -280870 761792 1195703 824228 189181
31882A89181k35381J32066j07345n91940n96558j06010K59966J96768J322q219
$$ 189181 -46200 85866 -21479 -613419 -1209977 -1315987 -1056021 -859253 -857931 -866150
31872h66150J52105L26225L72538J87424j19570k23329l1874J01396r6145l86014
$$ -866150 -714045 -387820 -15282 172142 52572 -170757 -202631 -101235 -197380 -583394
31862e83394m35869l05034j52210J23919N14704O07635J86807k65416k20787J10009
$$ -583394 -1019263 -1324297 -1476507 -1352588 -837884 -230249 -43442 -308858 -529645 -419636
31852d19636K12115J04911J18137J88525P6296r511K54975N58837L12394l43466
$$ -419636 -207521 -102610 15527 204052 280348 270837 525812 1084649 1397043 1053577
31842A053577o48578l72950j23946l15078m66116O1204R86658J271694M00272
$$ 1053577 404999 32049 -91897 -406975 -873091 -811887 174771 1446465 1846737
31833A846737q44847j221985n53084J16566N3406j79091J40494N02490n11r28910
$$ 1846737 1001890 -220095 -773179 -656613 -603207 -782298 -641804 -139314 -139825 -1068735
31823a068735r78602p7973N00479K57340J08532N17143O24881l8607n36364j66641
$$ -1068735 -2047337 -2125310 -1624831 -1367491 -1258959 -741816 -116935 -155542 -691906 -858547
31813h58547K77122l6238n38729m32967j00812j31668q8142M71627Q34908L64282
$$ -858547 -581425 -617663 -1156392 -1589359 -1690171 -1821839 -1909981 -1438354 -603446 -239164
31803b39164j55842J55714O09451J56698o57538o22145M7272K59218K4591J47201
$$ -239164 -395006 -239292 370159 526857 -130681 -752826 -705554 -446336 -421745 -274544
31793b74544M91672K98263k19372k71014n5473k73512n45371n5170O66499M44350
$$ -274544 217128 515391 296019 25005 -30468 -303980 -849351 -904521 -238022 206328
31783B06328m11021n61791N1649K99985L2504J29771N10968J94223o18767o40877
$$ 206328 -204693 -766484 -714835 -414850 -382346 -252575 258393 452616 -166151 -807028
31773h07028J57292M22112j18580k34928L85173N20370k05789n33058R1842N11606
$$ -807028 -649736 -227624 -346204 -581132 -195959 324411 118622 -414436 -322594 189012
31763A89012Q4627j70939L21999N07434k07493o47004j3116N47638L6763n18574
$$ 189012 273639 102700 424699 932133 724640 77636 64520 612158 648921 130347
31753A30347K8178P90817M67503l18959k84223J40883j96728q02314l88013O00432
$$ 130347 158525 949342 1416845 1097886 813663 954546 757818 -44496 -432509 167923
31743A67923O05358k61643l60483N66557Q81441j39594j050539o07870L26953
$$ 167923 773281 511638 151155 717712 1599153 1459559 409020 -198850 128103
31734A28103L69566k10000k02544M51685O46515p1544q37864p94842k19453J08032
$$ 128103 497669 287669 85125 536810 1183325 1111781 273917 -520925 -740378 -632346
31724f32346Q8605K00252M39570J92454o11385j009611l26035O15544N50834k84672
$$ -632346 -543741 -343489 96081 288535 -322850 -1332461 -1658496 -1042952 -492118 -776790
31714g76790m50428M64095J184164P25036j85898l95165m0060k4110m64672o87624
$$ -776790 -1227218 -763123 421041 1146077 960179 565014 524954 500844 36172 -651452
31704f51452m01632K5569K71515L10212J23398k05970k77983J54694O56961O13300
$$ -651452 -1053084 -1027515 -756000 -445788 -322390 -528360 -806343 -651649 5312 618612
31694F18612J12310k24966j68964n6604j11295j74110j53271k04354l24452k22656
$$ 618612 730922 505956 336992 280388 169093 -5017 -158288 -362642 -687094 -909750
31684i09750J80300M66711K31475l07787n19148j50930L57269M72201K42233J03580
$$ -909750 -729450 -262739 -31264 -339051 -858199 -1009129 -651860 -179659 62574 166154
31674A66154J52555M4659l28633n54778l46094k9343j4170j48656n4881K05043
$$ 166154 318709 363368 34735 -520043 -866137 -895480 -909650 -1058306 -1113187 -908144
31664i08144K89041J62224O0199P5976J76637L62647M70783K26113j62357o2792
$$ -908144 -619103 -456879 -396680 -320704 -144067 218580 689363 915476 753119 690327
31654F90327M69624M64137l87913r00662j94185O69088L09559n85889l82791N86558
$$ 690327 1159951 1624088 1236175 335513 141328 810416 1119975 534086 151295 737853
31644G37853M64311q76096j396556j78274J114012R32333P727l24028j99074l00271
$$ 737853 1202164 326068 -1070488 -1248762 -134750 797583 805310 481282 282208 -18063
31634a8063l39676J10033M61542J55567j82134R4187L61712p7240n39543j47940
$$ -18063 -357739 -247706 213836 369403 187269 281456 643168 565928 26385 -121555
31624a21555M63806K18064m25980k73577M11836L44533m49297n87159L22822J015125
$$ -121555 342251 560315 134335 -139242 272594 617127 167830 -419329 -96507 918618
31614I18618O04255j90569l98305j63898j19860l05434l62923k00197M8587K90707
$$ 918618 1522873 1332304 933999 770101 650241 344807 -18116 -218313 -169726 120981
31604A20981L88462J93282j47991k95838j99887p6602O3326L47525N31394J99344
$$ 120981 509443 702725 554734 258896 59009 -17593 45733 393258 924652 1123996
31594A123996m26498n57411J6488M69235O1575p39173q29349L2041Q67901P35377
$$ 1123996 697498 140087 156575 625810 687385 -51788 -881137 -849096 18805 754182
31584G54182r1267n26317q2928N70848N68673o8875o33883o83290l22824K15101
$$ 754182 662915 136598 53670 624518 1193191 1124316 490433 -192857 -515681 -300580
31574c00580O89588O89922L3901o88043o67017l1139K84911o9969m22886k48703
$$ -300580 389008 1078930 1112831 424788 -242229 -273368 11543 -58426 -481312 -730015
31564g30015R1427J66288J77633L29832K92700q1714k31915K07395O14209K94435
$$ -730015 -638588 -472300 -294667 35165 327865 246151 14236 221631 835840 1130275
31554A130275l38464l68996J96417M91081J11116m09100m47587k4813L83696L88104
$$ 1130275 791811 422815 619232 1110313 1221429 812329 364742 339929 723625 1111729
31544A111729J4952l20800k83376r1884j98273m82741l48267K47311N71609K37623
$$ 1111729 1126681 805881 522505 430621 232348 -250393 -598660 -351349 220260 457883
31534D57883j99038j91990p189m1375p8664J24241J99230j57311m82393k74552
$$ 457883 258845 66855 59666 18291 -60373 63868 263098 105787 -376606 -651158
31524f51158J46720K72348L06988N98621P37574J98130n68076p03096k91685j29978
$$ -651158 -504438 -232090 74898 673519 1411093 1609223 1041147 338051 46366 -83612
31514h3612l74236m35229j05126K00629L23767N50086Q14987N88623k04199q44901
$$ -83612 -457848 -893077 -998203 -797574 -473807 76279 891266 1479889 1275690 430789
31504D30789p13893o3055L51841J30115m11122n85617p8158O07926O85558J26680
$$ 430789 -283104 -346159 5682 135797 -275325 -860942 -939100 -331174 354384 481064
31494D81064k79642o8724K98710K79344K2207j38935k80180m31402k28312L42389
$$ 481064 201422 132698 431408 710752 732959 594024 313844 -117558 -345870 -3481
31484c481N67401J05084k90393L019L15611j63981q04858m49560N52784P11977
$$ -3481 563920 669004 378611 381630 697241 533260 -271598 -721158 -168374 543603
31474E43603l14506j193515q42623K79166J070824J030095L38693m94206q40986
$$ 543603 229097 -964418 -1807041 -1527875 -457051 573044 911737 417531 -423455
31465d23455m44680J78212L42447J03381l1433n6219l32738o78009n00825J59958
$$ -423455 -868135 -689923 -347476 -244095 -275528 -331747 -664485 -1342494 -1843319 -1683361
31455a683361N90692M62557J77068R8871J52082K23551L11562K62095m0703k90038
$$ -1683361 -1092669 -630112 -453044 -354173 -202091 21460 333022 595117 554414 264376
31445B64376j56158Q8362j8458l08856k89738k9271L8022l5493J20315L75355
$$ 264376 108218 196580 178122 -130734 -420472 -449743 -411721 -447214 -326899 48456
31435D8456L03784K3883j7084J00152j4454k22340j37793L3119r6856j76132L00230
$$ 48456 352240 376123 359039 459191 444737 222397 84604 117723 20867 -155265 144965
31424A44965Q17935N13235k41377l18292K31957K47827m85336q28469k53493K96864
$$ 144965 962900 1476135 1234758 916466 1148423 1396250 910914 82445 -171048 125816
31414A25816M4772m57900m39711o9754J25015Q4860n1246k27530j60228M02587
$$ 125816 170588 -287312 -727023 -796777 -671762 -586902 -638148 -865678 -1025906 -623319
31404f23319R18668N32893n08453j011713n82481l2416J51191L94823P69084N72971
$$ -623319 295349 828242 319789 -691924 -1274405 -1306821 -1155630 -760807 8277 581248
31394E81248k62523p21025l05822J73518P4982r5514J15907K25547o8713j32988
$$ 581248 318725 -402300 -708122 -534604 -459622 -555136 -439229 -213682 -282395 -415383
31384d15383L67156O64908K12867l48155m08228l77248n62191l50207M56857Q11698
$$ -415383 -48227 616681 829548 481393 73165 -304083 -866274 -1216481 -759624 52074
31374E2074J09773n78990k67669K49652n9878m91552P5568R51334O84989m27985
$$ 52074 161847 -417143 -684812 -435160 -495038 -986590 -911022 40312 725301 297316
31364B97316q81847m62172k16184k84207J88577J057848J104634J59855n09393
$$ 297316 -584531 -1046703 -1262887 -1547094 -1358517 -300669 803965 963820 454427
31355D54427k81097J7988j79580k58926J89379M85677J18462k93472q6895L50722
$$ 454427 173330 191318 11738 -247188 -57809 427868 546330 252858 165963 516685
31345E16685L41468J2704r2446O3891J06572j25416m80933p22367o20951j57814
$$ 516685 858153 870857 778411 842302 948874 823458 342525 -379842 -1000793 -1158607
31335a158607K91187L66517K78054M36662O45317L46426l61318p38230n22980
$$ -1158607 -867420 -500903 -222849 213813 859130 1205556 844238 106008 -416972
31326d16972k56169l08430l42135k6956L62957M15031J68453l0530P4402M84439
$$ -416972 -673141 -981571 -1323706 -1350662 -987705 -572674 -404221 -434751 -360349 124090
31316A24090Q47646O21889k29407r08815p30881j44420o7087m45941m21655J92236
$$ 124090 971736 1593625 1364218 455403 -275478 -419898 -486985 -932926 -1354581 -1162345
31306a162345O53707N66314L40427K23072m7834l64568j49203M68386M94276l47954
$$ -1162345 -508638 57676 398103 621175 573341 208773 59570 527956 1022232 674278
31296F74278r53851m74884L64483M54783l6676j93753R1467J62503j52276l31433
$$ 674278 -279573 -754457 -389974 64809 28133 -165620 -74153 88350 -63926 -395359
31286c95359r4809K39911L34200K13152R8488K04241N39398O83816J39961q08237
$$ -395359 -490168 -250257 83943 297095 395583 599824 1139222 1823038 1962999 1154762
31276A154762j135645m27563L99256L53095k14965k56773L37407O92119L44573
$$ 1154762 19117 -408446 -9190 343905 128940 -127833 209574 901693 1246266
31267A246266k30187m94910m49370k61370R768J83146L3952k67416l00636o3954
$$ 1246266 1016079 521169 71799 -189571 -179803 3343 37295 -230121 -530757 -594711
31257e94711Q422k20562l63239j53567J59617K53344J73733J65380L57926P01145
$$ -594711 -586289 -806851 -1170090 -1323657 -1164040 -910696 -736963 -571583 -213657 487488
31247D87488R27544O30865k13754q91709o73270J08887L88282j06195m47208K466
$$ 487488 1415032 2045897 1832143 940434 267164 376051 764333 658138 210930 213396
31237B13396N25661J85123o11606o68524J40495O41821J37839n61268l99406L47908
$$ 213396 739057 924180 312574 -355950 -215455 426366 564205 2937 -396469 -48561
31227d8561N44579q6361n87226k04536N45408O70084O4297n09627n72904l98483
$$ -48561 496018 409657 -177569 -382105 163303 833387 897684 388057 -184847 -583330
31217e83330l00865j21176K73811N05358J89272l78282n59570k35448J63777L64558
$$ -583330 -884195 -1005371 -731560 -226202 -36930 -415212 -974782 -1210230 -1046453 -681895
31207f81895M46672L84881J3936m44922m45556M3015L35119K6287l58484k14509
$$ -681895 -235223 149658 163594 -281328 -726884 -683869 -348750 -322463 -680947 -895456
31197h95456J41900J3465m64013m77842J49696O34300M11706o1137n6767M02328
$$ -895456 -753556 -740091 -1204104 -1681946 -1532250 -897950 -486244 -547381 -604148 -201820
31187b01820P13289N26220J607n02473o54985l22115J56495J52223m17436p67232
$$ -201820 511469 1037689 1039296 536823 -118162 -440277 -283782 -131559 -548995 -1316227
31177a316227k51428O20243Q32462L26499M501K80701N26591K16199k50046l62487
$$ -1316227 -1567655 -947412 -114950 211549 216050 496751 1023342 1239541 989495 627008
31167F27008l64798n99444o38704K3862Q37613P83781n5190n60753k65177Q7067
$$ 627008 262210 -337234 -975938 -952076 -114463 669318 614128 53375 -211802 -124735
31157a24735n9247j79036K25410N56349N7783p98955q93807j32135M73908L72983
$$ -124735 -183982 -363018 -137608 418741 476524 -322431 -1216238 -1348373 -874465 -501482
31147e01482J62195M60483R01657P40617l0487o94876p26081k89897R8550J41615
$$ -501482 -339287 121196 1022853 1763470 1732983 1038107 312026 22129 120679 262294
31137B62294m1553j49104o3574N7053N6338m257j3931j2781l9174J7158J60399
$$ 262294 220741 71637 8063 65116 121454 117197 103266 90485 51311 68469 228868
31126B28868J24330k00651m30960k25490Q8857k113k96188j62041L60012N55481
$$ 228868 353198 152547 -278413 -503903 -415046 -417159 -713347 -875388 -515376 40105
31116D0105K00296j09176Q384J83172R9651J9802J04230J7601l05290l01544K36688
$$ 40105 240401 131225 139609 322781 422432 442234 546464 564065 258775 -42769 193919
31105A93919O06420K82615k01727j96302J6810o3452j86265m1401j11536p06982
$$ 193919 800339 1082954 881227 684925 701735 638283 452018 410617 299081 -407901
31095d07901r51951r2394R06963O73859k43727k16657O51985O74067m24696r13431
$$ -407901 -1359852 -1452246 -545283 128576 -115151 -331808 320177 994244 569548 -343883
31085c43883P778Q64921M53932k60308p0510L79381k4940p83668p51494j42884
$$ -343883 -336105 528816 982748 722440 651930 1031311 1006371 222703 -528791 -671675
31075f71675P8254j8083K22963M89643N2319o22591m47546L86196O60069J40984
$$ -671675 -593421 -611504 -388541 101102 153421 -469170 -916716 -530520 129549 270533
31065B70533j75308J55932M44254K22953j06124k36328m13568o53266n37483q7817
$$ 270533 95225 251157 695411 918364 812240 575912 162344 -490922 -1028405 -1116222
31055a116222Q2295k27957m58312j74086M06216Q85894J020736O07780k10095
$$ -1116222 -1033927 -1261884 -1720196 -1894282 -1488066 -602172 418564 1026344 816249
31046H16249o49087j56451N72790M35194l80463o81556j83369J79138m6224k03401
$$ 816249 167162 10711 583501 1018695 638232 -43324 -226693 -47555 -93779 -297180
31036b97180P4946K09234q1802j53427L10060N78623J37551l83094l01053M4824
$$ -297180 -222234 -13000 -94802 -248229 61831 640454 778005 394911 93858 138682
31026A38682Q3303o566J18011K05219J1628q8687J64485L23588Q4558o1722K14462
$$ 138682 221985 215419 333430 538649 550277 461590 626075 949663 1034221 972499 1186961
31015A186961L15489k16247o81732k94431M33706M77382p8943l27880n7570J16583
$$ 1186961 1502450 1286203 604471 310040 743746 1221128 1142185 814305 756735 873318
31005H73318q3317k84779k18915j5045J44642J03282k53528n96683l07216M43427
$$ 873318 790001 505222 286307 271262 415904 519186 265658 -331025 -638241 -194814
30995a94814N45744l65772r95801k25457J011145J068454R5941m20310j50414
$$ -194814 350930 -14842 -1010643 -1236100 -224955 843499 939440 519130 368716
30986C68716j37464o46954o84063O1763N40034J73649j73287J98453O07091K72691
$$ 368716 231252 -415702 -1099765 -1038002 -497968 -324319 -497606 -299153 307938 580629
30976E80629l18318l26158L9270L8988k94692l34871M2305L39626K23260j25166
$$ 580629 262311 -63847 -24577 14411 -280281 -615152 -572847 -233221 -9961 -135127
30966a35127k88541L2103O64167Q65471R9358j003198j196197l19141M62308M39354
$$ -135127 -423668 -391565 272602 1138073 1237431 234233 -961964 -1281105 -818797 -379443
30956c79443K81069N51251N14635m71079j377772q26316N88325R54569r1819q35277
$$ -379443 -98374 452877 967512 496433 -881339 -1707655 -1119330 -164761 -256580 -1091857
30946a091857j42785R03964Q32302k2724l00577J92308L94819j62995o78482m36266
$$ -1091857 -1234642 -330678 501624 478900 178323 370631 765450 602455 -76027 -512293
30936e12293J50902L28720J10642j719O8212J4546j45751r8504J03137O5149j95859
$$ -512293 -361391 -32671 77971 76252 144464 159010 13259 -85245 17892 83041 -112818
30925a12818j93206J56067K89307k3379j58145L32427P82717L15504p10510j076728
$$ -112818 -306024 -149957 139350 115971 -42174 290253 1072970 1388474 677964 -398764
30915c98764m01771M29075N90180K45728n1640j60630k13487k24217j71756j05896
$$ -398764 -800535 -371460 218720 464448 412808 252178 38691 -185526 -357282 -463178
30905d63178J6968K55860M02726K30485L595J47150M18023J68743m70272n80971
$$ -463178 -446210 -190350 212376 442861 446456 593606 1011629 1180372 710100 129129
30895A29129P8542N55965J62528m62570m46126k0540R3797l5919J11879L96853
$$ 129129 207671 763636 926164 463594 17468 -3072 90725 54806 166685 563538
30885E63538K71447j51144k77200q1844k3175o2835K31422O55086M69168l43756
$$ 563538 834985 683841 406641 324797 301622 238787 470209 1125295 1594463 1250707
30875A250707q80130o09381k8258K36836J93768O3627j50318l36927k05753J27901
$$ 1250707 370577 -238804 -267062 -30226 163542 227169 76851 -260076 -465829 -337928
30865c37928J37856k33809l82639m4727K51548J20831p9042n4762j51739n07442
$$ -337928 -200072 -433881 -816520 -861247 -609699 -488868 -567910 -622672 -774411 -1281853
30855a281853m83296K43974Q06706L67385m23152l36252N23261R56130N54273
$$ -1281853 -1765149 -1521175 -714469 -347084 -770236 -1106488 -583227 372903 927176
30846I27176N5854j14664l39159o83981n71050N8979M17941J83920N4257M17280
$$ 927176 983030 868366 529207 -154774 -725824 -666845 -248904 -64984 -10727 406553
30836D06553N55585o5612p05977m90645J67663L26281L9783J4244K29024R4430
$$ 406553 962138 896526 190549 -300096 -132433 193848 233631 247875 476899 571329
30826E71329l05430l26419j3978p1298n29042n74760P9550P01051P27073N00532
$$ 571329 265899 -60520 -74498 -145796 -674838 -1249598 -1170048 -468997 258076 758608
30816G58608M22428K68248j52160m54566l67416k65295m37327m73247j4536M73316
$$ 758608 1181036 1449284 1297124 842558 475142 209847 -227480 -700727 -715263 -241947
30806b41947L84626n9606k48282j55923j29066p6143K89382O46852L95406k93668
$$ -241947 142679 83073 -165209 -321132 -450198 -526341 -236959 409893 805299 511631
30796E11631n88394k09085K25924J89581j04794k29657j23812O3108K13745J73220
$$ 511631 -76763 -285848 -59924 129657 24863 -204794 -328606 -265498 -51753 121467
30786A21467j08979k95233l4473L46821J80208m16223n26415J64555P77926N43777
$$ 121467 12488 -282745 -317218 29603 209811 -206412 -732827 -568272 209654 753431
30776G53431n9739j54155J76762K00807k16349n45800n12498k54029K13626Q22696
$$ 753431 693692 539537 716299 917106 700757 154957 -357541 -611570 -397944 424752
30766D24752R42890O6581j029401r47599K96524J078776M55903n33224o03001
$$ 424752 1367642 1434223 404822 -542777 -246253 832523 1288426 755202 152201
30757A52201j18646j30671m28378m1202P94833Q00205k06265q56658l04075N79703
$$ 152201 33555 -97116 -525494 -566696 228137 1028342 822077 -34581 -338656 241047
30747B41047O73796J44385k37661l66556n21016n50897k44270L7931p6500k56796
$$ 241047 914843 1059228 821567 455011 -66005 -616902 -861172 -823241 -899741 -1156537
30737a156537r2923R2578r6003k05786L14722R10804O33577k45388n74421j27092
$$ -1156537 -1249460 -1156882 -1252885 -1458671 -1143949 -233145 400432 155044 -419377 -546469
30727e46469K26066J31383J55893M05867J89701n05079o19230K06752P95306K72410
$$ -546469 -320403 -189020 -33127 372740 562441 57362 -561868 -355116 440190 712600
30717G12600m63499k48063M07846K59518n15259o23258J96460Q02900M82100j27473
$$ 712600 249101 1038 408884 668402 153143 -470115 -273655 529245 1011345 883872
30707H83872k39256k3919l9502k72432k82802M8375L34922J88399k47949l59531
$$ 883872 644616 620697 581195 308763 25961 74336 409258 597657 349708 -9823
30697i823J73284P54259N08094l84192p19555o174O66943J92190q69187j127328
$$ -9823 163461 917720 1425814 1041622 322067 315893 982836 1175026 305839 -821489
30687h21489l63412L84899M23665K9865l39684m64729j24619N95001R27802L45037
$$ -821489 -1184901 -800002 -376337 -346472 -686156 -1150885 -1275504 -680503 247299 592336
30677E92336l95006k45702L63715J76298o37565o05163M67689R44328O5129o62349
$$ 592336 197330 -48372 315343 491641 -145924 -751087 -283398 660930 726059 63710
30667F3710N4136J065855O30727p48667j177162l24378L44111K0649n05560m55664
$$ 63710 117846 1183701 1814428 1065761 -111401 -435779 -91668 -71019 -576579 -1032243
30657a032243r5927J52612L83318N63207K75556m20147p46864l21845K25016K28265
$$ -1032243 -1128170 -975558 -592240 -29033 246523 -173624 -920488 -1242333 -1017317 -789052
30647g89052o9163o5936K46421M25062K75281o7300m22743n23132m9446Q11444
$$ -789052 -858215 -924151 -677730 -252668 22613 -44687 -467430 -990562 -1040008 -228564
30637b28564J190414N17308n34580p70140j02261K98253k76499r50136n03546
$$ -228564 961850 1479158 944578 174438 72177 370430 93931 -856205 -1359751
30628a359751P37280J198585K58086q19411o38215M06283Q21882J92523m42480
$$ -1359751 -622471 576114 834200 14789 -623426 -217143 604739 797262 354782
30619C54782l61394j38590m01997o47111j49556O27746O04371k22601p03231j97796
$$ 354782 -6612 -145202 -547199 -1194310 -1343866 -716120 -111749 -334350 -1037581 -1235377
30609a235377O03892P84485L60284p0176k64057m01015n27874m31785j7154M62976
$$ -1235377 -631485 153000 513284 443108 179051 -221964 -749838 -1181623 -1198777 -735801
30599g35801N78471J20257n47628o42159J79645J151713J099371o1083j084764
$$ -735801 -157330 -37073 -584701 -1226860 -1047215 104498 1203869 1142786 58022
30590E8022r54354j00765M10584L62034L08488L85249J48015m11557o41743k97364
$$ 58022 -896332 -997097 -586513 -224479 84009 469258 617273 205716 -436027 -733391
30580g33391M529j53128k29090L10519Q97810O20553l00529p78607m72994r9285
$$ -733391 -728862 -881990 -1111080 -800561 97249 717802 417273 -361334 -834328 -933613
30570i33613m2462K18798Q74164J055960J86812p71597n25038N59860Q80744r0135
$$ -933613 -976075 -757277 116887 1172847 1359659 588062 63024 622884 1503628 1413493
30560A413493j126944j096354l62271J55413L46923N56891N88243N1191o41509
$$ 1413493 286549 -809805 -1172076 -1016663 -669740 -112849 475394 526585 -114924
30551a14924o25217R3226N39771J88813k87901p8404N56872P01977J00376n61576
$$ -114924 -740141 -646915 -107144 81669 -206232 -284636 272236 974213 1074589 513013
30541E13013o45512k88784L7498K64219O14603R42107O96495k63073j181067j135996
$$ 513013 -132499 -421283 -383785 -119566 495037 1437144 2133639 1870566 689499 -446497
30531d46497j77001O66708O05923l1577l73315j52913J17743J6250k37140k43266
$$ -446497 -623498 43210 649133 617556 244241 91328 209071 225321 -11819 -255085
30521b55085m6735L3982k7937J8450J85226J82081l3089p7982K10492L51995r2406
$$ -255085 -301820 -267838 -295775 -277325 -92099 89982 56893 -21089 189403 541398 448992
30510D48992o72598n19042L61149R28914M79025m25030p65301l42634K46868N31928
$$ 448992 -223606 -742648 -381499 547415 1026440 601410 -163891 -506525 -259657 272271
30500B72271M90747K01185k17879m15290j36039K82840K82340o7481j62839J50527
$$ 272271 763018 964203 746324 331034 194995 477835 760175 692694 529855 680382
30490F80382L30023M1779l22390l40494j97335k08242j97658J22546N01645M44193
$$ 680382 1010405 1052184 729794 389300 191965 -16277 -213935 -91389 410256 854449
30480H54449k1350l73437l13604k3570K34240L66472L09988K2588l25827m36922
$$ 854449 833099 459662 146058 122488 356728 723200 1033188 1055776 729949 293027
30470B93027k21228J30431L66444K64954l31821j191533j509589o27945R17488
$$ 293027 71799 202230 568674 833628 501807 -689726 -2199315 -2827260 -1909772
30461a909772J643145Q17713n07936p39314K38657R92015N18878m80184p20214
$$ -1909772 -266627 551086 43150 -696164 -457507 534508 1053386 573202 -147012
30452a47012r1145M25384K99214N3512K32161N35399L84940j61161n45894m85491
$$ -147012 -238157 187227 486441 539953 772114 1307513 1692453 1531292 985398 499907
30442D99907j86173L1775j0217l06968o00287n34269j23246J89834J94324K54637
$$ 499907 313734 345509 335292 28324 -571963 -1106232 -1229478 -1039644 -845320 -590683
30432e90683O06030P40713J19849p90160r42017j14265P80294Q56090J72987n69486
$$ -590683 15347 756060 875909 85749 -856268 -970533 -190239 665851 838838 269352
30422B69352p72565l32804K86784M16606k2027l04162M6799M08453K2908o12574
$$ 269352 -503213 -836017 -549233 -132627 -154654 -458816 -412017 -3564 19344 -593230
30412e93230m18436M35638P01151R3792k85526Q9414K86711l31199q77085m25028
$$ -593230 -1011666 -576028 125123 218915 -66611 22803 309514 -21685 -898770 -1323798
30402a323798M65402P93117O36253M82433N5878q48636j267289l62754Q51112
$$ -1323798 -858396 -65279 570974 1053407 1109285 260649 -1006640 -1369394 -518282
30393e18282P56271l36137o65464J58365O74236P4669o24032m58427K5257j3004
$$ -518282 237989 -98148 -763612 -605247 68989 143658 -480374 -938801 -913544 -926548
30383i26548l16647k55143M4525J54201J77737L67855N27766M24546K39134J19445
$$ -926548 -1243195 -1498338 -1453813 -1299612 -1121875 -754020 -226254 198292 437426 556871
30373E56871r9475l33284j61890K69944J61696n73408q35865j6279Q39627N70647
$$ 556871 457396 124112 -37778 232166 393862 -179546 -1015411 -1031690 -192063 378584
30363C78584k69801l79128J84283L12521j29261j73436L75270M82632l30343j068321
$$ 378584 108783 -270345 -86062 226459 97198 -76238 299032 781664 451321 -617000
30353f17000p40054K60790R13441Q96501M92918j31799q08376j020917m52530
$$ -617000 -1357054 -1096264 -182823 713678 1206596 1074797 266421 -754496 -1207026
30344a207026L80679O64952K98885j26821j91143j9K05591L30848L21515J38384
$$ -1207026 -826347 -161395 137490 10669 -180474 -180493 25098 355946 677461 815845
30334H15845j24024l11484l76914l28842j45282R6736J96719J34228J60453L44772
$$ 815845 691821 380337 3423 -325419 -470701 -373965 -177246 -43018 117435 462207
30324D62207L29260j06868n36805m29186K4884K07060M7381K9686K46169K09442
$$ 462207 791467 684599 147794 -281392 -256508 -49448 -2067 27619 273788 483230
30314D83230k18883m74451k26817L3615j34203l01835P0707N60428L59244l38089
$$ 483230 264347 -210104 -436921 -403306 -537509 -839344 -768637 -208209 151035 -187054
30304a87054n16571P3268N12087J96496k06975R5870O72684N39934k07907m69698
$$ -187054 -703625 -630357 -118270 78226 -128749 -32879 639805 1179739 971832 502134
30294E02134J45865O62712K18854n85357n90963J11187K79574n31776j158944
$$ 502134 647999 1310711 1529565 944208 353245 464432 744006 212230 -946714
30285i46714n30358O15746P11341l10648q80749j35426Q18171O32324k79430n15297
$$ -946714 -1477072 -861326 -149985 -460633 -1341382 -1476808 -658637 -26313 -305743 -821040
30275h21040J52123O29149L30821r0707l2579J61545M1496j33607k0159R9224
$$ -821040 -668917 -39768 291053 200346 167767 329312 370808 237201 217042 316266
30265C16266j06581l19314j54569N7176j45026l81314N2588Q85576J049487K42670
$$ 316266 209685 -109629 -264198 -207022 -352048 -733362 -680774 204802 1254289 1496959
30255A496959n69365n25655J059J30201k28752m25219j24218L16921M86537L94078
$$ 1496959 927594 401939 402998 533199 304447 -120772 -244990 71931 558468 952546
30245I52546J87318j59000o02032p91591m52488J28232L84393K11825K3146K8936
$$ 952546 1139864 980864 378832 -412759 -865247 -737015 -352622 -140797 -117651 -88715
30235h8715l3033k56758k26221K47733N64503J62968m73653m55721J15308L43569
$$ -88715 -121748 -378506 -604727 -356994 207509 370477 -103176 -558897 -443589 -100020
30225a00020N8252L3505M99951O06393j06761p63784m70565K86482M66082J2977
$$ -100020 -41768 -8263 491688 1098081 991320 227536 -243029 43453 509535 522512
30215E22512l80695m81917m74037j91427N04380R43200M11147n20327o37687M8006
$$ 522512 141817 -340100 -814137 -1005564 -501184 442016 853163 332836 -304851 -256845
30205b56845L63101n7954k66465K11707N01480k6294n44735j37197N94490M52491
$$ -256845 106256 48302 -218163 -6456 495024 468730 -76005 -213202 381288 833779
30195H33779m25045p46514L5496J039100J212440N10907l28296o62594m46480
$$ 833779 408734 -337780 -302284 736816 1949256 2460163 2131867 1469273 1022793
30186A022793j53320k38205n65775n79441j71926M6593l15106p04292l86951M32366
$$ 1022793 869473 631268 65493 -513948 -685874 -639281 -954387 -1658679 -2045630 -1613264
30176a613264R05479P15298K80288n4600l09560l99170j13052L23742L36127j62712
$$ -1613264 -707785 7513 287801 233201 -76359 -475529 -588581 -264839 71288 -91424
30166i1424n85674n09933j52010J77077M81279O67797L73608l40262o90120j68446
$$ -91424 -677098 -1187031 -1339041 -1161964 -680685 -12888 360720 20458 -669662 -838108
30156h38108N83413N83899r1774m73102j39989K79131J63437k71740n06500m82757
$$ -838108 -254695 329204 237430 -235672 -375661 -96530 66907 -204833 -711333 -1194090
30146a194090m01824j93475K77309P07081O05733K9284l82573j92061L35162O31387
$$ -1194090 -1595914 -1789389 -1512080 -804999 -199266 -169982 -552555 -744616 -409454 221933
30136B21933M76098R9144j71081j89521m0232M1906j29033m25410m25175R1568
$$ 221933 698031 797175 626094 436573 396341 438247 309214 -116196 -541371 -449803
30126d49803O90249O35244j48504p74543m36472M31065O14401j96525q96262n40360
$$ -449803 240446 875690 727186 -47357 -483829 -52764 561637 365112 -531150 -1071510
30116a071510K54953K78882l88846n60127J14975O34976L66722L7031L43446O90616
$$ -1071510 -816557 -537675 -926521 -1486648 -1371673 -736697 -369975 -332944 10502 701118
30106G01118K94378l53500l24220J08769J4954m47970l11822L52221M19369l22144
$$ 701118 995496 641996 317776 426545 441499 -6471 -318293 33928 453297 131153
30096A31153p28588k25125K91349R8065j78196J29818M90527K71650l264L23442
$$ 131153 -597435 -822560 -531211 -433146 -611342 -481524 9003 280653 277389 600831
30086F00831O66196J55113p05088p34080j3835K74660k24023o28177l88774m0331
$$ 600831 1267027 1422140 717052 -17028 -30863 243797 19774 -608403 -997177 -1037508
30076a037508j13263l09246j52173K69387N56772M96185J20208l16043m09541
$$ -1037508 -1150771 -1460017 -1612190 -1342803 -786031 -289846 -169638 -485681 -895222
30067h95222o1390K73317K06020o256j5353n9702l57102l45388M46185J201835
$$ -895222 -956612 -683295 -477275 -483531 -498884 -558586 -915688 -1261076 -814891 386944
30057C86944P72441m06944p81324m9997M59737M4653l53057K8426M52507J22156
$$ 386944 1159385 752441 -28883 -78880 380857 425510 72453 100879 553386 675542
30047F75542l60492j15964M28590K89785m49543r12494p86925l84465J56841P29022
$$ 675542 315050 199086 627676 917461 467918 -444576 -1231501 -1615966 -1459125 -730103
30037g30103Q06542J86568k78367J96082Q80419M73788p68496j259250m42713
$$ -730103 76439 263007 -15360 180722 1061141 1534929 766433 -492817 -935530
30028i35530N05515O31000M35228N53613N16018j99623q95206o44702Q9113J28199
$$ -935530 -430015 200985 636213 1189826 1705844 1506221 611015 -33687 55426 183625
30018A83625m56342m28512N09877J083322M23033n19413m50115K69875L16578
$$ 183625 -272717 -701229 -191352 891970 1315003 795590 345475 615350 931928
30009I31928m07601o77270j0121N80509L17306j28300P9713N11092L45356j53423
$$ 931928 524327 -152943 -163064 417445 734751 606451 686164 1197256 1542612 1389189
29999A389189k38417j41724n74312j141081p60678L97498R40638M31743j467K87094
$$ 1389189 1150772 1009048 434736 -706345 -1467023 -1069525 -128887 302856 301389 588483
29989E88483L67452m64837j215466p36477L42789O12509M7229k58621j7154O3814
$$ 588483 955935 491098 -724368 -1460845 -1118056 -505547 -458318 -716939 -734093 -670279
29979f70279j93009j50820L23019N32283K05060k8660K32168N08095L37131p272
$$ -670279 -863288 -1014108 -691089 -158806 46254 17594 249762 757857 1094988 1087716
29969A087716j52752k48250m53576m61060p9651K43604O9924k92576k88404o630
$$ 1087716 934964 686714 233138 -227922 -307573 -63969 5955 -286621 -575025 -581655
29959e81655N7582r7464M967M47110O91182L70427j85208m40324l01840j6273
$$ -581655 -524073 -621537 -616570 -169460 521722 892149 706941 266617 -35223 -51496
29949e1496K71577N04477M48831j10219q80935j161083o14768K86144P92228O54765
$$ -51496 220081 724558 1173389 1063170 182235 -978848 -1593616 -1307472 -515244 139521
29939A39521J81240k54409m50517l05324R6770L87679K86872L7899P4286K90424
$$ 139521 320761 66352 -384165 -689489 -592719 -205040 81832 119731 194017 484441
29929D84441J63818l39274n97437l11964k5156k21234m66825j00164N92117O83132
$$ 484441 648259 308985 -288452 -600416 -625572 -846806 -1313631 -1413795 -821678 -138546
29919a38546J1402n06595j79153M81084N12533j42621n90393k35507M20203M84519
$$ -138546 -127144 -633739 -812892 -331808 180725 38104 -552289 -787796 -367593 116926
29909A16926j10207n44986k66401K92837M37040K30328K41388M87962L61738l14605
$$ 116926 6719 -538267 -804668 -511831 -74791 155537 396925 884887 1246625 932020
29899I32020q59566o85985j29899J04862p6477k12291m5567K34629L83873L55692
$$ 932020 72454 -613531 -743430 -638568 -715045 -927336 -972903 -738274 -354401 1291
29889A291K13630M2442r2392k10641l27621k91179J5794L02410J32323l47539
$$ 1291 214921 257363 164971 -45670 -373291 -664470 -648676 -346266 -213943 -561482
29879e61482m75552p4705K30561M3071j31723J96101N28133J24363o89156q71019
$$ -561482 -1037034 -1111739 -881178 -838107 -969830 -773729 -245596 -121233 -810389 -1681408
29869a681408j74320N53217O07357K04288j18278k06940j56523L243J90655J94758
$$ -1681408 -1855728 -1302511 -695154 -490866 -609144 -816084 -972607 -969364 -778709 -583951
29859e83951m1789k90374l20074j21825J89789M80931N93427M57219K08756J4278
$$ -583951 -625740 -916114 -1236188 -1358013 -1168224 -687293 -93866 363353 572109 586387
29849E86387j48759l25517l46062o5772K61454K09560k38968o44960o36755k28948
$$ 586387 437628 112111 -233951 -299723 -38269 171291 -67677 -712637 -1349392 -1578340
29839a578340L25503P25727P24644L37619o8104j45201N598J2925k19010l98706
$$ -1578340 -1252837 -527110 197534 535153 467049 321848 327446 340371 121361 -277345
29829b77345k62541J13986M19055L85396K0568l49405l62911r365L91705N70660
$$ -277345 -539886 -425900 -6845 378551 399119 49714 -313197 -322562 69143 639803
29819F39803M50415L1712m61163m69630K18987P58259J11069j256797j661966
$$ 639803 1090218 1121930 660767 191137 410124 1168383 1279452 22655 -1639311
29810a639311n75796N29271M30630o7039K24615O99635J15308r36428p54997N83268
$$ -1639311 -2215107 -1685836 -1255206 -1322245 -1097630 -397995 -282687 -1219115 -1974112 -1390844
29800a390844J163766K44759o57204k88696N12723M49056k31684m97393k32533
$$ -1390844 -227078 17681 -639523 -928219 -415496 33560 -198124 -695517 -928050
29791i28050k5001o14Q1581J11433q7436j96555Q5151L80819K22096r1575M7911
$$ -928050 -953051 -953665 -872084 -760651 -848087 -1044642 -959491 -578672 -356576 -448151 -400240
29780d00240N43071P32447L50871k32858n84733n58808k54706L1279L1188r2246
$$ -400240 142831 875278 1226149 993291 408558 -150250 -404956 -373677 -342489 -434735
29770d34735P5052M46907M35063l5313k42250J39142L64055j51835o97369l37870
$$ -434735 -359683 87224 522287 486974 244724 383866 747921 596086 -101283 -439153
29760d39153M63928M76171l43492p59504j67927N66427N16312j9017j71956K01980
$$ -439153 24775 500946 157454 -602050 -769977 -203550 312762 293745 121789 323769
29750C23769M94497K68824k84445o90249o64357k86376J16410K56972J31452r330
$$ 323769 818266 1087090 802645 112396 -551961 -838337 -721927 -464955 -333503 -342833
29740c42833Q5478M08589O08867K68908m98572q79730k67349P04813P45851k88395
$$ -342833 -257355 151234 760101 1029009 530437 -349293 -616642 88171 834022 545627
29730E45627j021973m77577N02723N85783n6119k30906K64907M80022M9554k74756
$$ 545627 -476346 -953923 -451200 134583 78464 -152442 112465 592487 642041 367285
29720C67285p3070L7934l61771o77307l75833O9119O8837p1510J19501K79710
$$ 367285 294215 332149 -29622 -706929 -1082762 -1013643 -944806 -1016316 -896815 -617105
29710f17105p5698m42198n1681O83161O76386l1809k66175L64967Q15812L11893
$$ -617105 -692803 -1135001 -1186682 -503521 172865 141056 -125119 239848 1055660 1367553
29700A367553m34768m42743K9502J03104k45277l30723j0854J97960J08912O2075
$$ 1367553 932785 490042 519544 622648 377371 46648 35794 233754 342666 404741
29690D04741J36663K644l29422l69508M5615M67966N55258M38734K01879k90287
$$ 404741 541404 544048 214626 -154882 -109267 358699 913957 1352691 1554570 1264283
29680A264283p81006o30977J31530N43733P6503m69535j94961M40853L74431l18252
$$ 1264283 483277 -147700 -16170 527563 604066 134531 -60430 380423 754854 436602
29670D36602n69353m1906M30273K30600k26198l50723j96986n8660M3015Q0944
$$ 436602 -132751 -174657 255616 486216 260018 -90705 -287691 -346351 -303336 -222392
29660b22392j57280n73861o19227n2457O04870P50944M35771O9569j85154l44734
$$ -222392 -379672 -953533 -1572760 -1625217 -1020347 -269403 166368 235937 50783 -293951
29650b93951k91576M6881M35506N68629L85500j6665m83581o80141k92160M34673
$$ -293951 -585527 -538646 -103140 465489 850989 834324 350743 -329398 -621558 -186885
29640a86885Q16876O36807L90259L33983k1229r02594j445859p78493M71664Q05892
$$ -186885 629991 1266798 1657057 1991040 1969811 1067217 -378642 -1157135 -685471 120421
29630A20421o6577q11124l73889O14405Q81915K90600j95904k9953K45636j4233
$$ 120421 53844 -757280 -1131169 -516764 365151 655751 459847 429894 675530 661297
29620F61297n21333m89379J56292N99027K71234l51247m85447j87909j47998m94312
$$ 661297 139964 -349415 -193123 405904 677138 325891 -159556 -347465 -495463 -989775
29610i89775n71929o4298M04971K20006k64771k95015J59232N10585N38936N54818
$$ -989775 -1561704 -1626002 -1221031 -1001025 -1265796 -1560811 -1401579 -890994 -352058 202760
29600B02760O33600M03760k21735o94082n49977r2318L8935k44884m18056j16728
$$ 202760 836360 1240120 1018385 324303 -225674 -317992 -279057 -523941 -941997 -1058725
$$ [...]
##END NTUPLES=NMR SPECTRUM
##END=
