##TITLE=31Pdec_LY-11Dix.3.B
 CD3CN, 24 sc
 3.06.2021
##JCAMPDX= 6.0         $$ Bruker NMR JCAMP-DX V2.0
##DATA TYPE= NMR SPECTRUM
##DATA CLASS= NTUPLES
##ORIGIN= UXNMR, Bruker Analytische Messtechnik GmbH
##OWNER= root
$$ XWIN-NMR		Version 3.5
$$ Thu Jun  3 11:07:08 2021 Russian Standard Time (UT+4h)  she@DPX200
##.OBSERVE FREQUENCY= 81.013821
##.OBSERVE NUCLEUS= ^31P
##.ACQUISITION MODE= SIMULTANEOUS
##.ACQUISITION SCHEME= undefined
##.AVERAGES= 24
##.DIGITISER RES= 16
##SPECTROMETER/DATA SYSTEM= spect
##.PULSE SEQUENCE= zgpg30
##.SOLVENT NAME= CD3CN
##.SHIFT REFERENCE= (INTERNAL, CD3CN, 0, 248.564)
##AUDIT TRAIL= $$ (NUMBER, WHEN, WHO, WHERE, WHAT)
$$ ##TITLE= Audit trail, XWIN-NMR		Version 3.5
$$ ##JCAMPDX= 5.01
$$ ##ORIGIN= Bruker BioSpin GmbH
$$ ##OWNER= she
$$ F:/spectra/data/she/nmr/P31/1/pdata/1/auditp.txt
$$ ##AUDIT TRAIL=  $$ (NUMBER, WHEN, WHO, WHERE, WHAT)
(   1,<2021-06-03 11:06:09.42 +0400>,<she>,<DPX200>,
      <created by zg, POWCHK disabled, PULCHK disabled
       configuration hash MD5:
       00 E9 B6 7A A2 85 ED C7 34 08 36 98 17 FE 4E 26
       data hash MD5: 32K
       5F D3 07 2B F4 8F C9 62 AB BD A2 6F 6E 7C 0A D5>)
(   2,<2021-06-03 11:06:11.71 +0400>,<she>,<DPX200>,
      <Start of raw data processing
       efp BC_mod = 2 LB = 1 FT_mod = 6 PKNL = 1 PHC0 = -5963.25 PHC1 = 247.0723 SI = 64K 
       data hash MD5: 64K
       AF 72 84 E5 C3 E6 39 ED 32 B9 46 9B 99 C5 EC F0>)
(   3,<2021-06-03 11:06:28.54 +0400>,<she>,<DPX200>,
      <pk PHC0 = 10.77667 PHC1 = 0 
       data hash MD5: 64K
       D9 99 03 4A 60 7F A7 AB 82 AD 1D 4B 6A 1D 71 39>)
(   4,<2021-06-03 11:06:34.04 +0400>,<she>,<DPX200>,
      <abs ABSG = 5 
       data hash MD5: 64K
       F4 86 ED 52 37 F7 5D BD CC 6A 7F 87 2A 2C B8 1D>)
$$ ##END=
$$ 
$$ hash MD5
$$ 94 B7 69 1A 19 93 2F CA 2B ED 44 1B 9E 7B DA 4F
##$RELAX= 
##$RELAX= 
##$RELAX= 
##$RELAX= 
##$RELAX= 
##$RELAX= 
##$RELAX= 
##$RELAX= 
$$ Bruker specific parameters
$$ --------------------------
##$DU= <F:/spectra>
##$EXPNO= 1
##$NAME= <P31>
##$PROCNO= 1
##$TYPE= <nmr>
##$USER= <she>
##$AMP= (0..31)
100 100 100 100 100 100 100 100 100 100 100 100 100 100 100 100 100 100 
100 100 100 100 100 100 100 100 100 100 100 100 100 100 
##$AQSEQ= 0
##$AQ_mod= 1
##$AUNM= <au_zg>
##$AUTOPOS= <>
##$BF1= 81.014009
##$BF2= 200.13
##$BF3= 200.13
##$BF4= 200.13
##$BF5= 200.13
##$BF6= 200.13
##$BF7= 200.13
##$BF8= 200.13
##$BYTORDA= 1
##$CFDGTYP= 0
##$CFRGTYP= 5
##$CHEMSTR= <none>
##$CNST= (0..31)
1 1 145 1 1 1 1 1 1 1 1 1 1 1 1 1 1 1 1 1 1 1 1 1 1 1 1 1 1 1 1 1 
##$CPDPRG= <waltz16>
##$CPDPRG1= <>
##$CPDPRG2= <waltz16>
##$CPDPRG3= <>
##$CPDPRG4= <mlev>
##$CPDPRG5= <mlev>
##$CPDPRG6= <mlev>
##$CPDPRG7= <mlev>
##$CPDPRG8= <mlev>
##$CPDPRGB= <>
##$CPDPRGT= <>
##$D= (0..31)
0 1 0 0 0 0 0 0 0 0 0 0.03 2e-05 3e-06 0 0 0 0 0 0 0 0 0 0 0 0 0 0 0 0 
0 0 
##$DATE= 1622703968
##$DBL= (0..7)
120 120 120 11 120 120 24 19 
##$DBP= (0..7)
150 150 150 150 150 150 150 150 
##$DBP07= 0
##$DBPNAM0= <>
##$DBPNAM1= <>
##$DBPNAM2= <>
$$ [...]
##$SUBNAM3= <"">
##$SUBNAM4= <"">
##$SUBNAM5= <"">
##$SUBNAM6= <"">
##$SUBNAM7= <"">
##$SUBNAM8= <"">
##$SUBNAM9= <"">
##$SW= 501.771253377433
##$SWIBOX= (0..15)
0 1 3 0 0 0 0 0 0 0 0 0 0 0 0 0 
##$SW_h= 40650.406504065
##$TD= 32768
##$TD0= 1
##$TE= 0
##$TE2= 300
##$TE3= 300
##$TEG= 300
##$TL= (0..7)
0 120 53 12 22 120 120 120 
##$TP= (0..7)
150 150 150 150 150 150 150 150 
##$TP07= 0
##$TPNAME0= <>
##$TPNAME1= <>
##$TPNAME2= <>
##$TPNAME3= <>
##$TPNAME4= <>
##$TPNAME5= <>
##$TPNAME6= <>
##$TPNAME7= <>
##$TPOAL= (0..7)
0.5 0.5 0.5 0.5 0.5 0.5 0.5 0.5 
##$TPOFFS= (0..7)
0 0 0 0 0 0 0 0 
##$TUNHIN= 0
##$TUNHOUT= 0
##$TUNXOUT= 0
##$USERA1= <user>
##$USERA2= <user>
##$USERA3= <user>
##$USERA4= <user>
##$USERA5= <user>
##$V9= 5
##$VALIST= <valist>
##$VCLIST= <CCCCCCCCCCCCCCC>
##$VD= 0
##$VDLIST= <DDDDDDDDDDDDDDD>
##$VPLIST= <PPPPPPPPPPPPPPP>
##$VTLIST= <TTTTTTTTTTTTTTT>
##$WBST= 1024
##$WBSW= 4
##$XGAIN= (0..3)
0 0 0 0 
##$XL= 0
##$YL= 0
##$YMAX_a= 6167
##$YMIN_a= -7579
##$ZGOPTNS= <>
##$ZL1= 120
##$ZL2= 120
##$ZL3= 120
##$ZL4= 120
##$ABSF1= 248.5645
##$ABSF2= -253.2056
##$ABSG= 5
##$ABSL= 3
##$ALPHA= 0
##$AQORDER= 0
##$ASSFAC= 0
##$ASSFACI= 0
##$ASSFACX= 0
##$ASSWID= 0
##$AUNMP= <proc_1d>
##$AZFE= 0.1
##$AZFW= 0.5
##$BCFW= 0
##$BC_mod= 2
##$BYTORDP= 0
##$COROFFS= 0
##$CY= -3
##$DATMOD= 1
##$DC= 0
##$DFILT= <>
##$DTYPP= 0
##$F1P= 0
##$F2P= 0
##$FCOR= 1
##$FTSIZE= 65536
##$FT_mod= 6
##$GAMMA= 0
##$GB= 0
##$INTBC= 1
##$INTSCL= 5.30512e-09
##$ISEN= 30
##$LB= 1
##$LEV0= 0
##$LPBIN= 0
##$MAXI= 10000
##$MC2= 0
##$MEAN= 0
##$ME_mod= 0
##$MI= 50
##$NCOEF= 0
##$NC_proc= -4
##$NLEV= 6
##$NOISF1= 182.463
##$NOISF2= 159.3651
##$NSP= 0
##$NTH_PI= 0
##$NZP= 0
##$OFFSET= 248.5645
##$PC= 4
##$PHC0= -5952.473
##$PHC1= 247.0723
##$PH_mod= 1
##$PKNL= yes
##$PPARMOD= 0
##$PSCAL= 0
##$PSIGN= 0
##$REVERSE= no
##$SF= 81.014009
##$SI= 65536
##$SIGF1= 159.3651
##$SIGF2= -187.1042
##$SINO= 113.3802
##$SIOLD= 16384
##$SREGLST= <1H.CDCl3>
##$SSB= 0
##$STSI= 65536
##$STSR= 0
##$SW_p= 40650.406504065
##$SYMM= 0
##$S_DEV= 0
##$TDeff= 32768
##$TDoff= 0
##$TI= <>
##$TILT= no
##$TM1= 0
##$TM2= 0
##$TOPLEV= 0
##$USERP1= <user>
##$USERP2= <user>
##$USERP3= <user>
##$USERP4= <user>
##$USERP5= <user>
##$WDW= 1
##$XDIM= 65536
##$YMAX_p= 330223201
##$YMIN_p= -50756754
$$ End of Bruker specific parameters
$$ ---------------------------------
##NTUPLES= NMR SPECTRUM
##VAR_NAME=  FREQUENCY,     SPECTRUM/REAL,   SPECTRUM/IMAG
##SYMBOL=    X,             R,               I
##VAR_TYPE=  INDEPENDENT,   DEPENDENT,       DEPENDENT
##VAR_FORM=  AFFN,          ASDF,            ASDF
##VAR_DIM=   65536,         65536,           65536
##UNITS=     HZ,            ARBITRARY UNITS, ARBITRARY UNITS
##FACTOR=    0.620285442955139, 1,           1
##FIRST=     20137.2065510759, 0,            0
##LAST=      -20513.1999529892, 0,           0
##MIN=       -20513.1999529892, -50756754,   0
##MAX=       20137.2065510759, 330223201,    0
$$ Real data points
##PAGE= N=1
##DATA TABLE= (X++(R..R)), XYDATA
$$ [...]
35460D76192k30591j38039K22631K36603m02512q99505m16579M90250O11209q323
$$ 476192 245601 107562 330193 566796 164284 -735221 -1151800 -661550 -50341 -58664
35450e8664k01889K91661L76697m49710j090998n77653L40014L92906k11618k36456
$$ -58664 -260553 31108 407805 -41905 -1132903 -1710556 -1370542 -977636 -1189254 -1425710
35440a425710N32762R69673M19399l00999j91596M46188N37939j58060p72586
$$ -1425710 -892948 76725 496124 195125 3529 449717 987656 829596 57010
35431E7010o33731j22738P1463l8321j5521J17869J3267j62352J24507P03802
$$ 57010 -576721 -699459 -627996 -666317 -681838 -563969 -550702 -713054 -588547 115255
35421A15255P00340n8057n51062r1077N20657K38360n45376o89104j95909r5921
$$ 115255 815595 757538 206476 115399 636056 874416 329040 -360064 -555973 -651894
35411f51894n80950o49623J43956Q72324P05163J19139p7051l1144k83424n83055
$$ -651894 -1232844 -1882467 -1738511 -866187 -161024 -41885 -118936 -150080 -433504 -1016559
35401a016559k81113M31495O64340J59947l47459k32888K30843M11381J28340
$$ -1016559 -1297672 -866177 -201837 -41890 -389349 -622237 -391394 19987 148327
35392A48327l35788o44703n78611j33237L03143K14492k95210l92221L77189J195245
$$ 148327 -187461 -832164 -1410775 -1544012 -1240869 -1026377 -1321587 -1713808 -1336619 -141374
35382a41374Q96046l46406j120213p13741k331O2242j32273J79427N97849K37955
$$ -141374 754672 408266 -711947 -1425688 -1428019 -1365777 -1498050 -1318623 -720774 -482819
35372d82819n32482m91107M06088Q82627M26466K1908L22841N60108M8988n44529
$$ -482819 -1015301 -1506408 -1100320 -217693 208773 230681 553522 1113630 1162618 618089
35362F18089m50987j60459l89089o69666k45226M26680L93883j75365l98784j93926
$$ 618089 167102 6643 -382446 -1052112 -1297338 -870658 -476775 -652140 -1050924 -1244850
35352a244850j07585r6310K17492M85327J71589k19396J36379P54193M49608o08779
$$ -1244850 -1352435 -1448745 -1231253 -745926 -574337 -793733 -657354 96839 546447 -62332
35342f2332j033520l88896L26230M56607M12031M19975Q2916m97001n71256o5998
$$ -62332 -1095852 -1484748 -1158518 -701911 -289880 130095 213011 -283990 -855246 -921244
35332i21244K73175K82765N14472Q00188L13982o46531p33668J27418M01830l86021
$$ -921244 -648069 -365304 149168 949356 1263338 616807 -116861 10557 412387 26366
35322B6366o93240K97649J044772K33691q74616n26658O19612P33680j73104n94140
$$ 26366 -666874 -369225 675547 909238 34622 -492036 127576 861256 688152 94012
35312I4012j39881K50209K54991M06721O17820K48265m40472n13485l4930j8865
$$ 94012 -45869 204340 459331 866052 1483872 1732137 1291665 778180 743250 724385
35302G24385o64918j050009o94439j36772J99218N01346P68252O48935K80910
$$ 724385 59467 -990542 -1684981 -1821753 -1622535 -1121189 -352937 295998 576908
35293E76908K57405N78304N91767J25426k50689k25176j30736k15195l42027m62579
$$ 576908 834313 1412617 2004384 2129810 1879121 1653945 1523209 1308014 965987 503408
35283E03408o02125m48076J97950P17655M11824k35815j74366M58057N18774j66991
$$ 503408 -98717 -546793 -348843 368812 780636 544821 370455 828512 1347286 1180295
35273A180295m90716j2340K85738j95703n37390J03020R31869P01464l43398q72430
$$ 1180295 689579 677239 962977 767274 229884 332904 1264773 1966237 1622839 750409
35263G50409l88546L07528M08630R439l11743k45171L4218J41857n6654k36978
$$ 750409 361863 669391 1078021 1087460 775717 530546 564764 706621 649967 412989
35253D12989m3046L29042L48382m7975l46992k37707L973M7170p1226k23544m10788
$$ 412989 369943 698985 1047367 999392 652400 414693 418666 465836 394610 171066 -239722
35242b39722n16691k94866J97870N44657M90708J71693k07823n06044m91235q2828
$$ -239722 -756413 -1051279 -853409 -308752 181956 353649 145826 -360218 -851453 -934281
35232i34281K82150J19226k84535j94742M10031P53613M36377p9250l15578l29203
$$ -934281 -652131 -532905 -817440 -1012182 -602151 151462 587839 508589 193011 -136192
35222a36192k14341J33487M89690L42370k13690m04916N6989N22967M76803K34967
$$ -136192 -350533 -217046 272644 615014 401324 -3592 53397 576364 1053167 1288134
35212A288134J60057K8464k97181l89686n1550J79455m8922k23259J06767M40275
$$ 1288134 1448191 1476655 1179474 789788 738238 917693 868771 645512 752279 1192554
35202A192554J46356m49326o19340l66767j98725j88533l9056K34082L56656K74850
$$ 1192554 1338910 889584 270244 -96523 -295248 -483781 -522837 -288755 67901 342751
35192C42751Q1163j98006l63885j09060L15155J91284m66063o66727J1292O18369
$$ 342751 423914 225908 -137977 -247037 68118 259402 -206661 -873388 -862096 -243727
35182b43727L70344o0808J52423M42914m1829o72070k94398O62825P75842l2583
$$ -243727 126617 65809 218232 661146 619317 -52753 -347151 315674 1091516 1058933
35172A058933m83061j30514J70077K5892J5250K25036l6971o95675p01310J22519
$$ 1058933 575872 445358 615435 641327 656577 881613 844642 148967 -552343 -429824
35162d29824N91469J42859k43146J16443L74020k15304q05011l52452N87585P73828
$$ -429824 161645 304504 61358 177801 551821 336517 -468494 -820946 -233361 540467
35152E40467J62925l51977m11742k37585J81254P91104R07966J24898o54898k75381
$$ 540467 703392 351415 -60327 -297912 -116658 674446 1582412 1707310 1052412 777031
35142G77031R05872J462460Q75740o0904o48492r45499j040926p57263k31444
$$ 777031 1682903 3145363 4021103 3960199 3311707 2366208 1325282 568019 336575
35133C36575R2741J72046K96272L26193j38151p98585q01328k1453O48116N49561
$$ 336575 429316 601362 897634 1223827 1085676 287091 -514237 -535690 112426 661987
35123F61987M9310j97835r0779J02046J84716L8187l24554n71892m10881j26427
$$ 661987 711297 513462 422683 524729 709445 747632 423078 -148814 -559695 -686122
35113f86122j62918k62298J56434P88723O60919k46542p19968j23748N88740L75188
$$ -686122 -849040 -1111338 -954904 -166181 494738 248196 -471772 -595520 -6780 368408
35103C68408l38151m91681l9113K40575Q7003o2086L4847J89847K83889L26350
$$ 368408 30257 -461424 -500537 -259962 -172959 -235045 -200198 -10351 273538 599888
35093E99888K01428q2810j76772L6383O3472l65684n99870m1329O68588N04102
$$ 599888 801316 718506 541734 578117 641589 275905 -323965 -365294 303294 807396
35083H07396k44556l68727K67578M90893k12921q24262m36740L49199M51514j12579
$$ 807396 562840 194113 461691 952584 739663 -84599 -521339 -172140 279374 166795
35073A66795m97892l08406J49918M82862M49195m0202o27605o20653P4782N94563
$$ 166795 -331097 -639503 -489585 -6723 442472 402270 -225335 -845988 -771206 -176643
35063a76643K77837l11502k63621K30428K40209l54948p06910l88233N1834J27057
$$ -176643 101194 -210308 -473929 -243501 -3292 -358240 -1065150 -1453383 -1401549 -1274492
35053a274492J01657K65646L26312M6291j69411N3732L22377J19367k06795O9167
$$ -1274492 -1172835 -907189 -580877 -534586 -703997 -650265 -327888 -208521 -415316 -346149
35043c46149P46310Q05588m2600p91884n57459J52079K59725k62725m71161J0316
$$ -346149 400161 1205749 1163149 371265 -186194 -34115 225610 -37115 -508276 -497960
35033d97960M56071K50332j98721k32346L0903R9740N9295K99444N56078J58314
$$ -497960 -41889 208443 9722 -222624 -191721 -91981 -32686 266758 822836 981150
35023I81150p26692j018936k35653O90589O42130j91676o91346l41697K73363
$$ 981150 254458 -764478 -1000131 -309542 332588 140912 -550434 -892131 -618768
35014f18768M14820N8236k76882k10995J23889K75086J6667l00235j50647L68007
$$ -618768 -203948 -145712 -422594 -633589 -509700 -234614 -217947 -518182 -668829 -300822
35004c00822N27321j7895o32095n45159M5439K97083l8159l52123j79138J75426
$$ -300822 226499 208604 -423491 -968650 -923211 -626128 -664287 -1016410 -1195548 -1020122
34994a020122K30551O2870Q8294L83064N78547L66031j27626m97195m88429k15322
$$ -1020122 -789571 -726701 -638407 -255343 323204 689235 561609 64414 -424015 -639337
34984f39337M5862J94323L06814L56482J95344j19681k90050k12375j23060j07323
$$ -639337 -593475 -399152 -92338 264144 459488 339807 49757 -162618 -285678 -393001
34974c93001J26933O43389Q77623L77295l84706n78074j90303N4396j63614m44439
$$ -393001 -266068 377321 1254944 1632239 1247533 669459 479156 533552 369938 -74501
34964g4501m94654m85804m50664j02292M61021N96914O8133m78831m40855r6593
$$ -74501 -569155 -1054959 -1505623 -1607915 -1146894 -549980 -481847 -960678 -1401533 -1498126
34954a498126m236p9101J10802N07396O61572M41725R0888k24318m14938k46315
$$ -1498126 -1502362 -1581463 -1470661 -963265 -301693 140032 230920 6602 -408336 -654651
34944f54651L29516P94475N96718m8196m40534l67681k02963j31438L9760K78973
$$ -654651 -325135 469340 1066058 1017862 577328 209647 6684 -124754 -84994 193979
34934A93979K45989m3866j37192O8500J12003j84276l42987j00695N0427k45629
$$ 193979 439968 396102 258910 327410 439413 255137 -87850 -188545 -138118 -383747
34924c83747m30288Q1772P47739N87544k41912o07426j23361L37419J04071l11500
$$ -383747 -814035 -732263 15476 603020 361108 -246318 -369679 -32260 71811 -239689
34914b39689j93396K50883M06289K47905Q7899j51674n92940p34783p0030Q40947
$$ -239689 -433085 -182202 224087 471992 559891 408217 -184723 -919506 -989536 -148589
34904a48589R01360O7984n69226m26208j28131k43690l46940L2366M13709J84191
$$ -148589 752771 820755 251529 -174679 -302810 -546500 -893440 -861074 -447365 -263174
34894b63174k43064p6146M65192M56841j94247n63674j52335M14998M15930o744
$$ -263174 -506238 -582384 -117192 339649 145402 -418272 -570607 -155609 260321 253577
34884B53577k86361k41665m2329J81948L23724K41300K3120j8568J40504J18587
$$ 253577 -32784 -274449 -316778 -134830 188894 430194 453314 434746 575250 693837
34874F93837k00286l12929J67063P72436O98470j14188q81075r06518k58483M49153
$$ 693837 493551 180622 347685 1120121 1818591 1704403 823328 -83190 -341673 107480
34864A07480O51524K44718l48155n53076k54015Q4955N6388j64001j88295m9768
$$ 107480 759004 1003722 655567 102491 -151524 -66569 -10181 -174182 -362477 -412245
34854d12245n2615j65660o5894K59128M58451M14036L83427M12950J37984n34228
$$ -412245 -464860 -630520 -696414 -437286 21165 435201 818628 1231578 1369562 835334
34844H35334j006914p16260J8755L73082J06683k24918j45108J57809K72287J65457
$$ 835334 -171580 -887840 -869085 -496003 -389320 -614238 -759346 -601537 -329250 -163793
34834a63793N5209k5425j78825l09770k10681M5109J32384l7555j54952K2621
$$ -163793 -108584 -134009 -312834 -622604 -833285 -788176 -655792 -693347 -848299 -825678
34824h25678K97559L36473J50446n345q9758k83947n29963m41576J12858O16748
$$ -825678 -528119 -191646 -41200 -46545 -136303 -420250 -950213 -1391789 -1278931 -662183
34814f62183M51470k50380o81336l75498K03796L36792K4048j22348J56506M31643
$$ -662183 -210713 -461093 -1142429 -1517927 -1314131 -977339 -953291 -1075639 -919133 -487490
34804d87490L28301R3332R6084J75146l1430l70186l65863k7503J43301j8667
$$ -487490 -159189 -65857 30227 205373 173943 -196243 -562106 -589609 -446308 -464975
34794d64975j12380P9538K12238K9308j65909p4735O3076k6520o6136K70027O27842
$$ -464975 -577355 -497817 -285579 -256271 -422180 -496915 -433839 -460359 -526495 -256468 371374
34783C71374M38182j00495k46067J22764L11506p5347n06284l49140J77699L30166
$$ 371374 809556 709061 462994 585758 897264 821917 315633 -33507 144192 474358
34773D74358j38845o97103p36374k79667J19540R7954p4492O5992M21888M31985
$$ 474358 335513 -361590 -1097964 -1377631 -1258091 -1160137 -1234629 -1168637 -746749 -314764
34763c14764k632k45828Q3759M23910J57747l23704k74835P3420j09715o99644
$$ -314764 -317396 -563224 -479465 -55555 102192 -221512 -496347 -422927 -532642 -1232286
34753a232286o52628K34457Q34453M33496j91602j59583J16042r5130l57085J65071
$$ -1232286 -1884914 -1650457 -816004 -382508 -574110 -733693 -617651 -712781 -1069866 -904795
34743i04795J014151R29504j42033q90173o19183r6479o0569j06179K62457N09343
$$ -904795 109356 1038860 896827 6654 -612529 -709008 -769577 -875756 -613299 -103956
34733a03956k2374p76720o77912J77808O35337K46330j57824Q2237M23743J33192
$$ -103956 -126330 -903050 -1580962 -1403154 -767817 -521487 -679311 -597074 -173331 -40139
34723d0139m37333m25623J19694L35756l0550k31643K14537O84605L92585l95390
$$ -40139 -477472 -903095 -783401 -447645 -478195 -709838 -495301 189304 581889 186499
34713A86499p41286l32024K50404M52241L40362K11547J20833l530j13831j25928
$$ 186499 -554787 -886811 -636407 -184166 156196 367743 488576 485046 371215 245287
34703B45287o8774k9545p1459k26239m19070m24797r0437M09252P15177O54454
$$ 245287 176513 146968 75509 -150730 -569800 -994597 -1085034 -675782 39395 693849
34693F93849L18801j16576m47249m58339j65063R4151R3163P1591K95694M86009
$$ 693849 1012650 896074 448825 -9514 -174577 -80426 12737 84328 380022 866031
34683H66031K02053l34158m23371P2685M81082K49177l84796q06252o64190j1986
$$ 866031 1068084 733926 310555 383240 864322 1113499 728703 -77549 -741739 -753725
34673g53725P08271P79480r7636j128363j118617l7488Q41875O58502L2697o2356
$$ -753725 -45454 734026 636390 -491973 -1610590 -1648078 -806203 -147701 -115004 -177360
34663a77360K69178K67619j84292n04238l71626l9838J71803J59412n1679k57924
$$ -177360 91818 359437 175145 -329093 -700719 -740557 -568754 -409342 -461021 -718945
34653g18945j57206J68102J94559k14625l92584J51909Q04217O43094j68563o34068
$$ -718945 -876151 -708049 -513490 -728115 -1120699 -968790 -164573 478521 309958 -324110
34643c24110l79806K643L9798l2132J14578L84894N39215M52891L9534n54396
$$ -324110 -703916 -701273 -661475 -693607 -579029 -194135 345080 797971 837505 283109
34633B83109p28271p3268P69095O92273l00934r56191m92479L75973O14879K75310
$$ 283109 -445162 -518430 250665 942938 642004 -314187 -806666 -430693 184186 459496
34623D59496M5089L2493j45996m25358l31291J16144L15278P023l33342k24244
$$ 459496 504585 537078 391082 -34276 -365567 -249423 65855 72878 -260464 -484708
34613d84708J85052M43320L97690K13851O0844J2118P4471J23442k8504l44281
$$ -484708 -299656 143664 541354 755205 816049 828167 902638 1026080 997576 653295
34603F53295n29689m43324k90845j91156J16735P10903R43192J70600j033286
$$ 653295 123606 -319718 -610563 -801719 -684984 25919 969111 1139711 106425
34594A06425j272364k18640P57714M54817m45171m71707L82584P59418J34512
$$ 106425 -1165939 -1384579 -626865 -172048 -617219 -1088926 -706342 53076 187588
34585A87588m44397j32200M46548L77720r5931k01133R139q0066m49771m91792
$$ 187588 -256809 -389009 57539 435259 339328 138195 147334 67268 -382503 -874295
34575h74295o8873L24209L98670L25006J69792j99363n74715m49723K01263P13116
$$ -874295 -943168 -618959 -220289 104717 274509 75146 -499569 -949292 -748029 -34913
34565c4913N38017j06856n81756n31153j24335J94130J40377q2255j643M02044
$$ -34913 503104 396248 -185508 -716661 -840996 -646866 -506489 -588744 -590387 -188343
34555a88343M84512j57498q64409o33896M39553J166286Q19728K954l45478j98692
$$ -188343 296169 138671 -725738 -1359634 -920081 246205 1065933 1068887 723409 524717
34545E24717j78692m47281n18886j33599K62770J60823k40619l12368N1220K43955
$$ 524717 346025 -101256 -620142 -753741 -490971 -330148 -570767 -883135 -831915 -587960
34535e87960r2007l88583N5486R00112J114485M68075j47063r4392J45693n4514
$$ -587960 -679967 -1068550 -1013064 -112952 1001533 1469608 1322545 1228153 1373846 1319332
34525A319332m23997m00651j58185k09836m31126l29884J1447J05910l6948p312
$$ 1319332 895335 494684 336499 126663 -304463 -634347 -622900 -516990 -553938 -561250
34515e61250J58257N3001k67717l44702j48849m0118N1169M96729R92624P07016
$$ -561250 -402993 -349992 -617709 -962411 -1111260 -1151378 -1100209 -603480 389144 1096160
34505A096160l49795j043109o27358K35612M68280l0811n00532l73306K34585
$$ 1096160 746365 -296744 -924102 -688490 -220210 -251021 -751553 -1124859 -890274
34496h90274P85447P74472J84823l78852l37160P5640J40034k53983m85017k47245
$$ -890274 -104827 669645 854468 475616 138456 214096 354130 100147 -384870 -632115
34486f32115K9177L2932Q1876L83881M79814l4779p37613q78615l29641L83145
$$ -632115 -602938 -570006 -488130 -104249 375565 340786 -396827 -1275442 -1605083 -1221938
34476a221938P23223N12949m7815m76425m04376m3746O8466j40396k04318Q7611
$$ -1221938 -498715 14234 -33581 -510006 -914382 -958128 -889662 -1030058 -1234376 -1146765
34466a146765L86686M22304L48871K67368J9724l25693m26945l18380m00341n67763
$$ -1146765 -760079 -337775 11096 278464 298188 -27505 -454450 -772830 -1173171 -1740934
34456a740934k02399O32378R43849K85153m66115m82353k05537l39988n18584
$$ -1740934 -1943333 -1310955 -367106 -81953 -548068 -1030421 -1235958 -1575946 -2094530
34447b094530o4501O17395O39554J60405O6107M00122L68266j65562m17139m9473
$$ -2094530 -2159031 -1541636 -902082 -741677 -675570 -275448 92818 -72744 -489883 -539356
34437e39356L11147K18040Q8091L20765N29492J76701n52685r85804p67717j36807
$$ -539356 -228209 -10169 77922 398687 928179 1104880 552195 -433609 -1201326 -1338133
34427a338133L82406M16930P9425j19000J01204L86056K93782P580M150K11033
$$ -1338133 -955727 -538797 -459372 -578372 -477168 -91112 202670 210250 214400 425433
34417D25433J42462k03137l01797l1952P2034k83467o35283m71969L8287L70554
$$ 425433 567895 364758 62961 31009 103043 -180424 -815707 -1287676 -1249389 -878835
34407h78835L11614R320l08934l97076q4702M18227N88419K25893k21274k27195
$$ -878835 -567221 -557901 -866835 -1263911 -1348613 -930386 -341967 -116074 -337348 -564543
34397e64543J43633M20419L91201K53239J79843Q0794j25938k66113j48557N8684
$$ -564543 -420910 -491 390710 643949 823792 904586 778648 512535 363978 422662
34387D22662j5992l49333m06145R7862N99926L69447l47006n46377O3846N82061
$$ 422662 406670 57337 -348808 -250946 348980 718427 371421 -174956 -111110 470951
34377D70951K53463m43882o43483l79383k46229k57312J9629M41794L91103j20090
$$ 470951 724414 280532 -362951 -742334 -988563 -1245875 -1226246 -784452 -393349 -513439
34367e13439l47838L5747M78877M56766J66009M1579J33622K38057K28555P3047
$$ -513439 -861277 -825530 -346653 110113 276122 317701 451323 689380 917935 990982
34357I90982j41361j71288K5402K4245m48934q34371m19155M29744O48608J12864
$$ 990982 849621 678333 703735 727980 279046 -555325 -974480 -544736 103872 216736
34347B16736j74904K51587O13943L05541j15629n8524J3677m49764r07208n87196
$$ 216736 41832 293419 907362 1212903 1097274 1038750 1052427 602663 -304545 -891741
34337h91741J35909L54645R7617K1673O2185l18434p73378l63586P33808J170435
$$ -891741 -755832 -401187 -303570 -281897 -219712 -538146 -1311524 -1675110 -941302 229133
34327B29133M00238n22355n95644j85005m1813n1463J77928L10196j21414o60880
$$ 229133 629371 107016 -488628 -673633 -715446 -766909 -588981 -278785 -400199 -1061079
34317a061079n02908J89865N17786K46168L7112K56465M37829J66075k37852k75975
$$ -1061079 -1563987 -1374122 -856336 -610168 -573056 -316591 121238 287313 49461 -226514
34307b26514J422J93949J28021n4252j32550M6234M11839N64248J48561n66906
$$ -226514 -225092 -31143 96878 42626 -89924 -43690 368149 932397 1080958 514052
34297E14052q80912n67617j45054l4022J6691K99925M94886K35291q3084J78723
$$ 514052 -366860 -934477 -1079531 -1113553 -1096862 -796937 -302051 -66760 -149844 28879
34287B8879P73858P81459r932p17304o17728j08088K0806k46315k76078J67164
$$ 28879 802737 1584196 1574264 856960 239232 131144 151950 -94365 -370443 -203279
34277b03279N64713L61391l19714q16514o58178o9750K86747R1003k64228k57449
$$ -203279 361434 722825 403111 -413403 -1071581 -1141331 -854584 -763581 -1027809 -1285258
34267a285258O708L4764j72035p9599M13180O44874K11196k89397j25166M08993
$$ -1285258 -1278550 -1243786 -1415821 -1495420 -1082240 -437366 -226170 -515567 -640733 -231740
34257b31740M46021r5277m29067j49037K52989K84887J29512Q7426q903l36895
$$ -231740 214281 119004 -310063 -459100 -206111 78776 208288 295714 286811 -50084
34247e0084n42460k51531K03138K01472j89294l16133P847K35765L9645j30693
$$ -50084 -592544 -844075 -640937 -439465 -628759 -944892 -937045 -701280 -661635 -792328
34237g92328J60700N23767L16034k91425n01802n4575M61768N23866K73814L2789
$$ -792328 -631628 -107861 208173 -83252 -585054 -639629 -177861 346005 619819 652608
34227F52608j68505k88795j16609J88578J5074o89694r53640j11273R36993Q30631
$$ 652608 484103 195308 78699 267277 282351 -407343 -1360983 -1472256 -535263 295368
34217B95368k17582p14236j53024L56198K1380m18572j06375M66175L82426j57762
$$ 295368 77786 -636450 -789474 -433276 -411896 -830468 -936843 -470668 -88242 -246004
34207b46004k96863O5405L73132M93756O42985N70319o4782o92094l72224O39876
$$ -246004 -542867 -477462 -104330 389426 1032411 1602730 1537948 845854 473630 1113506
34197A113506J003314J73274q59553j048934n65762j35776M6457J58177J78335
$$ 1113506 2116820 2290094 1430541 381607 -184155 -319931 -273474 -115297 63038
34188F3038R4308J63515M06285L15864l41968q87222n64813K90983O61993K62033
$$ 63038 157346 320861 727146 1043010 701042 -186180 -750993 -460010 201983 464016
34178D64016j89274j30986J12115J9996k72898k73715J7675P6730l10525o17306
$$ 464016 274742 143756 255871 275867 2969 -270746 -253071 -176341 -486866 -1104172
34168a104172k57907N27609Q81908M36049k21242l86286j43927l0405j30000j01751
$$ -1104172 -1362079 -834470 47438 483487 262245 -124041 -267968 -298373 -428373 -530124
34158e30124N3733l9006l38327k76112K95432O94935L75776k32200l73157m5132
$$ -530124 -476391 -515397 -853724 -1129836 -834404 -139469 236307 4107 -369050 -414182
34148d14182J77921J21452J25306K72520J84449k79451o63728n19200M572M35780
$$ -414182 -236261 -114809 10497 283017 467466 188015 -475713 -994913 -990341 -554561
34138e54561N87086O10240O10103M95537J98728j60622l91847m27013l50263k67416
$$ -554561 32525 642765 1252868 1748405 1947133 1786511 1394664 967651 617388 349972
34128C49972j88856o0342J04819J79580N8031j79157k94593j29013K01133L84073
$$ 349972 161116 100774 205593 385173 443204 264047 -30546 -159559 41574 425647
34118D25647K35453p4776j96679j9873J88380J31562j52805m05200m94295m50086
$$ 425647 661100 586324 389645 369772 558152 689714 536909 131709 -362586 -812672
34108h12672k44561J53753M93448L64223k15225o27101l68742K45286M59695R7425
$$ -812672 -1057233 -903480 -410032 -45809 -261034 -888135 -1256877 -1011591 -551896 -454471
34098d54471k18036J7165M50813M10746p2286k90757Q6642N23132M20266m3457
$$ -454471 -672507 -655342 -204529 206217 133931 -156826 -70184 452948 873214 829757
34088H29757l07558l05484l54977l90190m6665M83055M90095j13612m94382j73318
$$ 829757 522199 216715 -138262 -528452 -575117 -92062 398033 284421 -209961 -383279
34078c83279J68822j66679o49205l59584M01954N01304j82713n03282J60301R59098
$$ -383279 -214457 -381136 -1030341 -1389925 -987971 -486667 -669380 -1172662 -1012361 -53263
34068e3263R03956K28745k19765k54257k63948l29900j94552J04929K35720J29079
$$ -53263 850693 1079438 859673 605416 341468 11568 -182984 -78055 157665 286744
34058B86744K6584O136j03577l33831m54508k86497P6937L53299K73605j53005
$$ 286744 313328 319464 215887 -117944 -572452 -858949 -782012 -428713 -155108 -308113
34048c08113m80186k05119N16708Q91517N08654n2774p3307K37233J54807l23168
$$ -308113 -788299 -993418 -476710 414807 923461 870687 797380 1034613 1189420 866252
34038H66252m53637K4406M38979K38664j83776j86938J03065O4171m04512p52596
$$ 866252 412615 437021 876000 1114664 930888 743950 847015 911186 506674 -245922
34028b45922o20968k71942o6917L1462J99978L46729L01550K05707L20108N15421
$$ -245922 -866890 -1138832 -1205749 -1174287 -974309 -627580 -326030 -120323 199785 715206
34018G15206L66366j73688n82698m48895q698K61195K84847K57571J43187k00285
$$ 715206 1081572 907884 325186 -123709 -132407 128788 413635 671206 814393 614108
34008F14108n31379m28145J3634K46960J30210J27385M45867N90605J69352l93145
$$ 614108 82729 -345416 -331782 -84822 45388 172773 618640 1209245 1378597 985452
33998I85452m71086j58839J4472j7163Q4694K71729J07527l91086n85103j30123
$$ 985452 514366 355527 369999 352836 437530 709259 816786 425700 -159403 -289526
33988b89526M53088M64196n7451m53997l16175Q8688K37628j2267l10601l00784
$$ -289526 163562 627758 570307 116310 -199865 -111177 126451 114184 -196417 -497201
33978d97201q9091n2773k12843j29211M08280R24357Q36539K35347l24187n99105
$$ -497201 -586292 -639065 -851908 -981119 -572839 351518 1188057 1423404 1099217 500112
33968E00112p33630p17830l76156J14270K99762J35947L4432J24985Q9533j09674
$$ 500112 -233518 -951348 -1327504 -1213234 -913472 -777525 -743093 -618108 -528575 -638249
33958f38249m5829L17124L27292k84404p27653k62926N63924O68979N3646k88866
$$ -638249 -684078 -366954 -39662 -324066 -1051719 -1314645 -750721 -81742 -28096 -316962
33948c16962L4499L15916j4079n38078o01980k27008J55088L59265M08907K43681
$$ -316962 -282463 33453 19374 -518704 -1120684 -1347692 -1192604 -833339 -424432 -180751
33938a80751j01868l05344j23171K34973L83130K39097R486j19073r0589L1465
$$ -180751 -282619 -587963 -711134 -476161 -93031 146066 155552 36479 -54110 -22645
33928b2645O4518q2084j59701J02439M14040K09765l46501l72463L32136O95799
$$ -22645 41873 -40211 -199912 -97473 316567 526332 179831 -192632 139504 835303
33918H35303r1364j148182j042461O5923O55006J36214l86061K7165P43730P12489
$$ 835303 743939 -404243 -1446704 -1380781 -725775 -589561 -975622 -948457 -204727 507762
33908E07762Q4856k34251m5324J28069J51860L95700P72325O27412j56409p46602
$$ 507762 592618 358367 313043 441112 592972 988672 1760997 2388409 2232000 1485398
33898A485398n13105J0903o2398n91044n86258K77606J091571R25455K4430o77977
$$ 1485398 972293 983196 920798 329754 -256504 21102 1112673 2038128 2062558 1384581
33888A384581q17925p39894o14380k07182L93012N88097J58597k83009j88287
$$ 1384581 566656 -173238 -787618 -994800 -601788 -13691 144906 -138103 -326390
33879c26390J05010P176l14294k44234K53391O39240O72277N74000L99991k9584
$$ -326390 -221380 -214204 -528498 -772732 -519341 119899 792176 1366176 1766167 1736583
33869A736583n41498o46286k91587L1488P4712J37875M10803N70475K89795k70411
$$ 1736583 1195085 548799 257212 288700 363412 501287 912090 1482565 1772360 1501949
33859A501949o75477o14985o9145N65371O31152l0133o61069n40028p7929j25871
$$ 1501949 826472 211487 142342 707713 1338865 1308732 647663 107635 29706 -96165
33849i6165m69201j88094N54590N29262m48513r20274j0675J099029R29987j54506
$$ -96165 -565366 -753460 -198870 330392 -118121 -1038395 -1049070 49959 979946 825440
33839H25440p17295l34214K49916M59185L00450j19196n57396n27514o413K60422
$$ 825440 108145 -226069 23847 483032 783482 664286 106890 -420624 -427037 -166615
33829a66615j03829l42862K05541Q69776O70876r9445m72409l67675l62425m32130
$$ -166615 -270444 -613306 -407765 462011 1132887 1033442 561033 193358 -169067 -601197
33819f01197j65038K18285K59036J97114L49794K00574n67290r03549R6069J240190
$$ -601197 -766235 -547950 -288914 -91800 257994 458568 -108722 -1012271 -916202 323988
33809C23988P81031o49905r09778J40876N20729l66514p96616Q7477P88251K40153
$$ 323988 1105019 455114 -454664 -313788 206941 -159573 -956189 -868712 -80461 159692
33799A59692l46398J28040N85984j72778j172661r15901J17203N16935K91688
$$ 159692 -186706 -58666 527318 354540 -818121 -1734022 -1616819 -1099884 -808196
33790h08196K97725L57826j50897o59886k39603N78309O06441N6927M293L24614
$$ -808196 -510471 -152645 -303542 -963428 -1203031 -624722 -18281 38646 42939 367553
33780C67553O4258n19448k89167N49427N94174k71775n76087J68587N79360j51966
$$ 367553 431811 -87637 -376804 172623 766797 495022 -81065 87522 666882 514916
33770E14916p63561k6563J125382J004402k42519r43870l80829L98553K82285
$$ 514916 -248645 -275208 850174 1854576 1612057 668187 287358 685911 968196
33761I68196m42351p20014k09556M05804M49873J06457k0851R7129o4751n56583
$$ 968196 525845 -194169 -403725 2079 451952 558409 537558 634687 569936 13353
33751A3353o65454k5446O52132N60742m1548l68686l02344k05241J5793O28928
$$ 13353 -652101 -677547 -25415 535327 493779 125093 -177251 -382492 -366699 262229
33741B62229J129338P07364l71721r49592o33050k17355k70203l67701r7664J91430
$$ 262229 1391567 2098931 1727210 777618 144568 -72787 -342990 -710691 -808355 -616925
33731f16925J67351J70170M81595O56593K39257m06869o11719l16318P1535L47142
$$ -616925 -449574 -279404 202191 858784 1098041 691172 79453 -236865 -165330 181812
33721A81812M97771L70612q4725m77089l99752n0659L0203k46114m05793r9756
$$ 181812 679583 1050195 965470 488381 88629 37970 68173 -177941 -583734 -683490
33711f83490M26655O53307M12015P2027O8984L02554K21914l55577q18955n37832
$$ -683490 -256835 396472 808487 880514 949498 1252052 1473966 1118389 299434 -238398
33701b38398J77152M51711R1658k15747k0892K74427K02874j8253J3296J32036
$$ -238398 -61246 390465 482123 266376 245484 519911 722785 704532 717828 849864
33691H49864p6781m97598n96006k16443K01923K32124n6723k92097k42627K5604
$$ 849864 773083 275485 -320521 -536964 -335041 -102917 -159640 -451737 -694364 -668760
33681f68760L09212M70069M69509K79647q1791l77081k41527L23470P44812N11273
$$ -668760 -359548 110521 580030 859677 777886 400805 159278 482748 1227560 1738833
33671A738833j02063l60210r2027R2275k64105p60361o73320N0589O61992M53697
$$ 1738833 1636770 1276560 1184533 1276808 1012703 252342 -420978 -370389 291603 745300
33661G45300m09542r93324o12777K99801O55996J37396l43422L427N98799L83626
$$ 745300 335758 -657566 -1270343 -970542 -314546 -177150 -520572 -517145 81654 465280
33651D65280m31747o00292J91519P77559L32144l58124j87339N54547P37752J54571
$$ 465280 33533 -566759 -375240 402319 734463 376339 189000 743547 1481299 1635870
33641A635870l25699k02982L1801j34892m32182l23015J52983M51220K42685k17820
$$ 1635870 1310171 1107189 1138990 1004098 571916 248901 401884 853104 1095789 877969
33631H77969m28304k33160q477j67153n37532n24569J7191M56879K36029k96118
$$ 877969 449665 216505 208028 40875 -496657 -1021226 -1004035 -547156 -311127 -607245
33621f07245l70878P7567L48890L0017m42158m45574L0819N08433O32461M05517
$$ -607245 -978123 -900556 -551666 -521649 -963807 -1409381 -1378562 -870129 -237668 167849
33611A67849K8973k33485j76690J39223L92231L60001J56186k8422k22906m84146
$$ 167849 196822 -36663 -213353 -74130 318101 678102 834288 805866 582960 98814
33601I8814n97954l17977J81805M65020M28376L47924L09625Q2856k83428k95670
$$ 98814 -499140 -817117 -635312 -170292 258084 606008 915633 998489 715061 419391
33591D19391J81577M72416J6192o49589n84364R9301L66613j25376m94345m2087
$$ 419391 600968 1073384 1089576 439987 -144377 -45076 321537 196161 -298184 -340271
33581c40271O65899P11896J55787k49104k10642l7683O9835J44754N1155l33179
$$ -340271 325628 1037524 1193311 944207 733565 695882 765717 910471 961626 628447
33571F28447o19140k76633M91884Q86721N77217K6960l21404n31170o59355m39264
$$ 628447 9307 -267326 224558 1111279 1688496 1715456 1394052 862882 203527 -235737
33561b35737J42972N09206K36541k24410j18943N24633R09352N42582j68705n15700
$$ -235737 -92765 416441 652982 428572 309629 834262 1743614 2286196 2117491 1601791
33551A601791l37463m6598N910r4894r7242J9078R1165J02077K07202M06044M29697
$$ 1601791 1264328 1217730 1223640 1128746 1031504 1050582 1141747 1243824 1451026 1857070 2286767
33540B286767R0069m13927o75280m71769P2821N76173O27859J67512l17502k63884
$$ 2286767 2376836 1962909 1287629 815860 888681 1464854 2092713 2260225 1942723 1678839
33530A678839K30568N18827L59446K37009M54044N03440j07930q98700j004470
$$ 1678839 1909407 2428234 2787680 3024689 3478733 3982173 3874243 2975543 1971073
33521A971073m39504P512l346n3053J01572R5677k94669o36423m51618Q9785M34320
$$ 1971073 1531569 1539081 1535735 1482682 1584254 1679931 1385262 748839 297221 387006 821326
33510H21326L27451p572j74271L8086M28499N25770J69412j86512r3643J66315
$$ 821326 1148777 1141205 966934 1005020 1433519 1959289 2128701 1942189 1848546 2014861
33500B014861J6536l98437l54930K49611O35088L32525j26954j52194k2512k47887
$$ 2014861 2031397 1632960 1278030 1527641 2162729 2495254 2368300 2216106 2193594 1945707
33490A945707n39538k24795N51906Q58679K77474m74856m97013J46774N90717
$$ 1945707 1406169 1181374 1733280 2591959 2869433 2394577 1897564 2044338 2635055
33481B635055L04144l06582n08179j81500J36231Q0370p7365J2213J37743j11446
$$ 2635055 2939199 2632617 2124438 1942938 2079169 2159539 2082174 2094387 2232130 2120684
33471B120684n60712n82264p568O09368P49092M92008J79830m3881j38621j8549
$$ 2120684 1559972 977708 970140 1579508 2328600 2820608 3000438 2956557 2817936 2799387
33461B799387K18674K41526m6551k66243q6228K56476K80025q1218m58067n64247
$$ 2799387 3018061 3259587 3213036 2946793 2860565 3117041 3397066 3315848 2857781 2293534
33451B293534m29161j89384N9247K05601J59117j5951j57839k11588k34384k04169
$$ 2293534 1864373 1674989 1734236 1939837 2098954 2083003 1925164 1713576 1479192 1275023
33441A275023j7699K53489L17584P2340r3834K42322P87347P00954k37407j098936
$$ 1275023 1257324 1510813 1828397 1900737 1806903 2049225 2836572 3537526 3300119 2201183
33431B201183r48644j49651K02828q1451j90463J25799P1049o69551j082351l69129
$$ 2201183 1252539 1102888 1305716 1224265 1033802 1159601 1230650 561099 -521252 -890381
33421h90381O18966O23935n2258j42263M67035O69267R1543l66267j89022o8180
$$ -890381 -271415 352520 300262 157999 625034 1294301 1385844 1019577 830555 762375
33411G62375n19353q44655k61963P60345J134568O15151q7037l43337j92963n8774
$$ 762375 243022 -601633 -863596 -103251 1031317 1646468 1559431 1216094 1023131 964357
33401I64357k40331n77941n32498J33532Q07440O68228j25072n61539k15181K12882
$$ 964357 724026 146085 -386413 -252881 554559 1222787 1097715 536176 320995 533877
33391E33877O8136l29229l90346j86294q5006l0029J82847L43814J73089r4289
$$ 533877 602013 272784 -117562 -303856 -388862 -418891 -236044 107770 280859 186570
33381A86570n1049K00013K39535J9528j24116j3275K25381M41391N47534M35435
$$ 186570 135521 335534 575069 594597 470481 457206 682587 1123978 1671512 2106947
33371B106947R6635k56327l95421l12373j49356n5418j46219l64110l88137k2978
$$ 2106947 2203582 1947255 1551834 1239461 1090105 1034687 888468 524358 136221 113243
33361A13243L58831K33637k17570k66566K51519O53919M60950N3582n5775L3946
$$ 113243 472074 705711 488141 221575 473094 1127013 1587963 1641545 1585770 1619716
33351A619716J7023n7781q7384k36775m89233l95791K14084P50985O27827P7070
$$ 1619716 1636739 1578958 1491574 1254799 765566 369775 583859 1334844 1962671 2039741
33341B039741l03489l89285l87514k94765p5494O938j69403j75733L17429Q08515
$$ 2039741 1736252 1346967 959453 664688 589194 596132 426729 250996 568425 1376940
33331A376940N58136k96118q62127o30284L6962M66439L06678k74818o87832m12967
$$ 1376940 1935076 1638958 776831 146547 183509 649948 956626 681808 -6024 -418991
33321d18991L19966O71701K97819j67952j37856J8054k77866o92520m68866K92284
$$ -418991 -99025 572676 870495 702543 564687 582741 304875 -387645 -856511 -564227
33311e64227P27579M66984l765j98972j27995P7109L67307N45636L88703N9538
$$ -564227 163352 630336 626571 427599 299604 376713 744020 1289656 1678359 1737897
33301A737897m6930J60451M90866Q65411J228601J333081J202042J470282K426669
$$ 1737897 1690967 1851418 2342284 3207695 4436296 5769377 6971419 8441701 10868370
33292A0868370K960881J586379j347017l558052l418655j764061n53185n03384
$$ 10868370 13829251 15415630 14068613 10510561 7091906 5327845 4774660 4271276
33284D271276q41672q41039n96353l74054r6554K48646K81965k62515r88695j191506
$$ 4271276 3429604 2588565 1992212 1618158 1521604 1770250 2052215 1789700 801005 -390501
33274c90501o79200N3289M49026L97556Q7850k95564n35938l61104K03905O61225
$$ -390501 -1069701 -1016412 -567386 -169830 -81980 -377544 -913482 -1274586 -1070681 -409456
33264d09456N83420J81642m2377k4737m4831q7801P3322K52070L4182l91285l80600
$$ -409456 173964 355606 313229 288492 243661 155860 229182 481252 515434 124149 -256451
33253b56451O5842K25722q2358j27162L92023O32008l2380q12693o24544K51690
$$ -256451 -190609 35113 -47245 -174407 217616 849624 817244 4551 -619993 -368303
33243c68303O61203K87159j57978j85997P855K09429M10164M17853M3796l62503
$$ -368303 292900 580059 422081 236084 243939 453368 863532 1281385 1325181 962678
33233I62678l04909J3753M73k65965j43471L86450N52111J5709n69410n66457
$$ 962678 657769 671522 671995 406030 262559 649009 1201120 1216829 647419 80962
33223H0962k17805p8370j46533m5496K85076N29717M67590J95194n0759j32637
$$ 80962 -136843 -215213 -361746 -407242 -122166 407551 875141 1070335 1019576 886939
33213H86939j20373j99675m16153n72175m75390j77411J46063L84560M42276K44587
$$ 886939 766566 566891 150738 -421437 -896827 -1074238 -928175 -543615 -101339 143248
33203A43248l9731p7037J29510J60206j64938m62013m14168k55062k32039j01239
$$ 143248 103517 26480 155990 316196 151258 -310755 -724923 -979985 -1212024 -1313263
33193a313263L26434O40183M60061J59963K57001M90845K99061j37883j93555
$$ -1313263 -986829 -346646 113415 273378 530379 1021224 1320285 1182402 988847
33184I88847J03425J53823j62701l78849l01892j78407q3700N9685q200m84544
$$ 988847 1092272 1246095 1083394 704545 402653 224246 140546 200231 192031 -292513
33174b92513p65893j25538R35341J147931L70837j92139N7855K32229l97292j064240
$$ -292513 -1058406 -1183944 -248603 899328 1270165 1078026 1135881 1368110 970818 -93422
33164i3422p17395L26087R36491P71048L40688q0274n93952r33330n78184K93480
$$ -93422 -810817 -484730 451761 1222809 1563497 1483223 889271 -44059 -622243 -328763
33154c28763P85796M63218q7590j92665k7536j12974k75930J19851R15720R92297
$$ -328763 457033 920251 832661 639996 612460 499486 223556 343407 1259127 2251424
33144B251424j42611j287639r73438M10513J087204M81336o5232L54334O59215
$$ 2251424 2108813 821174 -152264 258249 1345453 1826789 1761557 2115891 2775106
33135B775106k77053j404582r28274P61056J521567O42521l53337l35731q2261
$$ 2775106 2498053 1093471 165197 926253 2447820 3090341 2737004 2401273 2319012
33126B319012m60913q32947m12420J41836j27686p02797m28173M79090P39882
$$ 2319012 1858099 1025152 612732 754568 626882 -75915 -504088 -24998 714884
33117G14884P6306m53679k45394K6963k55544n82332k21130N32558P74070L00962
$$ 714884 791190 337511 92117 119080 -136464 -718796 -939926 -407368 366702 667664
33107F67664j92477j50011J95768L24030J39866p6543j65278j87792j46996J7066
$$ 667664 475187 325176 520944 844974 984840 908297 743019 555227 408231 425297
33097D25297J36447q3048n27393o35720j59865M02457M96139K83943K46352L08802
$$ 425297 561744 478696 -48697 -684417 -844282 -441825 54314 338257 584609 893411
33087H93411L0526m64257m99772Q9443N98002M35583r4739l76593l64727m11623
$$ 893411 923937 459680 -40092 49351 647353 1082936 988197 611604 246877 -164746
33077a64746n30606l82584Q2153M40859L57062K3853j04599J26438M18886L77750
$$ -164746 -695352 -1077936 -995783 -554924 -197862 -174009 -278608 -152170 266716 644466
33067F44466o6746n68382o40612q7301P17158J038963N19997k82479m50258O6662
$$ 644466 577720 9338 -631274 -718575 -1417 1037546 1557543 1275064 824806 891468
33057H91468K81212l84607j067108o45289M74849Q55634J84559l32655L4727M75062
$$ 891468 1172680 788073 -279035 -924324 -449475 406159 590718 258063 292790 767852
33047G67852J62185l70979l04731K5387j32437n19462l65101K07487M40218K49119
$$ 767852 930037 559058 254327 279714 147277 -372185 -737286 -529799 -89581 159538
33037A59538J68534K53998J11376j71203j47208Q5445Q5570o286K35632M81921
$$ 159538 328072 582070 693446 522243 375035 460480 546050 539764 775396 1257317
33027A257317L8839p88985r24385k01713L57264J92299k0919L26942P34249M68163
$$ 1257317 1296156 507171 -417214 -618927 -261663 -69364 -90283 236659 970908 1439071
33017A439071k60474o51839m03315N9633J97561q3098l65091k06756K04038J99286
$$ 1439071 1178597 526758 123443 183076 380637 297539 -67552 -274308 -70270 129016
33007A29016l00471m38663K80312R95712O91981j75772m04317L8820J58418k36643
$$ 129016 -171455 -610118 -329806 665906 1357887 1182115 777798 816618 975036 738393
32997G38393l16807J16538K37904k60807n95690k83777J08840Q7117k2007O9645
$$ 738393 421586 538124 776028 515221 -80469 -364246 -255406 -168289 -190296 -120651
32987a20651M3469k35982l33747j05096n04j15226O4060N63351O46618J08728
$$ -120651 -77182 -313164 -646911 -752007 -752511 -867737 -803677 -240326 406292 515020
32977E15020k50784J9956L08145J61008P0058L21649K39814n29899j069496n62546
$$ 515020 264236 284192 592337 753345 823403 1145052 1384866 854967 -214529 -777075
32967g77075L09822M41288k7872k35582j06725j56389l02411n7140M09698M71407
$$ -777075 -467253 -25965 -53837 -289419 -396144 -552533 -854944 -912084 -502386 -30979
32957c0979J12521j29004j11669j41244k44690j92533r1863j90453k34039J98255
$$ -30979 81542 -47462 -159131 -300375 -545065 -737598 -829461 -1019914 -1253953 -1055698
32947a055698P97913P70284M2878n04383k40712L68832M62455m4420l99111m4079
$$ -1055698 -257785 512499 555377 50994 -189718 179114 641569 597149 198038 153959
32937A53959O47590Q65315M09099j41202l28263l51342m17816j97715M52189P95509
$$ 153959 801549 1666864 2075963 1934761 1606498 1255156 837340 639625 1091814 1887323
32927A887323J68312p67369q13881o9522K42719k56281o24041k94192P5847r4415
$$ 1887323 2055635 1288266 474385 404863 647582 391301 -232740 -526932 -451085 -545500
32917e45500l68699k41637K2065P9819P9953L6028l36898o72288m3092J336498
$$ -545500 -914199 -1155836 -1133771 -1053952 -973999 -937971 -1274869 -1947157 -1990249 -653751
32907f53751J802744N85622p74034n69153N67028P50176l07790j115789p35509
$$ -653751 1148993 1734615 960581 391428 958456 1708632 1400842 285053 -450456
32898d50456J74670O61950O13578L68768Q8263j88523l81327m44177l50010p3902
$$ -450456 -275786 386164 999742 1368510 1456773 1268250 886923 442746 92736 18834
32888A8834K29125K94501J62085J15124P8762k95547p45146m47019O02785J168163
$$ 18834 247959 542460 704545 819669 898431 602884 -142262 -589281 13504 1181667
32878A181667M38581o82174q15876M465O23277M52994p6801m47626n31077l01480
$$ 1181667 1620248 938074 122198 126663 749940 1202934 1126133 678507 147430 -154050
32868a54050J59442M46364K29855j99696k68329J02733M36848L04882k57797p61327
$$ -154050 5392 451756 681611 481915 213586 316319 753167 1058049 800252 38925
32858C8925o01623K70971J022648Q08476m7001m76423k70094k46650o65107o93768
$$ 38925 -562698 -291727 730921 1539397 1492396 1015973 745879 499229 -165878 -859646
32848h59646M2597O18204K94905k34242m3268N09611N11036l280l31533l09384
$$ -859646 -817049 -198845 96060 -138182 -181450 328161 839197 835917 504384 195000
32838A95000k30500n9269L26855N32312J75477l31466l37881N1245K60023J63258
$$ 195000 -35500 -94769 232086 764398 939875 608409 270528 321773 581796 745054
32828G45054M0632m7267k13988l85176m54305m37354j79089N04999J122988P82748
$$ 745054 785686 738419 524431 139255 -315050 -752404 -931493 -426494 696494 1479242
32818A479242l99306j096956n47927M12811P16690M50300J59015j65037n12071
$$ 1479242 1079936 -17020 -564947 -152136 564554 1014854 1173869 1008832 496761
32809D96761l19807M66863P78400k2934q78288n30905N10548P83071K1161p29774
$$ 496761 176954 643817 1422217 1399283 520995 -9910 500638 1283709 1304870 575096
32799E75096o87224K6003Q57369J095340K75100r29951j064424O1632P73397j8264
$$ 575096 -112128 -86125 771244 1866584 2141684 1211733 147309 208941 982338 964074
32789I64074j041736o98209L91990O07267M1083J3415N87918O54254R9774j18114
$$ 964074 -77662 -775871 -383881 223386 264469 277884 865802 1520056 1619830 1501716
32779A501716R5712r8544o22712m44623M05911N96824k67795p78000J94206J747531
$$ 1501716 1597428 1498884 876172 431549 837460 1434284 1166489 388489 582695 2330226
32769B330226K079843O45481j357149k233066j336725K91973R35460J33154q35690
$$ 2330226 4410069 5055550 3698401 1465335 128610 420583 1356043 1489197 653507
32760F53507p89071j54148R3225O1503L60295O59325K28764n68443p12845j47754
$$ 653507 -135564 -289712 -196487 -134984 225311 884636 1113400 544957 -167888 -315642
32750c15642L06093L51707L05064J20622l99357p24347k22561N73065N91581j13089
$$ -315642 -9549 342158 647222 767844 368487 -355860 -578421 -5356 586225 473136
32740D73136n66149m75627l50053k69555J13627N22749L47458j24724o0798M48258
$$ 473136 -93013 -568640 -918693 -1188248 -1074621 -551872 -204414 -329138 -389936 58322
32730E8322N61597K13536J23907L44186J79044l69927m44505J58355N51556J78548
$$ 58322 619919 833455 957362 1301548 1480592 1110665 666160 824515 1376071 1554619
32720A554619l75739l93016l1447O6034l27980p61894n60822L40056J002397N09037
$$ 1554619 1178880 785864 754417 820451 492471 -269423 -830245 -490189 512208 1021245
32710A021245n49325o36615L93519R20267J54924n30303J6256P21558K50608n97261
$$ 1021245 471920 -164695 228824 1149091 1304015 773712 789968 1511526 1762134 1164873
32700A164873m05329K87323J16247n10247k95100L44921M7413p56595m55298P36128
$$ 1164873 759544 1046867 1163114 652867 357767 702688 750101 -6494 -461792 274336
32690B74336R77665l8723o49969j23664L86773J59470n1389J89577J87422k89486
$$ 274336 1252001 1213278 563309 439645 826418 985888 934499 1124076 1311498 1022012
32680A022012m10625J00929L55129j27117o42032n88745k56426J2273K68580L89330
$$ 1022012 611387 712316 1067445 940328 298296 -290449 -546875 -534602 -266022 123308
32670A23308J80893L9847L82355O41267R7269o44195m64750L31665M88248j00870
$$ 123308 304201 344048 726403 1367670 1464939 820744 355994 687659 1175907 1075037
32660A075037m21928k29003j94888l63068j44942K91907K75526N7849L49240P24460
$$ 1075037 653109 424106 229218 -133850 -278792 13115 288641 346490 695730 1420190
32650A420190K32004p00808p85300n1395L01003K351j34534O7146N1351j02901
$$ 1420190 1652194 951386 166086 114691 415694 418045 283511 350657 402008 299107
32640B99107O6081J42700m53672r86698m25365O27472Q79166N35266O09660Q65917
$$ 299107 365188 507888 54216 -932482 -1357847 -730375 148791 684057 1293717 2159634
32630B159634N33531J63853N13135N92822o62203j855127j081280N74931O06408
$$ 2159634 2693165 2857018 3370153 3962975 3300772 1445645 364365 939296 1545704
32621A545704o80143q36653L98208R34143K25442j37619K84342K38892l65576
$$ 1545704 865561 28908 427116 1361259 1586701 1449082 1733424 1972316 1606740
32612A606740k47851M84933M09841l48001l19136L39788J15725q06269q47053
$$ 1606740 1358889 1843822 2253663 1905662 1586526 1926314 2042039 1235770 388717
32603C88717j18959o8299m48605Q2101Q89160L50590p14942k80697R30431O31025
$$ 388717 269758 201459 -247146 -165045 724115 1074705 359763 79066 1009497 1640522
32593A640522o36299m80411O91881M73107p69718o18099N09143J27106j200739
$$ 1640522 1004223 523812 1215693 1688800 919082 300983 810126 937232 -263507
32584b63507o96441J143020J267613j27833j03893J170160R33858k70287N06002
$$ -263507 -959948 183072 1450685 1322852 1218959 2389119 3322977 3052690 3558692
32575C558692K240646J162542j907188k467652m22048J33768r96180j88166J925374
$$ 3558692 5799338 6961880 5054692 2587040 2164992 2298760 1302580 1114414 3039788
32566C039788J073121j789630j399024J659186J516457j688087j709927J703695
$$ 3039788 4112909 2323279 924255 2583441 4099898 2411811 701884 2405579
32558B405579K114521q84392o81950K832871K317609k091141j728346L652080
$$ 2405579 4520100 3635708 2953758 5786629 8104238 6013097 4284751 7936831
32550G936831M273221m33331N20510P660367P958677J007114L457758J6572858
$$ 7936831 12210052 11776721 12297231 19957598 27916275 28923389 32381147 48954005
32542D8954005J8992539R736958K3905531P3263785J02483289N2887094m6189399
$$ 48954005 67946544 77683502 101589033 174852818 277336107 330223201 284033802
32535B84033802j02947809p8849469k7529457r324427j8256774j7601607m031829
$$ 284033802 181085993 102236524 74707067 65382640 47125866 29524259 25492430
32528B5492430O10789n720125o579296q2080J101903l958869m294415P81806J504862
$$ 25492430 26103219 20383094 13803798 13721718 14823621 10864752 6570337 7352143 8857005
32519H857005k748390l049666J361306K220361j582641k547555P51930J651623
$$ 8857005 6108615 3058949 4420255 6640616 5057975 2510420 3262350 4913973
32511D913973j419167k519198R5671J341424m64475j104408O14407Q61944j102861
$$ 4913973 3494806 975608 1071279 2412703 1948228 843820 1458227 2320171 1217310
32502A217310j422619O53869J426595J108m43755O84493M64015j251957j323109
$$ 1217310 -205309 448560 1875155 1876263 1432508 2117001 2581016 1329059 5950
32493E950M10197P53398n93506o51960P19360N35544j171967j086470J017462
$$ 5950 416147 1169545 576039 -75921 643439 1178983 7016 -1079454 -61992
32484f1992J629241p8228r51551J88017Q02616j86038o75127J36825L86892l80887
$$ -61992 1567249 1489021 537470 725487 1528103 1342065 666938 803763 1190655 809768
32474H09768l48516N78408L53600r45928q60959P60919J206167k15718j025900
$$ 809768 461252 1039660 1393260 447332 -413627 347292 1553459 1337741 311841
32465C11841j75671L75580l51905p48577k4797M38927J03668J94898Q30415N65640
$$ 311841 136170 511750 159845 -588732 -613529 -174602 -70934 123964 954379 1520019
32455A520019n42817p12404J98335L92507l69184l60322N80430N73923o66477
$$ 1520019 977202 264798 463133 855640 486456 126134 706564 1280487 614010
32446F14010j138717j76800N10819J37086j7675N16603M80477l84303o42273M6280
$$ 614010 -524707 -701507 -190688 -53602 -71277 445326 925803 541500 -100773 -54493
32436e4493K57170m13290o32323J5938L41603J8210R4916O19280L98667m83817
$$ -54493 202677 -210613 -842936 -826998 -485395 -467185 -372269 247011 645678 161861
32426A61861n51946L24774O64721R3720k40685q7824l00234o26305l1971Q50543
$$ 161861 -390085 -65311 599410 693130 452445 364621 64387 -561918 -593889 256654
32416B56654M50058p17356p56348J00491l4795r19325m59209J182472J533859
$$ 256654 706712 -10644 -766992 -666501 -701296 -1620621 -2079830 -897358 636501
32407F36501K00484n08788J33603K38946p07360p63924N13395R19580l00600r65654
$$ 636501 836985 328197 461800 700746 -6614 -770538 -257143 662437 361837 -603817
32397f03817k7432N74500k32014o06126M95365J104834p6546j092469k16879R81427
$$ -603817 -631249 -56749 -288763 -894889 -399524 705310 628764 -463705 -680584 300843
32387C00843N64713m83899m27913J87113J53590M8359O28814Q29009k45632j204826
$$ 300843 865556 381657 -46256 140857 294447 342806 971620 1800629 1554997 350171
32377C50171o03470M54540K46603o42382o11415J61030M31456J82039J44667J35183
$$ 350171 -253299 201241 447844 -194538 -805953 -644923 -213467 -31428 113239 248422
32367B48422k69767m55615J15130N82098P9285o56936n88319j20027n4894k0912
$$ 248422 -21345 -476960 -361830 220268 299553 -357383 -945702 -1065729 -1120623 -1141535
32357a141535N21674R04799M53454q5335J28622M06310j66633q97085o38814J62502
$$ -1141535 -619861 284938 738392 653057 781679 1187989 1021356 124271 -514543 -352041
32347c52041K75901k21802k96475J79410M31188K41794Q8213J12536K6903j96799
$$ -352041 -76140 -297942 -594417 -415007 16181 257975 346188 458724 485627 288828
32337B88828l17384k16936J38404O28416O80084j11309r46577o13591M97932O88045
$$ 288828 -28556 -245492 -107088 521328 1201412 1090103 143526 -470065 27867 715912
32327G15912l70609r97434k36088O18577K59162n90194o42033o9583K73435L74382
$$ 715912 345303 -652131 -888219 -269642 -10480 -600674 -1242707 -1312290 -1038855 -664473
32317f64473N19455L84916j47252l65508L3126K40934j69697l68071J30006M34509
$$ -664473 -145018 239898 92646 -272862 -239736 1198 -168499 -536570 -406564 27945
32307B7945j1277k21093N14370J098813M42195n64323n29105J69851K76980j89924
$$ 27945 16668 -204425 309945 1408758 1850953 1286630 757525 927376 1204356 1014432
32297A014432l41035j22517o8160r1128P3238l408n50696p09716J08884Q89086
$$ 1014432 673397 550880 482720 391592 464830 461422 -89274 -798990 -690106 198980
32287A98980M75691m93424o29212K4036L91099K68029K70130M24371K91891N6845
$$ 198980 674671 181247 -447965 -423929 -32830 235199 505329 929700 1221591 1278436
32277A278436J56577K64597j23315n77369m07015O9048J00002j79834j61105N7289
$$ 1278436 1435013 1699610 1576295 998926 591911 660959 760961 581127 420022 477311
32267D77311K4270p6236J12271K47256o7885l95805k40653R186p0973j1219N28954
$$ 477311 501581 425345 537616 784872 716987 321182 80529 89715 18742 7523 536477
32256E36477P74655J46358m45211o8658M49683j13772j114587j009597M5863N30464
$$ 536477 1311132 1457490 1012279 943621 1393304 1279532 164945 -844652 -798789 -268325
32246b68325J05729j21023K55763M07976q657k91658q7931R3359J3300Q4804M04416
$$ -268325 -162596 -283619 -27856 380120 371463 79805 -8126 85233 98533 183337 587753
32235E87753N05315K20200j53450m98828p70540n11947M37976J096629M67157
$$ 587753 1093068 1313268 1159818 660990 -109550 -621497 -183521 913108 1380265
32226A380265p56084r88605p4310O58001N58524L01198K75919k4714o38806o95171
$$ 1380265 624181 -364424 -438734 219267 777791 1078989 1354908 1330194 691388 -3783
32216c783M9056N56207J19321m95110l07472L91076O53481L01465p0534r3290
$$ -3783 45273 601480 720801 225691 -81781 309295 962776 1264241 1193707 1100417
32206A100417M8226N8446j51035m41623n18827k22761J58143J62028j87398l61870
$$ 1100417 1148643 1207089 1056054 614431 95604 -127157 30986 193014 5616 -356254
32196c56254q7365K46788J52364k40156l07008K47428Q84961P65057j56204q81234
$$ -356254 -443619 -196831 -44467 -284623 -591631 -344203 540758 1305815 1149611 268377
32186B68377n84917K30070M25914j26350m82668k00763Q3848p6031j99075Q1502
$$ 268377 -316540 -86470 339444 213094 -269574 -470337 -386489 -462520 -661595 -580093
32176e80093K66612l6039l07723l4247M04327M97273M34217M41135J69057m58888
$$ -580093 -313481 -349520 -657243 -691490 -287163 210110 644327 1085462 1254519 795631
32166G95631p17324k69315Q1420k18493l92418K20082P51580K50779m90178k14075
$$ 795631 78307 -191008 -109588 -328081 -720499 -500417 251163 501942 11764 -202311
32156b02311N43908L43029o09606p88724L5427N16855J08738j96107J80347M46647
$$ -202311 341597 684626 75020 -713704 -678277 -161422 -52684 -248791 -68444 378203
32146C78203q852n74436n60586k19766l2186O1323K10497K47268J06331j9324
$$ 378203 369351 -205085 -765671 -985437 -1017623 -956300 -745803 -498535 -392204 -411528
32136d11528j15005k75123k40234K08847N53655J99965l43357r8812O79404P60795
$$ -411528 -526533 -801656 -1041890 -833043 -279388 -79423 -422780 -521592 157812 918607
32126I18607n1929n74118j59842M12909M00895J18601l6668l14933p11109n39680
$$ 918607 866678 292560 132718 545627 946522 1065123 1028455 713522 2413 -537267
32116e37267K96159P21882R7788n92141k26488O16749N60790l67338p84866r4311
$$ -537267 -241108 480774 578562 -13579 -240067 376682 937472 570134 -214732 -309043
32106c09043O72066M48846l81159o90031k22627K21189R7323j17354J92560O67008
$$ -309043 363023 811869 430710 -259321 -481948 -260759 -163436 -280790 -88230 578778
32096E78778M65572k82307m50328L75366J067705N10874p36936j241599o79747
$$ 578778 1044350 762043 311715 687081 1754786 2265660 1528724 287125 -392622
32087c92622j3298Q0300q9498r0046K1012J20922K96096M80309M13176J07689
$$ -392622 -405920 -325620 -415118 -505164 -484152 -363230 -67134 413175 826351 934040
32077I34040j29784j78236j32861N4593M30147O64296M26827l945j47713j59672
$$ 934040 804256 626020 493159 547752 977899 1642195 2069022 2065077 1917364 1757692
32067A757692n13828r97760q93785j61473M27627M43381K67100K40893J44809
$$ 1757692 1243864 246104 -647681 -809154 -381527 61854 328954 569847 714656
32058G14656j88133m18228k35707J21802K10230n7641l72027l66305Q095L27804
$$ 714656 526523 108295 -127412 -5610 204620 146979 -225048 -591353 -583258 -255454
32048b55454J37937l18728k86110L20721N98018K6703o22187n11879n1885K0229
$$ -255454 -117517 -436245 -722355 -401634 196384 223087 -399100 -910979 -962864 -942635
32038i42635N2583O58730J169235N10952p63056j059111k44699K04999l09046
$$ -942635 -890052 -231322 937913 1448865 685809 -373302 -618001 -413002 -722048
32029g22048o72421j32835M87871L72045K9686J74273M71387L13496r0166k15236
$$ -722048 -1394469 -1527304 -1039433 -667388 -637702 -463429 7958 321454 231288 16052
32019A6052p1474R0388K44463K91408l080m25633m39123j26959j16398l80862
$$ 16052 -55422 34966 279429 570837 567757 142124 -296999 -423958 -540356 -921218
32009i21218k13927L66561M66738m5986j51318M90512P67817J5490p25914m20807
$$ -921218 -1135145 -768584 -301846 -347832 -499150 -8638 759179 774669 48755 -372052
31999c72052K66341K33673k00288q1548M10408M11366l2677j82974K5406P3357
$$ -372052 -105711 127962 -72326 -153874 256534 667900 635223 452249 477655 551012
31989E51012n5283j2723L7545k38708m87839k12205J96331O5789k71022N582O58709
$$ 551012 495729 483006 520551 281843 -205996 -418201 -221870 -156081 -427103 -421521 237188
31978B37188O45750j48412o73679l36418K64269M54500L32461J82850o2670l77912
$$ 237188 882938 734526 60847 -275571 -11302 443198 775659 958509 895839 517927
31968E17927l83620K6662L49994J67453k29765k67102J22598M31102K04658m03224
$$ 517927 134307 160969 510963 678416 448651 181549 304147 735249 939907 536683
31958E36683p41318m00962K15777L80262P5744l797L61697M94218J0122l83743
$$ 536683 -204635 -605597 -389820 -9558 66186 62389 424086 918304 928426 544683
31948E44683l7592M26921O8581p38077q18623q1469L89190J32234n9369L92859
$$ 544683 507091 934012 1002593 264516 -554107 -635576 -246386 -114152 -173521 219338
31938B19338Q73655O07089j68442o55284n49356j36650K12071K43044q4207l90805
$$ 219338 1092993 1700082 1531640 876356 327000 190350 402421 645465 561258 170453
31928A70453j79016M03187N78567K7896n55828m24203J76970M43830J59831j85992
$$ 170453 -8563 394624 973191 1001087 445259 21056 198026 641856 801687 615695
31918F15695k46332j85662k01900j97885q2841j9961j39686k46178p7414K54314
$$ 615695 369363 183701 -18199 -216084 -298925 -318886 -458572 -704750 -782164 -527850
31908e27850L63817J49236l3201R6480K83675J29635k12978k00614K07137L44708
$$ -527850 -164033 -14797 -47998 48482 332157 461792 248814 48200 255337 600045
31898F00045j87823q06336o69926J48154P58251O29481J43303q6386R367O0221
$$ 600045 412222 -394114 -1064040 -915886 -157635 471846 615149 528763 538130 598351
31888E98351j46361m21967m62797k43778o6705j61854l14394j28741L17335M62125
$$ 598351 451990 30023 -432774 -676552 -743257 -905111 -1219505 -1348246 -1030911 -568786
31878e68786Q5760k79572j27221K29966J72272k06276k47916J91164M82902J54493
$$ -568786 -483026 -762598 -889819 -659853 -487581 -693857 -941773 -750609 -267707 -113214
31868a13214m63601p02449l04189M01142P83909M12753m04253p21672o8925P33167
$$ -113214 -576815 -1279264 -1583453 -1182311 -398402 14351 -389902 -1111574 -1180499 -447332
31858d47332N46906m16276q06701j05768O51200N24471J4991L3909L98897L44496
$$ -447332 99574 -316702 -1123403 -1229171 -577971 -53500 -38509 -4600 394297 738793
31848G38793p0653j76040K7452n8993l73642j67426N90871Q73839J10492q57499
$$ 738793 668140 492100 519552 460559 86917 -80509 510362 1384201 1494693 637194
31838F37194r62224l71133k3962j64206j69290K78826O42515L76997j91303k64618
$$ 637194 -325030 -696163 -720125 -884331 -1053621 -774795 -132280 244717 53414 -211204
31828b11204L01554P02870K12469p52525j041696k86734N41569M44067k53484
$$ -211204 90350 793220 1005689 253164 -788532 -1075266 -533697 -89630 -343114
31819c43114n02223j12166J63209J5012K4774N01757Q45727N39129l3341l04155
$$ -343114 -845337 -957503 -794294 -779282 -754508 -252751 592976 1132105 1098764 794609
31809G94609l43096l74892j87685K93157N11373J36108k14444M2218L70523K0165
$$ 794609 451513 76621 -111064 182093 693466 829574 615130 657348 1027871 1048036
31799A048036n70354m68827R3309J11057l90930m03650K26313M97003K7265l21875
$$ 1048036 477682 8855 102164 213221 -177709 -581359 -355046 141957 169222 -152653
31789a52653m3494J79936j39842l59218O6403N41343L90475j8779j00552q7920
$$ -152653 -196147 -16211 -156053 -515271 -448868 92475 482950 464171 363619 275699
31779B75699l23744l76558J33084N98953L74236n3703O8566L84516J32255l45855
$$ 275699 -48045 -424603 -291519 307434 681670 627967 696533 1081049 1213304 867449
31769H67449j44042N35761O54777J04197j99114M120o8372o90486j004740m53530
$$ 867449 723407 1259168 1913945 2018142 1819028 1823148 1754776 1064290 59550 -393980
31759c93980K64177L26613K8451J40210O08304O72558M7347o51139p07452j79352
$$ -393980 -129803 196810 225261 365471 973775 1646333 1693680 1042541 335089 155737
31749A55737K14583J6616l80584l13966J26234K08346k22788l94989J16813N51381
$$ 155737 370320 386936 6352 -307614 -181380 26966 -195822 -590811 -473998 77383
31739G7383J23788o31421o27457J08435N61723K80219j99422l59520k14122J19155
$$ 77383 201171 -430250 -1057707 -949272 -387549 -107330 -306752 -666272 -880394 -761239
31729g61239N11984N79366J48233k06194N3970L98669K6635o11709l96449M94134
$$ -761239 -249255 330111 478344 272150 326120 724789 751424 139715 -256734 237400
31719B37400P02541q5117o16061k00535K10653j72907n63646m6963P38088O34624
$$ 237400 939941 854824 238763 38228 248881 75974 -487672 -534635 203453 838077
31709H38077j50143m90924j40869J55454O7657N0130L26112M58627J19044l75803
$$ 838077 687934 197010 56141 211595 279252 329382 655494 1114121 1233165 857362
31699H57362n15080k01317K15816L01436o4630n24702n88911k11901J81123K68625
$$ 857362 342282 140965 356781 658217 593587 68885 -520026 -731927 -550804 -282179
31689b82179J19142j03401k87494j94981L19601Q11167O00276j74617n55023j33804
$$ -282179 -163037 -266438 -553932 -748913 -429312 381855 982131 807514 252491 118687
31679A18687L00939p648n95458n14769K19477P08654M79161o336j43922O0409
$$ 118687 419626 411978 -183480 -698249 -478772 229882 709043 702707 558785 619194
31669F19194J81581O283k17157j39497J51946J67918k43700n04080r0369N53472
$$ 619194 800775 807058 589901 450404 602350 770268 526568 22488 -67881 485591
31659D85591N60151m9137m08252j69427Q3585l1767r6461J95706M05996J59771
$$ 485591 1045742 996605 588353 418926 502511 470744 374283 569989 975985 1135756
31649A135756j71512j66824o2494j89313l30358k24652j20537k43974k93507m7545
$$ 1135756 964244 797420 734926 545613 215255 -9397 -129934 -373908 -667415 -714960
31639g14960J24449l1054p1506L15725N51070O2075o13263n54686J30884N72530
$$ -714960 -590511 -621565 -693071 -377346 173724 235799 -377464 -932150 -801266 -228736
31629b28736M75459K45089M5409k54540l55620J84223R23554Q43327j30484q75275
$$ -228736 246723 491812 537221 282681 -72939 111284 1034838 1878165 1747681 872406
31619H72406o63925j07377k0185j60356J56325P30668O90092r0876o44465k64357
$$ 872406 208481 101104 80919 -79437 76888 807556 1497648 1406772 762307 497950
31609D97950M30680L49006m86950r40633l93009L86144M10052j26993l27331k0991
$$ 497950 928630 1277636 790686 -149947 -542956 -156812 253240 126247 -201084 -222075
31599b22075J87703J06749J71314M03011J92718n40996r23576l90166M04444N67255
$$ -222075 -34372 72377 243691 646702 839420 298424 -625152 -1015318 -610874 -43619
31589d3619K12989M7347K11646K62273q587l62544n44765m63132j23135K68112
$$ -43619 169370 216717 428363 690636 682049 319505 -225260 -688392 -811527 -543415
31579e43415L62591J19838p2157N3333K89208L22814R0489l29765p21625o23107
$$ -543415 -180824 -60986 -133143 -79810 209398 532212 622701 292936 -428689 -1051796
31569a051796J36360P96460M37732n22905o96949J61433O94746J36698m37925
$$ -1051796 -915436 -118976 318756 -204149 -901098 -739665 -44919 91779 -346146
31560c46146P566O80475L65603m62575n08404J16885K24919l01223l87058K63578
$$ -346146 -338580 341895 707498 244923 -263481 -146596 78323 -222900 -609958 -346380
31550c46380O54201J91049m26891m05659Q7500M62174M95585K64836o6572j91562
$$ -346380 307821 498870 71979 -333680 -246180 215994 711579 976415 909843 718281
31540G18281N4455K92108N2356m07763l95994J36679N02145K98410j25676l07569
$$ 718281 772736 1064844 1117200 709437 313443 450122 952267 1250677 1125001 817432
31530H17432k04422j2186R1960J4873j04332L0060L33598K57966l27846o95044
$$ 817432 613010 600824 692784 707657 603325 633385 966983 1224949 897103 202059
31520B02059k98578L11255L83692J65860K58852L77667o8260o39001m61028J49583
$$ 202059 -96519 214736 598428 764288 1023140 1400807 1332547 693546 232518 382101
31510C82101J17067m82247m90186K78205O49695R1072m61026l16203j03667l68972
$$ 382101 499168 16921 -473265 -195060 454635 545707 84681 -231522 -335189 -704161
31500g04161m52728K31220R14116O19192k18847m48350K4122K83637m7233l55447
$$ -704161 -1156889 -925669 -11553 607639 388792 -59558 -35436 248201 200968 -154479
31490a54479j36105K78140L07134l8517j86638K35055Q10288O99921k59009j128098
$$ -154479 -290584 -12444 294690 256173 69535 304590 1114878 1814799 1555790 427692
31480D27692r81780j60177K71544R7495N1640L72983L99670p9313k15993M94045
$$ 427692 -554088 -714265 -442721 -345226 -293586 79397 479067 399754 183761 677806
31470F77806J170490P86589k66910q06604n44971j82076j19608p1756J07183J12403
$$ 677806 1848296 2634885 2367975 1561371 1016400 834324 714716 642960 750143 862546
31460H62546j41430k57866k5393J91330K5963l20596m15655k31914q3742m6402
$$ 862546 721116 463250 437857 629187 655150 334554 -81101 -313015 -396757 -443159
31450d43159J55626N81280P57239K73882m86036p06427k64379N3153k79792o94702
$$ -443159 -287533 293747 1050986 1324868 838832 132405 -131974 -78821 -358613 -1053315
31440a053315l81959M48443Q61497N44446J03237J6429L0860j94740m49327l18295
$$ -1053315 -1435274 -986831 -125334 419112 522349 538778 569638 374898 -74429 -392724
31430c92724J88643O49585O79953K40988l26539n52344l11762j695k8643k53916
$$ -392724 -204081 445504 1125457 1366445 1039906 487562 175800 174105 145462 -108454
31420a08454k43308Q2406M10777N26584M53990K14901j75482n53846p59713p96288
$$ -108454 -351762 -269356 141421 668005 1121995 1336896 1161414 607568 -152145 -948433
31410i48433n97879K5605Q61797J173226O37035m6141j27923Q7460p5453l71856
$$ -948433 -1546312 -1520707 -658910 514316 1151351 1105210 977287 1064747 989294 617438
31400F17438q6529N38614N35763j88916o79638m71838j73096k62785l80750j71452
$$ 617438 530909 1069523 1605286 1416370 736732 264894 91798 -170987 -551737 -723189
31390g23189J02310J71977J75680J61102k7390j61714J75423O22865L16595n74937
$$ -723189 -620879 -448902 -273222 -112120 -139510 -301224 -125801 497064 813659 238722
31380B38722p70077J53976Q98549L31921q15954j118585m65078J72653L66531
$$ 238722 -531355 -377379 521170 853091 37137 -1081448 -1546526 -1373873 -1007342
31371a007342M80699O09422L58283k88626o97489l81911L73176Q33929N95032
$$ -1007342 -526643 82779 441062 152436 -545053 -926964 -553788 280141 875173
31362H75173K5161r4375M47999Q65923L94759m84321o38111k6694K00227m33578
$$ 875173 900334 805959 1253958 2119881 2514640 2030319 1392208 1365514 1565741 1132163
31352A132163r36138m72516L03120L73031p8608k12430K4253N7886j47613j22474
$$ 1132163 196025 -276491 26629 399660 321052 108622 132875 190761 43148 -79326
31342g9326J45233K11800M1557M0494K41776J99357k14019n11926k78955K49740
$$ -79326 65907 277707 319264 359758 601534 800891 586872 74946 -204009 45731
31332D5731M63160L8498p12260j080934o49025K14964P37866O34319L12358J83496
$$ 45731 508891 547389 -164871 -1245805 -1894830 -1679866 -942000 -307681 4677 188173
31322A88173K03118J80719P8089j22424l80248l64491J68906P11366M47131m59154
$$ 188173 391291 572010 650099 527675 147427 -217064 -48158 663208 1110339 651185
31312F51185q44771j64893O90411O87307J1397m54566l84163j01358Q4242M6856
$$ 651185 -193586 -358479 331932 1019239 1030636 576070 191907 90549 174791 221647
31302B21647k52616n58425m10030J83229O06687M94529J91534P4288L3230o4910
$$ 221647 -30969 -589394 -999424 -816195 -209508 285021 476555 550843 584073 519163
31292E19163q8249j21451m59946q11764m30010N56905J002981M80737J0300L17867
$$ 519163 430914 309463 -150483 -962247 -1392257 -835352 167629 648366 658666 976533
31282I76533N89567r557p29379m64726L24879L84352k85329o00198k08751K30830
$$ 976533 1566100 1556543 827164 362438 687317 1071669 786340 186142 -22609 208221
31272B08221L29398K91611J65811j21688k05167K10050N55411J48598n89235p26396
$$ 208221 537619 829230 995041 873353 668186 878236 1433647 1582245 993010 266614
31262B66614k83752o871m6663l2079q0227m74956o90585r4896O71792M71931m02096
$$ 266614 -17138 -24009 -70672 -102751 -182978 -657934 -1348519 -1443415 -771623 -299692 -701788
31251g01788o23576k0433K87649m9674j64282K12855K71471j30452k6854P30964
$$ -701788 -1325364 -1345797 -1058148 -1107822 -1272104 -1059249 -787778 -918230 -945084 -214120
31241b14120Q84545l3204o22017J23260J035238O65888l63207n31007O0839J18812
$$ -214120 670425 637221 15204 138464 1173702 1839590 1476383 945376 1006215 1125027
31231A125027m87466o20383L1067M39685M6502l61864p8232L74776K14051l00266
$$ 1125027 637561 17178 48245 487930 534432 172568 94336 469112 683163 382897
31221C82897l35912J73093M39507k649o48616p19709j34425M95430O65825M60646
$$ 382897 46985 220078 659585 656936 8320 -711389 -845814 -350384 315441 776087
31211G76087K36512J40056Q5187j4537j76439l47576l40801l488M03586L33220
$$ 776087 1012599 1152655 1237842 1223305 1046866 699290 358489 355001 758587 1091807
31201A091807k80266p44206m76181J89543N15356L56662J14021j9732j51181k35686
$$ 1091807 811541 67335 -408846 -219303 296053 652715 766736 747004 595823 360137
31191C60137j63988j37775l45903m54423r0882L58871K23482l00549l29533L57193
$$ 360137 196149 58374 -287529 -741952 -832834 -473963 -250481 -551030 -880563 -523370
31181e23370J000418J011208O30568K68278m2497k99167l45282k73638l79191
$$ -523370 477048 1488256 2118824 2387102 2344605 2045438 1700156 1426518 1047327
31172A047327n40030l19522J63919K29961k70687o34241l93577J6383O5141j00916
$$ 1047327 507297 187775 351694 581655 310968 -323273 -716850 -700467 -635326 -736242
31162g36242j24816m8750j4654Q1258K23670J21079j89337j59879L90607P76818
$$ -736242 -861058 -909808 -924462 -843204 -619534 -498455 -687792 -847671 -457064 319754
31152C19754L62242m71267q16489l91621K71211N56993L19944j17159k84088m2419
$$ 319754 681996 210729 -605760 -997381 -726170 -169177 150767 33608 -250480 -292899
31142b92899K27770J87028J19270M16162O69606J40956q60980j116863k89385
$$ -292899 -65129 121899 241169 657331 1326937 1467893 606913 -509950 -799335
31133g99335M81675K74318l43853m26544r5796k263r8200O8173L65010L32494
$$ -799335 -317660 -43342 -387195 -813739 -909535 -911798 -1009998 -941825 -576815 -244321
31123b44321N2591p5229q2874j78448j20687L26462O71522L23286l37069m48217
$$ -244321 -191730 -266959 -349833 -528281 -648968 -322506 349016 672302 335233 -112984
31113a12984m1597O6642l01314l96288J61183P33299O68118K02413p7886j14895
$$ -112984 -154581 -87939 -389253 -785541 -624358 108941 777059 979472 901586 786691
31103G86691k23497m09314l33098J21138N65992M99297q4510n78833m14912K09028
$$ 786691 563194 153880 -179218 -58080 507912 1007209 922699 343866 -71046 137982
31093A37982N49998L18313M948J2192J7779l39492o59488l59655K74313M15436
$$ 137982 687980 1006293 1011241 1023433 1041212 701720 42232 -317423 -43110 372326
31083C72326l6301l06194N2339N28847M81911K6948k55213j42001M5064o0510
$$ 372326 336025 29831 82170 611017 1092928 1119876 864663 722662 767726 707216
31073G07216m01864n43469j99663L05882L66959j2921r4592M78734R37905M30211
$$ 707216 305352 -238117 -437780 -131898 235061 222140 127548 606282 1544187 1974398
31063A974398n67158q02521j15986L07723k14072q18253m99771L15079M94659
$$ 1974398 1407240 604719 488733 796456 582384 -235869 -735640 -420561 74098
31054G4098n3898m03773j64743L8314k13372l95711P186N50583N05453L5294o5688
$$ 74098 20200 -383573 -548316 -510002 -723374 -1119085 -1111899 -561316 -55863 -20569 -86257
31043h6257L77046O94079M32159p6537m01322n90440p06624m32223K93295P56121
$$ -86257 290789 984868 1417027 1340490 939168 348728 -357896 -790119 -496824 259297
31033B59297L20696n20447p40755k47082J03177p4403j97008J24795L56215p139
$$ 259297 579993 59546 -681209 -928291 -825114 -899517 -1096525 -971730 -615515 -622654
31023f22654m73513k38798N89401J120363Q31902O7330n03437n20536j24106K05988
$$ -622654 -1096167 -1334965 -745564 374799 1206701 1274031 770594 250058 125952 331940
31013C31940J05642k25929k63497N9860K23388l0217k54627q2903J12539r8136
$$ 331940 437582 211653 -51844 8016 231404 201187 -53440 -136343 -23804 -121940
31003a21940l63768j24615L46926L30124j08296j84469K67193M62797l3142n12094
$$ -121940 -485708 -610323 -263397 66727 -41569 -226038 41155 503952 470810 -41284
30993d1284j78643N84314P13928l0338p59591o85409q0639K52967Q1209j36791
$$ -41284 -219927 364387 1078315 1047977 288386 -397023 -477662 -224695 -143486 -280277
30983b80277o8397O9594L7439L8555K91493M94277K39295k44808l66159r6890
$$ -280277 -348674 -279080 -241641 -203086 88407 582684 821979 577171 211012 114122
30973A14122K5160j64863k26591M9041L02067L26812L77779M56254J25134n27413
$$ 114122 139282 -25581 -252172 -203131 98936 425748 803527 1259781 1384915 857502
30963H57502o38320P2759N87371R4791o07756l19640O20509Q90276K65496k42679
$$ 857502 219182 291941 879312 974103 366347 46707 667216 1557492 1822988 1580309
30953A580309j76738j49608m65489n65169j89759P5534j30515l55929k79458k76170
$$ 1580309 1403571 1253963 788474 223305 33546 109080 -21435 -377364 -656822 -932992
30943i32992n24148m83815J08647N80959L63545n7897J4498L51090L22723L6604
$$ -932992 -1457140 -1940955 -1832308 -1251349 -887804 -945701 -931203 -580113 -257390 -220786
30933b20786O0872L59141L57017q4118m79305m40242m0776M29285O33714L17648
$$ -220786 -159914 199227 556244 472126 -7179 -447421 -488197 -58912 574802 892450
30923H92450k95625n10637l7797M68826L09478k00342k81221J9878k1021n03451
$$ 892450 596825 86188 48391 517217 826695 626353 345132 365010 343989 -159462
30913a59462p14875l32917J08033K08654K96273O07238O68190J06526n26509m72534
$$ -159462 -874337 -1207254 -1099221 -890567 -594294 12944 681134 787660 261151 -211383
30903b11383P6365K91121j8348k12859P0547L71139K37114j6216J09701L48828
$$ -211383 -135018 156103 137755 -75104 -4557 366582 603696 587480 697181 1046009
30893A046009o936q89170j268214n12595O00919Q21505R6654m15970k6774N77988
$$ 1046009 1039073 149903 -1118311 -1630906 -1029987 -208482 -111828 -527798 -554572 23416
30883B3416M67908j63479m15975o1519K73726J83407k4855j4952N8168k7466j28658
$$ 23416 491324 327845 -88130 -149649 124077 307484 282629 267677 325845 298379 169721
30872A69721m4396J13422J42717N4924o5101k09368k70030n4735L11867L88433
$$ 169721 125325 238747 381464 436388 371287 161919 -108111 -162846 149021 537454
30862E37454Q1767j16934Q5196K28226j50091o18561m16103L09846O21049J55698
$$ 537454 619221 502287 587483 815709 665618 47057 -369046 -59200 561849 717547
30852G17547l76760k70839K49806N18997L50792P7628k5257P491m586j96821n11529
$$ 717547 340787 69948 319754 838751 1189543 1267171 1241914 1249405 1244819 1047998 536469
30841E36469o61880m40703p1209N7843r372Q5842K70039M0906n54386o54286J87015
$$ 536469 -125411 -566114 -637323 -579480 -588852 -503010 -232971 -192065 -746451 -1400737 -1213722
30830a213722J100762R60313m2866o80908l72911K24899L40125L7682j77683j25583
$$ -1213722 -112960 847353 804487 123579 -249332 -24433 315692 353374 175691 50108
30820E0108J3151O1617k2494j62966j76514L1952K55578K12181l8984k08408k42361
$$ 50108 63259 124876 102382 -60584 -237098 -205146 50432 262613 223629 15221 -227140
30809b27140k81999k12459K20616P82025Q17792J80491m37312m07667M4151L06505
$$ -227140 -509139 -721598 -500982 281043 1098835 1279326 842014 434347 478498 785003
30799G85003K22596M8047q4000j83061j36304J03459K46285M2365k28483j48446
$$ 785003 1007599 1055646 971646 788585 652281 755740 1002025 1044390 815907 667461
30789F67461P3555j62004p98017r71312k24813O73743O64482j49739o23438j30653
$$ 667461 741016 579012 -219005 -1190317 -1415130 -741387 -76905 -226644 -850082 -980735
30779i80735O29338O65079K4482m16402k14440K17709M01571L43840J36282l30065
$$ -980735 -351397 313682 338164 -78238 -292678 -74969 326602 670442 806724 476659
30769D76659q67074q11767N0051Q40539O23749k03156m11179K62934P62157L24994
$$ 476659 -390415 -1202182 -1152131 -311592 312157 109001 -302178 -39244 722913 1047907
30759A047907m50262o01425j41913J92500N4552k67760m30056l18313P0063N68017
$$ 1047907 597645 -3780 -145693 46807 101359 -166401 -596457 -914770 -844707 -276690
30749b76690P63203L78890k97208o52999m10182J32760M55233K88310j73845m57550
$$ -276690 486513 865403 568195 -84804 -494986 -362226 93007 381317 207472 -250078
30739b50078l13995k4525R17j53680o7836K63762L54566J7807l07155k48560l224
$$ -250078 -564073 -588598 -587681 -741361 -809197 -545435 -190869 -173062 -480217 -728777 -732001
30728g32001J39139K46976L72533K61399j15628k42429J89858O40969M34682k26919
$$ -732001 -592862 -345886 26647 288046 172418 -70011 119847 760816 1195498 968579
30718I68579n85729m00835p6017Q1272R8006l2593l33292n08490k07346L64705
$$ 968579 382850 -17985 -94002 -12730 85276 52683 -280609 -789099 -996445 -631740
30708f31740O04278L21482m3473o3130J91890L64904K25207j56466m61478m24310
$$ -631740 -27462 294020 250547 187417 379307 744211 969418 812952 351474 -72836
30698g2836j97110j92747m36724m49214L995N00295O15743M80099K90885j14261
$$ -72836 -269946 -462693 -899417 -1348631 -1344636 -844341 -228598 251501 542386 428125
30688D28125o65174p14682k6089N34910J98866m10850k55178L65539L13460m62526
$$ 428125 -237049 -951731 -977820 -442910 -244044 -654894 -910072 -544533 -231073 -693599
30678f93599r03960o20604k58261o4983M15870J019723Q75151O1717j81694M89493
$$ -693599 -1597559 -2218163 -2476424 -2541407 -2125537 -1105814 -230663 -168946 -350640 138853
30668A38853Q02340K4454o87133k37089N06894K17164o17346n92805K01468M42046
$$ 138853 941193 965647 278514 41425 548319 765483 148137 -444668 -243200 198846
30658A98846j51210n05154r3194L92381L93430J63520r4790n22978q15257l66456
$$ 198846 47636 -457518 -550712 -158331 235099 398619 303829 -219149 -1034406 -1400862
30648a400862M81061N75276k20628n90859J92879J006410O01188m22538n98079
$$ -1400862 -919801 -344525 -565153 -1156012 -963133 43277 644465 221927 -376152
30639c76152J21913M30543k17366q67729o12577J98788O91974O16192K82348o5715
$$ -376152 -254239 176304 -41062 -908791 -1521368 -1322580 -630606 -14414 267934 202219
30629B02219l06838k68477R334J08540k08241m96681j96742M33324N40621j02364
$$ 202219 -104619 -373096 -363762 -255222 -463463 -960144 -1156886 -723562 -182941 -285305
30619b85305o83331m29491L66124Q13544N98361J74881n6449j95317l97192m84832
$$ -285305 -968636 -1398127 -1032003 -218459 379902 554783 498334 303017 -94175 -579007
30609e79007k58906J16794L18749K76210J52013L8821j03996k65751l24446j94521
$$ -579007 -837913 -721119 -402370 -126160 25853 64674 -39322 -305073 -629519 -824040
30599h24040N0666K28112K17453J01973Q8084K24400K96935J30319j22536j90808
$$ -824040 -773374 -545262 -327809 -225836 -137752 86648 383583 513902 391366 200558
30589B00558p8494O790J2953J2279q4859l59430m82785l9245O65791P40313p2030
$$ 200558 122064 128854 141807 154086 69227 -290203 -772988 -812233 -146442 593871 521841
30578E21841q76980p62612L5289O17306O57994N18017L85418M5033m97447q03789
$$ 521841 -355139 -1117751 -1082462 -465156 192838 710855 1096273 1141306 643859 -159930
30568a59930n82419l9066M82740Q25412Q63652M36996l23959q90193q29593k82803
$$ -159930 -742349 -781415 -298675 526737 1390389 1827385 1503426 613233 -216360 -499163
30558d99163K40310M39901M32586M27029L84668J31536k39659l14610R0732M88486
$$ -499163 -258853 181048 613634 1040663 1425331 1556867 1317208 1002598 1093330 1581816
30548A581816K29765n41391r43009n41856N7558J72881L0264J83510M27128J61043
$$ 1581816 1811581 1270190 327181 -214675 -157117 15764 46028 229538 656666 817709
30538H17709l95576l76594K66943N05511j81097q87857o16821K10949M44611n9568
$$ 817709 422133 45539 312482 817993 636896 -250961 -867782 -656833 -212222 -271790
30528b71790l78633o0384K69980M4127l45786k47924K12444L78918M9767l46162
$$ -271790 -650423 -710807 -440827 -396700 -742486 -990410 -777966 -399048 -349281 -695443
30518f95443m47233l10439m7183L81203Q18578Q17201K46305l12262k35099K44288
$$ -695443 -1142676 -1453115 -1500298 -1119095 -300517 516684 762989 450727 215628 459916
30508D59916L31287j67677n72966l82699J4703P1603j3452K46987O07140L26761
$$ 459916 791203 623526 50560 -332139 -317436 -245833 -259285 -12298 594842 921603
30498I21603n84632j139667o63301K73738O14886J27116m80077n27929m6874M68913
$$ 921603 336971 -802696 -1465997 -1192259 -577373 -450257 -930334 -1458263 -1505137 -1036224
30488a036224O59539N48452L17252j8238n42189j013235q37631J57940J155385
$$ -1036224 -376685 171767 489019 470781 -71408 -1084643 -1922274 -1764334 -608949
30479f08949J136883K21156m47139k57805J49437L4110l50173l67354m5474K01151
$$ -608949 527934 749090 301951 44146 193583 227693 -122480 -489834 -535308 -334157
30469c34157L63084N53889M09703k97035q22452l31521N90601N47506n19451j122218
$$ -334157 28927 582816 992519 695484 -126968 -458489 132112 679618 160167 -962051
30459i62051m77661L84198L88680L091R9691L48376P121m86512j56724P12858
$$ -962051 -1439712 -1055514 -666834 -663743 -564052 -215676 -208555 -695067 -851791 -138933
30449a38933Q87081J67975l30756l9909K62033r1488n55873l70632K25462M73631
$$ -138933 748148 916123 585367 545458 807491 716003 160130 -210502 14960 488591
30439D88591J86185k50057n10312m83938j79894J45960J55835k9239N3350L56743
$$ 488591 674776 424719 -85593 -569531 -749425 -603465 -447630 -476869 -423519 -66776
30429f6776K71782k83716n41585j27810K35123m7360l72867p428N51776M11054
$$ -66776 205006 -78710 -620295 -748105 -512982 -560342 -933209 -940637 -388861 22193
30419B2193j23346q3151M14357L72226k71826n07415m8707J93282j94691l78589
$$ 22193 -101153 -184304 230053 602279 330453 -176962 -225669 -32387 -227078 -605667
30409f05667J50126N60066J13144n01439l16077L16902M21052K0516j31613J4815
$$ -605667 -455541 104525 217669 -283770 -599847 -282945 138107 158623 27010 41825
30399D1825j23000n05696m87427l0238K15874R5628J24394L42179J22574n37036
$$ 41825 -81175 -586871 -1074298 -1104536 -888662 -793034 -668640 -326461 -203887 -740923
30389g40923o60186J73049R33867O16454k06345l19165K12777K58526m47336q55251
$$ -740923 -1401109 -1228060 -294193 322261 115916 -203249 9528 268054 -179282 -1034533
30379a034533l20214L51889J90901m35097m59608K11855O37023L52086O344K05433
$$ -1034533 -1354747 -1002858 -811957 -1247054 -1706662 -1494807 -857784 -505698 -499354 -293921
30369b93921N18704K39332l80278m46092J78117O02571K28746l62544k94517L17738
$$ -293921 224783 464115 83837 -362255 -184138 418433 647179 284635 -9882 307856
30359C07856N87114J55393l88787m58505k43098k33852l99619l05112J08553L52783
$$ 307856 894970 1050363 661576 203071 -40027 -273879 -673498 -978610 -870057 -517274
30349e17274J01826k95882k85736J07579L11038K0408l57062k65586K40437O08287
$$ -517274 -415448 -711330 -997066 -889487 -578449 -558041 -915103 -1180689 -940252 -331965
30339c31965N37130K48858P174k21495m58785m47680l1560M40619M82005J30294
$$ -331965 205165 454023 461197 239702 -219083 -666763 -698323 -257704 224301 354595
30329C54595j37252j01412j1717o5588r6474N3127K01400J19044r8750k04694
$$ 354595 217343 115931 104214 38626 -57848 -4721 196679 315723 216973 12279
30319A2279j55563o9353j3391o1982l37873o96628o18413J34924R14978Q14872
$$ 12279 -143284 -212637 -226028 -288010 -625883 -1322511 -1940924 -1806000 -891022 -76150
30309g6150q3328o98817l73550K98344M20126J4229k62958k10654j71575k20847
$$ -76150 -159478 -858295 -1231845 -933501 -513375 -499146 -762104 -972758 -1144333 -1365180
30299a365180k9739M14282O37363M17652J11075K876j08388l61338m08548l416
$$ -1365180 -1394919 -980637 -343274 74378 185453 188329 79941 -281397 -689945 -693361
30289f93361M18312K89752k31526m97406k78364P5657K59349K86200K03225L3259
$$ -693361 -275049 14703 -216823 -714229 -992593 -916936 -657587 -371387 -168162 -134903
30279a34903n775K90087O42565N05217j54273p15927o82260k11171K38088M01702
$$ -134903 -140678 149409 791974 1297191 1142918 426991 -255269 -466440 -228352 173350
30269A73350K32087j60920m17700j93052K79791L24093k09522n75246j58306N38979
$$ 173350 405437 244517 -173183 -366235 -86444 237649 28127 -547119 -705425 -166446
30259a66446N30189k44839p93835m00779M68542Q16122L15121m17473o00854j13805
$$ -166446 363743 118904 -674931 -1075710 -607168 208954 524075 106602 -494252 -608057
30249f08057M65937N40406J18702l05190m19741l67889k74292R5035Q13991J245669
$$ -608057 -142120 398286 516988 211798 -207943 -575832 -850124 -755089 58902 1304571
30239A304571O77620m88214r26906j24583P38210L12153r46223j274370m9575
$$ 1304571 1982191 1493977 567071 442488 1180698 1492851 546628 -727742 -777317
30230g77317J286286J170726p3242r30232p80837l06580r7961K3418K02199J27620
$$ -777317 508969 1679695 1606453 676221 -104616 -411196 -509157 -485739 -283540 -155920
30220a55920k09389k41053J85506L59477j26064n41591j53118N21349N65035J72946
$$ -155920 -365309 -606362 -420856 -61379 -187443 -729034 -882152 -360803 204232 377178
30210C77178J41351K99253j51334r02310p18503M22031R41095M9233r09424m88357
$$ 377178 518529 817782 666448 -235862 -954365 -532334 408761 457994 -451430 -939787
30200i39787O62845Q93358K5928o55574m61542K7382K37326L10579L88746K40423
$$ -939787 -276942 616416 642344 -13230 -474772 -447390 -210064 100515 489261 729684
30190G29684r9407j72348R3152J52948k22368m77883j69490K82986K79674k929
$$ 729684 630277 457929 551081 704029 481661 3778 -165712 117274 396948 394019
30180C94019K8517L69552M43609O2398k89447k69249k26162n87852j049618q73597
$$ 394019 422536 792088 1235697 1298095 1008648 739399 513237 -74615 -1124233 -1997830
30170a997830M2955Q47742O95688k18725q80073o23054J85967O70719M24745j55323
$$ -1997830 -1954875 -1107133 -411445 -630170 -1510243 -2133297 -1947330 -1276611 -851866 -1007189
30160a007189m01908r4705L83883N57544L93798K05091J21375j4651j89702r6971
$$ -1007189 -1409097 -1503802 -1119919 -562375 -168577 36514 157889 143238 -46464 -143435
30150a43435K94303M96925K30342n1805R4764K71453r4657o10134m35647K20185
$$ -143435 150868 647793 878135 826330 921094 1192547 1097890 487756 52109 272294
30140B72294K84276m16943q10468l41418J67878L8969j07952L63476P69156K63427
$$ 272294 556570 139627 -670841 -1012259 -844381 -805412 -913364 -549888 219268 482695
30130D82695n04874l01758O30329Q74640K4852q06687p34474j28711L19262M84631
$$ 482695 -22179 -323937 306392 1181032 1205884 399197 -335277 -463988 -144726 339905
30120C39905M47181J52486k22489l04273j58847j88313k85079N7323O37251N56936
$$ 339905 787086 939572 717083 412810 253963 65650 -219429 -162106 475145 1032081
30110A032081k97695q09491k50980N67401N43500q1312k60287K00683N15721K32626
$$ 1032081 734386 -75105 -326085 241316 784816 703504 443217 643900 1159621 1392247
30100A392247k28801l69310k27099p0283J0192M2228M6243P0560J34629J37737
$$ 1392247 1163446 794136 567037 496754 506946 549174 595417 665977 800606 938343
30090I38343J2175j20212j56677k32563m48284n32003j70283L81419M78362r885
$$ 938343 950518 830306 673629 441066 -7218 -539221 -709504 -328085 150277 140392
30080A40392l97694p1065O14332P36398K3084p78942q78462l83003L8288J07080
$$ 140392 -257302 -328367 285965 1022363 1045447 266505 -611957 -994960 -956672 -849592
30070h49592N4308k3279k49373l71757J40074J067496J279073K28357r97729r70133
$$ -849592 -795284 -818563 -1067936 -1439693 -1299619 -232123 1046950 1275307 277578 -692555
30060f92555J51658R37112P03660J39563j09942l18862p55463r10496l48886L83327
$$ -692555 -540897 396215 1099875 1239438 1129496 810634 55171 -855325 -1204211 -820884
30050h20884M93030J34989Q4798M47044M82754j96833q97222o50288N09797J452944
$$ -820884 -327854 -192865 -108067 338977 821731 624898 -272324 -922612 -412815 1040129
30040A040129J203531N9166q04909p75942m00199l77037n26189k83745K24665
$$ 1040129 2243660 2302826 1497917 721975 321776 -55261 -581450 -865195 -640530
30031f40530L86017J54296M9743J53364j3260n00553o97518l14118K12185N40286
$$ -640530 -254513 -100217 -50474 102890 89630 -410923 -1108441 -1422559 -1210374 -670088
30021f70088Q23246R97298N95543k86208p48233l81020N8973r9968l97253k07292
$$ -670088 153158 1150456 1745999 1459791 711558 330538 389511 289543 -107710 -315002
30011c15002J13899q225k22179O1499M72965L13468j48222j99854k6273k23100
$$ -315002 -201103 -209328 -431507 -370008 102957 416425 268203 68349 42076 -181024
30001a81024l89598K80249J223402J027729j67395n72234M54520J244036L73233
$$ -181024 -570622 -290373 933029 1960758 1793363 1221129 1675649 2919685 3292918
29992C292918j135855j445862n73658M9621p1452j52239J95366M29352K63817
$$ 3292918 2157063 711201 137543 187164 115712 -36527 158839 588191 852008
29983H52008J25509J83950l776n11615o35386J2890P14264N54760l30120r84944
$$ 852008 977517 1161467 1157691 646076 10690 23580 737844 1292604 962484 -22460
29973b2460q23128j14950N10612O38283K70790j94575k75449O7774L44651J79027
$$ -22460 -845588 -960538 -449926 188357 459147 264572 -10877 56897 401548 580575
29963E80575j85023l00364j78695j35539j89015j15527J4708p8337k76435j29049
$$ 580575 395552 95188 -83507 -219046 -408061 -523588 -508880 -587217 -863652 -992701
29953i92701L75795O88932N21254K05761J4093k46640o01426n51343R3552O18260
$$ -992701 -616906 72026 593280 799041 813134 566494 -34932 -586275 -492723 125537
29943A25537L43245k97456l89995R8694M22997K81863P2447K7622n6008k30034
$$ 125537 468782 171326 -218669 -119975 303022 584885 657332 684954 628946 398912
29933C98912k89534k53055k60180j06690L56824N78652K2305o66773l97482N40398
$$ 398912 109378 -143677 -403857 -510547 -153723 424929 447234 -219539 -617021 -76623
29923g6623P71642O1710l29991J02628K47671m67317q05958J47906J143890O63402
$$ -76623 695019 756729 426738 529366 777037 309720 -496238 -348332 795558 1458960
29913A458960n48072o80672K50934O51434J0844n81817m60586j48578m131K95951
$$ 1458960 910888 230216 481150 1132584 1143428 561611 101025 -47553 -51684 244267
29903B44267O79564N27579q3486k83827J17843K91945j34472m60630k05233J09092
$$ 244267 923831 1451410 1367924 1084097 1201940 1493885 1359413 898783 693550 802642
29893H02642k5703k95922k91865j62794q7781R2006L25836K45828p3195r1859
$$ 802642 776939 481017 189152 26358 -61423 30583 356419 602247 529052 437193
29883D37193J80987R1428m39542o19860j11486L73323K68449n8994j99634l39438
$$ 437193 618180 709608 270066 -349794 -461280 -87957 180492 121498 -78136 -417574
29873d17574m87439j65588N23884O52537j9621m49397j8622L97531L4394l56101
$$ -417574 -905013 -1070601 -546717 105820 86199 -363198 -381820 15711 50105 -305996
29863c05996Q1279O63752L80180k70440k34066J61049n5156n06043j09951P19022
$$ -305996 -224717 439035 819215 548775 314709 475758 420602 -85441 -195392 523630
29853E23630N13847o92132j236797m72861L41959K64589k248K66750M73725j4254
$$ 523630 1037477 345345 -891452 -1364313 -1022354 -757765 -760013 -493263 -19538 -33792
29843c3792n28374k09144M79961N02522j16099m68395j94575J96446K47086M7434
$$ -33792 -562166 -771310 -291349 211173 95074 -373321 -567896 -371450 -124364 -76930
29833g6930j27360j51063m4606N0432p133j03324L2190L44633M15998R1346k22007
$$ -76930 -204290 -355353 -399959 -349527 -356660 -459984 -427794 -83161 332837 424183 202176
29822B02176j17434K61506M60400K52982k08672n49778m26939J03197M99100L46949
$$ 202176 84742 346248 806648 1059630 850958 301180 -125759 -22562 476538 823487
29812H23487n8257j80768r9439k58034n15576k87714L42992N79334J73365j69996
$$ 823487 765230 584462 485023 226989 -288587 -576301 -233309 346025 519390 349394
29802C49394K0880K75074Q9943k70586l84482l19011j79429K11743O75235N66369
$$ 349394 370274 645348 735291 464705 80223 -238788 -418217 -206474 468761 1035130
29792A035130r5090l09569L37177P75430J11888p67138n50971L19933M03485l04694
$$ 1035130 940040 630471 967648 1743078 1854966 1087828 536857 856790 1260275 955581
29782I55581m42309K89916N76219k60360j096775q38125m3829K15932L4727J10522
$$ 955581 513272 803188 1379407 1119047 22272 -815853 -859682 -643750 -609023 -498501
29772d98501L29862J13811l06138j66125M37425N48820j37614p24965m07543M17719
$$ -498501 -168639 -54828 -360966 -527091 -89666 459154 321540 -403425 -810968 -393249
29762c93249Q01409M95913L2813j58275j64339j95857k52524k76191k95828k68542
$$ -393249 408160 904073 936886 778611 614272 418415 165891 -110300 -406128 -674670
29752f74670l6495L76922O41754N01401J03752k49384m69289n36985k72199L20188
$$ -674670 -711165 -334243 307511 808912 912664 663280 193991 -342994 -615193 -295005
29742b95005P01125L89447k00477k06425L77952O42526J85115k85338j78262M7031
$$ -295005 406120 795567 595090 388665 766617 1409143 1594258 1308920 1130658 1177689
29732A177689j53430l48391K6856M29746l0367r67394j101366j98186N76005M10875
$$ 1177689 1024259 675868 702724 1132470 1102103 134709 -966657 -1164843 -588838 -177963
29722a77963j37480k42925N1800K82523L55099L38975R5316l47027n41508k44677
$$ -177963 -315443 -558368 -506568 -224045 131054 470029 565345 218318 -323190 -567867
29712e67867J29630J11987j54446k50204j09861Q0423K70649M46273M47390K43562
$$ -567867 -438237 -326250 -480696 -730900 -840761 -760338 -489689 -43416 403974 647536
29702F47536J05875J97861K88416J46475r6506k34583k95570l26101k45802j25029
$$ 647536 753411 951272 1239688 1386163 1289657 1055074 759504 433403 187601 62572
29692F2572j66670k26127Q2614N77950N32307j30868m91279m6889M07019J16806
$$ 62572 -104098 -330225 -247611 330339 862646 731778 240499 193610 600629 717435
29682G17435k91178Q1313P04908M35295m42494n79611J44352L74442m05773r59735
$$ 717435 426257 507570 1212478 1647773 1205279 625668 770020 1144462 738689 -221046
29672b21046l64872M70583L58713k70135k49677L47889M52614j83095o57434l58481
$$ -221046 -585918 -115335 243378 -26757 -276434 71455 524069 340974 -316460 -674941
29662f74941K91810O38411N34727J36164l86220p41713o38631j71697K64927M71640
$$ -674941 -383131 255280 790007 926171 539951 -201762 -840393 -1012090 -747163 -275523
29652b75523M97448L12980p5678k79773Q3892O34597N32325k96144r07435o19752
$$ -275523 221925 534905 459227 179454 263346 897943 1430268 1134124 226689 -393063
29642c93063Q6979L78948K16636J26091K48123K88513J87962J67811J76024q0826
$$ -393063 -306084 72864 289500 415591 663714 952227 1140189 1308000 1484024 1403198
29632A403198n01175n69362j40455K62427J89718j16143j69220J9406N4659j52223
$$ 1403198 902023 332661 192206 454633 644351 528208 358988 378394 433053 280830
29622B80830k23839J08142N55810N78265O1564m67184m33399K2022J45820m00517
$$ 280830 56991 165133 720943 1299208 1360772 893588 460189 482211 628031 227514
29612B27514r39611o36363K48847O13928O3857n19788k77552M23915O41674K14424
$$ 227514 -712097 -1348460 -1099613 -485685 -421828 -941616 -1219168 -795253 -153579 60845
29602F0845k19394k72779j58667q3681M1958K38638L30361K62030J43141j6422
$$ 60845 -158549 -431328 -589995 -673676 -631718 -393080 -62719 199311 342452 326030
29592C26030k31372l02866j02005N9077j19248k77132J09091P16461P04834N3402
$$ 326030 94658 -208208 -310213 -251136 -370384 -647516 -538425 178036 882870 936272
29582I36272l70407k08923n9161k34661j96487K56735L68522k07040m90402K85629
$$ 936272 565865 356942 297781 63120 -133367 123368 491890 284850 -205552 80077
$$ [...]
##END NTUPLES=NMR SPECTRUM
##END=
