##TITLE=31Pdec_LY-11Dix.2B
 CD3CN, 24 sc
 2.06.2021
##JCAMPDX= 6.0         $$ Bruker NMR JCAMP-DX V2.0
##DATA TYPE= NMR SPECTRUM
##DATA CLASS= NTUPLES
##ORIGIN= UXNMR, Bruker Analytische Messtechnik GmbH
##OWNER= root
$$ XWIN-NMR		Version 3.5
$$ Wed Jun  2 09:39:57 2021 Russian Standard Time (UT+4h)  she@DPX200
##.OBSERVE FREQUENCY= 81.013821
##.OBSERVE NUCLEUS= ^31P
##.ACQUISITION MODE= SIMULTANEOUS
##.ACQUISITION SCHEME= undefined
##.AVERAGES= 24
##.DIGITISER RES= 16
##SPECTROMETER/DATA SYSTEM= spect
##.PULSE SEQUENCE= zgpg30
##.SOLVENT NAME= CDCl3
##.SHIFT REFERENCE= (INTERNAL, CDCl3, 0, 248.564)
##AUDIT TRAIL= $$ (NUMBER, WHEN, WHO, WHERE, WHAT)
$$ ##TITLE= Audit trail, XWIN-NMR		Version 3.5
$$ ##JCAMPDX= 5.01
$$ ##ORIGIN= Bruker BioSpin GmbH
$$ ##OWNER= she
$$ F:/spectra/data/she/nmr/P31/1/pdata/1/auditp.txt
$$ ##AUDIT TRAIL=  $$ (NUMBER, WHEN, WHO, WHERE, WHAT)
(   1,<2021-06-02 09:38:02.71 +0400>,<she>,<DPX200>,
      <created by zg, POWCHK disabled, PULCHK disabled
       configuration hash MD5:
       00 E9 B6 7A A2 85 ED C7 34 08 36 98 17 FE 4E 26
       data hash MD5: 32K
       73 7C B8 82 F0 19 05 4F 4B C0 CD CB E9 9F E8 BB>)
(   2,<2021-06-02 09:38:27.71 +0400>,<she>,<DPX200>,
      <Start of raw data processing
       efp BC_mod = 2 LB = 1 FT_mod = 6 PKNL = 1 PHC0 = -5850.897 PHC1 = 52.27266 SI = 64K 
       data hash MD5: 64K
       89 B0 2E FD 08 8F E5 E9 54 9E 49 89 25 C7 D0 D3>)
(   3,<2021-06-02 09:39:07.65 +0400>,<she>,<DPX200>,
      <pk PHC0 = -49.79771 PHC1 = 89.59992 
       data hash MD5: 64K
       17 BA 7C E9 A0 EC CA 7F 5C AC B7 00 AA EF B6 17>)
(   4,<2021-06-02 09:39:10.42 +0400>,<she>,<DPX200>,
      <abs ABSG = 5 
       data hash MD5: 64K
       81 21 A9 7C F4 B6 EB 8B 11 66 E5 93 2C 67 47 32>)
$$ ##END=
$$ 
$$ hash MD5
$$ A5 D4 0F 65 EA DC 32 E1 38 2E 1C CE 7B 10 A8 2C
##$RELAX= 
##$RELAX= 
##$RELAX= 
##$RELAX= 
##$RELAX= 
##$RELAX= 
##$RELAX= 
##$RELAX= 
$$ Bruker specific parameters
$$ --------------------------
##$DU= <F:/spectra>
##$EXPNO= 1
##$NAME= <P31>
##$PROCNO= 1
##$TYPE= <nmr>
##$USER= <she>
##$AMP= (0..31)
100 100 100 100 100 100 100 100 100 100 100 100 100 100 100 100 100 100 
100 100 100 100 100 100 100 100 100 100 100 100 100 100 
##$AQSEQ= 0
##$AQ_mod= 1
##$AUNM= <au_zg>
##$AUTOPOS= <>
##$BF1= 81.014009
##$BF2= 200.13
##$BF3= 200.13
##$BF4= 200.13
##$BF5= 200.13
##$BF6= 200.13
##$BF7= 200.13
##$BF8= 200.13
##$BYTORDA= 1
##$CFDGTYP= 0
##$CFRGTYP= 5
##$CHEMSTR= <none>
##$CNST= (0..31)
1 1 145 1 1 1 1 1 1 1 1 1 1 1 1 1 1 1 1 1 1 1 1 1 1 1 1 1 1 1 1 1 
##$CPDPRG= <waltz16>
##$CPDPRG1= <>
##$CPDPRG2= <waltz16>
##$CPDPRG3= <>
##$CPDPRG4= <mlev>
##$CPDPRG5= <mlev>
##$CPDPRG6= <mlev>
##$CPDPRG7= <mlev>
##$CPDPRG8= <mlev>
##$CPDPRGB= <>
##$CPDPRGT= <>
##$D= (0..31)
0 1 0 0 0 0 0 0 0 0 0 0.03 2e-05 3e-06 0 0 0 0 0 0 0 0 0 0 0 0 0 0 0 0 
0 0 
##$DATE= 1622612282
##$DBL= (0..7)
120 120 120 11 120 120 24 19 
##$DBP= (0..7)
150 150 150 150 150 150 150 150 
##$DBP07= 0
##$DBPNAM0= <>
##$DBPNAM1= <>
$$ [...]
##$SUBNAM3= <"">
##$SUBNAM4= <"">
##$SUBNAM5= <"">
##$SUBNAM6= <"">
##$SUBNAM7= <"">
##$SUBNAM8= <"">
##$SUBNAM9= <"">
##$SW= 501.771253377433
##$SWIBOX= (0..15)
0 1 3 0 0 0 0 0 0 0 0 0 0 0 0 0 
##$SW_h= 40650.406504065
##$TD= 32768
##$TD0= 1
##$TE= 0
##$TE2= 300
##$TE3= 300
##$TEG= 300
##$TL= (0..7)
0 120 53 12 22 120 120 120 
##$TP= (0..7)
150 150 150 150 150 150 150 150 
##$TP07= 0
##$TPNAME0= <>
##$TPNAME1= <>
##$TPNAME2= <>
##$TPNAME3= <>
##$TPNAME4= <>
##$TPNAME5= <>
##$TPNAME6= <>
##$TPNAME7= <>
##$TPOAL= (0..7)
0.5 0.5 0.5 0.5 0.5 0.5 0.5 0.5 
##$TPOFFS= (0..7)
0 0 0 0 0 0 0 0 
##$TUNHIN= 0
##$TUNHOUT= 0
##$TUNXOUT= 0
##$USERA1= <user>
##$USERA2= <user>
##$USERA3= <user>
##$USERA4= <user>
##$USERA5= <user>
##$V9= 5
##$VALIST= <valist>
##$VCLIST= <CCCCCCCCCCCCCCC>
##$VD= 0
##$VDLIST= <DDDDDDDDDDDDDDD>
##$VPLIST= <PPPPPPPPPPPPPPP>
##$VTLIST= <TTTTTTTTTTTTTTT>
##$WBST= 1024
##$WBSW= 4
##$XGAIN= (0..3)
0 0 0 0 
##$XL= 0
##$YL= 0
##$YMAX_a= 4401
##$YMIN_a= -15882
##$ZGOPTNS= <>
##$ZL1= 120
##$ZL2= 120
##$ZL3= 120
##$ZL4= 120
##$ABSF1= 248.5645
##$ABSF2= -253.2056
##$ABSG= 5
##$ABSL= 3
##$ALPHA= 0
##$AQORDER= 0
##$ASSFAC= 0
##$ASSFACI= 0
##$ASSFACX= 0
##$ASSWID= 0
##$AUNMP= <proc_1d>
##$AZFE= 0.1
##$AZFW= 0.5
##$BCFW= 0
##$BC_mod= 2
##$BYTORDP= 0
##$COROFFS= 0
##$CY= -3
##$DATMOD= 1
##$DC= 0
##$DFILT= <>
##$DTYPP= 0
##$F1P= 0
##$F2P= 0
##$FCOR= 1
##$FTSIZE= 65536
##$FT_mod= 6
##$GAMMA= 0
##$GB= 0
##$INTBC= 1
##$INTSCL= 5.30512e-09
##$ISEN= 30
##$LB= 1
##$LEV0= 0
##$LPBIN= 0
##$MAXI= 10000
##$MC2= 0
##$MEAN= 0
##$ME_mod= 0
##$MI= 50
##$NCOEF= 0
##$NC_proc= -3
##$NLEV= 6
##$NOISF1= 182.463
##$NOISF2= 159.3651
##$NSP= 0
##$NTH_PI= 0
##$NZP= 0
##$OFFSET= 248.5645
##$PC= 4
##$PHC0= -5900.695
##$PHC1= 141.8726
##$PH_mod= 1
##$PKNL= yes
##$PPARMOD= 0
##$PSCAL= 0
##$PSIGN= 0
##$REVERSE= no
##$SF= 81.014009
##$SI= 65536
##$SIGF1= 159.3651
##$SIGF2= -187.1042
##$SINO= 113.3802
##$SIOLD= 16384
##$SREGLST= <1H.CDCl3>
##$SSB= 0
##$STSI= 65536
##$STSR= 0
##$SW_p= 40650.406504065
##$SYMM= 0
##$S_DEV= 0
##$TDeff= 32768
##$TDoff= 0
##$TI= <>
##$TILT= no
##$TM1= 0
##$TM2= 0
##$TOPLEV= 0
##$USERP1= <user>
##$USERP2= <user>
##$USERP3= <user>
##$USERP4= <user>
##$USERP5= <user>
##$WDW= 1
##$XDIM= 65536
##$YMAX_p= 334720328
##$YMIN_p= -6069655
$$ End of Bruker specific parameters
$$ ---------------------------------
##NTUPLES= NMR SPECTRUM
##VAR_NAME=  FREQUENCY,     SPECTRUM/REAL,   SPECTRUM/IMAG
##SYMBOL=    X,             R,               I
##VAR_TYPE=  INDEPENDENT,   DEPENDENT,       DEPENDENT
##VAR_FORM=  AFFN,          ASDF,            ASDF
##VAR_DIM=   65536,         65536,           65536
##UNITS=     HZ,            ARBITRARY UNITS, ARBITRARY UNITS
##FACTOR=    0.620285442955139, 1,           1
##FIRST=     20137.2065510759, 0,            0
##LAST=      -20513.1999529892, 0,           0
##MIN=       -20513.1999529892, -6069655,    0
##MAX=       20137.2065510759, 334720328,    0
$$ Real data points
##PAGE= N=1
##DATA TABLE= (X++(R..R)), XYDATA
$$ [...]
$$ plain form
35816 -504903 -260247 9898 56638 -7964 -24491 17810 82638 133584 67369 -201471 -569297
35805 -569297 -814831 -852018 -769522 -622643 -359893 -7606 231308 182489 -70460 -274488
35795 -274488 -297118 -219647 -133765 20890 311874 597361 640747 450580 306375 359116
35785 359116 406250 228215 -38327 -116938 -47493 -99708 -278028 -283151 -32252 145535 1891
35774 1891 -253538 -303809 -197078 -175459 -214642 -76705 243594 448696 347756 89123
35764 89123 -81474 -101327 -44942 54836 227454 461951 655306 674129 491013 263298
35754 263298 187089 225501 115853 -238242 -537389 -463558 -176291 -135599 -444548 -699391
35744 -699391 -593198 -348613 -327210 -452693 -346056 62584 388370 302920 -58227 -307409
$$ packed form
35816e04903K44656K70145M6740o4602j6527M2301O4828N0946o6215k68840l67826
35805e69297k45534l7187Q2496J46879K62750L52287K38914m8819k52949k04028
35795b74488k2630P7471Q5882J54655K90984K85487M3386j90167j44205N2741
35785C59116M7134j78035k66542p8611O9445n2215j78320n123K50899J77787j43644
35774A891k55429n0271J06731K1619l9183J37937L20299K05102j00940k58633
35764H9123j70597j9853N6385R9778J72618K34497J93355J8823j83116k27715
35754B63298p6209L8412j09648l54095k99147P3831K87267M0692l08949k54843
35744f99391J06193K44585K1403j25483J06637M08640L25786q5450l61147k49182
$$ plain form
35734 -307409 -253932 -13607 214877 327995 302545 138127 -131511 -409359 -563371 -515792
35724 -515792 -325824 -155886 -95691 -31829 211493 577173 748807 528466 149604 41373
35714 41373 289909 513736 349608 -79766 -322336 -158273 152441 220278 14372 -110466
35704 -110466 124738 543958 714643 498762 221685 189337 223724 -64574 -625669 -942127
35694 -942127 -729204 -325922 -183333 -252995 -199096 -13711 -16412 -302416 -594719 -697784
35684 -697784 -733080 -798751 -736837 -458670 -229247 -331921 -608996 -646339 -359079 -99072
35674 -99072 -139584 -303228 -236930 91947 345696 228151 -195767 -630112 -887502 -993487
35664 -993487 -1007306 -902419 -671321 -405991 -177883 43196 244616 294417 177925 156450
$$ packed form
35734c07409N3477K40325K28484J13118k5450j64418k69638k77848j54012M7579
35724e15792J89968J69938O0195O3862K43322L65680J71634k20341l78862j08231
35714D1373K48536K23827j64128m29374k42570J64063L10714O7837k05906j24838
35704a10466K35204M19220J70685k15881k77077l2348L4387k88298n61095l16458
35694i42127K12923M03282J42589o9662N3899J85385k701k86004k92303j03065
35684f97784l5296o5671O1914K78167K29423j02674k77075l7343K87260K60007
35674i9072m0512j63644O6298L28877K53749j17545m23918m34345k57390j05985
35664i93487j3819J04887K31098K65330K28108K21079K01420M9801j16492k1475
$$ plain form
35654 156450 431391 755637 703005 290247 -30634 -40267 -23264 -235729 -484376 -485389 -333569
35643 -333569 -306441 -422606 -504047 -506981 -484251 -357759 -43995 289894 398879 316649 253155
35632 253155 218988 74352 -102837 -62043 183395 308147 139072 -134120 -296948 -362008
35622 -362008 -372711 -253657 -23603 100666 9844 -103647 -57621 19200 -60470 -164277
35612 -164277 -16889 325389 487526 288275 -18520 -103449 34021 148357 105845 7434
35602 7434 -4253 64535 82721 -50279 -293079 -486829 -503629 -392035 -333176 -398484 -412267
35591 -412267 -182874 157551 249346 10735 -183919 -16832 288791 294185 17136 -110089
35581 -110089 71239 232871 132278 -25915 -6247 64020 530 -71329 7965 68841 -102660
$$ packed form
35654A56450K74941L24246n2632m12758l20881r633J7003k12465k48647j013J51820
35643c33569K7128j16165q1441k934K2730J26492L13764L33889J08985q2230o3494
35632B53155l4167j44636j77189M0794K45438J24752j69075k73192j62828o5060
35622c62008j0703J19054K30054J24269r0822j13491M6026P6821p9670j03807
35612a64277J47388L42278J62137j99251l06795q4929J37470J14336m2512r8411
35602G434j1687O8788J8186j33000k42800j93750j6800J11594N8859o5308j3783
35591d12267K29393L40425R1795k38611j94654J67087L05623N394k77049j27225
35581a10089J81328J61632j00593j58193J9668P0267o3490p1859P9294O0876j71501
$$ plain form
35570 -102660 -346094 -380337 -273576 -248895 -213544 41664 311551 175756 -312839 -656595
35560 -656595 -641725 -530692 -485969 -340175 -62640 69827 -37388 -111063 -26214 -39811
35550 -39811 -255770 -321359 11085 422873 497839 319827 236892 316454 388241 371831 234383
35539 234383 -108066 -520507 -583155 -172697 194680 40380 -340738 -337321 14814 126790
35529 126790 -187561 -469191 -367812 -79053 107637 220153 367024 472626 469671 474709
35519 474709 574147 642345 523643 234337 -103735 -372168 -462227 -360459 -252444 -336985
35509 -336985 -524344 -550046 -400166 -346385 -498291 -608113 -445514 -123287 100348 148355
35499 148355 103330 20011 -85539 -163372 -172453 -141208 -125907 -160436 -247941 -326939 -286277
$$ packed form
35570a02660k43434l4243J06761K4681L5351K55208K69887j35795m88595l43756
35560f56595J4870J11033M4723J45794K77535J32467j07215p3675Q4849j3597
35550c9811k15959o5589L32444M11788P4966j78012q2935P9562P1787j6410j37448
35539B34383l42449m12441o2648M10458L67377j54300l81118L417L52135J11976
35529A26790l14351k81630J01379K88759J86690J12516J46871J05602k955N038
35519D74709R9438O8198j18702k89306l38072k68433r0059J01768J08015q4541
35509c36985j87359k5702J49880N3781j51906j09822J62599L22227K23635M8007
35499A48355m5025q3319j05550p7833r081L1245J5301l4529q7505p8998M0662
$$ plain form
35488 -286277 -120840 1932 -23123 -48526 66508 134372 -101418 -459020 -472814 -82957
35478 -82957 247482 213846 45251 5385 -60260 -363035 -704064 -767992 -646869 -642465 -690085
35467 -690085 -437852 117786 516684 467966 238937 211676 318487 198393 -207696 -516369
35457 -516369 -399219 -9041 223910 108359 -162162 -340601 -401944 -427155 -402768 -291991
35447 -291991 -183159 -183930 -238383 -225328 -175431 -200435 -264156 -240048 -151633 -110440 -46862 199857
35435 199857 504004 502553 134676 -180551 -89822 226487 348329 179810 -9559 23630
35425 23630 262556 501039 514441 258529 -19858 -24769 169720 179769 -97236 -267811
35415 -267811 -50434 225833 110576 -220158 -194685 272605 675613 786388 1114478 2179282
$$ packed form
35488b86277J65437J22772k5055k5403J15034O7864k35790l57602j3794L89857
35478h2957L30439l3636j68595l9866o5645l02775l41029o3928J21123M404m7620
35467f90085K52233N55638L98898m8718k29029k7261J06811j20094m06089l08673
35457e16369J17150L90178K32951j15551k70521j78439o1343k5211K4387J10777
35447b91991J08832p71n4453J3055M9897k5004o3721K4108Q8415M1193O3578K46719
35435A99857L04147j451l67877l15227R0729L16309J21842j68519j89369L3189
35425B3630K38926K38483J3402k55912k78387m911J94489J0049k77005j70575
35415b67811K17377K76267j15257l30734K5473M67290M03008J10775L28090J064804
$$ plain form
35405 2179282 3634241 4502954 4207538 3085206 1912781 1184085 921594 949822 1103993
35396 1103993 1208239 1096029 793230 565564 619876 802625 756696 368701 -100791 -346202
35386 -346202 -315931 -158451 -37693 -44732 -135529 -127843 68488 224033 42574 -340862 -451459
35375 -451459 -166969 63179 -100472 -381284 -393462 -292181 -453679 -766053 -786947 -489735
35365 -489735 -296761 -375519 -437497 -316381 -228672 -290777 -259452 -12178 132132 -91781
35355 -91781 -402385 -352701 5522 217249 75182 -167621 -207020 -23160 214557 349955
35345 349955 290751 21187 -348959 -612978 -604034 -329644 -5980 79041 -151922 -435293
35335 -435293 -468538 -320233 -304058 -433766 -357162 16140 218025 -110367 -581258 -568182
$$ packed form
35405B179282J454959Q68713k95416j122332j172425p28696k62491K8228J54171
35396A103993J04246j12210l02799k27666N4312J82749m5929l87995m69492k45411
35386c46202L0271J57480J20758p039r0797P686J96331J55545j81459l83436j10597
35375d51459K84490K30148j63651k80812j2178J01281j61498l12374k0894K97212
35365d89735J92974p8758o1978J21116Q7709o2105L1325K47274J44310k23913
35355i1781l10604M9684L58223K11727j42067k42803l9399J83860K37717J35398
35345C49955n9204k69564l70146k64019Q944K74390L23664Q5021k30963k83371
35335d35293l3245J48305J6175j29708P6604L73302K01885l28392m70891J3076
$$ plain form
35325 -568182 -142741 72373 -78888 -71286 355729 689521 457133 19138 14543 363319
35315 363319 441799 83785 -240349 -252004 -242692 -444199 -580457 -387225 -153669 -303205
35305 -303205 -679217 -699444 -146444 558111 869000 646732 176939 -126121 -46967 234304
35295 234304 324318 131676 48705 404048 931751 1133327 1014086 993993 1133904 1002428
35285 1002428 445707 -41429 -13665 268581 260857 -76470 -319911 -247188 -64843 -14304
35275 -14304 -63117 -24544 190278 451495 481079 144163 -288267 -373449 -76210 163379
35265 163379 76272 -84822 -92375 -226750 -761910 -1291873 -1162883 -439261 148172 186403
35255 186403 -50889 -243896 -440889 -674436 -711157 -457951 -196259 -137792 -107676 68623
$$ packed form
35325e68182M25441K15114j51261P602M27015L33792k32388m37995m595L48776
35315C63319P8480l58014l24134j1655R312k01507j36258J93232K33556j49536
35305c03205l76012k0227N53000P04555L10889k22268m69793l03060P9154K81271
35295B34304R0014j92642q2971L55343N27703K01576j19241k0093J39911j31476
35285A002428n56721m87136K7764K82246p724l37327k43441P2723J82345N0539
35275a4304m8813L8573K14822K61217K9584l36916m32430q5182K97239K39589
35265A63379q7107j61094p553j34375n35160n29963J28990P23622N87433L8231
35255A86403k37292j93007j96993k33547l6721K53206K61692N8467L0116J76299
$$ plain form
35245 68623 213570 125183 -56049 -115193 -119120 -191769 -197925 8156 253713 324415 349469
35234 349469 515954 604928 291440 -210297 -331498 8522 255256 37858 -327899 -373078
35224 -373078 -123401 75393 88662 27051 -54652 -165058 -189546 -3751 259888 322815
35214 322815 139633 -64734 -151468 -222105 -354473 -422922 -325582 -209914 -273508 -429708
35204 -429708 -369041 51349 616473 962098 888349 490570 78513 -60687 72369 187880
35194 187880 80150 -62740 94529 518269 787510 630839 218816 -171876 -494122 -743939
35184 -743939 -725580 -319926 183998 369961 230398 106102 142685 146138 -8930 -166646
35174 -166646 -172754 -86991 -9183 56961 65984 -91178 -348570 -448694 -309702 -176699 -244946
$$ packed form
35245F8623J44947q8387j81232n9144l927p2649o156K06081K45557P0702K5054
35234C49469J66485Q8974l13488n01737j21201L40020K46734k17398l65757m5179
35224c73078K49677J98794J3269o1611q1703j10406k4488J85795K63639O2927
35214C22815j83182k04367q6734p0637j32368o8449R7340J15668o3594j56200
35204d29708O0667M20390N65124L45625p3749l97779m12057j39200J33056J15511
35194A87880j07730j42890J57269M23740K69241j56671m12023l90692l22246k49817
35184g43939J8359M05654N03924J85963j39563j24296L6583L453j55068j57716
35174a66646o108Q5763P7808O6144R023j57162k57392j00124J38992J33003o8247
$$ plain form
35163 -244946 -367094 -336837 -241028 -272925 -363569 -279257 13065 326692 519620 552052 379467
35152 379467 44052 -212385 -209364 -137052 -291604 -545354 -462469 15224 412860 407138 264479
35141 264479 331092 453019 301628 16450 35609 395280 692388 737221 735034 728079 406669
35130 406669 -256738 -685211 -436600 106921 282709 86769 -11444 18568 -240889 -761517
35120 -761517 -919811 -458008 76101 194490 171964 421884 695428 506208 -3625 -260163
35110 -260163 -117299 71055 100757 70055 -26322 -289400 -537270 -475674 -234914 -204220
35100 -204220 -344749 -245405 111823 270499 87089 -44831 57309 40840 -280051 -516430
35090 -516430 -355056 -51462 113294 307159 627845 669161 175933 -345994 -316342 9415
$$ packed form
35163b44946j22148L0257R5809l1897r0644Q4312K92322L13627J92928L2432j72585
35152C79467l35415k56437L021P2312j54552k53750Q2885M77693L97636n722j42659
35141B64479O6613J21927j51391k85178J9159L59671K97108M4833k187o955l21410
35130D06669o63407m28473K48611N43521J75788j95940r8213L0012k59457n20628
35120g61517j58294M61803N34109J18389k2526K49920K73544j89220n09833k56538
35110b60163J42864J88354K9702l0702r6377k63078k47870O1596K40760L0694
35100b04220j40529R9344L57228J58676j83410j31920J02140j6469l20891k36379
35090e16430J61374L03594J64756J93865L20686M1316m93228n21927K9652L25757
$$ plain form
35080 9415 -2668 -315313 -380063 -155167 -172719 -600785 -955888 -860504 -498174 -187533 -12111
35069 -12111 11885 -129341 -237657 -70437 203202 167769 -152440 -282438 -78730 39864
35059 39864 -149934 -255937 56835 474966 550941 416422 497985 791666 914401 729033
35049 729033 464747 281853 121250 -21860 -37119 37776 -9806 -250766 -504679 -628004
35039 -628004 -704335 -839885 -943497 -863003 -643052 -487077 -483123 -504211 -415238 -265430 -187630
35028 -187630 -182449 -132812 -6054 106744 158553 185823 151182 -45213 -317754 -395832 -215834
35017 -215834 -66968 -147065 -239869 -119808 -8886 -224122 -569569 -572168 -231150 -15893
35007 -15893 -123590 -258554 -207108 -103262 -4421 249753 554859 468903 -75988 -495982
$$ packed form
35080I415j2083l12645o4750K24896j7552m28066l55103R5384L62330L10641J75422
35069a2111K3996j41226j08316J67220K73639l5433l20209j29998K03708J18594
35059C9864j89798j06003L12772M18131P5975j34519Q1563K93681J22735j85368
35049G29033k64286j82894j60603j43110j5259P4895m7582k40960k53913j23325
35039f28004p6331j35550j03612Q0494K19951J55975L954k1088Q8973J49808P7800
35028a87630N181M9637J26758J12798N1809K7270l4641j96395k72541p8078J79998
35017b15834J48866q0097r2804J20061J10922k15236l45447k599L41018K15257
35007a5893j07697j34964N1446J03846R8841K54174L05106q5956n44891m19994
$$ plain form
34997 -495982 -361052 -11526 60702 -2553 198398 527451 537228 270726 179855 326850
34987 326850 304407 -17982 -259600 -160681 73989 235004 432313 722584 834258 577964
34977 577964 223969 144084 283769 294809 59833 -192190 -228005 -43037 219138 403834
34967 403834 403263 207574 -70307 -260285 -228679 51546 423333 566707 279368 -216443
34957 -216443 -439171 -227702 20570 -148848 -650069 -966464 -782270 -289420 126464 300403
34947 300403 323278 318599 312052 277906 212626 131355 23655 -139206 -323501 -392878 -231402
34936 -231402 71529 246807 130151 -130552 -238325 -92864 113610 142293 -36822 -254107
34926 -254107 -326218 -195348 44912 194595 65268 -347523 -791636 -933079 -663353 -213908
$$ packed form
34997d95982J34930L49526P2228o3255K00951L29053R777k66502r0871J46995
34987C26850k2443l22389k41618R8919K34670J61015J97309K90271J11674k56294
34977E77964l53995p9885J39685J1040k34976k52023l5815J84968K62175J84696
34967D03834n71j95689k77881j89978L1606K80225L71787J43374k87339m95811
34957b16443k22728K11469K48272j69418n01221l16395J84194M92850M15884J73939
34947C00403K2875m679o547l4146o5280q1271j07700j62861j84295o9377J61476
34936b31402L02931J75278j16656k60703j07773J45461K06474K8683j79115k17285
34926b54107p2111J30870K40260J49683j29327m12791m44113j41443K69726M49445
$$ plain form
34916 -213908 76219 93673 7533 3961 48719 -20379 -210748 -304263 -123174 208585 373133
34905 373133 220819 -73087 -245827 -243979 -198552 -175739 -96172 84099 243354 227984 54097
34894 54097 -107966 -136289 -89051 -122472 -288253 -424871 -304187 63052 343161 240673
34884 240673 -88567 -187324 99318 403556 350059 61518 -87721 -55283 -148070 -498386
34874 -498386 -833409 -834206 -504914 -110467 91239 14305 -204641 -301322 -174565 -50617
34864 -50617 -167186 -365576 -297523 -7893 89966 -101939 -163317 137155 377169 112353
34854 112353 -377993 -483962 -196651 -81003 -363625 -618861 -491543 -230110 -231491 -430510
34844 -430510 -486169 -339327 -219481 -203820 -123353 72884 159217 -35012 -330857 -412456
$$ packed form
34916b13908K90127J7454q6140l572M4758o9098j90369r3515J81089L31759J64548
34905C73133j52314k93906j72740J848M5427K2813P9567J80271J59255j5370j73887
34894E4097j62063k8323M7238l3421j65781j36618J20684L67239K80109j02488
34884B40673l29240r8757K86642L04238n3497k88541j49239L2438r2787l50316
34874d98386l35023p97L29292L94447K01706p6934k18946r6681J26757J23948
34864e0617j16569j98390O8053K89630R7859j91905o1378L00472K40014k64816
34854A12353m90346j05969K87311J15648k82622k55236J27318K61433j381j99019
34844d30510n5659J46842J19846J5661Q0467J96237Q6333j94229k95845q1599
$$ plain form
34834 -412456 -241774 -77892 -96383 -180897 -174783 -168207 -345489 -632002 -737671 -574131 -393496
34823 -393496 -415347 -524513 -491720 -323438 -201572 -196349 -237822 -289427 -357511 -388463 -336269
34812 -336269 -280449 -310553 -358278 -315854 -238024 -227323 -211136 -77890 45202 -50188 -252275
34801 -252275 -221062 82948 296467 173362 -109517 -298401 -401431 -486274 -420517 -84800
34791 -84800 332002 512375 396934 210960 191150 408622 731680 849444 512179 -106096
34781 -106096 -484027 -363555 -61857 31560 -3892 106808 282962 252976 110636 198038
34771 198038 472516 516060 246151 92669 280206 428771 177503 -208729 -254874 4061
34761 4061 156045 70166 -24898 -18893 -37547 -98729 -62654 28501 -51129 -276892 -319980 -101605
$$ packed form
34834d12456J70682J63882j8491q4514O114O576j77282k86513j05669J63540J80635
34823c93496k1851j09166L2793J68282J21866N223m1473n1605o8084l0952N2194
34812c36269N5820l0104m7725M2424P7830J0701J6187J33246J23092r5390k02087
34801b52275L1213L04010K13519j23105k82879j88884j03030q4843O5757L35717
34791h4800M16802J80373j15441j85974j9810K17472L23058J17764l37265o18275
34781a06096l77931J20472L01698R3417l5452J10700J76154k9986j42340Q7402
34771A98038K74478M3544k69909j53482J87537J48565k51268l86232m6145K58935
34761D061J51984q5879r5064O005j8654o1182L6075R1155p9630k25763m3088K18375
$$ plain form
34749 -101605 -37082 -442003 -972832 -1025221 -545256 -73126 -18319 -246969 -442069 -535136
34739 -535136 -605797 -600525 -401332 -60907 253958 497257 710739 785955 521459 2959
34729 2959 -317147 -130098 280618 360121 -335 -363029 -409173 -371713 -586426 -883235
34719 -883235 -801926 -313949 88698 82609 -99692 -140344 -126942 -268542 -408852 -251429
34709 -251429 61921 64093 -325593 -637050 -523208 -205052 -33032 36003 206160 366936
34699 366936 258599 -29888 -145691 -20552 56426 -55370 -152972 -101522 -68519 -163345
34689 -163345 -182812 18370 185328 23512 -301170 -393943 -240856 -194109 -388149 -569324
34679 -569324 -553545 -473645 -450982 -363476 -115258 156209 334861 515672 729605 754788
$$ packed form
34749a01605O4523m04921n30829n2389M79965M72130N4807k28650j95100r3067
34739e35136p0661N272J99193L40425L14865K43299K13482P5216k64496n18500
34729B959l20106J87049M10716P9503l60456l62694m6144L7460k14713k96809
34719h83235Q1309M87977M02647o089j82301m0652J3402j41600j40310J57423
34709b51429L13350K172l89686l11457J13842L18156J72020O9035J70157J60776
34699C66936j08337k88487j15803J25139P6978j11796r7602N1450L3003r4826
34689a63345j9467K01182J66958j61816l24682r2773J53087M6747j94040j81175
34679e69324J5779P9900K2663Q7506K48218K71467J78652J80811K13933K5183
$$ plain form
34669 754788 463640 103229 -70302 -183160 -405542 -478487 -83056 464567 481307 -97459
34659 -97459 -583661 -531539 -302405 -364441 -550290 -437036 -85618 96185 19413 -23546
34649 -23546 130144 332688 419731 372496 221700 52495 41009 234051 385736 281016
34639 281016 101037 145554 308339 225231 -107918 -305837 -225606 -193919 -459955 -793697
34629 -793697 -838556 -590429 -319596 -214095 -269085 -375811 -401724 -315464 -276558 -429139
34619 -429139 -612181 -533991 -252305 -155156 -381900 -611152 -573199 -429132 -426927 -491778 -418392
34608 -418392 -215739 -1380 215914 390985 313870 -82385 -484454 -564507 -406004 -277123
34598 -277123 -180273 25145 223034 177574 -7966 19848 314269 537706 466496 246436
$$ packed form
34669G54788k91148l60411j73531j12858k22382p2945L95431N47623J6740n78766
34659i7459m86202N2122K29134o2036j85849J13254L51418J81803p6772m2959
34649b3546J53690K02544Q7043m7235j50796j69205j1486J93042J51685j04720
34639B81016j79979M4517J62785q3108l33149j97919Q0231L1687k66036l33742
34629g93697m4859K48127K70833J05501n4990j06726k5913Q6260L8906j52581
34619d29139j83042P8190K81686R7149k26744k29252L7953J44067K205o4851P3386
34608d18392K02653K14359K17294J75071p7115l96255m02069q0053J58503J28881
34598b77123R6850K05418J97889m5460j85540K7814K94421K23437p1210k20060
$$ plain form
34588 246436 62998 -124888 -379651 -570691 -550600 -391145 -283424 -290326 -317376 -280789
34578 -280789 -214540 -207676 -266090 -273285 -142535 19481 31265 -72919 -69102 65879 42718
34567 42718 -271766 -512651 -252384 357353 726197 581720 264526 212022 415223 513451
34557 513451 267911 -182958 -486844 -445842 -223213 -140404 -271144 -370411 -244142 7333
34547 7333 213030 367985 485505 458949 298715 266967 490074 662670 479972 160358
34537 160358 130732 346556 383699 128122 -101155 -112108 -60364 -58677 -4864 101390 73356
34526 73356 -103360 -190497 -110060 -92348 -263474 -412114 -341425 -170375 -109326 -174571 -281755
34515 -281755 -415416 -573406 -710018 -804534 -831016 -684899 -361065 -131524 -233354 -450619
$$ packed form
34588B46436j83438j87886k54763j91040K0091J59455J07721o902k7050L6587
34578b80789O6249O864n8414p195J30750J62016J1784j04184L817J34981k3161
34567D2718l14484k40885K60267O09737L68844j44477l17194n2504K03201R8228
34557E13451k45540m50869l03886M1002K22629Q2809j30740r9267J26269K51475
34547G333K05697J54955J17520k6556j60234l1748K23107J72596j82698l19614
34537A60358k9626K15824L7143k55577k29277j0953N1744J687N3813J06254k8034
34526G3356j76716q7137Q0437J7712j71126j48640P0689J71050O1049o5245j07184
34515b81755j33661j57990j36612r4516k6482J46117L23834K29541j01830k17265
$$ plain form
34505 -450619 -393699 -134150 -82672 -247361 -187923 189959 405462 195162 -50355 31612
34495 31612 194349 86435 -133565 -151998 -84247 -211934 -427768 -421079 -204674 -28759
34485 -28759 52347 146589 225238 197921 119027 33129 -166494 -448866 -500269 -193336 103682
34474 103682 56690 -107002 -16754 209688 229219 84952 37578 35703 -97438 -174033 66901
34463 66901 353452 192506 -320028 -620569 -540646 -430931 -467613 -471545 -421781 -511545 -651002
34452 -651002 -543696 -308856 -370151 -652481 -607565 -184491 -9065 -337450 -603326 -391111
34442 -391111 -118826 -245950 -481392 -399889 -254868 -450552 -674676 -379475 166314 167094
34432 167094 -442252 -835257 -485888 162234 422950 215432 -71200 -137541 73889 474875
$$ packed form
34505d50619N6920K59549N1478j64689N9438L77882K15503k10300k45517Q1967
34495C1612J62737j07914k20000j8433O7751j27687k15834O689K16405J75915
34485b8759Q1106R4242P8649k7317p8894q5898j99623k82372n1403L06933K97018
34474A03682m6992j63692R0248K26442J9531j44267m7374j875j33141p6595K40934
34463F6901K86551j60946n12534l00541P9923J09715l6682l932M9764q9764j39457
34452f51002J07306K34840o1295k82330M4916M23074J75426l28385k65876K12215
34442c91111K72285j27124k35442Q1503J45021j95684k24124K95201N45789P80
34432A67094o09346l93005L49369O48122K60716k07518k86632o6341K11430M00986
$$ plain form
34422 474875 824782 845226 541231 225176 69429 -146075 -634294 -1145655 -1209840 -771516
34412 -771516 -290335 -143276 -175614 -24383 281305 341870 8025 -348774 -369600 -240193
34402 -240193 -358776 -635284 -570640 -50221 410978 406320 213272 308160 605038 596762 122175
34391 122175 -417002 -610539 -480054 -294930 -210393 -213996 -263766 -331661 -354589 -231082 90966
34380 90966 489972 669031 413620 -109183 -469504 -481440 -408241 -518121 -652620 -508106
34370 -508106 -195977 -153221 -494357 -805565 -709538 -366346 -225093 -448255 -778598 -889142
34360 -889142 -690585 -320827 24818 223336 261831 189314 35628 -193015 -428609 -521296
34350 -521296 -381607 -121325 34156 -1804 -83282 -41485 78203 93388 -26575 -96830
$$ packed form
34422D74875L49907K0444l03995l16055j55747k15504m88219n11361o4185M38324
34412g71516M81181J47059l2338J51231L05688O0565l33845l56799k0826J29407
34402b40193j18583k76508O4644N20419M61199m658j93048R4888K96878q276m74587
34391A22175n39177j93537J30485J85124Q4537l603m9770o7895k2928J23507L22048
34380I0966L99006J79059k55411n22803l60321j1936P3199j09880j34499J44514
34370e08106L12129M2756l41136l11208R6027L43192J41253k23162l30343j10544
34360h89142J98557L69758L45645J98518L8495p2517j53686k28643k35594r2687
34350e21296J39689K60282J55481l5960q1478M1797J19688J5185j19963p0255
$$ plain form
34340 -96830 5926 146326 131229 365 -47392 45266 152239 198893 238047 268184 178062
34329 178062 -46660 -224903 -194239 -12602 140108 171211 120671 80819 118242 204191 217679
34318 217679 106619 4113 39523 96820 -15491 -197046 -153521 130517 357504 411891
34308 411891 496146 643790 542343 96556 -262652 -193377 17050 -37224 -183143 -25935
34298 -25935 267698 183739 -270564 -568296 -521366 -492264 -666131 -748509 -578663 -447793
34288 -447793 -525399 -507555 -190535 80111 -46884 -327899 -330053 -136842 -161194 -450647
34278 -450647 -654245 -582175 -377338 -177302 26039 207022 299650 356987 457508 505097
34268 505097 381291 215369 213263 299561 254956 144535 239484 524025 666458 532153
$$ packed form
34340i6830J02756J40400j5097j30864m7757R2658J06973M6654L9154L0137r0122
34329A78062k24722j78243L0664J81637J52710L1103n0540l9852L7423Q5949J3488
34318B17679j11060j02506L5410N7297j12311j81555M3525K84038K26987N4387
34308D11891Q4255J47644j01447m45787l59208O9275K10427n4274j45919J57208
34298b5935K93633q3959m54303k97732M6930K9102j73867q2378J69846J30870
34288d47793p7606J7844L17020K70646j26995k81015k154J93211k4352k89453
34278d50647k03598P2070K04837K00036K03341J80983R2628N7337J00521M7589
34268E05097j23806j65922k106Q6298m4605j10421R4949K84541J42433j34305
$$ plain form
34258 532153 353727 300389 248088 122707 109502 293897 395494 147232 -260567 -402036
34248 -402036 -171721 124674 180482 -2456 -193414 -191015 -8380 148407 128238 50303
34238 50303 149599 424084 634812 673295 670547 672871 518073 189446 -24748 31113 78313
34227 78313 -137636 -345099 -119879 400359 638364 369357 -56364 -309815 -450955 -571985
34217 -571985 -500114 -119906 301764 414610 251514 141446 244412 388038 337586 70557
34207 70557 -225883 -350128 -275889 -162492 -144717 -148839 -20942 196196 282250 151394 -33272
34196 -33272 -109385 -105545 -106828 -100811 -66029 -72997 -177512 -317786 -420409 -520356 -687172 -897340
34184 -897340 -1030621 -938058 -539296 26130 396156 341075 99125 99415 347346 417762 134316
$$ packed form
34258E32153j78426n3338n2301j25381j3205J84395J01597k48262m07799j41469
34248d02036K30315K96395N5808j82938j90958K399J82635J56787k0169p7935
34238E0303R9296K74485K10728L8483k748K324j54798l28627k14194N5861M7200
34227G8313k15949k07463K25220N20238K38005k69007m25721k53451j41140j21030
34217e71985P1871L80208M21670J12846j63096j10068J02966J43626n0452k67029
34207G0557k96440j24245P4239J13397J7775m122J27897K17138Q6054j30856j84666
34196c3272p6113L840j283O017L4782o968j04515j40274j02623r9947j66816k10168
34184h97340j33281R2563L98762N65426L70026n5081k41950K90K47931P0416k83446
$$ plain form
34173 134316 -131447 -35357 230253 297167 190585 185612 317750 405069 397562 343981 144149
34162 144149 -291489 -729438 -838011 -667375 -534054 -472817 -216956 249698 543584 417301
34152 417301 105703 -33017 32391 75720 -53730 -293069 -428883 -255969 176557 492857
34142 492857 376432 14838 -98594 187138 524475 599992 500200 433990 392371 260114
34132 260114 45690 -159489 -289181 -281576 -130813 -2693 -69037 -194049 -76456 241490
34122 241490 358689 123253 -127297 -123063 -66309 -198880 -329369 -168518 134089 198925
34112 198925 -7454 -183770 -163002 -30735 116511 204311 76471 -304047 -630624 -566928
34102 -566928 -228333 -21560 -61782 -105915 -38324 -32698 -180191 -322208 -360578 -417806 -561240
$$ packed form
34173A34316k65763R6090K65610O6914j06582m973J32138Q7319p507n3581j99832
34162A44149m35638m37949j08573J70636J33321O1237K55861M66654K93886j26283
34152D17301l11598j38720O5408M3329j29450k39339j35814J72914M32526L16300
34142D92857j16425l61594j13432K85732L37337P5517r9792o6210m1619j32257
34132B60114k14424k05179j29692P605J50763J28120o6344j25012J17593L17946
34122B41490J17199k35436k50550M234N6754j32571j30489J60851L02607O4836
34112A98925k06379j76316K0768J32267J47246Q7800j27840l80518l26577O3696
34102e66928L38595K06773m0222m4133O7591N626j47493j42017l8370n7228j43434
$$ plain form
34091 -561240 -650289 -601491 -550942 -591046 -570894 -345280 -48100 71859 -32698 -218127
34081 -218127 -378725 -512146 -620599 -681016 -692946 -684384 -699492 -802149 -1009096 -1187288
34071 -1187288 -1132300 -825233 -514719 -442381 -549430 -564087 -358004 -109632 -71098 -228554
34061 -228554 -289835 -63334 222694 133475 -412641 -974757 -1097998 -837370 -594617 -560084
34051 -560084 -563551 -423347 -173608 75540 262005 306020 144439 -98701 -181754 -61773
34041 -61773 59925 82178 162121 411986 671888 751051 685021 563217 312462 -101471
34031 -101471 -441141 -474397 -368003 -471236 -758018 -838470 -558110 -240389 -215167 -404061
34021 -404061 -545881 -581525 -593856 -556994 -402806 -231717 -218091 -353824 -480420 -527742
$$ packed form
34091e61240q9049M8798N0549m0104K0152K25614K97180J19959j04557j85429
34081b18127j60598j33421j08453o0417j1930Q562j5108j02657k06947j78192
34071a187288N4988L07067L10514P2338j07049j4657K06083K48372L8534j57456
34061b28554o1281K26501K86028q9219n46116n62116j23241K60628K42753L4533
34051e60084l467J40204K49739K49148J86465M4015j61581k43140q3053J19981
34041f1773J21698K2253P9943K49865K59902P9163o6030j21804k50755m13933
34031a01471l39670l3256J06394j03233k86782q0452K80360L17721K5222j88894
34021d04061j41820l5644j2331L6862J54188J71089J3626j35733j26596m7322
$$ plain form
34011 -527742 -535623 -499346 -410585 -401297 -578056 -713570 -418599 277332 815097 761782 333791
34000 333791 38660 13205 16405 -74056 -123889 -69057 -37113 -89144 -129797 -152062 -297937
33989 -297937 -563247 -705571 -606192 -485032 -547623 -622139 -412495 16451 293511 239008
33979 239008 46994 -44156 -26535 1893 38289 117094 154840 -9736 -420259 -898581 -1146131
33968 -1146131 -968116 -446944 96160 352414 264125 18990 -159267 -180263 -82504 61168
33958 61168 198363 285932 277214 168924 67079 137450 414501 692166 706044 430302 100260
33947 100260 -70792 -89478 -69499 -46432 15611 120699 236473 349516 462293 564205
33937 564205 633913 632498 501175 244355 5123 -61021 -1141 -16788 -165704 -259857 -123936
$$ packed form
34011e27742p881L6277Q8761R288j76759j35514K94971O95931N37765n3315m27991
34000C33791k95131k5455L200r0461m9833N4832L1944n2031m0653k2265j45875
33989b97937k65310j42324R9379J21160o2591p4516K09644M28946K77060n4503
33979B39008j92014r1150J7621K8428L6396P8805L7746j64576m10523m78322k47550
33968a146131J78015N21172N43104K56254q8289k45135j78257k0996R7759J43672
33958F1168J37195Q7569q718j08290j01845P0371K77051K77665J3878k75742l30042
33947A00260j71052j8686J9979K3067O2043J05088J15774J13043J12777J01912
33937E64205O9708j415j31323k56820k39232o6144N9880j5647j48916r4153J35921
$$ plain form
33926 -123936 184533 478298 613491 494151 99848 -359610 -503785 -192777 242043 371907
33916 371907 180647 2527 26396 96650 16774 -154393 -199888 -40413 152587 141041
33906 141041 -97115 -309081 -248646 26102 248279 289712 233265 125797 -78725 -282940
33896 -282940 -254603 -7793 111551 -90188 -363080 -441898 -482116 -745906 -1085741 -1131430
33886 -1131430 -854653 -557218 -370800 -149682 152429 353483 333054 171697 -25576 -202082
33876 -202082 -257002 -136889 -6778 -71412 -245392 -271051 -139309 -92589 -208884 -294360
33866 -294360 -218898 -54588 157851 463868 747648 748518 446586 162471 140204 254264
33856 254264 246152 50511 -214350 -400717 -398813 -209718 8826 110751 139556 162330 41809
$$ packed form
33926a23936L08469K93765J35193j19340l94303m59458j44175L11008M34820J29864
33916C71907j91260j78120K3869P0254p9876j71167m5495J59475J93000j1546
33906A41041k38156k11966O0435K74748K22177M1433n6447j07468k04522k04215
33896b82940K8337K46810J19344k01739k72892p8818m0218k63790l39835m5689
33886a131430K76777K97435J86418K21118L02111K01054k0429j61357j97273j76506
33876b02082n4920J20113J30111o4634j73980k5659J31742M6720j16295q5476
33866b94360P5462J64310K12439L06017K83780Q70l01932k84115k2267J14060
33856B54264q112j95641k64861j86367J904J89095K18544J01925K8805K2774j20521
$$ plain form
33845 41809 -335807 -712496 -723068 -455644 -315257 -349117 -218520 102486 184377 -107928
33835 -107928 -299525 -65303 212859 77913 -237996 -182531 276262 676732 742824 581783
33825 581783 333654 44565 -183240 -272791 -344518 -508044 -577831 -308067 171125 463076
33815 463076 401946 178255 32378 62981 250719 436422 390507 138610 50467 321288
33805 321288 571099 351258 -116466 -195300 224860 557018 363421 -106825 -403597 -487422
33795 -487422 -587653 -735627 -735005 -466637 -20568 393196 551884 352474 -47586 -312872
33785 -312872 -248254 26084 256458 321678 279733 245709 278282 333656 309885 167072 -25098
33774 -25098 -187266 -288414 -253984 24274 457172 716326 638998 520504 724901 1122346
$$ packed form
33845D1809l77616l76689j0572K67424J40387l3860J30597L21006Q1891k92305
33835a07928j91597K34222K78162j34946l15909N5465M58793M00470O6092j61041
33825E81783k48129k89089k27805q9551p1727j63526o9787K69764M79192K91951
33815D63076o1130k23691j45877L0603J87738J85703m5915k51897q8143K70821
33805C21288K49811k19841m67724p8834M20160L32158j93597m70246k96772q3825
33795d87422j00231j47974O22K68368M46069M13764J58688j99410m00060k65286
33785c12872O4618K74338K30374O5220m1945l4024L2573N5374k3771j42813j92170
33774b5098j62168j01148L4430K78258M32898K59154p7328j18494K04397L97445
$$ plain form
33764 1122346 1250991 984399 666375 561018 553926 512550 579641 887846 1236638 1299325
33754 1299325 1021938 647352 441572 500280 715394 859920 823088 783855 977459 1282293
33744 1282293 1299759 919807 519546 451874 610003 699028 684479 713242 793436 842185 909738
33733 909738 1073668 1216772 1184413 1076428 1107158 1243374 1265469 1142251 1045888 1008531
33723 1008531 880703 671173 615366 802627 1006928 1021860 934871 930327 1028005 1159045
33713 1159045 1300254 1379230 1251043 956927 813599 1022626 1360613 1505304 1503067 1599914
33703 1599914 1739234 1630975 1309136 1192688 1461962 1749794 1684761 1444114 1454888 1732326
33693 1732326 1870061 1641919 1289643 1139336 1172930 1132796 932603 794310 956408 1334874
$$ packed form
33764A122346J28645k66592l18024j05357p092m1376O7091L08205L48792O2687
33754A299325k77387l74586k05780N8708K15114J44526l6832l9233J93604L04834
33744A282293J7466l79952m00261o7672J58129Q9025j4549K8763Q0194M8749O7553
33733I09738J63930J43104l2359j07985L0730J36216K2095j23218r6363l7357
33723A008531j27828k09530n5807J87261K04301J4932q6989m544R7678J31040
33713A159045J41209P8976j28187k94116j43328K09027L37987J44691k237R6847
33703A599914J39320j08259l21839j16448K69274K87832o5033k40647J0774K77438
33693A732326J37735k28142l52276j50307L3594m0134k00193j38293J62098L78466
$$ plain form
33683 1334874 1560860 1373804 911174 546122 496182 687315 934371 1091328 1060293 865227
33673 865227 729127 850012 1068646 1025898 710966 524293 663458 824926 756088 704595
33663 704595 934296 1145111 893631 360276 120178 273512 411266 408178 582452 951270
33653 951270 990354 429532 -249733 -473734 -309668 -171997 -163984 -120635 -38029 -53050 -155005
33642 -155005 -232467 -262766 -219279 5549 348719 495054 313577 109812 146162 213137
33632 213137 56757 -71385 208277 688001 801734 484290 239722 338356 489925 432776
33622 432776 353281 499416 755233 850203 737963 563956 445944 431526 510006 576613
33612 576613 549227 552012 764491 1062508 1090019 770288 459234 458378 641219 725948 670656
$$ packed form
33683A334874K25986j87056m62630l65052m9940J91133K47056J56957l1035j95066
33673H65227j36100J20885K18634m2748l14932j86673J39165J61468o8838n1493
33663G04595K29701K10815k51480n33355k40098J53334J37754l088J74274L68818
33653I51270L9084n60822o79265k24001J64066J37671Q013M3349Q2606j5021j01955
33642a55005p7462l0299M3487K24828L43170J46335j81477k03765L6350O6975
33632B13137j56380j28142K79662M79724J13733l17444k44568R8634J51569n7149
33622D32776p9495J46135K55817R4970j12240j74007j18012j4418P8480O6607
33612E76613k7386K785K12479K98017K7511l19731l11054q56J82841Q4729n5292
$$ plain form
33601 670656 596345 526395 431219 384174 454473 543659 511455 382151 276716 235381 252585
33590 252585 376996 604845 768696 724086 583967 574250 697105 743688 638254 554683
33580 554683 630982 756590 759507 670435 652406 736429 782015 699716 583434 574487 680499
33569 680499 791820 824480 783172 714625 659341 634603 620979 584492 541285 551380 607225
33558 607225 611423 547373 568079 763079 922979 762804 364086 133893 253251 417778
33548 417778 276768 -78706 -276764 -175438 29354 157780 268500 470682 693592 794108
33538 794108 839270 1095657 1634900 2101601 2138626 2000877 2345161 3296402 4279699 5200366
33528 5200366 7144463 10893755 14941553 16284159 13708151 9354725 6301875 5335739
$$ packed form
33601F70656p4311o9950r5176m7045P0299Q9186l2204j29304j05435m1335J7204
33590B52585J24411K27849J63851m4610j40119r717J22855M6583j05434q3571
33580E54683P6299J25608K917q9072j8029Q4023M5586q2299j16282q947J06012
33569F80499J11321L2660m1308o8547n5284k4738j3624l6487m3207J0095N5845
33558F07225M198o4050K0706J95000J59900j60175l98718k30193J19358J64527
33548D17778j41010l55474j98058J01326K04792J28426J10720K02182K22910J00516
33538G94108M5162K56387N39243M66701L7025j37749L44284R51241R83297R20667
33528E200366J944097L749292M047798J342606k576008m353426l052850r66136
$$ plain form
33520 5335739 4986511 4103619 3096947 2687539 2675381 2443503 1921238 1476995 1276124
33511 1276124 1219506 1265502 1415312 1509182 1351792 1010573 787878 876555 1130895 1205618
33501 1205618 927643 512918 319012 373306 344574 75601 -121587 76848 497777 727265
33491 727265 684457 591909 524813 377062 192351 154692 289207 488701 752986 1078168
33481 1078168 1244262 1102677 933241 1057608 1229036 956155 363775 101233 346582
33472 346582 552267 349690 82034 160552 451242 657793 837686 1125878 1318140 1163297
33462 1163297 825117 674257 784852 929574 923994 743075 452337 217967 220330 395079
33452 395079 439590 211201 -86054 -227819 -236689 -191732 -36240 258803 573537 824312
$$ packed form
33520E335739l49228q82892j006672m09408j2158k31878n22265m44243k00871
33511A276124n6618M5996J49810R3870j57390l41219k22695Q8677K54340P4723
33501A205618k77975m14725j93906N4294k8732k68973j97188J98435M20929K29488
33491G27265m2808r2548o7096j47751j84711l7659J34515J99494K64285L25182
33481A078168J66094j41585j69436J24367J71428k72881n92380k62542K45349
33472C46582K05685k02577k67656P8518K90690K06551J79893K88192J92262j54843
33462A163297l38180j50860J10595J44722n580j80919k90738k34370K363J74749
33452C95079M4511k28389k97255j41765q870M4957J55492K95043L14734K50775
$$ plain form
33442 824312 1037609 1138857 962247 603405 446776 667952 997483 1138067 1110375 1023790
33432 1023790 841301 576654 410214 403734 398951 365130 495135 777433 875197 660397
33422 660397 455700 491030 562657 524939 623547 944838 1035080 585202 62041 68390 433892
33411 433892 580851 495182 620256 970583 1107899 968648 991721 1319187 1511384 1257336
33401 1257336 840233 653890 678118 685727 638293 622919 625350 580069 504098 446074 406792
33390 406792 372700 337350 292949 291470 438805 702928 851652 753856 595175 583625 620616
33379 620616 540503 483447 656748 869673 752576 387826 255969 511952 763730 690968
33369 690968 471227 399093 436264 396588 317792 362921 497001 522283 388635 270345 313844
$$ packed form
33442H24312K13297J01248j76610l58842j56629K21176L29531J40584k7692q6585
33432A023790j82489k64647j66440o480m783l3821J30005K82298R7764k14800
33422F60397k04697L5330P1627l7718R8608L21291R0242m49878n23161O349L65502
33411D33892J46959q5669J25074L50327J37316j39251K3073L27466J92197k54048
33401A257336m17103j86343K4228P609m7434j5374K431m5281p5971n8024l9282
33390D06792l4092l5350m4401j479J47335K64123J48724r7796j58681j1550L6991
33379F20616q0113n7056J73301K12925j17097l64750j31857K55983K51778p2762
33369F90968k19741p2134L7171l9676p8796M5129J34080K5282j33648j18290M3499
$$ plain form
33358 313844 431804 412792 203801 8360 44845 259608 411018 421753 450538 567190
33348 567190 593377 398669 141016 43965 123619 298765 553632 796548 796666 513741 273871
33337 273871 346209 560426 631900 620239 705835 749109 520030 202088 183216 427633 530747
33326 530747 363842 193787 155825 83305 -64211 -46824 251153 628016 894024 1066247
33316 1066247 1143484 1022278 745213 520184 391558 196669 -63916 -146583 20621 165962
33306 165962 79167 -89409 -100027 47576 209005 299313 263968 53371 -238977 -392544
33296 -392544 -320968 -151409 14559 209405 402816 436081 270333 97700 76913 117453
33286 117453 39982 -167493 -332082 -258122 84683 440947 426979 -20687 -460744 -437544
$$ packed form
33358C13844J17960j9012k08991j95441L6485K14763J51410J0735K8785J16652
33348E67190K6187j94708k57653r7051P9654J75146K54867K42916J18k82925k39870
33337B73871P2338K14217P1474j1661Q5596M3274k29079l17942j8872K44417J03114
33326E30747j66905j70055l7962p2520j47516J7387K97977L76863K66008J72223
33316A066247P7237j21206k77065k25029j28626j94889k60585q2667J67204J45341
33306A65962q6795j68576j0618J47603J61429R0308l5345k10597k92348j53567
33296c92544P1576J69559J65968J94846J93411L3265j65748j72633k0787M0540
33286A17453p7471k07475j64589P3960L42805L56264j3968m47666m40057K3200
$$ plain form
33276 -437544 -43224 283145 384244 448457 542074 518122 388787 355296 425192 413260 353335
33265 353335 454171 602489 440303 54630 5780 430977 704977 361255 -181215 -288347
33255 -288347 -59988 -34190 -257669 -286937 11829 261078 198227 22433 7539 127043
33245 127043 198366 155232 58091 -16706 -31968 -20203 -46112 -68058 64517 352483 516065
33234 516065 321638 -46342 -168086 76467 357879 305384 -91298 -524179 -694703 -553480
33224 -553480 -278072 -56391 92818 255584 418311 448221 302371 128138 89407 187820
33214 187820 306186 329361 181359 -139172 -500098 -709649 -694425 -527046 -295278 -73136
33204 -73136 19789 -63681 -127246 77913 456937 629859 456047 218949 175729 220174 170737
$$ packed form
33276d37544L94320L26369J01099O4213R3617k3952j29335l3491O9896j1932n9925
33265C53335J00836J48318j62186l85673m8850M25197K74000l43722n42470j07132
33255b88347K28359K5798k23479k9268K98766K49249o2851j75794j4894J19504
33245A27043P1323m3134r7141p4797j5262J1765k5909k1946J32575K87966J63582
33234E16065j94427l67980j21744K44553K81412n2495l96682m32881j70524J41223
33224e53480K75408K21681J49209J62766J62727K9910j45850j74233l8731R8413
33214A87820J18366K3175j48002l20531l60926k09551J5224J67379K31768K22142
33204g3136R2925q3470o3565K05159L79024J72922j73812k37098m3220M4445m9437
$$ plain form
33193 170737 110821 197486 352713 405675 369274 325339 200447 -70119 -296028 -255871 -81362
33182 -81362 -100839 -323455 -395050 -124152 223857 284835 52116 -179427 -203916 -71056
33172 -71056 96028 278854 491571 637646 580694 355475 169045 139176 169024 167935 229586
33161 229586 428601 601299 566797 443894 463633 560235 489698 310779 351961 657349
33151 657349 866873 762725 553144 458406 399965 311925 374214 635862 742621 409952
33141 409952 -78432 -229197 -28507 100178 -77712 -370602 -496284 -353398 13094 457743
33131 457743 760183 810160 736382 701461 680567 623169 668413 931537 1204966 1177687 874790
33120 874790 585211 428122 306573 222653 268726 317620 122371 -207407 -225117 209811
$$ packed form
33193A70737n9916Q6665J55227N2962l6401m3935j24892k70566k25909M0157J74509
33182h1362j9477k22616p1595K70898L48009O0978k32719k31543k4489J32860
33172g1056J67084J82826K12717J46075n6952k25219j86430k9869K9848j089O1651
33161B29586J99015J72698l4502j22903J9739R6602p0537j78919M1182L05388
33151F57349K09524j04148k09581r4738n8441q8040O2289K61648J06759l32669
33141D09952m88384j50765K00690J28685j77890k92890j25682J42886L66492M44649
33131D57743L02440M9977p3778l4921k0894n7398M5244K63124K73429k7279l02897
33120H74790k89579j57089j21549q3920M6073M8894j95249l29778j7710M34928
$$ plain form
33110 209811 670168 747897 574099 485692 468219 296650 39431 -9799 131570 79296
33100 79296 -333537 -748549 -750079 -406244 -108109 -20120 36623 195519 309481 187919
33090 187919 -105480 -311776 -256946 1001 247864 289285 108613 -116899 -206768 -175013
33080 -175013 -146927 -111467 62093 330101 421073 205181 -68943 -84001 136737 318174
33070 318174 324977 268063 286651 399284 526591 533811 330599 44379 -37867 154499 327508
33059 327508 243687 97408 197770 452002 512893 330160 174263 157804 124666 30022
33049 30022 44752 205458 313126 291053 319111 469307 505146 237132 -142190 -276936
33039 -276936 -69369 262475 458992 457425 412744 507277 705311 774833 631052 494532
$$ packed form
33110B09811M60357P7729j73798q8407j7473j71569k57219m9230J41369n2274
33100G9296m12833m15012j530L43835K98135Q7989N6743J58896J13962j21562
33090A87919k93399k06296N4830K57947K46863M1421j80672k25512q9869L1755
33080a75013K8086L5460J73560K68008R0972k15892k74124j5058K20738J81437
33070C18174O803n6914J8588J12633J27307P220k03212k86220q2246J92366J73009
33059C27508q3821j46279J00362K54232O0891j82733j55897j6459l3138r4644
33049C0022J4730J60706J07668k2073K8058J50196L5839k68014l79322j34746
33039b76936K07567L31844J96517j567m4681R4533J98034O9522j43781j36520
$$ plain form
33029 494532 533749 544334 267492 -133145 -272534 -125718 -21411 -96051 -150702 -62572
33019 -62572 48738 124295 285322 566348 813614 904464 836280 630206 398320 394008 668850
33008 668850 826901 532717 109080 120093 485278 611884 351101 146475 189149 136656
32998 136656 -168726 -387844 -329587 -268090 -335955 -220040 196894 466328 244036 -148906
32988 -148906 -214142 89369 511205 877358 996199 653870 25354 -336941 -213106 26460
32978 26460 114104 295094 733794 1081657 1041744 846555 763515 637040 344906 180430
32968 180430 310373 367393 81925 -183800 -55078 208698 246578 263390 534640 727450
32958 727450 425964 -60784 -144805 114243 251676 270134 503365 820650 750438 314803
$$ packed form
33029D94532L9217J0585k76842m00637j39389J46816J04307p4640n4651Q8130
33019f2572J11310P5557J61027K81026K47266R0850o8184k06074k31886m312K74842
33008F68850J58051k94184m23637J1013L65185J26606k60783k04626M2674n2493
32998A36656l05382k19118N8257O1497o7865J15915M16934K69434k22292l92942
32988a48906o5236L03511M21836L66153J18841l42329o28516l62295J23835K39566
32978B6460Q7644J80990M38700L47863l9913j95189q3040j26475k92134j64476
32968A80430J29943N7020k85468k65725J28722K63776L7880J6812K71250J92810
32958G27450l01486m86748q4021K59048J37433J8458K33231L17285p0212m35635
$$ plain form
32948 314803 35136 124298 280752 266193 141351 -31068 -203475 -136084 305888 722368
32938 722368 587335 49242 -219014 16858 268268 101294 -258224 -286938 147546 626879
32928 626879 616451 43385 -542122 -530116 4014 397433 296493 46455 36232 141581
32918 141581 108107 27762 74079 167015 251333 501146 898665 1043679 758411 445115
32908 445115 457241 566294 451226 252111 219450 262943 236113 208568 145142 -118974 -310072
32897 -310072 129987 969113 1158065 383619 -314489 -128224 338562 292463 93653 327201
32887 327201 521659 49878 -519339 -323068 228577 186791 -214850 -26673 690087 1080349
32877 1080349 1090485 1360866 1768682 1567445 869009 568963 837591 1013000 937473 1087775
$$ packed form
32948C14803k79667Q9162J56454j4559j24842j72419j72407O7391M41972M16480
32938G22368j35033n38093k68256K35872K51410j66974l59518k8714M34484M79333
32928F26879j0428n73066n85507J2006N34130L93419j00940k50038j0223J05349
32918A41581l3474q0345M6317R2936Q4318K49813L97519J45014k85268l13296
32908D45115J2126J09053j15068j99115l2661M3493k6830k7545o3426k64116j91098
32897c10072M40059Q39126J88952p74446o98108J86265M66786m6099j98810K33548
32887C27201J94458m71781n69217J96271N51645m1786m01641J88177P16760L90262
32877A080349J0136K70381M07816k01237o98436l00046K68628J75409p5527J50302
$$ plain form
32867 1087775 1435022 1482324 1370690 1635012 1969645 1646381 1083680 1473620 2776495
32858 2776495 3610504 3318385 2668859 2285105 1873608 1342494 1223920 1534186 1530956 1041953
32848 1041953 809717 1142890 1440872 1393418 1417692 1582446 1366594 827310 723449 1114976
32838 1114976 1134859 542339 198450 563207 997886 1015223 979164 1111741 1018978 637056
32828 637056 481326 608149 513566 298273 629139 1337571 1483395 1036703 974664 1475819
32818 1475819 1671349 1465310 1788405 2636272 2778088 1998890 1682590 2433611 3080667
32809 3080667 2947472 3190284 4764587 6748425 7787156 7728335 6955495 5644055 4444358
32800 4444358 4283700 4814868 4740087 4107668 4263442 5155175 5172710 4241598 4266248 5655320
$$ packed form
32867A087775L47247M7302j11634K64322L34633l23264n62701L89940J302875
32858B776495Q34009k92119o49526l83754m11497n31114j18574L10266l230m89003
32848A041953k32236L33173K97982m7454K4274J64754k15852n39284j03861L91527
32838A114976J9883n92520l43889L64757M34679J7337l6059J32577r2763l81922
32828F37056j55730J26823r4583k15293L30866P08432J45824m46692o2039N01155
32818A475819J95530k06039L23095Q47867J41816p79198l16300P51021O47056
32809C080667j33195K42812J574303J983838J038731n8821p72840j311440j199697
32800D444358j60658N31168p4781o32419J55774Q91733J7535r31112K4650J389072
$$ plain form
32790 5655320 6454975 6045887 6415848 8332249 9756769 9854621 10878656 13905597 16664375
32781 16664375 18254135 21713010 28456956 34690644 37873496 42321995 52640449 65868469
32773 65868469 78223723 97559290 139416796 207445632 282408071 332747719 334720328
32766 334720328 286150978 208352640 134667823 88723128 69241178 58498115 45000886
32759 45000886 32291711 26443078 24757585 21395653 16707050 14388381 13904311 12033993
32751 12033993 9080986 7839863 8190186 7676847 6177043 5583813 5833494 5245268 4042405
32742 4042405 3863045 4375609 3788367 2250595 1572202 1941316 1901894 1278167 1271929 1874873
32732 1874873 1890476 1380630 1522581 2147719 1918057 912779 617849 1273760 1543383
$$ packed form
32790E655320P99655m09088L69961J916401J424520R7852J024035L026941K758778
32781A6664375J589760L458875O743946O233688L182852M448499J0318454J3228020
32773F5868469J2355254J9335567M1857506O8028836P4962439N0339648J972609
32766C34720328m8569350p7798338p3684817m5944695j9481950j0743063j3497229
32759D5000886j2709175n848633j685493l361932m688603k318669m84070j870318
32751A2033993k953007j241123L50323n13339j499804n93230K49681n88226j202863
32742D042405j79360N12564n87242j537772o78393L69114l9422o23727o238O02944
32732A874873J5603n09846J41951O25138k29662j005278k94930O55911K69623
$$ plain form
32723 1543383 973368 594035 841166 947358 688743 800749 1326855 1354589 739539 428794
32713 428794 754464 973621 780236 753697 1030267 991098 551806 384670 615361 624177
32703 624177 335316 377906 779901 824014 399686 195873 354001 239801 -219646 -289754
32693 -289754 188147 439777 136794 -62759 266057 670691 782844 880222 1101481 1074326
32683 1074326 709959 483500 580331 573789 228526 -136135 -274547 -266010 -54050 479802
32673 479802 953994 837094 363239 230881 442549 404771 117469 175903 568841 622733
32663 622733 266982 210216 657550 971758 850248 732842 777048 561282 134088 208411
32653 208411 879145 1250036 841540 324687 302156 374549 65909 -249085 -73564 317050
$$ packed form
32723A543383n70015l79333K47131J06192k58615J12006N26106K7734o15050l10745
32713D28794L25670K19157j93385k6539K76570l9169m39292j67136K30691Q816
32703F24177k88861M2590M01995M4113m24328k03813J58128j14200m59447p0108
32693b89754M77901K51630l02983j99553L28816M04634J12153R7378K21259k7155
32683A074326l64367k26459R6831o542l45263l64661j38412Q537K11960N33852
32673D79802M74192j16900m73855j32358K11668l7778k87302N8434L92938N3892
32663F22733l55751n6766M47334L14208j21510j17406M4206k15766m27194P4323
32653B08411O70734L70891m08496n16853k2531P2393l08640l14994J75521L90614
$$ plain form
32643 317050 418075 306190 273784 213512 -50023 -302150 -313810 -234586 -218772 -125330 78426
32632 78426 117077 -78892 -167461 23310 223286 246217 231826 193040 -51968 -341441 -263469
32621 -263469 62584 87265 -126704 105609 793768 1012588 407429 -94740 253736 827750
32611 827750 734452 265489 267688 705895 886103 693336 613579 748623 699168 349242
32601 349242 38777 -22020 56601 181357 324597 327678 88091 -157971 -114877 135884
32591 135884 302110 313200 280937 235096 203254 328588 601120 707374 457323 126076
32581 126076 71959 259962 454860 613746 766207 773555 560649 364960 415672 556082
32571 556082 494612 249631 55322 -3909 4029 65128 184886 279448 293519 308253 408588
$$ packed form
32643C17050J01025j11885l2406o0272k63535k52127j1660P9224J5814R3442K03756
32632G8426L8651j95969q8569J90771J99976K2931j4391l8786k45008k89473P7972
32621b63469L26053K4681k13969K32313O88159K18820o05159n02169L48476N74014
32611H27750r3298m68963K199M38207J80208j92767p9757J35044m9455l49926
32601C49242l10465o0797P8621J24756J43240L081k39587k46062M3094K50761
32591A35884J66226J1090l2263m5841l1842J25334K72532J06254k50051l31247
32581A26076n4117J88003J94898J58886J52461P348k12906j95689N0712J40410
32571E56082o1470k44981j94309n9231P938O1099J19758R4562J4071J4734J00335
$$ plain form
32560 408588 569388 709752 694323 350349 -233226 -548247 -245394 234920 176942 -324629
32550 -324629 -496637 -138513 94333 -135434 -283534 53838 409447 316766 151563 408529
32540 408529 790309 786939 614676 750352 970997 732353 197498 8409 208415 239643
32530 239643 -51141 -203798 18720 299253 385133 423881 526047 506538 241702 -99883
32520 -99883 -310099 -321961 -103291 316308 695642 760479 543420 294581 109500 -83931
32510 -83931 -254456 -288115 -218062 -163556 -131554 -130579 -316582 -710393 -948334 -696262 -171847
32499 -171847 147048 208094 338908 610134 736195 616284 499340 516965 460674 167034
32489 167034 -196914 -379344 -336871 -179718 -24735 27695 -53942 -159337 -154957 -60449 31581
$$ packed form
32560D08588J60800J40364j5429l43974n83575l15021L02853M80314n7978n01571
32550c24629j72008L58124K32846k29767j48100L37372L55609r2681j65203K56966
32540D08529L81780l370j72263J35676K20645k38644n34855j89089K00006L1228
32530B39643k90784j52657K22518K80533Q5880L8748J02166j9509k64836l41585
32520i9883k10216j1862K18670M19599L79334O4837k17059k48839j85081j93431
32510h3931j70525l3659P0053N4506L2002R75j86003l93811k37941K52072N24415
32499a71847L18895O1046J30814K71226J26061j19911j16944J7625n6291k93640
32489A67034l63948j82430M2473J57153J54983N2430q1637j05395M380R4508R2030
$$ plain form
32478 31581 134176 275439 315627 90668 -301075 -563570 -519498 -204915 239747 574829
32468 574829 510060 33374 -409645 -368264 41734 310070 215048 12497 -35593 25022
32458 25022 58571 67929 89750 83557 40059 35835 83604 55982 -149861 -444859 -609652 -504654
32446 -504654 -210495 45873 140239 186107 318265 412564 243479 -99677 -255987 -109634
32436 -109634 68547 103918 159918 304636 252374 -135650 -454132 -269292 237219 560614
32426 560614 582172 547061 526578 382952 160237 49266 21291 -87838 -197282 -110013
32416 -110013 42820 -53615 -327961 -372593 -103082 105722 49158 4631 224717 500171
32406 500171 476809 149468 -177364 -245915 -19633 331608 516150 355266 15724 -148954
$$ packed form
32478C1581J02595J41263M0188k24959l91743k62495M4072L14583M44662L35082
32468E74829o4769m76686m43019M1381M09998K68336r5022k02551m8090O0615
32458B5022L3549R358K1821o193m3498m224M7769k7622k05843k94998j64793J04998
32446e04654K94159K56368R4366M5868J32158R4299j69085l43156j56310J46353
32436a09634J78181L5371N6000J44718n2262l88024l18482J84840N06511L23395
32426E60614K1558l5111k0483j43626k22715j10971k7975j09129j09444Q7269
32416a10013J52833r6435k74346m4632K69511K08804n6564m4527K20086K75454
32406E00171k3362l27341l26832o8551K26282L51241J84542j60884l39542j64678
$$ plain form
32396 -148954 -35279 116024 101647 7726 -8956 22488 -1207 -34127 62045 286538 450149
32385 450149 382496 142691 -35149 -38463 -36197 -211653 -415763 -345069 -55470 62117 -71997
32374 -71997 -23167 446840 862466 648102 -21878 -464685 -408291 -190449 -138632 -223914
32364 -223914 -308136 -311577 -135377 202780 379771 103212 -390410 -582669 -396128 -224500
32354 -224500 -237676 -164881 122627 312678 153594 -150775 -294435 -294444 -324507 -393518 -422178
32343 -422178 -430112 -444143 -381284 -176040 103683 342579 433407 241062 -262745 -803545
32333 -803545 -995910 -782499 -449214 -192858 41732 275248 383103 354810 351812 410625
32323 410625 380609 233989 130379 107847 51613 32824 270514 642574 691216 322657
$$ packed form
32396a48954J13675J51303j4377r3921j6682L1444k3695l2920R6172K24493J63611
32385D50149o7653k39805j77840l314K266j75456k04110P0694K89599J17587j34114
32374g1997M8830M70007M15626k14364o69980m42807N6394K17842N1817q5282
32364b23914q4222l441J76200L38157J76991k76559m93622j92259J86541J71628
32354b24500j3176P2795K87508J90051j59084l04369j43660rl0063o9011k8660
32343d22178p934j4031O2859K05244K79723K38896R0828j92345n03807n40800
32333h03545j92365K13411L33285K56356K34590K33516J07855k8293k998N8813
32323D10625l0016j46620j03610k2532n6234j8789K37690L72060M8642l68559
$$ plain form
32313 322657 52998 270542 668470 761544 590394 491937 477489 320000 66854 -15083
32303 -15083 77114 79386 -79085 -178739 -93235 34479 42944 -56917 -174909 -241533 -210965
32292 -210965 -121075 -120730 -280202 -422534 -312875 26093 349385 493314 485429 408198 328361
32281 328361 320534 384245 365562 139413 -140611 -160276 145629 446705 361046 -112799 -559250
32270 -559250 -538400 -19096 590678 873420 808072 660288 567912 463333 374228 468009
32260 468009 684607 656441 227453 -219581 -252748 9175 141610 102841 251669 701603
32250 701603 1077213 1023343 636671 250081 43656 13763 96288 144320 -30267 -401296
32240 -401296 -655734 -566130 -313513 -227378 -302026 -237091 58542 293869 225448 16582
$$ packed form
32313C22657k69659K17544L97928R3074j71150r8457j4448j57489k53146q1937
32303a5083R2197K272j58471r9654Q5504J27714Q465r9861j17992o6624L0568
32292b10965Q9890L45j59472j42332J09659L38968L23292J43929p885p7231p9837
32281C28361p827O3711j8683k26149k80024j9665L05905L01076q5659m73845m46451
32270e59250K0850N19304O09774K82742o5348j47784r2376j04579q9105R3781
32260D68009K16598k8166m28988m47034l3167K61923J32435l8769J48828M49934
32250G01603L75610n3870l86672l86590k06425k9893Q2525M8032j74587l71029
32240d01296k54438Q9604K52617Q6135p4648O4935K95633K35327o8421k08866
$$ plain form
32230 16582 -18351 137134 241568 199429 166674 248988 342951 353965 354278 399898 378184 200972
32218 200972 -484 -57082 -23309 -70924 -216332 -335921 -357740 -257085 10415 347255
32208 347255 439292 152125 -129825 41401 460280 497125 75030 -144454 243971 754020
32198 754020 741146 325533 95713 209823 345634 364293 441668 570365 481662 156758
32188 156758 -59964 -19360 -23097 -300142 -584693 -507223 -152129 86600 53254 -56670
32178 -56670 -54784 20259 27943 -102071 -310387 -414007 -248237 82379 226847 44289 -104376
32167 -104376 197368 765422 963697 544751 -29777 -260429 -250996 -402492 -736981 -905171
32157 -905171 -750222 -492354 -360535 -357349 -422263 -539778 -620254 -535211 -354152 -305389 -421711
$$ packed form
32230A6582l4933J55485J04434m2139l2755Q2314R3963J1014L13M5620k1714j77212
32218B00972k01456n6598L3773m7615j45408j19589k1819J00655K67500L36840
32208C47255R2037k87167k81950J71226M18879L6845m22095k19484L88425N10049
32198G54020j2874m15613k29820J14110J35811J8659P7375J28697q8703l24904
32188A56758k16722M0604l737k77045k84551P7470L55094K38729l3346j09924
32178e6670J886P5043P684j30014k08316j03620J65770L30616J44468j82558j48665
32167a04376L01744N68054J98275m18946n74528k30652R433j51496l34489j68190
32157i05171J54949K57868J31819L186o4914j17515q0476Q5043J81059M8763j16322
$$ plain form
32146 -421711 -480504 -391581 -356079 -485481 -555511 -367940 -106001 -59966 -206767 -348477
32136 -348477 -473910 -646491 -688481 -375738 107778 305076 111724 -78740 57540 356127
32126 356127 442873 214300 -90229 -159560 118581 547692 769533 637461 404485 389609
32116 389609 540557 558829 391799 292744 378980 450641 343765 186601 167538 266746 360192
32105 360192 419423 477424 522158 522445 471404 371556 267847 257731 328933 268758 -50087
32094 -50087 -372987 -331342 43053 379788 500832 531048 513758 361408 224607 406322
32084 406322 774912 787621 331501 11391 251386 609597 465112 -23193 -220116 23
32074 23 190174 130674 93479 285876 539352 652436 640868 541799 317577 69531 41503
$$ packed form
32146d21711n8793Q8923L5502j29402p0030J87571K61939M6035j46801j41710
32136c48477j25433j72581m1990L12743M83516J97298j93352j90464J36280K98587
32126C56127Q6746k28573l04529o9331K78141M29111K21841j32072k32976j4876
32116C89609J50948J8272j67030r9055Q6236P1661j06876j57164j9063R9208R3446
32105C60192N9231N8001M4734K87n1041r9848j03709j0116P1202o0175l18845
32094e0087l22900M1645L74395L36735J21044L0216j7290j52350j36801J81715
32084D06322L68590J2709m56120l20110K39995L58211j44485m88305j96923K20139
32074B3J90151n9500l7195J92397K53476J13084j1568r9069k24222k48046k8028
$$ plain form
32063 41503 275090 503359 508285 380973 321673 359488 372698 251812 -26699 -370378 -580056
32052 -580056 -516389 -283267 -125341 -137799 -204031 -204871 -131926 1339 182680 312991 273613
32041 273613 132447 119505 319694 520749 455793 112614 -263717 -413297 -271297 -2071
32031 -2071 151683 112639 60824 207197 494140 643696 520774 303812 212622 193116 33620
32020 33620 -246425 -329369 -25392 379577 418895 66808 -194560 -39285 230917 133215
32010 133215 -269747 -463347 -240502 54415 119749 118060 287072 475462 389282 91433
32000 91433 -72418 52667 296143 437404 404392 258745 159596 265509 514560 608742
31990 608742 384822 70089 -29241 46305 42607 -69572 -92559 7800 23096 -140434 -284631
$$ packed form
32063D1503K33587K28269M926j27312n9300L7815J3210j20886k78511l43679k09678
32052e80056O3667K33122J57926j2458o6232q40P2945J33265J81341J30311l9378
32041B73613j41166j2942K00189K01055o4956l43179l76331j49580J42000K69226
32031b071J53754l9044n1815J46373K86943J49556j22922k16962r1190j9506j59496
32020C3620k80045q2944L03977M04969L9318l52087k61368J55275K70202r7702
32010A33215m02962j93600K22845K94917O5334j689J69012J88390q6180k97849
32000I1433j63851J25085K43476J41261l3012j45647r9149J05913K49051R4182
31990F08742k23920l14733r9330P5546l698j12179k2987J00359J5296j63530j44197
$$ plain form
31979 -284631 -200415 48093 225635 213582 114802 103524 204801 250388 105090 -109178
31969 -109178 -162761 -68496 -49897 -133043 -83658 133274 198440 -20076 -141211 143709 477455
31958 477455 313574 -216240 -448068 -125178 322063 440176 217531 -157986 -534445 -690567
31948 -690567 -443008 -6104 155993 -21708 -116424 61263 126878 -213328 -594137 -501146
31938 -501146 -38099 272392 262917 229743 345521 417194 284410 88011 5782 -11926 -84931
31927 -84931 -173599 -175953 -129587 -143833 -195317 -165143 -75453 -114786 -353173 -571970 -515446
31916 -515446 -225393 45498 199351 345390 479079 394459 59196 -165929 78741 671317
31906 671317 1146093 1225405 1018748 779889 673675 722053 786610 656621 322560 77557
$$ packed form
31979b84631Q4216K48508J77542j2053r8780j1278J01277M5587j45298k14268
31969a09178n3583R4265J8599q3146M9385K16932O5166k18516j21135K84920L33746
31958D77455j63881n29814k31828L22890M47241J18113k22645l75517l76459j56122
31948f90567K47559M36904J62097j77701r4716J77687O5615l40206l80809R2991
31938e01146M63047L10491r475l3174J15778P1673j32784j96399q2229j7708p3005
31927h4931q8668k354M6366j4246n1484L0174Q9690l9333k38387k18797N6524
31916e15446K90053K70891J53853J46039J33689q4620l35263k25125K44670N92576
31906F71317M74776P9312k06657k38859j06214M8378O4557j29989l34061k45003
$$ plain form
31896 77557 163324 418926 496720 323945 105032 -40417 -164841 -279351 -329538 -346699
31886 -346699 -374373 -308812 -70344 164875 204799 195554 368691 544004 337298 -180558
31876 -180558 -531222 -556598 -565288 -658813 -493849 47135 490810 437432 158756 132739 324584
31865 324584 356393 146851 -37000 -23165 117275 266798 341958 287817 197616 278566 505720
31854 505720 528495 160203 -271209 -349032 -131474 27624 25299 17839 39100 5305 13023
31843 13023 230569 504957 458281 40089 -336951 -324997 -63586 53368 -124689 -359531
31833 -359531 -315423 57665 437056 478542 249565 152455 365170 592974 528233 309555
31823 309555 265881 396941 425361 252771 47203 -65546 -103529 -56541 110236 299005
$$ packed form
31896G7557Q5767K55602P7794j72775k18913j45449j24424j14510n0187j7161
31886c46699k7674O5561K38468K35219L9924r245J73137J75313k06706n17856
31876a80558l50664k5376q690r3525J64964N40984M43675n3378k78676k6017J91845
31865C24584L1809k09542j83851J3835J40440J49523P5160n4141r0201Q0950K27154
31854E05720K2775l68292m31412p7823K17558J59098k325p460K1261l3795P718
31843A3023K17546K74388m6676m18192l77040J1954K61411J16954j78057k34842
31833c59531M4108L73088L79391M1486k28977r7110K12715K27804o4741k18678
31823C09555m3674J31060K8420j72590k05568j12749l7983M6988J66777J88769
$$ plain form
31813 299005 379295 411875 512507 547567 292801 -106670 -201649 141181 523135 585189
31803 585189 500947 651408 1011887 1168486 895060 448639 215550 231752 212086 22393
31793 22393 -69155 239324 763268 947358 566523 50312 -71345 178525 391419 418665
31783 418665 480177 670403 745896 517335 151964 -88162 -190199 -276009 -303678 -121055
31773 -121055 232316 490728 472324 278843 109136 -17553 -219550 -480692 -600588 -469717
31763 -469717 -224118 -13200 206159 454738 509102 222364 -65830 115773 614359 755130
31753 755130 323402 -78268 77385 485718 545649 239144 -12329 -56521 -44579 20595
31743 20595 227271 395463 306593 177364 360605 663184 555845 44804 -285969 -169249
$$ packed form
31813B99005Q0290L2580J00632L5060k54766l99471r4979L42830L81954O2054
31803E85189q4242J50461L60479J56599k73426m46421k33089J6202j9666j89693
31793B2393r1548L08479N23944J84090l80835n16211j21657K49870K12894K7246
31783D18665O1512J90226P5493k28561l65371k40126j02037q5810k7669J82623
31773a21055L53371K58412j8404j93481j69707j26689k01997k61142j19896J30871
31763d69717K45599K10918K19359K48579N4364k86738k88194J81603M98586J40771
31753G55130m31728m01670J55653M08333N9931l06505k51473m4192J1942O5174
31743B0595K06676J68192q8870j29229J83241L02579j07339n11041l30773J16720
$$ plain form
31733 -169249 27784 21355 24409 196643 263861 33052 -202734 -158581 -38018 -115374 -209441
31722 -209441 -23249 280881 315062 77885 -113682 -169870 -274719 -456709 -520889 -417949
31712 -417949 -334609 -361794 -353565 -198474 -16127 18138 -90067 -183509 -158471 -78140 -71770
31701 -71770 -134900 -107506 73818 205576 70980 -222227 -397562 -429121 -485227 -503786 -256383
31690 -256383 116308 133004 -288606 -624091 -548042 -435075 -656896 -872884 -585463 -33663
31680 -33663 123405 -195339 -465918 -424614 -309978 -246957 -30507 357055 570440 427869
31670 427869 164545 3814 -102032 -161945 -22671 257663 339028 123993 -46651 43959
31660 43959 139046 4485 -126424 32572 301187 332402 157035 9722 -147059 -454541
$$ packed form
31733a69249J97033o429L054J72234O7218k30809k35786M4153J20563p7356r4067
31722b09441J86192L04130L4181k37177j91567n6188j04849j81990o4180J02940
31712d17949Q3340k7185Q229J55091J82347L4265j08205r3442K5038Q0331O370
31701g1770o3130K7394J81324J31758j34596k93207j75335l1559n6106j8559K47403
31690b56383L72691J6696m21610l35485P6049J12967k21821k15988K87421N51800
31680c3663J57068l18744k70579M1304J14636O3021K16450L87562K13385j42571
31670D27869k63324j60731j05846n9913J39274K80334Q1365k15035j70644R0610
31660D3959R5087j34561j30909J58996K68615L1215j75367j47313j56781l07482
$$ plain form
31650 -454541 -687798 -476213 57226 376747 292329 173787 303219 462885 377791 184240
31640 184240 150375 192408 14514 -397940 -741058 -810196 -685875 -488067 -195960 188152
31630 188152 482731 501958 315455 185136 246026 363076 334729 147043 -31931 -42980
31620 -42980 151017 483333 809468 941203 780863 447504 170449 33665 -64552 -172866
31610 -172866 -171827 -3000 139100 33100 -229032 -343485 -229737 -147153 -312195 -590115
31600 -590115 -691553 -533015 -246218 67561 396525 667336 746513 647775 571532 637323
31590 637323 698100 543450 200525 -111994 -281688 -392501 -513754 -558084 -415960 -129589
31580 -129589 135409 235451 150952 29761 123335 526482 943689 910842 365488 -189056
$$ packed form
31650d54541k33257K11585N33439L19521q4418j18542J29432J59666q5094j93551
31640A84240l3865M2033j77894m12454l43118o9138J24321J97808K92107L84112
31630A88152K94579J9227j86503j30319O0890J17050k8347j87686j78974j1049
31620d2980J93997L32316L26135J31735j60340l33359k77055j36784r8217j08314
31610a72866J039J68827J42100j06000k62132j14453J13748Q2584j65042k77920
31600e90115j01438J58538K86797L13779L28964K70811P9177r8738p6243O5791
31590F37323O0777j54650l42925l12519j69694j10813j21253m4330J42124K86371
31580a29589K64998J00042q4499j21191R3574M03147M17207l2847n45354n54544
$$ plain form
31570 -189056 -259942 60954 311848 284041 130222 -33653 -243550 -396449 -250007 154937
31560 154937 422765 346591 215126 344576 594124 645095 515222 435724 399758 239847
31550 239847 51748 107307 354464 428615 229205 79463 172830 236027 -37652 -514977
31540 -514977 -821106 -784963 -478576 -39125 326294 381338 155501 -2048 91172 150015
31530 150015 -84114 -315364 -115152 307809 326317 -133730 -432875 -177371 215964 212646
31520 212646 -44557 -52221 253214 469265 346373 22095 -297595 -536404 -639550 -565262
31510 -565262 -406963 -309476 -279474 -259757 -302772 -437237 -472486 -243407 29159 -10969 -271120
31499 -271120 -292890 26137 243803 74802 -157303 -62618 187686 170436 -97439 -210031
$$ packed form
31570a89056p0886L20896K50894k7807j53819j63875k09897j52899J46442M04944
31560A54937K67828p6174j31465J29450K49548N0971j29873p9498l5966j59911
31550B39847j88099N5559K47157P4151j99410j49742R3367O3197k73679m77325
31540e14977l06129L6143L06387M39451L65419N5044k25837j57549R3220N8843
31530A50015k34129k31250K00212M22961J8508m60047k99145K55504L93335l318
31520B12646k57203p664L05435K16051j22892l24278l19690k38809j03146P4288
31510e65262J58299R7487L0002J9717m3015j34465l5249K29079K72566m0128k60151
31499b71120k1770L19027K17666j69001k32105R4685K50304j7250k67875j12592
$$ plain form
31489 -210031 -5853 256540 342746 305507 252313 155795 7420 -66280 21799 163790 186848
31478 186848 66741 -50983 -2285 233822 490116 560195 430657 287444 241219 189015
31468 189015 63564 41418 278628 565583 529572 138180 -270481 -442652 -414362 -258058
31458 -258058 55635 448477 669045 586654 350751 146256 -6300 -104341 -54025 133903
31448 133903 241754 118364 -102404 -214224 -215759 -226522 -285440 -384412 -532927 -631631 -477946
31437 -477946 -96652 135967 -49427 -406880 -513916 -370477 -320127 -461799 -517499 -303566
31427 -303566 4688 163277 147320 55896 -48523 -111133 -74705 23200 82157 91079 97505
31416 97505 50318 -113935 -250073 -145300 99322 148779 -24053 -36111 280959 509937
$$ packed form
31489b10031K04178K62393Q6206l7239n3194r6518j48375p3700Q8079J41991K3058
31478A86848j20107j17724M8698K36107K56294P0079j29538j43213m6225n2204
31468A89015j25451k2146K37210K86955l6011l91392m08661j72171K8290J56304
31458b58058L13693L92842K20568q2391k35903k04495j52556r8041N0316J87928
31448A33903J07851j23390k20768j11820j535j0763n8918r8972j48515r8704J53685
31437d77946L81294K32619j85394l57453j07036J43439N0350j41672n5700K13933
31427c03566L08254J58589j5957r1424j04419o2610L6428R7905N8957Q922O426
31416I7505m7187j64253j36138J04773K44622M9457j72832j2058L17070K28978
$$ plain form
31406 509937 227678 -299985 -417513 26731 502789 553801 351385 318076 470794 442309
31396 442309 81424 -268888 -212120 164671 410668 316257 135676 121771 109354 -190949
31386 -190949 -663362 -892126 -742208 -490940 -365710 -304851 -249833 -292835 -376023 -229263
31376 -229263 140145 256691 -176013 -735937 -808641 -424278 -98372 -4234 136698 375486
31366 375486 360190 1836 -229275 14099 396193 411257 156927 140177 457380 640932
31356 640932 365021 -80722 -192422 114500 478942 580097 442049 265744 141444 30746
31346 30746 -60128 -52199 37458 40806 -144811 -371642 -398840 -190930 59257 165656 79729
31335 79729 -164220 -462093 -616352 -497777 -256772 -178083 -285135 -309653 -128242 31592
$$ packed form
31406E09937k82259n27663j17528M44244M76058N1012k02416l3309J52718k8485
31396D42309l60885l50312N6768L76791K45997r4411j80581j3905j2417l00303
31386a90949m72413k28764J49918K51268J25230O0859N5018m3002q3188J46760
31376b29263L69408J16546m32704n59924p2704L84363L25906R4138J40932K38788
31366C75486j5296l58354k31111K43374L82094J5064k54330j6750L17203J83552
31356F40932k75911m45743j11700L06922L64442J01155j38048j76305j24300j10698
31346C0746r0874P929Q9657L348j85617k26831k7198K07910K50187J06399q5927
31335G9729k43949k97873j54259J18575K41005P8689j07052k4518J81411J59834
$$ plain form
31325 31592 -19439 -90664 84441 390292 494561 367667 286015 334490 278171 21627 -160065
31314 -160065 -55349 109083 20612 -193854 -156058 133926 254062 13196 -214537 -9150
31304 -9150 499369 814717 696953 334640 -5556 -208164 -210136 27161 366346 538119
31294 538119 435896 206548 5494 -136474 -160524 33463 326984 388421 128323 -110430
31284 -110430 -52115 82200 -49604 -344279 -452567 -364940 -340331 -350139 -106761 338917
31274 338917 545771 344658 68866 -50797 -232140 -609869 -821963 -530702 -12268 220460
31264 220460 143635 119866 238266 229477 -17494 -287042 -409207 -442416 -444537 -379484 -303998
31253 -303998 -355528 -487222 -479817 -289472 -133500 -146031 -186234 -93210 84964 240372 395985
$$ packed form
31325C1592n1031p1225J75105L05851J04269j26894q1652M8475n6319k56544j81692
31314a60065J04716J64432q8471k14466L7796K89984J20136k40866k27733K05387
31304i150N08519L15348j17764l62313l40196k02608j972K37297L39185J71773
31294E38119j02223k29348k01054j41968k4050J93987K93521O1437k60098k38753
31284a10430N8315J34315j31804k94675j08288Q7627K4609r808K43378M45678
31274C38917K06854k01113k75792j19663j81343l77729k12094K91261N18434K32728
31264B20460p6825k3769J18400q789k46971k69548j22165l3209k121O5053P5486
31253c03998n1530j31694P405J90345J55972j2531m0203R3024J78174J55408J55613
$$ plain form
31242 395985 602044 771710 754465 506753 125635 -211646 -319701 -131648 206743 463297
31232 463297 546042 504139 353919 92842 -126383 -75148 230253 495801 526996 444598
31222 444598 419237 389689 205432 -92221 -299205 -282398 -73136 192008 338086 254349
31212 254349 13076 -198467 -306404 -387335 -454931 -408754 -270375 -236248 -351151 -360513 -93509
31201 -93509 219019 272374 157376 186030 369703 434376 314626 242727 288218 199238 -115863
31190 -115863 -284771 43259 601487 752832 310685 -199208 -200296 243470 593383 560206
31180 560206 381494 341743 311103 6989 -448209 -594109 -289263 40749 -25109 -364645
31170 -364645 -578807 -558102 -472994 -369467 -145843 131677 252754 200522 134008 40142
$$ packed form
31242C95985K06059J69666j7245k47712l81118l37281j08055J88053L38391K56554
31232D63297Q2745m1903j50220k61077k19225N1235L05401K65548L1195q2398
31222D44598k5361k9548j84257k97653k06984J6807K09262K65144J46078q3737
31212B54349k41273k11543j07937q0931o7596M6177J38379L4127j14903r362K67004
31201i3509L12528N3355j14998K8654J83673O4673j19750p1899M5491q8980l15101
31190a15863j68908L28030N58228J51345m42147n09893j088M43766L49913l3177
31180E60206j78712l9751l0640l04114m55198j45900L04846L30012o5858l39536
31170c64645k14162K0705Q5108J03527K23624K77520J21077n2232o6514r3866
$$ plain form
31160 40142 -217868 -476591 -355831 83747 243417 -159179 -571169 -366266 215636 425661
31150 425661 95491 -234834 -236147 -209247 -426755 -611157 -405016 18743 209178 84222
31140 84222 -39999 44937 232010 362421 415212 404867 307189 151507 47139 66090 182992
31129 182992 335698 460581 484766 383546 233776 113224 -30304 -291742 -603724 -761249
31119 -761249 -681559 -508130 -394000 -297810 -97910 165036 296354 207481 53248 26745
31109 26745 72661 -58988 -432838 -745126 -673517 -328672 -132135 -241516 -365876 -260486
31099 -260486 -125787 -272600 -592370 -679269 -388800 34966 347224 504285 486701 264593
31089 264593 5186 -19150 148754 142111 -154813 -350192 -114018 282541 331452 -1173
$$ packed form
31160D0142k58010k58723J20760M39578J59670m02596m11990K04903N81902K10025
31150D25661l30170l30325j313K6900k17508j84402K06141M23759J90435j24956
31140H4222j24221Q4936J87073J30411N2791j0345r7678j55682j04368J8951J16902
31129A82992J52706J24883K4185j01220j49770j20552j43528k61438l11982j57525
31119g61249P9690J73429J14130R6190J99900K62946J31318q8873j54233k6503
31109B6745M5916j31649l73850l12288P1609L44845J96537j09381j24360J05390
31099b60486J34699j46813l19770q6899K90469M23766L12258J57061j7584k22108
31089B64593k59407k4336J67904o643k96924j95379K36174L96559M8911l32625
$$ plain form
31079 -1173 -289227 -268284 -87797 31822 66287 70550 62431 91149 220820 398537 505421
31068 505421 539128 558730 475635 151835 -277297 -459640 -287185 -40589 34329 31840 115060
31057 115060 198230 127301 -18047 -58494 -15978 -26563 -55398 30328 158785 106626 -129857
31046 -129857 -268883 -111018 226557 502077 588895 469929 207207 19634 175261 629933
31036 629933 936290 728643 202401 -106578 34446 354592 504253 439303 327066 289096
31026 289096 355527 512693 658862 627533 385548 118973 9322 23413 44333 86138
31016 86138 203719 296663 234463 128273 224550 512124 681702 549627 307369 242826
31006 242826 388372 558749 592060 448777 206563 45099 88528 185797 41855 -321007
$$ packed form
31079a173k88054K0943J80487J19619L4465M263q119K8718J29671J77717J06884
31068E05421L3707J9602q3095l23800m29132j82343J72455K46596P4918k489Q3220
31057A15060Q3170p0929j45348m0447M2516j0585k8835Q5726J28457n2159k36483
31046a29857j39026J57865L37575K75520Q6818j18966k62722j87573J55627M54672
31036F29933L06357k07647n26242l08979J41024L20146J49661o4950j12237l7970
31026B89096O6431J57166J46169l1329k41985k66575j09651J4091K0920M1805
31016H6138J17581R2944o2200j06190R6277K87574J69578j32075k42258o4543
31006B42826J45546J70377L3311j43283k42214j61464M3429R7269j43942l62862
$$ plain form
30996 -321007 -471052 -138338 339022 426678 106283 -153714 -73138 146152 232597 212829
30986 212829 227075 236402 124338 -49554 -105077 -11901 53474 -54642 -255907 -349015 -275768
30975 -275768 -197985 -281823 -489148 -672091 -792057 -881709 -850574 -580648 -227115 -114943
30965 -114943 -231418 -154824 308463 748277 718319 385156 214694 249149 180912 6231
30955 6231 59838 394563 640834 585468 438913 385352 287044 31972 -188224 -180938 -57190
30944 -57190 -27971 -119316 -244161 -342157 -332002 -146096 107781 253445 330987 469001 499886
30933 499886 152832 -334380 -365360 82010 284790 -148487 -640775 -547806 -135046 -48193
30923 -48193 -257435 -237952 86772 307482 284252 263824 321418 313680 330288 566039 781385
$$ packed form
30996c21007j50045L32714M77360Q7656l20395k59997Q0576K19290Q6445j9768
30986B12829J4246R327j12064j73892n5523R3176O5375j08116k01265r3108P3247
30975b75768P7783q3838k07325j82943j19966q9652L1135K69926L53533J12172
30965a14943j16475P6594M63287M39814k9958l33163j70462L4455o8237j74681
30955F231N3607L34725K46271n5366j46555n3561r8308k55072k20196P286J23748
30944e7190K9219r1345j24845r7996J0155J85906K53877J45664P7542J38014L0885
30933D99886l47054m87212l0980M47370K02780m33277m92288R2969M12760Q6853
30923d8193k09242J9483L24724K20710k3230k0428N7594p738J6608K35751K15346
$$ plain form
30912 781385 552737 73326 -3784 374668 502246 49944 -373559 -208147 160433 60080
30902 60080 -376257 -424962 155220 845674 1086743 814560 304252 -131884 -253410 -7182
30892 -7182 374065 552903 406266 82649 -197792 -295050 -191698 -17216 37739 -61891
30882 -61891 -144314 -81270 29363 38434 -24283 -25176 75977 226343 369286 415283 242749
30871 242749 -135372 -503951 -668994 -655437 -578874 -442221 -190964 130870 403603 529347
30861 529347 438281 136720 -178543 -249824 -120219 -141001 -446438 -671004 -458102 -37779
30851 -37779 55409 -278954 -626182 -677652 -554653 -456933 -342243 -118790 96086 114530
30841 114530 -54628 -238005 -326446 -352432 -370732 -349080 -203995 56704 261025 234607
$$ packed form
30912G81385k28648m79411p7110L78452J27578m52302m23503J65412L68580j00353
30902F0080m36337m8705N80182O90454K41069k72183n10308m36136j21526K46228
30892g182L81247J78838j46637l23617k80441r7258J03352J74482N4955r9630
30882f1891q2423O3044J10633R071o2717q93J01153J50366J42943M5997j72534
30871B42749l78121l68579j65043J3557P6563J36653K51257L21834K72733J25744
30861E29347r1066l01561l15263p1281J29605k0782l05437k24566K12902M20323
30851c7779R3188l34363l47228n1470J22999R7720J14690K23453K14876J8444
30841A14530j69158j83377q8441k5986j8300K1652J45085K60699K04321k6418
$$ plain form
30831 234607 53989 -8032 128574 202584 21328 -178282 -69873 194065 144220 -272655
30821 -272655 -529601 -234235 328101 594367 426069 157793 103345 266544 460649 499274
30811 499274 311365 35939 -42635 192647 493529 516960 246247 -25565 -96218 -44806
30801 -44806 -18223 -32117 -56572 -131749 -278402 -395213 -367560 -230673 -125291 -111834 -109778
30790 -109778 -23571 128255 225165 161530 -51088 -283801 -395076 -341453 -176802 42543
30780 42543 298755 538815 628936 473057 175319 -6812 70593 268110 336768 238957
30770 238957 189217 341869 553581 572134 395681 275707 346865 430234 302960 20527
30760 20527 -186152 -240184 -247405 -231815 -73073 233878 462437 429548 248878 161790 213257
$$ packed form
30831B34607j80618o2021J36606P4010j81256j99610J08409K63938m9845m16875
30821b72655k56946K95366N62336K66266j68298k68276n4448J63199J94105L8625
30811D99274j87909k75426p8574K35282L00882K3431k70713k71812p0653N1412
30801d4806K6583j3894k4455p5177j46653j16811K7653J36887J05382J3457K056
30790a09778Q6207J51826R6910o3635k12618k32713j11275N3623J64651K19345
30780D2543K56212K40060R0121j55879k97738j82131P7405J97517O8658r7811
30770B38957m9740J52652K11712J8553j76453j19974P1158Q3369j27274k82433
30760B0527k06679n4032p221J5590J58742L06951K28559l2889j80670q7088N1467
$$ plain form
30749 213257 255365 211480 160408 157395 124167 -31506 -271481 -440109 -382821 -69073 345131
30738 345131 608936 602585 435283 248539 5886 -381881 -785330 -909829 -639488 -163005
30728 -163005 271941 568886 712926 674429 476839 234675 44900 -63201 -48483 119287
30718 119287 320096 352074 210421 106322 120107 61876 -170362 -318496 -90007 381352
30708 381352 648907 476592 68581 -183146 -54782 332963 589483 410530 -51479 -329884
30698 -329884 -240833 -91799 -148121 -217668 -50469 168948 145157 37108 194309 488077
30688 488077 471690 149300 -15528 95113 63150 -275767 -456250 -114686 411009 608577
30678 608577 513141 474815 533520 492332 388950 423235 534624 478030 266082 160873 245796
$$ packed form
30749B13257M2108m3885n1072l013l3228j55673k39975j68628N7288L13748M14204
30738C45131K63805o351j67302j86744k42653l87767m03449j24499K70341M76483
30728a63005M34946K96945J44040l8497j97590k42164j89775j08101J4718J67770
30718A19287K00809L1978j41653j04099J3785n8231k32238j48134K28489M71359
30708C81352K67555j72315m08011k51727J28364L87745K56520j78953m62009k78405
30698c29884Q9051J49034n6322o9547J67199K19417k3791j08049J57201K93768
30688D88077j6387l22390j64828J10641l1963l38917j80483L41564N25695J97568
30678F08577r5436l8326N8705m1188j03382L4285J11389n6594k11948j05209Q4923
$$ plain form
30667 245796 342520 357504 394762 476302 426366 130681 -275725 -561698 -619918 -496699 -304800
30656 -304800 -134355 1465 116467 145092 10203 -158581 -71397 318578 649340 593030
30646 593030 308745 208390 385107 546880 464401 216165 -17932 -175363 -272442 -307106
30636 -307106 -259733 -130648 8534 -6676 -266192 -550470 -492405 -103498 138384 -47607
30626 -47607 -293449 -138195 240403 324515 99464 28293 235594 327187 122880 -24350
30616 -24350 120192 230180 -19536 -367259 -362262 -52967 157051 144824 122933 157382 56461
30605 56461 -238420 -501042 -549640 -472650 -421710 -374981 -233448 -32235 74941 14484 -99942
30594 -99942 -82082 110361 304253 306716 152852 59766 125137 212432 204327 218776 421322
$$ packed form
30667B45796R6724J4984L7258Q1540m9936k95685m06406k85973n8220J23219J91899
30656c04800J70445J35820J15002K8625j34889j68784Q7184L89975L30762n6310
30646E93030k84285j00355J76717J61773q2479k48236k34097j57431r7079l4664
30636c07106M7373J29085J39182j5210k59516k84278N8065L88907K41882j85991
30626d7607k45842J55254L78598Q4112k25051p1171K07301R1593k04307j47230
30616b4350J44542J09988k49716l47723M997L09295K10018j2227k1891L4449j00921
30605E6461k94881k62622m8598P6990N0940M6729J41533K01213J07176o0457j14426
30594i9942J7860J92443J93892K463j53864r3086O5371Q7295q105J4449K02546
$$ plain form
30583 421322 713949 802874 580026 278530 181150 268460 256163 -25277 -367397 -371030 99106
30572 99106 716429 999903 772059 260178 -177907 -321846 -160171 128530 270323 138680
30562 138680 -72705 -65753 167163 344191 307621 205583 183011 148525 21191 -16994 224896
30551 224896 572004 642182 342601 -29676 -183601 -118838 10940 117586 182677 188606
30541 188606 140971 78308 -2041 -160017 -405208 -626489 -673707 -492790 -186643 30497
30531 30497 -8156 -225421 -307988 -33806 429437 700030 656403 550796 597977 667530 538350
30520 538350 280322 151632 216728 322503 406990 538793 627004 426555 -22527 -274245
30510 -274245 -52727 297584 276531 -31287 -101176 209657 462811 354622 167495 257906
$$ packed form
30583D21322K92627Q8925k22848l01496r7380Q7310j2297k81440l42120l633M70136
30572I9106O17323K83474k27844n11881m38085j43939J61675K88701J41793j31643
30562A38680k11385O952K32916J77028l6570j02038k2572l4486j27334l8185K41890
30551B24896L47108P0178k99581l72277j53925O4763J29778J06646O5091N929
30541A88606m7635o2663q0349j57976k45191k21281m7218J80917L06147K17140
30531C0497l8653k17265q2567K74182M63243K70593m3627j05607M7181O9553j29180
30520E38350k58028j28690O5096J05775Q4487J31803Q8211k00449m49082k51718
30510b74245K21518L50311k1053l07818o9889L10833K53154j08189j87127R0411
$$ plain form
30500 257906 469102 406708 57042 -238602 -282921 -152750 61816 292860 326467 -23730
30490 -23730 -538221 -719527 -389751 103153 349325 282490 42958 -261714 -491690 -436523
30480 -436523 -90390 195286 84595 -296483 -509530 -374431 -184560 -299199 -668867 -889687
30470 -889687 -698174 -283397 -20320 25251 127771 410194 584854 382832 23575 -67702
30460 -67702 106758 156091 -35279 -102319 215189 653542 806509 632796 342126 31243
30450 31243 -276004 -417927 -256157 36847 147768 58746 63058 329675 666263 774382
30440 774382 593414 324151 190183 219976 242734 107499 -101849 -152968 15431 192214
30430 192214 188139 95579 120010 249272 258372 21463 -316651 -505801 -455562 -302112 -214945
$$ packed form
30500B57906K11196o2394l49666k95644m4319J30171K14566K31044L3607l50197
30490b3730n14491j81306L29776M92904K46172o6835k39532l04672k29976N5167
30480d36523L46133K85676j10691l81078k13047J35099J89871j14639l69668k20820
30470h89687J91513M14777K63077M5571J02520K82423J74660k02022l59257r1277
30460f7702J74460M9333j91370o7040L17508M38353J52967j73713k90670l10883
30450C1243l07247j41923J61770K93004J10921q9022M312K66617L36588J08119
30440G74382j80968k69263j33968K9793K2758j35235k09348n1119J68399J76783
30430A92214m075r2560K4431J29262R100k36909l38114j89150N0239J53450Q7167
$$ plain form
30419 -214945 -155566 86052 541121 866059 697994 160726 -230401 -185559 96009 327485
30409 327485 497640 695381 850114 855623 756567 630864 467663 311660 306935 423440
30399 423440 383634 74762 -210567 -189273 3146 90333 79607 82416 -19582 -313175 -487048
30388 -487048 -224289 181717 142785 -345304 -692697 -614929 -475561 -588565 -724019 -580522
30378 -580522 -303730 -193696 -224704 -204248 -165393 -251424 -369821 -294241 -37998 154226
30368 154226 167213 140305 210167 302438 253955 65049 -58672 40429 213682 143020 -195663
30357 -195663 -396032 -145278 287359 393273 138835 -58439 -27369 -31641 -160110 -49197
30347 -49197 483585 945566 742632 19808 -492448 -375950 83152 360755 247595 -83948
$$ packed form
30419b14945N9379K41618M55069L24938j68065n37268l91127M4842K81568K31476
30409C27485J70155J97741J54733N509r9056j25703j63201j56003m725J16505
30399D23440l9806l08872k85329K1294J92419Q7187j0726K809j01998k93593j73873
30388d87048K62759M06006l8932m88089l47393P7768J39368j13004j35454J43497
30378e80522K76792J10034l1008K0456L8855q6031j18397P5580K56243J92224
30368A54226J2987k6908O9862R2271m8483j88906j23721R9101J73253p0662l38683
30357a95663k00369K50754M32637J05914k54438j97274L1070m272j28469J10913
30347d9197N32782M61981k02934p22824n12256J16498M59102K77603j13160l31543
$$ plain form
30337 -83948 -332075 -325042 -145257 -5646 29203 86941 197674 168293 -93268 -333016 -272123
30326 -272123 -23716 78357 -41318 -171276 -187080 -155926 -97176 57728 234822 226251
30316 226251 11604 -154743 -73416 162438 345502 409257 412333 401404 387428 371351 324119
30305 324119 203874 25823 -141623 -247016 -260312 -155352 10735 67606 -67354 -215523
30295 -215523 -156156 19654 9360 -241091 -439729 -379288 -211707 -175357 -279560 -406476
30285 -406476 -506015 -508593 -257521 231078 607426 564108 267125 129412 226526 250577 36938
30274 36938 -195243 -215014 -100763 -38386 -30308 7049 25612 -73779 -250557 -392459 -493676
30263 -493676 -604869 -683211 -661834 -608104 -634428 -687113 -602358 -361307 -123060 -7534 -6816
$$ packed form
30337h3948k48127P033J79785J39611L4849N7738J10733k9381k61561k39748O0893
30326b72123K48407J02073j19675j29958j5804L1154N8750J54904J77094q571
30316B26251k14647j66347Q1327K35854J83064O3755L076j0929j3976j6077m7232
30305C24119j20245j78051j67446j05393j3296J04960J66087N6871j34960j48169
30295b15523N9367J75810j0294k50451j98638O0441J67581L6350j04203j26916
30285d06476r9539k578K51072M88599L76348m3318k96983j37713R7114K4051k13639
30274C6938k32181j9771J14251O2377Q078L7357J8563r9391j76778j41902j01217
30263d93676j11193p8342K1377N3730k6324n2685Q4755K41051K38247J15526P18
$$ plain form
30252 -6816 -102889 -287465 -451923 -457305 -355845 -341944 -424501 -371999 -90567 169065 151775
30241 151775 -38169 -110012 17805 194264 290443 275069 135419 -76125 -211502 -240253
30231 -240253 -365501 -674694 -811981 -363059 471668 992982 871647 525633 471237 649309
30221 649309 656308 371455 18222 -251299 -488812 -685020 -660702 -313332 176906 475445
30211 475445 396164 81968 -101388 70500 378750 345770 -179877 -755477 -824676 -370336
30201 -370336 113306 248432 137424 74005 129941 166140 107103 26789 -1536 -4336 -40728
30190 -40728 -124416 -243854 -398062 -561692 -647971 -577458 -401364 -299797 -398932 -602105
30180 -602105 -662515 -451703 -126284 14486 -150068 -407771 -423528 -110836 269239 425787
$$ packed form
30252f816r6073j84576j64458n382J01460J3901q2557N2502K81432K59632j7290
30241A51775j89944p1843J27817J76459R6179j5374j39650k11544j35377k8751
30231b40253j25248l09193j37287M48922Q34727N21314j21335l46014n4396J78072
30221F49309O999k84853l53233k69521k37513j96208K4318L47370M90238K98539
30211D75445p9281l14196j83356J71888L08250l2980n25647n75600o9199M54340
30201c70336M83642J35126j11008o3419N5936L6199n9037q0314k8325k800l6392
30190d0728q3688j19438j54208j63630q6279P0513J76094J01567r9135k03173
30180f02105o0410K10812L25419J40770j64554k57703j5757L12692L80075J56548
$$ plain form
30170 425787 369489 310150 301529 203675 5324 -76685 67349 240301 239866 142301 85074
30159 85074 2220 -146905 -117308 270864 688401 655755 257324 5178 18620 -95703
30149 -95703 -459394 -627149 -326071 65858 139175 58336 110934 101834 -244521 -611636 -460301
30138 -460301 98342 420717 265275 21362 -17339 -30810 -186576 -281242 -99927 231387
30128 231387 466001 530572 453501 277947 166780 298285 536608 524574 241452 112222
30118 112222 362566 629232 496107 95821 -164973 -206934 -213188 -184277 -12442 125064
30108 125064 -62660 -420159 -435125 3600 373647 258327 -44748 39449 563917 1044901
30098 1044901 1126103 917851 689497 537279 448199 451105 534917 541756 312242 -84586 -371681
$$ packed form
30170D25787n6298n9339q621r7854j98351q2009J44034J72952m35r7565n7227
30159H5074q2854j49125K9597L88172M17537l2646l98431k52146J3442j14323
30149i5703l63691j67755L01078L91929P3317q0839N2598r100l46355l67115J51335
30138d60301N58643L22375j55442k43913l8701j3471j55766r4666J81315L31314
30128B31387K34614O4571p7071j75554j11167J31505K38323j2034k83122j29230
30118A12222K50344K66666j33125m00286k60794m1961o254K8911J71835J37506
30108A25064j87724l57499j4966M38725L70047j15320l03075Q4197N24468M80984
30098A044901Q1202k08252k28354j52218q9080K906Q3812O839k29514l96828k87095
$$ plain form
30087 -371681 -328706 -5477 314428 357840 116761 -136797 -155230 -18276 -5581 -164350
30077 -164350 -213269 22791 314639 377469 315024 400431 550005 424804 42244 -158029
30067 -158029 26726 261514 241188 155162 267029 383170 177910 -178851 -207039 154295
30057 154295 454991 370979 31024 -321500 -592303 -679274 -450035 -48198 107292 -159623
30047 -159623 -516992 -569869 -333389 -62694 146480 326091 397641 278183 131065 211259
30037 211259 470761 568930 313933 -98428 -337199 -277626 -42317 164009 189953 7234
30027 7234 -263523 -428150 -372718 -139330 146430 379089 496680 464822 295732 69819
30017 69819 -109717 -196505 -210612 -168149 -51464 116371 220094 154755 -36574 -210417
$$ packed form
30087c71681M2975L23229L19905M3412k41079k53558j8433J36954J2695j58769
30077a64350m8919K36060K91848O2830o2445Q5407J49574j25201l82560k00273
30067a58029J84755K34788k0326q6026J11867J16141k05260l56761k8188L61334
30057A54295L00696q4012l39955l52524k70803q6971K29239M01837J55490k66915
30047a59623l57369n2877K36480K70695K09174J79611P1550j19458j47118Q0194
30037B11259K59502R8169k54997m12361k38771N9573K35309K06326K5944j82719
30027G234k70757j64627N5432K33388K85760K32659J17591l1858j69090k25913
30017F9819j79536q6788j4107M2463J16685J67835J03723o5339j91329j73843
$$ plain form
30007 -210417 -299214 -340415 -336303 -234434 -94518 -107988 -333970 -548072 -505539 -263881 -87051
29996 -87051 -95426 -173359 -186493 -134293 -91980 -118876 -214508 -282691 -187857 67395 297763
29985 297763 363719 340872 348105 344363 256687 167569 172718 185339 105875 42311 97543 97082
29973 97082 -129929 -335426 -146592 284352 401825 56657 -284907 -260343 -71137 -31752
29963 -31752 -104160 -152756 -265418 -482450 -529565 -199339 234903 358970 203622 134252
29953 134252 272192 376960 268533 68747 -6273 98085 246516 242238 26536 -199594
29943 -199594 -174012 64924 212322 150354 89134 136846 74203 -213579 -423238 -279644
29933 -279644 1482 84062 82358 297210 573854 465290 -6087 -269715 23879 564471
$$ packed form
30007b10417q8797m1201M112J01869J39916j3470k25982k14102M2533K41658J76830
29996h7051q375p7933j3134N2200M2313k6896r5632o8183R4834K55252K30368
29985B97763O5956k2847P233l742q7676q9118N149J2621p9464o3564N5232m61
29973I7082k27011k05497J88834M30944J17473l45168l41564K4564J89206L9385
29963c1752p2408m8596j12662k17032m7115L30226M34242J24067j55348o9370
29953A34252J37940J04768j08427j99786p5020J04358J48431m278k15702k26130
29943a99594K5582K38936J47398o1968o1220M7712o2643k87782k09659J43594
29933b79644K81126Q2580j704K14852K76644j08564m71377k63628K93594N40592
$$ plain form
29923 564471 824842 615113 106046 -396238 -600265 -419092 -107337 -7427 -138440 -255856
29913 -255856 -273994 -310876 -324888 -101565 303403 490587 266602 -51260 -94086 61348
29903 61348 93897 -67070 -198519 -116410 153113 464075 669232 704162 631503 534165 362786
29892 362786 43266 -263257 -250040 107562 462952 566079 572663 702517 826560 664470
29882 664470 247796 -103872 -223239 -267281 -435962 -700247 -853605 -734121 -377788 -2787
29872 -2787 182976 188896 189025 243256 207694 -7588 -257279 -373045 -405537 -470780 -486675 -309367
29860 -309367 -64832 -58215 -317440 -487055 -290768 102678 331375 306003 224634 202166
29850 202166 118370 -126685 -395310 -471467 -338860 -173726 -110751 -144682 -244110 -410147
$$ packed form
29923E64471K60371k09729n09067n02284k04027J81173L11755R9910j31013j17416
29913b55856j8138l6882j4012K23323M04968J87184k23985l17862m2826J55434
29903F1348L2549j60967j31449Q2109K69523L10962K05157L4930p2659r7338j71379
29892C62786l19520l06523J3217L57602L55390J03127O584J29854J24043j62090
29882F64470m16674l51668j19367m4042j68681k64285j53358J19484L56333L75001
29872b787J85763N920J29N4231l5562k15282k49691j15766l2492o5243j5895J77308
29860c09367K44535O617k59225j69615J96287L93446K28697k5372q1369k2468
29850B02166q3796k45055k68625p6157J32607J65134O2975l3931r9428j66037
$$ plain form
29840 -410147 -574914 -575375 -334664 -1057 195551 192295 115755 86462 94053 67302 -13910
29829 -13910 -109723 -179956 -210342 -179738 -41854 200189 403161 380354 164097 46790 207055
29818 207055 410575 316000 -7575 -183907 -115790 -63979 -82493 128096 562394 604961
29808 604961 -153455 -1133975 -1360782 -682854 111874 336511 64033 -257011 -364249 -249568
29798 -249568 -42207 45674 -85117 -240170 -187989 -37103 -41147 -125904 -31982 141955 54802
29787 54802 -213628 -191323 188423 411981 204485 -72141 -121955 -207979 -532195 -692798
29777 -692798 -316349 214051 292691 38782 46440 370949 444758 -6397 -563866 -736543
29767 -736543 -509993 -149245 155885 303694 257011 164295 274845 604654 853816 743861
$$ packed form
29840d10147j64767m61K40711L33607J96608l256p6540k9293P591k6751q1212
29829a3910r5813p0233l0386L0604J37884K42043K02972k2807k16257j17307J60265
29818B07055K03520r4575l23575j76332O8117N1811j8514K10589M34298M2567
29808F04961p58416r80520k26807O77928P94728K24637k72478l21044j07238J14681
29798b49568K07361Q7881j30791j55053N2181J50886m044q4757R3922J73937q7153
29787E4802k68430K2305L79746K23558k07496k76626m9814q6024l24216j60603
29777f92798L76449N30400P8640k53909P658L24509P3809m51155n57469j72677
29767g36543K26550L60748L05130J47809m6683r2716J10550L29809K49162j09955
$$ plain form
29757 743861 314119 -149449 -368284 -263559 -9024 134825 120774 154544 343223 481373
29747 481373 367175 150434 111931 236709 294733 247305 264387 376756 400701 219969
29737 219969 -78920 -342227 -434016 -245690 172792 552653 674664 616902 551994 445430
29727 445430 199004 -66478 -172679 -186562 -241434 -212393 47957 294693 170212 -181474
29717 -181474 -275510 -47684 59531 -168455 -410105 -367014 -157276 17709 147545 159157
29707 159157 -158656 -713868 -994589 -695370 -136205 214824 317025 377161 419530 372368
29697 372368 329040 389302 431507 323549 170730 108061 65653 -16166 2627 159030 179089
29686 179089 -87402 -300469 -106825 253982 291316 39535 -27718 219565 414119 361124
$$ packed form
29757G43861m29742m63568k18835J04725K54535J43849j4051L3770J88679J38150
29747D81373j14198k16741l8503J24778N8024m7428J7082J12369K3945j80732
29737B19969k98889k63307r1789J88326M18482L79861J22011n7762o4908j06564
29727D45430k46426k65482j06201j3883n4872K9041K60350K46736j24481l51686
29717a81474r4036K27826J07215k27986k41650M3091K09738J74985J29836J1612
29707A59157l17813n55212k80721K99219N59165L51029J02201O0136M2369m7162
29697C72368m3328O0262M2205j07958j52819o2669m2408q1819J8793J56403K0059
29686A79089k66491k13067J93644L60807L7334k51781o7253K47283J94554n2995
$$ [...]
##END NTUPLES=NMR SPECTRUM
##END=
