##TITLE=31Pdec_AM_NVViNPHOS
 CDCl3, 24 sc
 9.9.2024
##JCAMPDX= 6.0         $$ Bruker NMR JCAMP-DX V2.0
##DATA TYPE= NMR SPECTRUM
##DATA CLASS= NTUPLES
##ORIGIN= UXNMR, Bruker Analytische Messtechnik GmbH
##OWNER= root
$$ XWIN-NMR		Version 3.5
$$ Mon Sep  9 16:34:07 2024 Russian Standard Time (UT+4h)  she@DPX200
##.OBSERVE FREQUENCY= 81.013821
##.OBSERVE NUCLEUS= ^31P
##.ACQUISITION MODE= SIMULTANEOUS
##.ACQUISITION SCHEME= undefined
##.AVERAGES= 24
##.DIGITISER RES= 17
##SPECTROMETER/DATA SYSTEM= spect
##.PULSE SEQUENCE= zgpg30
##.SOLVENT NAME= CDCl3
##.SHIFT REFERENCE= (INTERNAL, CDCl3, 0, 198.062)
##AUDIT TRAIL= $$ (NUMBER, WHEN, WHO, WHERE, WHAT)
$$ ##TITLE= Audit trail, XWIN-NMR		Version 3.5
$$ ##JCAMPDX= 5.01
$$ ##ORIGIN= Bruker BioSpin GmbH
$$ ##OWNER= she
$$ F:/spectra/data/she/nmr/P31/2/pdata/1/auditp.txt
$$ ##AUDIT TRAIL=  $$ (NUMBER, WHEN, WHO, WHERE, WHAT)
(   1,<2024-09-09 16:33:15.35 +0400>,<she>,<DPX200>,
      <created by zg, POWCHK disabled, PULCHK disabled
       configuration hash MD5:
       00 E9 B6 7A A2 85 ED C7 34 08 36 98 17 FE 4E 26
       data hash MD5: 32K
       6A C6 F8 68 9B 98 39 B2 D2 06 DC 40 2C 2D C9 25>)
(   2,<2024-09-09 16:33:17.85 +0400>,<she>,<DPX200>,
      <Start of raw data processing
       efp BC_mod = 2 LB = 1.5 FT_mod = 6 PKNL = 1 PHC0 = 2694.001 PHC1 = 63.68747 SI = 64K 
       data hash MD5: 64K
       83 59 8D F4 51 20 31 EB B5 F5 10 61 DD 76 53 52>)
(   3,<2024-09-09 16:33:32.18 +0400>,<she>,<DPX200>,
      <pk PHC0 = 1.172394 PHC1 = 0 
       data hash MD5: 64K
       B6 4E 59 38 16 75 90 3E 5E 07 70 08 C4 43 5C DB>)
$$ ##END=
$$ 
$$ hash MD5
$$ 95 D9 AA 22 11 BC CF 78 76 0B B0 AF FE 37 05 79
##$RELAX= 
##$RELAX= 
##$RELAX= 
##$RELAX= 
##$RELAX= 
##$RELAX= 
##$RELAX= 
##$RELAX= 
$$ Bruker specific parameters
$$ --------------------------
##$DU= <F:/spectra>
##$EXPNO= 2
##$NAME= <P31>
##$PROCNO= 1
##$TYPE= <nmr>
##$USER= <she>
##$AMP= (0..31)
100 100 100 100 100 100 100 100 100 100 100 100 100 100 100 100 100 100 
100 100 100 100 100 100 100 100 100 100 100 100 100 100 
##$AQSEQ= 0
##$AQ_mod= 1
##$AUNM= <au_zg>
##$AUTOPOS= <>
##$BF1= 81.014009
##$BF2= 200.13
##$BF3= 200.13
##$BF4= 200.13
##$BF5= 200.13
##$BF6= 200.13
##$BF7= 200.13
##$BF8= 200.13
##$BYTORDA= 1
##$CFDGTYP= 0
##$CFRGTYP= 5
##$CHEMSTR= <none>
##$CNST= (0..31)
1 1 145 1 1 1 1 1 1 1 1 1 1 1 1 1 1 1 1 1 1 1 1 1 1 1 1 1 1 1 1 1 
##$CPDPRG= <waltz16>
##$CPDPRG1= <>
##$CPDPRG2= <waltz16>
##$CPDPRG3= <>
##$CPDPRG4= <mlev>
##$CPDPRG5= <mlev>
##$CPDPRG6= <mlev>
##$CPDPRG7= <mlev>
##$CPDPRG8= <mlev>
##$CPDPRGB= <>
##$CPDPRGT= <>
##$D= (0..31)
0 1 0 0 0 0 0 0 0 0.06 0 0.03 2e-05 3e-06 0 0 0.0002 0 0 0 0 0 0 0 0 0 
0 0 0 0 0 0 
##$DATE= 1725885194
##$DBL= (0..7)
120 120 120 11 120 120 24 19 
##$DBP= (0..7)
150 150 150 150 150 150 150 150 
##$DBP07= 0
##$DBPNAM0= <>
##$DBPNAM1= <>
##$DBPNAM2= <>
##$DBPNAM3= <>
##$DBPNAM4= <>
##$DBPNAM5= <>
##$DBPNAM6= <>
##$DBPNAM7= <>
##$DBPOAL= (0..7)
0.5 0.5 0.5 0.5 0.5 0.5 0.5 0.5 
##$DBPOFFS= (0..7)
$$ [...]
##$SUBNAM2= <"">
##$SUBNAM3= <"">
##$SUBNAM4= <"">
##$SUBNAM5= <"">
##$SUBNAM6= <"">
##$SUBNAM7= <"">
##$SUBNAM8= <"">
##$SUBNAM9= <"">
##$SW= 400.765351723535
##$SWIBOX= (0..15)
0 1 3 0 0 0 0 0 0 0 0 0 0 0 0 0 
##$SW_h= 32467.5324675325
##$TD= 32768
##$TD0= 1
##$TE= 0
##$TE2= 300
##$TE3= 300
##$TEG= 300
##$TL= (0..7)
0 120 53 12 22 120 120 120 
##$TP= (0..7)
150 150 150 150 150 150 150 150 
##$TP07= 0
##$TPNAME0= <>
##$TPNAME1= <>
##$TPNAME2= <>
##$TPNAME3= <>
##$TPNAME4= <>
##$TPNAME5= <>
##$TPNAME6= <>
##$TPNAME7= <>
##$TPOAL= (0..7)
0.5 0.5 0.5 0.5 0.5 0.5 0.5 0.5 
##$TPOFFS= (0..7)
0 0 0 0 0 0 0 0 
##$TUNHIN= 0
##$TUNHOUT= 0
##$TUNXOUT= 0
##$USERA1= <user>
##$USERA2= <user>
##$USERA3= <user>
##$USERA4= <user>
##$USERA5= <user>
##$V9= 5
##$VALIST= <valist>
##$VCLIST= <CCCCCCCCCCCCCCC>
##$VD= 0
##$VDLIST= <DDDDDDDDDDDDDDD>
##$VPLIST= <PPPPPPPPPPPPPPP>
##$VTLIST= <TTTTTTTTTTTTTTT>
##$WBST= 1024
##$WBSW= 4
##$XGAIN= (0..3)
0 0 0 0 
##$XL= 0
##$YL= 0
##$YMAX_a= 2480
##$YMIN_a= -2024
##$ZGOPTNS= <>
##$ZL1= 120
##$ZL2= 120
##$ZL3= 120
##$ZL4= 120
##$ABSF1= 0
##$ABSF2= 0
##$ABSG= 0
##$ABSL= 0
##$ALPHA= 0
##$AQORDER= 0
##$ASSFAC= 0
##$ASSFACI= 0
##$ASSFACX= 0
##$ASSWID= 0
##$AUNMP= <proc_1d>
##$AZFE= 0.1
##$AZFW= 0.5
##$BCFW= 0
##$BC_mod= 2
##$BYTORDP= 0
##$COROFFS= 0
##$CY= -3
##$DATMOD= 1
##$DC= 0
##$DFILT= <>
##$DTYPP= 0
##$F1P= 0
##$F2P= 0
##$FCOR= 1
##$FTSIZE= 65536
##$FT_mod= 6
##$GAMMA= 0
##$GB= 0
##$INTBC= 1
##$INTSCL= 9.790993e-09
##$ISEN= 30
##$LB= 1.5
##$LEV0= 0
##$LPBIN= 0
##$MAXI= 10000
##$MC2= 0
##$MEAN= 0
##$ME_mod= 0
##$MI= 50
##$NCOEF= 0
##$NC_proc= -9
##$NLEV= 6
##$NOISF1= 182.463
##$NOISF2= 159.3651
##$NSP= 0
##$NTH_PI= 0
##$NZP= 0
##$OFFSET= 198.0616
##$PC= 4
##$PHC0= 2695.173
##$PHC1= 63.68747
##$PH_mod= 1
##$PKNL= yes
##$PPARMOD= 0
##$PSCAL= 0
##$PSIGN= 0
##$REVERSE= no
##$SF= 81.0140089999434
##$SI= 65536
##$SIGF1= 159.3651
##$SIGF2= -187.1042
##$SINO= 113.3802
##$SIOLD= 16384
##$SREGLST= <1H.CDCl3>
##$SSB= 0
##$STSI= 65536
##$STSR= 0
##$SW_p= 32467.5324675325
##$SYMM= 0
##$S_DEV= 0
##$TDeff= 32768
##$TDoff= 0
##$TI= <>
##$TILT= no
##$TM1= 0
##$TM2= 0
##$TOPLEV= 0
##$USERP1= <user>
##$USERP2= <user>
##$USERP3= <user>
##$USERP4= <user>
##$USERP5= <user>
##$WDW= 1
##$XDIM= 65536
##$YMAX_p= 337540289
##$YMIN_p= -50934546
$$ End of Bruker specific parameters
$$ ---------------------------------
##NTUPLES= NMR SPECTRUM
##VAR_NAME=  FREQUENCY,     SPECTRUM/REAL,   SPECTRUM/IMAG
##SYMBOL=    X,             R,               I
##VAR_TYPE=  INDEPENDENT,   DEPENDENT,       DEPENDENT
##VAR_FORM=  AFFN,          ASDF,            ASDF
##VAR_DIM=   65536,         65536,           65536
##UNITS=     HZ,            ARBITRARY UNITS, ARBITRARY UNITS
##FACTOR=    0.49542278885378, 1,            1
##FIRST=     16045.7642231865, 0,            0
##LAST=      -16421.768244346, 0,            0
##MIN=       -16421.768244346, -50934546,    0
##MAX=       16045.7642231865, 337540289,    0
$$ Real data points
##PAGE= N=1
##DATA TABLE= (X++(R..R)), XYDATA
$$ [...]
38736h487212O6376M091042N309422K177136j608795k763564k230679k016087
38728e462361j634827l6334J358784M93806j524680j388404J462696L362472J254722
38719b114126k618380l161431O43684L838289J959605k621149l656465M53679
38711g276294M614310M272021J242324J36648J734459L090288K578702J289945
38703A1682403J7034j683977l217790k866123p72534O04517j305r88281p28856
38694B045088J18413L40487J10271k31922j325161k926822k687047R04202N340163
38685A687672O163927K083713l494763n980046l722735R01413L670160K353156
38677C662497r57178k196853m24478J115636o4881k053229j963818p94495j423181
$$ plain form
38736 -8487212 -8420836 -4329794 979628 3156764 1547969 -1215595 -3446274 -5462361
38728 -5462361 -7097188 -7133522 -5774738 -5280932 -6805612 -8194016 -6731320 -3368848 -2114126
38719 -2114126 -4732506 -7893937 -7250253 -3411964 -1452359 -4073508 -7729973 -7276294
38711 -7276294 -2661984 1610037 2852361 2989009 4723468 7813756 10392458 11682403
38703 11682403 11699437 10015460 6797670 3931547 3159013 3763530 3762225 2773944 2045088
38694 2045088 2163501 2503988 2614259 2382337 1057176 -1869646 -4556693 -3652491 1687672
38685 1687672 7851599 9935312 6440549 460503 -3262232 -2360819 1309341 3662497
38677 3662497 2705319 508466 83988 1199624 1134743 -918486 -2882304 -3676799 -5099980
38668e099980k944960j251918M229064Q302683O455073Q29744k674170j683786
38660F161750P58292J032997n91124r99236J368529M243324M012252J15968m035845
38651A2066907n035144l261344j555637j204957j189522q56413r11351j493449
38643c440910j521780o72833q5756l33107n39101l31401p20145j967493k501022
38634a2113548j261614O41923J976095L177709M475350M253187J583817j252974
38626A479945j496517o3082j10519k023826k850504r41663J580380J882252l0667
38617b574201j839108j709481J59113J908729J640525n60221k299498j447657
38609f721799J348941L780469M746142M528569K955038j73985l019113k858677
$$ plain form
38668 -5099980 -8044940 -9296858 -5067794 3234889 9689962 10519706 7845536 6161750
38660 6161750 6920042 7953039 7361915 6362679 7731208 11974532 15986784 16102752 12066907
38651 12066907 7031763 3770419 2214782 1009825 -179697 -1036110 -1947461 -3440910
38643 -3440910 -4962690 -5635523 -5721279 -6054386 -6593487 -6924888 -7645033 -9612526 -12113548
38634 -12113548 -13375162 -12733239 -10757144 -7579435 -3104085 1149102 2732919 1479945
38626 1479945 -16572 -79654 -190173 -2213999 -5064503 -6006166 -4425786 -2543534 -2574201
38617 -2574201 -4413309 -6122790 -5963677 -4054948 -2414423 -2974644 -5274142 -6721799
38609 -6721799 -5372858 -1592389 3153753 7682322 10637360 10463375 7444262 4585585
38601D585585N430J975636Q56969j457434k379966k419097l400106m592956l506375
38592a0332314j85152J972876N52045k443040k888022L05419L715432L538099
38584e764657K54320k108279j247922P00684P93279j40165J048380M447776O120968
38575D104384L316922j643960m141655k475430J085314L490578L777546L106203
38567A0619902K831741K641741Q29797l005594o223373n711452j995591J149616
38559A136787J301964n09484k448237l829012l659674m80242M428485O597583
38551B538170L801886m08317j577061o02020j490823m445975n557249l090610
38543a0831999J35476J327556R94664N04579l12250j425922j245634R23367L056129
$$ plain form
38601 4585585 4591015 6566651 7423620 5966186 3586220 1167123 -2232983 -6825939 -10332314
38592 -10332314 -10517466 -8544590 -7992545 -10435585 -13323607 -13018188 -9302756 -5764657
38584 -5764657 -5510337 -7618616 -8866538 -8165854 -7372575 -7512740 -6464360 -2016584 4104384
38575 4104384 7421306 5777346 1635691 -839739 245575 3736153 7513699 10619902
38567 10619902 13451643 16093384 16923181 13917587 7694214 1982762 -12829 1136787
38559 1136787 2438751 1929267 -518970 -4347982 -8007656 -8487898 -4059413 2538170
38551 2538170 6340056 5931739 4354678 3752658 2261835 -2184140 -7741389 -10831999
38543 -10831999 -10696523 -9368967 -8374303 -7869724 -8181974 -9607896 -10853530 -9930163 -6874034
38534f874034L023277J507647N40570N21313N41359N21745J013715J533357J025772
38525C354721j89402n54021N26314J849561K022786R85671l49074j304058j874090
38516D468408k190600j928896o42587J097000J482624o03762l522903l983136
38508e823852p42531L717199N832109M511233J493325r65778j873153j556941
38500D591611r49374p50751q24395n79402r5960k70555j487148k811961l042756
38491f220691k029664n21675O82669J008791L12583n87174l49739J209877K602740
38482c892283K530924J461301N34785j22228q43115j082284j65755J154267J506281
38473A081893J001031R21019J408850J189938j41921j212128q38973L96236J173276
$$ plain form
38534 -6874034 -3850757 -2343110 -1802540 -1281227 -739868 -218123 795592 2328949 3354721
38525 3354721 3165319 2611298 3137612 4987173 7009959 7995630 7646556 6342498 4468408
38516 4468408 2277808 348912 -293675 803325 2285949 1682187 -1840716 -5823852
38508 -5823852 -6566383 -2849184 2982925 7494158 8987483 8021705 6148552 4591611
38500 4591611 3642237 2891486 2067091 1487689 1391729 1121174 -365974 -3177935 -6220691
38491 -6220691 -8250355 -8772030 -8089361 -7080570 -6767987 -7355161 -7704900 -6495023 -3892283
38482 -3892283 -1361359 99942 634727 512499 -330616 -1412900 -1578655 -424388 1081893
38473 1081893 2082924 3003943 4412793 5602731 5460810 4248682 3409709 3805945 4979221
38464D979221R35503q3933j202434j303835J41701J683285J150671j099924k184235
38455C016020r42283J58648q24578j765890j11772J919810P0481m613155n967320
38446i060039j382206M043631M369106L31575l005970l311755k052325m33101
38438a0501084J673046L461501L537783K454114J850556J331936n78527k665936
38430E63389k065026N88676J240604j211684k908929j337188O64313J57124p31146
38421e039867R20078K713582M10698m355271n574659j785577J898103J574984
38413i237929m72538m52334J341836K212049J442244K79564o15107j315349j402272
38404h219836m79625Q08606J459449J098324j88100j731608j723286J224040N225431
$$ plain form
38464 4979221 5914724 5830791 4628357 3324522 3466223 5149508 6300179 5200255 3016020
38455 3016020 2073737 2232385 1407807 -358083 -469855 1449955 1520436 -3092719 -9060039
38446 -9060039 -10442245 -6398614 -2029508 -1697933 -4703903 -8015658 -10067983 -10501084
38438 -10501084 -8828038 -5366537 -1828754 625360 2475916 3807852 3229325 563389
38430 563389 -1501637 -912961 327643 -884041 -3792970 -5130158 -4465845 -4308721 -5039867
38421 -5039867 -4119789 -1406207 -995509 -5350780 -10925439 -12711016 -10812913 -9237929
38413 -9237929 -9710467 -10162801 -8820965 -6608916 -5166672 -4887108 -5502215 -6817564 -8219836
38404 -8219836 -8699461 -7890855 -6431406 -5333082 -5521182 -7252790 -8976076 -7752036 -2526605
38395b526605O114911K622256j539458k425957p67573r1533j529314k894803k175647
38386e213723J17856J894685J596907j68685n88455K409496O458728O133946l70252
38377A2270503p965400j0241275o621371j600643J456226K719106L152431K718594
38369d111829J414564k71926j966642k832679j329773K330341M800608L538190
38361A570854R56076J174630L546469L637398M86465j818129p30231J164049R51030
38352A0938611l83389r69741j591537l221818m093861k519690k79720p327j145318
38343c273790j541908j177461j116472n43367J588175L323514J940044j357341
38335b158606k704445j189068M08143L84460k0733J37163m1887q24261j001887
$$ plain form
38395 -2526605 3588306 6210562 4671104 2245147 1477574 1386041 -143273 -3038076 -5213723
38386 -5213723 -5095867 -3201182 -1604275 -1772960 -2361415 48081 6506809 12640755 12270503
38377 12270503 4305103 -5936172 -12557543 -14158186 -12701960 -9982854 -6830423 -4111829
38369 -4111829 -2697265 -2969191 -4935833 -7768512 -9098285 -6767944 -1967336 1570854
38361 1570854 2526930 3701560 7248029 10885427 11371892 9553763 8823532 9987581 10938611
38352 10938611 10555222 9585481 7993944 4772126 678265 -1841425 -2121145 -2128472 -3273790
38343 -3273790 -4815698 -5993159 -7109631 -7652998 -6064823 -2741309 -801265 -2158606
38335 -2158606 -4863051 -6052119 -5643976 -5259516 -5280249 -5143086 -5184973 -6009234 -7011121
38326g011121m24388l59265m56550J399167M920379O390969L717936l66784k296673
38317E513670k222005k166338k109419q64853R22669J678237J595292J701977
38309D049230J333035o78543l174099l899634k970197k286182j968967m30577
38301a0025934K046758K922324J156632j334280k682073l054885k929800j894912
38293a5796170k13574P02398N64813R19397K474694L760028L613551K924522K605358
38284A555017J988891P58065K41749R24127Q37035j331428l540208l355837j741921
38275c664510r53891l60919J992898M685504L936851m44785l902142k977097O57702
38266a030389L235861L418114K350523J238080L95004n15135k188459m558884
$$ plain form
38326 -7011121 -7435509 -7794774 -8251324 -6852157 -1931778 4459191 8177127 7810343 5513670
38317 5513670 3291665 1125327 -984092 -1848945 -926276 751961 2347253 4049230
38309 4049230 5382265 4703722 1529623 -2370011 -5340208 -7626390 -9595357 -10025934
38301 -10025934 -7979176 -5056852 -3900220 -5234500 -7916573 -10971458 -13901258 -15796170
38293 -15796170 -16009744 -15307346 -14742533 -13823136 -11348442 -7588414 -3974863 -1050341 1555017
38284 1555017 3543908 4301973 4543722 5467849 6304884 4973456 1433248 -1922589 -3664510
38275 -3664510 -4618401 -4979320 -2986422 1699082 5635933 5191148 1289006 -1688091 -1030389
38266 -1030389 2205472 5623586 7974109 9212189 9607193 9092058 6903599 2344715
38258B344715n787056l986272j02184K865032L655983L474385K760217K95580
38250E520400l473861n383804l720866r09301K5743n59703o02409J66676P40484
38241h196641R31759O06067j174553l680018l425917J120555N710169N257779
38233b850800J342700J71049L399462N889263L501330j462095m528200m834246
38225F28463l979187k253322O52150L060510K724405R1449k329948l288877l270575
38216g964932k245405M87395L960241N343981L159204o83220l068501k963507
38208c974744j525933K48999K476838M946640O191151M941677J893695q71868
38200A4326455j930393j317970Q5317Q95658l87288l610591n861763m297024l34906
$$ plain form
38258 2344715 -3442341 -7428613 -7530797 -4665765 -1009782 2464603 5224820 5520400
38250 5520400 2046539 -3337265 -7058131 -7967432 -7941689 -8501392 -9103801 -8937125 -8196641
38241 -8196641 -7264882 -6658815 -7833368 -11513386 -14939303 -13818748 -8108579 -2850800
38233 -2850800 -1508100 -1337051 2062411 7951674 11453004 9990909 5462709 628463
38225 628463 -3350724 -5604046 -4951896 -1891386 833019 924468 -1405480 -4694357 -7964932
38216 -7964932 -10210337 -9722942 -5762701 -418720 2740484 2057264 -1011237 -3974744
38208 -3974744 -5500677 -5251678 -2774840 2171800 8362951 13304628 15198323 14326455
38200 14326455 12396062 11078092 11163409 12059067 11671779 8061188 2199425 -2097599 -2432505
38191b432505J399279q31789l366820k217195J737600M598018M339009J631482
38183D857079k099393m782689l868153N14020M233151M169901K667377L264543
38175H955836M160972J103562m480899o391652k953387P06804R89751M04926J534215
38166D030128K326832R79604L44087K970936N815653M663202O63266k276884l835892
38157A5680932n929036p178202m339097J470404N024515L707685N4585k554884
38149E936902l263280k709341j785790j540555j786593l98221L340773N922074
38141C715969L674759j381134l815845k265125j37139Q37824K516520M964899
38133H110728M562830j59022n114613n930102l285414m25817J447768K466155
$$ plain form
38191 -2432505 -1033226 -1865015 -5231835 -7449030 -5711430 -1113412 3225597 4857079
38183 4857079 2757686 -2025003 -5893156 -5379136 -1145985 3023916 5691293 8955836
38175 8955836 13116808 14220370 9739471 3347819 394432 1101236 2090987 2495913 4030128
38166 4030128 6356960 7336564 7680651 10651587 16467240 21130442 21793708 19516824 15680932
38157 15680932 9751896 2573694 -1765403 -294999 4729516 8437201 8491786 5936902
38149 5936902 2673622 -35719 -1821509 -3362064 -5148657 -5546878 -2206105 3715969
38141 3715969 7390728 6009594 2193749 -71376 -208515 629309 3145829 8110728
38133 8110728 12673558 12514536 7399923 1469821 -1815593 -2241410 -793642 1672513
38125A672513J788518n43589j660379O45512L894158L774748J77238k797325k454954
38116D496440j65002J644972K336154K199590J091678p34748j832116j007825
38108H029143R58987K136343J864619J389237J678832J551540o89980m026186
38100A2892535n187660l242426j501844k763225m639142l015702R76270J958110
38092d523084j267097l112872O09559O019579O494433J967669j606116r24838
38084C657233J130185J018107n71476j207659j088604k103992l898162l820932
38076f885300j047986J578880J191625j033772j515333M52617J678048K16145
38068e365076j218154N38840L537906L168533n02149k259133M38564L435028K108784
$$ plain form
38125 1672513 3461031 2917442 1257063 1902575 5796733 9571481 9748719 6951394 4496440
38116 4496440 4331438 5976410 8312564 10512154 11603832 10869084 9036968 8029143
38108 8029143 8988130 11124473 12989092 14378329 16057161 17608701 16918721 12892535
38100 12892535 7704875 4462449 2960605 197380 -4441762 -7457464 -6481194 -4523084
38092 -4523084 -5790181 -8903053 -8293494 -2273915 4220518 6188187 4582071 3657233
38084 3657233 4787418 5805525 5234049 4026390 2937786 833794 -3064368 -6885300
38076 -6885300 -7933286 -6354406 -5162781 -6196553 -7711886 -7259269 -5581221 -5365076
38068 -5365076 -6583230 -6044390 -2506484 662049 159900 -2099233 -1660669 1774359 3883143
38059C883143j881956l596859k156736r04874j235110o04560K632292N872259
38051B007599N424437J041020m089151o512795m752943K4322M187673L813211
38043A143373j286450o077840m888512K033987Q230376Q294524L870025O41033
38035A1960516O88856R04016j049456k951386k059025K21619P88285j36826j2273
38026H354326J284372J533339L81263l88050o39951j996555l950637m003584k280310
38017a705787j642300k195519m92860L959862O390540L805215l03760j780509
38009F034882j824281k878177k833945J000287N287496M362359j051914m856109
38001C240598m541297l339314l489933l092346p12882J754477K453529K080227
$$ plain form
38059 3883143 2001187 -1595672 -3752408 -4657282 -5892392 -6496952 -3864660 2007599
38051 2007599 7432036 8473056 4383905 -2128890 -6881833 -6857511 -2669838 1143373
38043 1143373 -143077 -6220917 -11109429 -9075442 -845066 7449458 11319483 11960516
38035 11960516 12649372 13553388 12503932 9552546 7493521 7715140 8503425 8366599 8354326
38026 8354326 9638698 11172037 11553300 11165250 10525299 8528744 4578107 574523 -1705787
38017 -1705787 -3348087 -5543606 -6036466 -2076604 4313936 8119151 7815391 6034882
38009 6034882 4210601 1332424 -1501521 -501234 4786262 9148621 8096707 3240598
38001 3240598 -1300699 -4640013 -8129946 -11222292 -11935174 -10180697 -7727168 -5646941
37993e646941J720793J246471O75854L36108n42285k442720l144397l54582L572721
37984d578978L892275N81876j455941J17871K300271K482658J739793P08480k279530
37975C508775o198849n922253J07198N367946L402182k847803n152633j364593
37967i100030K713041K239464o88085q97971L114973P621306P661710K273548
37959A4937956m091677o216838m004621j664760j252903o77157J067128J434224
37951d68648l92070n71407K950992N350058J735080m135800m427029J100410M695279
37942E836865J835573l459225n634630m265876j736541Q88234K968475K949175
37934f17950O91296j424172j821714j771822k340737j918666R55200M370623N023125
$$ plain form
37993 -5646941 -3926148 -2679677 -2003823 -1667715 -2210000 -4652720 -7797117 -8151699 -4578978
37984 -4578978 -686703 -104827 -1560768 -1442897 857374 3340032 5079825 5788305 3508775
37975 3508775 -2690074 -8612327 -8505129 -3137183 264999 -2582804 -7735437 -9100030
37967 -9100030 -6386989 -4147525 -4835610 -5733581 -2618608 5002698 12664408 14937956
37959 14937956 10846279 4629441 624820 -1039940 -2292843 -2970000 -1902872 -468648
37951 -468648 -860718 -1432125 1518867 6868925 8604005 4468205 41176 1141586 5836865
37942 5836865 7672438 4213213 -1421417 -5687293 -7423834 -6535600 -3567125 -617950
37934 -617950 73346 -1350826 -3172540 -4944362 -7285099 -9203765 -8248565 -3877942 1145183
37925A145183K185583j962002m768011m658710j817746J312123J734690m77193
37917g306083j764083K52844L286031L454943O11640j584956m23395K921913N189119
37908D637973M363200J066439k341686l700749k601847m31321Q98663K42963k063318
37899G0317m104482l692612q81980J488594J182659l13324j01848J400508R65351
37890c986817k118666m444366l249055R2486K693584L551250K788974L96712k221188
37881f497086k246880N08794K258425P42317q67282P23242K663492K19444m592172
37872g087706m966117J77685M111177K311977j463367k012558j56593P92225J491986
37863f801291M073566O153778L435979k692523n789169k981443J674429L297805
$$ plain form
37925 1145183 3330766 1368764 -3399247 -8057957 -9875703 -8563580 -6828890 -7306083
37917 -7306083 -9070166 -8817322 -5531291 -2076348 -1464708 -3049664 -3473059 -551146 4637973
37908 4637973 9001173 10067612 7725926 4025177 1423330 992009 1890672 2133635 70317
37899 70317 -4034165 -7726777 -8608757 -7120163 -5937504 -6250828 -6352676 -4952168 -3986817
37890 -3986817 -6105483 -10549849 -13798904 -13706418 -11012834 -7461584 -4672610 -4275898 -6497086
37881 -6497086 -8743966 -8235172 -5976747 -5234430 -6101712 -5378470 -2714978 -2495534 -7087706
37872 -7087706 -12053823 -11876138 -7764961 -5452984 -6916351 -8928909 -9085502 -8293277 -6801291
37863 -6801291 -2727725 3426053 6862032 4169509 -1619660 -4601103 -2926674 371131
37855C71131J543243j244440l299309l234472j98915L636668L947564O9161k956902
37846a366271j021430L018374L525095K92863j744865k90060J300713l81505l777980
37837d45066m820663k287123J169136K453808J276998O0957P84715K106547Q70275
37828A169584k975358n202022l013508M25513N19238j697069j756543R4514q88703
37819a3324354m807923m956771J917145R051171Q462360K047310k001627r81357
37811d594046O57820J42389K3214K142481L796561K177506j476508m348477n398026
37802f877086m408294r28550L533387N071700J953184k183253k351937J636097
37794d554752N289639M982794J451299j903010k662565j368463o66491k267332
$$ plain form
37855 371131 1914374 669934 -2629375 -5863847 -6062762 -2426094 1521470 1590631 -1366271
37846 -1366271 -2387701 630673 4155768 4448631 2703766 2413706 3714419 3332914 -445066
37837 -445066 -5265729 -7552852 -6383716 -3929908 -2652910 -2591953 -1807238 299309 1169584
37828 1169584 -1805774 -7007796 -10021304 -9595791 -9076553 -10773622 -12530165 -12435651 -13324354
37819 -13324354 -18132277 -23089048 -21171903 -12120732 -3658372 -1611062 -3612689 -4594046
37811 -4594046 -3936226 -3793837 -3770623 -1628142 2168419 4345925 2869417 -1479060 -6877086
37802 -6877086 -11285380 -12213930 -8680543 -3608843 -1655659 -3838912 -6190849 -4554752
37794 -4554752 734887 5717681 7168980 5265970 2603405 1234942 568451 -1698881
37786a698881m526468m049606k27827L252456K725237o62596k260846J47584L447201
37777c853746L116177q21493l348885o25385M662629O233099K432895j395070
37769F400221l92736K899686K580763j558336l835632j470205J530284J043917
37761G197962j138554j197525K08397m45994l209495m306905j950664J222363
37753c620415K307562J764434J429098J061000r38411m100042n347697k660289
37745a0104760J883940M145547K816229O34201J82016M80898n21706j945934j457714
37736c887283K38832J66842j498771q64038L351159O705110M872333l02958l624645
37727E156581l248719j344035L32790J928854L102574K422135l67786l529810
$$ plain form
37786 -1698881 -6225349 -10274955 -10502782 -7250326 -4525089 -5187685 -7448531 -7300947 -3853746
37777 -3853746 -737569 -1559062 -4907947 -5533332 -870703 5362396 7795291 6400221
37769 6400221 6007485 8907171 11487934 9929598 6093966 4623761 6154045 7197962
37761 7197962 6059408 4861883 5070280 4624286 1414791 -2892114 -4842778 -3620415
37753 -3620415 -1312853 451581 1880679 2941679 2003268 -2096774 -7444471 -10104760
37745 -10104760 -8220820 -4075273 -1259044 -624843 -442827 38071 -483635 -2429569 -3887283
37736 -3887283 -3648451 -3481609 -4980380 -5844418 -2493259 4211851 9084184 8781226 5156581
37727 5156581 1907862 563827 896617 2825471 5928045 8350180 7982394 4452584
37719D452584n076294m098930r43639K437577L151182K75569l453719m590278
37711g845948k893812o00147J093933K467047L095305K128643O05039P31109K474476
37702A255645L249418J577383r48311j910236n34670K428200N446042O419629
37694A6983100M087641m7403k791459k920771k295843k780727l758925l663912
37686B811701k467932j315741o34747M4556Q22049J176279J017757J068252J678419
37677D200593J801215J83890k249428k663579k19508J728566j25148l466576k786716
37668c596691K214181N077083J517241m319813n955948l286128p44408K71926
37660h822557J684986L199255K395646n7475r01216k24698j366699m101151l719066
$$ plain form
37719 4452584 -623710 -4722640 -5666279 -3228702 -77520 198049 -3255670 -7845948
37711 -7845948 -10739760 -11339907 -10245974 -7778927 -4683622 -2554979 -1949940 -1218831 1255645
37702 1255645 4505063 6082446 5134135 3223899 2689229 5117429 10563471 16983100
37694 16983100 21070741 21023338 18231879 15311108 13015265 10234538 6475613 2811701
37686 2811701 343769 -971972 -1606719 -1562163 -740114 436165 1453922 2522174 4200593
37677 4200593 6001808 6185698 3936270 1272691 1053183 2781749 2656601 -809975 -3596691
37668 -3596691 -1382510 3694573 5211814 892001 -5063947 -8350075 -9094483 -8822557
37660 -8822557 -7137571 -3938316 -1542670 -1600145 -2501361 -2726059 -4092758 -8193909 -11912975
37651a1912975J131353N099134L649725m88015j848126K74270K393101K296680
37643E95147O11602j273238k130845j186689O21022J293932Q65863J432738L008926
37634C838458K702711k24628k270247j262720j88908j957021l898966j970580
37626e231901K235974L656227J415359m84283M50473K404884K862306J517164
37618H826203n85206k133251j966002o02491n09333k655810m275703k659115O17540
37609e943168K302118K285286K183731J309073j368056l085550n92816L462523
37601E53141L385548n71951k347057J53982J988648j78132k715667j571626J255229
37592d7885J802453L56447o40767j374635l043462m166885k636219N11867K816355
$$ plain form
37651 -11912975 -10781622 -5682488 -2032763 -2520778 -4368904 -4094634 -1701533 595147
37643 595147 1206749 -66489 -2197334 -3384023 -2763001 -1469069 -603206 829532 3838458
37634 3838458 6541169 6316541 4046294 2783574 2594666 637645 -3261321 -5231901
37626 -5231901 -2995927 660300 2075659 1591376 2041849 4446733 7309039 8826203
37618 8826203 8240997 6107746 4141744 3539253 3029920 374110 -3901593 -6560708 -5943168
37609 -5943168 -3641050 -1355764 827967 2137040 768984 -2316566 -2909382 553141
37601 553141 3938689 3366738 1019681 1173663 3162311 2984179 268512 -1303114 -47885
37592 -47885 1754568 2111015 1470248 95613 -2947849 -7114734 -9750953 -9239086 -6422731
37583f422731L874683M032375K164253j614893l609896j235858K071434J377000
37575F36367k019300k692096N7415J437393m11572j359881J342452M047251K403751
37566C441780j945965m178413k981075o27146J519136L462516L754412O27763
37558C073008l861200m866894j305930J898292L22331l676947m193541J0348M024149
37549h576384L794598J312728J009372L314076M626353K808919k85980k167992
37541E835690k961392l909789m507938l220977l84416J593762J220359k00111
37533f534812l73817R18544J485479k65967k645939k273616J246589L832195J874980
37524b736364k334593k923914J678765O263450N539889M60781m274913o351847
$$ plain form
37583 -6422731 -2548048 1484327 3648580 2033687 -1576209 -2812067 -740633 636367
37575 636367 -1382933 -4075029 -4017614 -2580221 -2991793 -4351674 -3009222 1038029 3441780
37566 3441780 1495815 -2682598 -5663673 -6290819 -4771683 -1309167 2445245 3073008
37558 3073008 -788192 -5655086 -6961016 -5062724 -4740393 -8417340 -12610881 -12600533 -8576384
37549 -8576384 -4781786 -3469058 -2459686 854390 5480743 8289662 8003682 5835690
37541 5835690 2874298 -1035491 -5543429 -8764406 -9148822 -7555060 -6334701 -6534812
37533 -6534812 -6908629 -5990085 -4504606 -4770573 -7416512 -9690128 -8443539 -4611344 -2736364
37524 -2736364 -5070957 -7994871 -6316106 -52656 5487233 5948014 1673101 -4678746
37516d678746o295462l951975J002967N529791M981698k24548l556672l35168
37508g528115O024959Q389079M520931j468528m898543m719132k486268j03652
37500b269269R89114N55409J08959J181762K829639K585417J51341j895839j808965
37491B427568j000190j359248k117931j367880N08246J222234M6808j161400o37562
37482c439355J142435K361629J778131m61341k887135l527187j793039M05670
37474f420192O82130o20161p39420J639421M446783M926143K871084K16149j405084
37465E596853j658521j102155q51349j809979l312071l401188j316512J300397
37457f554525K567535K569570K378403K190132J778895J540789J551642Q25340
$$ plain form
37516 -4678746 -10974208 -14926183 -13923216 -8393425 -3411727 -3636275 -7192947 -7528115
37508 -7528115 -1503156 6885923 11406854 9938326 5039783 320651 -2165617 -2269269
37500 -2269269 -1280155 -724746 -615787 565975 3395614 5981031 6132372 4236533 2427568
37491 2427568 1427378 68130 -2049801 -3417681 -2909435 -1687201 -1640393 -2801793 -3439355
37482 -3439355 -2296920 64709 1842840 1381499 -1505636 -5032823 -6825862 -6420192
37474 -6420192 -5738062 -6358223 -7097643 -5458222 -1011439 3914704 6785788 7001937 5596853
37465 5596853 3938332 2836177 1984828 174849 -3137222 -6538410 -7854922 -6554525
37457 -6554525 -3986990 -1417420 960983 3151115 4930010 6470799 8022441 8847781
37449H847781p98488j395658K80897K029430Q07353k705655m967078m539231l217481
37440e658130k259924o82272K006701M217540M554011L477149J827128j81610
37432G300593j729084j465367J73981R07036r1872r90105m76750J57755n03202
37423C282985j657369k015374j877033j838266j343668k24206K16834n36711p24297
37414f717105R77037L027895L365999K424191J608941N19070j747778l964960
37406e06710m203809k857131j686409q87781K93424J143041O72222L68101K353734
37397e311318N056068M288035o69878n175419m725643j34710M066973M742369
37389B136477K458036j42616j151658r35060j186630k372240k839916j142228
$$ plain form
37449 8847781 8049293 6653635 6934532 8963962 9771315 7065660 2098582 -2440649 -5658130
37440 -5658130 -7918054 -8600326 -6593625 -2376085 2177926 5655075 7482203 7300593
37432 7300593 5571509 4106142 4280123 5187159 5095287 4105182 3628432 3786187 3282985
37423 3282985 1625616 -389758 -2266791 -4105057 -5448725 -5672931 -5456097 -5992808 -6717105
37414 -6717105 -5740068 -2712173 653826 3078017 4686958 5206028 3458250 -506710
37406 -506710 -4710519 -7567650 -9254059 -10141840 -9848416 -8705375 -8033153 -7665052 -5311318
37397 -5311318 -255250 4032785 3362907 -1812512 -6538155 -6672865 -2605892 2136477
37389 2136477 4594513 4451897 3300239 2365179 1178549 -1193691 -4033607 -5175835
37381e175835J797816L964628M583577L868837J868454o12840j421639K39673
37373I112671J787162O14315j707290j731621K73677P22033j517823l495021k823201
37364A234902o13048R69971J127558j78864k366270l325721j418604J264110R55852
37355b350114k113680l842454k533215o70774M94822K942894O345851O047938
37347D321268L73500m780425l565297J203238K465594o72897k855979j438684
37339d949682M98804K60694p25633n39646K13041P73850K208608M957144O805098
37330I502278N333806J109973k886151m222049k856539q51587m36580j696773
37322B996378k569786j831602q96772j273572j778930n95014J226992J353337
$$ plain form
37381 -5175835 -3378019 586609 5170186 9039023 10907477 10294637 8872998 9112671
37373 9112671 10899833 11514148 9806858 8075237 8348914 9070947 7553124 4058103 1234902
37364 1234902 621854 1591825 2719383 2540519 174249 -3151472 -4570076 -3305966 -2350114
37355 -2350114 -4463794 -8306248 -10839463 -11510237 -11015415 -8072521 -1726670 4321268
37347 4321268 4694768 -85657 -3650954 -2447716 17878 -655019 -3510998 -4949682
37339 -4949682 -4450878 -4190184 -4915817 -5455463 -5242422 -4468572 -2259964 2697180 9502278
37330 9502278 14836084 15946057 13059906 8837857 5981318 5129731 4693151 2996378
37322 2996378 426592 -1405010 -2301782 -3575354 -5354284 -5949298 -4722306 -3368969
37314c368969M14163J043508K769601J931314k175058m921102k489898K453181
37306d343260M213251J538643j394248r50879J702671K896121J289342p47660
37298D203981k18750K798935N015169L551720q12648m541130n092900l095282
37290A809095j105424j008225k433721l118986j265528J889818K831975J84807
37282b216189k855677k410736O93547K033973j09847k506513j877027N81609J365297
37273g301563l03166j720694n67525K043360K832376K62672l271489l810617n74501
37264a2411147K834046K942555P73012j35643J087232K095405J492194M67656
37256h54690j10234j186880k941536l356407j040613K428380M519813M516639
$$ plain form
37314 -3368969 -2954806 -1911298 858303 2789617 614559 -4306543 -6796441 -4343260
37306 -4343260 -130009 1408634 14386 -936493 766178 3662299 4951641 4203981
37298 4203981 3985231 6784166 11799335 15351055 14538407 9997277 4904377 1809095
37290 1809095 703671 -304554 -2738275 -5857261 -7122789 -5232971 -2400996 -2216189
37282 -2216189 -5071866 -7482602 -6789055 -4755082 -4864929 -7371442 -9248469 -8666860 -7301563
37273 -7301563 -7604729 -9325423 -9892948 -7849588 -5017212 -4754540 -8026029 -11836646 -12411147
37264 -12411147 -9577101 -6634546 -5861534 -5997177 -4909945 -2814540 -1322346 -854690
37256 -854690 -964924 -2151804 -5093340 -8449747 -9490360 -7061980 -2542167 1974472
37248A974472L028259N36185k034932k899962j373285P48895J169000l90301k544482
37239a786151l915000l571565j310393J437597K485935J758406J640978L368981
37231A08788M981868M279916J824383o24690k524344l490781k186819J144185
37223C512506L137346J356439j810984k513562j073500n97492j338248q31736
37215a59231Q99000J005300q63709j456903N83976K310479J421613j77376j98007
37206C365142M7324j426091l003529j714201J719675L473049J759506j333615
37198B887260l012781k573470r61120O77064J679527K132781K470767K393557
37190E693585J058198r67992j441687L65996J636862n64654m634304n875030k725980
$$ plain form
37248 1974472 5002731 5538916 3503984 604022 -769263 -20368 1148632 758331 -1786151
37239 -1786151 -5701151 -9272716 -10583109 -9145512 -6659577 -4901171 -3260193 108788
37231 108788 5090656 9370572 11194955 10570265 8045921 4555140 2368321 3512506
37223 3512506 6649852 8006291 6195307 3681745 2608245 2010753 672505 -159231
37215 -159231 739769 1745069 881360 -575543 8433 2318912 3740525 3563149 3365142
37206 3365142 3412466 1986375 -1017154 -2731355 -1011680 2461369 4220875 2887260
37198 2887260 -125521 -2698991 -3660111 -2983047 -1303520 829261 3300028 5693585
37190 5693585 6751783 5783791 4342104 4708100 6344962 5780308 1146004 -4729026 -7455006
37181g455006R54476Q18546k538751m482222j878534L428698O650596N094033
37173E91836R75832j088354N65838K742297J618893k061083l698523o68668M199118
37164C177186N744629K294716k435231l334551L34432L694304J781955l929858
37156G327582o712319l199251J910461K341022r94593j986977J028665L026695
37148B741285O29035k662827k403283M1560O97955k85286J92867K257506L151500
37139D360312K367063K067884K616475K074280L17793o79116j032977k771067
37131I320647m715884k899433J985796L207832k322771q071376o637041n07208
37123a0639438K093346m68369k031183Q27634M003026L108172k15486j903477
$$ plain form
37181 -7455006 -6500530 -5681984 -8220735 -12702957 -14581491 -11152793 -4502197 591836
37173 591836 1567668 479314 1045152 3787449 5406342 3345259 -353264 -1021932 3177186
37164 3177186 8921815 11216531 8781300 5446749 5781181 9475485 11257440 7327582
37156 7327582 615263 -2583988 -673527 1667495 672902 -1314075 -285410 2741285
37148 2741285 3370320 707493 -1695790 -1654230 -956275 -1241561 -1048694 1208812 4360312
37139 4360312 6727375 8795259 11411734 13486014 13803807 13124691 12091714 9320647
37131 9320647 4604763 1705330 3691126 6898958 4576187 -3495189 -10132230 -10639438
37123 -10639438 -8546092 -9014461 -11045644 -10218010 -6214984 -3106812 -3322298 -5225775
37115e225775j213907k6781N95568N80951j53835p97395K60499K731860L857570
37106F08755K070583q45949k634391l176208k687111j54880M042153O467157M519088
37097H209197K88724k170191j916949r24732m08882j90086m18100j056647p23390
37088F88944J192145K399017O33849k374132l035232j054314Q77468J642411K227475
37079C197631K369354Q40066j078002p89953O91018k77440l316377l583060K12087
37070a734676K760975L50876k864065j363181K903879L802862O96096j279487
37062C273279J27650J344928l68276k563044k199481o43144r50151k596199k249558
37053f823996J030890M159163L926520P82164k103882k666635j767821j192003
$$ plain form
37115 -5225775 -6439682 -6466463 -5870895 -5289944 -5443779 -6241174 -5980675 -3248815 608755
37106 608755 2679338 1833389 -801002 -3977210 -6664321 -6819201 -2777048 3690109 8209197
37097 8209197 8497921 6327730 4410781 3486049 3077167 2887081 2468981 1412334 688944
37088 688944 1881089 4280106 4913955 2539823 -495409 -1549723 -672255 970156 3197631
37079 3197631 5566985 6407051 5329049 4539096 5230114 4952674 1636297 -1946763 -1734676
37070 -1734676 1026299 1377175 -1486890 -2850071 53808 3856670 4552766 3273279
37062 3273279 3400929 4745857 4377581 1814537 -384944 -1028088 -1978239 -4574438 -6823996
37053 -6823996 -5793106 -1633943 2292577 3074741 970859 -1695776 -3463597 -4655600
37045d655600r51375K43332K234032K989368J623538R4582M13446J568511J276506
37036D836340j83245m66532P55830J070807o00764j850347l72381K212128K359322
37027G761158m52571k973600k399130L38587J997216P38302k083381l345915j259111
37018a678445K482337L862368P73557l993160n295986j588146L101578M044719
37010A708822J214957j726475k459224j529501L91997L427475O117340N532186
37002A2677577J517324k007363k239194j322084k118162k823031j8270M517384
36994H184181N059288J3479n775620p518906n282418j553663J749921K648619
36986b475119p6127l530180k507173K980276O303188L268126j885556l284014
$$ plain form
37045 -4655600 -5606975 -5363643 -3129611 -140243 1483295 1577877 1991323 3559834 4836340
37036 4836340 4653095 4186563 4942393 6013200 5412436 3562089 3189708 5401836 7761158
37027 7761158 7308587 4334987 1935857 2274444 4271660 5009962 2926581 -419334 -1678445
37018 -1678445 803892 4666260 5439817 1446657 -3849329 -5437475 -2335897 1708822
37010 1708822 2923779 1197304 -1261920 -2791421 -2399424 1028051 7145391 12677577
37002 12677577 14194901 12187538 9948344 8626260 6508098 3685067 3666797 8184181
36994 8184181 13243469 13256948 7481328 -37578 -5319996 -6873659 -5123738 -2475119
36986 -2475119 -2551246 -6081426 -8588599 -5608323 694865 3962991 2077435 -1206579
36978a206579j766212j514708k288584j175296O38444l48108k765046j854597
36970a2280686K081938L471034N06730k063682r55230Q68457J05052j437822o73071
36961a0377280J630004K958163L042950K691638J565797j0452K01364K890072
36953D592256M914456L302948n39908l078519l055898j516716L18200J134827
36945F071646o6222j696051o04112K619196L076304q99302l888554j311839K725346
36936F026412J204035m886132p818645m194333J507927M426570M538030L539301
36928D343165J756389k52152j169978j418415k656132m050806k955589j8741Q26622
36919e595637j228201k067284P39132L972969M086358K373332J572926R80963
$$ plain form
36978 -1206579 -2972791 -4487499 -6776083 -7951379 -7312935 -7661043 -10426089 -12280686
36970 -12280686 -10198748 -6727714 -6220984 -8284666 -9239896 -8371439 -8266387 -9704209 -10377280
36961 -10377280 -8747276 -5789113 -2746163 -54525 1511272 1500820 1702184 4592256
36953 4592256 9506712 12809660 12269752 9191233 6135335 4618619 4936819 6071646
36945 6071646 6005424 4309373 3705261 6324457 9400761 8501459 4612905 3301066 6026412
36936 6026412 7230447 2344315 -5474330 -9668663 -8160736 -3734166 803864 4343165
36928 4343165 6099554 5847402 4677424 3259009 602877 -3447929 -6403518 -6422259 -5595637
36919 -5595637 -6823838 -8891122 -8151990 -4179021 -92663 2280669 3853595 4834558
36911D834558j146548l209673k587754m84096k95494k203318l153376j668204
36903i913905O47404K056703K134387N93762k270038l991249j873680K891560
36895i725056N680391L903562p6647k344252j810011j29462J101801J584766J522218
36886b92690Q46831o76045k812113m278816l334504J72804L651762L944379R26111
36877a852281k097023k042418O74237L019375K883637J045174k59320m2164O95306
36868B024523Q10845O61571J096663J590479R90436q4860K64006J765676J407115
36859A0526454k144814n684713n379460k006063M84065O21176M52968J237722
36851a892665J583754O08190k29818R8909K66024p45832j386973k06467J176124
$$ plain form
36911 4834558 3688010 478337 -2109417 -2593513 -2889007 -5092325 -8245701 -9913905
36903 -9913905 -9266501 -7209798 -5075411 -4481649 -6751687 -10742936 -12616616 -9725056
36895 -9725056 -4044665 -141103 -217750 -2562002 -4372013 -4501475 -3399674 -1814908 -292690
36886 -292690 554141 -121904 -2934017 -7212833 -10547337 -10374533 -6722771 -2778392 -1852281
36877 -1852281 -3949304 -5991722 -5317485 -2298110 585527 1630701 1371381 1329217 2024523
36868 2024523 2835368 3496939 4593602 6184081 7174517 7089657 7353663 9119339 10526454
36859 10526454 8381640 2696927 -2682533 -4688596 -4204531 -3583355 -3130387 -1892665
36851 -1892665 -308911 299279 69461 168370 434394 -311438 -1698411 -1904878 -728754
36842g28754N12036r98284k06569K882356M736701L446066J229921N80292N51192
36833A2004957j039637l587719m467970k958232q77783M70895J517415K224017
36825C285943J196260j720284l947566l173777o33733N94568j42614o03849P27381
36816d417671K628209L180837K130604M46484j204182k670933l759454m064929
36808g731035l016755k67289L186253M865997L391620Q12523K37680J297489Q24732
36799C601215j509108j937368J135892L305387J33376n662908p390448l453058
36791a1777020J290872K914524K536441K313560J790939K36552q90535l16521
36783a901188O65510M68072j87612k8845L98375K95101O16185K075554K898992
$$ plain form
36842 -728754 -216718 -1215002 -1421571 1460785 6197486 9643552 10873473 11453765 12004957
36833 12004957 10965320 7377601 2909631 -48601 -926384 -455489 1061926 3285943
36825 3285943 4482203 2761919 -1185647 -4359424 -4993157 -4398589 -4541203 -5145052 -4417671
36816 -4417671 -1789462 1391375 3521979 3968463 2764281 93348 -3666106 -7731035
36808 -7731035 -10747790 -11015079 -7828826 -2962829 428791 1241314 1478994 2776483 3601215
36799 3601215 2092107 154739 1290631 4596018 4729394 -933514 -8323962 -11777020
36791 -11777020 -10486148 -7571624 -5035183 -2721623 -930684 -694132 -1584667 -1901188
36783 -1901188 -1235678 -767606 -955218 -984063 -585688 -290587 325598 2401152 5300144
36774E300144J305430j218763k060370j643682k149311k996331j497335K030929
36766b929289L878624K564760J006381J444053J863698J4145k201294j827728
36758C813350j14616o12008l065571l425657j55607L304514L533905J407377l23379
36749D362308j098884j993171k949826k978638k057027p59065J161783L788666
36741b523854N380646L983323M58507k268852k974611k950987k906813j642991
36733e445632J144499L062660J888251j115618k597860j169938J432130K841512
36725D0004K467129J524426J472391K368542K625244J023251j105716j189480
36717I225791O96726J320840j009016l326612j900735K220622M409127K516412
$$ plain form
36774 5300144 6605574 5386811 3326441 1682759 -466552 -3462883 -4960218 -2929289
36766 -2929289 949335 3514095 4520476 5964529 7828227 7842372 5641078 3813350
36758 3813350 3698734 3086726 21155 -3404502 -3560109 -255595 3278310 4685687 4362308
36749 4362308 3263424 1270253 -1679573 -4658211 -6715238 -7474303 -6312520 -2523854
36741 -2523854 2856792 6840115 7298622 5029770 2055159 -895828 -3802641 -5445632
36733 -5445632 -4301133 -1238473 649778 -465840 -3063700 -4233638 -2801508 40004
36725 40004 2507133 4031559 5503950 7872492 10497736 11520987 10415271 9225791
36717 9225791 9922517 11243357 10234341 6907729 5006994 7227616 11636743 14153155
36709A4153155j193776m000894n486007n775773m181854j171221P84203M08551
36701f463616p7723J879286M873257M922481R01869l689308m956807k958916q40858
36692f410335o47999j337363q96033P23147J651539P94622n86311n13603J132265
36683f090071K502548K045309J61728j412345j390778r4707R35454O74022n1491
36674b720331L09845J448833J119574j526685m000580l390633j22305K908589
36666e973693L962852L275499J281889j439799l023710j874255P23900K136261
36658i31056K284427L054887M037848K702338n90502k042734n45658o4410l163441
36649D741699o124025m414921O8261J911561L74696l83288J408820K676861J080231
$$ plain form
36709 14153155 12959379 8958485 3472478 -2303295 -6485149 -7656370 -6872167 -6463616
36701 -6463616 -6541339 -4662053 211204 5133685 6035554 2346246 -2610561 -5569477 -6410335
36692 -6410335 -7058334 -8395697 -9291730 -8568583 -6917044 -6122422 -6708733 -7222336 -6090071
36683 -6090071 -3587523 -1542214 -1380486 -2792831 -4183609 -4278316 -3342862 -2668840 -2720331
36674 -2720331 -2410486 -961653 157921 -1368764 -5369344 -8759977 -8882282 -5973693
36666 -5973693 -2010841 1264658 2546547 1106748 -1916962 -3791217 -3067317 -931056
36658 -931056 1353371 4408258 8446106 11148444 10557942 8515208 7969550 7905140 4741699
36649 4741699 -1382326 -5797247 -5728986 -3817425 -3442729 -3826017 -2417197 259664 1339895
36640A339895j290682j589131m25631k59962j616332k921703k954596j826760
36632a1544902j29105J687361L231968M122678M059888K918556R08383j487495
36624C767332l745030n044747m114299p10719K653195K618592l57965j604059
36616f537700J521994N184691L920554j468509m630607k214448J911856K194205
36608a17964j558525m580854l288670P67657L092185J585779j032669p65985K344386
36599c554660M430532L501051J992683K165577K232431N418k472394j971911L41258
36590F669985R84608L24337J410596L377563J959808k766799n134864k343772
36582D481462J189349P32527k180316l427992k592044j792833j322695k26253
$$ plain form
36640 1339895 49213 -1539918 -1965549 -2225511 -3841843 -6763546 -9718142 -11544902
36632 -11544902 -11674007 -9986646 -6754678 -2632000 1427888 4346444 5254827 3767332
36624 3767332 22302 -5022445 -9136744 -9847463 -7194268 -4575676 -4933641 -6537700
36616 -6537700 -5015706 168985 4089539 2621030 -2009577 -4224025 -2312169 -117964
36608 -117964 -1676489 -6257343 -9546013 -8778356 -5686171 -4100392 -5133061 -5899046 -3554660
36599 -3554660 875872 4376923 6369606 8535183 10767614 10773032 8300638 6328727 6669985
36590 6669985 7654593 7978930 9389526 12767089 14726897 11960098 6825234 4481462
36582 4481462 5670811 6403338 4223022 795030 -1797014 -3589847 -4912542 -5138795
36574e138795J026319J714292K606929L668085K531865j514858m609072l198862
36566b914097L12826J028448j016657j507315R42550L003177K251924L07845n55517
36557A853184l45124L19609J769704L623434L840600J119930l020300n641974
36549C519063n111839k150395R17696J950439R32987j19486P0167L83640l70421
36540B1851j003056k1933J110062j93245l036225l565855n44144K621389K546027
36531b065129J22537j397848q27936J06075m86008k260253k899107o70318L011116
36522g366871M379925J785824j608348j506718J829891M114381L146992J397120
36514F172196J546618K333766R89412j984733l166209j063638J575528J169897
$$ plain form
36574 -5138795 -4112476 -2398184 208745 3876830 6408695 4893837 284765 -2914097
36566 -2914097 -2601271 -1572823 -2589480 -4096795 -3154245 -151068 2100856 2408701 1853184
36557 1853184 1508060 1827669 3597373 7220807 11061407 12181337 9161037 3519063
36549 3519063 -1592776 -3743171 -2825475 -875036 57951 -61535 8632 392272 21851
36540 21851 -981205 -1003138 106924 -86321 -3122546 -6688401 -7232545 -4611156 -2065129
36531 -2065129 -1942592 -3340440 -4168376 -4062301 -4548309 -6808562 -9707669 -10377987 -7366871
36522 -7366871 -2986946 -1201122 -2809470 -4316188 -2486297 1628084 4775076 6172196
36514 6172196 7718814 10052580 11041992 9057259 5891050 4827412 6402940 7572837
36506G572837k078202m286409k704665Q24217K403972J319802N97435K121739
36498E770726L785578K898989J02103k253854l628788m561571m177895j718142
36490c782854O24107O9190k078792j974931N57171J494624q25897k721676p37583
36481i376641L120561M369484K031152r82452k099806j410186m16677j64630m47109
36472e376304j83666J031576J882257R85096o82439q78039L82541O93149r19398
36463c065227k464675k121259n89075P09367J544310J879562J187472q852j18113
36454c046490P58910M72234j326797j712689R98010L835731L143233M0171j250417
36445A911896N96539K816025K935770J469380l4324j298452k815641m346668m791914
$$ plain form
36506 7572837 5494635 1208226 -1496439 -672222 1731750 3051552 3648987 5770726
36498 5770726 9556304 12455293 12557396 10303542 6674754 2113183 -2064712 -3782854
36490 -3782854 -3158747 -3089557 -5168349 -7143280 -6586109 -5091485 -5917382 -8639058 -9376641
36481 -9376641 -6256080 -1886596 144556 -837896 -2937702 -4347888 -4764565 -4929195 -5376304
36472 -5376304 -5559970 -4528394 -2646137 -1661041 -2343480 -3221519 -2838978 -2145829 -3065227
36463 -3065227 -5529902 -7651161 -8240236 -7530869 -5986559 -4106997 -2919525 -2928377 -3046490
36454 -3046490 -2287580 -1815346 -3142143 -4854832 -3856822 -21091 3122142 3162313 1911896
36445 1911896 2508435 5324460 8260230 9729610 9695286 8396834 5581193 1234525 -3557389
36436c557389l373691q43499P64542L06621q06737l69723J482232K743239K915260
36427g39145L257997L408422J157501l092268n164435k754356Q09928J367715
36419a748641j48194k9645K030906L020955J831828O45948J226070K748057L386438
36410A2963722J927531j734716n689222o473247k759603K243888M351058L313876
36402H143287J743767M98492j569053m029269m627536k753065k25344J538239
36394a280482K565894K682350J538893K10345M9694J07291j438309l510996l166671
36385b241991n89258N72408j247091l118184k224932K36653J729624K309045L401588
36376a172138M378139L040453q31818m366529m553280j597530J317978J864754
$$ plain form
36436 -3557389 -6931080 -7774579 -7010037 -6703416 -7510153 -7879876 -6397644 -3654405 -739145
36427 -739145 2518852 5927274 7084775 3992507 -1171928 -3926284 -3116356 -1748641
36419 -1748641 -1896835 -1926480 104426 3125381 4957209 5603157 6829227 9577284 12963722
36410 12963722 14891253 13156537 7467315 994068 -1765535 478353 4829411 8143287
36402 8143287 9887054 10385546 8816493 4787224 159688 -2593377 -2818721 -1280482
36394 -1280482 1285412 3967762 5506655 5717000 5766694 5873985 4435676 924680 -2241991
36385 -2241991 -2831249 -2258841 -3505932 -6624116 -8849048 -8612395 -6882771 -4573726 -1172138
36376 -1172138 3206001 6246454 5414636 1048107 -3505173 -5102703 -3784725 -1919971
36368a919971J438526K712136M700212L346054j762350m999605k212391K564119
36360C866730K482502k223101n135048l287612J5352J910130L265604M205593
36352E100150K598445o47005n86997M052382P198867L614819l310617o493748
36344A1526296m730712k543987k586386l087407k185465p18836l39961j343539
36336f009997k565568k218969L93141L194831L164194Q12585J64291K623223M085436
36327C643167R47133m002560n423131k952504p39708p76091r77726L37026J887117
36318h057277J969537Q49569m2395M14763K357406M300865L781423K50846l435309
36309B389428m090268j898834N27704J602824J443407L72064j130100j918941
$$ plain form
36368 -1919971 -481445 2230691 6930903 10276957 8514607 3515002 1302611 3866730
36360 3866730 6349232 4126131 -1008917 -4296529 -4281177 -2371047 894557 5100150
36352 5100150 7698595 7051590 6464593 10516975 17715842 21330661 18020044 11526296
36344 11526296 6795584 4251597 1665211 -1422196 -3607661 -4326497 -4666458 -6009997
36336 -6009997 -8575565 -10794534 -10401393 -7206562 -4042368 -3229783 -3065492 -442269 3643167
36327 3643167 4590300 587740 -4835391 -7787895 -8527603 -9303694 -10281420 -9944394 -8057277
36318 -8057277 -6087740 -5238171 -5280566 -4865803 -2508397 1792468 5573891 5824737 2389428
36309 2389428 -1700840 -3599674 -3071970 -1469146 -25739 346325 -783775 -2702716
36301b702716j506193r25834q35841l08192R34916J190456k81337j285113r4045
36292e813899J598396J847344J804401K588971J927116j679898m317586j695774
36284c740929L298668M284868J282447O8658K020278K198644j094457k497364
36276E820813J333987N361671L577960k077996n300170m441944k844327k409857
36268i79863j891531p27348k28328p02461n45512J152835L076381L282276J279058
36259C715507j548246l033024k179291l76869Q6491j116096k121228j590131o2204
36250h225091J691121L734108N560153N367452K072961k766280n867506m840703
36242c273785k93462L959104L867592k01392l096223j169113K739480L473437
$$ plain form
36301 -2702716 -4208909 -5134743 -5970584 -6278776 -5343860 -4153404 -4434741 -5719854 -5813899
36292 -5813899 -4215503 -2368159 -563758 2025213 3952329 2272431 -2045155 -3740929
36284 -3740929 -442261 3842607 5125054 5193712 7213990 9412634 8318177 5820813
36276 5820813 7154800 12516471 16094431 14016435 8716265 4274321 1429994 -979863
36268 -979863 -2871394 -3598742 -3827070 -4529531 -5075043 -3922208 -845827 2436449 3715507
36259 3715507 2167261 -865763 -3045054 -3421923 -3335432 -4451528 -6572756 -8162887 -8225091
36250 -8225091 -6533970 -2799862 2760291 8127743 10200704 7434424 1566918 -3273785
36242 -3273785 -3567247 391857 4259449 4058057 961834 -207279 2532201 6005638
36234F005638R05269q94576m31887K11695M52132J623411K200151j123031o304530
36225B644272o467358j72082N055984L193142j947925l410124j094434M03097
36217a795428J09050Q59334L313545N076755M864408L728057K971767L269136
36209B2396624M272270L704910j06663l628303p89653P886374J4767770J6206348
36201F4709677J6684542J8617254J8391254J8979036L3155816O0229949P0744001
36194C01511529L6028760k9118494p4886158p2103656m1151454j8702821j4552853
36187H7024853j4444808j0210780p620500j0012217j1753516q978174m998572
36180A9006286l199543k841354k960490l666455l199810J93299L577745K468511
$$ plain form
36234 6005638 6910907 6016331 5584444 5796139 6248271 7871682 10071833 8948802 2644272
36225 2644272 -3823086 -3995168 1060816 4253958 2306033 -1104091 -2198525 -1795428
36217 -1795428 -1686378 -827044 2486501 7563256 12427664 16155721 19127488 22396624
36209 22396624 26668894 30373804 30267141 26638838 25849185 33735559 48503329 64709677
36201 64709677 81394219 100011473 118402727 137381763 170537579 230767528 301511529
36194 301511529 337540289 308421795 233535637 161431981 120280527 101577706 87024853
36187 87024853 72580045 62369265 54748765 44736548 32983032 24004858 19006286
36180 19006286 15806743 12965389 10004899 6338444 3138634 3331933 6909678 9378189
36172I378189j665491l087157p33324Q87137o6692l53838J323773J524806j282623
36163E924780l191098j304851J168178J45316k805060l319181j001400P70418
36155c612898L40174n99743l32258R44027K512464M068210M814411L491954K28163
36146A1854504k689711k954951r10455Q24221O07559l24582j09289N93764l10373
36137F580687k398160k579522K28179K961997K637250L03998j370023k160940
36129D203466l159249l571054k031172J56603N37761n05413n76780N58188R89714
36120c397936M29065N07892J478379K002318K129317K981737L489615J244777
36112A0865164k987627n385962m367903k170552o16761P46630J583996K55603
$$ plain form
36172 9378189 7712698 4625541 3892217 4779354 4712662 4358824 5682597 7207403 5924780
36163 5924780 2733682 1428831 2597009 2742325 -62735 -3381916 -4383316 -3612898
36155 -3612898 -3272724 -3872467 -4204725 -3260698 -748234 3319976 8134387 11626341 11854504
36146 11854504 9164793 6209842 5299387 6123608 6731167 6406585 6297296 6891060 6580687
36137 6580687 4182527 1603005 1831184 4793181 7430431 7734429 6364406 4203466
36129 4203466 1044217 -2526837 -4558009 -4401406 -3863645 -4369058 -4945838 -4387650 -3397936
36120 -3397936 -2968871 -2460979 -982600 1019718 3149035 6130772 9620387 10865164
36112 10865164 7877537 2491575 -1876328 -4046880 -4663641 -3917011 -2333015 -2077412
36104b077412k317291k675432l79648R17589j65952k85930K067735K895741m24292
36095b444892l530480j579219K648344L106823j0343j570170m49168m18818k523354
36086f771277l114124n01709J974884J312745j031182k171574j525895l6711J446344
36077a0418499J950090J128953O72260K207759L901875K620848n96567j462527
36069D192P41588K056555P64927K97120K885295N211412L774235M30487j315310
36060A4850501j941383l453128m345758k039258J598551K221745m76042k862943
36052C552285l354560l597020l780632j744876K153043L770805R12138l036122
36044e124939l580530p90343J825740K279656J574944J220460J346666J166781
$$ plain form
36104 -2077412 -4394703 -7070135 -7449783 -6532194 -6698146 -6984076 -4916341 -2020600 -2444892
36095 -2444892 -5975372 -7554591 -4906247 -1799424 -1809767 -3379937 -3829105 -4247923 -6771277
36086 -6771277 -9885401 -10387110 -8412226 -7099481 -8130663 -10302237 -11828132 -11864843 -10418499
36077 -10418499 -8468409 -7339456 -6667196 -4459437 -557562 2063286 1466719 4192
36069 4192 745780 2802335 3567262 3864382 6749677 11961089 15735324 16165811 14850501
36060 14850501 12909118 9455990 5110232 3070974 4669525 6891270 6415228 3552285
36052 3552285 197725 -3399295 -7179927 -8924803 -6771760 -3000955 -2088817 -5124939
36044 -5124939 -8705469 -9495812 -7670072 -5390416 -3815472 -2595012 -1248346 -81565
36036h1565K14645q52890n75163J441788L067808J596489k415207m985179l400530
36027e989804M30370K653904K179091R16855J75731q44695k608684l297216q28272
36018g212720L857035P124583O651330L954184K013680J338806J47508j848102
36010A6026304k362340k89293J801088J030925j611520l090218l065691l569598
36002D869657m486888l195431O02689L342972K522123Q5751j090590j197553j410106
35993D2624n62670K501573N075133L303796j676412m335953k064593J632318K461826
35984F377642P38174m60466k7450P81834J130359J096141M8416k873844o397406
35975D13400p362483m293314N98145L958920M825553M419615L280718O36141k996926
$$ plain form
36036 -81565 133080 -719810 -1294973 146815 3214623 4811112 2395905 -2589274 -5989804
36027 -5989804 -5559434 -2905530 -726439 190416 366147 -478548 -3087232 -6384448 -7212720
36018 -7212720 -3355685 3768898 10420228 14374412 16388092 17726898 17874406 16026304
36010 16026304 13663964 13374671 15175759 16206684 14595164 11504946 8439255 4869657
36002 4869657 382769 -2812662 -2209973 1132999 3655122 3740873 2650283 1452730 42624
35993 42624 -520046 1981527 7056660 10360456 8684044 4348091 2283498 3915816 6377642
35984 6377642 7115816 6655350 6627900 7409734 8540093 9636234 9684650 6810806 413400
35975 413400 -6949083 -11242397 -10644252 -6685332 -1859779 2559836 5840554 6476695 3479769
35966C479769m618052k004673K610530M291172J194950l132688m119103j364894
35958c662989J730044K363078P67772j066341j457647j1952K060596K643987Q45600
35949D212148j772961l093618k893373j957371J93344M031896O887846M733058
35941A0340969j664923n811299l283832K094245L189981j025017m920879m503526
35933e584281j956424q93911j001469N0573J946430K207937L56539j229425n86273
35924f690304J790615M295998N773739N434231L001837l03589k278566k050935
35916H973026q92894k20890j07973m59363j849577l629501k959946J553484O132298
35907F538664N206908q93122n064741k222187L812049N246849L99813m922944
$$ plain form
35966 3479769 -1138283 -3142956 -532426 3758746 4953696 1821008 -2298095 -3662989
35958 -3662989 -1932945 430133 1197905 131564 -1326083 -1338035 722561 3366548 4212148
35949 4212148 2439187 -654431 -3547804 -5505175 -5311831 -1279935 5607911 10340969
35941 10340969 8676046 2864747 -419085 1675160 4865141 3840124 -1080755 -5584281
35933 -5584281 -7540705 -8434616 -9436085 -9385512 -7439082 -5231145 -4874606 -6104031 -6690304
35924 -6690304 -4899689 -603691 5170048 10604279 13606116 13302527 11023961 8973026
35916 8973026 8080132 7859242 7751269 7291906 5442329 1812828 -1147118 406366 6538664
35907 6538664 11745572 10852450 5787709 3565522 7377571 12624420 13024233 8101289
35899H101289n684329l209701j390870r37903j31867R21762K33137k295815l931951
35890h326248k665979J48296J694325J172361M38076J529158M099955N440291
35882C530235L344452q74891l088864r82710K781150L551492M79608k602510k353715
35873C784247R8272J404855M94580q16574o89624R24956K811438L393951J527066
35864A2933167k215964n280927n447799l232422q66643N85767J560651J999613
35856C5443J234949o9198k64690L55129n53075l327553m609812j799847K756315
35847f242339M668707L268957J553463J147785O61519p40676j414060j50238J453197
35838D206315J159375j031251l468825m769211l978148o35782L662153N347406
$$ plain form
35899 8101289 2416960 -792741 -2183611 -3121514 -3253381 -2331619 -2098482 -4394297 -8326248
35890 -8326248 -10992227 -10843931 -9149606 -7977245 -7539169 -6010011 -1910056 3530235
35882 3530235 6874687 5999796 2910932 1928222 4709372 8260864 8740472 6137962 3784247
35873 3784247 3882519 5287374 5781954 4965380 4275756 5200712 8012150 11406101 12933167
35864 12933167 10717203 5436276 -11523 -3243945 -4110588 -3524821 -1964170 35443
35856 35443 1270392 1201194 936504 1291633 738558 -2588995 -7198807 -8998654 -6242339
35847 -6242339 -1573632 1695325 3248788 4396573 5058092 4317416 2903356 2753118 4206315
35838 4206315 5365690 4334439 865614 -3903597 -7881745 -8517527 -4855374 492032
35830D92032K586352k077382m610671m008694k017076L90114L432156N913138
35822I9969N392536J678349k339602m279647m547003m122178k491547N49915L048268
35813g010940L069020J499973N33282K62883q77646k708899k845924j40054L326024
35804d892281M545966K708240n76158l079230l401300j582822R93369K794649
35796b489567L491118L580145K917321R39708j506411k264889o78344J103969
35788E093050P97577j148045k556042k313065p88590J395346L230550K932072
35780F642853o9918l257336l594505j864658j793676m481394o541865m889789
35772a9850288p82233K476137L572761L167658K052457J427731K894170N684891
$$ plain form
35830 492032 3078384 1001002 -3609669 -7618363 -9635439 -9245325 -5813169 99969
35822 99969 5492505 7170854 4831252 551605 -3995398 -8117576 -10609123 -10059208 -7010940
35813 -7010940 -3941920 -2441947 -1908665 -1645782 -2523428 -5232327 -8078251 -8218305 -4892281
35804 -4892281 -346315 2361925 1785767 -1293463 -4694763 -6277585 -5284216 -2489567
35796 -2489567 1001551 4581696 7499017 8438725 6932314 4667425 3989081 5093050
35788 5093050 5890627 4742582 2186540 -126525 -915115 480231 3710781 6642853
35780 6642853 6572935 3315599 -278906 -2143564 -3937240 -8418634 -14960499 -19850288
35772 -19850288 -20632521 -18156384 -14583623 -11415965 -9363508 -7935777 -5041607 643284
35764F43284N952360J816290k747061k696343Q70647K568712Q65505n97375J12424
35755F788443M24512j249923k441126j476476o82812j618743j601528J066311
35747g91342K638800k32350l691209j849302L481328M988997R45211k928426l199255
35738f37548l166906n295788n925346j763451L447605L965427N26831j347359
35730a0196535L88875K627685K826531J888334J165363L41531q90043j794164
35722c642423k037732k124712j993830j106674j07686k86922j081227l60336K139442
35713a0602100L902657L244909J775048J684112K293111J391710j010106k597403
35705H1938k206696j167586p51596l03914R34589J766204O22393j628408k502386
$$ plain form
35764 643284 6595644 8411934 5664873 2968530 3839177 6407889 7273394 6676019 6788443
35755 6788443 7212955 5963032 3521906 2045430 1362618 -256125 -1857653 -791342
35747 -791342 1847458 1615108 -2076101 -3925403 -444075 4544922 5490133 2561707 -637548
35738 -637548 -3804454 -9100242 -15025588 -16789039 -13341434 -9376007 -8849176 -10196535
35730 -10196535 -9807660 -7179975 -4353444 -2465110 -1299747 -958216 -1848259 -3642423
35722 -3642423 -5680155 -7804867 -9798697 -10905371 -11013057 -11299979 -12381206 -12741542 -10602100
35713 -10602100 -6699443 -3454534 -1679486 4626 2297737 3689447 2679341 81938
35705 81938 -2124758 -3292344 -4043940 -4347854 -3413265 -1647061 -1024668 -2653076 -5155462
35696e155462j367414l8224L83462J046061K774214M148389L822651K875684K688158
35687A1177519K108862n26199l724679m371732k376955n17996P5608O52305R70433
35678C467166j021676m516009n219429j630191J914053J311850j547965k347705
35670i589906o46642J025606J808956K313893J945402M91869L88087L007817M626183
35661E371265J203034m242241m926646n07250K304461K874l184220k846249l90628
35652g215600J332407K765483M270549L107743j543434m717353k114230K709578
35644a404857L165440o06830k639791n43198J976202J934441O72650l99117k447933
35635b92993n545181o611677l720350N81848K732633K514269J761681J102667
$$ plain form
35696 -5155462 -6522876 -6561100 -6177638 -5131577 -2357363 1791026 5613677 8489361 11177519
35687 11177519 13286381 12760182 9035503 4663771 2286816 1768820 1844428 2496733 3467166
35678 3467166 2445490 -2070519 -7289948 -8920139 -7006086 -5694236 -7242201 -9589906
35670 -9589906 -10236548 -9210942 -7401986 -5088093 -3142691 -2650822 -2262735 745082 5371265
35661 5371265 6574299 2332058 -2594588 -3101838 -797377 -794503 -3978723 -6824972 -7215600
35652 -7215600 -5883193 -3117710 1152839 4260582 2717148 -2000205 -4114435 -1404857
35644 -1404857 1760583 1153753 -1486038 -2029236 -53034 1881407 2554057 2154940 -292993
35635 -292993 -5838174 -12449851 -16170201 -15588353 -12855720 -10341451 -8579770 -7477103
35627g477103N39947J284142L980360O207963M768723L01563k905219k088157
35619D612219R26804K404567R17590j899904l676455l326064j235448J485504
35611B08813L579292L952052K196753p73019l040624l399576k646730k313236
35603b236275k172907l79167L353740O191518N228294J247053k190873k997142
35595F044241k180992j367671p67833k79462p17092k526355m390133m516801k688251
35586a3390349l9089K332812L500891K706091Q23628N73087L005888M850191K414297
35577F777447k371622l666435j8006L331392K297234k40176J14625J872286P61175
35568H857920k231923k024986J913087M281325K424596K68553J246408K489548
$$ plain form
35627 -7477103 -6937156 -5653014 -1672654 4535309 9304032 9605595 6700376 4612219
35619 4612219 5539023 7943590 8861180 6961276 3284821 -41243 -1276691 208813
35611 208813 3788105 7740157 9936910 9163891 6123267 2723691 76961 -2236275
35603 -2236275 -4409182 -4788349 -1434609 4756909 9985203 11232256 9041383 6044241
35595 6044241 3863249 2495578 1727745 1448283 731191 -1795164 -6185297 -10702098 -13390349
35586 -13390349 -13429438 -11096626 -7595735 -4889644 -4066016 -3492929 -487041 4363150 6777447
35577 6777447 4405825 739390 721384 4052776 6350010 6109834 6224459 8096745 8857920
35568 8857920 6625997 4601011 6514098 10795423 13220019 13488572 14734980 17224528
35560A7224528L9801m064129m768605j818700K54560r63696l251985m016076l168551
35551d532853j326335J305022L297410K451800o31752k128291j9511K632970J770823
35542B819283j803177l397244q66360K615328L033547P48474n35242Q97397K661372
35533F173378J943887o02475k159408j799613j139412j250590j291506p58801
35525h84540p85926j884979k377923r68024O13160k05280k858720m215341k873593
35516a6441166p19854K6908n03329o23107P63686L289274N507106N966116M590112
35507A855746K775708J468175j4384k027580k654634k5009L888494M596808Q12684
35498A0676008l616084m621570k652344r26145o76073l39481J154385K395926
$$ plain form
35560 17224528 17264329 13200200 8431595 6612895 6867455 5903759 2651774 -1364302 -4532853
35551 -4532853 -5859188 -4554166 -1256756 1195044 563292 -1564999 -1584510 1048460 2819283
35542 2819283 1016106 -2381138 -3247498 -632170 2401377 3149851 2614609 3512006 6173378
35533 6173378 8117265 7514790 5355382 3555769 2416357 1165767 -125739 -884540
35525 -884540 -1670466 -3555445 -5933368 -6901392 -6288232 -6493512 -9352232 -13567573 -16441166
35516 -16441166 -17161020 -17134112 -17637441 -18260548 -17496862 -14207588 -8700482 -2734366 1855746
35507 1855746 4631454 6099629 6085245 4057665 1403031 1378022 5266516 9863324 10676008
35498 10676008 7059924 2438354 -213990 -1140135 -1816208 -2155689 -1001304 1394622
35490A394622J330555j898668m616371m137999n50209L261418M590683L490240
35482B864271J835652N06579j156671l223877m123690k459224R92730L750131
35474a014099L775790J185272j622348j828905R02401L679305L562152R92055
35466I631623j351925k374229k940087k759799j50997M016726N342975J377611
35458A0791898m009552m786494l69089L852713L470076k31883l178071l634331
35450A905267k767009j650632j13415J437069J162800j838710n266386n526072
35442a2657088k049737J857631L051769J848154L44310o52737j114071Q0833L508074
35433e782862O466653N317658Q02216k295088j654583l18623j588958m197803
$$ plain form
35490 1394622 2725177 826509 -3789862 -7927861 -8478070 -5216652 -625969 2864271
35482 2864271 4699923 5206502 4049831 825954 -3297736 -5756960 -4764230 -1014099
35474 -1014099 2761691 3946963 2324615 495710 1398111 5077416 8639568 9631623
35466 9631623 8279698 5905469 2965382 205583 54586 4071312 9414287 10791898
35458 10791898 6782346 1995852 1626763 5479476 8949552 8717669 5539598 1905267
35450 1905267 -861742 -2512374 -2625789 -1188720 -25920 -1864630 -7131016 -12657088
35442 -12657088 -14706825 -12849194 -9797425 -7949271 -7604961 -8257698 -9371769 -9290936 -5782862
35433 -5782862 683791 6001449 6803665 4508577 2853994 2535371 946413 -3251390
35425c251390m881833l185850r59274R68762K729599L531969K785815K020088
35417b42114K760036L387302J285956k377302l525014j171948Q66832m08637k688098
35408b112987j612333L105882P067986O316549J541437l038255m191109k584593
35400D492577j209544j450703j747926l96097J728747K426285J178336n79401
35392D442274j550204j431661k63213J325667J545273r38195m655083o274784
35384g799926m251026k50064L115703M571812M198953K838659J842167J959027
35376F225305K095316M98393k570104m765533m535628k562923n6067K587216M679929
35367A595904M617383J788277j838156l328115j715604J228399K787197J687086
$$ plain form
35425 -3251390 -8133223 -11319073 -12278347 -11309585 -8579986 -5048017 -2262202 -242114
35417 -242114 2517922 5905224 7191180 4813878 1288864 116916 983748 575111 -2112987
35408 -2112987 -3725320 -619438 6448548 12765097 14306534 11268279 7077170 4492577
35400 4492577 3283033 1832330 84404 -311693 1417054 3843339 5021675 4442274
35392 4442274 2892070 1460409 1197196 2522863 4068136 3129941 -1525142 -7799926
35384 -7799926 -12050952 -12301016 -9185313 -4613501 -414548 2424111 4266278 6225305
35376 6225305 8320621 8819014 6248910 1483377 -3052251 -5615174 -5671241 -3084025 1595904
35367 1595904 6213287 8001564 6163408 2835293 1119689 2348088 5135285 6822371
35359F822371p52615j875942o84096Q74101N38923j159458k077196j901228j970408
35350b185548k062642m93875K134997K657103J53535k120948j622054l55836j112643
35341e007911k416901p82985L489182O456485N943607L527666J217494p12610
35333A1714027k105782j929796L1267K326763L443787K912119P46488k416602
35325A4722271m545444l749841j102810J57426j086674k477335j980201o85387
35317g47995l26908k36035R87066K345003J647474q50286k563665k287380j499415
35308c532141j545080j571029k23872K077117L699391L688251K149911l92985
35300D349563k914503l767593j989551J273163L615655L754716K309054K98907
$$ plain form
35359 6822371 6069756 4193814 3509718 4383819 4922742 3763284 1686088 -215140 -2185548
35350 -2185548 -4248190 -4742065 -2607068 50035 203570 -1917378 -3539432 -3895268 -5007911
35341 -5007911 -7424812 -8207797 -4718615 1737870 7681477 11209143 12426637 11714027
35333 11714027 9608245 7678449 7709716 10036479 13480266 16392385 17138873 14722271
35325 14722271 10176827 6426986 5324176 5481602 4394928 1917593 -62608 -747995
35317 -747995 -1074903 -1310938 -323872 2021131 3668605 2818319 254654 -2032726 -3532141
35308 -3532141 -5077221 -6648250 -6872122 -4795005 -1095614 2592637 4742548 4349563
35300 4349563 1435060 -2332533 -4322084 -3048921 566734 4321450 6630504 6929411
35292F929411j956340m008575m537178k648388M22676K030124P98872j945213
35284d914611l548744k470965N57278L278586L801515K304494R73659J767561
35276A748773M120610N336668L451806o35470l968573m168392j415684J657951
35268F127689K166175k79393l063342l492884j959796j046746j659983j860216
35260e068496j58673J939766K219114J167930J006143J942482J746965o21510
35252D173721k975005k588159K16673K402891J776695o96265k249953j556498
35244a495900j79985m54021k076311j882460K103669P153761Q002460K803751
35236A3974964m391901p838781n884451j754089O44772L66955j016029j968441
$$ plain form
35292 6929411 4973071 964496 -3572682 -6221070 -5798394 -3768270 -2969398 -4914611
35284 -4914611 -8463355 -10934320 -10377042 -7098456 -3296941 -992447 -18788 1748773
35276 1748773 5869383 11206051 14657857 14022387 10053814 5885422 4469738 6127689
35268 6127689 8293864 8014471 4951129 1458245 -501551 -1548297 -3208280 -5068496
35260 -5068496 -5227169 -3287403 -1068289 99641 1105784 3048266 4795231 4173721
35252 4173721 1198716 -1389443 -1172770 1230121 3006816 2310551 60598 -1495900
35244 -1495900 -1675885 -2129906 -4206217 -6088677 -3985008 3168753 11171213 13974964
35236 13974964 9583063 1744282 -4140169 -5894258 -5249486 -4882531 -5898560 -7867001
35228g867001k005455q59823J648587M300619M473655J124003k782756k960848
35220d929019O63203L247864J123664l310140m797465j980227J622288K755223
35212e604609J717215L53052m11052p1527J912260M495941M855265J640978k826123
35203F061400n208017m861716l412288j970756p27290j67527l29094M03195L114236
35194g097857N352147L452815j610334l999449l82658N170379O280402K423719
35186I589164j194817j207312L7682r44284l277615l193220K02145L161625J890463
35177E063831k479683m796052j821816L648180N642865K010970k782126k976314
35169A509855J341098M469036K501707j874817l308042o33022K430455K569364
$$ plain form
35228 -7867001 -9872456 -10732279 -9083692 -4783073 -309418 814585 -1968171 -4929019
35220 -4929019 -4265816 -1017952 105712 -3204428 -8001893 -9982120 -8359832 -5604609
35212 -5604609 -3887394 -3534342 -3945394 -4016921 -2104661 2391280 7246545 8887523 6061400
35203 6061400 853383 -4008333 -7420621 -9391377 -10118667 -10286194 -10615288 -10212093 -7097857
35194 -7097857 -1745710 1707105 96771 -3902678 -4285336 885043 7165445 9589164
35186 9589164 8394347 7187035 7224717 6280433 3002818 -190402 11743 3173368 5063831
35177 5063831 2584148 -2211904 -4033720 -385540 5257325 7268295 4486169 1509855
35169 1509855 2850953 7319989 9821696 7946879 4638837 4005815 6436270 9005634
35161I005634L16978k026879l584091m753128n308704m290392j531070J702329
35153a0469323L682473L538942J864921K52190j28267L48145M52069j32941n33702
35144a125493k76785m2587l20161m39711J38839N02385n36679k456303l413595
35135g970090k441935l45151J432418K042683J538195O56156J65632O7001o4244
35126d919335K26163J907514M051026L611836n25474m797819m896195j543422
35118f885706P52811L80993L57963K583253M160804J768787k997287n492561l760802
35109i131745J2945K754537L128733J777549P11082J564965L028473J542524l553585
35100A835478p506261n700768k95546K256140l44460m019911m494691j797696
$$ plain form
35161 9005634 9322612 7295733 3711642 -1041486 -6350190 -10640582 -12171652 -10469323
35153 -10469323 -6786850 -3247908 -1382987 -1130797 -1259064 -910919 -458850 -591791 -1125493
35144 -1125493 -1402278 -1444865 -1765026 -2204737 -2065898 -1563513 -2100192 -4556495 -7970090
35135 -7970090 -10412025 -10757176 -9324758 -7282075 -5743880 -5087724 -4922092 -4855091 -4919335
35126 -4919335 -4693172 -2785658 1265368 4877204 4351730 -446089 -5342284 -6885706
35118 -6885706 -6132895 -5751902 -5393939 -2810686 1350118 3118905 121618 -5370943 -9131745
35109 -9131745 -9118800 -6364263 -3235530 -1457981 -746899 818066 3846539 5389063 1835478
35100 1835478 -5670783 -11371551 -11667097 -9410957 -9755417 -13775328 -18270019 -20067715
35092b0067715K021257N685167P712885O311867K445346K6883P78772J676341
35084F590803n1920k319268j798929M06104P07558j020013j734471o99526l56361
35075b76023j650634k508972j662540l83865N36257K085338L996224L754807N36567
35066D427159k635454k739021n15931J445931K122115J632958j98737k527752
35058A011268k864429l88019J948432J319886p14828q34518P64189J131309m76265
35049H97025j957692k085766j426490m0014K184798L348846J677649l42664J456459
35040C712151N741758O226645J025341l841060l274394m76097j086756l970031
35032D057557l553113Q55791M124678L310396J203137R27354J445245K51268k555544
$$ plain form
35092 -20067715 -18046458 -12361291 -4648406 1663461 4108807 4135690 4914462 6590803
35084 6590803 6538883 4219615 2420686 2826790 3534348 2514335 779864 80338 -276023
35075 -276023 -1926657 -4435629 -6098169 -6482034 -5945777 -3860439 135785 3890592 4427159
35066 4427159 1791705 -947316 -1463247 -17316 2104799 3737757 3539020 1011268
35058 1011268 -1853161 -2241180 -292748 1027138 312310 -522208 241981 1373290 897025
35049 897025 -1060667 -3146433 -4572923 -4612937 -2428139 920707 2598356 2255692 3712151
35040 3712151 9453909 15680554 16705895 12864835 9590441 9114344 8027588 4057557
35032 4057557 504444 1360235 5484913 8795309 9998446 10925800 12371045 12622313 10066769
35023A0066769m769548m769688k620882j7753N65375j438334k868802k61172M673665
35014a440370O147989J965634l098726l572169j31792K559871K651001K125453
35006G206891J974836L46015l520135o555002n320706q70484K131997J076534
34998c530054j732256k650756j493579q95443j652952j400026J327041M229402
34990g798623M378409K435305J318854J818973K208307J543281N22924o46999
34982E780431k301625l263096j921860L51100M22248j225311m22786L600797N418095
34973F437993J075078n012370n499243l76020L334397J651740j600042j248452
34965a236919K114599L895643J976922j189852k250187q54451M46592l82205k170622
$$ plain form
35023 10066769 5297221 527533 -2093349 -2111102 -1545727 -2984061 -5852863 -6114035 -1440370
35014 -1440370 4707619 6673253 3574527 2358 -129434 2430437 5081438 7206891
35006 7206891 9181727 9527742 6007607 -547395 -5868101 -6738585 -4606588 -3530054
34998 -3530054 -5262310 -7913066 -9406645 -10302088 -11955040 -13355066 -12028025 -7798623
34990 -7798623 -3420214 -984909 333945 2152918 4361225 5904506 6427430 5780431
34982 5780431 3478806 215710 -1706150 -1355050 -932802 -2158113 -2580899 1019898 6437993
34973 6437993 7513071 2500701 -2998542 -3374562 -40165 1611575 11533 -1236919
34965 -1236919 877680 4773323 6750245 5560393 3310206 2455755 2902347 2520142 349520
34956C49520k013588N92977K639612J616721r84176j999304j040976j04133L81457
34947e61890J945068M394701M941395K239424j171627k171692j065971m46567
34939H102841j233225j919454j488038j148315k338142m006611l336409M99701
34931f867652M527436N230604K918170Q38897K07771r08851k950567k821470R12711
34922A087049M129475K521722j531849k454226l48263m40655l702689m590037
34914e329473j33306M769832M710118J419582l84507p07149k423314m523025l284278
34905e885520P70409K832109J155477n21524P75186K839330K281285k26229j362581
34896B657942o5807J368240N29095k249376m239934l132940K73314K544954J546543
$$ plain form
34956 349520 -1664068 -1071091 1568521 3185242 2201066 201762 -839214 -943347 -561890
34947 -561890 1383178 5777879 10719274 12958698 11787071 9615379 8549408 8102841
34939 8102841 6869616 4950162 3462124 2313809 -24333 -4030944 -7367353 -6867652
34931 -6867652 -2340216 2890388 5808558 6647455 6855226 5946375 2995808 174338 1087049
34922 1087049 5216524 7738246 6206397 3752171 3403908 2963253 -739436 -5329473
34914 -5329473 -5462779 -692947 4017171 5436753 5052246 4345097 1921783 -2601242 -5885520
34905 -5885520 -5115111 -2283002 -1127525 -1649049 -873863 1965467 4246752 4020523 2657942
34896 2657942 2592135 3960375 4489470 2240094 -1999840 -5132780 -4859466 -2314512 -767969
34887g67969q38420j395021j58168J08515j234353j511659O17254K359915Q31357
34878a988549k311873l110832r76172R18805O64465l0223O61896J534216O25260
34869d013007j088286q27244J668405L456104K485381K16477r38818r25818j086522
34860a053328j327150n50715P62861R02535j31346m11672P24134J541984Q20023
34851A277326k45911k67349Q9891l89030j167382p45331J156425L284048L890493
34842F883180J707799k595576n666205m488812p46413P77187q64963j280296J759265
34833d514834L784153N69919m243947l967628J130500M626580L535628R82615
34825A902986m44207j744780l045022k085610Q76586J842038q60495l705951l522563
$$ plain form
34887 -767969 -1606389 -3001410 -3159578 -3051063 -4285416 -5797075 -5179821 -2819906 -1988549
34878 -1988549 -4300422 -7411254 -8387426 -7468621 -6804156 -6834379 -6172483 -4638267 -4013007
34869 -4013007 -5101293 -5928537 -4260132 -804028 1681353 1897830 959012 33194 -1053328
34860 -1053328 -2380478 -2931193 -2168332 -1265797 -1397143 -1808815 -1084681 457303 1277326
34851 1277326 1031415 764066 853957 464927 -702455 -1447786 -291361 2992687 6883180
34842 6883180 8590979 5995403 329198 -4159614 -4906027 -4128840 -4993803 -6274099 -4514834
34833 -4514834 -730681 -160762 -4404709 -8372337 -7241837 -2615257 920371 1902986
34825 1902986 1458779 -286001 -3331023 -5416633 -4540047 -2698009 -3558504 -7264455 -10787018
34816a0787018j758487q10684j44720J252607K270245K230690K592483L602202
34808a552682K859791k49151k534310k090980j266881j619296o02399K996470
34800d059438N253246L444902J364768K698874L819089N7438m968511m478092
34792C132276o5230Q57766k378846l159424M11902K569008N70004r06470Q94598
34783A925584J634908j593495m090151j200050L900942N471847L294572M82295
34775I826452k144588m459128m198115r38944J104606o26632k124766L06074K755311
34766d99730J09150m129459k571320L788602O636191L116741p63657l30809J860601
34757G216310K202676J248603K17885j660382l458525j762516L139494N342848
$$ plain form
34816 -10787018 -12545505 -13356189 -13500909 -12248302 -9978057 -7747367 -5154884 -1552682
34808 -1552682 1307109 1057958 -1476352 -3567332 -4834213 -6453509 -7055908 -4059438
34800 -4059438 1193808 4638710 6003478 8702352 12521441 12578879 7610368 3132276
34792 3132276 3067046 3924812 1545966 -1613458 -1201556 1367452 1937456 1030986 1925584
34783 1925584 3560492 1966997 -2123154 -3323204 577738 6049585 9344157 9826452
34775 9826452 7681864 3222736 -975379 -1914323 -809717 -1436349 -3561115 -3255041 -499730
34766 -499730 -390580 -4520039 -7091359 -3302757 3333434 6450175 5686518 5355709 7216310
34757 7216310 9418986 10667589 10885474 9225092 5766567 4004051 7143545 12486393
34749A2486393J450533l683855l564284R91647L847605K029520j940233m510810
34741G106516m197288j373771J841893K404084l19158k991938k349079N50122
34733F71381K414694K394287J818020Q10680j332819l160129k079368J460233
34725B996979L867459L047487O64624p54242o90902O6325R46485J486696J198944
34716A2829855L61331q9157J65049N96881Q67812R26719K38345j662790l890201
34707A0343844m923769m567638l738884k549174m53138J756305K276571J019510
34699h36373l9257K20913P94411P41810M59692O1759j037378j901192k56232L382840
34689A590993M644733R33297m316309o071580m241769k198867p47811J723766
$$ plain form
34749 12486393 13936926 10253071 6688787 7680434 11528039 13557559 11617326 7106516
34741 7106516 2909228 1535457 3377350 5781434 5462276 2470338 121259 671381
34733 671381 3086075 5480362 7298382 8109062 6776243 3616114 1536746 2996979
34725 2996979 6864438 9911925 10576549 9822307 9131405 9197730 10144215 11630911 12829855
34716 12829855 13191186 13102029 13267078 13863959 14731771 15658490 15896835 14234045 10343844
34707 10343844 5420075 852437 -2886447 -5435621 -5888759 -4132454 -1855883 -836373
34699 -836373 -875630 -654717 139694 881504 1341196 1402955 365577 -1535615 -1791847 1590993
34689 1590993 6235726 7169023 2852714 -3218866 -7460635 -9659502 -10407313 -8683547
34681h683547M044908K755042j410362k820097J026600N223858M305770j72568
34673D269604k492777n79724K790737M683893M174122J198527l003781n117011
34665E923590k972628R12957K276049R58403K84612J159775J026726r99245k304905
34656F265334j292855J35405J70083l19786m50947j143083k332498j748053J160272
34647D43872L150478J658759j395079k851366k662176k353205j938689j296391
34639g243797j802678l394178k917896R52249M158019K874376k50550m38654J429608
34630f633501J317149M0789J714107N254265N141585J067730r12700J432034K760140
34621A1181598l83182l471282j781902J702990J456566k083881m512520m479895
$$ plain form
34681 -8683547 -4638639 -1883597 -3293959 -6114056 -5087456 136402 4442172 4269604
34673 4269604 1776827 1197103 3987840 8671733 12845855 14044382 11040601 5923590
34665 5923590 2950962 3863919 6139968 7098371 7382983 8542758 9569484 8570239 6265334
34656 6265334 4972479 5107884 5277967 4958181 4507234 3364151 1031653 -716400 443872
34647 443872 3594350 5253109 3858030 1006664 -1655512 -4008717 -5947406 -7243797
34639 -7243797 -9046475 -12440653 -15358549 -14406300 -10248281 -7373905 -7624455 -8063109 -6633501
34630 -6633501 -5316352 -5275563 -3561456 1692809 6834394 7902124 6989424 8421458 11181598
34621 11181598 10798416 7327134 5545232 7248222 8704788 6620907 2108387 -2371508
34613b371508l611076k200970Q8111J422802K72175j137903j6794K157047K070562
34604c327554P2257q71328o4600J160973K903945N562634O721462L778404j270188
34595A4666005m033467l761140k820214j378348K187101O084039N883027J149172
34587A7976175l572276n251006n326999n349110m375248k167903o71147n44678
34579i282192M5605J657201K242151J026938M4346L32624L41175m05580n1957
34570d049689J480886J404478p38830j225197J628036L767407J669917j605638
34562B331370j154564K037702L083765R39317r12841p00813n66612k216719m088584
34553a247979l803308j143203K003960L322276J930087l53883n45230J606483
$$ plain form
34613 -2371508 -5982584 -8183554 -8095443 -6672641 -6400466 -7538369 -7555163 -5398116 -3327554
34604 -3327554 -3255297 -4126625 -4191225 -3030252 -126307 5436327 12157789 15936193 14666005
34595 14666005 10632538 6871398 4051184 2672836 4859937 10943976 16827003 17976175
34587 17976175 14403899 9152893 3825894 -1523216 -5898464 -8066367 -8737514 -9282192
34579 -9282192 -9236587 -7579386 -5337235 -4310297 -4265951 -3933327 -3592152 -3997732 -4049689
34570 -4049689 -2568803 -1164325 -1903155 -3128352 -1500316 2267091 3937008 2331370
34562 2331370 1176806 3214508 6298273 7237590 6324749 5623936 5057324 2840605 -1247979
34553 -1247979 -5051287 -6194490 -4190530 -868254 1061833 707950 162720 1769203
34545A769203K810863P31591k673088m132163l241883j464905P16105K872113
34537b612164L095901O92873j467187p19769J062027N76772j297124j255779O26971
34528a297479J659165J980375L869679N977132M087010j538344n167795l645832
34520E923911m14016M88687m41475j494668l340333n913928n930180j570494L475919
34511i216577M579488K251711J16744n54048m54973J021383M189307O122035M012301
34502A2067371K47035n33727J438117J733256r00702l042897k891882k756963
34494E359608l818493l407031K9997L477035L843145K451209J915971J586560
34486A1438001l72769k750008k893266j002498N95675J181368J426361P84945
$$ plain form
34545 1769203 4580066 5311657 2638569 -1493594 -4735477 -6200382 -5484277 -2612164
34537 -2612164 483737 1176610 -290577 -1010346 51681 628453 -668671 -1924450 -1297479
34528 -1297479 361686 2342061 6211740 12188872 16275882 14737538 9569743 5923911
34520 5923911 5509895 5998582 5557107 4062439 722106 -5191822 -11122002 -12692496 -9216577
34511 -9216577 -4637089 -2385378 -2268634 -2822682 -3277655 -2256272 1933035 8055070 12067371
34502 12067371 12314406 11780679 13218796 14952052 14051350 11008453 8116571 5359608
34494 5359608 1541115 -1865916 -1835919 1641116 5484261 7935470 9851441 11438001
34486 11438001 11065232 8315224 5421958 4419460 5015135 6196503 7622864 8407809
34478H407809j358512k999034j807509N37768L75256j844219j911724J235022
34470F34857L537238K063920j094815l040789l943565m256422k294273J956253
34462f437596M309002J909441j568524q68729K892691M163813J365481j850093
34454C915486l057949l431999l496562j806466J033655J878198K37668m00235
34446e128204J587810K935918P58133k833464m132132k722781k96330K337209
34438g493841M099705K479355k888357p598723p006201k016833K549078L918083
34430a3957734K968619J560590J205298K868375N184295M501750k00760m257335
34422a26902k857080J880979L593261N29380k786725k694471p67756j72347j363796
$$ plain form
34478 8407809 7049297 4050263 2242754 2780522 3155778 1311559 -600165 634857
34470 634857 4172095 6236015 5141200 2100411 -1843154 -6099576 -8393849 -6437596
34462 -6437596 -2128594 -219153 -1787677 -2656406 236285 4400098 5765579 3915486
34454 3915486 857537 -2574462 -6071024 -7877490 -6843835 -4965637 -4727969 -5128204
34446 -5128204 -3540394 -604476 153657 -2679807 -6811939 -9534720 -9831050 -7493841
34438 -7493841 -3394136 -914781 -3803138 -11401861 -18408062 -20424895 -17875817 -13957734
34430 -13957734 -10989115 -9428525 -8223227 -5354852 -170557 4331193 4130433 -126902
34422 -126902 -2983982 -1103003 2490258 3019638 232913 -2461558 -3229314 -3401661 -4765457
34413d765457k746508k903054j171223J805815L689175K767429O19675Q0197R83424
34404a640527Q69965n39744j159732p23782j130038k117502q57224K880293N227553
34395H09262L769354R77301k7745J67470m58840j684521k268024k487771k985894
34386d189408l050790k159987j295753r17425J69740K126944K819391J384815
34378e112473L80311J695052K833266N07533l967720o265245m792815j767788
34370a6489879N00517J532786J590096J237171J492387K435901K543729J122380
34362d034912j23631L1327j10878k052204l581477j834315J736992L335079K621469
34353d012550K389302L169094K749290J074200P85661J951984J059290k750757
$$ plain form
34413 -4765457 -7511965 -10415019 -11586242 -9780427 -6091252 -3323823 -2704148 -2623951 -1640527
34404 -1640527 -770562 -1310306 -2470038 -3193820 -4323858 -6441360 -7298584 -4418291 809262
34395 809262 4578616 5555917 5528172 5695642 5236802 3552281 1284257 -1203514 -4189408
34386 -4189408 -7240198 -9400185 -10695938 -11613363 -11443623 -9316679 -6497288 -5112473
34378 -5112473 -4732162 -3037110 -203844 303689 -3664031 -9929276 -14722091 -16489879
34370 -16489879 -15989362 -14456576 -12866480 -11629309 -10136922 -7701021 -5157292 -4034912
34362 -4034912 -4158543 -4127216 -4238094 -6290298 -9871775 -11706090 -9969098 -6634019 -4012550
34353 -4012550 -1623248 1545846 4295136 5369336 6154997 8106981 9166271 6415514
34345F415514m865889j798837K767658K504669k779188o823139n071848J59718
34337i491342L486518L064287J683392K098367L244314K200559r86851k708627
34329B590617q79074J544306M34178l411334n117349k488045J268370K364921
34321c693410J123628K94776R12286J773925J713040O83505o35453j239547o73689
34312B59061j12561j116234k629539j402033L060440O286136M264757n63047k204663
34303E842317N93219K786449M93498l588804m251043n97114L823444N958281N436521
34294A6496768K847469r57592l881329l909193k078637j513753k750447k929674
34286A323612r20644J36496k028058m249399k364291K023426L945736L000316
$$ plain form
34345 6415514 1549625 -249212 2518446 5023115 2243927 -4579212 -9651060 -9491342
34337 -9491342 -6004824 -2940537 -1257145 841222 4085536 6286095 5299244 2590617
34329 2590617 1711543 3255849 3690027 278693 -4838656 -7326701 -6058331 -3693410
34321 -3693410 -2569782 -2275006 -1362720 411205 2124245 2807750 2172297 932750 259061
34312 259061 146500 -969734 -3599273 -5001306 -1940866 4345270 8610027 8046980 5842317
34303 5842317 6435536 9221985 9715483 6126679 1875636 1278522 5101966 11060247 16496768
34294 16496768 19344237 18386645 14505316 10596123 8517486 7003733 4253286 1323612
34286 1323612 402968 539464 -1488594 -5737993 -8102284 -6078858 -2133122 867194
34278H67194L371161N816150N678022R19441l488774k926837l48723j287496m766990
34269C833148m820041J43096M823880M296145l30313m413557m845029j762261
34261c074932K219923L637171J108747k678386l601185j002621J717480J487247
34253a86556j272514l954092m383344j995613J751092L869780K471720p74105
34245d473632k288264q27547J397475J927354Q17109j42959J81829R97991L29525
34236b081119k466267m843024l497104O53552K653437M73788j442929J183606
34228i366060N484568N856686K942892K127518M095688L751617o13315l754488
34220A0525106j582589K760649M182493K379145j76482k915307n907544p124675
$$ plain form
34278 867194 4238355 10054505 15732527 16651968 13163194 10236357 9887634 8600138 3833148
34269 3833148 -986893 -843797 3980083 8276228 7945915 3532358 -1312671 -3074932
34261 -3074932 -855009 2782162 3890909 1212523 -2388662 -3391283 -1673803 -186556
34253 -186556 -1459070 -5413162 -9796506 -11792119 -10041027 -6171247 -3699527 -4473632
34245 -4473632 -6761896 -7589443 -6191968 -4264614 -3447505 -3590464 -3408635 -2410644 -2081119
34236 -2081119 -4547386 -9390410 -12887514 -12233962 -9580525 -9106737 -10549666 -9366060
34228 -9366060 -3881492 1975194 4918086 7045604 11141292 14892909 14279594 10525106
34220 10525106 8942517 11703166 15885659 18264804 18088322 15173015 9265471 2140796
34212B140796n058910j935210q06391j216672p35955J024518K749506L904826
34204F6508M177814K449461q54076k525157q62010Q65907j151910n118745n986353
34195h938561k869811J96864O77326M49050J530843K631186J734340l77475j251181
34186f217419k27833R04254N19993o46282m98641J413743K968487K429824J123403
34177A769529J164958J582878m7508k447466j462356K886427M816734P90565m999374
34168D054387o478531l457027K15645K897322N000175N292970K511313q95307
34160I140947j447033N0747L36327m72432K28024J807317R99339j926301k960326
34151E756609r08433Q61345K26796q52613o80945o28784j869053l106966l244349
$$ plain form
34212 2140796 -2918114 -4853324 -5659715 -6876387 -7612342 -6587824 -3838318 66508
34204 66508 4244322 6693783 5839707 3314550 2452540 3318447 2166537 -2952208 -8938561
34195 -8938561 -11808372 -11611508 -10934182 -10485132 -8954289 -6323103 -4588763 -4966238 -6217419
34186 -6217419 -6445252 -5540998 -5021005 -5667287 -6165928 -4752185 -1783698 646126 1769529
34177 1769529 2934487 4517365 4469857 2022391 560035 3446462 8263196 9053761 4054387
34168 4054387 -2424144 -5881171 -5665526 -2768204 2231971 7524941 10036254 9140947
34160 9140947 7693914 7744661 8080988 7608556 7836580 9643897 10643236 8716935 5756609
34151 5756609 4848176 5709521 5936317 5083704 4402759 3773975 1904922 -1202044 -4446393
34142d446393k944945k228521N6247L156900M441534L759461L945748N523165
34134A1263196N056838Q72652l608345m848689l879405l228951k607736p82227
34126a762667J236243K047083K267605K214729J78397l726679n212918j540553
34118d298760L130677L033146n20043j252730K142272M131617J206686k844314
34110D728551k885035M54801K640562J491523j472525m217337n678038m790724
34102i728222r81474L847245N908943L392322j149257l363239j722302J314302
34094b481682K546106J264488j001541k623712k792842j332230R92459K441474
34086b987480J855392m1292j849266l276544m465674m568218k870634n24772R99258
$$ plain form
34142 -4446393 -7391338 -9619859 -9563612 -6406712 -1965178 1794283 5740031 11263196
34134 11263196 16320034 17192686 13584341 8735652 4856247 1627296 -980440 -1762667
34126 -1762667 -526424 1520659 3788264 6002993 6181390 2454711 -2758207 -4298760
34118 -4298760 -1168083 1865063 1345020 92290 2234562 6366179 7572865 4728551
34110 4728551 1843516 2298317 4938879 6430402 4957877 740540 -4937498 -9728222
34102 -9728222 -10709696 -6862451 -953508 2438814 1289557 -2073682 -3795984 -2481682
34094 -2481682 64424 1328912 327371 -2296341 -5089183 -6421413 -5428954 -2987480
34086 -2987480 -1132088 -1173380 -3022646 -6299190 -10764864 -15333082 -18203716 -18728488 -17729230
34077a7729230K368499M711336O346888M666653J071161l8807K030668K757771
34069F184939o15604m502130m124244k22067K520189J680285j157403l345482
34061c581517l339062j086750J728847K885850K309492J968501K264377J174239
34053D323977j725813l675448l129501k171412k061389n21458K991561L783911
34045b185572j059181n939125l623701L648729P236795M891558K475908K815266
34037H260677J522923l546548o742746l248112K830025M464273J401881j589540
34029C352833k672813l339412l228929o30629K696988K881863L94384O6347L538967
34020C059599O314697M485374N44228o69610P84901O18861k658804n217382l401898
$$ plain form
34077 -17729230 -15360731 -10649395 -4302507 364146 1435307 1396500 3427168 6184939
34069 6184939 5569335 1067205 -3057039 -3279106 -758917 921368 -236035 -3581517
34061 -3581517 -6920579 -8007329 -6278482 -3392632 -1083140 885361 3149738 4323977
34053 4323977 2598164 -1077284 -4206785 -6378197 -8439586 -8961044 -5969483 -2185572
34045 -2185572 -3244753 -9183878 -12807579 -9158850 -1922055 2969503 5445411 8260677
34037 8260677 9783600 6237052 -505694 -3753806 -923781 3540492 4942373 3352833
34029 3352833 680020 -2659392 -5888321 -6518950 -3821962 -940099 -545715 -479368 3059599
34020 3059599 9374296 13859670 14403898 13734288 14519189 15138050 12479246 7261864 3859966
34011C859966J003724L132977J341817j292459j752244r77775j686461l887982
34003b58437m717099k465701J165140L404192L596069L091755K808498K115039
33995H739456J51600k563071m333245l930659j681141J029897K746154K278702
33987B437693p91280m808337o270473l452265N82748J186669j500594k595231
33979a5211070J17738K632982J092368j923550j490647J912785L682072K639316
33971f548006J911451K525568J729011j172837k515537j12216K884679K748857
33963A450970L35077j462258k399063l771009m910376m141945j795630N46507
33955a6147727K554488M444905N183545L982909K350111K048320K181947R81275
$$ plain form
34011 3859966 4863690 7996667 9338484 8046025 6293781 5316006 3629545 -258437
34003 -258437 -4975536 -7441237 -6276097 -2871905 724164 3815919 6624417 8739456
33995 8739456 8891056 6327985 1994740 -1935919 -3617060 -2587163 158991 2437693
33987 2437693 1646413 -3161924 -9432397 -12884662 -12301914 -11115245 -12615839 -15211070
33979 -15211070 -15093332 -12460350 -11367982 -13291532 -14782179 -12869394 -9187322 -6548006
33971 -6548006 -4636555 -2110987 -381976 -1554813 -4070350 -4182566 -1297887 1450970
33963 1450970 1786047 323789 -2075274 -5846283 -10756659 -14898604 -16694234 -16147727
33955 -16147727 -13593239 -9148334 -3964789 18120 2368231 4416551 6598498 7579773
33947G579773o84642o63368M04149k07495k540990l257712n30303L123519M155228
33938G378159K111217p76184k497263k482080j097748P19801J810013J660547
33930F826462Q01776K6302m91741j148327k292720l730498m657828m252067k540336
33921a1458977m40213J143318J823040J462846L83852r4603J304349L755509M759098
33912B638219L324016J196249J21171k51135n75474j16028J311862J794805J37967
33903I581652j565130r19726Q57467J116031K66093L49265M66481j735689m583899
33894C832545l726308L95968K008222j101551l586503q01248L764893L993406
33886D779424M64036j235336N62577K061180P51100j595905l061740l950551m016131
$$ plain form
33947 7579773 6895131 6231763 6635912 6428417 3887427 629715 99412 3222931 7378159
33938 7378159 9489376 8713192 6215929 3733849 2636101 3355902 5165915 6826462
33930 6826462 7628238 7654540 7162799 6014472 3721752 -8746 -4666574 -8918641 -11458977
33921 -11458977 -11899190 -10755872 -8932832 -7469986 -7086134 -7180737 -5876388 -2120879 2638219
33912 2638219 5962235 7158484 7279655 7028520 6453046 6337018 7648880 9443685 9581652
33903 9581652 8016522 7096796 7954263 9070294 9336387 9685652 10152133 8416444 3832545
33894 3832545 106237 502205 2510427 1408876 -2177627 -2978875 786018 4779424
33886 4779424 5243460 4008124 4570701 6631881 7382981 5787076 2725336 -1225215 -5241346
33877e241346j728220K007950L363830J120181p65312J003115L572356J942756
33869E275310l377546o739427m908431o13692J914163J789026O19696o21687j844526
33860h507114k322155j043953J596919L823518M301249L167203J308837n45155
33852A779349j850131k103626j182695M35873K091113L325550L593487K075086
33844H164006j325136m752529n316842k162758J921710L088366N29421k977989
33836b831751m471573l427113r37052J855667L603721K889652K80596j070293
33828d108146R10451L773378L357642k17957k378521n81298K076986J564015j269906
33819C126644k350385m94403J241243K83570k057314k826543j275625Q21627J831302
$$ plain form
33877 -5241346 -6969566 -4961616 -1597786 -477605 -1242917 -239802 3332554 5275310
33869 5275310 1897764 -4841663 -9750094 -10363786 -8449623 -6660597 -6040901 -6662588 -8507114
33860 -8507114 -10829269 -11873222 -10276303 -6452785 -2151536 1015667 2324504 1779349
33852 1779349 -70782 -2174408 -3357103 -2921230 -830117 2495433 6088920 8164006
33844 8164006 6838870 2086341 -3230501 -5393259 -3471549 -383183 146238 -2831751
33836 -2831751 -7303324 -10730437 -11667489 -9811822 -6208101 -3318449 -3037853 -4108146
33828 -4108146 -3197695 575683 3933325 3715368 1336847 755549 2832535 4396550 3126644
33819 3126644 776259 281856 1523099 1806669 -250645 -3077188 -4352813 -3531186 -1699884
33810a699884J932932K077245K153611J090059j063276k230200q11208J435489
33802B884768J085651k062953m190183k742414p8786L11424r42983p47414R81931
33793e500959J316538m30684j288080O44476L299881L943875K779676J647090
33785F411813J246488J243678J317173O72657j656001m612398n236531k662322
33777c275443Q4639L60397j58708J414397L983789M074828J768783Q49895K485154
33768A1587731K802568j147826o080219o325464j609327K396819J479373k115012
33760I88643l549737k031928p91264j224939p05020K352205M446483J485729m228066
33751c257894n900946j549685K905723J957325j712475j398884L767387P522219
$$ plain form
33810 -1699884 233048 2310293 4463904 5553963 4490687 2260487 1449279 2884768
33802 2884768 3970419 1907466 -2282717 -5025131 -5103917 -4792493 -5735476 -6482890 -5500959
33793 -5500959 -4184421 -4615105 -5903185 -5258709 -1958828 1985047 4764723 6411813
33785 6411813 7658301 8901979 10219152 10891809 9235808 4623410 -613121 -3275443
33777 -3275443 -3190804 -2830407 -2989115 -1574718 2409071 6483899 8252682 9102577 11587731
33768 11587731 14390299 13242473 7162254 836790 -772537 1624282 3103655 988643
33760 988643 -2561094 -4593022 -5384286 -6609225 -7314245 -4962040 -515557 970172 -3257894
33751 -3257894 -9158840 -10708525 -7802802 -5845477 -7557952 -8956836 -5189449 2332770
33743B332770N065633p63254l467595q27006L173222L618772J21436l522411m194519
33734A537048k580619j084745k42655R63055K153605J652481l60899j639533j491923
33725a094185j617254k220427q02899L070891N395131L352121J76853L03781K259288
33716H823300J359783k221800l730288j727197j9819r73805k257333j851704j388156
33707c987019k174148k248160k35404J581373J147587L51115J493586K890365
33699a180705J802885l80583l5266K763002M171350K248403p04962j795581p86676
33690F101867P94470J525453N21061k007994l939934k748005J160274L906595
33682E313787K268486k201087m547005k228052J596784J930759j436784l582212
$$ plain form
33743 2332770 7398403 6635149 3167554 2340548 5513770 9132542 9253978 5731567 1537048
33734 1537048 -1043571 -2128316 -2370971 -1407916 745689 2398170 2037271 397738 -1094185
33725 -1094185 -2711439 -4931866 -5734765 -2663874 2731257 6083378 6260231 6564012 8823300
33716 8823300 10183083 7961283 4230995 2503798 2483979 1510174 -747159 -2598863 -3987019
33707 -3987019 -6161167 -8409327 -8644731 -7063358 -5915771 -5564656 -4071070 -1180705
33699 -1180705 622180 241597 206331 2969333 7140683 9389086 8684124 6888543 6101867
33690 6101867 6896337 8421790 8942851 6934857 2994923 246918 1407192 5313787
33682 5313787 7582273 5381186 834181 -1393871 202913 2133672 696888 -2885324
33674b885324j593026R56171l86294l358831j974422L623605O273848K246253
33666B901980l243857m202698k262203k107136k853348m11691L990632M730523
33658c457798R52133j740575M2527K832622K538655M86079J63730J538618J984592
33649E340583O36701j070228j786136j128014M49916J242268m40538l267241l512832
$$ plain form
33674 -2885324 -4478350 -3522179 -3908473 -7267304 -9241726 -5618121 655727 2901980
33666 2901980 -341877 -4544575 -6806778 -8913914 -11767262 -12178953 -8188321 -3457798
33658 -3457798 -2505665 -4246240 -4203713 -1371091 1167564 1653643 1817373 3355991 5340583
33649 5340583 5977284 4907056 3120920 1992906 2442822 3685090 3244552 -22689 -3535521
$$ [...]
##END NTUPLES=NMR SPECTRUM
##END=
