##TITLE=1H_LY-DMAA.Per.2
 CDCl3
 8 sc, 
 7.02.2022
##JCAMPDX= 6.0         $$ Bruker NMR JCAMP-DX V2.0
##DATA TYPE= NMR FID
##DATA CLASS= NTUPLES
##ORIGIN= UXNMR, Bruker Analytische Messtechnik GmbH
##OWNER= root
$$ XWIN-NMR		Version 3.5
$$ Mon Feb  7 11:56:24 2022 Russian Standard Time (UT+4h)  she@DPX200
##.OBSERVE FREQUENCY= 200.131346
##.OBSERVE NUCLEUS= ^1H
##.DELAY= (6, 6)
##.ACQUISITION MODE= SIMULTANEOUS
##.ACQUISITION SCHEME= undefined
##.AVERAGES= 8
##.DIGITISER RES= 18
##SPECTROMETER/DATA SYSTEM= spect
##.PULSE SEQUENCE= zg30
##.SOLVENT NAME= CDCl3
##.SHIFT REFERENCE= (INTERNAL, CDCl3, 0, 15.7039)
##AUDIT TRAIL= $$ (NUMBER, WHEN, WHO, WHERE, WHAT)
$$ ##TITLE= Audit trail, XWIN-NMR		Version 3.5
$$ ##JCAMPDX= 5.01
$$ ##ORIGIN= Bruker BioSpin GmbH
$$ ##OWNER= she
$$ F:/spectra/data/she/nmr/H-F/1/audita.txt
$$ ##AUDIT TRAIL=  $$ (NUMBER, WHEN, WHO, WHERE, WHAT)
(   1,<2022-02-07 11:53:21.06 +0400>,<she>,<DPX200>,
      <created by zg, POWCHK disabled, PULCHK disabled
       configuration hash MD5:
       00 E9 B6 7A A2 85 ED C7 34 08 36 98 17 FE 4E 26
       data hash MD5: 16K
       BD BB A6 93 BB 6D 7E 75 D1 09 42 B1 65 85 29 BB>)
$$ ##END=
$$ 
$$ hash MD5
$$ 0E 94 E1 68 18 6E 8C 6E 7D B6 B0 4D 5A 68 EB E6
##$RELAX= 
##$RELAX= 
##$RELAX= 
##$RELAX= 
##$RELAX= 
##$RELAX= 
$$ Bruker specific parameters
$$ --------------------------
##$DU= <F:/spectra>
##$EXPNO= 1
##$NAME= <H-F>
##$PROCNO= 1
##$TYPE= <nmr>
##$USER= <she>
##$AMP= (0..31)
100 100 100 100 100 100 100 100 100 100 100 100 100 100 100 100 100 100 
100 100 100 100 100 100 100 100 100 100 100 100 100 100 
##$AQSEQ= 0
##$AQ_mod= 1
##$AUNM= <au_zg>
##$AUTOPOS= <>
##$BF1= 200.13
##$BF2= 200.13
##$BF3= 200.13
##$BF4= 200.13
##$BF5= 200.13
##$BF6= 200.13
##$BF7= 200.13
##$BF8= 200.13
##$BYTORDA= 1
##$CFDGTYP= 0
##$CFRGTYP= 5
##$CHEMSTR= <none>
##$CNST= (0..31)
1 1 145 1 1 1 1 1 1 1 1 1 1 1 1 1 1 1 1 1 1 1 1 1 1 1 1 1 1 1 1 1 
##$CPDPRG= <>
##$CPDPRG1= <>
##$CPDPRG2= <>
##$CPDPRG3= <>
##$CPDPRG4= <mlev>
##$CPDPRG5= <mlev>
##$CPDPRG6= <mlev>
##$CPDPRG7= <mlev>
##$CPDPRG8= <mlev>
##$CPDPRGB= <>
##$CPDPRGT= <>
##$D= (0..31)
0 1.2 0 0 0 0 0 0 0 0.06 0 0.03 0 0 0 0 0.0002 0 0 0 0 0 0 0 0 0 0 0 0 
0 0 0 
##$DATE= 1644220400
##$DBL= (0..7)
120 120 120 120 120 120 120 120 
##$DBP= (0..7)
150 150 150 150 150 150 150 150 
##$DBP07= 0
##$DBPNAM0= <>
##$DBPNAM1= <>
##$DBPNAM2= <>
##$DBPNAM3= <>
##$DBPNAM4= <>
##$DBPNAM5= <>
##$DBPNAM6= <>
##$DBPNAM7= <>
##$DBPOAL= (0..7)
0.5 0.5 0.5 0.5 0.5 0.5 0.5 0.5 
##$DBPOFFS= (0..7)
0 0 0 0 0 0 0 0 
##$DE= 6
##$DECBNUC= <off>
##$DECIM= 32
##$DECNUC= <off>
##$DECSTAT= 4
##$DIGMOD= 1
##$DIGTYP= 9
##$DL= (0..7)
0 120 120 120 120 120 120 120 
##$DP= (0..7)
150 150 150 150 150 150 150 150 
##$DP07= 0
##$DPNAME0= <>
##$DPNAME1= <>
##$DPNAME2= <>
##$DPNAME3= <>
##$DPNAME4= <>
##$DPNAME5= <>
##$DPNAME6= <>
##$DPNAME7= <>
##$DPOAL= (0..7)
0.5 0.5 0.5 0.5 0.5 0.5 0.5 0.5 
##$DPOFFS= (0..7)
0 0 0 0 0 0 0 0 
##$DQDMODE= 0
##$DR= 18
##$DS= 0
##$DSLIST= <SSSSSSSSSSSSSSS>
$$ [...]
##$SUBNAM2= <"">
##$SUBNAM3= <"">
##$SUBNAM4= <"">
##$SUBNAM5= <"">
##$SUBNAM6= <"">
##$SUBNAM7= <"">
##$SUBNAM8= <"">
##$SUBNAM9= <"">
##$SW= 18.0517287032376
##$SWIBOX= (0..15)
0 0 2 0 0 0 0 0 0 0 0 0 0 0 0 0 
##$SW_h= 3612.71676300578
##$TD= 16384
##$TD0= 1
##$TE= 0
##$TE2= 300
##$TE3= 300
##$TEG= 300
##$TL= (0..7)
0 120 120 120 120 120 120 120 
##$TP= (0..7)
150 150 150 150 150 150 150 150 
##$TP07= 0
##$TPNAME0= <>
##$TPNAME1= <>
##$TPNAME2= <>
##$TPNAME3= <>
##$TPNAME4= <>
##$TPNAME5= <>
##$TPNAME6= <>
##$TPNAME7= <>
##$TPOAL= (0..7)
0.5 0.5 0.5 0.5 0.5 0.5 0.5 0.5 
##$TPOFFS= (0..7)
0 0 0 0 0 0 0 0 
##$TUNHIN= 0
##$TUNHOUT= 0
##$TUNXOUT= 0
##$USERA1= <user>
##$USERA2= <user>
##$USERA3= <user>
##$USERA4= <user>
##$USERA5= <user>
##$V9= 5
##$VALIST= <valist>
##$VCLIST= <CCCCCCCCCCCCCCC>
##$VD= 0
##$VDLIST= <DDDDDDDDDDDDDDD>
##$VPLIST= <PPPPPPPPPPPPPPP>
##$VTLIST= <TTTTTTTTTTTTTTT>
##$WBST= 1024
##$WBSW= 4
##$XGAIN= (0..3)
0 0 0 0 
##$XL= 0
##$YL= 0
##$YMAX_a= 426803
##$YMIN_a= -367891
##$ZGOPTNS= <>
##$ZL1= 120
##$ZL2= 120
##$ZL3= 120
##$ZL4= 120
##$ABSF1= 10
##$ABSF2= 0
##$ABSG= 5
##$ABSL= 3
##$ALPHA= 0
##$AQORDER= 0
##$ASSFAC= 0
##$ASSFACI= 0
##$ASSFACX= 0
##$ASSWID= 0
##$AUNMP= <proc_1d>
##$AZFE= 0.1
##$AZFW= 0.1
##$BCFW= 1
##$BC_mod= 2
##$BYTORDP= 1
##$COROFFS= 0
##$CY= 11.3945322036743
##$DATMOD= 1
##$DC= 2
##$DFILT= <>
##$DTYPP= 0
##$F1P= 2.36226072786647
##$F2P= -0.459571619588291
##$FCOR= 0.5
##$FTSIZE= 0
##$FT_mod= 4
##$GAMMA= 1
##$GB= 0.15
##$INTBC= 1
##$INTSCL= 1
##$ISEN= 128
##$LB= 0.24
##$LEV0= 0
##$LPBIN= 0
##$MAXI= 10000
##$MC2= 0
##$MEAN= 0
##$ME_mod= 0
##$MI= 1.114404
##$NCOEF= 0
##$NC_proc= 0
##$NLEV= 6
##$NOISF1= 3.799351
##$NOISF2= 2.8
##$NSP= 1
##$NTH_PI= 0
##$NZP= 0
##$OFFSET= 15.70392
##$PC= 1
##$PHC0= -16030.29
##$PHC1= 15.80078
##$PH_mod= 1
##$PKNL= yes
##$PPARMOD= 0
##$PSCAL= 0
##$PSIGN= 0
##$REVERSE= no
##$SF= 200.130013532006
##$SI= 16384
##$SIGF1= 3
##$SIGF2= 2
##$SINO= 400
##$SIOLD= 16384
##$SREGLST= <1H.CDCl3>
##$SSB= 0
##$STSI= 0
##$STSR= 0
##$SW_p= 3612.71676300578
##$SYMM= 0
##$S_DEV= 0
##$TDeff= 0
##$TDoff= 0
##$TI= <>
##$TILT= no
##$TM1= 0
##$TM2= 0
##$TOPLEV= 0
##$USERP1= <user>
##$USERP2= <user>
##$USERP3= <user>
##$USERP4= <user>
##$USERP5= <user>
##$WDW= 1
##$XDIM= 8192
##$YMAX_p= 0
##$YMIN_p= 0
$$ End of Bruker specific parameters
$$ ---------------------------------
##NTUPLES= NMR FID
##VAR_NAME=  TIME,          FID/REAL,        FID/IMAG
##SYMBOL=    X,             R,               I
##VAR_TYPE=  INDEPENDENT,   DEPENDENT,       DEPENDENT
##VAR_FORM=  AFFN,          ASDF,            ASDF
##VAR_DIM=   8192,          8192,            8192
##UNITS=     SECONDS,       ARBITRARY UNITS, ARBITRARY UNITS
##FACTOR=    0.0002768,     1,               1
##FIRST=     0,             0,               0
##LAST=      2.2672688,     0,               0
##MIN=       0,             -367891,         0
##MAX=       2.2672688,     426803,          0
$$ Real data points
##PAGE= N=1
##DATA TABLE= (X++(R..R)), XYDATA
0 0 0 0 0 0 0 0 0 0 0 0 8 -8 8 -8 16 -16 24 -26 32 -40 48 -57 66 -80 96 -112 129 -146 170 -194 225 -257
32 -257 291 -331 371 -419 468 -525 588 -656 730 -810 900 -996 1101 -1218 1344 -1480 1632
49 1632 -1799 1980 -2182 2405 -2655 2933 -3248 3607 -4018 4498 -5063 5743 -6574 7627 -9004
64 -9004 10886 -13627 18011 -26133 46173 -200101 -127738 426803 135865 -302665 -204091 205083
76 205083 186009 -54636 -158901 -65475 71096 183577 25387 -244687 -141129 276721
86 276721 235569 -253831 -310907 206298 341305 -127063 -331269 48030 271662 25351
96 25351 -182241 -73532 66737 94582 49803 -83994 -160438 45980 241730 9468 -290677
107 -290677 -69138 299731 121452 -274131 -154050 219922 162221 -146729 -138772 70546
117 70546 91468 -143 -23450 -52349 -50883 84923 123326 -94878 -181625 85896 217166
128 217166 -65997 -227586 40858 210848 -20913 -174502 7656 121350 -7912 -63212
138 -63212 18653 6106 -38202 42552 61355 -78393 -81456 102056 96039 -111285 -98367 112566
150 112566 90223 -106564 -69685 99610 42193 -92445 -10484 86553 -20947 -82306 46752
161 46752 76215 -66294 -68255 75898 53041 -79595 -32588 76924 4489 -72708 27853
172 27853 69020 -61121 -67496 91876 69826 -113221 -72230 124601 75008 -120859 -71706
183 -71706 105250 61696 -78261 -40823 45588 9437 -12764 30055 -15492 -75175 32951
194 32951 117965 -39629 -154675 32669 176418 -17222 -181023 -3931 164854 24091
204 24091 -129235 -37154 78686 39423 -18032 -25949 -42063 -399 96017 39353 -133832 -82656
216 -82656 152367 124339 -148689 -155558 124592 168993 -86093 -161521 38978 129562 5728
227 5728 -78540 -42247 11988 61998 58985 -63532 -125898 46282 178407 -14445 -208564
238 -208564 -24056 213541 62677 -190868 -90513 147042 103532 -86774 -95250 21333
248 21333 67085 40670 -21704 -90093 -34681 120052 92352 -129037 -143959 115731 178746
259 178746 -86688 -193081 46491 181916 -5424 -147585 -29660 94095 51719 -28598
269 -28598 -56139 -38443 43853 99640 -15555 -144550 -20656 170030 59520 -172045 -91522
280 -91522 153363 110846 -118386 -112860 73396 95590 -27571 -62439 -13909 16219 43094
291 43094 34101 -59317 -83131 60332 122155 -49811 -146639 31645 153748 -10750 -142408
302 -142408 -6407 116820 17577 -79124 -18068 37475 9790 4427 7126 -40098 -28542 66396
314 66396 50387 -81946 -69118 85777 79481 -81571 -81337 70241 71783 -57379 -54155 44094
326 44094 29387 -33996 -1846 27551 -24628 -24015 47757 23005 -63652 -21001 73278 18026
338 18026 -74992 -10634 72005 199 -64913 13713 56392 -29097 -48027 43270 39708 -55150
350 -55150 -32876 60897 24705 -61675 -16280 55467 4411 -45217 10211 31800 -27811 -17888
362 -17888 47519 6608 -66190 1668 82855 -4300 -92630 3639 95143 758 -87474 -4930
374 -4930 70522 7075 -45400 -4848 14861 -3953 16131 18091 -45119 -38118 65895 59185 -77641
387 -77641 -79229 77553 92909 -67265 -97191 49111 89867 -26305 -69447 4586 38944
398 38944 13302 -61 -22274 -40431 22409 78634 -12503 -108130 -4333 125058 24573
409 24573 -127272 -44212 113625 57308 -87794 -61870 51863 53760 -13121 -34500 -24220
420 -24220 4699 53694 31064 -71788 -67508 76746 99603 -68083 -120668 49738 128549
431 128549 -24391 -119487 -929 95794 22294 -59141 -34599 15255 35444 29543 -25011 -69888
443 -69888 4367 98920 21165 -114937 -48084 114608 69168 -100886 -81679 75888 81478
454 81478 -44753 -67881 13212 43093 14684 -9165 -33803 -27476 43630 63311 -42340 -91651
466 -91651 32958 109799 -17549 -114634 478 105831 14027 -85801 -23317 56386 24043
477 24043 -23675 -17262 -9452 2422 37186 16698 -57557 -37255 68234 55389 -69238 -67196
489 -67196 62669 71392 -49966 -65600 35847 51936 -21696 -30911 11241 6599 -4937 18147
501 18147 3247 -40334 -5367 56635 8625 -66740 -12474 68800 13329 -65379 -11556 56320
513 56320 5425 -44891 3627 32382 -14706 -20346 26506 10358 -36140 -1606 43545 -4804
525 -4804 -45912 11176 44657 -16753 -38873 23346 30560 -30461 -20967 37767 11310 -45018 -3634
538 -3634 49782 -2670 -52190 6081 49607 -8724 -42813 10420 31022 -13200 -15856 17733
550 17733 -744 -24025 17410 32918 -30610 -41779 40064 50433 -43194 -55508 41072 56105
562 56105 -33978 -50441 23751 37901 -13146 -19762 3500 -3145 1758 27096 -2927 -50356 -1444
575 -1444 68293 9366 -79260 -19567 81148 29279 -73462 -35423 57877 36536 -35678 -29809
587 -29809 11612 16591 12202 3309 -31095 -26424 43147 50130 -46765 -70574 41761 83587 -30562
600 -30562 -87792 14828 80613 498 -63907 -13447 38388 20049 -8467 -19553 -22064 11578
612 11578 49354 2825 -69089 -20098 79866 38312 -79378 -52214 69757 60113 -51899 -58926
624 -58926 30158 48529 -7679 -29709 -11957 4440 25303 22841 -31769 -49687 29823 70817
636 70817 -21883 -84321 9286 87374 4331 -80210 -15868 63934 22921 -40758 -22912 14977
648 14977 16619 10823 -3620 -32007 -12732 47216 30683 -54128 -46133 53404 56651 -46287 -60467
661 -60467 34609 55863 -21851 -44571 9593 26728 -1018 -6203 -3744 -15393 3724 34560
673 34560 -160 -48971 -5427 57647 11706 -59311 -15873 55469 17608 -46171 -14865 34535
685 34535 8707 -21413 788 9267 -12154 752 23287 -8307 -33252 12570 39538 -15219
697 -15219 -42307 15824 40324 -16658 -34875 17531 26411 -19440 -16515 22234 6748 -25018
709 -25018 2426 27794 -9292 -28475 14831 27468 -17950 -23418 20480 17089 -22319 -8724
721 -8724 24168 -860 -26720 9765 28925 -17801 -31515 22705 32190 -25289 -31373 24436 27392
734 27392 -21597 -20292 17248 10081 -12625 2862 9330 -16500 -7406 30143 8286 -40892 -10588
747 -10588 48181 14393 -50164 -17833 46705 19720 -38298 -18783 25742 13555 -11725 -5007
759 -5007 -2661 -7462 14192 21465 -22331 -35777 25337 47667 -23511 -55208 17894 57107 -9527
772 -9527 -51919 1318 40892 5730 -24275 -8786 5094 8029 14956 -2441 -32634 -6675 45850
785 45850 17759 -53116 -29077 53044 37474 -47077 -42195 35293 40419 -20985 -32831 5784
797 5784 19188 7453 -1484 -16607 -17902 20995 36798 -19446 -51495 13930 60915 -4873 -62574
810 -62574 -4574 57262 12719 -45100 -17250 28140 16911 -9336 -11706 -9272 1639 24425
822 24425 10728 -35145 -24341 39517 35912 -38463 -43964 32525 46669 -23398 -43216 13344
834 13344 34370 -3818 -20451 -2675 4365 6240 12703 -5631 -27754 2062 39449 3627 -46285
847 -46285 -9955 47366 14877 -43695 -17643 35400 16526 -24928 -12224 13150 4316 -2594
859 -2594 5451 -6023 -15952 11788 25705 -14313 -32568 14719 36419 -12899 -35774 10975 31848
872 31848 -9022 -24530 8482 15468 -9252 -5776 11129 -3467 -13956 10874 16325 -16667 -18262
885 -18262 19833 18155 -21416 -16515 21282 12554 -20543 -7033 19479 707 -18347 6074 17720
898 17720 -11693 -16618 16483 15621 -18790 -13272 19671 9990 -18595 -5081 16405 -1282 -14003
911 -14003 8278 11495 -15879 -10082 22163 9012 -27250 -9076 29395 8863 -28911 -8554
923 -8554 25321 6911 -19207 -3516 11747 -1494 -3588 8419 -3344 -16038 9051 23978
935 23978 -11853 -30367 12324 34561 -10424 -35465 6894 32337 -3173 -25751 -273 15577
947 15577 1600 -3935 -1068 -8653 -2388 19773 7752 -28397 -14287 33281 20828 -33838 -25544
960 -25544 30485 27896 -23388 -26067 14653 20538 -5150 -11091 -2936 -712 8699 13693 -11293 -26071
974 -26071 10225 35633 -6747 -41666 943 42391 4696 -38604 -9550 30128 11846 -18677
986 -18677 -10991 5852 6883 6739 452 -17001 -9234 24358 18917 -27249 -26979 26455 32719 -22090
1000 -22090 -34439 15493 31932 -8112 -25320 1216 14900 3411 -2887 -5777 -9997 4846
1012 4846 21287 -1589 -30167 -3460 35024 8730 -35574 -13138 32285 15610 -25484 -14876
1024 -14876 17046 11523 -7727 -5063 -408 -3002 6995 11777 -10889 -19868 12149 26025 -11484
1037 -11484 -29428 8984 29292 -6428 -26339 3673 20243 -2508 -12702 2444 4251 -4020
1049 -4020 3725 6690 -10477 -9770 15543 12893 -18074 -14576 18948 15190 -17774 -13532 15853 10285
1063 10285 -13297 -5432 10819 -232 -8977 5839 7455 -11113 -6704 14821 5718 -17249 -4784
1076 -4784 17589 2946 -16764 -494 14601 -2907 -11945 6893 9417 -10725 -6821 14502 5062
1089 5062 -16824 -3421 17974 2116 -17243 -702 14891 -1300 -11272 3756 6718 -7270
1101 -7270 -2324 10892 -1908 -15085 4672 18308 -6494 -20740 6636 21366 -5888 -19858
1113 -19858 4612 16314 -3073 -10516 2581 3809 -2707 3846 4451 -10705 -7008 16434 10422
1126 10422 -19983 -13770 20972 16225 -19500 -17124 15784 15578 -10888 -12023 5234 5854 -479 1453
1140 1453 -3251 -9725 4932 17453 -4609 -23553 2827 27426 494 -27868 -3625 25565
1152 25565 6420 -19988 -7453 12683 6718 -4191 -3622 -4086 -1368 10970 7372 -16020 -13972
1165 -13972 17922 19410 -17497 -23406 14404 24386 -10059 -22579 4947 17696 -478 -10305 -2594
1178 -2594 1639 3890 7543 -2903 -15593 408 21823 3475 -25030 -7373 25296 10648 -22628
1191 -22628 -12366 17589 11751 -11302 -9092 4448 4166 1394 1850 -6101 -8733 8729 14986 -9420
1205 -9420 -19832 8301 22645 -6036 -22687 3560 20508 -1009 -15709 -320 9754 742
1217 742 -2851 644 -3682 -2920 9259 6024 -13220 -9275 15196 11539 -15507 -12905 13889 12323
1231 12323 -11553 -10319 8653 6607 -6024 -1872 3987 -3109 -2533 7987 2114 -11726 -2018 14410
1245 14410 2377 -15198 -2137 14804 1602 -13010 -140 10346 -1952 -7438 4440 4488 -7244
1258 -7244 -2121 9596 55 -11442 1217 12082 -2305 -11809 3161 10231 -4168 -7708 5382
1271 5382 4870 -6815 -1564 8729 -1110 -10280 3508 11784 -4726 -12245 5444 11924 -5336 -10267
1285 -10267 4884 7394 -4589 -3707 4302 -756 -4911 4911 5719 -8831 -7222 11440 8487 -12832
1299 -12832 -9623 12622 9837 -10995 -8826 8526 6723 -5214 -3089 2327 -1303 235 6299 -1689
1313 -1689 -11040 2131 14955 -1416 -17524 -89 18134 1722 -16937 -3318 13564 3854
1325 3854 -9037 -3432 3525 1555 1862 1498 -6591 -5309 10117 9562 -11650 -13056 11667 15651 -9791
1340 -9791 -16317 7109 15025 -3781 -11748 830 6856 1323 -963 -2316 -5288 1656 10761 -116
1354 -116 -15144 -2566 17390 5117 -17706 -7480 15814 8673 -12367 -8427 7900 6697 -2981
1367 -2981 -3205 -1423 -978 4965 5973 -6872 -10599 7435 14387 -6570 -16534 4665 16808 -2462
1381 -2462 -15257 266 11735 1113 -7184 -1593 1831 686 3292 1026 -7598 -3592 10630 6289
1395 6289 -12157 -8444 12106 9949 -10667 -9877 8420 8722 -5682 -5848 3247 2292 -1192 1789 16
1410 16 -5785 291 9089 -149 -11526 -584 12416 1135 -12201 -1486 10713 1221 -8343 -376
1424 -376 5547 -1238 -2708 3255 236 -5278 1902 7319 -3134 -8519 3939 9212 -4081 -8745
1438 -8745 4128 7427 -4033 -5357 4130 2808 -4682 -344 5260 -2152 -6056 3866 6521 -5133
1452 -5133 -6807 5620 6291 -5572 -5189 5166 3360 -4625 -830 4299 -1777 -4052 4446 4299 -6498
1467 -6498 -4529 8035 4866 -8578 -4882 8140 4435 -6969 -3396 5129 1533 -3251 783 1244
1481 1244 -3686 112 6426 -1068 -8972 1142 10785 -774 -11453 74 11021 897 -9225
1494 -9225 -1230 6585 1193 -3154 -212 -355 -1403 3567 3614 -6076 -6110 7414 8277 -7749 -9964 6812
1510 6812 10353 -5322 -9807 3167 7694 -1275 -4682 -325 748 1102 3344 -977 -7078 191 10215
1525 10215 1409 -11935 -3092 12328 4799 -11190 -5617 8973 5698 -5706 -4665 2295 2463 955
1539 955 488 -3612 -3968 5084 7207 -5611 -10046 4891 11624 -3558 -11993 1743 10908 -8
1553 -8 -8387 -1101 5091 1606 -1193 -1003 -2580 -254 5834 2184 -7935 -4314 9134 6121 -9011
1568 -9011 -7453 7819 7535 -6026 -6836 3722 4911 -1740 -2310 -68 -931 1043 4095 -1325 -6768
1583 -6768 1074 8830 -144 -9676 -577 9670 1403 -8345 -1599 6466 1427 -4037 -468 1534 -1029
1598 -1029 697 2740 -2520 -4578 3442 5952 -3968 -6926 3739 6999 -3322 -6372 2752 4965
1612 4965 -2309 -3049 2207 929 -2327 1289 2803 -2970 -3192 4327 3820 -4896 -3933 5080 3733 -4730
1628 -4730 -2953 4078 1719 -3511 -160 2775 -1699 -2429 3367 2126 -4791 -2147 5563 2077 -5868
1643 -5868 -1908 5535 1578 -4667 -778 3517 -313 -2038 1858 829 -3328 212 4928 -749 -6158
1658 -6158 902 6868 -684 -6898 318 6032 -126 -4709 -10 2729 -428 -619 1090 -1621 -2386
1673 -2386 3334 3606 -4492 -4963 4959 6015 -4739 -6383 3908 6189 -2681 -5019 1456 3271 -286
1688 -286 -844 -322 -1802 504 4324 -109 -6407 -806 7674 1784 -8140 -2856 7525 3475 -6135
1703 -6135 -3623 4086 2979 -1806 -1679 -410 -310 2266 2648 -3307 -4705 3819 6666 -3331 -7808 2461
1719 2461 8230 -1207 -7477 61 5819 857 -3622 -1275 856 918 1728 -136 -4140 -1258 5731 2719
1735 2719 -6574 -4062 6493 5122 -5696 -5420 4316 5105 -2544 -3817 1051 1960 523 379 -1244
1750 -1244 -2716 1593 4808 -1281 -6423 603 7182 277 -7214 -1099 6267 1528 -4818 -1645 2863
1765 2863 967 -878 -32 -963 -1374 2452 2895 -3171 -4123 3496 5129 -3219 -5376 2649 5140 -1884
1781 -1884 -4159 1284 2790 -826 -1108 776 -771 -956 2364 1363 -3584 -1986 4254 2295 -4465
1796 -4465 -2603 4159 2447 -3533 -1882 2765 980 -1851 279 1210 -1552 -647 2878 397 -3755
1811 -3755 -387 4396 420 -4370 -410 3974 334 -3232 98 2171 -822 -1140 1619 76 -2525
1826 -2525 589 3379 -1123 -4102 1186 4335 -1125 -4166 933 3509 -701 -2423 750 1115 -883
1841 -883 454 1392 -1614 -1967 2752 2715 -3330 -3294 3433 3680 -3228 -3707 2500 3147 -1734 -2292 864 869
1859 869 -211 688 -125 -2419 109 3896 236 -4848 -774 5359 1438 -5075 -1791 4364 2077 -3059
1875 -3059 -1750 1608 1025 25 105 -1336 -1555 2193 2915 -2691 -4265 2424 5079 -1985 -5431 1113
1891 1113 5051 -320 -4130 -392 2648 821 -850 -720 -998 296 2758 626 -3927 -1580 4665
1906 4665 2651 -4661 -3378 4146 3782 -3128 -3593 1901 2857 -658 -1686 -483 -104 1102 1805 -1416
1922 -1416 -3435 1165 4509 -634 -5195 -56 5275 854 -4571 -1232 3550 1465 -1996 -1065 543
1937 543 402 995 648 -1989 -1754 2703 2880 -2884 -3682 2593 4039 -2135 -3969 1361 3379 -769 -2374
1954 -2374 205 1041 23 350 27 -1733 -328 2814 905 -3408 -1409 3724 1857 -3412 -1899 2909
1970 2909 1784 -2104 -1222 1238 344 -550 559 -70 -1683 307 2481 -426 -3219 247 3368 -94
1986 -94 -3289 -98 2773 65 -1979 174 1140 -595 -196 1228 -543 -1702 1114 2345 -1296 -2699
2002 -2699 1398 2783 -1227 -2631 947 2085 -795 -1394 636 274 -738 606 908 -1489 -1370 2120
2018 2120 1705 -2452 -1966 2503 2156 -2193 -1942 1713 1523 -1037 -682 555 -172 -55 1251 -113 -2210
2035 -2210 66 2951 166 -3397 -562 3379 811 -3086 -1049 2326 912 -1393 -645 373 21
2050 21 572 817 -1341 -1705 1789 2557 -1781 -3163 1612 3463 -1159 -3354 538 2905 16 -1934
2066 -1934 -424 810 461 442 -290 -1701 -169 2579 856 -3192 -1549 3237 2085 -2949 -2463 2297
2082 2297 2400 -1488 -1969 602 1187 284 -62 -780 -1042 1124 2252 -1010 -3045 676 3585 -170 -3682
2099 -3682 -376 3280 752 -2556 -1004 1536 809 -488 -521 -699 -158 1483 919 -2091 -1730 2309 2373
2116 2373 -2134 -2850 1770 2881 -1147 -2495 574 1892 22 -874 -281 -171 327 1134 -161 -2078
2132 -2078 -238 2624 624 -2899 -1094 2689 1322 -2262 -1382 1559 1042 -865 -617 189 -107 375
2148 375 913 -681 -1557 833 2229 -642 -2475 506 2568 -147 -2231 49 1694 21 -1036 53
2164 53 232 -387 406 675 -987 -1139 1278 1503 -1494 -1746 1365 1802 -1150 -1598 794 1189 -540 -559
2182 -559 391 -114 -326 775 399 -1358 -594 1812 862 -1904 -983 1832 994 -1574 -949 1051 631 -606
2200 -606 -168 162 -509 173 1078 -277 -1706 257 2089 -136 -2248 -58 2198 313 -1769 -343
2216 -343 1293 330 -534 -92 -128 -288 761 802 -1170 -1298 1404 1690 -1351 -2013 1054 2077 -798 -1902
2234 -1902 258 1391 13 -739 -178 -105 188 918 -49 -1541 -226 2062 720 -2200 -1014 2187 1373
2251 1373 -1743 -1447 1194 1246 -589 -855 -79 143 517 446 -899 -1310 904 1837 -769 -2301 387 2401
2269 2401 -71 -2327 -275 1862 562 -1146 -581 415 474 381 -84 -1046 -367 1528 945 -1733 -1489 1625
2287 1625 1713 -1345 -1900 904 1687 -465 -1369 -30 668 288 1 -374 -780 351 1434 -128 -1883
2304 -1883 -233 2089 557 -1991 -793 1704 962 -1212 -795 688 573 -47 -110 -387 -433 702 976
2321 976 -843 -1443 743 1684 -658 -1832 334 1678 -163 -1374 -102 860 169 -272 -20 -270 -120
2338 -120 789 481 -1085 -748 1268 1037 -1212 -1157 1027 1214 -755 -947 446 556 -252 -153 45 -456 -24
2357 -24 831 36 -1257 -228 1365 373 -1446 -546 1299 547 -999 -493 650 237 -230 81 -70 -457
2375 -457 339 900 -441 -1227 447 1403 -336 -1479 120 1270 -33 -1077 -97 613 82 -87 28
2392 28 -365 -304 752 614 -1022 -861 1084 1176 -957 -1209 830 1205 -445 -957 182 641 58 -76 -162
2411 -162 -439 144 897 -30 -1302 -202 1486 412 -1565 -774 1320 744 -1007 -773 564 561 -115 -308
2429 -308 -291 -149 616 677 -724 -1032 739 1430 -522 -1556 333 1565 -25 -1270 -229 920 339
2446 339 -379 -371 -213 169 616 99 -1074 -424 1253 742 -1229 -1090 1033 1200 -829 -1176 459 996 -31
2465 -31 -574 -254 115 398 454 -387 -879 301 1199 -95 -1434 -216 1453 366 -1298 -556 943 553
2483 553 -539 -517 70 216 309 98 -540 -471 759 871 -755 -1086 633 1290 -377 -1198 168 1090 101
2502 101 -654 -153 313 217 197 -112 -608 -139 866 341 -1053 -564 981 713 -885 -829 620 724 -378
2521 -378 -532 107 248 89 115 -185 -476 247 810 -113 -991 -1 1081 208 -1018 -312 822 296 -572
2540 -572 -274 206 127 12 89 -317 -344 441 672 -511 -902 459 944 -325 -941 188 822 -45 -516 -15
2560 -15 225 131 202 33 -429 -152 727 380 -753 -486 830 653 -698 -690 475 698 -276 -497 14 214
2580 214 123 82 -153 -421 159 769 -86 -959 -58 1042 180 -931 -320 800 459 -488 -420 185 341 114
2600 114 -43 -404 -262 483 462 -556 -788 445 963 -359 -1026 193 909 37 -640 -186 281 268 60
2619 60 -229 -325 112 687 144 -848 -325 930 568 -831 -720 626 743 -391 -656 75 421 88 -200
2638 -200 -349 -209 319 481 -329 -723 212 941 -53 -992 -102 918 297 -701 -341 470 363 -56 -254 -226
2658 -226 88 489 248 -516 -459 644 663 -574 -863 367 825 -164 -789 -51 446 120 -257 -250 -74 166
2678 166 356 -78 -626 -48 775 223 -748 -398 714 479 -501 -456 362 473 -2 -273 -35 51 210 238 -309
2699 -309 -434 211 635 -174 -764 -15 739 92 -700 -153 441 257 -234 -173 17 90 273 80 -358 -265 423
2720 423 452 -371 -561 363 651 -230 -573 162 420 60 -254 -157 -6 142 200 -59 -411 -48 555 210 -616
2741 -616 -371 580 351 -483 -406 332 364 -125 -205 -52 46 209 127 -123 -353 196 573 -165 -636 11 647 67
2763 67 -557 -120 378 253 -242 -215 -38 156 194 20 -344 -149 461 429 -462 -497 382 571 -261 -511 118 511
2785 511 121 -286 -188 89 258 146 -189 -372 93 480 76 -632 -226 638 373 -548 -392 369 360 -143 -299
2806 -299 -33 212 261 0 -261 -227 286 456 -264 -578 170 686 -20 -600 -154 525 217 -351 -240 83 230
2827 230 88 -68 -292 -87 398 193 -507 -387 439 503 -332 -510 206 507 17 -383 -42 226 168 -56 -211
2848 -211 -230 192 437 -68 -519 -3 580 194 -530 -265 440 309 -294 -325 154 238 64 -54 -176 -78 326
2869 326 211 -306 -378 241 554 -93 -490 31 494 91 -355 -131 214 198 -44 -178 -173 38 275 85 -392
2890 -392 -195 317 299 -323 -398 291 413 -106 -295 -4 237 111 -76 -104 -25 192 264 -66 -342 -21 449 119
2912 119 -436 -177 388 226 -257 -282 79 211 -10 -137 -81 -47 201 141 -189 -340 199 384 -153 -381 53
2933 53 406 55 -333 -152 230 152 -8 -145 -62 56 211 36 -293 -143 339 298 -308 -341 289 357 -122 -319
2955 -319 15 237 93 -57 -178 -72 130 233 -152 -298 60 444 52 -425 -168 353 205 -234 -215 192
2975 192 247 -36 -186 -167 47 221 87 -313 -205 279 285 -220 -400 98 460 27 -371 -91 319 157 -127
2996 -127 -216 -1 119 115 -83 -239 -37 341 154 -375 -224 314 308 -171 -300 113 268 -10 -169 -142 30 52
3018 52 60 -112 -209 158 276 -34 -377 -25 365 131 -306 -192 213 225 -62 -189 -46 102 144 1 -214 -105
3040 -105 292 193 -211 -295 181 336 -92 -372 -41 252 56 -160 -127 55 161 61 -93 -152 42 290 86
3061 86 -293 -118 290 204 -229 -265 163 269 -42 -194 -49 117 158 18 -167 -105 97 188 -90 -310 53 325
3083 325 52 -288 -150 242 181 -123 -123 26 147 107 -49 -151 5 173 79 -231 -192 208 317 -108 -297 6
3105 6 311 47 -200 -122 103 129 62 -147 -163 40 160 15 -286 -58 254 204 -154 -245 116 249 -71 -178 -24
3128 -24 130 99 -36 -126 -67 138 224 -128 -243 30 282 18 -303 -122 225 127 -150 -208 12 138 35 -95
3150 -95 -146 -3 230 116 -201 -133 151 252 -111 -240 49 256 15 -194 -82 121 166 10 -104 -53 39 175
3172 175 -63 -223 -51 230 107 -209 -135 178 168 -77 -209 16 188 95 -104 -68 33 110 171 -157 -182 108
3194 108 274 -29 -267 -14 255 83 -208 -140 113 152 37 -71 -77 64 125 17 -149 -57 137 156 -144 -195 55
3217 55 222 5 -213 -33 156 88 -69 -105 -32 91 101 -54 -245 17 173 40 -200 -120 201 115 -114 -154 0
3240 0 110 8 -90 -93 -17 44 66 -149 -90 58 185 -96 -221 8 181 91 -167 -71 46 78 -11 -119 -68 74 141
3265 141 -34 -199 -26 134 134 -137 -137 101 228 -17 -195 -11 158 96 -103 -109 4 98 65 -78 -111 66 174
3288 174 -24 -217 -47 156 137 -150 -154 49 135 5 -182 -105 86 100 -36 -122 -132 114 157 -17 -207 9 135
3311 135 16 -159 -124 132 109 -20 -69 19 76 92 -86 -155 -9 161 128 -156 -105 100 154 -81 -182 2 106
3334 106 20 -162 -49 -1 84 47 -66 -72 92 145 -1 -158 27 138 107 -124 -83 102 172 -17 -86 -13 92 72
3358 72 -50 -93 -39 128 99 -128 -158 33 165 -16 -167 -59 97 28 -114 -43 23 106 21 -63 -89 29 130 41
3382 41 -60 -64 110 148 -106 -149 81 189 39 -167 -94 80 95 -20 -60 -15 83 135 -1 -100 -7 149 52 -142 -67
3407 -67 84 103 -15 -93 -10 124 18 -34 -58 14 108 74 -83 -149 75 163 -6 -133 -11 99 22 -102 -58 15 40
3432 40 -24 -54 -29 31 151 1 -105 8 124 95 -68 -88 70 126 6 -62 -45 46 76 5 -115 -31 82 82 -52
3457 -52 -99 -6 143 74 -102 -92 100 138 -42 -90 33 52 73 -51 -78 74 136 13 -90 -63 12 108 -15 -75 -30
3482 -30 109 58 -46 -46 7 78 52 -131 -55 27 87 -53 -155 -45 90 38 -79 -183 31 110 11 -93 -17 153 37
3507 37 -36 -89 -35 78 22 -86 -80 -4 67 11 -143 -78 102 38 -75 -85 -9 63 65 -54 -51 41 85 23 -99 -34 86 130
3535 130 -79 -91 5 47 40 -113 -5 105 71 -26 -68 -34 22 76 -5 -86 -15 81 55 -105 -77 -5 111 -44 -148 -30
3561 -30 85 81 -30 -81 24 26 45 -72 -102 63 98 -56 -102 5 63 55 -52 -41 31 53 -8 -19 -40 100 74 -29 -105
3588 -105 -71 24 56 -67 -110 17 86 2 -122 -41 -7 47 -4 -62 -45 103 92 -39 -76 -10 102 27 -41 -36 33 42 9 -65
3616 -65 -22 4 25 -100 -29 -43 35 36 -24 -40 20 48 -34 -62 -30 94 8 -84 -31 11 41 16 -83 -4 44 24 -25 -69 -5 43
3646 43 54 -46 -15 18 48 39 -74 -51 14 32 -24 -33 14 16 -11 -106 -52 1 90 -24 -65 -59 42 20 -73 -87 68 47 45 -37
3676 -37 -57 29 33 9 -77 -39 2 68 -2 -74 -43 59 68 -89 -49 -8 51 -39 -54 -2 51 50 -90 -113 -11 27 1 -28 -83 3
3706 3 34 -40 -60 -36 -3 67 -94 -95 -12 21 -17 -61 2 30 46 -42 -53 6 36 16 -50 -26 -9 69 -2 -43 -8 50 53 -35 -8
3737 -8 24 55 16 -55 -52 22 107 -7 -73 28 89 18 -69 -62 -6 55 38 -94 -22 42 65 15 -41 25 31 57 0 -36 -11 67 2
3768 2 -44 -30 -26 44 14 -37 -14 54 32 -19 -105 -22 101 75 -34 -75 -7 24 -14 -34 -57 41 34 -16 -64 -34 92 7 -38 1
3798 1 -22 40 -28 -67 -22 35 49 -41 -76 -19 29 13 -24 -70 31 8 5 -83 -16 69 40 -15 -1 -21 39 17 -45 -85 9 37 37
3829 37 -54 9 26 22 -5 -77 -56 13 -18 -50 8 1 31 15 -30 10 73 39 -33 -22 -22 76 7 -46 -38 24 68 -10 -31 -15 42 31
3861 31 -16 -42 3 57 23 -37 -54 9 24 -68 20 8 21 50 -16 -28 28 38 22 -25 -66 -28 -17 -52 -41 -9 61 39 -96 -80
3891 -80 64 21 4 -74 -53 25 27 -19 -97 13 50 -8 -42 -76 -15 -5 3 2 29 72 54 -44 -34 -62 -16 -9 2 -49 -43 42 -2 -67
3923 -67 0 17 0 -2 -47 -44 19 8 19 3 35 29 9 -28 41 54 64 -4 3 54 18 46 0 7 35 40 2 -55 -40 -14 -7 -19 -27 46
3957 46 70 13 -22 -35 -49 9 -6 -55 -31 44 59 -19 -9 7 6 14 -3 0 24 10 63 0 30 20 31 -15 -51 1 39 -20 -52 -27
3989 -27 31 -10 -44 -38 42 33 27 8 -45 2 -11 2 9 18 7 30 8 9 31 88 32 -11 10 52 34 106 34 -5 -13 -41 2 -23 -16 21
4023 21 36 -24 -37 26 33 31 -25 -8 31 18 4 41 10 -17 22 26 -39 9 24 -18 -68 -47 9 -18 -18 8 -6 11 -3 4 -49 6 26
4056 26 -33 36 -41 -6 22 -64 -35 -13 38 -14 31 36 52 25 -7 -12 -27 -39 17 -1 -26 2 34 54 27 -35 -10 34 5 -59 -7
4087 -7 14 24 4 -29 -29 6 -5 35 -20 -52 12 13 -7 0 9 19 18 -13 -30 20 55 -46 -24 2 45 16 -49 -40 41 8 -20 -11 47 -58
4121 -58 -18 14 -67 27 12 3 -20 -3 -16 34 -11 -14 19 -40 -22 -3 -39 31 17 2 -20 3 -38 41 -17 -50 31 -7 31 2 -13
4152 -13 -12 -40 49 2 -9 -31 -26 -2 44 12 37 21 14 -29 -9 -18 2 -7 -40 12 32 13 -28 -6 13 42 -30 21 -19 23 58 -20 -31
4185 -31 35 19 36 -8 41 102 20 -45 -7 33 58 21 -51 -16 -16 -22 0 -25 -25 21 4 2 -62 -5 -2 -8 11 -19 26 -18 -17 -19 -3 -5 -21
4220 -21 -71 14 16 40 -39 -11 -32 9 4 20 -33 -27 48 19 34 -18 -9 41 14 -15 -33 -41 -67 33 21 -2 -4 14 1 -1 61 44 -8
4253 -8 20 -22 -32 -11 -49 -21 -72 -7 -4 -12 1 14 50 29 23 -24 46 -6 -25 -36 50 -5 25 -35 -24 72 -17 -6 12 19 -22 -12 43
4286 43 -45 27 8 -33 13 -37 -37 48 20 -26 -5 18 -23 11 -89 -55 66 46 1 -12 -51 -48 42 -25 -37 18 -17 -11 -21 42 23
4317 23 -2 18 -12 24 16 2 17 -18 -26 43 17 -18 -14 18 22 -6 -41 23 43 -25 -8 -34 19 20 -75 -9 -53 17 4 -33 12 4 11 31
4351 31 21 -10 29 -4 -7 27 8 37 17 26 -10 21 36 -30 -79 10 24 2 37 -26 -26 -15 -10 -69 -73 -43 16 44 -16 12 -52 39 11
4384 11 29 23 -16 -18 -52 -40 -43 -36 -32 3 3 -15 -20 39 -15 -11 13 36 -5 -4 -7 -22 4 -27 12 -30 35 -9 -48 27 3 -1 -27 36 2 25
4420 25 -32 42 28 -17 -48 -25 0 1 -31 -27 -24 -76 -11 13 -38 19 -50 44 -58 -41 20 1 24 42 3 -17 -16 17 -53 -13 -24 -5
4452 -5 -5 24 46 15 26 4 10 -2 14 14 42 -18 -1 -24 53 -10 -2 -21 -37 69 14 -77 -1 26 -2 -51 30 -55 35 -16 -26 65
4484 65 29 -52 -28 -35 62 59 6 -4 1 -3 12 -10 7 -5 30 46 -31 23 30 43 0 -11 -22 -66 -30 -25 -22 20 26 -2 0 16 23 -15 -29
4519 -29 -13 3 -12 12 10 -35 7 26 -18 -21 -3 15 -39 30 7 -15 18 -16 41 -6 -14 23 -17 -10 -34 -6 43 5 38 -28 13 6 12
4552 12 -8 -13 32 22 -16 47 57 25 2 57 -42 9 24 -24 -51 66 3 -38 -55 16 11 5 9 5 34 2 -27 20 -10 35 36 2 -55
4585 -55 -45 -1 2 -6 -43 19 -19 49 -27 -4 -24 22 19 14 62 56 25 -1 -27 11 48 -27 -34 26 -6 -3 -39 -5 36 37 34 -34 5 40 27
4620 27 12 -69 -23 40 -5 -36 -9 31 11 22 27 -4 -17 -24 27 7 -54 19 38 -10 -61 1 13 -12 -28 12 16 -19 10 -30 -21 -47
4652 -47 -17 17 3 -16 24 5 37 -8 -55 16 35 5 21 10 31 25 0 -1 9 58 -22 -19 40 0 -57 14 -21 36 4 4 1 -23 57
4685 57 23 -41 -67 -63 13 -2 -32 2 -25 -9 12 -11 11 -70 -4 -19 -7 9 -3 0 -84 22 -5 15 51 -17 -4 23 3 4 -17
4716 -17 -24 30 -2 21 -53 -7 88 7 -53 -55 9 -10 10 -2 27 41 -19 24 -31 17 25 -21 -19 -15 28 19 -8 4 -24 3 -4 3 -29 4
4750 4 3 14 34 -63 32 0 1 -13 25 10 39 -38 -15 -24 -12 -31 -12 12 -21 -24 21 -15 45 -18 30 8 -75 5 8 -45 -45 3 18 -22
4784 -22 44 40 14 8 20 27 -30 -12 -7 36 0 21 28 40 -5 25 42 45 -43 -45 39 0 24 -5 -50 -19 13 10 -36 13 61 23 -12 -12 -26
4819 -26 11 33 40 -26 4 32 20 -58 4 23 6 20 1 51 20 22 58 -28 6 -16 -5 -38 -37 21 78 18 -19 -9 -19 -19 -34 10
4851 10 30 41 -46 -12 -36 6 10 -31 -33 -14 22 9 -3 3 -9 -7 -7 -33 2 5 -16 -1 -4 -32 31 41 33 -10 -6 8 9 -36 2 -27 38
4886 38 36 -12 -44 -12 25 10 17 28 23 68 -63 39 4 32 -20 -15 -36 -8 57 -63 42 -14 10 49 20 -79 18 -9 -34 -18
4916 -18 15 69 1 -1 -56 -35 -4 0 -13 -12 15 42 -13 -29 60 38 3 14 30 -6 72 -26 -29 45 22 48 -19 6 1 -18 35 -1 -27
4949 -27 -17 -6 30 -42 -3 -29 7 7 -7 69 27 32 29 13 14 -1 -4 -32 -26 35 9 14 11 21 -21 -10 1 -3 -26 9 -24 -39 6 -21 -31
4984 -31 -2 21 -8 55 -11 -40 -4 42 18 6 3 44 41 50 -43 -60 -17 4 -6 -43 -19 59 -6 -2 5 -32 30 5 -47 -42 36 25 9
5017 9 29 68 26 13 -12 -26 -11 -36 18 13 1 19 5 -19 -48 15 18 15 -40 -23 -10 62 -50 -13 -52 33 18 26 -16 -16 -38 2 -19
5050 -19 23 -35 -9 8 -17 -5 38 26 23 -13 -18 26 17 -102 -10 -9 43 -39 -10 9 12 20 48 -33 -45 23 36 42 -11 -58 -52 -6 -29 -33
5084 -33 42 38 -27 -18 -50 56 -15 -33 -45 50 0 -12 -7 -36 -13 49 27 9 2 12 -28 32 7 6 40 9 -3 12 23 27 23 -21 10
5117 10 40 40 -17 12 25 -27 51 29 -49 -18 -22 9 -48 -49 -12 0 -12 -18 7 23 8 23 -1 -13 -2 22 -27 4 39 -30 32 -75
5149 -75 13 -26 32 -36 -7 13 55 -11 -8 -2 -1 2 -59 -35 -9 17 9 -4 34 9 -5 14 -65 28 1 21 -12 2 -30 -10 -7 -23 -26 43
5183 43 54 31 -17 41 -4 -48 -43 -25 -21 17 0 29 8 41 35 -1 -22 8 9 6 -38 12 26 50 -22 -23 -37 39 32 9 10 -49 -28 33
5217 33 -3 4 9 -36 -44 -8 13 5 42 40 -26 8 20 0 -7 -31 48 17 -37 33 -24 11 12 -38 -75 29 2 -10 -7 -33 -4 54 -24 6
5251 6 -53 -27 25 -59 -7 52 60 -47 -14 -38 47 -4 -3 49 -44 13 69 -1 -63 -16 26 5 -25 7 54 -9 -19 -66 0 25 24 15
5283 15 -4 -2 -7 -57 -20 -15 -44 39 -4 -52 -33 32 13 -37 16 -2 11 21 -24 36 -7 -57 14 -2 -48 24 -1 -40 -19 24 -20 7
5315 7 -10 30 56 -17 28 -27 37 57 45 26 -18 15 70 46 -10 -3 43 24 -23 -1 11 4 -16 -57 -42 35 39 34 -80 -15 28 51
5347 51 -14 -45 -31 -2 14 -9 0 19 10 -37 12 -47 -21 40 -4 -1 -25 17 2 -4 2 -20 52 -14 -92 -17 18 9 -33 24 36 -7 -24
5380 -24 48 -38 -1 -39 12 -9 -8 -39 -13 -16 -33 48 -10 -23 38 22 25 -69 -2 -32 13 38 15 -15 -37 47 24 27 10 15 -12 15 1
5413 1 -26 20 -5 -47 -55 -59 -32 -27 -18 -57 10 -11 -15 64 36 -40 11 -18 -59 9 11 9 11 -10 -21 -19 -3 -27 -47 1 -32 1 20 -25 54
5448 54 -39 24 -17 -4 35 36 16 -28 -4 8 39 -4 -48 -49 54 -15 -46 -40 2 49 -39 -8 20 -24 -14 40 -32 29 20 16 -14 -17 6
5481 6 71 -2 -19 -4 55 -8 -13 -10 14 42 -9 52 -71 -24 -15 0 -41 -30 -1 -59 -20 24 24 15 -7 7 -7 -13 36 21 -20 9 38
5514 38 15 -12 17 23 38 -46 -50 9 -12 -1 -10 -3 20 -62 -27 47 -31 31 -14 -19 -12 29 1 -11 -56 -45 3 -52 -23 44 -25 33 22
5547 22 -9 -25 31 4 -34 29 -22 -3 16 -44 -12 6 22 45 -26 14 46 87 -15 -20 -45 -28 -33 -17 -29 23 -1 56 38 12 52
5578 52 15 -4 14 -19 51 33 53 -44 -34 -40 -34 49 -10 -33 -17 -40 12 -37 58 -21 -4 -28 16 32 -13 -20 -7 9 4 25 -55 11
5610 11 2 9 70 9 13 14 15 -19 24 50 16 5 36 34 -40 1 -8 34 18 26 -16 -52 0 32 3 16 13 -5 -33 -32 7 -8 17 -48 11
5645 11 -1 -32 -6 51 48 -31 -13 4 -7 20 61 -12 2 -27 -7 1 39 76 -49 31 2 -21 31 4 -5 13 45 31 1 -18 22
5676 22 -9 -5 -11 -11 -54 -24 -6 19 -15 -23 10 -1 -36 9 -21 -4 33 31 -7 -9 26 -45 41 -47 0 13 -32 19 -11 56 -22 8 38
5709 38 -59 -18 -12 -19 35 -21 -4 46 27 -4 14 -19 -36 -17 53 -8 -29 31 55 8 -3 -24 43 30 -7 -13 -11 1 -48 5 -17 26
5741 26 8 76 40 0 24 1 -43 -8 -55 -5 48 -16 29 42 -7 28 21 -36 -50 12 37 -28 -32 -19 34 -84 -20 29 9 -3 -31
5772 -31 2 35 30 -21 4 -10 -4 3 -32 -39 13 7 33 -17 26 -7 -21 15 -39 -12 12 -20 -6 -93 3 -19 2 18 46 17 17 37 -14
5805 -14 50 32 -30 -37 38 49 -55 26 -2 -1 -33 55 27 -52 -49 10 3 -34 17 19 9 -27 -16 -5 -6 53 76 6 -19 11 41 10 50
5838 50 -12 -16 0 -15 -24 9 -18 10 -9 10 17 45 -46 12 -19 25 27 5 -10 27 -5 51 5 45 27 2 21 -13 24 26 -3 21 41
5871 41 -26 -36 -40 -42 -11 5 -16 6 40 -1 -15 -35 -24 12 18 12 -22 -17 -6 49 14 34 -58 18 19 30 -3 13 89 -17 -31 -44 14
5904 14 -40 -24 -13 -2 -18 -24 30 -23 6 8 48 2 22 -17 16 19 -95 -21 64 34 -4 0 -7 -59 53 -34 -21 -5 -5 -8 -37 27 -17
5937 -17 33 -12 27 20 -22 67 28 -43 -18 -10 11 -15 -59 -14 37 32 -27 15 29 51 -23 9 28 -29 -59 -12 27 9 32 50 28 -11
5969 -11 1 -26 20 -13 17 11 32 -26 -54 31 17 18 -12 1 50 21 5 16 4 -12 14 -23 -12 -18 -18 -40 -27 -44 -3 3 -50 4 -39
6002 -39 7 -14 -24 -41 25 -28 21 -12 -25 4 70 2 -27 6 -5 -22 -5 38 -4 2 -26 -31 -6 33 0 10 54 -30 10 -11 17
6033 17 -29 -19 10 14 32 44 54 -56 -7 -43 -37 0 9 -1 -13 -5 81 -36 4 -16 15 -21 31 22 -23 41 -15 40 4 0 6 -17 -21
6066 -21 43 -32 3 20 -20 -9 11 39 -8 35 54 -25 73 53 -22 -39 6 -1 -23 -10 44 66 -19 3 33 -28 11 11 -46 -24 42
6097 42 -24 42 59 -31 39 -23 20 -6 16 72 52 -11 0 36 29 18 32 39 -4 -6 24 83 13 15 7 -28 -26 31 -11 10 -8 31 -11
6130 -11 -75 10 -33 -2 -20 35 -36 -15 25 19 -53 -25 22 29 -15 -17 56 -18 2 -22 19 -9 -7 30 -26 4 -20 49 -41 -14 34 30 -24
6163 -24 20 -5 17 -10 15 8 -3 24 47 -22 -8 10 19 23 -7 -45 -21 -6 -8 39 17 17 13 -31 30 -30 27 -15 42 -53 23 37 16
6196 16 23 -2 26 -54 -29 -22 -21 -22 -30 22 4 -10 -11 -8 -17 -12 47 -62 -3 9 -75 -50 31 -7 8 28 -48 8 26 -32 18 0 -8 26 43
6231 43 37 -18 5 -31 2 -13 -36 36 74 6 21 75 27 54 9 -31 -24 8 -68 -26 21 32 -6 -45 2 -21 -16 -22 -41 -25 -9 -16 8
6264 8 -30 27 48 -36 12 26 18 37 34 13 -47 39 40 39 -5 6 -17 3 -41 67 -88 -18 8 18 5 -29 -3 -7 -25 -34 -4 28 -55
6297 -55 -34 -6 15 -25 -5 46 4 -32 25 20 -30 -10 -3 -9 -41 28 6 -7 20 3 16 51 15 45 16 6 -33 45 39 -25 22 -71
6329 -71 50 -9 -14 3 -26 -8 -18 35 3 -35 -16 16 -23 11 0 14 18 6 -31 -27 -21 16 44 -22 -17 1 29 -31 29 35 53 65 -8
6362 -8 50 7 11 -5 23 35 -14 -23 26 49 -5 -33 38 21 -30 18 5 -17 -2 2 21 64 -1 -11 -31 -11 36 27 -6 -46 8 2 -15
6395 -15 -7 20 -19 18 23 -41 -16 41 30 -1 -11 -2 22 26 -54 -7 -27 6 3 -32 -24 7 -43 -18 -18 -24 14 -21 3 2 18 -27 -9 -33 -1
6430 -1 -16 -15 11 -19 82 -19 65 21 26 -29 -9 53 -48 13 -32 1 -72 35 24 -62 -23 82 40 -7 -16 13 -6 -30 72
6459 72 -20 -46 17 -18 -3 -44 -18 -4 15 -18 -10 30 3 10 -55 7 30 -41 5 11 6 38 -6 68 -37 -33 19 -27 -14 33 55 -10
6491 -10 -33 -5 -39 -24 -18 -30 -12 25 -34 8 21 -21 34 -16 -30 0 41 32 -4 10 -15 11 55 -5 43 -1 -68 -23 31 34 6 9
6523 9 -1 39 -28 32 23 -18 7 47 -7 -7 20 49 -11 -22 -32 -46 -50 -15 4 -9 3 40 18 9 -23 35 -13 11 -5 15 2 -43 46
6556 46 -10 74 1 33 35 -29 -69 -23 27 -35 6 15 25 25 43 6 -1 -59 -52 16 3 -21 27 73 -7 -35 -18 22 51 -5 -7 -1 18 -10
6590 -10 10 48 -43 39 4 5 -24 -11 31 9 14 14 19 3 -31 42 -4 18 16 -10 30 19 34 30 7 15 -15 -27 -1 50 -28 14 -23 32
6624 32 -16 18 35 13 -6 -16 -8 13 11 -21 14 -29 29 -39 31 28 19 -33 -19 -20 28 -34 -25 15 26 -2 -11 1 14 -8 -20 5 44 48
6658 48 18 30 -33 -27 42 44 21 -46 -30 -27 -30 3 0 21 -6 3 -16 -31 47 21 22 35 2 -1 -33 47 8 50 31 20 26 1 63 -1 10
6693 10 -7 -13 -17 30 14 12 13 15 -38 -16 -20 -5 50 55 -9 -27 54 2 22 -11 -20 40 -29 25 9 -10 -25 -51 -22 -37 -19 22 70 -49
6727 -49 -28 54 -36 -31 50 24 12 14 3 9 5 39 -15 -21 -30 14 2 -4 40 -25 31 -40 -28 -27 32 0 -48 -10 -36 1 -20 19 -54 18
6761 18 -6 26 -32 -53 9 -51 -32 12 58 49 -22 -26 -5 9 13 39 25 39 -15 28 -23 8 8 -22 21 -40 19 18 34 11 -13 -35 -22
6794 -22 -35 -24 -40 17 -12 -23 -26 22 3 29 13 -23 24 24 13 19 34 13 -37 -21 -12 67 38 40 21 -14 -2 5 -1 -49 36 36 -4 -39
6828 -39 -48 69 21 -3 6 -58 -11 -14 13 -6 -57 -13 31 -11 34 0 10 -30 7 39 -12 28 39 21 2 19 65 -33 -58 -2 12
6859 12 32 54 80 7 21 17 -6 -4 17 39 36 18 21 6 33 4 -56 12 9 -42 37 3 32 1 5 -43 8 -14 13 -18 8 -45 -8
6892 -8 -32 58 5 -45 13 -12 13 26 -8 35 -17 34 25 -3 18 22 16 -23 15 16 -55 -57 9 11 -62 -7 43 11 -68 26 -12 8 -13 40
6926 40 8 -7 -18 -63 -40 -25 -5 44 11 -49 38 4 42 9 11 67 24 -14 -10 17 23 1 9 28 -19 -13 2 -10 -13 -34 31 31 -41 30
6960 30 -42 -36 16 23 4 30 4 40 -11 -5 -27 -29 62 0 22 20 50 -22 21 17 17 -8 57 32 -3 58 -8 -11 32 -18 33 -24 1 29
6994 29 5 1 33 -6 -16 15 33 -29 6 11 -21 27 -18 20 -15 17 -1 -12 13 -11 9 41 47 -43 -26 55 25 0 34 30 -4 25
7026 25 -10 26 5 31 -73 42 0 -18 -22 -42 -13 49 -46 -15 33 -41 27 -40 27 -58 10 -48 -38 -26 15 -6 -52 31 20 -10
7056 -10 -13 -20 -5 11 48 23 -27 28 6 6 47 -13 5 35 28 -20 -15 -21 53 2 25 9 -19 10 -20 -35 -22 -18 -3 39 18 6 -5 8
7090 8 24 -11 -36 -26 -13 -40 -13 6 3 -40 8 -16 -31 14 3 -34 54 6 -31 4 -17 17 1 15 59 6 15 29 28 5 0 4 -14
7123 -14 1 71 20 11 15 28 -5 35 -4 15 -10 7 30 38 -28 9 8 11 -2 -16 8 4 63 26 13 7 54 -43 -1 -63 7 70 -43
7156 -43 5 41 29 11 19 22 17 27 43 -6 -54 -8 -19 -27 -4 1 -64 49 6 -3 -17 18 4 -47 50 -44 2 22 2 1 81 -5 11
7189 11 50 -10 -49 81 -6 30 29 19 73 18 -58 38 13 13 -16 37 -36 10 -6 -1 -16 -6 23 -41 16 -54 -3 -41 49 26 -39
7220 -39 10 -4 -5 -23 2 5 -11 20 0 25 -27 12 36 -25 -52 -20 -5 16 26 -11 25 20 12 50 16 20 18 17 -4 2 42 6 2 20 -16
7255 -16 -52 -29 15 40 -18 -10 20 -72 -10 -34 -19 38 39 -7 25 11 13 -18 -3 31 -59 43 -26 22 -37 -24 -34 4 -8 52 42
7286 42 16 0 6 -6 -4 7 3 -14 -20 -8 16 -25 46 -6 54 4 15 -24 -26 24 -27 -87 -16 13 4 46 1 -14 19 -18 -24 2 -12 14
7320 14 -4 -27 -1 29 -25 -1 -29 21 7 -7 23 32 14 6 -28 24 -18 64 -11 26 18 14 21 -47 21 20 -41 18 67 -12 -10 0 -23 22
7354 22 37 12 -15 34 -11 -8 28 26 16 -11 -35 -44 -11 -36 44 -14 -8 5 -34 34 15 -9 -7 -2 14 -13 15 78 17 -17 -62 -7 -3 -25
7388 -25 23 -18 5 46 -15 9 -12 -41 66 -14 -13 -5 48 44 8 -12 90 -19 61 10 -9 56 30 -37 14 66 10 -83 -19 13
7418 13 -64 -1 -6 9 14 -28 -22 20 43 18 -3 -29 14 21 31 -3 -6 -1 1 -1 2 6 -25 -13 29 8 -3 3 32 53 23 -24 4 -12 89
7453 89 -31 -24 4 32 21 27 23 29 64 6 -1 16 -39 42 -24 31 2 -25 42 15 21 -27 13 -7 46 -2 -13 9 34 1 4 -36 -22
7486 -22 5 49 -11 -14 15 -6 -60 -3 25 -10 -54 29 -14 -45 -25 34 -71 18 7 21 -52 -34 5 -5 -34 6 -13 -10 28 -33 -12
7517 -12 -38 26 24 28 -34 21 -13 12 17 36 13 31 18 -2 4 29 -11 22 68 44 -3 35 22 81 -32 -35 27 19 -25 16 -1 -2 -55
7550 -55 -8 45 -46 31 17 -11 -27 54 30 -14 -21 4 29 -2 5 63 -24 70 -6 -24 17 -19 -7 11 33 8 -5 15 -4 -24 15
7581 15 -5 21 -8 9 26 1 58 -1 34 20 -9 -1 1 3 4 36 6 22 30 14 12 36 -9 11 20 -8 9 -15 -4 32 -19 2 24 -9
7615 -9 12 -27 -31 -21 7 26 42 -29 -4 -1 -14 -24 21 1 7 5 -44 -20 8 10 -18 61 -1 -38 44 5 52 -27 -4 84 -5 39 -1
7648 -1 -6 -18 43 -34 -3 26 5 5 62 31 38 5 1 9 21 23 7 -8 -14 -48 -19 -4 -21 21 -10 -14 0 8 50 -40 -41 -22 -29 19 15 -16 -55
7685 -55 -17 -10 -50 -24 33 11 -29 -22 33 5 -28 44 46 45 9 -34 -22 -5 35 2 23 -12 6 -25 8 7 7 -57 29 -17 -5 15 -31
7718 -31 39 -31 9 16 23 32 31 1 22 -7 -26 -65 15 -5 6 -3 -48 22 59 -5 21 -12 21 -38 13 -47 46 28 14 22 -2 30 27 -32
7752 -32 4 -5 4 -25 12 19 -1 14 -48 83 -7 -17 -4 -14 41 67 -11 22 42 37 -26 4 3 44 10 -32 40 11 -31 19 48 -42
7784 -42 -26 38 9 19 15 -4 26 2 15 20 -13 27 -32 -20 31 6 14 -40 -29 -3 34 -13 -3 -18 -1 1 -14 -14 31 13 -15 44 -24
7817 -24 -1 38 -63 15 -25 -18 31 -8 7 -27 -19 15 27 38 37 21 -10 7 -34 42 2 26 -5 -35 13 37 48 -3 -33 -34 46 9
7849 9 12 22 4 20 -35 1 23 -47 42 15 -47 -8 38 -38 9 -47 -13 1 5 11 -12 -8 1 17 -1 -15 -58 -32 21 -4 32 -46 -13
7882 -13 17 17 30 -59 11 18 -3 11 57 -3 -30 20 -13 19 -5 5 32 -5 -16 28 52 30 -1 13 -43 31 -33 20 0 5 -20 15
7914 15 -32 4 -4 21 -53 -23 34 -31 8 18 27 -19 -28 -17 -10 3 -22 -14 -27 9 -10 11 -4 25 -43 27 4 -44 -5 35 34 12 14 28
7948 28 16 18 26 13 31 -64 -15 -12 18 29 23 -40 -17 -33 68 -1 6 39 9 -3 -49 59 -41 -77 -62 -10 1 -8 39 8 5 21
7980 21 24 37 -10 -22 -23 85 60 5 -31 12 51 16 -30 21 -25 -15 -6 -28 15 -28 -24 15 15 9 12 -24 22 14 -8 -40 -11 29 -23 16
8014 16 -27 13 -30 -63 -18 2 -8 -10 2 -56 25 6 -10 25 36 55 22 16 3 7 2 -28 20 46 -15 1 32 -41 36 -38 21 -15
8046 -15 24 -15 -15 27 -45 -25 -25 27 -1 -8 -26 38 -29 35 19 34 3 3 37 -8 15 -12 -4 39 -12 -4 -14 -21 -57 42 -19 2 -14 -3
8080 -3 25 -28 -38 -25 -13 13 31 -35 -15 -19 -29 -41 19 17 -68 43 23 37 7 -33 6 -7 -6 63 44 -45 -21 -47 36 0 0 60
8112 60 -10 25 10 48 8 -19 -17 -4 -13 -10 -57 17 9 1 12 24 10 14 29 49 91 -29 10 -3 -5 12 30 -29 5 9 48 52 36 2
8146 2 61 -41 -12 6 17 33 63 -22 -40 -12 24 17 -12 -23 -56 63 -25 -39 7 2 54 -13 -61 25 -16 -27 -26 12 -52 -35 1
8177 1 7 58 -25 15 -25 17 64 5 32 20 5 20 44 36
8191C6
$$ Imaginary data points
##PAGE= N=2
##DATA TABLE= (X++(I..I)), XYDATA
0 0 0 0 0 0 0 0 0 0 0 0 0 0 0 0 0 0 0 0 0 0 0 0 0 0 0 -4 4 -4 4 -8 8 -8 12 -12 12 -15 20 -21 22 -30 30 -34 41 -43 48 -54
46 -54 62 -67 75 -83 92 -99 108 -118 130 -141 152 -164 174 -183 192 -190 178 -143 65 122 -571
67 -571 1815 -6503 53523 413963 127752 -367891 -176096 256807 199095 -131330 -178298 -7887
79 -7887 118573 128024 -25430 -219928 -83763 266063 190909 -270138 -277010 234250 332121
90 332121 -168061 -341571 87826 307252 -8545 -229874 -52208 126720 88214 -8080
100 -8080 -93109 -107562 67688 204632 -20139 -271462 -40150 299292 96347 -291697 -141258
111 -141258 249479 161333 -185073 -154345 108281 117987 -33670 -58871 -28161 -12806 72048
122 72048 88704 -92068 -154244 92897 203074 -76457 -225360 53718 222388 -30025
132 -30025 -195035 12740 148940 -6627 -92979 11422 33368 -28294 19033 49164 -62688
143 -62688 -72335 91625 89678 -108220 -98695 112986 96004 -109706 -80747 103648 57169 -95365
155 -95365 -26017 89753 -5161 -83953 35049 79839 -57351 -72691 72102 61312 -78809
166 -78809 -44042 78395 18816 -75397 10821 70093 -45117 -68307 76867 68022 -104009
177 -104009 -71127 120486 74078 -124278 -73947 114956 68316 -92400 -52169 62696 26783
188 26783 -28426 9907 -1966 -52083 25889 97226 -37959 -137745 37419 167343 -26259
199 -26259 -181592 6476 175017 14039 -149777 -32286 105154 39707 -49192 -34725 -12494
210 -12494 14513 70649 19020 -116913 -60460 146208 104693 -152817 -141290 139285 165187
221 165187 -106447 -167869 63129 148431 -15943 -106384 -25782 46343 54102 23087 -65556
232 -65556 -94070 56602 154056 -32208 -196967 -4703 214186 43926 -205425 -78294
242 -78294 171524 99539 -117961 -101691 54566 84013 11109 -45790 -67094 -5367 108072
253 108072 64138 -127135 -119523 124906 163701 -103082 -189065 67099 190250 -26014 -167869
264 -167869 -13747 122472 42258 -62617 -56541 -5358 51946 70397 -31319 -124412 -1702
275 -1702 160275 40685 -173517 -76395 165455 103529 -137173 -113845 96941 106838 -50065
286 -50065 -80761 5787 40393 30039 8627 -53278 -59620 61203 103803 -56694 -136812 40969
298 40969 152105 -21450 -150487 1373 131202 13051 -98943 -18954 58796 15387 -15727
309 -15727 -1835 -22867 -17154 54911 40057 -75294 -60208 85416 75533 -84590 -81679 76339
321 76339 77723 -64122 -64215 50145 42056 -38955 -16100 29996 -12025 -25681 36597 23129 -56683
334 -56683 -22232 69393 19964 -74848 -14573 74288 6225 -68465 6739 61139 -21034 -51867
346 -51867 36704 44038 -49581 -36136 58766 28901 -62188 -20918 59148 10408 -51141 2202
358 2202 38442 -19046 -25074 37285 11627 -57249 -2057 74988 -3576 -88573 4593 95293
370 95293 -1459 -92341 -2587 80463 6682 -58575 -6359 30882 1439 936 10443 -31192 -27676
383 -27676 56474 48455 -73315 -69959 78699 86803 -73873 -96736 58621 94817 -38168 -81332
395 -81332 14998 55268 5150 -20106 -18830 -20078 23793 60589 -18322 -94441 5088 118714
407 118714 14585 -127888 -34595 122483 51897 -102091 -60970 70598 59203 -32776 -45731
418 -45731 -6367 20364 39928 12457 -64652 -49823 75762 84333 -74128 -111833 59921 126565
430 126565 -37504 -126005 11675 109641 12715 -78498 -29492 38055 36737 7595 -31362 -50510
442 -50510 15829 86105 8010 -108808 -34949 116568 59425 -109570 -77098 89134 82998
453 82998 -61013 -76589 28542 56647 1438 -27053 -25508 -9017 40050 46040 -44083 -78450
465 -78450 38735 102481 -25396 -113607 9202 112150 7516 -96895 -19405 71997 24872
476 24872 -40276 -21771 6676 10406 23919 6499 -48689 -27355 63846 46633 -70150 -62419
488 -62419 66624 70354 -56881 -69678 43014 59782 -28434 -41942 16167 19221 -7274 6171
500 6171 3799 -29538 -3709 49455 7033 -62464 -10632 68706 13160 -67849 -13019 61190
512 61190 8761 -51119 -1514 38379 -9274 -26415 20467 14934 -31773 -5840 40252 -1763
524 -1763 -45209 8216 45929 -13742 -41982 20212 35250 -26472 -25612 34331 16225 -41369 -7135
537 -7135 47835 183 -51483 4516 51343 -7688 -46966 9337 37146 -11951 -24056 14986
549 14986 7409 -20781 9136 28186 -24549 -37328 36040 46389 -42203 -53276 42964 56765
561 56765 -37774 -53885 29309 45213 -18216 -29364 8211 8805 -278 15138 -3022 -39191 1176
574 1176 59966 4827 -75033 -14627 81152 24423 -78681 -33082 66457 36624 -47458 -34140
586 -34140 23819 24166 794 -7169 -22169 -14408 38358 38703 -45819 -60785 45407 78316 -36718
599 -36718 -86930 23021 85565 -7060 -73484 -7652 51804 17447 -24000 -20991 -7221 16240
611 16240 36207 -5193 -60472 -11373 75691 29453 -80913 -45888 75776 57290 -61442
622 -61442 -60498 41581 55055 -18509 -39853 -2532 17782 19675 9189 -29546 -36678 31714 61092
635 61092 -26714 -78892 15783 86975 -2635 -85302 -10678 72888 19937 -53201 -23880 27961
647 27961 20611 -1770 -10735 -22051 -4148 40689 21930 -51481 -38653 54914 52404 -50321
659 -50321 -59342 40960 59334 -28130 -51106 15427 36240 -4919 -16859 -2110 -4916 4062
671 4062 25161 -2547 -42642 -2660 53984 8570 -59402 -14183 58080 17213 -51330 -16657
683 -16657 40741 12405 -27782 -4067 15377 -6171 -3765 18036 -4757 -28538 10865 36883
695 36883 -14095 -41505 15576 41786 -16357 -38158 16816 30736 -18563 -21731 20542 11395
707 11395 -23806 -2018 26452 -6138 -28320 12305 28326 -16432 -25695 19494 20747 -21247
719 -21247 -12882 23379 4173 -25231 5527 27938 -13908 -30271 20554 31983 -24500 -32285
731 -32285 25111 29633 -23450 -24438 19316 15369 -15041 -3975 10668 -9676 -8123 23435 7589
744 7589 -35821 -9124 45285 12621 -49711 -16123 49315 19233 -42900 -19474 32510 16791
756 16791 -18756 -9708 4345 -949 8752 14255 -19016 -28928 24284 42002 -25147 -52352 20891
769 20891 56904 -13978 -55434 5320 47130 2522 -33117 -7628 14946 9097 5192 -5575
781 -5575 -24040 -1562 40068 12232 -50171 -23419 54022 33774 -50848 -40540 41657 41944 -28487
794 -28487 -37524 13131 26450 998 -10877 -12749 -8261 19428 27556 -20959 -44763 17161 57071
807 57071 -9558 -62603 257 61045 9056 -51749 -15357 37260 17841 -18693 -14782 -91
819 -91 7177 17423 4259 -30543 -17716 37970 30365 -39906 -40698 35883 45845 -28396 -45843 18212
833 18212 39358 -8394 -27937 121 12670 4968 4273 -6285 -20403 4317 34312 726 -43413
846 -43413 -6720 47592 12793 -46072 -16579 39979 17540 -30397 -14856 18972 8482 -7790
858 -7790 236 -2160 -10933 9136 20911 -13541 -29634 14632 34918 -13940 -36556 12029 34331
871 34331 -9779 -28423 8747 20335 -8597 -10502 10176 1122 -12361 7490 15269 -14035 -17443
884 -17443 18498 18335 -20913 -17717 21371 14623 -21116 -10147 19900 3820 -19026 2602 17917
897 17917 -9088 -17253 14274 16248 -17803 -14459 19545 12019 -19159 -7602 17807 2231 -15109
910 -15109 4858 12764 -12026 -10671 19226 9457 -25044 -9055 28600 8870 -29703 -8982 27341
923 27341 7856 -22677 -5586 15538 1230 -7733 4724 -46 -12138 6547 20115 -10686
935 -10686 -27339 12567 32946 -11453 -35285 8890 34490 -4889 -29436 1356 21076 1196
947 1196 -9897 -1689 -2497 -454 14344 4730 -24625 -11141 31265 17533 -34234 -23587 32554
960 32554 27095 -27353 -27459 19230 23886 -9768 -16166 996 5564 6306 7302 -10305 -19973 11292
974 11292 31372 -8718 -39253 3964 42632 1829 -41163 -7446 34795 10968 -24913 -12040
986 -12040 12216 9233 517 -3622 -12277 -4687 21138 14098 -26379 -23148 27423 30340 -24518 -33972
1000 -33972 19118 33885 -11666 -28989 4609 20569 1470 -9019 -4962 -3624 5652 15866
1012 15866 -3603 -26275 -830 33056 6011 -35998 -11292 34305 14594 -29276 -15711 21374
1024 21374 13536 -12310 -8547 3554 1326 4096 7452 -9129 -15923 12003 23354 -11956 -27995
1037 -27995 10437 29850 -7686 -28199 4966 23548 -2994 -16653 2171 8336 -3192 -286
1049 -286 5159 -7440 -8335 13223 11345 -17141 -13929 18787 15164 -18449 -14448 17016 12182 -14421
1063 -14421 -7870 12104 2817 -9703 3163 8259 -8570 -7072 13215 6227 -16324 -5455 17600
1076 17600 3853 -17454 -1937 15609 -1242 -13480 4774 10488 -8934 -8038 12731 5855 -15824
1089 -15824 -4129 17718 2863 -17710 -1392 16328 -100 -13088 2532 9132 -5342 -4432
1101 -4432 9040 92 -13005 3397 16770 -5799 -19835 6613 21190 -6521 -20936 5120
1113 5120 18250 -3877 -13728 2674 7229 -2509 17 3463 -7255 -5584 13916 8800 -18416
1126 -18416 -12062 20919 15244 -20445 -16787 17933 16676 -13386 -14101 8053 9118 -2766 -2481 -1701
1140 -1701 -5659 4238 13597 -5182 -20865 3831 25769 -1296 -28116 -2074 27168 5220 -23067
1153 -23067 -7120 16607 7462 -8315 -5289 88 1448 7872 4307 -13710 -10675 17302 16865 -18057
1167 -18057 -21756 16144 24164 -12451 -23975 7460 20305 -2693 -14324 -1419 6012 3490 2939
1180 2939 -3722 -11742 1898 19065 1443 -23699 -5374 25635 9284 -24204 -11658 20449
1192 20449 12436 -14498 -10713 7949 6930 -1423 -1367 -4046 -5352 7565 11924 -9396 -17734 8960
1206 8960 21469 -7414 -23111 4721 21850 -2156 -18341 174 12928 774 -6228 -136
1218 -136 -460 -1599 6737 4546 -11366 -7638 14526 10644 -15546 -12401 14840 12810 -12880 -11566
1232 -11566 10010 8569 -7367 -4476 4770 -663 -3178 5534 2206 -10117 -2067 13237 2215
1245 2215 -15015 -2233 15276 1959 -13875 -860 11823 -733 -8868 3239 6031 -5822
1257 -5822 -3225 8532 1033 -10689 546 11828 -1902 -12164 2670 11119 -3743 -9163 4655
1270 4655 6286 -6108 -3272 7786 138 -9528 2411 11199 -4207 -12070 5241 12335 -5330
1283 -5330 -11163 5163 9064 -4646 -5582 4441 1519 -4549 2866 5212 -6985 -6521 10190 7788
1297 7788 -12402 -9288 12769 9756 -12002 -9630 9698 7952 -6884 -5027 3795 1063 -869 3858
1311 3858 -1054 -8640 2124 13267 -1765 -16357 818 18204 961 -17739 -2572 15414
1323 15414 3752 -11476 -3881 6251 2590 -872 -252 -4500 -3392 8466 7395 -11168 -11472 11824
1337 11824 14541 -10871 -16175 8554 15981 -5387 -13601 2275 9533 436 -3894 -1854 -2124 2190
1351 2190 8214 -1005 -13146 -1203 16554 3797 -17863 -6465 16923 8215 -14393 -8857 10119
1364 10119 7747 -5476 -5135 671 1262 3303 3520 -6044 -8395 7421 12733 -7114 -15582 5745
1378 5745 17027 -3530 -16277 1319 13715 533 -9538 -1458 4489 1249 669 -10 -5645 -2347
1392 -2347 9257 4853 -11739 -7546 12208 9333 -11553 -10163 9559 9441 -7077 -7464 4443 4293
1406 4293 -2054 -266 602 -3757 300 7582 -251 -10438 -160 12226 854 -12528 -1395 11607
1420 11607 1420 -9704 -974 6915 -450 -4177 2133 1322 -4316 920 6299 -2589 -7991 3601
1434 3601 9046 -3909 -8975 4162 8246 -3974 -6438 4157 4216 -4267 -1526 4906 -971 -5608
1448 -5608 3088 6315 -4670 -6800 5385 6594 -5725 -5887 5315 4245 -4914 -2167 4392 -437
1462 -437 -4175 3122 4153 -5496 -4369 7435 4794 -8375 -4885 8576 4809 -7578 -4025 6155
1476 6155 2579 -4145 -449 2234 -2236 -521 4957 -713 -7882 1112 9906 -1027 -11356 349
1490 349 11375 402 -10324 -1106 8001 1300 -4936 -768 1486 -484 2130 2524 -4785 -4811 6960
1505 6960 7289 -7657 -9217 7424 10387 -6149 -10267 4204 8866 -2238 -6325 314 2738 776
1519 776 1232 -1236 -5380 617 8692 606 -11205 -2233 12341 3993 -11927 -5255 10229 5879
1533 5879 -7351 -5251 4048 3734 -574 -997 -2348 -2177 4489 5591 -5527 -8743 5286 10958 -4396
1548 -4396 -12078 2549 11595 -952 -9895 -656 6836 1422 -3246 -1411 -704 522 4293 1247 -6995
1563 -6995 -3183 8795 5373 -9215 -6762 8586 7651 -6969 -7262 4930 5952 -2773 -3722 737
1577 737 667 537 2466 -1366 -5519 1207 7846 -676 -9453 -186 9805 994 -9149 -1533 7547 1647
1593 1647 -5235 -1007 2798 -137 -344 1920 -1597 -3688 3056 5411 -3730 -6592 3911 7116 -3544
1608 -3544 -6880 2965 5717 -2588 -4070 2158 1924 -2248 241 2504 -2211 -3085 3715 3512 -4727 -3852
1624 -3852 5095 3904 -4947 -3315 4528 2425 -3761 -936 3118 -837 -2531 2607 2275 -4162 -2120
1639 -2120 5228 2033 -5874 -2058 5750 1690 -5167 -1268 4061 281 -2768 1022 1367 -2607 -218
1654 -218 4239 -450 -5564 949 6685 -782 -6941 580 6613 -216 -5512 34 3771 -151 -1703
1669 -1703 757 -564 -1811 2443 2967 -4036 -4377 4737 5456 -5005 -6357 4376 6345 -3290 -5704
1684 -5704 2081 4202 -846 -2036 59 -393 535 3150 -325 -5398 -263 7154 1294 -8021 -2350
1699 -2350 7962 3208 -6956 -3656 5135 3389 -3028 -2491 578 685 1343 1362 -2901 -3701 3635 5773
1715 5773 -3634 -7327 3001 8111 -1805 -7896 653 6853 498 -4721 -1075 2349 1187 472 -583
1730 -583 -3032 -515 4933 1941 -6237 -3463 6529 4676 -6196 -5368 4983 5325 -3504 -4534 1740
1745 1740 3001 -256 -844 -870 -1489 1526 3881 -1433 -5672 1020 6882 -122 -7300 -693 6859 1340
1761 1340 -5617 -1672 3861 1377 -1911 -615 -185 -696 1723 2075 -2935 -3542 3400 4676 -3425 -5324
1777 -5324 2986 5327 -2267 -4721 1632 3547 -1019 -1867 802 168 -764 1574 1204 -3041 -1631 3995
1793 3995 2150 -4391 -2554 4330 2513 -3961 -2281 3049 1434 -2337 -438 1427 -912 -958 2213
1808 2213 497 -3370 -322 4165 427 -4369 -343 4290 367 -3663 -60 2787 -396 -1631 1183
1823 1183 563 -2123 348 2938 -951 -3811 1154 4187 -1273 -4353 966 3826 -827 -3072 650
1838 650 1779 -820 -366 1082 -1024 -1634 2317 2372 -3021 -2987 3460 3623 -3357 -3671 2867 3557 -2137
1855 -2137 -2780 1269 1572 -532 -71 -53 -1634 125 3189 34 -4476 -528 5110 1107 -5278 -1663
1871 -1663 4787 2034 -3680 -1939 2392 1491 -765 -458 -717 -710 1834 2339 -2475 -3636 2632 4718 -2276
1888 -2276 -5367 1606 5287 -740 -4708 -115 3446 538 -1892 -850 -121 601 1949 135 -3386
1903 -3386 -1088 4374 2138 -4769 -3052 4463 3666 -3646 -3705 2555 3263 -1219 -2321 71 865 841 930
1920 930 -1313 -2643 1301 4018 -978 -4983 212 5283 435 -5076 -1048 4147 1318 -2864 -1256
1935 -1256 1319 795 270 135 -1503 -1224 2434 2363 -2761 -3250 2802 4006 -2356 -4065 1706 3741 -1100
1952 -1100 -2969 417 1629 -116 -318 -108 -1117 -225 2323 591 -3216 -1164 3628 1618 -3641 -1922
1968 -1922 3206 1934 -2510 -1520 1661 921 -831 103 186 -1138 213 2115 -407 -2879 294 3338
1984 3338 -188 -3470 14 3082 61 -2466 -36 1568 -400 -627 821 -146 -1393 839 2035
1999 2035 -1233 -2579 1403 2855 -1356 -2717 1165 2403 -875 -1742 746 883 -631 180 806 -1067
2015 -1067 -1107 1899 1467 -2385 -1891 2488 2045 -2363 -2090 1907 1800 -1310 -1157 790 318 -230 766 2
2033 2 -1723 51 2665 122 -3209 -372 3516 704 -3297 -960 2761 1050 -1908 -859 867 340
2049 340 71 285 -1065 -1296 1556 2111 -1868 -2849 1707 3376 -1338 -3489 828 3153 -217 -2458
2065 -2458 -120 1436 475 -99 -406 -1057 76 2193 539 -2872 -1222 3267 1839 -3161 -2382 2598
2081 2598 2403 -1930 -2271 911 1604 -118 -671 -596 -476 1021 1688 -1065 -2652 887 3433 -378 -3655
2098 -3655 -67 3629 603 -2934 -946 2078 973 -993 -680 -144 161 1124 526 -1882 -1351 2194
2114 2194 2010 -2281 -2639 1960 2828 -1476 -2742 845 2251 -212 -1407 -141 408 363 760 -200 -1624
2131 -1624 -5 2380 433 -2777 -914 2774 1206 -2452 -1445 1873 1216 -1311 -964 461 202 53
2147 53 468 -562 -1279 746 1946 -715 -2412 639 2530 -341 -2395 146 2031 82 -1349 55
2163 55 681 -164 134 515 -736 -888 1198 1340 -1446 -1606 1393 1767 -1344 -1793 938 1394 -747 -941
2181 -941 483 182 -355 464 368 -1102 -476 1612 743 -1890 -903 1962 1035 -1636 -1048 1319 836 -819
2199 -819 -348 329 -177 -10 815 -279 -1421 300 1822 -263 -2298 22 2207 136 -2053 -350
2215 -350 1528 407 -909 -249 178 -48 538 540 -1014 -1036 1365 1572 -1363 -1860 1266 2091 -936 -1953
2233 -1953 537 1614 -177 -1078 -217 342 217 470 -199 -1283 -21 1892 475 -2172 -922 2221
2249 2221 1249 -1924 -1376 1500 1364 -864 -1021 250 534 361 157 -701 -880 907 1600 -825 -2152
2266 -2152 610 2403 -309 -2434 -128 2076 414 -1574 -609 733 570 27 -310 -742 -120 1336
2282 1336 706 -1628 -1184 1736 1622 -1560 -1840 1165 1871 -703 -1578 204 1020 136 -405 -363 -412 387
2300 387 1063 -243 -1709 -99 1960 351 -2083 -717 1908 865 -1502 -904 989 744 -327 -408
2316 -408 -105 -91 577 713 -760 -1176 835 1592 -630 -1785 476 1748 -209 -1576 -61 1147 110
2333 110 -590 -157 -22 -101 574 271 -1004 -570 1242 893 -1270 -1095 1159 1261 -876 -1064 682 824
2351 824 -331 -295 122 -115 19 647 16 -1072 -115 1366 305 -1447 -509 1357 519 -1221 -526 809
2369 809 408 -484 -110 41 -267 213 688 -348 -1053 438 1376 -327 -1379 268 1481 -86 -1126
2386 -1126 -64 885 98 -354 -27 -117 -167 626 421 -956 -732 1074 976 -1011 -1180 853 1231 -604 -1062
2405 -1062 357 844 -35 -350 -111 -132 222 720 -110 -1092 -73 1461 327 -1511 -542 1455 741 -1144
2423 -1144 -794 782 726 -295 -457 -145 36 448 368 -654 -863 727 1227 -645 -1477 429 1606 -159
2441 -159 -1441 -116 1125 379 -643 -307 113 281 461 -83 -870 -215 1170 625 -1258 -885 1176 1094
2459 1094 -969 -1245 655 1043 -251 -800 -150 338 327 186 -381 -647 380 1120 -131 -1348 -43 1520
2477 1520 286 -1327 -521 1166 588 -741 -582 305 403 116 -39 -524 -300 637 655 -775 -988 665
2495 665 1172 -460 -1280 337 1140 -23 -819 -147 542 133 -57 -133 -424 5 765 225 -918 -465 1008
2514 1008 674 -959 -818 727 757 -503 -657 238 457 -24 -127 -168 -273 201 644 -171 -904 43 1056
2533 1056 134 -1035 -240 928 323 -720 -257 377 253 -135 -25 -185 -227 395 466 -509 -792 441 875
2552 875 -424 -930 216 877 -127 -719 -44 427 90 -45 -29 -305 -43 612 293 -694 -514 876 643
2571 643 -709 -714 600 703 -412 -557 133 393 56 -12 -197 -279 156 572 -152 -909 26 1040 154 -1007
2591 -1007 -287 878 370 -611 -438 364 346 -19 -112 -240 -138 496 382 -532 -648 593 907 -456 -1034
2610 -1034 261 953 -43 -847 -170 558 222 -198 -237 -271 177 502 -53 -764 -194 845 444 -895 -633
2629 -633 780 728 -428 -705 247 603 48 -308 -228 44 305 384 -345 -634 245 900 -133 -1001 -105 965
2649 965 242 -806 -338 575 397 -291 -308 -93 169 338 94 -473 -279 613 590 -520 -741 528 904 -283
2669 -283 -799 35 667 55 -415 -207 85 219 203 -155 -533 11 696 182 -762 -334 722 442 -598 -464
2689 -464 464 513 -152 -340 36 177 207 139 -252 -325 293 509 -201 -761 102 731 57 -684 -147 546 236
2710 236 -374 -259 81 122 100 -51 -315 -229 430 325 -472 -454 452 620 -289 -590 158 590 3 -346 -34
2731 -34 153 157 109 -78 -311 28 514 75 -607 -263 599 332 -474 -378 389 454 -220 -318 42 112 127 65 -164
2754 -164 -259 237 466 -191 -588 142 618 41 -640 -162 515 256 -349 -266 121 182 96 -29 -307 -115 455
2775 455 252 -403 -485 386 539 -316 -553 192 518 1 -414 -138 229 196 13 -149 -231 106 466 -5 -614
2796 -614 -122 617 264 -622 -375 433 401 -295 -425 63 246 55 -121 -264 -145 270 310 -289 -525 260 582
2817 582 -62 -614 -62 599 171 -362 -244 220 273 19 -197 -230 26 375 86 -499 -239 446 418 -415 -542
2838 -542 261 506 -163 -497 7 313 127 -141 -200 -12 204 307 -168 -411 58 541 103 -534 -201 474
2858 474 355 -381 -288 220 299 -33 -207 -125 47 219 140 -256 -256 233 468 -173 -522 80 497 64 -464 -68
2880 -68 325 170 -168 -149 -96 141 196 -7 -313 -108 406 299 -344 -362 304 392 -186 -423 74 251 17 -152
2902 -152 -136 6 98 191 -72 -283 76 390 34 -403 -100 434 257 -306 -258 199 274 -28 -174 -124 62 192
2924 192 40 -259 -283 202 288 -222 -417 86 417 30 -378 -113 297 129 -157 -179 38 112 170 -38 -242 -61
2946 -61 448 197 -349 -272 270 379 -195 -322 65 256 24 -210 -129 80 161 100 -256 -214 69 379 -41 -383
2968 -383 -68 362 125 -304 -226 211 250 -43 -175 -46 84 164 7 -196 -108 281 310 -245 -418 147 414 -66
2990 -66 -399 -90 275 98 -212 -223 102 168 87 -125 -248 47 283 104 -296 -171 333 344 -231 -322 142 300
3012 300 -40 -265 -52 162 124 18 -205 -159 182 234 -79 -336 1 365 90 -325 -181 272 224 -160 -234 28
3034 28 185 160 -56 -120 -45 235 167 -236 -239 167 366 -136 -365 -27 287 117 -237 -111 81 128 11 -136 -181
3057 -181 42 253 -27 -273 -65 267 201 -279 -268 194 268 -46 -211 4 162 111 -25 -127 -10 169 168 -129
3079 -129 -274 68 331 8 -352 -120 222 127 -233 -203 68 147 44 -152 -111 -11 169 89 -217 -209 172 266 -172
3102 -172 -240 91 279 8 -218 -95 132 163 7 -104 -79 62 116 -17 -253 -52 263 140 -266 -199 208 176
3124 176 -66 -210 -10 144 111 -26 -167 -25 166 162 -88 -218 81 298 27 -262 -88 237 134 -133 -206
3145 -206 109 155 -31 -106 -133 123 128 34 -168 -129 162 231 -176 -301 99 250 22 -225 -50 211 120 -70 -107
3168 -107 -31 128 117 -88 -203 40 215 47 -245 -132 228 184 -128 -155 25 182 39 -136 -68 67 128 71
3190 71 -138 -159 156 239 -41 -213 7 297 82 -214 -86 130 193 -39 -132 2 138 167 -73 -179 10 222
3212 222 104 -144 -209 156 228 -85 -206 -4 177 74 -126 -84 24 98 14 -90 -124 35 256 21 -203 -46
3234 -46 246 119 -136 -180 110 176 18 -126 -30 34 124 -12 -119 -69 176 126 -28 -190 -75 210 21 -201 -113
3257 -113 160 114 -110 -92 -16 131 124 -58 -135 -23 131 77 -156 -151 134 191 -104 -156 -1 170 103 -146 -92 19
3281 19 118 55 -33 -114 44 206 63 -161 -26 185 77 -152 -139 91 191 16 -129 -99 87 123 -6 -153 -27
3304 -27 123 55 -106 -181 22 194 -16 -204 -52 126 120 -125 -103 32 77 92 -50 -139 27 120 78 -173 -57 130
3328 130 173 -114 -169 105 184 23 -139 -72 81 105 -20 -97 -97 82 86 -48 -180 6 195 55 -141 -96 101 133
3352 133 -44 -109 20 78 110 -53 -41 6 180 126 -101 -151 81 153 -30 -162 -12 123 103 -119 -109 49 129 6
3376 6 -26 -86 32 100 63 -126 -43 118 68 -68 -133 66 133 22 -115 -80 103 28 -76 -72 -31 115 105 -47 -126 33
3402 33 146 -9 -160 -111 80 90 -43 -102 7 68 23 -54 -102 37 97 24 -57 -124 63 158 -20 -143 -61 125 25
3427 25 -131 -100 3 117 10 -81 -43 70 96 -59 -120 27 103 43 -79 -106 105 153 -11 -120 -17 89 49 -16
3451 -16 -41 55 96 41 -53 -138 27 150 -16 -135 -66 107 82 -78 -61 -27 100 -9 -87 -117 10 119 1 -65 -63
3476 -63 89 108 -73 -117 11 132 85 -137 -54 8 63 24 -86 -32 84 58 -35 -94 29 53 6 -93 -101 34 114 24
3502 24 -122 -22 53 48 -41 -47 8 115 12 -56 -60 81 120 -21 -141 -31 121 105 -46 -104 105 73 6 -67 4 62
3528 62 84 5 -99 -33 109 54 -61 -76 -14 67 3 -31 -56 114 66 -44 -65 -31 74 15 -31 -73 16 64 -4 -95 -113
3555 -113 86 119 9 -120 -13 104 56 -62 -110 -9 46 -4 -63 -94 87 123 -55 -115 -7 77 33 -44 -78 38
3579 38 38 -30 -64 -8 98 97 -31 -52 -19 55 50 -94 -62 32 8 -47 -106 -38 77 38 -45 -46 -51 93 -4 -62 -28 29 104 46
3609 46 -81 -61 51 28 -76 -73 -1 119 -8 -44 -23 70 58 42 -87 -74 6 17 -35 -80 -27 46 -11 -119 -67 68 26
3636 26 -15 -56 -15 35 18 10 -58 60 97 60 -84 -35 45 48 8 -69 -41 108 8 -79 -59 38 26 19 -32 -59 20 62 -11 -89
3666 -89 -13 87 26 -76 -16 24 80 25 -62 -22 47 71 -25 -68 -13 105 35 -86 -87 9 -16 16 -99 -79 61 24 -34 -5
3694 -5 -19 41 21 -22 4 71 43 33 -35 -1 27 47 24 -82 24 92 50 -97 -21 56 12 -34 -64 -62 26 14 -52 -106 30
3723 30 10 -64 -78 -93 26 86 -46 -50 -14 23 103 -49 -70 67 85 23 -64 -77 21 114 -23 -46 -37 26 60 -38 -75 8 93
3752 93 37 -49 -50 30 41 -8 16 -53 66 60 -37 -70 21 27 19 -24 -51 15 47 4 -12 52 60 105 -61 -60 -13 73 4 -40 -44 64
3784 64 56 12 -23 20 71 28 -39 -71 -38 62 52 -90 -6 43 46 -29 -70 -10 79 70 30 -34 37 62 25 19 -41 49 92 -36 -61
3815 -61 -58 19 -40 -53 -18 6 28 -5 -20 37 85 76 46 -39 -25 69 68 -77 -30 42 14 45 -83 -23 21 37 -26 -21 -27 -11 28 -19
3847 -19 -55 11 81 41 -64 -9 52 59 -11 -15 46 55 -3 -25 -4 15 6 9 -30 -47 7 37 11 -37 -13 1 16 -8 -32 28 52 -47
3879 -47 -25 -20 49 -36 -44 -65 13 57 -24 -18 -58 -27 27 -19 -20 -10 29 51 5 -8 9 36 96 -59 25 25 1 -17 -11 -15 30 -7 -22
3912 -22 -46 25 31 41 -21 -79 17 -43 -13 -9 45 72 42 -47 -62 -8 48 21 -2 -18 -32 -2 0 -84 -16 -27 22 -17 -6 -36 20 58
3944 58 -21 -20 9 72 -9 -73 -13 -5 11 -2 5 7 59 39 -24 49 1 8 -8 -80 37 61 40 -23 -24 -6 0 11 -23 -13 -12 49 -26 -19
3978 -19 -6 -3 -28 7 -10 10 17 -26 31 6 41 75 53 -65 11 42 -19 48 8 9 14 -33 1 -53 30 57 12 -45 32 54 -56
4009 -56 -66 -12 63 10 -35 -12 -20 5 4 25 -32 -18 61 9 -27 -28 37 26 6 -17 -9 -6 29 -35 -34 -11 46 23 -53 -4 20 62 -14
4042 -14 -25 -80 25 44 -15 -46 0 27 26 25 18 -55 0 37 -83 13 66 19 -41 -31 19 35 -29 29 47 45 6 -16 26 47 41 68
4074 68 13 -13 -5 2 17 9 26 -10 55 -28 -44 32 42 33 -12 37 -82 -1 -23 -24 -24 -5 45 14 -79 -44 37 -5 -49 48 12 76 -18
4107 -18 -42 -22 29 10 8 -11 10 30 39 53 -13 20 9 54 -22 12 -19 29 -21 -29 9 -28 12 11 -56 -26 4 22 -60 -5 55 -34
4139 -34 5 -8 -14 48 19 -44 -3 -10 -2 32 -31 23 -1 51 -27 0 -25 48 -21 48 20 31 52 4 -19 -21 -35 14 -7 -61 -14 -62
4171 -62 66 -30 47 -14 26 26 -21 -10 67 25 12 5 -46 -17 -24 3 30 -23 8 -3 -29 -20 -10 2 -26 -83 -21 43 11 34 -45 -8
4203 -8 16 -14 57 8 12 20 31 -16 24 17 -41 -39 -9 -58 -35 39 -24 10 -4 53 75 -53 -40 14 -11 -29 -30 -31 11 -18 -40 22 11
4236 11 -17 3 16 -19 20 69 -2 -36 -15 -49 -6 -60 -44 -17 1 28 -22 -8 63 19 15 -4 -3 13 -42 -29 -44 5 -18 -30 -17
4267 -17 -3 9 4 -36 -45 5 -6 -33 -5 21 39 28 -20 -7 -36 -12 67 -21 -25 -22 22 46 -54 9 -5 -2 12 23 32 34 20 -55 -38
4300 -38 97 22 4 -17 13 -53 56 24 36 14 -3 23 -16 -17 -18 1 17 42 -30 45 16 13 -38 6 26 20 20 -86 -39 2 12
4331 12 -14 -36 15 -9 39 -27 19 -30 8 63 -21 10 20 1 -70 54 -7 18 -46 -25 4 26 -9 30 17 9 14 16 27 7 46
4362 46 -32 -42 6 -37 9 -21 -22 -5 -56 -8 -7 -21 -32 20 -32 -26 -28 7 61 25 12 -9 -38 29 -50 -46 -35 -42 -38 8 13 -22 28 64
4396 64 -53 -26 -24 -13 14 -21 42 -12 25 -13 -22 -3 50 55 -35 -16 -3 -33 -20 3 21 45 15 -4 57 17 17 0 -2 -21 8 -50
4428 -50 -2 -7 -41 38 11 -8 -37 -34 86 -28 -33 11 21 14 -9 -20 4 20 8 35 -55 3 -1 64 -19 -53 15 48 -17 0 10 -9
4460 -9 21 -27 42 29 -25 30 12 -75 -25 -33 44 0 -38 -40 44 59 44 -14 -29 18 19 65 39 39 -31 -42 33 -13 41 30 -12 -19 16
4493 16 17 -46 -7 -37 50 -14 -11 -67 -33 40 -39 -27 -32 14 25 1 1 120 44 4 -22 14 14 5 -8 6 13 5 44 41 -23 -9 42 42 -13
4528 -13 -4 39 82 -36 -14 -21 -10 0 -4 -14 3 3 54 -10 -20 -2 32 -21 7 -1 35 14 48 31 -10 39 -8 -13 43 25 3 -12 -32
4561 -32 12 7 40 0 4 44 -58 1 0 16 11 17 -56 44 -1 61 8 -18 -4 9 10 -17 -14 -4 27 60 -3 29 -45 -6 31 6 -16
4594 -16 20 24 15 3 18 16 18 39 -35 -36 48 42 48 -55 1 48 -5 -16 23 36 -6 -1 -12 5 -3 -30 -16 -5 -48 -20 26 -15 -48 42
4628 42 16 -30 -6 -2 14 -14 -27 -57 -5 23 35 27 3 12 4 -2 12 6 -11 44 19 -19 -27 34 -15 5 -8 16 -23 -6 -6 22 12 24
4662 24 -26 30 16 -17 -71 -22 -32 -30 7 -21 7 -53 14 -3 -17 -21 -25 -1 18 -26 -17 1 -33 -25 -9 8 -17 7 25 24 56 -17 5
4695 5 -58 23 17 -20 38 -31 14 27 -17 -2 12 29 -32 -51 20 29 40 -4 -33 -9 -6 47 61 -37 10 6 41 -12 -21 -3 -24 -23 -9 15
4729 15 49 7 4 25 -34 42 50 62 -45 10 38 32 -24 30 58 -27 77 -12 5 34 9 -15 -46 -17 63 27 -3 71 31 28 -18
4760 -18 -3 1 32 39 40 -19 58 -2 5 -2 -17 32 67 -53 -12 33 65 50 12 -23 19 34 77 20 -30 -46 -1 34 -54 -21 -15 -30 34
4793 34 16 18 21 -29 7 43 21 13 -56 -17 34 6 -5 -25 -20 1 39 6 -50 -14 20 15 -5 31 9 58 33 -9 5 13 -21 -38 5
4826 5 21 15 19 10 -24 -23 0 20 18 -10 -20 5 -4 17 3 -21 -28 41 -21 0 14 32 -34 -26 -34 -9 12 -10 -17 -12 26 11 -5 -52 -36 5
4862 5 33 33 19 5 7 8 -20 16 -11 -41 -30 -16 82 -24 -6 6 -32 1 -14 -7 26 8 -15 18 -67 -49 -27 -6 -46 -15 -23 -21 53
4895 53 -21 -29 65 -41 50 6 -27 21 -19 -12 35 45 44 -56 -44 -25 5 17 -8 25 35 -12 -72 -37 -54 29 10 22 -37 -20 -10
4926 -10 41 8 -4 3 10 38 -7 -33 64 46 -17 17 -32 -46 16 -31 -17 -33 66 51 5 8 -21 47 -15 5 -61 31 36 -15 57 -37
4958 -37 -21 -41 -21 5 26 9 -28 -28 -43 12 -45 6 -33 14 -10 -43 16 -34 72 10 11 -16 -31 -10 18 -34 -22 28 53 -17 -20
4989 -20 -10 20 34 -56 4 -27 9 24 14 -4 41 -12 13 -12 -58 33 16 17 -39 -30 1 -32 4 -12 -36 19 -24 -29 -24 -39 22 27 4
5022 4 65 4 11 -7 -6 -10 14 17 -46 13 8 46 -3 -17 10 29 34 46 -2 28 28 -15 -44 -42 46 -6 47 -44 -29 21 16 -53 37 0 11
5057 11 -17 -12 3 1 23 -54 54 -13 -4 22 1 19 -19 8 3 -6 21 28 19 58 0 25 -62 34 -16 2 19 25 33 -14 -30 20 88 -4
5091 -4 -6 -6 1 -8 -48 -44 -19 16 -9 -38 13 3 47 0 -20 -41 -7 -41 -7 27 10 14 43 -3 -27 59 -1 -6 -33 -2 115 46 18 -6
5125 -6 6 9 -36 19 -29 11 -12 32 0 -13 27 -21 10 38 -9 17 2 -47 1 24 48 0 23 47 18 33 38 54 41 26 -4 -8
5157 -8 2 60 32 18 -23 -39 9 -64 -36 -28 15 9 8 -55 20 33 -1 -22 -51 45 22 -3 -51 -11 -34 5 -21 5 -57 35 37 -19 8
5190 8 52 11 -25 -27 -32 29 30 -19 -62 -24 62 -13 33 16 21 19 61 -25 -49 18 33 1 19 21 4 5 2 9 18 -12 2 -55 -20 -15 -39 1
5226 1 -60 -29 32 0 34 20 54 3 -5 -11 -13 4 82 9 11 14 -3 -7 1 -3 15 21 6 15 -23 -25 26 11 -30 -18 4 -23 -18 70 -6 34 -49
5263 -49 -42 -23 -7 23 17 -20 25 20 -34 8 -28 13 0 28 -34 4 11 18 11 -23 -41 42 5 -67 -25 17 18 -68 16 -8 -46 -16 -15 -16 46
5298 46 -10 34 -45 36 14 -26 -12 8 3 5 59 55 18 -13 -11 55 49 22 -3 -28 45 -33 19 23 2 -19 -5 -9 51 -6 -15 13 57 -6
5332 -6 -33 -70 22 16 3 49 5 22 -9 -7 21 12 47 24 11 -6 -4 62 13 -15 -14 24 19 -7 -35 13 -29 -56 -42 45 -9 23 -28 45
5366 45 34 -1 10 -11 -45 71 44 8 -23 -24 38 46 30 9 8 -14 18 -14 -53 3 6 8 -12 -7 -9 -36 9 -27 23 29 30 -40 4 16
5400 16 23 44 -18 -26 -6 -11 34 1 57 65 13 11 -54 -25 -2 -2 -24 -32 -25 -6 -37 40 -11 11 -93 0 26 -66 -13 -44 0 -15 -19 46
5434 46 -44 31 -24 8 45 32 -18 12 57 -37 -21 -22 1 25 -17 -41 -9 10 20 -34 -48 -64 33 13 21 13 0 -5 -18 -53 18 22 20
5467 20 24 -7 7 -32 -21 -32 -28 21 57 9 -10 -9 -17 -8 12 5 -44 -5 -23 -5 -1 -3 7 22 3 -38 33 10 13 -8 5 -21 19 -37 17
5502 17 74 9 -36 -11 -32 -11 9 10 -23 -5 63 8 -26 -50 15 56 -11 -15 -27 24 27 5 -18 10 29 23 0 28 42 22 25 -28 7
5535 7 27 40 14 13 -6 45 27 -4 13 48 -9 -1 2 44 33 6 -19 -3 4 -10 -41 -44 31 -18 17 15 -4 -19 9 4 6 35 -16 32 -16
5570 -16 -8 -15 25 84 -1 14 -13 -39 -26 -25 0 54 -3 -91 -5 3 60 2 -53 7 0 -1 18 -9 -46 -24 -6 -50 -47 45 2 42 -5 31
5604 31 -25 -45 11 -23 -23 -2 5 -27 -2 -7 -24 -4 -27 34 16 -12 1 19 -1 -12 -35 -50 -29 30 26 37 -7 -51 32 -34 -23 -20 -38
5637 -38 6 -5 -2 -43 -30 -39 -18 37 67 2 -35 -15 15 -58 29 -3 4 -45 11 -25 -2 -28 1 -11 12 -32 -21 12 22 45 -38 21
5669 21 25 42 -9 21 2 -41 -5 28 5 0 -1 26 -1 29 15 -16 -27 15 49 35 -10 7 -59 -4 26 -10 -9 10 -1 8 7 14 -8 18
5703 18 5 19 13 -24 1 -43 -1 -5 11 34 -24 -17 29 -45 -32 -66 32 -55 28 8 -26 30 -3 18 -11 0 5 -17 18 -38 41 27
5735 27 25 -20 -32 -3 -27 -7 26 34 62 44 14 -30 15 71 -35 51 -8 34 6 41 9 -16 18 -18 -26 3 -68 -4 17 -10 -5 -47
5767 -47 53 3 -25 -25 -10 -6 -33 5 -10 -18 16 51 -43 31 43 21 1 1 -5 -28 8 2 -11 1 47 27 -9 -18 11 36 5 13 -10 25
5801 25 32 -63 20 14 -19 33 7 22 -1 0 14 3 -22 -11 59 -6 -18 66 -3 66 6 32 -47 -49 -39 -13 -18 39 16 50 31 -38 35
5834 35 40 -19 23 -43 16 -24 23 8 -44 -26 22 16 -1 29 -28 -6 -4 -30 -3 -3 -2 8 24 45 39 -50 15 0 -36 -68 31 -20 47
5867 47 -20 -3 68 13 8 43 -41 50 8 18 -19 -49 8 23 20 5 4 35 -2 -39 1 18 -9 14 -2 -43 17 -62 9 32 19 63
5899 63 31 4 -24 -54 -26 52 -81 -21 19 29 34 -19 14 28 -32 -84 45 16 17 -9 -2 -10 -30 -70 -32 -29 14 -11 24 7 -22 2
5931 2 -34 34 -26 -34 -21 -7 61 22 -4 0 35 -15 -25 -8 -83 20 22 -26 29 -25 9 -28 -26 1 -19 -8 13 -15 13 -24 -37 21
5963 21 41 -11 -45 11 -19 -15 17 21 -28 35 38 17 22 -6 6 47 10 31 41 -14 -21 6 11 34 34 33 31 -14 -56 -48 -50 13 64 7 36 -28
5999 -28 20 9 10 36 42 -44 -13 -2 18 -56 -22 3 7 -9 3 85 3 26 -26 37 -38 -30 -7 22 20 22 15 -12 -25 3 49 -1 2 24
6033 24 80 50 8 36 49 -18 7 -23 28 50 27 -42 3 -19 32 29 -24 -25 -8 5 -31 2 -59 25 4 31 10 -9 52 25 -30
6064 -30 0 45 1 16 9 0 -3 3 -58 15 -24 11 -35 41 24 26 36 -2 12 -66 -15 -29 -36 0 18 -30 -14 32 12 -35 20 20 14 -37
6098 -37 2 -47 13 21 7 4 -11 20 25 -46 18 16 -19 43 -25 30 -3 9 55 24 23 16 17 23 -2 32 -26 -18 -48 -14 26 -12 -12 41 14
6133 14 -18 -32 2 -22 -42 16 6 7 25 18 -19 12 16 5 61 -10 8 -15 -14 -2 32 32 -60 85 -7 10 39 -3 -22 -15 -21 -4 -13 -31
6167 -31 2 9 -1 -26 -31 -1 -35 -39 16 13 24 -3 -9 -43 -23 38 -36 -31 8 31 23 -18 9 57 13 2 -26 -32 -34 60 39 -13 6 24 0
6202 0 -35 27 80 -10 25 -11 4 -41 -5 -30 72 -47 -17 47 -14 -13 29 -10 21 -15 -43 -10 -13 -4 -39 2 -31 -35 34 10 12 29
6234 29 11 30 -9 -27 33 72 8 -2 45 35 9 4 -23 0 37 26 20 25 17 33 -1 -18 -7 36 30 -60 -54 0 -13 -37 24 -47 -1
6267 -1 -13 -9 -8 -4 -7 -21 -8 -22 81 7 25 17 10 27 -21 -6 -7 -13 -20 -18 34 -17 2 20 -37 -5 -21 -17 2 -15 7 -41 29 -1 -17 16
6303 16 36 24 22 16 16 -31 5 36 -16 -9 -5 11 19 -32 14 -9 18 28 -31 40 17 12 30 -23 -29 -1 37 7 13 29 -24 -63 46 7
6337 7 33 0 -7 -9 62 18 -50 -9 25 -20 -52 -9 -44 -1 -36 -24 48 -42 -14 -60 14 -16 2 -4 -27 8 9 2 39 -24 -18 -9 13 -31
6371 -31 -19 3 -50 48 57 -52 -18 0 -30 -51 -26 35 17 55 -14 -6 -9 -12 4 -29 -52 -35 -50 -12 -18 -19 19 -6 -7 28 -30 -33 -25 -34 -13
6406 -13 51 8 47 32 18 -6 -19 6 -2 -35 21 -13 2 24 -11 41 -7 -40 20 -4 46 7 39 39 -14 -11 32 53 -18 -2 19 35
6438 35 -17 20 2 15 27 11 -53 -10 -14 5 2 63 9 5 19 -13 -1 54 -41 -1 -3 29 32 -13 29 39 -8 -9 12 -19 39 17 6
6471 6 46 21 -10 69 -34 -20 8 50 36 -85 10 -3 -19 20 -4 -23 -16 35 0 -32 -5 -10 35 -21 24 7 -20 67 -3 -8 15
6502 15 4 33 -18 -57 -9 19 16 -15 1 15 -4 -11 14 7 44 -8 29 26 40 -40 -18 44 27 -14 10 9 28 6 -35 17 25 -6 -9 -44
6536 -44 42 33 -14 16 -16 57 5 27 -9 2 41 -22 -25 -13 24 -40 -11 -28 16 13 -23 -23 21 -3 19 -24 19 21 -14 -21 4 -64 17
6569 17 4 30 -1 33 39 35 -54 -53 17 28 40 -26 -1 10 21 -6 4 2 2 27 -21 -23 10 38 6 18 -18 5 25 15 -26 -49 7
6602 7 7 18 48 11 9 -25 -29 -28 -24 16 19 5 19 -26 -39 -33 -18 64 34 5 -10 54 -20 -9 38 4 3 48 -8 -27 -28 -6 -4 -53 31 10
6638 10 11 -33 -19 -6 -19 13 -60 30 -32 -11 -28 3 -14 -1 2 22 -43 39 30 33 27 -12 -1 22 -9 22 31 0 29 -35 -32 -10 -6 68
6672 68 -41 -28 8 6 -2 -24 18 -16 42 5 -27 -12 29 52 17 -1 26 24 -66 -51 16 13 0 -4 26 37 -6 15 54 -18 -2 53
6704 53 3 -22 19 -27 13 -2 26 29 -7 3 -31 -22 45 -8 47 -15 2 2 -42 41 20 -40 25 20 9 19 -37 43 -7 16 19 -6 -51
6737 -51 43 -40 -3 -16 -2 46 28 -22 -19 -1 50 12 19 21 -22 21 13 18 11 25 -25 -8 9 -50 -34 -68 -15 -5 -40 7 -9 10 2 -21
6771 -21 10 -49 21 14 -16 69 -19 -29 14 -23 4 -36 17 0 8 -31 25 26 -8 6 41 -33 6 -26 36 -20 -1 22 5 64 -1 11
6803 11 51 35 -5 19 -9 35 25 6 16 57 -13 -9 26 52 -6 18 -66 -3 -11 3 5 -11 0 31 54 35 -20 -46 -25 -6 4 -43
6835 -43 -20 35 -5 -52 -1 -11 24 17 5 -27 24 30 38 -13 -27 -19 -14 19 -28 23 29 51 -10 -74 34 23 12 -27 -9 -7 -3 -10 -23 -15 34
6870 34 15 25 -49 30 33 7 51 42 -7 5 -80 66 -12 -52 -5 39 83 -44 -9 38 -9 6 21 -17 8 -64 10 -27 25 21 -7
6901 -7 -28 6 -32 14 -19 -12 -7 -20 37 -21 -11 -27 9 25 -33 64 40 10 -1 7 33 -31 24 -19 -15 39 21 24 -45 -1 -31 15 -8
6934 -8 38 -21 20 -18 -25 -7 -43 16 -49 22 20 -27 -1 -57 26 11 40 35 -44 26 -8 4 12 10 -90 -23 -39 -16 -37 1 -48 -23 24
6967 24 -6 -93 -13 -6 -43 -14 4 37 -48 20 -27 5 -20 4 -1 -7 -31 -15 15 -21 12 -3 -11 -1 6 -19 -23 1 -17 -25 -35 -13 5 -15
7001 -15 41 39 38 -15 -50 -44 36 28 7 22 -18 22 -17 -23 30 25 -47 -39 -11 6 -11 7 73 -2 -12 53 -7 18 -4 10 27 16 3 8
7035 8 4 -18 56 -13 2 -36 30 3 14 18 21 -8 46 -33 -27 -2 10 22 -6 -55 18 3 -52 -57 -14 -36 -50 25 -29 31 7 45 -8
7068 -8 8 28 7 -20 30 -8 7 -9 28 24 3 34 -9 14 -30 -17 -20 -16 42 -15 -37 21 -13 -42 9 -26 9 10 -32 -13 -15 3 28
7101 28 -2 33 2 0 4 -5 -3 12 -42 17 0 15 39 -12 26 -23 -21 -2 -33 23 59 -53 34 23 -7 23 -25 105 -25 -3 23
7132 23 -78 7 -24 -10 -3 20 11 -3 -7 79 18 -27 -34 68 -28 -20 -32 26 -1 -20 -36 -8 11 -14 -9 33 47 -3 -7 2 -18 40 40 23
7166 23 -19 19 -4 25 -23 25 14 0 -27 16 -33 1 37 1 -28 -20 -22 -11 0 18 -19 -14 -19 -40 6 22 27 -24 -46 -56 34 5 32
7199 32 1 10 19 34 -44 -25 18 -2 3 31 -20 -49 -56 18 -13 -17 -5 17 -38 31 -36 -11 -24 13 -16 0 27 55 46 -10 20 -50 18
7232 18 -23 -8 28 -35 18 5 8 -2 44 54 -16 15 6 -2 1 8 -1 2 3 34 -4 46 -39 43 10 65 -10 5 -30 3 -22 7 15 9 -44
7267 -44 18 -20 15 -26 -28 31 -2 -32 -32 -25 -5 -4 -1 -32 -38 4 -19 -15 -23 65 26 14 -17 -52 -4 31 55 4 -63 -41 17 -18 -7 1 2
7302 2 28 15 29 1 9 -22 29 15 -35 -10 29 22 -28 22 18 23 -1 14 -20 35 -3 -7 23 -32 40 -62 62 23 25 -2 -44 -13 -60
7335 -60 -48 -22 -50 3 -3 19 -18 -20 -4 -28 0 0 -23 45 22 -10 0 21 -29 30 -15 -14 20 -15 38 -73 25 -16 -79 16 -8 45
7367 45 0 -27 37 23 13 -5 -15 -33 -27 -10 -2 18 -17 -21 -10 -11 -13 -49 23 40 -17 -21 -34 -38 17 -6 -5 -18 3 28 -11 -12 29 -5 55
7402 55 26 3 5 11 35 50 0 -52 61 -3 13 -53 6 80 -19 -13 26 83 -28 -6 -55 16 27 -21 -34 46 -10 -28 -17 -16 -38
7433 -38 25 -35 16 -20 -23 57 -4 -9 22 -6 7 -16 -9 16 -6 3 21 -66 9 -24 10 -13 39 11 28 -52 22 25 38 20 35 -11 -20
7466 -20 4 25 -8 -3 23 -30 -35 3 57 -4 -5 -11 -23 26 -9 -21 16 -15 3 6 -42 -6 25 46 37 -4 -15 -6 10 1 -38 34 64 17
7500 17 3 -4 -27 1 39 77 14 22 -15 1 -17 1 17 26 27 37 -2 -26 -37 -36 -27 -3 -10 -47 -7 15 0 -26 -21 34 -1 -2 14 31 11
7535 11 -21 28 -6 -17 -18 5 43 -13 33 47 14 -21 32 13 -19 2 41 60 2 -53 39 -46 -21 10 -52 -42 11 8 -2 18 16 10
7567 10 45 -31 -1 -29 -33 15 1 3 -15 6 30 36 45 6 1 -2 22 -2 -43 -3 -11 -18 -3 -4 -4 -1 -2 -30 60 -7 -10 28 6 20 -6 19 3
7604 3 -37 -42 -61 -16 65 -12 24 16 32 -17 -21 7 -24 32 1 19 -9 -5 6 8 33 -49 39 -47 6 -15 -7 -52 22 18 6 52 5 -40
7638 -40 6 12 18 10 17 -20 -6 53 -6 13 -55 3 17 -1 -2 -27 1 -7 14 -48 18 -7 3 23 -6 -17 -8 46 -5 -3 76 -4 -34 -26 7
7673 7 8 6 18 -34 -3 -14 36 -6 -18 35 22 2 40 12 -31 1 -29 0 16 -21 56 -39 -30 18 -3 -19 -9 -8 -21 4 -2 -1 -23 -29
7707 -29 -7 0 -44 -30 -17 -4 12 -38 1 0 5 -35 41 -23 -40 14 -55 8 3 -30 -25 -6 -58 30 -2 4 -2 17 -31 64 60 -6 15 1
7741 1 12 -19 -6 4 24 26 27 -7 -24 -14 -16 -18 -24 24 -3 22 11 -13 24 -33 5 -15 27 -3 25 -23 10 0 -8 15 -34 -15 -7 -25
7775 -25 -8 20 7 23 4 8 5 -34 -13 18 24 39 36 -49 45 -15 27 4 -2 25 45 17 23 -26 4 -13 -34 15 -23 31 -25 -24 -27 3
7809 3 -16 -7 -34 -29 -12 12 -72 22 30 4 35 -52 -56 3 5 6 -22 -38 -39 28 16 0 -37 -7 -8 -53 35 16 25 24 -11 -1 38 0 39 -27
7845 -27 -38 7 -28 17 -16 11 0 -16 22 -14 -18 -45 4 24 21 -2 -35 -20 -29 -40 45 12 16 42 20 -14 -2 1 -5 36 13 71 25
7878 25 -41 -14 3 -7 -28 -7 6 26 8 8 -36 -2 21 -7 -2 -2 -14 -21 -3 13 -53 37 -29 -13 0 -11 -36 35 66 -25 9 -18
7910 -18 -7 -35 -60 52 -9 -7 46 -19 -57 14 9 12 36 13 15 23 -6 14 4 -5 21 58 -9 -7 -42 4 6 14 -7 20 8 -10 12 -41
7944 -41 12 -37 21 45 3 42 72 -6 -32 -2 -23 54 -6 -3 15 32 19 6 -11 31 16 24 -21 -37 23 -20 -38 -53 -1 -48 -53 19
7976 19 -10 8 68 -22 13 -12 -12 -6 27 16 10 -8 15 -1 -39 23 50 -2 -19 41 -1 5 30 -19 34 14 27 8 -17 -9 38 17 -18
8009 -18 16 -33 65 45 -21 1 -22 5 22 20 -14 25 -5 -2 34 -29 -1 -10 -15 37 55 -26 -2 -16 -22 20 29 -33 -38 4 20 -16 23 3
8043 3 -4 22 36 -42 -36 69 -32 3 -62 44 15 6 0 -3 -14 -23 -29 47 -4 25 32 25 -24 9 7 38 16 19 15 -20 34 11 7 -19 1 -75
8079 -75 14 28 -1 24 43 10 14 -23 -16 8 1 -55 -59 38 19 -4 -26 34 44 20 -30 36 -36 25 25 22 48 4 22 17 49 -37 -36 -48
8113 -48 -23 -77 10 -2 -36 2 -4 53 37 23 -31 29 19 25 -2 9 16 -23 -8 12 -40 38 11 11 -14 -20 10 22 14 40 48 -61 27
8146 27 0 -20 12 -38 21 6 -15 -44 -51 40 14 8 -65 -8 -11 -40 17 51 19 40 -10 23 23 39 -16 -10 34 -59 3 25 -32 -6 5
8179 5 -17 -24 29 5 17 -2 30 31 -26 3 -6 22
8191B2
##END NTUPLES=NMR FID
##END=
