##TITLE=1H_SL88-Dau(f10)
 CDCl3, 8 sc, 
 30.04.2021
##JCAMPDX= 6.0         $$ Bruker NMR JCAMP-DX V2.0
##DATA TYPE= NMR FID
##DATA CLASS= NTUPLES
##ORIGIN= UXNMR, Bruker Analytische Messtechnik GmbH
##OWNER= root
$$ XWIN-NMR		Version 3.5
$$ Fri Apr 30 14:10:37 2021 Russian Standard Time (UT+4h)  she@DPX200
##.OBSERVE FREQUENCY= 200.131506
##.OBSERVE NUCLEUS= ^1H
##.DELAY= (6, 6)
##.ACQUISITION MODE= SIMULTANEOUS
##.ACQUISITION SCHEME= undefined
##.AVERAGES= 8
##.DIGITISER RES= 18
##SPECTROMETER/DATA SYSTEM= spect
##.PULSE SEQUENCE= zg30
##.SOLVENT NAME= D2O
##.SHIFT REFERENCE= (INTERNAL, D2O, 0, 15.7039)
##AUDIT TRAIL= $$ (NUMBER, WHEN, WHO, WHERE, WHAT)
$$ ##TITLE= Audit trail, XWIN-NMR		Version 3.5
$$ ##JCAMPDX= 5.01
$$ ##ORIGIN= Bruker BioSpin GmbH
$$ ##OWNER= she
$$ F:/spectra/data/she/nmr/H-F/1/audita.txt
$$ ##AUDIT TRAIL=  $$ (NUMBER, WHEN, WHO, WHERE, WHAT)
(   1,<2021-04-30 14:08:05.12 +0400>,<she>,<DPX200>,
      <created by zg, POWCHK disabled, PULCHK disabled
       configuration hash MD5:
       00 E9 B6 7A A2 85 ED C7 34 08 36 98 17 FE 4E 26
       data hash MD5: 16K
       51 F4 C7 56 96 BC E0 40 B1 A9 7E D3 38 6E FE CE>)
$$ ##END=
$$ 
$$ hash MD5
$$ 6D 67 7A 05 6B DB DF 78 8F 0D F1 70 A9 D0 38 84
##$RELAX= 
##$RELAX= 
##$RELAX= 
##$RELAX= 
##$RELAX= 
##$RELAX= 
$$ Bruker specific parameters
$$ --------------------------
##$DU= <F:/spectra>
##$EXPNO= 1
##$NAME= <H-F>
##$PROCNO= 1
##$TYPE= <nmr>
##$USER= <she>
##$AMP= (0..31)
100 100 100 100 100 100 100 100 100 100 100 100 100 100 100 100 100 100 
100 100 100 100 100 100 100 100 100 100 100 100 100 100 
##$AQSEQ= 0
##$AQ_mod= 1
##$AUNM= <au_zg>
##$AUTOPOS= <>
##$BF1= 200.13
##$BF2= 200.13
##$BF3= 200.13
##$BF4= 200.13
##$BF5= 200.13
##$BF6= 200.13
##$BF7= 200.13
##$BF8= 200.13
##$BYTORDA= 1
##$CFDGTYP= 0
##$CFRGTYP= 5
##$CHEMSTR= <none>
##$CNST= (0..31)
1 1 145 1 1 1 1 1 1 1 1 1 1 1 1 1 1 1 1 1 1 1 1 1 1 1 1 1 1 1 1 1 
##$CPDPRG= <>
##$CPDPRG1= <>
##$CPDPRG2= <>
##$CPDPRG3= <>
##$CPDPRG4= <mlev>
##$CPDPRG5= <mlev>
##$CPDPRG6= <mlev>
##$CPDPRG7= <mlev>
##$CPDPRG8= <mlev>
##$CPDPRGB= <>
##$CPDPRGT= <>
##$D= (0..31)
0 1.2 0 0 0 0 0 0 0 0.06 0 0.03 0 0 0 0 0.0002 0 0 0 0 0 0 0 0 0 0 0 0 
0 0 0 
##$DATE= 1619777284
##$DBL= (0..7)
120 120 120 120 120 120 120 120 
##$DBP= (0..7)
150 150 150 150 150 150 150 150 
##$DBP07= 0
##$DBPNAM0= <>
##$DBPNAM1= <>
##$DBPNAM2= <>
##$DBPNAM3= <>
##$DBPNAM4= <>
##$DBPNAM5= <>
##$DBPNAM6= <>
##$DBPNAM7= <>
##$DBPOAL= (0..7)
0.5 0.5 0.5 0.5 0.5 0.5 0.5 0.5 
##$DBPOFFS= (0..7)
0 0 0 0 0 0 0 0 
##$DE= 6
##$DECBNUC= <off>
##$DECIM= 32
##$DECNUC= <off>
##$DECSTAT= 4
##$DIGMOD= 1
##$DIGTYP= 9
##$DL= (0..7)
0 120 120 120 120 120 120 120 
##$DP= (0..7)
150 150 150 150 150 150 150 150 
##$DP07= 0
##$DPNAME0= <>
##$DPNAME1= <>
##$DPNAME2= <>
##$DPNAME3= <>
##$DPNAME4= <>
##$DPNAME5= <>
##$DPNAME6= <>
##$DPNAME7= <>
##$DPOAL= (0..7)
0.5 0.5 0.5 0.5 0.5 0.5 0.5 0.5 
##$DPOFFS= (0..7)
0 0 0 0 0 0 0 0 
##$DQDMODE= 0
##$DR= 18
##$DS= 0
##$DSLIST= <SSSSSSSSSSSSSSS>
$$ [...]
##$SUBNAM2= <"">
##$SUBNAM3= <"">
##$SUBNAM4= <"">
##$SUBNAM5= <"">
##$SUBNAM6= <"">
##$SUBNAM7= <"">
##$SUBNAM8= <"">
##$SUBNAM9= <"">
##$SW= 16.9725357007746
##$SWIBOX= (0..15)
0 0 2 0 0 0 0 0 0 0 0 0 0 0 0 0 
##$SW_h= 3396.73913043478
##$TD= 16384
##$TD0= 1
##$TE= 0
##$TE2= 300
##$TE3= 300
##$TEG= 300
##$TL= (0..7)
0 120 120 120 120 120 120 120 
##$TP= (0..7)
150 150 150 150 150 150 150 150 
##$TP07= 0
##$TPNAME0= <>
##$TPNAME1= <>
##$TPNAME2= <>
##$TPNAME3= <>
##$TPNAME4= <>
##$TPNAME5= <>
##$TPNAME6= <>
##$TPNAME7= <>
##$TPOAL= (0..7)
0.5 0.5 0.5 0.5 0.5 0.5 0.5 0.5 
##$TPOFFS= (0..7)
0 0 0 0 0 0 0 0 
##$TUNHIN= 0
##$TUNHOUT= 0
##$TUNXOUT= 0
##$USERA1= <user>
##$USERA2= <user>
##$USERA3= <user>
##$USERA4= <user>
##$USERA5= <user>
##$V9= 5
##$VALIST= <valist>
##$VCLIST= <CCCCCCCCCCCCCCC>
##$VD= 0
##$VDLIST= <DDDDDDDDDDDDDDD>
##$VPLIST= <PPPPPPPPPPPPPPP>
##$VTLIST= <TTTTTTTTTTTTTTT>
##$WBST= 1024
##$WBSW= 4
##$XGAIN= (0..3)
0 0 0 0 
##$XL= 0
##$YL= 0
##$YMAX_a= 82374
##$YMIN_a= -60699
##$ZGOPTNS= <>
##$ZL1= 120
##$ZL2= 120
##$ZL3= 120
##$ZL4= 120
##$ABSF1= 10
##$ABSF2= 0
##$ABSG= 5
##$ABSL= 3
##$ALPHA= 0
##$AQORDER= 0
##$ASSFAC= 0
##$ASSFACI= 0
##$ASSFACX= 0
##$ASSWID= 0
##$AUNMP= <proc_1d>
##$AZFE= 0.1
##$AZFW= 0.1
##$BCFW= 1
##$BC_mod= 2
##$BYTORDP= 1
##$COROFFS= 0
##$CY= 11.3945322036743
##$DATMOD= 1
##$DC= 2
##$DFILT= <>
##$DTYPP= 0
##$F1P= 15.9154993809931
##$F2P= -4.1035820241983
##$FCOR= 0.5
##$FTSIZE= 0
##$FT_mod= 4
##$GAMMA= 1
##$GB= 0.15
##$INTBC= 1
##$INTSCL= 1
##$ISEN= 128
##$LB= 0.24
##$LEV0= 0
##$LPBIN= 0
##$MAXI= 10000
##$MC2= 0
##$MEAN= 0
##$ME_mod= 0
##$MI= 1.114404
##$NCOEF= 0
##$NC_proc= 0
##$NLEV= 6
##$NOISF1= 3.799351
##$NOISF2= 2.8
##$NSP= 1
##$NTH_PI= 0
##$NZP= 0
##$OFFSET= 15.70392
##$PC= 1
##$PHC0= -11124.91
##$PHC1= 16.00103
##$PH_mod= 1
##$PKNL= yes
##$PPARMOD= 0
##$PSCAL= 0
##$PSIGN= 0
##$REVERSE= no
##$SF= 200.130013532006
##$SI= 16384
##$SIGF1= 3
##$SIGF2= 2
##$SINO= 400
##$SIOLD= 16384
##$SREGLST= <1H.CDCl3>
##$SSB= 0
##$STSI= 0
##$STSR= 0
##$SW_p= 3612.71676300578
##$SYMM= 0
##$S_DEV= 0
##$TDeff= 0
##$TDoff= 0
##$TI= <>
##$TILT= no
##$TM1= 0
##$TM2= 0
##$TOPLEV= 0
##$USERP1= <user>
##$USERP2= <user>
##$USERP3= <user>
##$USERP4= <user>
##$USERP5= <user>
##$WDW= 1
##$XDIM= 8192
##$YMAX_p= 0
##$YMIN_p= 0
$$ End of Bruker specific parameters
$$ ---------------------------------
##NTUPLES= NMR FID
##VAR_NAME=  TIME,          FID/REAL,        FID/IMAG
##SYMBOL=    X,             R,               I
##VAR_TYPE=  INDEPENDENT,   DEPENDENT,       DEPENDENT
##VAR_FORM=  AFFN,          ASDF,            ASDF
##VAR_DIM=   8192,          8192,            8192
##UNITS=     SECONDS,       ARBITRARY UNITS, ARBITRARY UNITS
##FACTOR=    0.0002944,     1,               1
##FIRST=     0,             0,               0
##LAST=      2.4114304,     0,               0
##MIN=       0,             -60699,          0
##MAX=       2.4114304,     82374,           0
$$ Real data points
##PAGE= N=1
##DATA TABLE= (X++(R..R)), XYDATA
0@%%%%%%%%%%%%%%mJ2j6J6j6J6k4L2l2M0m8N6o4P2q8J01j12J27j45J65j84K08
36A12k36K62k92L26l63M04m49M97n47O03o67P35q10Q95r84J083j195J316j454
55g64J611j790J993k228K508k842L250l766M434n340O646q689J2343k0782P4415
70F0999K1375j43073P3628K77k2575L5399l0408m444K8417j9000J7487k2231j3124
83a7273L0980j7942N951K2300l9288J0939K3545j6885l160o216N570J8626j0799
96F348K931j2905j5468L8902k108l4465J6589K759M25O959k0833O047Q389r207
110e637J3987j4638j1016K7457j0508p474J8660j9045q102K3864J517j4153l584
123h672J0291O114l144l946j0365K910J9393k928j7093L056J2739n572r855O382
$$ y = [0, 0, 0, 0, 0, 0, 0, 0, 0, 0, 0, 0, 0, 0, 0, -4, 8, -8, 8, -8, 8, -16, 16, -16, 24, -24, 32, -32, 40, -48, 53, -59, 68, -77, 88, -96, 112, -124, 138, -154, 172, -191, 213, -236, 261, -286, 317, -350, 385, -425, 470, -514, 569, -626, 690, -764, 847, -943, 1050, -1178, 1330, -1512, 1738, -2028, 2406, -2934, 3712, -4977, 7366, -13416, 60999, 82374, -60699, 12929, 13206, -9369, 26030, -4378, -8822, 19595, 595, 18082, -4149, -17273, 13707, -4235, 1716, 24016, -15272, -4333, 19212, 2327, -833, -7049, -1479, 17147, 6348, 9279, -3626, -19094, 19808, 17700, -16765, -176, 2583, 3008, 9967, -10866, -4819, 3570, -5637, 8350, -6288, -17304, 10153, -355, -7829, 10831, -8214, -16316, 7548, 9065, -5088, -8672, 1619, 7733, 4589, 643, -9722, -6812, 12581, 9653, -7440, -4384, 8355, 2783, -7072, -690]
137f90K12n202J0858K448j3089j506M485m56L359L145p409l424J3884K903j7871
152h353j558J2183L492J303m283p481M535O998j245q917k458J4575R67j2544M691
167A905p46p002R340J112o985J083j345L419K435p579p15l73O168Q066j5304n609
183a2130J5769p98p127Q40n65K691J777m24k955m891P905L662r742K994K078o373
199g289P253M212r551j658N674J586k346j520Q98j847N424O447j2818n733J5392
214D124O13p884L676J80r78M054o28n346m31O978K900o462J244K259o521M415
230B193N691p878j519O081R41k137l860j522K690M073J130p225k967R718k88r549
246d428L473L710l120J587K514l955m346L798M956m075l255L275j709J449L467
$$ y = [-690, -478, -5680, 5178, 7626, -5463, -6969, -2484, -2940, 419, 3564, -3845, -7269, 6615, 9518, -8353, -9911, 2272, 5764, 7067, 2784, -4697, -162, 6836, 5591, -3326, -5784, 8791, 9758, -2786, 1905, 1159, -5843, 3497, 4609, -2376, -1293, -2638, 781, 3216, -4363, -5078, -5451, 717, 8783, -6521, -12130, 3639, 2841, -4286, -3446, -4011, -1320, 457, 33, -2922, -7813, 92, 3754, -5988, -2994, -916, -7289, -36, 4176, -5375, -7033, -1359, 227, -2119, -3639, -2741, -4588, 836, 7283, -5535, -11268, 4124, 4737, -3147, 529, 709, -269, 3785, 3157, -2189, -2620, 4358, 7258, 796, 2040, 4299, -2222, 2193, 7884, 6, -1513, 4568, 5509, 3372, -488, -2010, 680, 4753, 5883, -1342, -4309, 5409, 5121, -4428, -955, 2755, -365, 1222, 3736, -219, -4565, -767, 4189, 114, -3141, 134, -1575, -126, 3341]
261C341p382j429P131q37l092j1j188J093K428R23m559l807P979L056r001J238
277d117M853k906J109J822l663j439M448K040k835j053K104k250K289L201n901
292b298j451P118J676m817j926K200J190j14J995k885k811P114N47p570K358K391
308B717k159K361J314l745j428K532K256k876k269K563M67Q67M13m539r41M489
324B022R94k442k434J773K122j445n58n60k074L568J961m842m38K381q51K11K56
341c56n97k396J673L887k763m432L886J104j337J819k654k243N136K366n268j743
357c918M334O27k529K585n98l017M133K265n137P9J907k36J087Q6r47j030J389
374A080K297k526l157M205r64L26J523k746j034L906l82k016j442K387K291l594
$$ y = [3341, -4041, -5470, 1661, 824, -2268, -2279, -3467, -2374, 54, 977, -3582, -7389, 590, 3646, -5355, -4117, 736, -2170, -1061, 761, -2902, -4341, 107, 2147, -688, -1741, 363, -1887, 402, 3603, -2298, -3749, 3369, 5045, 228, -1698, 502, 1692, 1578, 3573, 688, -2123, 4991, 5538, -2032, 326, 2717, 558, 2919, 4233, 488, -940, 1592, 3848, 972, -1297, 1266, 1733, 2600, 3013, -1526, -2467, 2022, 3016, 574, -1860, -87, 2035, 590, 32, -528, -2602, 966, 2927, -1915, -2353, 28, -823, -612, -356, -953, -3349, -1676, 2211, -552, -4984, -1098, 6, -1331, 488, -2166, -4409, 727, 3093, -2175, -3918, 416, 1043, -1486, 1099, 501, -2516, 1617, 3882, -1255, -1176, 731, 495, 1582, 1668, 721, -309, 1080, 3377, 851, -2306, 1899, 935, 1261, 2784, 38, -996, 2910, 2528, 512, -930, 1457, 3748, 154]
390A54k23R00k536K268L096l766q03J836K59J97j633k28q6K95K897k484m187L895
408a49J357k900Q85q12j060K624N49k374j817K587J700k564O88J016l256K767
424g59L121m806j317L638P97j946l16R27j299R24K477l334j469L447p23l7N71
441a04k116K39K444P25k567j685M108R58k839J131o2j176K753J29j380n91P38
458G05K509j470j458J289j104J327J748l265j32J484J30M88k165m07J693j330
474D2K396j684m044M871R27l588J332o64K91J493j669K37j429L90L941m163p53
491b074L497l795J523K868m253P48J063l51J595l154M64J627j494K770k351l579
507d896O531q06l362K435j544J092K000k328J166j098K54L404l041l18K939k857
$$ y = [154, -69, 831, -1705, 563, 3659, -107, -910, 926, 1185, 1382, -251, -479, -565, -270, 2627, 143, -4044, -149, 1208, -1692, -807, -1619, -2679, -55, 494, -1880, -3697, -1110, 590, -1974, -1286, -270, -3526, -759, 2362, -2444, -3761, -123, 674, -1272, -1588, -661, -1960, -1036, 1441, -1893, -3362, 85, -638, -675, -104, -2220, -1981, 463, 1188, -1379, -3064, 1044, 2002, -837, 294, 232, -944, 1809, 1938, 558, -33, 705, 3214, 1744, 286, 1575, 471, 1798, 3546, 281, 149, 1633, 1763, 2251, 86, -321, 1372, 42, 2438, 754, -3290, 1581, 2508, -1080, 252, -412, -121, 1372, -297, -60, -1489, -1099, 2842, -1321, -2074, 1423, -2372, -849, 2019, -2234, -1486, -423, -774, 821, -2333, -1869, -242, -1736, 1034, -1317, -4896, 1635, 829, -2533, -98, -1642, -550, 1450, -878, 288, -810, -556, 2848, -193, -511, 2428, -429]
523d29J757J898l574P87J049L83P44k961N53J979j232J034j162k037L682K7k545
540d7mM44J433j026r50J719k068J99K562k234o7L12q14J364K91j767n07R01K183
559A924k019k621K684N0j054J193j859o08K200L12j551j164J921M23k083J764
575d88k59j771K044L75j109P94q85M08J155l46k22j489J462K525l184n69K254
592F95j093J099n9j993J531N28j42K14j741J298R05k158K116n7k580K488J91n58
610F84k20j430K249N73k016J164j152N05K583l056j045K972j025m81J88n26P56
627G23o34O09k0k378K022O44k166J396j36k070K130O56j179o66J95R41j16n14
645e63j07p41J244R88k221j39J557l82l83N85o74P2M33P03n61j248J107M06p45
$$ y = [-429, 1328, 3226, -348, 439, 1488, 1871, 2615, -346, 207, 2186, 954, 1988, 826, -1211, 2471, 2498, -47, -51, 393, 1826, 800, -150, 1569, -499, -300, 2262, 28, -39, 273, -541, 823, 1114, -653, -1160, -259, 1924, -95, -2716, -32, 18, -1036, 157, -1702, -2310, -110, 202, -1349, -2513, -592, -169, -2252, -488, -747, -2518, -474, -99, -1208, -414, -1299, -891, 264, -82, -304, -1793, -331, 2194, -990, -1559, 695, -398, 701, 642, -1351, 180, 708, 566, 780, -961, 337, 1242, -916, 1200, 1143, -1437, 1051, 1242, 684, 464, -966, 1283, 1856, -160, 1004, -148, 357, 2940, -116, -1161, 1811, 786, 305, 493, -33, 723, 89, 698, 678, -1700, 322, 966, -1200, 196, 60, -2010, 120, 776, -403, -1069, -874, 67, -49, -563, -670, -1411, -167, 821, -1400, -1539, 18, -364, -747, -162, -836, -764, -331, 372, -189, -1437, -330, 76, -669]
664f69R23q28p29J420R31j347p95R96R16k49n72J31P6N86m4m98l19P07O42r12
684C66K7N92j020O41P36p64o22M23P90L5j078K30j12k38J433j138j504J854L82
703A033j381J54L53k57K78L64m21r28M55R69j249J44Q08j281N66J218j607m14
721a196N63M89k69l52K5J05K84M72r80o46J437N5r35R39n37j80O78l0r7m11L42
742b44Q90q50R4K56l72M43M34p94j51M58N38%r16M70N98k45K43j57j076J279K91
763A189r70o8O47m63K62L88q3p62JR57o25n33M06j48j48Q81r23q23R87M52o16
784Hm77M07N8l4K05k91m98M45L35l90l35O28q28J00Q70m14j256Q04P19k40l68
805e52p1J76J65J89n36k52P34L43m61n22L96L61r0L22n25J4N01j23j36j07K82
$$ y = [-669, 254, -574, -1303, 117, 1048, -299, -1094, -98, 818, 569, -3, 128, 204, 790, 746, 248, -71, 636, 1278, 366, 393, 985, -35, 606, 1342, 578, -44, 379, 1169, 1204, 126, 356, 244, 6, 1439, 301, -1203, 651, 1033, -348, -194, 159, -98, 180, 544, 123, -805, -350, 619, -630, -486, 322, -959, -393, 825, -782, -1196, -633, -144, -413, -765, -740, -635, -351, 121, -859, -1505, -68, -13, -948, -9, -546, -726, -48, -78, -175, -586, -244, 646, -204, -110, 146, -226, 217, 651, -143, -294, 164, 702, 702, -214, 256, 854, 609, 852, 695, -381, 898, 1189, 219, 151, 798, 335, 597, 985, 902, 140, 141, 1098, 473, -60, 346, 198, 50, 931, 8, -815, 172, 624, 8, -469, -62, -4, -38, 167, -124, -622, -177, 158, -232, -567, 61, -767, -667, 203, -211, -1467, -663, 56, -184, -552, -623, -447, -282, -93, -629, -881, -147, 196, -265, -787, -391, -30, -120, 202, -323, -309, 192, 69, -67, -174, 108]
826A08n1L30J84q5q06M78P74n80m56L22L7J69P2r7o22M16M26m37n06R22l2n73
848gL15nm75M00L79l86m30L47J24l37K98k94m82N04P12j053k93M38L04k6j51k08
870c26k73L05L47q29L27L34m23L52P4l73J04M5J88Q6k79n2M88k38M09m28o1L90
892A67J34l34p01O87L40k07m86M22l24L69J69j59l11L56R0J80l81N24o00K00O04
913G39k20q78P38M68n76K20k97m05P68j67o0k70P8Q69j131L26L47p19K44N61r27
934b92R1L36j72j3J59k64k51J34N93n97m44Q75k39n1J04n27K10L12l7k74k31L22
956b56J57m28N16j78n01M09K06l80J24R3P9L05m17q4J37N4O45p18k19R24r4m04
978c0j4K02L71o86O45o8p35R36k8p16N97R9m80J42J62L07p97J40N32l88m5K27
$$ y = [108, 57, 387, 571, 486, -320, 158, 932, 352, -104, 218, 255, 424, 496, 399, -223, 193, 619, 182, -324, 598, 566, -7, 308, 303, -172, 228, 607, 221, -209, 138, 262, -75, 223, -71, -553, -49, 663, -390, -683, -245, 59, 33, -118, -326, -599, -294, 53, -776, -449, -115, -538, -186, -112, -485, -381, -336, -148, -62, -341, -393, 95, -143, 266, -162, -223, 167, 301, -33, -734, -47, 293, 86, -400, 22, -302, 67, 236, 77, -234, 122, 212, 392, 11, 535, -65, 135, 739, 519, -359, 379, 847, 271, 491, 194, -211, 557, 390, 330, 60, 138, 1007, -124, 202, 549, -170, 74, 635, -292, -201, 135, -37, -50, 109, -155, -406, -272, 321, -276, -720, 155, -84, -135, -31, -558, -348, -36, -73, -347, -578, -256, -99, -527, -11, -189, -690, -281, -75, -455, -331, -238, -159, 146, -271, -355, -218, -164, 481, -237, -456, 468, 374, -30, -44, 158, 529, -157, 488, 420, -315, 621, 593, -123, 474, 573, 93, 235, 397, 704, -93, 47, 579, 191, 146, 373]
1000C73o66O42M51j063J70L85N1l18k24M35j44l65M39m98j40M87l43Q1M94q24
1020e77M39PL0Q0o05K74M66o90k5M01m45P06m03l43O45k25R2J07o65P67J3o35
1042e86R56k84m03L95m43J60M53n51L37l27P06K5r62L81R63o30j33L42l61N28
1062E66l69l00J75nL96j13m80O80l68p43J012k19l91M28k78L85k79K2J70k66K18
1083B41l50l85N77K40m90O0J38j28L67o53L84l53L8K88m97K04L89k91L3L01m44
1104c31k0P7K6K10k92M2K95k75L65m03q3M17O6m57K37n8K23m80M32J4k36L05L93
1127D67o64J21N08m52J62J47j00j68K01K59q4m84M57l49K34K81n21l94R43l21
1147B43K3k29n6M34n19L45J30m59K90L34q13L70Q7k93K57L8l49K83l90M75l20
$$ y = [373, -293, 349, 800, -263, -93, 292, 343, 25, -199, 236, 92, -273, 166, -332, -472, 15, -328, -247, 247, -577, -138, -131, -101, -21, -626, -352, 114, -576, -601, -200, -645, 61, -342, -685, -40, -265, -173, -66, -731, 36, 49, -586, 370, 86, -317, 78, -365, -205, 248, -303, 34, -293, 413, 438, -524, -143, 820, 190, 57, 399, 38, 566, 197, -103, 72, 67, 463, 350, -130, 550, 182, -561, 451, 232, -159, 269, -9, 376, 97, 119, 289, 23, 241, -109, -494, 83, 323, -167, -107, 31, -97, 270, -383, 1, -352, -314, -26, -523, -319, 70, -221, -188, 113, -331, -351, -274, -248, -38, -330, -288, 7, -268, 97, -306, -389, 28, 94, -363, -126, -184, 39, -441, -9, 5, -231, 74, 467, -197, -76, 432, -20, 142, 289, 189, 21, 222, 481, 397, -87, 370, 21, 255, 536, 15, -379, 564, 243, 266, 37, -19, 415, -104, 241, 371, -88, 202, 536, -277, 93, 180, -113, 144, 182, -167, 116, -274, 201, -119]
1168a19r2J13o9o9N49o60Q3N4J37o8M1j30K09j78j73L82k75j0K27j36j03K00k5
1191a12j65J16K27o7q0J94K5m24K22K11p8J5j26J7J86j63j97K59L6M07l53j97
1213d7J16o6K06J54k01J47O9l59J16j09K48j44o9J37j37o4RK01j97J77k08r6K4
1236i3N04m40l76L72J84m87R8J71p4K65m3j70j64K1P6l3P3j75r5J57J64k01J21
1259a45l5M3o5j72K54J47J8k57r9J88L48J3k64j37K68j81P1J32q3J65j37J91j21
1282A42m2L6k98K99J24j87K0L07k92J32k52J46o2N9K76k32q5J29J60k77q0J45
1304A68K7J40k77m4q8J12j90J71N2r8k29K12K74l24j11J24K9K5J03k16K49j69
1326f0j29K40k93K72q7k11j44J35J38n7R6K26n52J75K84j05J51l53L46l98M05
$$ y = [-119, -211, -98, -167, -236, 313, -347, -264, -210, -73, -141, -100, -230, -21, -199, -372, 10, -265, -275, -48, -184, -287, -87, -112, -277, -161, 66, -1, -81, 113, 138, -286, -64, 147, 69, 84, -42, -25, 161, -2, -199, 60, 96, 503, 150, -47, 69, 3, 209, 363, 162, 309, 378, 19, 135, 26, 274, 130, 61, 198, 61, -3, 6, 207, 10, 187, -21, -117, -93, 411, -29, -405, -33, 151, -336, -238, -67, -141, 124, 81, -89, -253, -232, -156, -189, -116, -291, -386, -229, -65, -266, -145, -180, -137, -202, -374, -120, 27, 45, -212, -311, -123, 225, 238, -26, -163, 105, -76, -5, 127, 44, 209, 72, 263, 142, 100, 136, -162, 137, 261, 74, 94, 401, 109, 241, -11, 135, 73, 132, 408, 176, 91, 220, 380, 103, 23, 168, 195, 335, 58, 14, -74, 38, -152, 19, 71, -27, -256, -44, 230, -94, -205, -81, -52, -27, 76, -140, 109, -60, -189, 51, -242, 30, -57, -268, -412, -277, -139, -196, -100, 126, -426, -251, 33, -72, 79, -274, 72, -326, 79]
1347G9k30K4L01Qk61j02K90J24k46K69k58J63J41k57M4pK09j54j6J84J8n06L47
1370A64r7R6k2j20N1J8J46o7k73J68L10l46k08J55K22l63qJ81k33K50j32K0j23
1393b11J16R7k52L68k02k73K23q3J74k89J56L84l24J8Mk04K30L43m15pK97j24
1415B6j28j15K06j9l97M83j20nk79L18j59L06M4q4k19K11l3j73K37J57j98J42
1437B01k38l6O62m97j94K21P1P1k03J57q8j39M3L09j78P0P6n06M70j39q9m4K54
1460B54k79Rj51K20J54r2k48j7o8K22k6k85K65n0M35m72l10K71R2j56N70k56l56
1483b74J41p0O3K2K71j25qO5R5n20M20K8m85L53k9j68J38p8J16K65j74n8k3m6
1507h1J45j00R8NJ8j0j36K32j59o8j26M16j24J07n8j15L50qk52j03j48N81o39
$$ y = [79, -151, -127, 174, 182, -79, -181, 109, 233, -13, 256, -2, 161, 302, 45, 89, 82, 291, 137, 121, 305, 323, -183, 164, 67, 163, 141, 21, 72, 90, 236, 169, -104, 64, 374, 28, -180, -25, 197, -166, -174, 7, -226, 24, -108, -88, -211, -95, 2, -250, 118, -84, -357, -134, -217, -43, -332, -176, 208, -116, -98, -94, -298, -68, 275, -140, -147, 150, 26, -102, -217, -11, -30, -427, 56, -64, -69, -348, -30, -189, 117, 161, 77, -142, 69, 36, -137, 100, 257, 59, 201, -37, -73, 589, 92, -102, 119, 190, 261, 58, 215, 127, -12, 31, 340, 162, 232, 308, -198, 272, 133, 44, 0, 254, -25, -16, -167, 53, 207, 115, -133, -150, -218, 4, -22, -307, -42, -92, 343, -129, -439, -168, -76, -232, 338, 82, -274, -133, -203, -140, -118, 153, 28, 20, 85, 180, -340, 80, 108, -377, -24, -53, -221, -83, -161, -45, 220, 46, -12, -35, -81, 64, -36, 62, 67, 85, 75, -61, 171, 12, -56, -182, 234, 110, 217, 159, 44, 394, 386, 134, 31, -117, 464, -175]
1530a75Q2O3K0J3K04m02K06O0M4o8L01j80k96j3N49r10N58k7j52J83j0k00l9K69
1554H0l16N6J23N9R5k71R0N14n71O2J02j85J16o8J93l55L90J07l76K73J53k44
1576B7j38L81l36o3K19p1l3o3O0j02K59k00M1J1K4Q3l9k35J85M3Q2J7k25K87%
1601B14m58nK27K67j77j36N5J74l72K44j84J90r7k02K43q7L11o4k43J08Mk91K85
1624FMl7m1P7l1P7o6j04k4J28Lj46J35J37k11K20k65K7J68j36r5J64k0K23m10
1649b17J62K51k37M3l24N68l02q6J23M2Q2L5k68j66K95q0J16j03L59k20N9kK2
1672A52m2k63J42J28k42L87n11K97q9Q1j26R4l7P4mo2L08m50J79R3q5J75k0l95
1696b16J3K54k44K0k6J26j66N7J69q7k8P6j43J58o7J40J45j96O7j56j5K79j40
$$ y = [-175, -93, -30, -10, 3, 207, -195, 11, 71, 115, 47, 348, 168, -128, -141, 408, -502, 56, 29, -123, 60, 50, -150, -189, 80, -236, -180, -57, 2, 97, -174, -84, 430, -141, -79, 23, -162, -46, -114, 79, -276, 114, 221, -155, 118, 271, 27, -111, 270, -66, -129, 90, 19, -14, -77, -17, -119, 140, -60, -19, -8, 16, 99, 60, -175, 10, 53, 135, 152, -73, 214, 214, -244, -249, -22, 245, 68, -68, -13, 161, -211, 33, -151, 39, -58, -260, -17, -104, 207, 143, -100, 8, 12, -279, 6, 10, -27, -68, 9, -22, 55, -11, -115, -139, -11, -8, -154, -19, 118, -93, 127, -138, -111, 57, -79, -174, -10, -30, 193, -217, -55, 196, -41, 2, -322, 246, -56, -142, -19, 23, 105, 140, -128, -294, 1, -79, 37, -66, 293, 73, 132, 130, 152, 110, -153, -11, 117, -125, 262, -249, 48, -41, 40, -86, 8, -29, 45, 41, -21, 287, -163, 16, 109, 24, 199, 179, -216, -203, 51, -193, -173, -199, -73, -239, -182, -13, -100, -128, -52, -195, -37, -104, 36, 181, -15, 52, -104, -119, 160, 20]
1719B0J63k95J2J02r2K17j71n3J80Qk56l3K64j2n2r2k77L31K54k5k1j06k26K9
1743a31J18Q4o0j1K10Pk73j10J18R3K16l6l73K6K49k40L01k60P5l8Q3Q5J32m15
1767a50R1Q4k2j62N5J66r2%J15k52K81j23k86K78oJ88j85m2l3J31j81J71k77L18
1791F7Pk1m4k40j32J89J56l0J48l97K86Kk26K68j73K02j39J30Q4L7J08J5k81K26
1815B42j37Qr0J73l1k68KQ7p0J01j14j00R9M6J6p4J10L65l76jn4K1K91m06J58
1840br5PJ86Mj42J30m2j14J36l27J44K94k28j14L55j39m27L00J39k37R6N5J61
1863A40j57L9P7j42K01o6l3l7K06k27M0j85J2Q3J27on4j16K0J09k2J47J42k37
1887F1q3N0j45P8L51J05l02Q3j90j2J72k91M89n52K58K07o18K69J49O7p1mJ34
$$ y = [20, 183, -112, -100, 2, -90, 127, -44, -97, 83, 91, -165, -198, 66, 54, 2, -90, -367, -36, 218, 193, 172, 66, -160, -131, -13, 71, 11, 0, 210, 217, -56, -166, -48, 45, 261, 225, -148, -122, 127, -113, 188, -72, 3, -35, 48, 133, 265, -150, -59, 25, 3, -159, -104, 62, -30, -30, 85, -167, 114, -9, -295, -17, -23, 165, -20, -62, -95, 36, -145, 26, -251, 67, 74, 53, 9, -231, -363, -174, -18, -48, 100, -297, -11, -9, -235, 33, -140, 62, -77, 53, 137, 174, 282, 297, 16, 242, 105, 113, 23, 196, 165, -103, -101, -14, -84, 17, -97, -197, -98, -52, -36, -110, 0, 365, -11, -12, -66, -45, 246, -160, -2, -97, -90, 96, 100, -42, 88, 46, -68, 68, -259, -115, 179, -49, -163, 192, 53, -374, -74, 65, -172, -76, -21, 140, -17, 22, 99, -43, 158, 92, 59, 22, 228, 1, 41, -144, -132, -49, 78, 72, 18, -98, -78, 31, 9, 156, 298, 61, -22, 28, -117, -39, 312, 417, 115, 198, 8, -4, 168, -123, 366, -186, 72, 279, -339, -70, 79, 146, 75, 71, 205]
1910B05l37K80j60K24j92o4j66K39j24L0j85J59Q8J8j41j41N5K21O3l22P3k7Q7
1933a17N5J7M8p1K28r5j05j40L86j59J44n4J90l84J2K57k70J71J25n55L47Kj53
1956a21K86l17q4M08k82j8J51oq6J60j57J64j76J10p2J7L2l8J70j61m2L82n27
1979b07K10k52O4L46k24K00r3j77R1J53l25J30l9J7O1J0J52j03j09mj69M9J37
2002h2J6J64j20n8M8J17L9JJ8j27J79m98J71J14K5r2P3LJ90L3m31JK49k3J01o2
2028D9J05l74K34p0L3J85j13j25K32k05Q2j58n0J31J66k49l2J05J25O4j76J66
2050A25j14LK38pj49j2r8r0J81q7L6L7n8N3p3l5L8j11K13j23l4J5K44j94j40j9
2076a61K44J8k36K40k54j8L51m33M81m00p9J9L45m6K50l06m2J36k51N20l36j99
$$ y = [205, -132, 148, -12, 212, 20, -44, -210, 29, -95, -65, -250, -91, -3, 15, -126, -267, -212, 9, 72, -250, -177, -204, -117, -62, -45, 3, -68, 160, 65, -40, -180, 206, 47, 191, 137, 327, -57, -45, 212, -58, 113, 238, -317, 30, 32, -121, 165, -152, -236, 172, -110, -128, 23, 17, -69, 91, -66, 98, -78, 32, -40, -23, 9, -29, 141, -20, -62, 320, -207, 3, -249, -185, 161, -63, 137, 44, -133, -42, 111, -214, -84, -123, -106, -45, -35, 117, 14, -95, -99, -268, -219, -82, -66, 98, -22, -80, -32, 85, 124, 125, 143, 16, 195, -303, -132, -18, 7, -85, -12, -9, 181, 214, -217, -216, 33, 10, 111, 49, 154, -220, 14, -56, -23, 162, 49, -76, 156, -49, 33, -125, -175, -44, 122, -127, -159, -54, 71, 135, -41, 125, 11, 14, 252, 245, 96, 84, -14, -104, 77, -10, 26, 63, 5, 58, -15, -50, -12, -123, 90, -33, -67, -52, 192, -2, -142, -161, 83, 101, -135, 105, -149, -167, 184, -249, 232, -168, -247, -228, 117, 71, 321, 15, -27, 109, -142, 378, 42, -157]
2098a57K53j15J25J71j65qk15n2J55J54j59J63j27J87j32P7j38K6K1k40K43N5
2120A22p7q1K42O4j9q2Nj59j69J18N3L4m46N66l94K31l04L10j75J56k42K79N0
2143H2Q8q5o6j25m5K92k73J16L4j54P7J28K2k04j13L15k81K30L3q6K38k14P5j56
2167g2K24j29jP2K7o3q7kJ45J38l19j30K01N2J59j00j42J11j18N8j78qM95m04
2191g1K1j49J16M9o1K06ol11NL01K3j62l64M46j76L63l01R5k18K53J64k70K90
2214B43j49k45j06M43k89p3J00O0m4r6J67j70M3J47m7J94j31j51QJ20N3j24R7
2237E0k11j5J60j71K33K62k68J16m0j32J56m03J81J51J09p2n4Nl5q9L2K1J92p1
2261A07n3R0P4k38j26J08k8L37Ol75J79j14j8m4O8L1j25K68N3l11J33j1L5m29
$$ y = [-157, 96, -19, 106, 277, 112, 104, -111, -163, -8, 146, -13, 150, 23, 210, 78, 155, 17, 43, 64, -176, 67, 122, 45, -36, 206, 270, 251, 169, 174, 15, -154, -36, 17, 51, -395, 171, -223, 8, -296, 14, -161, -5, -247, 32, 82, 170, 85, 19, -106, -151, 141, -132, -16, 18, -136, -59, 69, 91, -113, -226, 89, -192, 38, 71, -15, 223, 9, 84, -72, 152, 23, 22, 94, 121, 58, -29, -31, 114, 252, -67, -197, 4, 56, 215, 115, -27, 84, -34, 24, -154, -162, 333, -71, -50, -199, -83, -34, -95, 111, 105, -206, -201, 100, 123, -39, -403, 43, -133, 230, -71, 24, -194, 59, 223, -47, 243, 94, -151, -257, 186, -103, -176, -76, -16, -60, -156, 11, -159, -116, 31, -16, 178, 47, -104, -96, 24, 77, -47, 50, -161, -176, -16, -187, 46, 308, 40, 156, 116, -16, 140, -263, -82, 69, 178, 106, 52, 57, 22, -67, -35, -14, 178, 107, 54, 144, 218, -20, -146, -38, -66, 271, 277, -98, 81, -33, -51, -95, -27, 4, -121, 147, 200, -111, 22, 11, 46, -383]
2285c83M37qj48Pm7L8J77j33J29k5j93J25k01L74j03K77k56j51R8J05O9p1q3R2
2309A26j47J33o8J30k59J78m76L36j34J11M6j79L38j99J37J37j71J35l7Q8j33
2330I2Nj59K43j60j88J61K94l41K10q5k07N1n2K02j25J58r6R3m0p9j43J44M1J5
2354C4j6m3n1J67j96J55n2nj89K22m7J8M8j76J20r3J06K04j55j34J2N4k98R5M45
2379B25j94j11kQ3q5K33L4k35M0k04K47J16j56J25n2J91k01Q4k10J09M7j58m9
2402a23J53k37J41J73J30l01L11m54K60R5j89OJ59p5nJ59k50J4J01r2n3L75m01
2425a03J66k49N5J42k04K65j75K16j87J21k87L86j66K38j98o2L25m53J26j7R9
2446C8nPr2K57k79N4o2J08p3j26M9R9L5J7n7O5j05k25J74P8j2K1p2K33j76J52
$$ y = [-383, 54, 46, -102, -95, -142, -104, 73, -60, 69, 44, -149, -24, -225, 149, 46, 323, 67, -84, 14, 119, 188, 117, 34, 126, -21, 112, 44, 174, -85, 93, -383, -47, -181, -70, -24, -203, 135, -64, 73, 210, 39, 174, 137, 225, 92, 97, -62, 181, 21, -167, -6, 288, -53, 157, 72, -135, -84, -136, 66, -59, 99, 3, 96, 56, -23, -166, -22, 19, 34, 18, -25, -76, 91, -105, 50, -2, -7, -196, 26, -21, -3, 45, -131, -11, -104, 2, 206, 51, -83, -71, -17, -315, -220, 225, 31, -80, -82, 1, -84, 149, 183, -52, -12, -216, 31, 147, -9, 116, 64, 255, 54, 138, -72, 37, 84, -74, -123, 30, -207, -66, 107, 237, -64, 247, -207, 53, 148, -41, -35, 124, 49, 44, 203, -47, -33, 68, -24, -77, 298, -103, 63, -186, -131, 11, -193, 72, -103, 113, -74, 47, -240, 146, -20, 218, 20, -42, 283, -170, -44, -61, 38, 33, 40, -52, 205, -74, -20, -82, 26, -47, -173, -124, -25, 10, 27, -30, 35, -70, -295, -121, -43, -55, -34, -106, 127, -49, 103]
2472A03rj5j16M8k12J47JK83m33J61j86L98J55l70M3k49J64L13p6j13J13j7k40
2495a07J43O3j26J42J31j64n3Q1k88K58O7j12O3j74R1j23R4k70N2L71k43J02J3
2518A1J63J28k37K73l62q5R0q2p4J52k45L67l81M28j30Q6J75j07l9l17K71p4J87
2541A98l07J13J43r7o6j47J43K6j63J92l2J17l23L81j04On1N8p7r1J35L6L4l01
2565a77L39j66K2p7j17K47j37P2K0Q0l4j09J37l3j13R3J21k02J7j73Q4n4J99o
2589C3r6K7j33o7K65Nm3J13j48j85K99k49K0J13j74R6K72l43J96Q5l1j6j39j37
2613b37K03j59K78l28o0M28j03J32k53J12P1j73L09j57j58J67j74J65k28J34J6
2634a5N4J66j89O3r4j9j08J24O8P0j57l3K66k11l7j25J34K44k33j29L42r3J6J93
$$ y = [103, 94, 79, -37, 11, -201, -54, -53, 230, -203, -42, -228, 170, 325, -45, -2, -251, -87, 226, 150, 37, 150, 133, -107, 36, 99, -27, 115, 246, 82, 29, 110, -178, 80, 147, 35, 98, -76, 15, -108, -14, -284, -232, 139, -104, -2, 11, 174, 302, 65, 338, -24, -109, -19, -101, -175, -23, -268, 99, -282, 146, 16, 102, 277, 170, 131, -186, 85, 11, 198, -109, 4, 147, 50, -16, -163, -20, 6, -157, 35, 3, 120, -203, 178, 74, 80, 29, 87, 10, -81, 54, 90, 124, -177, 162, -4, 18, -59, -176, 71, -66, 6, 26, 106, 72, -37, 100, 67, -46, 47, 168, -34, -17, -190, -106, -160, 39, 33, -63, -36, -169, -236, 29, 34, -9, 104, -44, -229, 70, -179, -159, -46, -220, -124, 148, -195, 1, 86, 55, 39, -100, -237, -34, -193, 85, -243, -303, 125, 22, 154, -99, 13, 84, -89, 220, 63, -95, 72, -102, 63, -165, -31, -15, 39, 205, 16, 79, -15, -34, -142, -18, 50, 120, -37, -70, 196, -15, -52, -177, -43, 201, -32, -161, 181, 88, 104, 297]
2658B97n25o1M84r9j23j49J14R0j1k7K0j6j40K04L9j86N3J36k95M1K8K82k10j45
2682a99J89J12j19m5N1K73l93J50j9O2n1kO6k07K18O6j6k09m0M18m40J2P7OR5
2707E5j49M2j18K49r6K61n06K01K16k82J46o2J39r0N5l94L52n9K18j05k09L29
2729A93j64j64J40J59l46K37m9j50R6M9R4p7j07P0j94J92j42J6K3J67q9k5O4j4
2753b1j9P0L6l1J0q9j14m5K11j28J72j23j7K80k38k4K2k25QL09M1j67M9J99j67
2778aL1L5N1n4J72k02n4j2PJ28k46M82j55k63J75j76JR1J3j15J41P9k40O8L8q0
2804h6j00NL35j95M0k19L19k8r0J97k54P1K44l05J9N1M3J10k01o1K3QO2L9J31
2829A58k99J74k02M53m23J50l5r2L1q8J76j58M53m83L07k67K13n6ML3K23l86M5
$$ y = [297, -228, -289, 195, 96, -27, -176, -62, 28, 17, -10, 10, -6, -146, 58, 97, -89, -36, 100, -195, -154, -126, 156, -54, -199, -10, 102, -17, -62, -11, 262, -131, 19, 0, 62, 11, 9, 75, -132, 86, 152, 136, -73, -113, 305, -135, -123, -46, -40, 55, -94, -52, -170, 79, -17, 244, -262, -61, 155, -127, 19, -43, 96, 6, 61, -333, 19, -40, 178, 73, -136, 193, 29, -135, 5, 164, -182, 55, 6, -144, -48, 1, 95, 18, -89, -19, -213, -21, -163, -147, -124, 43, -46, -71, -7, -21, -40, 30, 66, 35, 45, -44, -158, -203, 8, -120, 52, -71, -88, 192, -46, -70, -48, -273, -265, 44, 85, -82, -33, 166, -1, 30, 65, 116, 62, 234, 32, -22, -34, -27, 101, -145, 337, 182, -81, 94, -82, -81, 10, 23, -92, 49, 128, -112, -44, -6, -86, -186, -181, 154, -41, -1, -220, 99, 71, -19, 178, -76, -5, 239, -66, -47, 4, 47, 157, -44, -105, -82, -74, -12, 27, 158, -141, 33, -169, 284, -139, 11, -24, -116, -85, -173, 3, -155, 298, -185, 122, -145, 68, 12, 16, 49, 272, -114, -69]
2852f9P7o1j27J04J68o1o7JO8J30N2m09K14J43r7K97m47K2J07L1J09j27k29L02
2876A31j98Lj04J34k2l9K91l05J43j28L03j30k47N2p6M82l28O8j11K15r7k44J78
2899b9K02p1Qj02k26M37J1j95%k02R3kK73j74l7J25n3l4n4J38rj16r3N3J72k66
2925a51J84K9J71m45K07K52j38j21j68J21N0J20o4K57j06j17r3m4Q1j10o5K21
2947G1p1k56J94p3J43q8j77J61K34j70k7j46K93k3l6J31l13J58L23k91R2l04o5
2970b40L00j09K63k66j64J02J06j5j13K94nk13P7R6k22m3j11K86J78Q2m80K78
2992H1o9j26J66N6J22j58P2k53j65M00j31K08l09J60j13o9K85km1l00M36r9k08
3015e7j00K09j0K18j85K25r6k06k44K95K11k60L9k06j17L86j40J95po23N20l26
$$ y = [-69, 8, -53, -180, -76, 92, 31, -36, -35, 33, 163, 215, -194, 20, 163, 66, 363, -84, -62, 45, 76, 185, 58, -171, 131, -67, -64, -168, -34, -56, -95, 196, -109, 34, -94, 209, 79, -168, -116, -192, 290, -38, 30, -81, 134, 37, -207, -29, 173, 102, 110, 8, -218, 219, 230, 35, 35, -167, -74, -76, 197, 23, -14, 111, 58, 24, -30, 108, 99, -17, -110, -57, 115, -151, 33, 62, 233, -212, -5, 247, 109, -12, -180, -59, -9, 111, 47, 304, 198, 81, -12, -56, 25, -85, -150, 71, 0, -256, -62, -135, 8, -80, -257, -96, 138, -32, -59, -205, 88, 65, 29, 160, -153, 5, 328, 37, 129, -175, -240, 60, -49, 214, -52, -216, -114, -8, -23, -136, 158, 153, -60, 17, 113, -109, -152, -263, 23, 201, 283, -197, 81, 12, -114, 52, 108, 230, 72, 144, -109, -274, 126, -5, 203, -106, 54, -59, -128, 157, 155, 114, -186, 250, 151, -57, -157, 52, 42, 260, 75, 300, 204, -2, -246, 49, 260, 0, 39, -167, -284, 102, -38, 157, 150, -473, 47, -279]
3037b79K08j46P1J37J08k13j40K11n3J03L6k15L00j00j0q7QM8q5J51j02K8n1M06
3061C34k30k31N6O9P2J06k26Q7N0j69K40j38j14L92m25J15k1N0K9j91L98l41Q0
3084hj37p8L06k02J12Q7k26K80m07L33r9Ql6Pp3N4j81N34l75J78L18m54p9K17
3108G9j39mK5J67j37R4l91K54j64K22j03Q2k39J84J81k88J98J7o7j55K54j13J37
3131I4k2j20PjM9Q2P4M1l07K14p5l34L39j20qj41J07Q5J03J46k32j55J68r0L39
3156B43o2O2m55K78j76J4N4J71k91K1J74P3o5NK46m46L24Q3l05q5K79l89N19k74
3180bo7j28L47Lj12j12J99l3k6k56P3J41j19K40j53J18k41j1K9P3K27k49k41R6
3204b04K26J5p6l4J46j73L62j57j83J84k31J59jj65L51k37oK1M5J67j17j25j5
$$ y = [-279, -71, -217, -146, -9, 99, -114, -254, -43, -96, 7, 43, -172, 128, 28, 18, -69, -61, -13, -98, 53, -49, -21, -72, 334, 104, -127, -71, -2, 70, 176, -50, 37, 87, -82, 158, 20, -94, 298, -127, -12, -33, 17, 46, -145, 253, -88, -8, -145, -223, 83, -119, -7, 80, -146, 134, -273, 60, -39, -31, -67, -60, -133, -79, -260, 274, -101, 77, 395, -59, -138, 79, -60, -64, -39, 128, -9, 85, -306, -52, -216, 6, -97, -15, -254, -70, 111, -177, 21, 38, -29, -184, 70, -43, 94, 72, -48, -41, -42, 7, 89, 163, 204, -103, 111, 36, -298, 41, -79, -87, -228, -121, -36, 67, 213, -19, -174, -6, -96, 243, 181, 243, -212, 66, -110, -96, -42, 129, -162, -141, 33, 106, 41, 46, 292, -154, 170, 253, -52, -137, 142, -247, 272, -2, -69, -197, 150, 153, 41, -71, 128, 95, 69, -187, -114, 27, -92, 148, -5, 113, -128, -139, -110, -37, 190, -59, -300, -204, 22, 37, -39, -73, 73, -100, 262, 105, -78, 106, -125, 34, 33, -132, 219, -18, -24, -3, 42, 209, 92, -33, -48]
3227d8O0L08l85M58k06j32J33k45p4J77J54L7l11K0j46K91k4j58L58p6l58J58
3249ij9qK67n2j12J98n22K86j93J70J25m09J57K65j49m3r2J10J33k2j77K68k54
3272h2j55J26J17J27k54J35j29r4K18M8k90J37J77k7J45l93O6n4M84k85j24K52
3294A45Q0k68k18M49k23Q1J53J7j72q1J43J60l75K07j71J18Rj74J21O7n9J59k28
3317f0N6O2j30K78o2J37k42r7k1O6L0K50l14R7j04r0J63J11J01k56r6J48k09J85
3341Ck23L46J10k72k82L58j4j59M0m1J36j29K7K89k76j75L43j06M9l27M19k94
3363a78M18l49J33j48K29k01J12J45j54k3K5J5K20m70K03q1J36O7O5j94k52M73
3385A91o0l2O1q2k25n5K64Oo9n1K09k29K10k26K39j51N7nj24J10J4n0J50j47L28
$$ y = [-48, 12, 320, -65, 393, 187, 55, 188, -57, -131, 46, 200, 237, -74, -54, -200, 91, 67, -91, 267, 191, -167, -9, -28, -36, 231, 179, 67, 265, -257, 29, -164, 6, 131, -278, -121, 144, -5, -48, -140, -30, 103, 81, -96, 172, -82, -237, -111, 6, 133, -121, 14, -115, -209, 9, 57, -233, -96, 81, 54, 199, -194, -128, -182, 302, 17, -107, 145, 225, -43, -261, 188, -35, 46, 199, 216, 44, -37, 106, 266, -109, 98, -73, 45, 54, -120, 1, 68, 9, 168, -60, -4, 58, -72, 206, 144, 281, 39, -58, -79, -13, 17, 267, -47, 50, -54, -144, 19, 130, 231, -25, -121, 27, -182, 3, -220, 126, 236, -36, -318, 40, 26, -133, -93, -134, 2, -127, -100, 189, -87, -262, 81, -25, 24, -303, 116, -178, 240, -109, 24, -124, 105, -96, 16, 161, 7, -16, 9, 24, 244, -226, -23, -104, 32, 99, 164, -30, -282, 191, 131, 99, 160, 78, -147, -202, 62, 68, -1, -52, 157, -72, 138, -88, 151, 0, 57, 52, -72, 38, 52, 2, 152, 5, 333]
3410C33k31j4k66Q8Q0j6j43M0J33k08K83k11K06j55J02N1M6K4J22l75K33J06l3
3433A95J80m58J94l61L93l07o2N03k51j4j13k5nJ52KJ63k11J03k06j0R2K6J66
3456A46j7m2j62P3j0j27J87J33o2j2l2o8r3J29K5m7J42n4l5m9n5K74m25n4J46
3481h9J4j13R7pL79m84l9K8M9J77j20N1j0MJ44o1j46k41L47J87j48J17j76l41
3505c81M00r0R6k72K40j62M8J6m3L4j20L56J56k51Mj78J10O7m3K59l93J22m2j81
3529b48P5N1K25l5j07P1L46l31L8l5O0M9N6r6j34K79k4k30j35K99k30Q1k6j5l6
3554e2r5K71kj36l9J19P4m10J75R3K0J23j90p3J8L1p4L43Pj92M4j08n4m0J11J44
3580A08l3j75l0L1J27Kj25J05j37K44j45J3R8o8j00R6n1J4k7j50J69k43J54J08
$$ y = [333, 102, 88, -178, -90, -10, -26, -169, -129, 4, -204, 79, -132, 74, -81, 21, 72, 118, 142, 264, -111, 122, 228, 195, 375, -83, 111, -250, 143, -164, -226, 277, 26, 12, -101, -126, -131, 21, 23, 186, -25, 78, -128, -138, -46, -20, 146, 129, 87, -75, -2, -12, -139, 48, 181, 119, 107, 75, 7, -86, 43, 68, 21, 163, 109, 74, 25, -30, 244, -181, -235, -89, -75, -188, -91, -98, 281, -203, -242, -214, -165, 12, -108, -57, -67, -63, 81, 20, -126, -367, -20, 167, 19, 136, -40, -381, 19, -71, 25, -247, -7, -169, -121, -105, -148, -114, -234, 122, 278, 27, 31, -147, -37, 30, -13, 246, -147, -25, -67, -248, -173, -122, 103, 68, -39, 32, 378, 47, 85, 50, 110, 159, 215, 119, -15, 264, 240, 10, -125, 174, -56, 25, -1, -16, -52, -147, 124, 122, -14, -53, 66, 140, -270, -95, -2, 18, 141, -49, -122, -104, -73, -147, 196, 203, 11, 55, -53, -107, -147, -36, 108, 75, -100, -130, -99, 28, 30, -95, 10, -127, 117, -28, -15, 83, 15, -85, 11, -40, -26, -53, -203, -34, -277, -123, -15]
3604a5K03k09q9Q0j90J38J78M0j16M9M8j47L4j93L46j63J30j26j31J63J7J50k78
3627h1%J30R1p4o5j74K16j18j12N6J18j27L53k77N5m2m8j54O8J73o2l4k00K93
3651a5j91J75r8R4J40q1j59J09k38L99L8j47k9Q8k6J3K8o0o9n2l8K61j56o0N8
3676a6j91J74O2J01n4n1K3J44k36j96L62o5k38K10R7m7k80L03j33J60L6k08o4
3699a07K52o4l3J29j19j24J15k02Q1n6K71j25K2l5q0J31j68J37k07j11K24K20
3721A51l61M29k2n21N46j01m24L82l04M2J0K11J36m21K55q0O2J9j07J49R5j0K5
3744A61k12M9j02J28K26m11M17n41K14K86j97k66M18l09N5mJ80k84L0K79m4l0
3766D3ML7Nk07P2ln7M1J29l3p8J58r0J17K1k72l3K52k0J44k00k81K65Q4j62K33
$$ y = [-15, 188, -21, -110, -30, -220, -82, 96, 136, 20, 69, 117, -30, 4, -189, 157, -6, 124, -2, -133, 30, 47, 197, -81, -81, 49, 140, 66, 1, -173, 43, -75, -187, -131, -13, -140, 213, -64, -9, -51, -99, -253, -185, -12, -74, -108, -308, -15, -206, -31, -129, -35, 105, 24, -135, -26, -264, 135, 173, 26, -3, 85, 59, 72, 100, 40, -29, -81, -119, 142, -14, -74, -16, -207, -33, 29, 130, 76, 25, 48, 192, -44, -240, 122, 57, -181, 29, 126, 79, -201, 102, -31, 129, 165, -43, -107, 145, 81, 48, 177, 58, -66, 49, -153, -72, -128, 143, 18, 40, 5, -75, 56, -112, 25, -182, -293, -69, 151, -210, 219, 197, -324, 222, 121, -303, 79, -225, -183, -173, 38, 174, -247, 8, -72, -10, 9, -98, 51, 146, 136, 161, -51, -2, -104, 24, 250, -161, 256, -285, -71, 215, 18, -248, 170, -139, -84, -88, 92, -192, -162, 117, 73, 43, 47, 84, 89, -118, -46, -49, -106, -65, 64, 31, -47, 111, 21, 138, 159, -113, -146, 106, 86, 230, 30, -251, 14, 98, -64, 169]
3792A69k04m3J02r1J30k32J63j5R7r5l3L00k1r1l75L9K56j26J61q1r3j21K30j42
3816a16J99l12K72K3k89P2K73l3p9J98m02K12j55K22n0K3j51J71k38J48j10N8
3838f4J4O1p3J56m1J26L6o5K05j77j70K56k39J51m9j90M8J26p7l7j07J07K19k47
3862c1J17o9oJ43k48O3J79j67j32k2K83Q9k40k9m3NK30l61L82k44j93jK89j10
3886a16K18k0k31J31j9m2r5Q3K2q4m2J63Q5j00K62k41N7R1o4k7J21m7k9Q4q4K07
3912B83k97m6J00J45l3j11o6o5qL19j59k92M76n5k44O9jk31J08J22r5N2J25j51
3936e5KM2o5J48l50J26L24k68K41M7l76J33J65m03J72J04n8J34R4k47Mk8J63p3
3960b4Q0J7Q8k63J7J5k37K67j19K68o2J85k21J58k57K06j58J42k40Q7O6l6J88
$$ y = [169, -35, -78, 24, -67, 63, -169, -6, -21, 76, -19, -52, 248, 227, 136, -239, -200, 56, -70, 91, 10, -83, -204, 26, -116, 83, -229, 43, 66, -223, -151, 122, 89, 10, 208, -194, 18, -137, 85, 35, 58, -93, 78, -160, -12, -122, -64, -50, 11, -62, 94, 53, 179, 215, 150, 355, 178, 8, 264, 25, 176, 127, -63, -15, 111, 34, -3, -110, -3, 216, -31, 86, 17, 11, 154, -94, -31, 148, -19, -151, -173, 110, 199, -41, -70, -113, -108, 122, -239, 143, -101, -294, -295, -6, -116, 102, 82, -149, -18, -37, -79, -174, -91, -69, -153, -195, -32, 53, -47, 215, -26, 31, 122, 58, 31, 152, 105, 76, 160, 76, 283, -14, -60, 40, 185, 152, 41, -25, -90, -98, 221, 62, -230, 246, 191, -53, 16, 15, -216, -108, 14, -81, -29, 96, -55, -53, -11, -76, 72, -278, -152, 172, -96, 145, 192, -184, -51, 114, -289, -117, -13, -71, 63, 157, -90, -86, -114, 49, -24, 56, 73, 161, -102, -85, -70, -307, -40, -159, 109, 47, 232, 11, 169, -88, 118, -40, 102, -138, -51, 15, -21, 167]
3983A67k32L37l50L0J99l66J68P8l4N8J07k16R5j09o2L8J18l5q8q1K39j15K67
4006B13k54k1L13o5l34j08K39l8KQ1l2J63j64Q5j09k76J73J07j74K04J73m07R3
4029a36K15k18R0J52r7K01k23k90L13n4j30J09P6K48j44k3r9J33l45K13n7KJ63
4052I9l6Q1l02J67J39nj69J61P5j06k32J86j28J87k89J63J32k47L2P7J56j7j11
4075A3K40j63q6K55k47k1J58j26j16Q9K63l57l11N18q6j51J3K02J37k36l82L21
4097g3o0J74J96k00J97j83l1k63K99j84j38L01j19J48l9k1Kk6L2n1K23n2j53Q7
4121F6j22Q9k52K44k37J42J13r0J55P4l34M6O7O5J0Oj4K46l30J19j91P9K44k52
4145e7J31L15k09k11J26m8J9k36j26K81n5J17Q2j14Q3k04J3L13k56j51J57J49
$$ y = [167, -65, 272, -78, -48, 151, -215, -47, 31, -3, 55, 162, -54, 41, -68, -130, -92, 26, -9, -97, -178, 61, -54, 213, -41, -62, 251, 186, -148, -256, -17, -55, -53, 28, -4, 159, -5, 80, -29, -305, -132, -25, -199, 5, 178, -229, -136, 79, -139, -49, 103, 6, 207, -16, -306, 7, -47, -177, -68, 8, 256, 112, 89, -10, 123, -222, -9, -66, -64, 99, 63, 144, -158, 9, 148, 143, -26, 135, 210, 104, -128, 58, -70, 117, -172, -9, 123, -124, -92, -15, 141, 124, 13, 253, 90, 4, 259, 12, -9, 149, 23, -93, -4, 259, -98, -409, 109, 23, -128, -115, 87, 224, -12, -394, -73, -133, 41, 237, 37, 234, 51, 20, -243, 56, -128, -266, 35, -84, 64, 25, 4, 6, -20, 12, -39, 184, 132, -21, 66, -56, 33, -219, 25, -212, -70, 43, -47, 108, 182, -152, -106, -39, 26, 36, 42, 28, 274, -56, 63, -128, -49, 195, -57, 74, 389, 180, -31, 95, 47, 66, -170, -296, -15, -70, 47, 129, 15, 98, -106, -93, 220, -36, -187, -30, 119]
4167A19l24L65k84J28K39r9l53j09J44M43l73L00l57J49k45K3J33J42P7l8q6R3
4189H7j21L2P6n8l4L9q7NM40m88J85j00o2L3n2Q5O1j88L57j32j52q3J21J70pj8
4215A09j59L67l74o0M1k1m8J97p2j53L51j95L9J2K0j10J55n5j19j34L15r2K11
4238B25j87j17N4J09k75J60n4%r6K28L9k05k2L3q8o7M29k35J66q7J04m72L50K03
4262A95k72K67k03q0MM0J23K0k27m6J99K88q8m09M57k46J98j78q7R3k9J45j9n9
4286H6j34N2j13jJ88j80J5K8J85j14J13k42K1L38j92K33j27j77N1J90l32J78J50
4309B16lk19j43K80j90M1k30L26J8j97M8l7R3N3n0J58m91L37Pmj51p0M70l42l30
4334d10J33J99K07l40K91q3L61k70k31j03J41P0j65J03Q5q1J96k12L9N2J83k95
$$ y = [119, -205, 160, -124, 4, 243, 144, -209, -318, -174, 269, -104, 196, -161, -12, -257, -234, -101, 41, 118, 80, -6, 87, -34, -2, 74, 16, -18, 21, -66, -61, 379, -109, 76, -24, -86, -53, -105, -20, 41, -147, 210, 78, -74, -157, -36, 134, 127, 109, -50, 317, -57, -117, -76, -97, -145, 52, -20, -173, 178, -17, 22, 34, 54, -56, 99, 44, -75, -209, 106, 14, 225, 38, -79, -25, 84, -191, -31, -85, -85, -181, 47, 86, -119, -141, -108, -196, -263, 166, -69, 97, 10, 114, -358, -8, 195, -77, 190, -13, -93, -89, -49, 74, 94, -133, -179, 20, 308, 220, -189, 268, 22, 220, 42, -45, 48, 19, 164, 145, 86, -48, 4, -109, -110, 78, -102, -87, -59, 126, 12, 125, -117, -96, 242, 50, 283, 156, -21, 30, 220, -112, 66, 216, 213, -6, -149, 131, -59, -18, -248, 78, 96, -101, -53, -90, 3, 56, 6, 164, -327, 10, 17, 13, -138, -208, 262, -80, -410, -277, -78, 129, -211, 80, -3, 358, 88, -143, -246, -105, -35, -200, -97, -12, -93, 103, -109, -70, -18, 165, -130]
4356a30N5J24Q5j98J84rj54J13K00k87j75L7J30n4K62j99j89J12L3L32k41jo2
4379c2m8k4K12j99J08R9j44M3K27l24j25J79m9J0J71j71Pq6Q0J66j37R5Qj88J26
4404Dq1J81r0o9N3N1J0l0j25j0L44k7k96J22jn6nj69K29n7m4J18k14K97k99J68
4430Dj11J59k2P5n3k83K99J44l0k5j12N5M5j91J72j77J44k26J82rJ4K43l19r3
4454a15J83K50k42p8M7K0M4o1n1r0K74k79P2L0j71K37J33k44L3J94k98q7J18k
4478h3J5J76K1j6P4k79r4J47J45k89J58J89j26k32J84R7l10K16o7J51mm8O5j31
4502d1R5q4J16k7o7l0p6L08k69J96p2m4j59L46j94J1J77l83M85k37J27J04k15
4525F7j27O7J01j03J54K4P0k3k1j77J3j17J07J60k69J08j21J20pp5o4J71j2l5
$$ y = [-130, -75, 49, 134, -64, 120, 111, -43, 70, 270, -17, -192, -155, -25, -79, 183, -16, -205, -93, -60, 272, 31, 30, -32, -80, -104, 108, -91, 17, 116, -28, 15, 242, -82, -207, -28, -77, -67, 104, -67, -60, -146, -66, 100, -37, 58, 66, -122, 4, -77, 104, 14, -55, -2, 49, 59, 29, -96, -106, 238, 211, -85, 37, 36, -20, -25, -194, 35, -22, -66, 52, -162, 135, -164, 4, -107, 52, 30, 105, 52, -231, 68, 212, 182, 157, 45, 100, 145, -46, 126, -51, 93, -133, 49, 40, 54, 297, -22, -115, 68, 318, 76, -2, 45, 65, 109, 48, -3, -93, 181, -98, -26, 4, -167, 70, 203, -41, -8, 186, -112, -199, -81, -83, -68, 108, 129, 113, 187, -92, -186, -39, 106, -183, -25, 164, 38, -194, -10, 87, -223, -7, -74, 77, 73, 25, 90, -41, 54, -30, 86, 59, -8, -38, -114, 194, -75, 121, 49, 5, -154, 192, -2, 9, 186, -197, 288, 51, 178, 282, 67, -60, 7, 108, 5, 159, 183, 253, 230, 209, 32, 45, -72, 35, 195, -74, 34, -87, 33, 26, -49, -113, 58, 46, 11]
4549A1m9r8K18j46J56N3l77K26q0j5J41J17k04l9J06O4J8j44l60L75J20Kl57M86
4573B24k19J1m9N1j73M8rR2J6j18N4J19J78k67N6j32K07k00O5M0j13J51Ol29M77
4598A86R8k34j54J63q5J6P7j09Q4l6M0j28R8R4r5kr4L58j33l9j5r6j65L55j0k70
4624i6L67l24MJ30k2K5n3o1J15q7j20j2J53j91K80Q7j54R7k13K50k56K04m2J46
4648B27n24K67Om4K54k82K96r8j29M7OM6j62K08qJ42k08l21J01K03j46L70j89
4671F2k43K03P1j5Q2q9j22Q6o4K16l51J15Q9j18r7P1K48m7k4L2r2R3k81K29p6
4696b2k85K61m6J66j60O6l7j64M31o6m0K45j36j91J7K4o0O9l1k83N7K04q8J05
4720C6j87L42k00j26RP4R6k31L25j77J02LK8pj22m4R5J04r6k9L55k63M9j42l4
$$ y = [11, -38, -136, 82, -64, 92, 145, -232, -6, -86, -101, 40, 157, -47, -86, 20, 84, 102, -42, -402, -27, 93, 95, -262, 224, 5, 16, -33, 18, -155, -107, -116, -24, -8, -126, -72, 47, 225, -42, 14, -118, 89, -111, -46, -6, -119, 32, 38, -291, 186, 284, 50, -104, 59, -26, -10, 67, -42, 42, 6, 46, -82, 16, 110, 15, 13, -81, 277, 144, 105, 90, -6, -171, 184, 174, -96, 271, -53, -49, 81, 59, 84, 31, -30, 85, -2, -122, -134, 19, -172, 108, 195, 41, 138, -75, 175, -81, 123, 81, 227, -297, -30, -24, -68, 186, -96, 200, 102, -27, 20, 26, 72, -90, 118, 110, 252, 44, -277, -176, 27, -119, 251, 62, -181, 22, 93, 78, 160, 71, -51, 35, -29, 187, -164, -49, 40, -78, -175, -104, 144, 97, 73, 105, 13, 106, -175, 54, -22, -307, -46, -92, 74, -86, -20, -57, -221, 210, 144, 104, 349, 213, 22, 39, 63, 3, 72, 41, -242, -185, 19, -69, 36, -151, 191, -9, -135, -126, -52, 44, -187, 138, -39, 63, 66, 94, 87, -35, -79, 16, 120, 24, -5, 350, 87, 136, -6, -40]
4745d0J9Q8j26J12J66j28j22J22l5j36J24p8K7J28k16J4KJ60k0kn6r8m0Q3l8K30
4771A40l55L25q5j90L62k64R6P8m0k10K24o9K79m02o8J26K58j81n1lJ42Q6k20
4794b2O7n7K1L0j41K36Q0k64K43k29K45m05J06K04n4j03l3L1K38o0j51%N7n0P3
4819F2J83j80o0k47K75j53O2q1K23no5nr4K26l56J21O5K3K1p8j05J54Q8j69K32
4844A37l0p3r6kJ02p1j87K8j79N60k21j15J28qj68J76J93J36k12j96j02M6J16
4867c8J24k93K84O6m9k18j1J80j31J93l19J30JK1l9L2J19k35L71j32j02p2J56
4890C8l03J33q4L45k73J03j07K61k27P3K8L1j03M34j64l59J02O8K5J73j49r3R
4913c9J24j73K94Nk53r5K62l19K54n7l9K48l84q1Q2K07j01P1o9j61L75l84K39
$$ y = [-40, -21, 67, -59, 53, 219, 91, -31, 91, 56, -80, 44, -34, -7, 121, -95, -81, -79, 81, 61, 59, 3, -95, -135, -52, -90, 140, -215, 110, 25, -165, 197, -67, 29, 107, 67, -143, 81, 12, 291, -111, -179, -53, 205, 24, -27, -30, 112, 198, -22, 45, -12, 9, 39, -102, 134, 214, -50, 193, -36, 209, -196, -90, 114, 60, -43, -76, -45, 193, 133, -18, -18, 39, -11, 62, 245, 65, 5, -242, 33, -120, -58, -139, 84, 79, 14, 9, -85, 141, -215, -94, -29, -6, 15, -63, -168, -14, 74, -95, 137, 107, 34, -62, -64, 38, -33, -220, -192, -371, 189, -32, -147, -19, -27, -195, -19, 174, 310, 98, -98, -200, -154, -38, 86, -207, 77, 143, 94, -124, -135, 45, -86, 107, -212, -82, -81, -60, -99, -67, 52, -183, 188, 56, -46, -118, 38, -265, -132, -216, 129, -144, -41, -148, 113, -114, -41, -13, 18, -85, 349, 185, -174, -72, -4, 21, 194, 45, -48, -39, 85, -88, 206, 211, -42, -137, 125, -194, 60, 3, -36, 212, -172, -253, -171, 36, -65, 6, -63, -224, 151, -233, 6]
4936Fk15J79J07k03K5J24L1k35O9k7L17m5l9q0J91l65J47m4O5N9mN7r3l8r3nL11
4963B02j42r3k70O76l97J6J0K5j9L3k67L10q7nPJ19j96Q3Q8O3j44m4n7K19k22
4988i2K28j7j38N7l2k0J70l28K11p6L8J50j25r8p8J11n4K55j91r8l5L80l57J51
5012A2%LJ22m16N04l12K77l12K15k06J29N4J01l40J59j16J85j19R8K14j95j01
5034d4j58K59Q0k64N0J89k09o7J01P2J0p9J46q9j52J42o6K84j03j0Q9om83J98
5058a10O2O5n0P1L6p0k5m0J13j47j0K03j8j82K16k14Q3j7j29J13J60j65l10OP17
5083C58l73J46j81J02n3Q5j65N4N6j07j22J59Q7J61l82K90m08L94J0m1Ol4j16
5106g4J20K6j00k77L98k18J46K01m63J58r9L24l33J47j8Q1n6K24n07L25N4J13
$$ y = [6, -209, -30, 77, -126, -101, 23, 54, -181, -112, -139, 178, 133, 94, 14, 205, -160, -13, -57, 8, 67, 63, 120, 27, -11, -104, -109, 202, 60, -33, -303, 373, -24, -8, 2, 27, 8, 41, -226, 84, -3, -8, -1, 118, -78, 5, 93, 156, 12, -32, -89, 130, -92, 136, 119, -19, 38, 6, -14, 156, -172, 39, -37, 1, 151, 26, -72, -150, -39, -93, 162, -29, -127, -162, 218, -139, 12, 12, 15, 137, -279, 225, -87, 190, -122, 93, -113, 16, 70, 171, -169, -10, -126, 59, -60, 38, 252, 57, -44, -202, 57, 137, -127, -77, 112, -97, -164, -63, 9, 19, -60, 86, -3, -155, -13, -79, 205, 102, 92, 181, 175, -308, -110, -48, 17, -33, 38, 74, 4, -21, -61, 52, -95, -105, 98, 80, -102, 114, -100, -17, -34, -163, -50, 110, -55, -365, -359, 358, -15, 131, -50, 52, -1, 84, -81, -27, 29, -78, -200, -41, 46, 207, -175, 115, -293, 101, 111, 70, 76, 42, -74, 46, 72, -28, -305, 93, -125, 21, 222, -241, -83, -182, 142, -191, -44, -62, 19, -37, 187, -320, 5, 59, 172]
5128A72k64j08J84K61k63j59J84k5J8l6o4OM24l95J83Qj55J09O6k0m7n6M7k05
5152a35J6N5J60k36K06Mm2m7Q1L6l71J88J53J1j44k14L18k13L56j97l3O5Q8j07
5176bk19J8J04n8L73n53K67J19J27k58K36Ml30Q4J93j03m8l6J60L7k87K23k68
5199b17K50R0j13Pk2J28j51O7MJ85j47K4m7q8Q8r6N4N6R7j94J4R3j28j1J54k76
5225a79K60j52k7K07j98j1J28j06m0Jr4q3K01j06J08Q2k13K66j82J81k70N7K52
5248H2p4j82L66l51J01N6n4K11j81QJ4o5J19J38k88jJ4l8L37k81J81j74K7j15
5272a50L20k04L13k9k61K8N8n7J17O0j44j8j79Q1J30Kj23Q9j16J69j12l0r4Q4
5296f6r8J69K66m48O7j06kK36o2J6j23J24Q3k03J47J64j95N6n5J1o0N4j31K43
$$ y = [172, -92, -200, -16, 245, -18, -177, 7, -18, 0, -36, -100, -94, 330, -65, 118, 126, -29, 80, 146, 126, 79, 23, 70, -135, -119, -64, 96, -140, 66, 70, 28, -19, 62, 98, -273, -85, 68, 79, -65, -279, 39, -174, 182, -15, -48, 17, 105, -2, -221, -203, -99, -157, 216, -337, -70, 49, 176, -82, 154, 158, -172, -88, 105, 2, -46, -82, 78, 115, -172, 51, -217, 33, 123, 10, 17, -5, 123, -28, 39, 43, 228, 81, 105, 58, -30, 58, -38, 16, 72, 169, -25, -11, 82, -46, -57, 97, -179, 81, -71, -98, 109, -89, -100, 28, -78, -118, -117, -211, -294, -93, -199, -91, -9, -222, 44, -138, 43, -227, -170, 82, 8, -174, 192, -159, -58, -2, -56, 155, -26, -18, -4, -69, 50, 188, -100, -101, -87, -125, 212, -69, 112, -62, -35, -150, 170, -34, 279, 250, -11, 17, 75, 18, 135, 195, 51, 33, -146, -65, 65, 67, -56, 33, -83, 86, -26, -56, -150, -66, -164, 5, 271, -177, -110, -216, -218, 18, -44, -28, -151, -27, 56, -147, 0, 164, -31, 25, -30, -19, -79, -25, -156, 87]
5320H7j90R0R5j85K68p1k75L25l00n1J94j36L00J87l48j9N9mo3Q3j36J51k21r
5344a69J24l4L78j78k21J11j31K44K61l50J93l7k83J56R4j52M0j30L9J62o6j17
5366f6M7K20l48K65j60K4n2R3J51lk31J11j48J40J73j89K34j59j66Q7k18J80P7
5389F2M9j82J54k69P3J40K6j1j17P7K4j30k2q1J71J73p3o7j02P3k35L50J01j30
5413E4j95K93k14J26k8j31K57O1j64m3K9m6J72n42K93K48j38O2p4J35j69M55o50
5436b09M13l34l4L8K43J64m37L40j93K16j72j80J25k33J81K65J67l50K5k26L71
5457A80n0k81J76o5N8j35J77M6k36J22j39L9J75n7p9K52j6k59J54M6j38J98k91
5480a23J5P5M6j23K0j24J82j6j61P1J33P0l41K67p0J34k31R5Mo1K03l7j61J88
$$ y = [87, -103, -13, 82, -103, 165, 94, -181, 144, -156, -207, -13, -149, 151, 338, -10, -29, 30, 26, -37, 46, -90, 61, -160, -169, -45, -79, 299, 121, -100, 11, -120, 124, 385, 35, 228, 191, -92, 64, 158, 6, 46, -84, -45, 117, 51, -66, -19, 201, -147, 118, -42, -18, -70, 23, 174, 171, -60, 51, -97, 43, 216, 27, 261, 102, -64, 23, -195, -15, 62, 111, -71, 83, -186, -113, 27, 53, 42, -75, 2, 26, -104, -126, -207, -36, 137, 64, -3, -105, -32, -267, 83, 184, 54, -141, 152, -62, 64, 36, -95, 162, 223, 59, 16, 45, -1, 171, -371, -78, 170, 32, 94, 20, 155, -14, 441, -209, 204, -130, -164, -126, 117, 281, -156, 184, -9, 207, 35, -145, -20, -253, -72, 193, 360, 10, 35, -191, 180, 130, -151, 25, -40, 18, -117, 60, 106, -130, -8, -147, -108, 67, 10, -69, 183, 167, -92, 62, 108, -30, 168, -123, -108, -33, 13, -110, -90, -214, -32, -48, -209, -138, -5, 65, -276, -9, -79, 55, -176, -81, -77, -138, 65, 28, -133, 55]
5504E5j89J02j84M12K1l93J19m0J74L0k2Q2j44K9j31R2J20l5q2J7j52P6L56o49
5528c36N5L76m08K07j82M50l08K00Q9L8n60L83j21L31k11q0%J72l7m8K52q7j70
5551EjM8j59K20j2j64j45J59J41m6K17j1m32L9J49J30k45J11j39J35j9K03j29
5574E5j64L03l44K86R5l90K36J02k50J20m4j3O5k14L18k34O1K60k8j31N0K8L5
5597B02p5k50K12j44j16Q6L67j98j73j09K51o4J45j23M2N8J2k04j69K36M3l17
5619b88K51J81m64K85R4j10j7O8J09q7J33k06Q1L6Q0L5k29L4Q7q7k2J59k4l01
5643b02j09M56k0L0j79p4m8J40j59J39N5M6O1o4o0m0K9Jj12K17J83l48P3Q4j87
5668h8K55j30n3K42l75j51L86P9j56j01J68k29L48r9j24Q0j4J14k76K43j09j36
$$ y = [55, -134, -32, -216, 196, 217, -176, -57, -97, 77, 107, 85, 167, 23, 52, -79, 13, 133, 98, 16, 33, -119, -43, 313, -336, -281, 95, -313, -106, -288, 162, -146, 54, 143, 181, -379, 4, -117, 214, 3, -77, -77, 95, 58, 10, 262, 175, 5, 4, 52, -107, 113, 101, -63, -208, -49, 92, 46, 263, 252, -180, -141, 8, 138, -107, 4, -135, 0, -19, 184, 55, -109, 194, -150, 136, 231, -159, 77, 179, -71, 49, 5, -8, 57, -157, 161, -73, -12, 248, 220, 89, 139, 167, 202, 127, -123, 89, -55, -171, -85, 282, 84, -89, -198, 53, -11, 134, 11, 53, 111, 123, -81, -250, -14, 29, -288, -37, 144, -320, -35, 59, -51, -68, 0, 109, 22, 155, -51, 30, 66, 146, 181, -48, -14, 73, -14, -36, 123, 99, -202, -311, 145, 125, 155, -24, -98, -146, -6, -165, -26, 29, 75, 136, 72, 12, -28, 1, 2, -110, 107, 290, -58, 15, 99, -88, 167, 37, -16, 226, -149, -300, 86, 165, 9, -92, 76, -153, 195, 96, -28, 52, 38, 152, -124, 119, 10, -126]
5690a26M8Q5J8j04J37M2k91K46J99j27j44j06pL62j56R3l24n0L11j35R2J4k38
5713a61J70N1j76K77j00M79m12q7k16RJ53N6j18J48k7p0L1rp7m1J44k22K95j93
5737i6L06k54J07O3k83J46k4J62j06q9J38k82L10R8p0j41n5J64N0j43M3j6j65
5760a37N6M3j08R7j80P4M3K82j08j34n3K41o3J35l93J11O5J47k25l3J10p3r8K61
5784F0l72L10p7M7J66j38lK38j91Mq9J50j55J45l7M9j36p5J47j48K76k67Q5J33
5808A22J3j02J87o8Jk58l1L6J8O6J78j64J28k78K36j53J68p6j20KK43j75KJ18
5832I3J5r1Q3q1m8r3O7M8N0mp9J84m40n6M67j15K13p4j29j09Q9n6J07k6NK3j28
5859h5L44j59j22K7P5Q0k79K48j59M8J03o5j59J33K50l35R0k62J12L5J81j89J11
$$ y = [-126, -78, 7, 25, -79, 58, 100, -191, 55, 254, 127, -17, -123, -130, 232, 76, 169, -155, -205, 106, -29, 63, 77, -161, 9, 60, -116, 161, 61, 540, 128, 41, -175, -166, -13, 43, -75, 73, 46, -24, 7, -2, -79, -120, 24, -198, 97, -96, 210, -44, 63, 126, -157, -11, -35, 127, 21, -68, 70, -212, 98, 196, 126, -15, -70, 94, 144, 1, 44, 28, -137, -81, -38, -146, -49, -229, -155, -112, 170, 62, -72, -125, 116, 53, 188, -205, -94, -29, 118, -107, -140, -30, -103, -201, 60, -312, -2, -79, -32, 134, -4, -7, 231, 40, 44, -45, 105, -50, 95, 58, 107, -29, -104, 43, -105, 171, -96, -11, 122, 135, 33, 220, 152, 153, -105, -136, -100, -82, -16, 162, -2, 126, -152, 84, -69, 99, 23, -97, -95, 148, -27, -25, 93, 108, 17, 100, 19, -29, -122, -55, -7, 43, 39, -40, 144, -296, -352, 115, 0, 213, 139, 10, -99, -10, -66, 41, 15, 20, 43, -85, 259, 100, -22, 5, 80, 160, -119, 129, -30, 18, 121, 56, -103, 30, 280, -55, 35, -227, -115, -80, 101, -88, 23]
5882B3j71r2J52Q5r6%O3K49k66nP1R0Oj02j55O4L38L7l07J05l0k15L92k97J64
5907A03J2j12n5L05k79J92k02k1j13J58r9N6Q4N4jk47K29rm68M01%J82pl45M96
5932C14n05K71Kp5r3L17j92m3Q0J6j25R9j31L39j19O8k17j20K5j36L83ol37O3
5956a22J45J30l36J89r2J72N8j83r5L85m21P6P5j56J84k4L8j02L27k40J37J01
5978B46l60n8K03R7p2k34L61k99K00k60J61J9K4j65l2LK40mj42K54N2k18O5J33
6002B14m30K61o8j28J20o7K43l81K32M7j11J21O0m1j24R5r7K5K2J63j84O2j8J80
6026A96l26J78j9K48l36NP5J41j32pJ86k57OJ02j90l6P7J70m9k37J26P2K23l98
6050a82J81J8J47k33O0JJ7P8J81j73L7k73J01j83K88j93J59k13L49j23k68L00
$$ y = [23, -148, -240, -88, -3, -99, -99, -36, 213, -53, -58, 13, 103, 109, 7, -148, -84, 254, 291, -16, 89, 59, -156, 236, -61, 103, 115, 3, -52, 253, -26, 166, -36, -57, -170, -12, -111, -55, 29, 83, 82, -165, 64, 55, -413, -12, -12, 170, 163, -182, 314, -191, 80, 82, 7, -86, 231, 39, -4, 76, 92, -33, 66, -65, 274, 155, 223, 6, -114, -89, -225, 158, 152, -185, -122, 23, 153, -183, 6, -86, 86, 144, -39, -134, 251, -170, -94, -19, -175, 9, -15, 23, -79, 248, 8, 145, 246, -114, -172, 31, 128, 56, -178, 183, -116, 84, -176, -15, 4, 28, -137, -169, -166, 74, 70, -72, 182, 234, 16, 81, 214, -216, 45, -23, -151, -31, -98, 145, -236, -4, 43, -68, 53, 113, 72, -52, 43, -54, -29, -7, 156, -28, 34, 16, 196, -130, 48, 29, 277, -59, -54, 21, 162, 30, 23, 209, -48, -42, 60, -130, -166, -89, 81, 32, -205, -79, -7, 216, -182, -1, 17, 164, -69, -9, -8, 9, 87, 268, 95, 132, -141, -40, -223, 65, -128, 31, -182, 167, 44, -224, 76]
6072G6j15K27l08J01O5l24M86k14j50N9P3j19J78j98J3K3j22K95l4J22k40j86
6094b92K06j26J46L12P3m19L33l01J02K1P5k77n4L85j29q5r2J17J70j97J72j53
6116a3rn8K51l07o1P2K07J90n9J12k08j35J01j13O1M0j9j73q8L38j84P1m4J64
6140A36J13l17Q3K09k45K31m8O9j40k08k1N4j04J39l4j69Q2K18j44j0k8R2K60
6163B18j50j14k1K93k01r9J23K5k13M6j12J68J38j23q0K32j06k66K56j00P5L16
6185C05m78o5L14j82p7L40j86n3L02n03M6L05j02R5Q1k08j99M48o8l7j14j09j
6208a46r2j9K12q9r7M59k61O4j16j29m8M36Q5k02j61J13j80J88j36M63l89j51
6230a96M67J9k73l11K79J59j30J06NQ5j02m5j23m8J59J04j65M6m0q6J37k9p1K70
$$ y = [76, -39, 188, -120, -19, 46, -278, 208, -6, -156, -97, -24, -143, 35, -163, -150, -127, -249, 46, 12, 134, -106, -292, -86, -212, -66, 246, 319, -100, 233, -68, 34, 55, 130, -147, -201, 184, 55, -30, -122, -5, 165, -32, 140, -13, -22, -80, 171, -136, -197, -125, 82, 272, 213, 325, 117, -18, 83, -30, 31, 71, 52, -121, -209, 129, -55, 16, -28, 136, 249, -68, 15, 224, -21, 210, 162, 231, 91, -117, -138, -84, -188, -49, -83, -252, -170, 48, -96, -106, -134, -42, 218, 68, -46, -67, 226, 25, -74, 49, 74, -139, -93, -205, -37, 101, -22, -102, 130, 24, -242, 14, -86, -11, 305, -173, -238, 76, -106, -183, 157, -29, -82, 220, -283, -237, 68, -34, 61, 142, -66, -265, 183, 115, 78, -36, -145, -146, -238, -257, -45, -134, -231, 228, -33, 31, -85, -214, -262, 174, 259, 57, -104, 9, -171, 17, -119, 344, -45, -196, 271, 290, 17, -294, -15, 144, 14, 120, 125, 210, 108, 63, -60, -108, 51, 155, -10, 36, -4, -90, 47, 18, -53, 217]
6254B17k63J31j69j78M51j69j42J11j06J01K27j78o8n1M6j5L10j17k26k8J53j17
6276h0J82r1P8k10K94j40k1j59J73QJ73m9l55L56k63p1J5L80m19J83P6k06J77
6299C1j0l8k34L85jj53LQ6o3mR0K76m76p3K65q8M36k21n5k39J64J29j6k77N4J98
6325A69j34k43Q3K24j50k4JK91m02J23J53o9k85J15L45j91Q2ro0r4J86m08M67
6348A70j58j85M96k33j78J08J40k71MO9K66j91j24K09r4r6L49j96j35j30M9L07
6370A76j35Q0o4P7k45J34L3J91k29l16K00K91m3qj23l07L16J6K4q2K16l39L03
6393A66N6j06q4jj85J23J10j56J50O4j21l29L03o9J84Pk02L42k35J23o7j76r1
6416a94P3N95n16pN50l74O1k83Qj98J64K48j18q7L93k44p3K73j70m6k08O1K00
$$ y = [217, -46, 85, -84, -262, 189, 20, -122, -11, -117, -16, 211, 33, -35, -86, -40, -55, 255, 138, -88, -116, 37, -80, 102, 11, 89, -121, 173, 33, 12, -147, 26, 34, 207, 158, -197, 159, -104, -175, -160, 220, -199, -16, 60, -146, 31, 21, -17, -251, 134, 133, -20, -17, 69, 6, 2, 92, 368, -108, -181, 84, -4, 432, 211, 156, -83, 81, 210, 194, -83, -29, 169, 35, -208, -125, 99, -51, -75, -74, 217, -185, -62, 91, 22, -263, -148, 197, 6, 88, 79, 19, -75, 111, -297, 170, 12, -173, 323, 90, -88, 20, 160, -111, -107, -38, 228, 37, -87, 122, 28, -68, 281, 85, -50, -180, -131, 176, 41, 121, 57, 134, -111, 23, 56, 247, 18, -298, -98, 193, 150, 142, 19, -288, 28, 44, 68, -14, 202, -137, 166, 222, 116, 32, 31, -154, -31, 79, -77, 73, 137, 16, -313, -10, -79, 105, 112, -90, 252, 17, 140, 73, -103, -194, -121, 474, -42, -49, 501, 127, 188, -95, -87, -285, -121, 127, 9, -78, 315, 71, -2, 271, 101, 55, -153, -92, 108]
6439A08q1ol09J63N7K19r5k75J14K47j03K7M7j39J66J82k51j78l1L6J72l9J00
6462A31M0j94O7j9J9l67L75J94k52J8j52J87kk5J57k49j46N77m24N9J84k01j60
6485a83J66p8P3J11o5l2M1Op8l49O61m27J69r8l7K03p0k21j4L88K4l7k55j72O30
6510C56k92j74K48o9P9j31qQ5n3k04K42j04P7P6j67K41k86L19q2j17k11K14O5
6533A04pk07K5j8K67l62L61Q6l15P8K86r7q4P5k36m1j20J10K34j13J65j98k73
6556b80K76J14N4q1j70lK04k57M36j57J80n03J16j9lK70j73P7j07j00m7L0J50
6579Gl92L41J60j67O0L29l41K20j39j46J9j48M4L52R4m54K81j63J6k20J84K49
6601A86rk77J10k8K98j68k14R9j40M2j1J27O8k98J49J11k78K44m9J82l41K91j82
$$ y = [108, 27, 21, -288, -125, -68, 151, 56, -219, -105, 142, 39, 66, 113, -26, 140, 322, 71, -107, -138, -102, 70, 31, 131, 171, -23, 44, 25, 44, -323, 52, 246, -6, 12, -140, 47, 45, 20, 177, -72, -218, 359, -65, -6, 178, -23, -183, -17, -95, -22, 89, 24, -8, 33, 39, -39, -388, 273, -154, 15, -83, -120, 83, 13, -208, -222, 166, 190, 153, -102, -274, 356, 64, -110, 138, 69, 148, 17, 9, 94, 41, -163, 79, -25, 52, 128, -39, 202, -84, 235, 153, 36, -175, 39, 104, 97, -110, -85, -103, 164, -198, 163, 249, -66, 12, 298, 201, 117, 192, -44, -85, -205, -95, 139, 26, 191, -7, -280, -4, 110, 164, 83, -87, -90, 114, -143, 293, 136, 316, -187, -71, -90, -93, 177, 4, 81, -26, -126, -173, -143, 7, -385, -44, 116, -51, 9, 338, -3, 217, 78, -68, -49, -197, -153, 199, 293, -161, 120, -43, -27, -247, -63, 186, 177, -100, 10, -18, 280, 112, -102, -3, -143, -101, -112, 15, 83, -215, -66, 45, -233, 11, -38, 144, -197, 94, -88]
6624h8n2M33k78j9J2j54K06k91M34j49L1Q7j06j64Q9L9k26j2L73L8k87N2J27l6
6648E9j71J54J91m04P5L37k69k13L90j20kk8k24J96J3j02K51k50L06l90p0J90
6670h1j22J99k18L49k8R4N0k30J39k54k7K27k2j58K5RK13l5J37j76j03j03P9j6
6694e2q5l5K94o4k08J29P4n5K67k83qK85l31L93l13n0Q2k6Nj21J72j58J21m3j88
6719a98K82k61JJ21L11n14m6K47o8J66k56Q9J08r4K45j22k03J41m7j84N16k05
6741B9R8O1L1j69L3n8j98J49K57Rr3k24n7J80j28K18J79l65K11j31j55j23K78
6764C2o4O3J20k98L68k28o6j88L19j13m23L40P4K95k62K42j39j26m7Q1J25j88
6786h3j82K45k8J74J00k18l39J29k6J45n6K74j37m2J78q0mj55K19N0k98n4L03
$$ y = [-88, -140, 293, 15, -4, 8, -146, 60, -231, 203, 54, 85, 172, 66, -98, -9, 30, -196, -208, 165, 203, -84, -32, 95, 59, -112, 42, 233, -171, -96, 241, -28, -241, 149, 29, 27, -1, -225, -29, -16, -118, 133, -117, 189, -201, -271, -81, -203, -4, -222, 127, 99, 193, 243, 13, 152, -102, -129, 98, 76, -82, -57, -48, 165, 130, 267, 91, -12, -115, -36, -52, -137, -172, 122, 58, -150, -21, 53, -2, 265, -18, -26, 259, -72, 321, 8, -42, 40, 14, 19, -102, 70, -88, 33, -10, -198, 84, -177, -176, -55, 256, -258, -304, -57, -125, 41, -215, -126, -18, -112, 133, 11, -192, -51, -98, -282, 234, 29, 127, 188, 219, 50, 83, 25, -173, -24, 233, 242, 149, -75, -132, 48, -80, 138, 317, -48, 163, 32, -123, -246, 32, -32, 31, 151, -147, 221, -7, -73, -261, 58, -55, -478, -138, -64, 231, -31, 211, 72, -54, -101, -20, 105, -83, -265, -20, -48, 126, 226, 8, -331, -202, -228, -83, -139, 135, -2, -44, 134, 54, 50, -105, 114, 164, -134, -188, 115]
6809A15l05J48mJ81j89L14k75j18J20j2L0J09j76K7j57J65J16j82J2o9J29o0L30
6832B49j13j26Q4o2J40k86L19O7k88M2J20j06q2j0Oo8K2M03l22K37k27n0K9j10
6856a32J11K4j61J15M0kJO4P1k75K38j07K90k30l13K02L54l73K52k82J10J44l42
6879b01J01k0J60k2r8OR5q5K62m20M26q0r1p7j6mJ28q1k81L90p6m9m4M53n14L92
6905B54j46k27p9M38k28J99l8k19l0j0j86L76n2j03J23n8J47k69M2K09l02q6M95
6928B50l60J6R3j35J35mK57K3l69J62p1j00J48J44j84k96Q8J45K76l02L3K67l11
6951i5L98k38J82p8j89o6m6N7K55k81j18J95l3J40j04K06M0l03J48J5k05J84j55
6974i1R3k30K92rm10K88L35j99J03l9j3p1ll4R1k70J93P3j9r7k8R2K17j71r3J6
$$ y = [115, -190, -42, -46, 135, -54, 260, -15, -133, -13, -25, 5, 114, -62, -35, -192, -27, 89, -93, -81, -150, -21, -81, 249, 136, 10, 94, 32, 172, -114, 205, 272, -16, 26, 146, 40, -42, -52, -46, -114, -92, 311, -11, 226, -1, -51, -22, -132, -21, 3, -158, -43, -3, -5, -4, 60, 131, -144, 94, -13, 277, 47, -266, -64, 290, -83, 169, -113, -3, 141, -201, -100, -120, 40, 18, -80, -74, 21, -64, 198, -222, 204, 124, 33, -44, -60, -64, 64, -17, -298, 92, 16, -33, -77, 376, -138, 254, 108, -119, -198, 240, 12, 211, 173, -46, -76, -86, -272, 104, 52, -51, 72, 14, 161, -108, -66, 143, -159, -245, 250, -110, -94, -1, -136, -1, -5, 252, 275, -94, 68, -3, -103, 45, 189, 5, -291, -203, -58, 218, -84, -51, 216, -95, 303, 65, 247, 169, -20, -86, -132, -75, 180, -101, -219, -24, -57, 83, -21, 185, 225, -78, 70, 85, -120, 64, -91, 2, -228, 64, 55, -355, -67, 268, 69, 172, 133, 120, 49, 46, 12, 103, -167, 26, 99, 80, -17, -45, 47, 264, 93, 0, 16]
7000A6j02K69q9j90o3J47L32j75q7p2J14r7K64l71K07j28j06OL42k46Q9j01n1
7023i2l6J91j53M3J90j22L6M8m8QJ94l65J20j56K42k76J44j35J13K01l28K54J44
7046B17j40j97K07Rqq6P9l56K36j08L47r1n9R1r5l47R8K19j13J76k41O9K99l03
7070i7J69j37Q2k5n7J73k41K43k69N6J80M3k60J88r4M4J57j65L3J2O0k75K37L5
7094I2j8l7p8p4P8K00l94L18J79l94K08n0j4j26k0J89M4o8j52J57l5P6L7k92K96
7119A22j89J63k24K07M6j06j59l8K19N2l30L02j50K25k75J39l3k7m8O0o4PJ12
7142A1j90R3r6L76j02l82J97O6lN1p3M8j52j04K43r5L06j09P4j04j01K93m86L11
7166G2K2k43M2J58j48k0L12m2j20k9p1P4N1M7k18K1N6Lq8j50K26P2pk53K62Q6
$$ y = [16, -86, 183, 94, -96, -159, -12, 320, 145, 58, -14, 100, 3, 267, -104, 103, -25, -131, -125, 217, -29, 60, -41, -92, -128, 63, -90, -47, 143, 21, 57, 105, 57, 65, 259, -106, 14, -142, 100, -176, -32, -167, -54, 147, -181, 73, 217, 77, -120, 87, 96, 88, 2, 81, -275, -39, -147, 200, 109, 50, 141, 46, -301, -203, 16, -97, 79, -162, -93, 206, -97, 72, -65, 17, -8, -65, 108, -133, 110, -159, -103, 77, 120, -140, 48, -46, -2, 155, -10, 23, 35, 95, -180, 57, 92, 74, 37, -41, -115, -37, 163, -231, 87, 266, -128, 80, 30, 16, -110, -130, 59, 103, 35, -117, 40, 5, 81, 118, -174, 122, -67, 96, -128, 79, 125, 19, -140, -178, 41, 93, -237, 65, -85, 140, -135, 4, -29, -56, -104, -44, -108, -101, 11, -179, -86, -182, 194, 92, -290, -93, -27, -30, 21, -52, -4, -156, -260, -17, -112, 194, 85, 159, 55, -46, 247, -239, 72, 94, -149, -107, 51, -97, -117, 195, 153, 33, 4, -67, 7, 58, 105, -113, -92, -36, -33, -121, -271, -45, 27, 20, -233, 29, 115]
7192A15j45J77j03L4q8k5J45j1k21K50j30N3j80K82j77l3P8O9j73j9J09j45l0
7215a68K62k12K63m09P5L22j11N4J36k88m2J35q1K5J46J01m78J77J57j7nK3o8
7238cJ24j55L8p3m2L7Q0Q0L0l35K47j59J6M44j41K0k58J03N9k25M2p8K30k6J71
7263B26l16J73j6k98L44j3J2k18J24m4J48l17L51l60L06j51j92J13K04q8q3l8
7285a33M0J79j51q1J50j01j06J21K4K5j36J91r0J11lK6j36J34l83M64r6l7K26
7308B38k22K95n00LJ93l1M6j02O4j9J20R8k9j81j2J46j55K6K85m23K46p4j18l1
7332a37L14j39k31J39j29J85j11Q1J9j20j1J73k30J79J16j42L05k20j57j03L30
7353A11Q8j67l2J15jo8k09L93k36J5N7j30Q0N2j50J48p1o0j21K04o0N0J52j33
$$ y = [115, -30, 147, 44, 78, -10, -35, 110, 99, -122, 128, -2, 51, -129, 153, -24, -57, 21, 90, -83, -102, 7, -138, -168, 94, -118, 145, -264, -189, 133, 22, 76, 212, -76, -118, 17, -64, -39, 107, 208, -270, -93, 64, 47, 42, 65, -3, 121, -34, 4, -69, -111, -74, 6, 86, 116, -219, 28, -131, -115, 329, 188, 208, -50, 53, 112, -113, -71, -149, 81, 55, 226, -90, 83, 67, -231, 113, 100, 112, -106, 18, -26, 122, -195, 156, -204, 102, -49, -241, -128, 76, -12, -95, -133, -93, 86, -65, -146, 4, -97, -203, -82, -58, -33, -169, 22, -68, 43, 40, 66, -70, 64, -319, 145, 49, 12, 238, 16, 311, -189, -186, 7, -24, 22, -80, -16, -35, 85, 183, 154, -27, -39, 107, -48, -22, 263, -160, 86, 12, -106, -137, 177, 38, -193, -54, -183, 2, -109, -28, -9, -129, -140, 33, -197, -18, 98, -44, 261, 41, -116, -219, 111, 199, 32, 0, 115, 114, 46, -163, 230, -6, 9, 66, -64, 16, 68, -82, 66, -5, -65, -186, 18, -42, 8, 160, 27]
7377B7M8m7J3rk7J13j61o6L5j47L89j25j41R2K6k07L51k16K98j87M6j11q8J29
7401C5m8n6J49j90K88k40j93K29j07L43j01K8k1m64K86RK0j57M19j79k7J84k65
7424e8J30p9m6p9J01J0n6N6R0K84j13l98q3K68k3j26jJ50l6J02p1q5j47L69J2
7449A71l04j09L77j07m1j57K33j1k2j87Q2J98k99K45j15N9k9J02J24l80K42m8
7471B4PKR1r2l5r6J97j8Mj62k11L23Oj89L10q3j36K3J70l4J71j36k53J9L85l65
7497g8J10m6O8p6J62k9l7k22J90P4o5k05j14M45j76j2J77n33L98j46K28j39J59
7520A33J62k61J66j92kl1PJ49N0q3J7k36K04n8%j67L00j76j30J40K39l87L33l46
7544a69J02M18l69J4J41o8J30l15J44N3J85k19P8k30R8o5J47j45J9K12l34K03
$$ y = [27, 75, 28, 41, 32, 5, 118, -43, -109, -74, -221, 168, 43, -98, -6, 20, -187, 164, -52, 246, 59, 105, -6, -94, 35, -13, -69, 80, -110, 178, -62, -255, -26, -133, 210, 109, 137, 116, -348, -62, -53, -33, -190, 229, 50, 23, 207, -58, 72, -7, -53, -132, -31, -21, -77, -21, 69, 353, 240, -158, -241, 27, 4, -122, -123, 27, -9, 93, 22, -63, -210, 159, 171, -133, -242, 135, 28, -13, -170, 63, 52, 30, -157, -75, 123, -176, 69, -46, 13, -16, 86, 210, -170, 72, 24, 31, 33, 124, 32, -3, -99, 98, 80, 84, -78, -289, 34, 40, -149, 161, 78, -58, -35, 135, 101, 272, 136, -117, -98, 287, -78, 32, -14, 54, -22, 140, 111, 74, -148, 42, 116, 51, -154, -268, 177, 1, -11, 166, -367, 31, -115, 113, -26, 133, 295, 34, 200, 8, 6, -25, -18, 131, 181, 98, 115, -121, 83, 25, 25, -142, 158, -18, -148, -8, 231, -156, 177, -169, -67, 351, -18, -4, 137, 69, 199, -116, 28, 81, 266, 47, 125, -105, -7, -72, 75, -70, -51, 161, -173, 30]
7566C0J14j56l85L65k24J42j81j2N56j96K3r2L89l96l9K96m32l5L01j2J2q1r2
7589a05R8J19j11m3J29k2j29K54l3j0j23k15L48n4m3K16l70Q9J72j21k2K01l72
7612a47J06K9k51L15K5k12J62j95J65R8j31l1m1J39J6J10j63J3R7j38K7J43k11
7635g5J75J7k83M5j91L66j71J76k21L16q3k47K60k66K26j4L7m9J27k00R7j65K30
7658A07j4k45o6K93J1j46K30p7M3n0k1m8Q0r8L0k43L55k66n8L60j31o2N8k40J94
7683dJ61l18R4M9l35M11j22m9J58K7m9O8k08J34J06qk29J38L0l8l1k53J89J14
7707C5R8k17J10Q0j27L8j78K99k83J96l2J42K78m05k00J63J95r8j62K75m41M26
7729A92q8J85k61J92k79M1K31j39R8l60Q2K06j40j70P2O7J05M8pj87o0K33P7j67
$$ y = [30, 144, -12, -397, -32, -256, -114, -295, -307, 249, 53, 76, -16, 373, -23, -62, 234, -198, -233, 68, 56, 68, -13, -105, -7, 112, 1, -42, 87, 65, -64, 190, 157, 147, 24, -191, 157, 103, 60, 276, -94, -5, 167, 46, 24, 225, -147, -41, -12, -263, 52, 77, -135, 27, -168, -3, 95, -36, -67, -108, 31, 47, 157, -6, 7, 104, -34, -7, 136, -75, 100, 117, -166, -121, -312, 54, -117, 59, -162, 154, 71, -176, 84, -182, 44, 30, 67, 18, 145, -55, 42, -123, 107, 93, -152, -218, 75, 86, -60, 170, 93, 136, 86, 65, 17, 97, -1, 29, -214, 141, -125, -183, 177, 46, -16, 42, -198, -4, 157, -161, -67, -18, -353, 58, -64, -113, 45, 72, 23, 91, -117, 17, 123, 115, -114, 24, 54, 16, -15, -268, -79, 35, 133, -84, 26, 106, -21, 17, -161, 138, -145, 51, 19, 161, 439, 34, -166, -3, 192, 94, -68, 207, -234, 192, 104, 289, 28, 220, -59, -18, 213, 74, 172, -188, -106, 100, -40, -210, -138, -71, 34, 82, 75, -112, -172, 61, 138, -29]
7753b9qJ86m68J19R1j75M04j45RQ4j73J03K58o8l68K9M81k95P0M4p1r1k57L16
7777D6l71J74ML30J3k9l89K10K90k16L3J9m18K46NN0k47K74j62L4J20O2j41o7
7801a30K25J1l23j28N07k59J58ko2j5K63j51j39J82k20J70j06K55l4k82Q7j07
7823a00N7j0l5k1K90M7p1j93j4N9P0j9J00j36J0k06J50Q1r4M5j83K99j49p2J84
7848H9j92J32K7J38l22J01J13j20K97j94n7rK87j64l5m51K88o7J83j78RK45L6
7871A56k43N8j28J03n7j65L82Pj65j73L51k34L62j77r4L0j05J26M8j35J47j74
7893h0j53K59j42J79j05j85J32n6p1J26o6J54j76K33n5J58O6n27K23J26M1L17
7915C98j72l68M23j94jk44J58R0P3j63l0o2L07k00J5L0O2M8p7j2k20j22J94M3
$$ y = [-29, -37, 149, -319, -200, -109, -284, 120, -25, -16, 68, -105, -2, 256, 188, -180, -151, 330, 35, 105, 149, 78, -13, -270, 46, -325, -151, -147, 183, 196, 167, -222, -12, 278, 62, 95, 114, -304, -58, -53, -3, -250, 24, -138, -104, 16, 78, -63, -130, 95, 106, -217, -345, 162, -97, 61, 59, -3, -18, 245, 94, -45, 137, -83, 87, -19, 236, 202, -80, 7, -100, -43, -53, -88, -109, 181, 228, 157, -36, -50, 9, 79, 60, 160, 24, 34, -172, -22, 59, -35, 10, -173, 126, -23, -95, 89, -103, 29, 56, 194, -128, -27, 86, -34, 263, 69, 12, 3, 290, 126, 91, -360, -72, -139, 44, -134, -125, 120, 156, -87, -29, -157, -54, -111, -276, 106, 113, -52, -225, 126, -108, 254, 77, -17, 13, -92, 34, 82, -53, 94, -80, -233, 26, -116, 63, -42, -227, -95, -151, -222, -96, -162, -8, -184, 49, -6, 152, 218, -309, -86, 40, 81, 398, 226, -142, 281, 87, 86, -158, 0, 90, 163, 0, -30, -92, 215, 15, 30, 60, 122, 170, 93, 81, -139, -261, -67, -24]
7939b4%j17J87J15J68m72J08K65k27K19m08K86l18L44k82J86k26K97q3J51k51
7960h2J35J37r8J57j84j76P6K12j04j36J31J5k30N0M8Q1j32Q1K10j33j23J94m4
7983H5j96K82k87J16o6r2j13Q1K38QM6j39L32j47M2k00j02J25j7j62r7K26K6N9
8007D8n9J30J73j51j39P8j43O9L2oO8J47j81q3p4J64M8k08j19M1L16l36M0L2J01
8032a2J85l85K23K1LK7q7L2l1l3pj31J87k49J92J82r0j46o4J03J4k37K37J24j57
8057i9M1j55MK78O3j33l3o4K34q0p5o6J79J10j3k76L1J31k56J24l8J06K17j31
8081I9k73L53k38K24m52N31l07m4K27l8j43K25l73J95J52j46j0n0K14%l6j99N8
8104c1K61j30l20J27J71n9J20K6k48J18Pp4p0J84j51k04K59K06k84J42k65K23
$$ y = [-24, -24, -141, 46, 161, 329, -143, -35, 230, 3, 222, -186, 100, -218, 126, -156, 30, -196, 101, 18, 169, -82, 53, 190, 92, 249, 65, -111, -35, 177, 73, -63, 68, 83, -147, -97, -49, 32, -100, -19, 191, 58, -65, 129, 85, -111, 171, -116, 0, -66, -158, -271, -190, 48, 56, 102, -37, 295, 148, 190, -10, -112, 13, -4, -166, -263, -37, -11, 48, -11, 119, 292, 141, 2, 80, -63, 6, 38, 32, 100, 247, 66, -17, -91, 73, 121, -87, -206, -165, 151, -185, -145, -113, -12, 173, -212, 11, 32, 35, 62, -25, 7, -24, -57, -64, -195, -8, -257, -65, 117, 27, -119, -183, -80, -66, -303, -66, 58, -99, -58, -213, -209, 69, 132, -1, -34, -98, 136, 56, -19, -85, 94, 204, 191, -85, -54, 77, -179, -55, -93, 13, 230, 99, -174, 179, -59, 165, -287, 244, -63, -107, 120, 82, -61, 164, -209, -14, 138, -8, -18, -68, 146, 146, 110, -89, -31, 230, 100, -220, -93, 78, 19, 139, 165, -83, 35, 42, -32, -102, 82, -69, -273, -14, 192, -92, 50, -215, 8]
8126HR2k65J45j1j67K48J04m16P1K93j31j9K01Mk94K17j28m1J04r6o3L30J5l47
8150a46J63O9J3k1j08j13J59J9RO7O4n00K24q6R8K46j47Q0j04J93m59R7M4K8k0
8175a31K20j29K1m6q5L11k11L7J46l00O4L82l28p4K35k06
$$ y = [8, 100, -165, -20, -31, -198, 50, 154, -262, -191, 102, -29, -48, 153, 157, -137, 80, -48, -89, 15, -81, -144, 186, 201, -146, 17, 86, 99, 78, -30, -143, 16, 35, 44, 111, 175, -325, -101, -187, -89, 157, 10, 90, -14, 179, -280, -183, -139, -111, -131, 89, -40, -19, -65, -150, 161, -50, -13, 133, -167, -103, 279, -49, -123, 112, -94]
8191i4
$$ Imaginary data points
##PAGE= N=2
##DATA TABLE= (X++(I..I)), XYDATA
0@%%%%%%%%%%%%%%kJ0j6J6j6J6k4L2l3M1m9N7p2Q1r0J06j22J39j60J83k07K34
36A24k63K96l32L72m14M58n11N67o26O93p67Q47r34J031j135J248j375J516j674
55h79J849k045K271k531K830l184L610m130M788n647O822q550J1371j7079N2848
70D2344q9553J6193Q6876o8932L8615j4947k0499L3841j3433q195L029k6905L5566
83A4000o192j5548K3806k7183q878L6226k1315j0348O113K047J6332j0508j0455
96a1903L295j3653K8812Q870m0527J2629J9711j1666O314j3473j281J8426j1063
109e509M246j427j6869K5431j32k0822J7569p515j4288K4960L737j9271j064J1896
123I42N717o864m609k669L939J7166j950j8929L237J5197l855j0968O040O249
$$ y = [0, 0, 0, 0, 0, 0, 0, 0, 0, 0, 0, 0, 0, 0, 0, -2, 8, -8, 8, -8, 8, -16, 16, -17, 24, -25, 32, -40, 41, -49, 57, -65, 74, -86, 97, -110, 124, -139, 157, -175, 197, -217, 241, -270, 297, -329, 364, -403, 444, -490, 541, -594, 654, -721, 795, -879, 970, -1075, 1196, -1335, 1495, -1689, 1921, -2209, 2579, -3068, 3754, -4796, 6575, -10504, 42344, -47209, -31016, 55860, -13072, 25543, 10596, -9903, 23938, 10505, 2310, 5339, -21566, 14000, 7808, -7740, 16066, -11117, -19995, 16231, -5084, -15432, -9319, -7272, 9060, -1448, -11903, -8608, -22261, 6551, 15421, -25106, -12477, 7234, -4432, 1882, -11591, -12872, 5554, -5509, -1263, -2690, -19559, 5872, 5740, -15082, 2487, -5028, -19316, 5644, 9381, -9890, -10954, 942, 6659, -205, -4814, -7483, -3544, 13622, 11672, -7257, -4020, 11177, 7322, -3646, 2394, 8643]
137H643o213N463L348j3774j886Q845p1n33J338n984m505R995L133j7617k500
152a2318J6233K009n429l823o057M586P760l238o865r50J2114K811j5049J721
166f495O975p376O829M716r950J108K523M1K913o747j083M423K317N182j1187
181e811q135J7382K090j1996K164K529J735J880k174j342k445N681N891r506l20
196b377P033n221L620O106r870k274P733J580l664j982J703J59J196M552r544
211a250o985J5391L073j2607K456L428l089K645n81m627J020N632K108o765j908
226b059M698m066J179O965o924l702P572O85n006k589P5L649K641n95n933l229
242f639Q726J452j0138J726O850l355p11K573l630l015L865N249m151m406M449
$$ y = [8643, 2430, 7893, 11241, -2533, -4419, 4426, 4355, 3822, 5160, -824, -5329, 4666, 7799, -9818, -12318, 3915, 5924, 495, -3328, -9385, -4799, 2961, -277, -7142, -8092, 4022, 6833, -8216, -6495, 480, -6896, -67, 4649, -5301, -4193, -1670, -1629, 1284, -5463, -6546, -2123, 194, 5376, -5811, -13946, 3436, 5526, -6470, -4306, -1777, -42, 1838, -336, -1678, -4123, 1558, 7449, -2057, -2377, 4656, -565, 3055, 9161, -709, -2983, 4750, 6330, 2666, 684, 2387, 2546, 3742, 8294, -1250, -8235, 7156, 10229, -2378, 78, 3506, 417, 3062, 2481, -2146, -1126, 4506, 6614, -151, -2059, 2639, -1427, -248, 6717, -207, -3909, 3663, 4348, -658, -3247, -3172, 477, 3118, 2523, -3410, -6639, 2087, 3539, -6599, -4873, 1977, -1378, -2089, 484, -3146, -6161, -2296, 2953, -1198, -5604, -1155]
257a155P96j570L439m747k716Q652M1n280P03Q50Q09K109n44k754k732O228M207
274F336q427j251P294k292j583K774k668j726M239K117l480k526L122j97m15L007
290D324m138k482P133J194o322j819L308J896r41R6j559k398M616J820p702O40
306b334N705k807J79J636l969j001K673K076k540l057L117J334j451q7k742j060
322d328M942J019l893j596J867K746j968j657J229j251K450K697m801j188L846
337A14L7j190L22p0j034Q63L603k110m595L606K937k908P48q78j946M216K446
354D161n348j772M294K033l084k13J725l253K721L332m825j019L764l05p46P47
370B212j728m24J452J477k474k992M110J342k689J112k422j459N672j320m094
$$ y = [-1155, -359, -1929, 1510, -3237, -5953, 2699, 2740, -2540, -1837, -987, -178, 1931, 1387, -1367, -4099, 2129, 6336, -2091, -3342, 3952, 1660, 77, 2851, 183, -1543, 2696, 4813, 1333, -1193, 1929, 1732, 1317, 4324, 186, -2296, 4837, 6031, -291, -2110, 1198, 3094, 2153, 2249, 690, -1708, 2908, 4728, -2974, -2334, 3371, 564, 743, 2379, -1590, -2591, 82, 2158, -382, -3439, -322, 1012, -439, -526, -3268, -4328, 614, 1633, -2260, -3856, -1989, 757, -1211, -2868, -1639, -2890, -440, 2257, -2544, -3732, 114, 151, -1039, -717, -787, -1821, -958, 2645, 535, -4060, -454, 2483, -425, 323, -555, -2501, 1715, 4161, -1187, -2959, 1335, 3368, 284, 71, 1796, -1457, 1264, 4596, -229, -1248, 2516, 2211, 1465, 2212, 484, 60, 1512, 2989, 515, -2477, 1633, 2975, 286, 1398, -1024, -2483, 3189, 1869, -2225]
385b225k82K861R37k702j306K200j254j35L048l150j687K755K76o67j049l37J310
402a407J71J601j332l710L091L365l879n5R69j280K312R80k509j457K623K296
418A779k875o50K342j901P84L506l644k018M586Q98k568j69J507l36n4K526k329
435A384k341L934L50k237J389j529l60K370m40k117j442L098J356l855L52J387
451A299k189J923N94k215L0N57J639r36k433K025K15n99J731k340j243K460l7
468D81p0j402o51K615j160R2J78l598L289K869m797N87J142n77J595j301m65K99
486h74m78L024j925l029N115k119j541M258l304p67L145p89O45j604p64L102j600
503D95O19M01m305M553J602n442K388O27j439K410k214k0O61r23K789j796k264
$$ y = [-2225, -2507, 354, 1291, -1411, -2717, -517, -1771, -1906, 1142, -2008, -3695, -940, -664, -1331, -2380, -2717, -1407, -1236, 365, -967, -4677, -1586, 1779, -2100, -2155, -1186, -2466, -154, 826, -1683, -3140, -517, 1779, -1096, -1746, 596, -1305, -521, 2985, -659, -2677, 1909, 2807, 239, 70, 1577, 1241, 1187, 3713, 1384, -957, 2977, 3327, 1090, 2479, 950, 590, 2960, 2520, 403, -1039, 2059, 3415, -440, -88, 1299, -890, 1033, 1627, -588, -558, -1, 1638, 702, -1731, 294, 509, -90, 1641, -699, -1942, 518, 481, 411, -991, -1642, 973, -187, -95, 83, -3515, -226, 2643, -2154, -1567, -425, -1002, 593, -708, -1173, -874, -1352, 1672, -253, -3282, 1833, -286, -1827, 2431, -873, -1640, 1505, 716, 1361, -243, -1007, 2095, 495, 1114, 1515, -2790, 1763, 3365, -2077, 311, 938, -501, 1909, -305, -325, 336, -587, 2202, 406, -1858]
520a858L738j684m85K928l377j33K449o77K65j702l67K811j702J42J24k282L034
537A224P96l495J99J193M00n34j291J346l97j406K478j238j529J944r19L70R25
554F6j903k23J185J371q85k797K514J569k074O65n27r19K318K85j681r82J954
571f4J200k429P92Q82j772J336J043k016R08J62l22J662j063l23l93O59K556k571
589B47j689L537p98o87Q46j715J091J499j136O3j028L97J576k025L24J424k839
606i13J488J088j612j05p83J197J018k500N62M22q37K273j833j975L451o19j647
623a325J183p48N52K02m04P52k152R77K068k729R08P22j739J043J348j779l89
640a510Q53O79J70r52J17r8O11J248k028p93K748k24j490J390l34n27N76N73n11
$$ y = [-1858, 1880, 196, -289, 2639, -738, -871, 1578, 901, 1166, -536, -903, 1908, 206, 348, 472, -1810, 1224, 2020, -1475, -1276, -83, 317, -217, -1508, -162, -559, -1965, 513, -725, -2254, -310, -1229, -859, 66, -1837, -2060, -875, 496, -389, -3186, -672, 897, -1177, -512, -1039, -1958, 360, 645, -1036, -2018, -64, 1136, -1293, -501, 381, -1391, -55, 988, -1028, -120, 42, -280, 1382, 319, -4, -397, 262, 2818, 247, -1442, 2095, 1297, 610, 1456, -259, 832, 2331, 1195, 1258, 230, 627, 2203, 178, 502, 1926, -913, 575, 1663, 51, -54, -837, 360, 1378, -1122, -560, -138, -975, 1298, -535, -2510, 941, 322, -1325, -142, -890, -338, -136, -540, 212, -1940, -963, 1105, -1624, -716, 6, -1733, -690, 658, -1121, -1510, -657, 22, 192, -760, -643, -741, -130, 1118, -910, -1703, 1045, 821, -669, 721, 387, -140, 436, 1009, 498]
659D98p50N15J307j119L07P1r27Q95P84j278n93O40J099m61j180L49N03O5K0o40
679A05k81O03O53r59n89J038l46j8O83j010q59O49N88J32j195K47N16m01Q42n95
699a97j662J497J052j466j19N47k73L29j36k60o52N50J275j109m38J137n71k66
717g62J368j157p04J302L46j74m24l67P33o7L63k46q12J115L81j055L77K15k38
736A94O26k54M1l90n4Q72m13n57O08k05J37O52r43n40O02Q00l56j245M16O14j72
757D33p2q8o14P99L99j144M8K16K02m89M25l4q65K88J078n20r84L79L10j32L84
778A9m42q73O67R57r29o53O93P9j89M69n56k23P36K88m30j91N48k10m9O52m50
799h7o05N15Q90q58m00L64K32M18k27j14k63L04P25p90j70L06K90l03R2k03k66
$$ y = [498, -252, 263, 1570, 451, 758, 829, -98, 797, 1581, 303, -290, 350, 1449, 988, -192, 157, 660, 725, 745, 105, -176, 427, 1080, 121, -468, 570, 224, 206, 889, -121, -980, -331, 257, 389, -806, -559, -43, -444, 398, -197, -1859, -362, 690, -776, -895, -348, -621, -292, -428, -688, -1340, -790, 485, -624, -1062, 75, -496, -762, 606, -551, -1255, 47, 393, 219, -205, -572, 161, 94, 457, 211, -601, 514, 895, -160, 217, 432, 194, 820, 566, 607, 217, 163, 1035, 622, 65, 673, 468, 605, 1257, 314, -226, 376, 1176, 820, -425, -9, 605, 433, 361, 273, -341, 458, 857, -287, -239, -23, 179, -310, 115, 81, -784, -496, 582, 62, -922, -543, -233, -365, 19, -423, -1296, -629, 328, -601, -1254, -561, -482, -671, -202, -758, -981, -245, 43, -387, -578, -30, -240, -289, 363, -87, -692, -177, 713, -145, -545, -181, 51, 469, 242, 128, -135, 169, 894, 104, -66, 240, 530, 227, 319, 116, -150]
820a50O84P0l99J4O3L13m80J79M01o43K26O77l24j109P97L38j79l27J8k06k1Q34
842G76p31r02P62L63q29L72l3j88J05J60k6o34K97K05J33k02M53j189O68R22q82
863d00m56P25j3n1om43N3P49R8p70l5O89o3l72K74j16j69M99o6Q3m22K34K48J35
887D05K29m72j78M22L24J28n54K36M77o15J31k63L95m06P30n81k58K26n3L5j98
908A60O9mj00K23m5r62P08L61n69O7k0k94J69M34m13m29J40P76n98l96O05k23
930c41j64O99o03j48K27j19J57l15kK78q9M45l29l97O05J67m40J71J8k37P07p8
952B12j74N0N8M60l55k73N10m83K33N07o66m5J48K13L5l25L05k87P5L89r8o78
974a89N69K16l74j70M5K04o9l76N24m91k14R39p18J9K91m80K15L39j34k91j25
$$ y = [-150, 534, 604, 205, 219, 282, 595, 115, 294, 695, 52, 278, 955, 631, -478, 319, 657, 478, 151, 169, -37, -58, 776, 45, -857, -95, 268, -561, -189, -222, -410, -305, -145, -171, -805, -508, -303, -170, -372, 81, -1108, -440, 482, -400, -856, -131, -144, -195, -201, -644, -591, 158, 256, -514, -549, 140, 77, -295, -21, -137, -306, 193, 127, 210, -212, 22, 270, 405, 634, 162, -16, 406, 730, 858, 304, 540, 1017, 402, 533, 270, 665, 259, 989, 408, 150, 376, 323, 358, 160, 229, 225, 125, 348, 303, -659, 49, 410, -159, -92, -112, -406, -237, 197, -216, -645, -505, 271, -327, -723, -118, -341, -505, 194, -409, -557, -330, -449, -292, -607, -609, -331, -420, 25, -304, -701, -96, 71, -369, -198, -180, -417, 290, 212, 38, 88, 146, 606, 251, -22, 488, 5, 238, 745, 79, 34, 182, 395, 430, 105, 410, 123, 198, 587, 489, -189, 380, 596, 222, 52, 97, 301, 232, -144, 380, -111, -325, 614, -104, -85, 206, -274, -59, 280, 146, -145, -270]
995b70Q01k26o60K04r9K13M12p24J01M7J43k68p2L36p9k62M36R9p48P33L9q44
1017f88P37l72J36K85k83L13l15J64N98m29l15L91l68M00J48q35P12j9k6M8o28
1038c46N51L52p10L84J68q82Q77nj25K20o88P80k07l21N46n48j22O78n92j44O21
1059D87j34k78J07k99N53m39J76q7m05N34l64l38N00m9n35N97J88m87N7j57L54
1080a9o9P2J41n55K26N85o65j87M92l18K04J9n02M14j69K91n1l17M99l45n3M99
1102A92m30J25J7k04N48k50j39M28Q4j27j41k78L79L26o38K71j59O8K10m10M83
1123C55k13k14P16n55j57K93k70L06j33j59J68l7O4L1m28L04L02n60K38r9k03
1144b51M09J1n55J75R5K38j46m3j9k44JN23o05qN96l57q6K91l61J57j25Q8K18
$$ y = [-270, 531, 305, -355, -151, -250, -37, 375, -349, -248, -201, -58, -326, -398, -62, -141, -403, 33, 132, -616, 117, 156, -688, 49, -323, -187, 98, -185, 128, -187, -23, 575, 146, -169, 222, -146, 254, 402, -433, 279, 260, 234, 282, -346, 205, 557, -153, 231, 399, -483, 394, 389, 264, 484, -204, 576, 369, 48, 594, 46, -76, 602, 10, -134, 487, 353, 75, 182, -117, 436, -3, 173, 86, -319, 215, -149, -487, 13, -36, -571, 26, 214, -273, -216, -373, -19, -88, -16, 125, -430, -204, 381, -284, -471, 21, -297, -93, -74, -576, -162, -331, -40, -91, -408, 91, -254, -307, 192, -238, -113, -96, -300, 248, -2, -141, 287, 371, 244, 103, -175, 204, 530, -108, 163, 4, 72, 282, -128, 355, 142, -72, 644, 89, -68, 225, -45, 261, 128, -31, 137, 100, 164, 195, -233, 71, 373, -187, 51, -48, -251, 158, 169, -386, -211, -116, 122, -24, -67, -86, -330, -329, 194, -411, -419, 177, -180, -266, 25, -336, -179, -304, -216, 2]
1167Bn55L16L41l63MK96o5N5j03M3k21q3L19K18l03K95k55L51k10m5k1k4M8p4
1191c4J82n5M6j03J42J06m51K18L83m72K55o2k88L93j55Lq3M7j04O8O0O9J5m02
1215b22M52l19l5L07j33o0k20L07l86J83M50l12k92r3M16m58L51m3j75L51j59
1236i0j12K6J91j02j70N3M54k16k95pP3Q1J23m0j42L5OJ12k03N45j76j21L1o3
1260gM43o49P4R1J6j8J92o7M1J66j76K8lj46j33K43K06m32L13R9l88L10O8Mk30
1285D5K95l09j78J10J81k68K9J50p3J87J14m83J3K5M16l69o0R6N8n2Q4j54l5q4
1309b62n3L59k90L03m31M72j15k60M7K26N2l3J73l25J48r4j05K79k24J30L7k71
1331b37l3M29j70k07M68k21j50J62K18k89p3J68L33m96L28O2j62L4O7r6l76M04
$$ y = [2, -553, -237, 104, -259, -255, 41, -24, 31, -72, -29, -250, -333, -14, 204, -99, 196, -59, 292, 82, 37, 16, -8, 40, -34, 148, 93, 139, 36, 178, 284, -167, 51, 434, -38, 217, 155, -133, 260, 105, 108, 25, 72, -32, 36, 96, 165, 180, -222, 230, -89, -124, 183, 50, -10, -230, 77, -309, -126, 324, 12, -280, -373, 43, -415, -64, -107, -282, 69, -90, -202, -176, 15, -87, -257, -204, 250, 34, -261, -268, -195, -114, 9, -31, -173, -138, -132, -20, -223, 322, 146, 25, 56, -7, 436, -213, -139, -48, -32, -50, 142, 75, 116, 282, 106, 134, 131, -15, -148, 95, 301, -131, 182, 281, -107, 203, 271, 275, 45, 340, 31, -147, -37, 144, -124, -95, 55, -18, 169, 283, -200, -187, -162, 254, -115, -175, -79, -21, -73, 11, -143, -178, -262, -315, 44, -246, 57, -374, 98, -17, -277, -230, -4, 48, 15, 188, -137, 11, -83, -188, 91, -133, -3, 34, -237, -270, 159, -11, -218, 250, 29, -121, 41, 259, -30, -103, 65, 398, -98, 230, 292, 130, 164, 231, 135, -241, 163]
1353A63J40l22J12j91J55O6k6j3LJ98j73j02K33J28n27J07K67L6l13R5M1k16L9
1376a00j21J19m9J09j5k61J69J87q7j00M4L2r9R0J63j03j43Q2m08M42O0k20K64
1399E5j76k1J27lM9l03L58l8j38K03j58J24l42L14K86p6k98L96l01O5N5Jk11J95
1423A63k52J74K49k50K74l88lK01j62p2L93k74N2K71m60O1K68l12P1L5k40K55
1445E4r4m3L32m59L27j85k50L20k14K06R1k10r1K32r3O5m14k4N39l38J75o7K9
1468a12J57j18k28J75K31k05k62L53K41k55j56K13Jk85K94j59K48l8j90J48O6
1489A19j06PR4j5J34l15O4K89j86K80l26K3J54Nj47j44L6J10p6m1L57l18m3L62
1513C17j51J13j25k11K24j22j64L7mM19q8l36J2kj45R5k70L80L28m35L50j06K24
$$ y = [163, 303, -19, 93, -98, 57, 123, 97, 84, 87, 285, 112, 10, 243, 371, -156, -49, 218, 254, -59, 36, 77, -139, -100, -221, -102, -151, -42, -57, -318, -149, 38, -49, -149, -105, -73, -172, -82, 81, -22, -165, -83, -491, -49, 11, -209, 55, -121, -142, -15, -18, 31, -272, 86, 48, -90, 113, -45, 79, -263, 51, 337, 261, -37, 359, 58, 123, 178, 179, -32, 163, -89, 85, 334, 84, 358, -30, -33, 168, 6, -66, 327, 53, 105, 376, -84, -23, 245, -67, 4, 39, -201, 54, -40, -83, 249, -210, 117, -68, -318, 2, -212, -6, 85, -125, -216, 16, -77, -12, -426, -450, 89, -249, -74, -141, -112, 45, -73, -301, -126, 105, -100, -362, -9, 232, -23, -179, 34, 35, -250, 44, -115, 133, 95, -95, 53, 119, 13, 20, 114, 99, 233, -82, -18, 271, 85, 365, 39, 62, 216, 221, 74, -70, -34, 76, 0, -41, 316, -2, -45, 317, 166, 279, 154, -57, 167, 45, -119, -82, -86, 333, 245, -91, -79, -81, -226, -131, -401, -21, 307, -128, 222, 116, 340]
1536C40l18J32k73RL54o20P74k61n1J02n37R58m34l80K91k14R5o9p5K47KN8p9
1559E1l0J90j07K03j00k24K63k73oK52j82Nj3L17J8j97j94L19j7l2j78P9k33K88
1583A99k93k26O18n7j64K5K8J09j67m7j1n0J83k52K22j25n9N9J4l28L68j66k22
1606c42K68j2J5K24j89J26P4l21k3M01k34J6l58K75J72k46Q7J33k28J06P4r4Q7
1629A1j37J93p2j35N3j11P8L70L8k96k87M07k16M09l66L03q7j2J69j64J86j87
1651A47j55k2K02k7P4j46J6j93K9J74J9k47K86k43J6K42l7m6r3J6j52Rl6K29m
1676E8q2J39k13j71O4J50L8J1k20P5qJ41k77K17j05QO8R7k34R2K68ql4k79L96
1701A91l61J29K84k06j02M14p4k80l2L18m37J78j2J43l28J34K24R4j19L2j90J46
$$ y = [340, 22, 154, -119, -110, 244, -376, 398, 137, 86, 188, -349, 609, 175, -205, 86, -128, -33, -102, -177, 70, 72, 130, 51, 21, 211, 104, 307, 207, -17, 246, -27, -33, 219, 37, 42, 29, 346, 364, 167, -27, 292, 275, 243, 65, 144, -89, 199, -94, -320, 298, 241, 77, 102, 130, 239, 72, 25, 14, -36, 147, -105, 117, -8, -67, -8, 6, -322, 46, -120, -342, -74, -86, -71, 153, -36, 90, 164, -157, -180, 221, -13, 3, -355, -80, 92, -154, -67, 66, -162, -56, 18, -76, 11, -126, 67, -5, -140, -87, -198, -120, 250, 288, -8, -295, 112, -104, 305, -61, 242, 155, 143, 312, 148, 334, 147, -8, -30, 172, 145, 219, 73, 89, -104, -75, 99, 118, -129, 157, -86, -70, 172, 135, 89, -4, 12, -140, -131, -167, 62, 58, -24, 115, -98, -269, -205, -55, -17, -6, -226, -151, -159, -18, -295, -78, -183, -175, -107, -10, -244, -152, 116, 108, 74, -205, 191, -170, -41, 243, 37, -65, 349, 275, -5, -37, 281, -156, 22, 10, 153, -175, -41, 183, 277, 158, 190, 0, 146]
1723A46j49K09j67K40k04J14m30K61J36j34Q7o7M7p1j7K41j58lj28K75j66r0j33
1746a61o9L47k48K46k90M53l39k6P0j32J07J91k62J61j23l5K3Q3j19j0J46M3O3
1769A19r4j52J12R1Lj89o5qL85r0m0N6K6j52N0Kp8K7J00m90L09J99k15K27l43
1794b10k3N24l26kJ92j61M6M4J36n6J04l79J31K40m32P7K17N0j67P6M7K0j50J39
1818A37j92O6J16l74J94p4J51j09J43k09J98J17j4m02J12J0J61j86K13J1j31J42
1840H0p8j2k12M78l16K2J9M4K4j37P8j80j03J53j46L85m2j24l8R1r1J02J26k10
1864h7L9k0Q8J01l2O7J60l90j34J05K49j58K69l92O3K14j39R1j58l1L13j21k34
1887a37K00k62K26j03K01p4j16Q2k16n7N9K26k66J73J83n9K40m24J73J42k97r4
$$ y = [146, -3, 206, 39, 279, 75, 189, -241, 20, 156, 22, 109, 42, 89, 18, 1, 242, 84, 81, -47, 228, 62, -28, -161, -230, 117, -131, 115, -175, 278, -61, -87, -17, -149, -42, 149, -113, 48, -75, -110, -87, -4, -123, -133, 13, 56, 119, 25, -127, -15, 76, 79, -110, -175, -183, 202, 112, 72, 128, 154, 2, 52, 54, -24, 3, 103, -387, -78, 121, -94, 133, -210, -233, 291, -35, -37, 155, -6, 40, 84, 220, 164, 268, -111, 20, 260, -172, -95, 122, 172, 5, 81, 128, 148, -2, 137, -55, 11, 127, -247, -53, -127, 24, -85, 58, -151, 47, 164, 150, -252, -140, -130, 31, -155, 58, 69, -62, 80, 2, -10, -222, 256, -60, -38, -19, 25, 49, -88, -10, -190, -293, -140, -286, 99, 57, -67, -105, -14, -105, -3, 123, -87, -48, -68, 20, 121, 89, 156, 316, -74, -208, -103, 146, -12, 257, -135, -72, 142, 3, 94, -64, -95, 218, 97, -137, 63, -199, 27, -76, 125, 51, -65, 17, -199, -256, -197, 29, -237, -64, 119, 60, 300, -124, 49, 191, -106, -200]
1909b00K24j7qQ2j75J63l06J84R4r4J66j41J68k08j90J73n3K45J08k61K12l9m3
1932H4j43J68qJ46j36o7R9o5l6j37O0R3k44j5l9M06m34J95J04j1J91l98L15j50
1956b2K77j23M6o2k05nR1j89L18M4j45rJ35l31l1M25Ok74j20Q1N9J32j92k88J51
1981b31K77R0k08n1K17l01N07m05j28J58N3k19J29q9M41l34J22K9j53O4k18N60
2003C10l77j07r7L87k80rJ33P2j04J62k18J64O7J32k9j95J75l27J59r0Q9j6J67
2026A68k64K2K16jj22j86Q8K6J17k42j0QK74j96L26l52J11K37p3k12j13L04l78
2049b52L38l29J39J8K6K43l09J04R2j51m7K39Kj14J26k34o7pK9K24q5l40K74J44
2073F3j17L3k7j22j24L70j48J29j81q6L13j10J90k11L1n3k67M31N1r9j18J30N
$$ y = [-200, 24, 7, -1, 81, -94, 69, -237, -53, 41, -53, 113, -28, 140, -68, -258, -85, -138, 107, 215, -46, 166, 127, 84, -59, 109, 101, 247, 111, 44, 143, 78, 42, -95, -35, 58, -186, -201, -240, 166, -268, -73, 31, 20, 211, -187, 128, -22, 255, 132, 178, 116, -89, -94, -3, -192, 126, 170, 25, 16, 151, -180, -211, 214, 220, -54, -174, -93, -34, 98, -94, -382, -231, 46, 136, -72, -123, 94, -207, 300, -105, -233, -75, -22, -241, -112, -201, 240, -94, 28, 57, -96, -32, -250, 310, -67, -174, -271, 116, -164, -173, -40, 32, -72, 90, -128, 36, 103, 235, 206, 11, 186, -141, 18, -72, 17, 1, 168, -96, -74, 142, 141, 19, -167, -79, -53, 64, -178, -188, -180, 94, -102, 224, -128, -17, 220, 147, -65, -178, 126, -252, 86, -243, -104, -86, -60, 183, -126, -22, 70, -81, -128, 111, 113, -1, 125, -109, -176, -183, -154, 70, -15, -355, -81, 63, -54, -21, -48, -170, -294, 76, -72, 57, -124, -210, 103, -7, 183, -28, 3, -50, -317, 114, 165, 66, -52, 78, 83]
2096H3k17j39K74j17R3M9J20k48K53l38j18K28K0J37r5L4n9K03r3R6m6j52O8j3
2120B3j12Q6k08J91m7RN7N0j68Q7l5k8J94j92j6M39k24r0j3J18l3l87K80j84K87
2145H4r8o2Mj39K03k8j75K63J24m2j06j03j06K34j48O9K72l31kk9K50j66J75n9
2169H4j53j7J53m1j40J71O1j15j82J40N5K1q9J32j04O4o7PK61n36M02j6l29L25
2193H7q2R7k32O9k2J08L41j71j87L5k18N22l37j22rJ08j57M53l11O7N3oo2l8q
2218b2J57p9L3j63K02k48L32k55J75j42J5J79l52J36k85L85j6J32o3J0r8K0O0
2241A13j63L30m58J10L9J64k47J74R1j07J06m5l3R4j04l99K69Q2j58J54r2R5j65
2264a50K76r3k90L97j85j16J14M4r6j35L97j19m5K9R6o3j51P1j11R2j00L60k21
$$ y = [83, -134, -273, 1, -116, -23, 26, 146, -102, 151, -187, -305, -77, -57, 80, -15, 19, -40, 163, 70, 166, 120, -32, 36, 23, -89, -3, -211, -20, -67, -58, -1, 49, -119, -32, -67, -95, 99, -93, -109, 330, 106, 16, 3, 121, 88, -299, -19, -203, 84, -14, -76, -72, -211, -8, -36, -211, 52, 176, 134, 28, -75, -181, 53, -95, -26, 246, -85, -87, -116, 134, -32, 143, 84, -69, -86, 67, 26, -114, 57, 118, 3, -179, -39, 16, 37, -52, 80, -24, 40, -27, -20, 241, -295, 107, 91, -238, 87, 5, 102, -130, -61, -83, 25, 366, 195, 8, 43, -175, 347, 10, -112, -121, -13, -170, 283, -28, 39, 92, 86, 24, -14, -22, 135, 56, 89, -74, 128, -120, 212, -43, 132, -10, 5, 184, -168, -32, -317, 68, 52, 184, 121, 131, 33, 53, 113, -50, 280, -178, -68, -29, 135, -112, 62, 153, 46, 152, 107, 74, 168, 64, -335, -66, 16, -142, 12, -80, 15, -150, 126, 33, -257, 140, -45, -161, -47, -3, -99, -234, 163, 44, -1, 28, 124, 61, -90, -19, -130, -38, -138, 222, 1]
2287Am5j17k47K37N8J77L0j23m6K77r3j67l4Q1m9K8J75k10M7j3L01l56k7j9K62
2312A28j66j91L81Q0l07J95J08k23J44k03J95j60n3NL2p1M1m1O9j65m5K41K7j33
2336a12M9j31K69N3j88R4r7qL9j25J5o2J44K3P2N1j33K6N3J77m16J72k5R5m4p2
2362h1j59L99j51P3nj41K65j09k00O9R9k17k08K62R9K59j32J32l30NJ47k86N13
2385C03n51L07j82J4L27k44q6J52j78K40n0j55J92k90N03k36j95J65m5NoQ3k28
2408a55J89o6l2l6M1N4k9K4m9P8j97K04L56n82L66k51J31orl04N58l41K36k97
2432a17J27k2j14P8l03L91q9k70M36j88l4J41Q9j41r8l1J65j23K56j9j30M17m41
2455b0j04J4K77q7K8j17j4K92m23o1L46l24K58j24J80m3j91L64j28j07n6j13J37
$$ y = [1, -44, -161, -408, -171, -113, 64, 94, -29, -75, 202, 109, -58, -92, -11, -60, -32, 143, -67, -20, -33, 268, -88, -115, -134, 128, -38, -229, 152, 232, -75, 120, 228, 5, 149, -54, 141, -19, -72, -67, -35, -106, -65, -106, -37, -202, -247, -6, 21, -112, -63, -194, 75, 128, -60, 34, -63, -71, -32, -157, -142, -204, -60, -37, 35, 86, -47, -21, 32, 209, -207, -35, -60, 35, -9, -81, -240, 159, 8, 81, 76, -65, 200, 91, -109, -40, 59, -158, -366, -104, -5, 254, 122, 254, -76, -71, 76, -210, 303, -248, 59, -123, -109, 218, -26, -112, 40, -138, 102, 52, -103, 89, -201, 302, 66, -129, 36, -9, -4, -10, 73, -155, 34, -32, -64, -100, -59, -5, -34, -10, -59, 19, -178, 26, 382, -200, 166, -85, 46, 40, 31, -273, 285, -56, 180, -117, 10, -12, -126, -48, -351, 40, -49, -319, 117, -71, -105, 36, 125, -16, -114, -145, 20, -103, 153, 134, 4, 421, -20, -124, -110, 167, 80, 108, -9, -23, 269, -154, -215, 131, -193, 65, -59, 121, 78, -113, 251, 123, 16, -40, -153, -16]
2478a6M6J5q4K18m4L1o9j68J0q0J62K74m65J46qj03J80J4J33k95O8j2j23J86p7
2503f1n3j45K76j36O9J3M8p9J84j15r3J8M7j00P0n9J68J16l05J73r6L08m0j94
2527A4R0p5J30q0o2J68l20J70n5J79j1P0j95O7r1m5J83n8p3J6J91k47Q3k1k23
2552a95L82l67J71J26k95N1J89k2q1J13j0j06L86m13r7J55o1j52O9J36K7k36j05
2575c35M91j98L21k60j61K6ok50M19k65K43K70j46j64j08J93l1N3j49K03p7n4
2597A5J00j72K20J08j76j01j32N3J02j44j54K40K1J19k42K25m7P7j66O3r3J31
2619D7j10MJ34k24o3J34J47k32j96L41o0J12j36k06L67j26r2K5Q3rO3M2K32j61
2643A16j27K3j7k17RJ87l1q1P2M0n6J20j40K62j45K46k70l4q5K9J65k8l86M56
$$ y = [-16, 30, 45, -39, 179, 135, 166, 97, -71, -61, -141, 21, 295, -170, -24, -32, -135, 45, 59, 192, -103, -35, -47, -170, 16, -61, -114, -259, 17, -119, -50, -37, 11, -68, 116, 1, -92, -74, -27, -127, -57, -116, 52, 168, -137, 36, -60, 248, 208, 14, 104, 29, 159, 79, 17, 185, -135, 35, -20, 159, 148, 218, 23, 90, -1, -46, 137, 79, 6, 22, 213, -34, 49, 28, -195, 187, -180, -9, 117, -178, -127, 62, 40, -41, 72, 62, -44, 342, -71, -168, -13, -74, -226, -157, -21, 6, -230, -335, 156, -42, 279, 19, -142, -116, -122, -372, 47, -218, 25, 295, 149, -15, -123, 70, 39, 92, -57, 146, 69, 15, 115, -57, 163, 271, 95, -6, -138, -85, 17, -127, -281, -41, -20, 99, -143, 82, 35, 112, -54, 9, -84, 47, -63, -59, 75, -149, -212, -78, 69, -163, -359, -18, -78, 34, -102, -308, 59, -67, -159, -134, -51, -60, 3, 45, 277, 116, -11, 12, -5, -222, -213, -26, -57, -138, -66, -26, -82, 38, -102, 160, 15, 261, -9, -43, -128, -99, 66, 38, -348, 108]
2667A08k0nl4J38J45p9k65j60L11j42JK7J4j07J62m4m7P8Q3J71l74K18k86K59
2691A52j47j9M4L01l02j99L23k05q8K46j09J07p4n5m6J70k5k32J18R1j12J12R2
2714A43j38n9j09M1K5K7l5J20j40K59q7J9j06J2J79k25K58k68R7nr6J40j05J62
2738A09P8q7p8J98p6L8Rj73l9K8q5J22m8K09k25O2r5j94R8J99j93L92j47r8OJ47
2764A57p8n9k3j19K2L06j3q8j48j44K52K3Lj18R5Kk3N3j49j8k7K09l3j07L6j6
2790ej90K08R6j23P3J44q4Ml60P6K91Pl01J50k9q6N2J42j11J01j54J2L6P3K89
2815C11m39N8K23J9K3J65r3p2j81o6M8J95j51r1MK9q8K49j18O0L9m4k14J20lJ13
2841I6r2J0J74j19j82k92L65J28j11k50K55J9j30L2K42j22J26j28K8o5L10l37
$$ y = [108, 88, 83, 49, 187, 332, 253, -12, -172, 139, -3, -2, 25, 39, -68, 94, 50, 3, 81, 164, 335, -39, 179, -107, 152, 5, -14, 30, 331, 29, -170, 153, -52, -140, 106, -3, 104, 30, -25, -71, 99, 74, -158, -40, 51, -61, 51, 143, 5, -54, -163, -122, -97, -70, -105, 15, -125, 134, 47, 66, -40, -28, 151, -74, 184, -84, 13, 8, -88, 52, -53, 109, 187, 100, 22, 220, 144, 182, 191, 18, -21, 7, -78, 44, -4, 205, -20, 42, -53, -247, -149, 50, -143, 249, 102, 4, 10, 157, 79, 20, -3, -122, -100, 206, 193, 105, -43, -187, 65, 88, 91, -27, 68, 70, 47, 100, -49, -67, -94, 115, 82, -25, 11, -5, -195, 13, 109, -14, 59, 203, 119, 123, -237, -161, 130, 137, -164, -14, -43, -129, -77, 65, -46, 55, -99, -87, -51, 22, 311, -128, -70, 153, 172, 195, 360, 267, 195, 14, -52, -4, 191, 40, -51, -47, -18, -106, 143, 25, 85, 124, 80, -134, -14, -17, 96, 4, 14, 188, 69, -113, -405, -40, 88, -23, -273, -18, 1, -129, -97, 145, 23, 149, 21, 49, -16, 294, -43]
2863d3k17M8R0K00j98J65j03J33j61J65k59J42P8K20l31l4j22L05k51J61j08L4
2885h6J87p3r4J24Q3j31j96K05k44J99R0l43M68O3k64J12P2j31k47Q6J34PJ48
2908A69j78PO2p8Q5Q7j45J06k21P9o2Q1n5m0J41m6J65j88J95j79J23j19PN8j17
2933f3Q7k5K00m19P2k74M82q6j73K59j89Nl6J47j46J77k7M4j09J30O9j70M8M6
2957D9m8n7J75o6r7J79k31j36L98m71M89j87j47R5k4J6j2R1J58j40P8M1j58J13
2981A08k28J40O3J7j28m4j90L04j20J83k6R3o0j69j6J14K01m58L58j20OJ74j48
3004E4J64j67j2p5J82j90L09j81n0J71l88L64q9k99K27J06l0j41M1L33n12K69
3026H6j01m5mK68Rk72m5J58J5p6L3R3j89J84j50n1rQ4l9n3J74n4J84j65l5j33
$$ y = [-43, -260, -212, -122, 78, -120, 45, -58, 75, -86, 79, -180, -38, 40, 260, -71, -105, -227, 78, -173, -12, -120, -86, 101, 28, -66, 58, 141, 10, -186, 19, -225, -26, 64, -279, 189, 252, -12, 100, 172, 41, -206, -120, 14, 21, 169, -9, -2, 60, -18, 67, 154, 9, 115, -106, -27, -89, -8, -63, -103, 38, -8, 157, -31, 164, -15, 108, -11, -4, 54, -63, 24, -1, 199, -220, -148, -422, 60, -26, -199, 60, -129, -124, -160, -13, -159, 18, -9, 35, -74, 56, 125, -45, 3, 49, 1, -56, 119, 53, -44, 135, -96, -232, 166, -305, 184, -3, -150, -55, -79, -63, -75, 16, 174, 34, 112, 153, -5, 108, -120, 20, 83, 100, -28, -72, -262, 42, -78, 105, 79, 172, 112, -57, -73, 41, 242, -216, 142, 22, 28, 202, 54, 218, 51, 39, -36, 146, -44, 265, 84, 34, 205, -183, 181, 92, -207, 20, 126, 96, -45, -4, 329, -183, 86, -15, -60, -64, 204, 213, -59, -104, 54, 69, -7, 26, 119, -70, 114, -36, -87, -96, -12, -51, -104, 70, 16, 200, 35, 0, -133]
3052a33K37j00k8j91Q4J3J58M5k23L92q3m75K75K28k35K28j39Ln8J07k47K89k2
3075A25j32j57J92J52k12OJ17k06p2pJ97M4j13k43L70n4k36L41m3o5l6J65j43
3098a0p5K16l8k1k90L92j98J24M4m03J65J9L2m2N2J3L0j31j0K7p2J05J50k01J46
3123B4n8rj0j63K19J20nj21rj40K09j02m8L8o3J26m5OR9j07R4R0J14m7j83Q6k10
3150i5L26l27J23N0j63J27K05l08RJ08m6L58k75j87J80j56n5P4j47K15L36l03
3172D9n2q6R6N4J94l67n1K81Q7l10M0K29j12k24J37J03j52K80k76k36J07O0M8
3195a01Q2k4K38l42J13J03p6j3n0o8K50n0j21J10o7j1M9K4k1l3Q5J01j33o1J34
3220A18P0j50j84K09p5J85j27j67n3k2M56l50o0J48k00K99J3P3k68L9o1r3L3J15
$$ y = [-133, 104, 4, -24, -215, -131, -118, 40, 85, -138, 254, 171, -304, -29, 199, -36, 192, 53, 56, -2, 105, -142, 147, 125, -7, -164, 28, 180, -32, -26, 91, -115, -187, -194, 3, 47, -66, -309, 61, 7, -229, 112, 69, 4, -32, 133, -10, -85, 131, 93, 72, -218, 174, -24, 100, 144, -259, -94, -75, -43, -85, -33, -20, 10, -121, -131, -104, -176, -71, 79, -122, 24, -34, -43, -53, -216, 3, 123, 118, -3, -12, -152, 57, -45, -93, -55, -118, 8, -37, -31, 68, -39, 55, 145, 259, 212, 29, 115, -95, 231, -96, 27, 77, -86, 41, 246, -62, -53, 55, 9, 367, 92, -95, 85, -71, -126, -52, -199, 16, 352, 49, -3, -89, 7, 61, 255, -112, -163, 118, 205, -105, -65, 164, 52, -172, -35, 68, -84, 196, -80, -316, -209, -149, -101, -19, -43, 195, -147, -34, 69, -7, -20, -70, -138, 112, 62, -59, 51, -16, -27, 22, 46, 25, -8, 77, 178, 45, -16, 118, 188, 38, -146, 63, -12, 173, 46, -121, -174, -196, 260, -90, -150, -2, -202, 97, 110, 183, -85, -46, -107, -200, -167, -52]
3244e2J00k82K32p6J0O3j53k8m9Q6L47m05L4J17m3N8o7J30k61J85j14L60n05M44
3268A31K3po2j8k5n4k4o9L12l88K41r5J41k70J30k9j67L69k03Q3J08k0j09lJ52
3293A47l98M63j22l3j20K3J88j72L5J9n3K58k71K44k09j59N0L4o5J31o8j43K52
3316C1K49l92K66p0n1q4k24O8J80p7KK43j64m4J82n3l15K93j84J40K7p7M35m05
3340b4q6m6L42q0j99J42R5p0j19k26L54Qj87L31l63J71m0N7k07K36p8J54k23K2
3364c6P7J00j93K43k29M0J5j72J67J74m2j04J50k82J65J13J02k57j92K21o5Mp4
3387g5q7K93k14J07N7k04nr5L25R6p3j79o9J01M0M2l5k35L67j37N6j28Q6j22N9
3412b9P8r8J3K3K04Ll31K52Nj46M1K5p3m5j78M74m26L3K65k7m07M68J58l20K35
$$ y = [-52, 48, -234, -2, -78, -68, -5, -158, -186, -235, -149, 198, -207, -173, -56, -99, -41, -108, 22, -239, -54, -168, 192, -313, 131, 154, 147, 85, 67, 42, -12, -36, -105, 207, -181, 60, -35, 106, -164, -34, -63, -230, 139, -64, 19, 127, 107, -2, -5, 147, -251, 212, 90, 57, -63, -40, 148, -24, 11, 30, -23, 235, -36, 208, -1, -160, -110, -76, -141, -10, -78, -221, 31, 280, -112, 154, 84, 33, -51, -275, -207, -27, -104, -102, 141, -23, -67, 115, 62, -253, 40, -144, -4, 23, -54, 381, -24, -110, -156, 186, 106, -93, 49, 144, 74, -45, -271, 83, 91, -96, 235, -128, 43, 3, 60, -147, 89, 11, 165, -58, -36, 41, 141, -52, 191, -38, 2, 17, -155, 12, 186, 144, 40, 190, -92, 73, 186, 288, 31, -161, 60, -5, -1, -75, -162, 131, -83, 24, 81, -123, -128, -223, 102, 198, 125, -54, -123, -22, 18, 60, 25, -210, 157, 20, 76, -52, 34, -88, -29, 49, -49, -36, -13, 191, 194, -137, 115, 120, -26, 15, 40, -33, -78, -256, 218, -208, -175, 90, 63, -344, 124, 282, -38, 197]
3437A97j36j38J68j15j24K65k04j44K06K29k79M0L6K29r1j57J91p1q6l28L87k87
3459b12K87O3J97n31%M54l82M48n76N8K77n2mj91L4P8O1q2J04J15r6k32P1N6j2
3484f7L7k59N83k76J29k74J5K18j56M4l01N39k63K35j90k55M33j62j53K75q0o1
3506A1l4R1l31K83q4Rq1J43mJ22k60J29K39k87k08L61o9q7L08k92M4m5J87Kj43
3531DP2o4k09J06r8K65j90L38j30q2J43j49Or2J4K9k8J85k17P0N6k1l01M41j91
3556d3k54K90n4R2m4m0J85j08M0J87k80O8p8k9k0K19Q3k91q4K20J71l49J1L19
3580B11l77N4P5J54j1j07j31J87R4q8n4J4o3J55r9j30J17n9J37kk18K48R2q8n6
3605E5QJ46k37J79k24L00j44n5q8J65o2J31l70K01k5L1q4Q7m5k12J87K2p4P2J62
$$ y = [197, 61, -77, 91, -24, -148, 117, -87, -231, -25, 204, -75, -35, 1, 230, 139, -18, 173, 102, 16, -312, 75, -212, 75, 138, 335, -196, -196, 258, -124, 324, -252, -194, 83, 31, 27, -164, -130, -52, 9, -73, 31, 146, 50, -182, -111, -55, -67, -30, -289, 294, 18, 147, -127, -112, 106, -50, -6, -307, 232, -31, 204, 14, -241, 192, 30, -123, 152, 72, 11, -23, 68, -263, 20, -64, -55, -136, 7, 3, 125, -135, -6, 233, -54, -262, 99, 30, -57, 251, -41, 3, -42, 145, 147, 4, 76, 12, -197, -91, -189, 76, -114, 224, 94, 12, 155, 6, 12, -80, -66, -37, -65, 120, -97, -27, 29, 8, -293, 148, -43, -297, -7, -61, 31, -13, -53, 132, 24, 64, 251, -29, 39, -39, -68, -88, 131, 214, -77, -161, 59, 230, -119, -108, 211, -166, -112, -37, 117, 106, -1, -132, 55, 149, 61, 7, 21, -42, 113, 14, -116, 1, -58, 79, 77, -141, 107, 199, 111, 55, 63, 209, -28, 151, -73, 227, 83, 28, -60, 105, 43, 174, -196, 5, -20, 11, -73, 14, -31, -243, -56, -34, -108, -36, 126]
3630A26j8p2j66L14nk66L66m19j3Nk09L18j43J79j49R6L06k01k05p4J52j13L25
3653A34r3j40J87j17J39j48q2J13R7J0j82K79k43pn0M1K5Q8J9j71J03L7j39J35
3677C5R3q1K06j1l88K42j57J94k46Q6J11J0l9m35L55R3j32J32lk60P8J61k45J60
3701d1Q9j97J13J73j19J54l38J90Jj22M5M5R0j16r2L49k73O3M0LK01o39L82K7
3725B8P7k08J00j57J93l0n1K31j75J18N8l59L43k28j93L02L2J31j06m7J10j19
3747E0J51nl40m0J33NJ93r2n8J17l71K19j24j0K22R4j13l31K12J56n8N9J22l15
3771a24J14j21p4P0J23K8OJ14k77k1L33r9N0p3J13k78Q6J54k24P3J2n1L60m19
3795a25P4R6lj13J4j19pK52Lj24J26k39J50kj14j8k8K22j3J1J04J54l91J40P0
$$ y = [126, 108, 36, -130, 184, 179, -87, 279, -140, -153, -148, -357, -39, -182, -3, -152, -56, 250, 49, -156, -230, -78, -191, 134, 41, -99, 88, -29, 110, -38, -120, -7, 90, 100, -82, 197, -46, -53, -103, -62, -37, 51, 70, -101, 2, 39, -100, 35, 128, 47, 253, 242, -146, 96, -61, 133, -113, -27, 84, 94, 55, -380, -25, 68, -64, 68, 65, -195, -117, 44, -201, -41, 48, -149, -36, 137, 18, 172, -166, 24, 25, -97, -52, -7, 83, -33, -125, 224, -49, 14, 54, 57, 258, -381, 1, 28, 105, -103, -3, -160, 33, 3, -48, 183, 8, 126, 184, -175, 168, -60, -253, 49, 81, 212, 106, 59, 169, 50, 201, 196, -144, -184, -51, -46, 147, 55, -3, 114, -257, -38, -162, -172, 50, 144, 31, -300, -88, 68, 10, 69, 191, -124, -10, -131, -205, -135, -12, 16, 22, 136, -141, -162, 171, 72, 122, 49, 162, -116, -30, 124, -100, -27, -15, -66, 294, -125, -51, 45, 42, -71, -57, -176, -183, 69, 72, -52, 74, -165, -15, -17, -131, -149, -177, 45, 32, 43, 147, 301, -90, 50, 120]
3820A20o5m3l5R9j52N7K21j70N6J44k62K71l62Q4R8j57K51j00q7N4l9R6q9j65
3844a75J94k3p8J42K3l8M4l0k06O6j8J98r7N5k01L21k51M7p6P7n0j7J42k8M4k13
3870a48J63j19M4P3j00K74j38J33o3j35N5J18j58J3J6j75K56j60L6K00j13m5N
3893C2N3r5kP2m3j00O3k9J47p2q4j02O4j58K55j12L6l4K61j14p7j20K15Q0N9k46
3919e1k11K93r8l9j28K51j29J95l09J56Q4PO3P7l86L32j39J66k58K00j66J27J82
3942B19l07K13k05J17j19J24j44L89j32mk0J0K1j49m1L5J73j60P3Q8k47J20j10
3965e6M8l3j14R2lJ59j77k9J37p5k34L50l79L04k5L22n13J70L12j28j35J36j34
3988ej42J87l36M28l02k28M78J90Kk94J7l3L12k86r6K87j72R2P9k4l87k0M60l47
$$ y = [120, 55, 12, -23, 76, -76, -19, 202, 32, 88, 232, -30, 241, -121, -37, 61, -96, 155, 55, -32, 22, -17, 79, -10, -175, 19, -4, -82, 60, 83, 45, 89, 59, -147, -81, -99, 99, 2, 57, -144, 177, -74, -27, -103, -26, -76, -93, 49, 21, 65, -148, 15, -104, -60, 13, -87, 187, 49, 182, 119, -16, 39, 157, -1, 12, 28, -147, 109, -51, -15, 185, 72, 27, 32, 85, -10, -12, 60, 17, -83, -20, -49, 98, 26, -58, -160, -96, -254, 1, -111, -75, -109, 152, 38, -39, -159, 56, 136, 195, -51, -262, 31, -67, -106, -234, 17, -112, 83, -226, -70, 14, 21, 84, 161, -225, 107, -32, 134, -124, 76, -90, 37, 219, -88, 125, -80, 37, -82, 42, -102, 287, 155, 151, 131, 141, 162, 13, -28, 7, 180, 20, 93, 181, -66, 54, -56, -8, -41, -155, -63, -66, 93, -84, -113, 24, -51, -285, 65, -314, -10, -35, 287, -226, -56, 256, 128, -7, 129, -5, -147, 40, -296, 132, -170, -398, 80, 270, 272, -22, -5, -38, 274, -12, -108, 179, 7, 99, 178, 154, -233, -253, 207, -140]
4012a40j20J89m8j48J42j24L95p9k18J95k28J87o4J63j77KkJ29j46J31M1j65J10
4035B5r1J56q4L4m6q4N3L38l71m9L85n47L42jqj75N4N9O7l3j05Q3r6J05P9l61
4061b71L67r2J2k14L4qJ35L7p7j38Q0J02J12k98K34k9j64K40j87J89r2n2j53l1
4085b64NJ07l9J31O2o4R8l65K74J11p6R2J34m19M30k29k09l4R5P7P0Q9j22J54
4109A08r4K80j61k18j4J75k87M32l30P2J78k02K19k56J72k12j18L50k0J03j82
4130eJ3o2L80k40j1m76L53J05L0p2J02q1p0K39k94K13m65L00J46ok17K01r8j34
4154a49m3O1P3j19K05k52RK27j04J6J89j43n0P0J32j6j50P3Jl0j14L0n5J00j90
4179b29K76L62m07m00O38q9k35n4L16j90J43K00j99Pn0L1l09J49J46J31k35K48
$$ y = [-140, -260, -71, -119, -267, -125, -249, 146, 67, -151, 44, -184, 3, -61, 102, -75, -73, -75, 54, -92, 39, 80, -85, 25, -66, 90, 6, 40, -6, -90, -37, 301, -70, -119, 266, -281, 61, 60, 52, -123, -69, -10, 57, 24, -81, 2, -94, 11, 90, -271, 96, 4, 16, -198, -164, -172, -37, 0, -77, -215, -135, -33, 79, -219, 15, -14, -178, 62, -125, 64, -28, -80, -233, -264, -259, -152, -191, -60, 2, -62, 36, -329, -55, 56, -20, 72, 206, -213, 217, -12, -221, -255, -160, -83, -13, 76, -46, 108, 14, 294, 133, -85, -99, 76, -211, 221, -109, -37, 141, -61, 158, -98, 74, -138, -256, 94, 74, 177, -5, 8, -54, 326, 86, 75, -401, -48, 57, 87, 15, 117, 36, -34, 205, -89, 124, -341, -41, 105, 99, -118, 83, -15, -149, -192, -131, -58, -177, 28, -224, -215, 12, -92, -76, 113, -30, -80, -10, 122, 106, -44, 29, 30, 0, -114, -84, -139, -39, -229, 47, 409, 2, -398, 240, 151, -84, -138, 178, -12, 131, 331, 132, 139, 89, 120, -189, -40, 106, 237, 2, 250]
4201B50j59K02p5k18K17j93m19O33k70P6l00L84k61O5O0k63K52l1RJ01K2K8q1
4224B9q4N3Q7j35Pl8K10k07j62L37j13k4J5m8Qm1J25m2K5j05p0K13N5j63j75K62
4250A9J68m5p7j9R7k91J16J14j27M2K0N3L75m01j41oJ58J27n0j80J88k49J05j67
4274a71M41k15k66L41j19m6J79N1k44J20R1j49j3k9p9J73l48K25J97k94J66l7
4296b6j85L37j38j41J56Q0k76J74K94l76j0Q8K2K1o9j1K9K4nj36r2L48r6j30n9
4321a77J17l0qP1P3j71J30p3K07j88rm2R3J05j36K6j9K78k16j18J48o1J73j96
4345b3J17j32J52k00O8L2N7q6j3Q0J26j19k7k03K44K7m15K80R6M1ll36K62j55
$$ y = [250, 91, 293, 218, 0, 217, 24, -395, 238, -32, 44, -256, 128, -133, -68, -8, -271, -19, -50, -41, 60, 82, 110, 29, -55, -2, 85, -50, -43, -81, 129, -78, -240, 97, -16, -40, -25, -73, -65, -106, 19, -23, 2, -103, -173, 40, 95, -68, -243, 19, 187, 142, 65, 46, 143, -148, -32, 82, -45, -3, 17, 70, 445, 44, -97, -103, 55, 182, 132, -48, 140, -109, -4, -171, 270, 55, -211, 130, 11, -35, 144, 195, -49, 71, 162, 13, 0, -29, -108, 65, -283, -58, 139, -155, 11, -26, -211, 126, -12, -153, 3, 83, -193, -19, 275, -101, -111, -23, -1, 20, -49, -60, -31, -7, -12, -148, -240, 108, 12, -118, -177, -60, -90, -98, -27, 46, -125, 5, -68, 139, -49, -58, -100, -7, 98, -38, -12, -31, 247, 31, -87, 61, 0, 173, -23, 94, -38, 114, -86, -18, 14, 71, -15, -28, 52, 178, 59, 32, -171, 73, 100, -315, -35, 61, 102, 99, -237, 25, -130]
$$ [...]
8191f
##END NTUPLES=NMR FID
##END=
