##TITLE=31Pdec_LY-6.1.Dix.1H
 CD3CN, 24 sc
 31.03.2021
##JCAMPDX= 6.0         $$ Bruker NMR JCAMP-DX V2.0
##DATA TYPE= NMR SPECTRUM
##DATA CLASS= NTUPLES
##ORIGIN= UXNMR, Bruker Analytische Messtechnik GmbH
##OWNER= root
$$ XWIN-NMR		Version 3.5
$$ Wed Mar 31 13:47:54 2021 Russian Standard Time (UT+4h)  she@DPX200
##.OBSERVE FREQUENCY= 81.013821
##.OBSERVE NUCLEUS= ^31P
##.ACQUISITION MODE= SIMULTANEOUS
##.ACQUISITION SCHEME= undefined
##.AVERAGES= 24
##.DIGITISER RES= 16
##SPECTROMETER/DATA SYSTEM= spect
##.PULSE SEQUENCE= zgpg30
##.SOLVENT NAME= CDCl3
##.SHIFT REFERENCE= (INTERNAL, CDCl3, 0, 248.564)
##AUDIT TRAIL= $$ (NUMBER, WHEN, WHO, WHERE, WHAT)
$$ ##TITLE= Audit trail, XWIN-NMR		Version 3.5
$$ ##JCAMPDX= 5.01
$$ ##ORIGIN= Bruker BioSpin GmbH
$$ ##OWNER= she
$$ F:/spectra/data/she/nmr/P31/1/pdata/1/auditp.txt
$$ ##AUDIT TRAIL=  $$ (NUMBER, WHEN, WHO, WHERE, WHAT)
(   1,<2021-03-31 13:46:52.57 +0400>,<she>,<DPX200>,
      <created by zg, POWCHK disabled, PULCHK disabled
       configuration hash MD5:
       00 E9 B6 7A A2 85 ED C7 34 08 36 98 17 FE 4E 26
       data hash MD5: 32K
       99 78 68 BB 45 12 DA 46 8C E2 DD 1E 03 CB 10 76>)
(   2,<2021-03-31 13:46:55.15 +0400>,<she>,<DPX200>,
      <Start of raw data processing
       efp BC_mod = 2 LB = 1 FT_mod = 6 PKNL = 1 PHC0 = -4604.565 PHC1 = 443.001 SI = 64K 
       data hash MD5: 64K
       2C 9A CF 2D 91 8F A5 64 BA 7C 39 F1 B3 8A 2A CE>)
(   3,<2021-03-31 13:47:16.89 +0400>,<she>,<DPX200>,
      <pk PHC0 = 23.33183 PHC1 = -61.00001 
       data hash MD5: 64K
       E6 36 5A D9 3C 38 29 33 47 63 74 3D 9F 9D 93 EE>)
(   4,<2021-03-31 13:47:20.23 +0400>,<she>,<DPX200>,
      <abs ABSG = 5 
       data hash MD5: 64K
       9E 74 E8 DC AF AA D4 EA 0F A5 9A 7E EE D7 56 EC>)
$$ ##END=
$$ 
$$ hash MD5
$$ 49 53 F0 25 93 DE C8 3E AD CA 5E 88 85 15 29 24
##$RELAX= 
##$RELAX= 
##$RELAX= 
##$RELAX= 
##$RELAX= 
##$RELAX= 
##$RELAX= 
##$RELAX= 
$$ Bruker specific parameters
$$ --------------------------
##$DU= <F:/spectra>
##$EXPNO= 1
##$NAME= <P31>
##$PROCNO= 1
##$TYPE= <nmr>
##$USER= <she>
##$AMP= (0..31)
100 100 100 100 100 100 100 100 100 100 100 100 100 100 100 100 100 100 
100 100 100 100 100 100 100 100 100 100 100 100 100 100 
##$AQSEQ= 0
##$AQ_mod= 1
##$AUNM= <au_zg>
##$AUTOPOS= <>
##$BF1= 81.014009
##$BF2= 200.13
##$BF3= 200.13
##$BF4= 200.13
##$BF5= 200.13
##$BF6= 200.13
##$BF7= 200.13
##$BF8= 200.13
##$BYTORDA= 1
##$CFDGTYP= 0
##$CFRGTYP= 5
##$CHEMSTR= <none>
##$CNST= (0..31)
1 1 145 1 1 1 1 1 1 1 1 1 1 1 1 1 1 1 1 1 1 1 1 1 1 1 1 1 1 1 1 1 
##$CPDPRG= <waltz16>
##$CPDPRG1= <>
##$CPDPRG2= <waltz16>
##$CPDPRG3= <>
##$CPDPRG4= <mlev>
##$CPDPRG5= <mlev>
##$CPDPRG6= <mlev>
##$CPDPRG7= <mlev>
##$CPDPRG8= <mlev>
##$CPDPRGB= <>
##$CPDPRGT= <>
##$D= (0..31)
0 1 0 0 0 0 0 0 0 0 0 0.03 2e-05 3e-06 0 0 0 0 0 0 0 0 0 0 0 0 0 0 0 0 
0 0 
##$DATE= 1617184011
##$DBL= (0..7)
120 120 120 11 120 120 24 19 
##$DBP= (0..7)
150 150 150 150 150 150 150 150 
##$DBP07= 0
##$DBPNAM0= <>
##$DBPNAM1= <>
$$ [...]
##$SUBNAM3= <"">
##$SUBNAM4= <"">
##$SUBNAM5= <"">
##$SUBNAM6= <"">
##$SUBNAM7= <"">
##$SUBNAM8= <"">
##$SUBNAM9= <"">
##$SW= 501.771253377433
##$SWIBOX= (0..15)
0 1 3 0 0 0 0 0 0 0 0 0 0 0 0 0 
##$SW_h= 40650.406504065
##$TD= 32768
##$TD0= 1
##$TE= 0
##$TE2= 300
##$TE3= 300
##$TEG= 300
##$TL= (0..7)
0 120 53 12 22 120 120 120 
##$TP= (0..7)
150 150 150 150 150 150 150 150 
##$TP07= 0
##$TPNAME0= <>
##$TPNAME1= <>
##$TPNAME2= <>
##$TPNAME3= <>
##$TPNAME4= <>
##$TPNAME5= <>
##$TPNAME6= <>
##$TPNAME7= <>
##$TPOAL= (0..7)
0.5 0.5 0.5 0.5 0.5 0.5 0.5 0.5 
##$TPOFFS= (0..7)
0 0 0 0 0 0 0 0 
##$TUNHIN= 0
##$TUNHOUT= 0
##$TUNXOUT= 0
##$USERA1= <user>
##$USERA2= <user>
##$USERA3= <user>
##$USERA4= <user>
##$USERA5= <user>
##$V9= 5
##$VALIST= <valist>
##$VCLIST= <CCCCCCCCCCCCCCC>
##$VD= 0
##$VDLIST= <DDDDDDDDDDDDDDD>
##$VPLIST= <PPPPPPPPPPPPPPP>
##$VTLIST= <TTTTTTTTTTTTTTT>
##$WBST= 1024
##$WBSW= 4
##$XGAIN= (0..3)
0 0 0 0 
##$XL= 0
##$YL= 0
##$YMAX_a= 3839
##$YMIN_a= -5969
##$ZGOPTNS= <>
##$ZL1= 120
##$ZL2= 120
##$ZL3= 120
##$ZL4= 120
##$ABSF1= 248.5645
##$ABSF2= -253.2056
##$ABSG= 5
##$ABSL= 3
##$ALPHA= 0
##$AQORDER= 0
##$ASSFAC= 0
##$ASSFACI= 0
##$ASSFACX= 0
##$ASSWID= 0
##$AUNMP= <proc_1d>
##$AZFE= 0.1
##$AZFW= 0.5
##$BCFW= 0
##$BC_mod= 2
##$BYTORDP= 0
##$COROFFS= 0
##$CY= -3
##$DATMOD= 1
##$DC= 0
##$DFILT= <>
##$DTYPP= 0
##$F1P= 0
##$F2P= 0
##$FCOR= 1
##$FTSIZE= 65536
##$FT_mod= 6
##$GAMMA= 0
##$GB= 0
##$INTBC= 1
##$INTSCL= 5.30512e-09
##$ISEN= 30
##$LB= 1
##$LEV0= 0
##$LPBIN= 0
##$MAXI= 10000
##$MC2= 0
##$MEAN= 0
##$ME_mod= 0
##$MI= 50
##$NCOEF= 0
##$NC_proc= -5
##$NLEV= 6
##$NOISF1= 182.463
##$NOISF2= 159.3651
##$NSP= 0
##$NTH_PI= 0
##$NZP= 0
##$OFFSET= 248.5645
##$PC= 4
##$PHC0= -4581.233
##$PHC1= 382.001
##$PH_mod= 1
##$PKNL= yes
##$PPARMOD= 0
##$PSCAL= 0
##$PSIGN= 0
##$REVERSE= no
##$SF= 81.014009
##$SI= 65536
##$SIGF1= 159.3651
##$SIGF2= -187.1042
##$SINO= 113.3802
##$SIOLD= 16384
##$SREGLST= <1H.CDCl3>
##$SSB= 0
##$STSI= 65536
##$STSR= 0
##$SW_p= 40650.406504065
##$SYMM= 0
##$S_DEV= 0
##$TDeff= 32768
##$TDoff= 0
##$TI= <>
##$TILT= no
##$TM1= 0
##$TM2= 0
##$TOPLEV= 0
##$USERP1= <user>
##$USERP2= <user>
##$USERP3= <user>
##$USERP4= <user>
##$USERP5= <user>
##$WDW= 1
##$XDIM= 65536
##$YMAX_p= 377878932
##$YMIN_p= -52830079
$$ End of Bruker specific parameters
$$ ---------------------------------
##NTUPLES= NMR SPECTRUM
##VAR_NAME=  FREQUENCY,     SPECTRUM/REAL,   SPECTRUM/IMAG
##SYMBOL=    X,             R,               I
##VAR_TYPE=  INDEPENDENT,   DEPENDENT,       DEPENDENT
##VAR_FORM=  AFFN,          ASDF,            ASDF
##VAR_DIM=   65536,         65536,           65536
##UNITS=     HZ,            ARBITRARY UNITS, ARBITRARY UNITS
##FACTOR=    0.620285442955139, 1,           1
##FIRST=     20137.2065510759, 0,            0
##LAST=      -20513.1999529892, 0,           0
##MIN=       -20513.1999529892, -52830079,   0
##MAX=       20137.2065510759, 377878932,    0
$$ Real data points
##PAGE= N=1
##DATA TABLE= (X++(R..R)), XYDATA
$$ [...]
35533b97532k99702j283165j271570K99995J864147J674540M11611Q0957Q35629
$$ -297532 -597234 -1880399 -3151969 -2851974 -987827 686713 1098324 1179281 2014910
35524B014910R47401j61297j035574p35203k17051l88189n98129j45801K49870
$$ 2014910 2962311 2801014 1765440 1030237 813186 424997 -173132 -318933 -69063
35515f9063k34270r17226o41012M19070J147721J060036M82395k46651q52282
$$ -69063 -303333 -1220559 -1861571 -1442501 -294780 765256 1247651 1001000 148718
35506A48718r33731m68552K4210L68628R69391J601752J123102o61827k028020
$$ 148718 -785013 -1253565 -1229355 -860727 108664 1710416 2833518 2171691 143671
35497A43671j512862n3573N25332K14931K58454O46083K65143p55452j026522
$$ 143671 -1369191 -1422764 -897432 -682501 -424047 222036 487179 -268273 -1294795
35488a294795l42277l7166m80720l17378R69472J736892P23304p59725q01433
$$ -1294795 -1637072 -1674238 -2154958 -2472336 -1502864 234028 957332 197607 -603826
35479f03826K11417N07043j25604l19525K89600N15108j34079n36831K4202N22723
$$ -603826 -392409 114634 -10970 -330495 -40895 474213 340134 -196697 -172495 350228
35469C50228p2238r45530o70528M86451R74699L41559k70480q3907K46935j1661
$$ 350228 277990 -667540 -1338068 -851617 123082 464641 194161 110254 357189 345528
35459C45528m23999k28500M10857P91367P09075L79379j51683p92396j081421
$$ 345528 -78471 -306971 103886 895253 1604328 1983707 1832024 1039628 -41793
35450d1793p94095m00744k45304J04528Q71936J213714M89975l44772p0937O76394
$$ -41793 -835888 -1236632 -1481936 -1377408 -505472 708242 1198217 853445 782508 1458902
35440A458902L48815q64637j338599q23043o84246j113496n94306J099306J917561
$$ 1458902 1807717 943080 -395519 -1218562 -1902808 -3016304 -3610610 -2511304 -593743
35431e93743Q32045k80936K43634J108309N44761m86632j90322O24526l0388j589244
$$ -593743 238302 -42634 201000 1309309 1854070 1367438 1177116 1801642 1771254 182010
35421A82010j761223m46034L48620K07504O43658J622382J172286q11436j703192
$$ 182010 -1579213 -2025247 -1676627 -1469123 -825465 796917 1969203 1157767 -545425
35412e45425l71214Q07041j09227j450065r01965O99628J093345L35711J48836
$$ -545425 -916639 -109598 -218825 -1668890 -2570855 -1871227 -777882 -442171 -293335
35403b93335P29242Q03272J29279m08012o82967j152021j254687j38184J345294
$$ -293335 435907 1239179 1368458 960446 277479 -874542 -2129229 -2267413 -922119
35394i22119J509216N26485J17410O08399N61315m36096r22283j44547O38263
$$ -922119 587097 1113582 1230992 1839391 2400706 1964610 1042327 897780 1536043
35385A536043L67484j85538j09989J5084n10609r44468l71839N52664O11506l3450
$$ 1536043 1903527 1717989 1608000 1623084 1112475 168007 -203832 348832 960338 926888
35375I26888l12886o3390j8524l67095n27354j51379N82483J389479J785969J077084
$$ 926888 614002 550612 532088 164993 -362361 -513740 68743 1458222 3244191 4321275
35365D321275o12626j816991j346897n369N02060j2525k57198K88657O99708L47549
$$ 4321275 3708649 1891658 544761 539392 1041452 1028927 771729 1060386 1760094 2107643
35355B107643j35865j01894J23354O2755j11745j88793m38448r27356j087379
$$ 2107643 1971778 1869884 1993238 2055993 1944248 1755455 1317007 389651 -697728
35346f97728n43180K97619R32843J309517J269752L81403j040576j663110p65124
$$ -697728 -1240908 -943289 -10446 1299071 2568823 2950226 1909650 246540 -518584
35337e18584N80500Q77625J39343n24605o71273p01751o35417k6237Q59523J001968
$$ -518584 61916 939541 1078884 554279 -116994 -818745 -1454162 -1480399 -620876 381092
35327C81092J48065n73647j56542P72749O74344q03838k080662j402606Q20790
$$ 381092 529157 -44490 -201032 571717 1246061 442223 -1638439 -3041045 -2220255
35318b220255K126035R16506j324741j795587o6106J518243J357357O33957Q03240
$$ -2220255 -94220 822286 -502455 -2298042 -2364148 -845905 511452 1145409 1948649
35309A948649R46474l93720k074885j662751N67187J649853K98493j278008r02415
$$ 1948649 2895123 2501403 426518 -1236233 -669046 980807 1279300 1292 -901123
35300i01123M40682N58460n06600q98273M7144J041794Q95814p8148q32911q21550
$$ -901123 -460441 98019 -408581 -1306854 -1259710 -217916 677898 599750 -233161 -1054711
35290a054711k79874J83580J93455K1362K02338O43001O44625N5721l03319J60191
$$ -1054711 -1334585 -1151005 -957550 -936188 -733850 -90849 553776 609497 306178 466369
35280D66369Q66491R41501M57412J09445J34265K36741J98481m9073n41100r30859
$$ 466369 1332860 2274361 2731773 2841218 2975483 3212224 3410705 3361632 2820532 1889673
35270A889673n97804K69444M26825o82551j654249q51734J040076J687989L18172
$$ 1889673 1291869 1561313 1988138 1305587 -348662 -1200396 -160320 1527669 1845841
35261A845841j255186j219867m8982N89517J94323l55967m21905l25183m53632
$$ 1845841 590655 -629212 -678194 -88677 105646 -250321 -672226 -997409 -1451041
35252a451041n27002j30359N07986P55307M31201k6672k68984m11157m88657j24936
$$ -1451041 -1978043 -2108402 -1600416 -845109 -413908 -440580 -709564 -1120721 -1609378 -1734314
35242a734314O79046R53887m3703j296685j007046P12402J621717N34829p91657
$$ -1734314 -1055268 -101381 -145084 -1441769 -2448815 -1736413 -114696 420133 -371524
35233c71524k80592J197193J115029p48741j883101q13981P91791P51285n28875
$$ -371524 -652116 545077 1660106 911365 -971736 -1785717 -993926 -242641 -771516
35224g71516j012479j37905O59205L06176m58536l92373M43767R00345M12469
$$ -771516 -1783995 -1921900 -1262695 -956519 -1415055 -1807428 -1363661 -463316 -50847
35215e0847k51804r7312O98337J025885M26712k47429j41601K53257j31076j137559
$$ -50847 -302651 -399963 298374 1324259 1750971 1503542 1361941 1615198 1484122 346563
35205C46563j428370m89098M67227J90090q14636j037780q5153Q74423P33633
$$ 346563 -1081807 -1570905 -1103678 -913588 -1728224 -2766004 -2851157 -1976734 -1243101
35196a243101k30271q46274m04765O63560J236363O32293n14089p54089M02794
$$ -1243101 -1473372 -2319646 -2724411 -2060851 -824488 -192195 -706284 -1460373 -1057579
35187a057579J571033J105406n66666j334701l20946Q66642N16049p57582j209055
$$ -1057579 513454 1618860 1052194 -282507 -603453 263189 779238 21656 -1187399
35178a187399o82338m52888p83333n68856M30287R42146M15038P6938P12479J065162
$$ -1187399 -1869737 -2322625 -3105958 -3674814 -3244527 -2302381 -1887343 -1810405 -1097926 -32764
35168c2764m5190j408879j104893M56529J202569N76396k5890J74265L98360J50270
$$ -32764 -77954 -1486833 -2591726 -2135197 -932628 -356232 -382122 -207857 190503 340773
35158C40773O6346M13695M18043k53475p73330n59531r8478K02983O44940J100465
$$ 340773 407119 820814 1238857 985382 212052 -347479 -445957 -242974 401966 1502431
35148A502431O57194p93980j874286j509977l35762M62140O21979M16974m5762
$$ 1502431 2159625 1365645 -508641 -2018618 -2354380 -1892240 -1270261 -853287 -899049
35139h99049l92632k8310O86447N88087l08218n48219K60107N83973k44485n03383
$$ -899049 -1291681 -1319991 -633544 -45457 -353675 -901894 -641787 -57814 -302299 -805682
35129h05682R18835K086106R39078j091951j223386K07502N37720o79511j225334
$$ -805682 113153 2199259 3138337 2046386 823000 1030502 1568222 888711 -336623
35120c36623k04002P40334O16899M89032Q97331P11141l22735n42084O26267J066372
$$ -336623 -540625 199709 816608 1305640 2202971 2914112 2591377 2049293 2675560 3741932
35110C741932o80320k522200j663573J036911K150879N50287j283574j018693
$$ 3741932 3061612 539412 -1124161 -87250 2063629 2613916 1330342 311649
35102C11649N29779J011473j98557j521981j463835l20389N89525O94282M98000
$$ 311649 841428 1852901 1654344 132363 -1331472 -1651861 -1062336 -368054 129946
35093A29946L73551N559o01358n70676M59376J190896K65893j405732j516714
$$ 129946 503497 509056 -92302 -662978 -203602 987294 1253187 -152545 -1669259
35084a669259L92381K160628J925825L62213p36765q51969o92857o48448m36835
$$ -1669259 -1276878 883750 2809575 3171788 2435023 1583054 890197 241749 -195086
35075a95086N3988M60607M32905L029m25443l33831L55201R69256Q13507J47073
$$ -195086 -141098 319509 752414 755443 330000 -3831 351370 1320626 2134133 2281206
35065B281206k24401k22097m18314o83682j57734J035536J350030m0987j705188
$$ 2281206 2056805 1834708 1416394 732712 574978 1610514 2960544 2919557 1214369
35056A214369j699026k10956P64931J48977r93443j099436p1046Q88923R08590
$$ 1214369 -484657 -695613 69318 218295 -775148 -1874584 -1945630 -1056707 -148117
35047a48117L18964p8014j17214k55737o29598p26340k14240M42976O35504M46297
$$ -148117 170847 92833 -24381 -280118 -909716 -1636056 -1850296 -1407320 -771816 -325519
35037c25519L34868L73054L70321L87311M76075K67433m46314j027216o98804
$$ -325519 9349 382403 752724 1140035 1616110 1883543 1437229 410013 -288791
35028b88791K68015Q50486N94840m6484m73359l78372K44771Q67503O46364m18328
$$ -288791 -20776 829710 1424550 1378066 904707 526335 771106 1638609 2284973 1866645
35018A866645j143768p78644j43570j32341p7593R05594J851604J111684r42877
$$ 1866645 722877 -55767 -199337 -331678 -409271 496323 2347927 3459611 2516734
35009B516734k319935k183325j356864m26165O11023J103622M08266l59606L98369
$$ 2516734 196799 -1986526 -3343390 -3769555 -3158532 -2054910 -1646644 -2006250 -1607881
35000a607881J822595J540227l69862j265553k31859N97126j33524r59142o43247
$$ -1607881 214714 1754941 1385079 119526 -112333 484793 351269 -607873 -1251120
34991a251120k26820m52963j09934J187840J489441l5755j009415K31043J441921
$$ -1251120 -1477940 -1930903 -2040837 -852997 636444 600689 -408726 -177683 1264238
34982A264238K61009j458435p65228J121388Q46310j253565j809185k12288P31189
$$ 1264238 1525247 66812 -698416 422972 1269282 15717 -1793468 -2005756 -1274567
34973a274567j9329k66623R52845J483288O5008j291792q04218J77052j40894
$$ -1274567 -1293896 -1560519 -607674 875614 940622 -351170 -1155388 -978336 -1119230
34964a119230q64991l03720R13821J021723J26222k82012n116j46085q19924q80075
$$ -1119230 -1984221 -2287941 -1374120 -352397 -226175 -508187 -513303 -659388 -1479312 -2359387
34954b359387l9569M33907l31017j361548j081992O20354K223916K254298P15222
$$ -2359387 -2398956 -1965049 -2296066 -3657614 -4739606 -4119252 -1895336 358962 1074184
34945A074184j086528j811087j126121K17237J093128R26565J92466q9140M08890
$$ 1074184 -12344 -1823431 -2949552 -2732315 -1639187 -712622 -520156 -609296 -200406
34936b00406Q38390L68150m87427n34078K91311Q24335M59264j11337k27315j54027
$$ -200406 637984 1006134 518707 -15371 275940 1100275 1559539 1448202 1220887 1066860
34926A066860j87657m8098K42942M8977o37951q32239j80119L05144l3100m00112
$$ 1066860 879203 831105 1074047 1123024 485073 -347166 -527285 -222141 -255241 -655353
34916f55353j55142m659l50269m9436J511346K586481J375545r62205j808958
$$ -655353 -810495 -815154 -1165423 -1214859 296487 2882968 4258513 3296308 1487350
34907A487350q08719J61462J84507J25521M24533L19629m45663r51180n31176
$$ 1487350 678631 840093 1024600 1150121 1574654 1894283 1448620 497440 -33736
34898c3736M21472J198239J269194L17741j116668j590315n72982M81920K72492
$$ -33736 387736 1585975 2855169 3172910 2056242 465927 -107055 374865 647357
34889F47357k48099K98881J037160L72293q56626o29655N41897L37902j185206
$$ 647357 399258 698139 1735299 2107592 1250966 621311 1163208 1501110 315904
34880C15904j499955M3457J144676N44304j64786K03003M57736k52357o29199
$$ 315904 -1184051 -1140594 4082 548386 383600 586603 1044339 791982 162783
34871A62783J83317P66479l135q74839n58941N7650o7531p1809P42900Q93035
$$ 162783 346100 1112579 1109444 234605 -324336 -266686 -334217 -406026 336874 1229909
34861A229909p52293k230335j087562J548762K382397P06567r92336q98562J97906
$$ 1229909 477616 -1752719 -2840281 -1291519 1090878 1797445 805109 -93453 104453
34852A04453R19135J011367O26070k77400j203716j151798J7299J148425J151615
$$ 104453 1023588 2034955 2661025 2383625 1179909 28111 45410 1193835 2345450
34843B345450J74049p83998r47081l98369O7281j57911o56723n14792K65287P23352
$$ 2345450 2519499 1735501 788420 390051 457332 299421 -357302 -872094 -606807 116545
34833A16545N16699M00113O61743M04869p44042j507893p86185M29022M13834
$$ 116545 633244 1033357 1695100 2099969 1355927 -151966 -938151 -509129 -95295
34824i5295p10352j234739l49387R28735J226848K76571j012783j349822k39457
$$ -95295 -805647 -2040386 -2389773 -1461038 -234190 42381 -970402 -2320224 -2559681
34815b559681J226326J381657J77292o26221k4207P70743M19904l65319k28958
$$ -2559681 -1333355 48302 225594 -400627 -424834 345909 765813 400494 171536
34806A71536M04946J94303n70749l52863R02463J427654L25640j075849j181388
$$ 171536 576482 770785 200036 -152827 749636 2177290 2502930 1427081 245693
34797B45693k00752M74999J95621l51565j98394O33155J014676O6963j426963
$$ 245693 44941 519940 715561 363996 165602 798757 1813433 1880396 453433
34788D53433j672617k24317J217371J048760j05157n27492O6371M50001l7964
$$ 453433 -1219184 -1443501 -226130 822630 717473 189981 256352 706353 668389
34779F68389o77568o62551j34376L12521M31522L95029M60536O51215O51051K21951
$$ 668389 -9179 -671730 -806106 -493585 -62063 332966 793502 1444717 2095768 2317719
34769B317719k97943m48664n29351j097515j575055p33394J060770J737460M96643
$$ 2317719 2019776 1571112 1041761 -55754 -1630809 -2364203 -1303433 434027 930670
34760I30670q15282n40345K94334K0832p17383k83978Q60308R29359r390k81232
$$ 930670 115388 -424957 -130623 -109791 -827174 -1111152 -250844 678515 669125 387893
34750C87893K14164j94471j661985k005556j31236J914120J684987l87487j833010
$$ 387893 602057 407586 -1254399 -3259955 -3391191 -1477071 207916 -179571 -2012581
34741b012581j296083L07181J238060P18009m72188q57038N618Q77717N65968
$$ -2012581 -3308664 -3001483 -1763423 -1045414 -1517602 -2374640 -2369022 -1491305 -925337
34732i25337k03761J04198J168982J029919p58209k050134j116658Q02357J302979
$$ -925337 -1129098 -1024900 144082 1174001 415792 -1634342 -2751000 -1948643 -645664
34723f45664J70312o24401Q0746J131223R08133l03676o74749N87536J903406
$$ -645664 -475352 -1099753 -1019007 112216 1020349 716673 41924 629460 2532866
34714B532866J260534r24537k082083q83446R52359J119436j83446j005367o50106
$$ 2532866 3793400 2868863 786780 -96666 855693 1975129 1791683 786316 136210
34705A36210k07912m13829p14380n70156j88551K72570Q96799J178788L46370
$$ 136210 -71702 -485531 -1199911 -1770067 -1958618 -1686048 -789249 389539 735909
34696G35909j135767j671137o36119P35560J071827M44191k63236n77177m41721
$$ 735909 -399858 -2070995 -2707114 -1971554 -899727 -455536 -718772 -1295949 -1737670
34687a737670J45301Q49115R50505J46051r45145j356863o24181Q41221J847659
$$ -1737670 -1592369 -743254 207251 353302 -591843 -1948706 -2572887 -1731666 115993
34678A15993J278066m93716j528263n80647J094997J396569L07130l89469k5710
$$ 115993 1394059 900343 -627920 -1208567 -113570 1282999 1590129 1200660 1174950
34669A174950J94943m59965j008035m87391N32300Q98092K57963r45560j844977
$$ 1174950 1369893 909928 -98107 -585498 -53198 844894 1102857 157297 -1687680
34660a687680j361906O81440K541514K132251j39201j704746j288769k38445N9880
$$ -1687680 -3049586 -2368146 173368 2305619 2166418 461672 -827097 -1065542 -1005662
34651a005662P5052N24063P79619K00257m47380k52412L19383L57681o4633l97557
$$ -1005662 -930610 -406547 373072 573329 125949 -126463 192920 550601 485968 88411
34641H8411n39557m31426J73307Q29207N70566l76395n64343K77608O06635k45469
$$ 88411 -451146 -882572 -709265 119942 690508 314113 -250230 27378 634013 388544
34631C88544p65179O3021Q49959K73586n31379j15335N41355k05235j595726j666834
$$ 388544 -376635 -313614 536345 809931 278552 163217 704572 499337 -1096389 -2763223
34621b763223m33693N31019P59314Q00433M29515o22214j057273K69204J797909
$$ -2763223 -3196916 -2665897 -1906583 -1106150 -676635 -1298849 -2356122 -2086918 -289009
34612b89009J166673r63459j842537r06494q3000j16485J48686P63432L58445
$$ -289009 877664 -85795 -1928332 -2834826 -2917826 -3034311 -2885625 -2122193 -1763748
34603a763748p12488l48662J349766J576252m73584j840378n51510J165013P89158
$$ -1763748 -2476236 -2824898 -1475132 101120 -372464 -2212842 -2764352 -1599339 -810181
34594h10181l68755P0821J135303L44439j643439j931349k28344P61213j03590
$$ -810181 -1178936 -1108115 27188 371627 -1271812 -3203161 -3431505 -2670292 -2773882
34585b773882o75407P69812K665600K435587O1898k033975j931218n9496J560638
$$ -2773882 -3449289 -2679477 -13877 2421710 2483608 449633 -1481585 -1541081 19557
34576A9557J401066j22819j215499q45162O6064O6144p53020j023815j77622Q32945
$$ 19557 1420623 1297804 82305 -762857 -696793 -630649 -1383669 -2407484 -2585106 -1752161
34566a752161J014872O01506M30217O77426P50711K43390m21831m75703J57009
$$ -1752161 -737289 -135783 294434 971860 1722571 1965961 1544130 1068427 1225436
34557A225436O42377L42081k39981k52477P7441j51007p60638n42757N76513R73476
$$ 1225436 1867813 2209894 1969913 1717436 1794877 1643870 883232 340475 916988 1890464
34547A890464j51149j164536l72447J159223J039692p94753j907496q57630J005167
$$ 1890464 1739315 574779 202332 1361555 2401247 1606494 -301002 -1158632 -153465
34538a53465J708849J043621K1037p86715j357668j464504q45989J53109Q35469
$$ -153465 1555384 2599005 2620042 1833327 475659 -988845 -1834834 -1681725 -846256
34529h46256R33547P09623M51061K57733J96325K73393K51117j90069r53424j377361
$$ -846256 87291 796914 1247975 1505708 1702033 1975426 2226543 2036474 1083050 -294311
34519b94311q80291K07413Q06380L67691l32406j85130P11507J231646Q37552
$$ -294311 -1174602 -967189 -160809 206882 -125524 -310654 400853 1632499 2470051
34510B470051J34840k42877l07127q7940N12256Q73866O23j642722k078253o10422
$$ 2470051 2604891 2362014 2054887 1966947 2479203 3353069 3353692 1710970 -367283 -977705
34500i77705P92434L03602r98141j002742N3237L98671J7280L86243J274621Q06555
$$ -977705 -185271 118331 -879810 -1882552 -1829315 -1430644 -1413364 -1027121 247500 1054055
34490A054055r33207j381919L72062J771290P72623q38357l95690J303590J376983
$$ 1054055 120848 -1261071 -889009 882281 1654904 816547 420857 1724447 3101430
34481C101430m95998j724724r60300Q3636l64284j423997j124594N95820J871847
$$ 3101430 2605432 880708 -79592 4044 -360240 -1784237 -2908831 -2313011 -441164
34472d41164J476866K54132j95905M57528J092325P59007j79925q04984r12122
$$ -441164 1035702 1289834 1093929 1551457 2643782 3402789 3222864 2417880 1505758
34463A505758q54346n67252K41422J089332J063789L01831k2647N06388R06501
$$ 1505758 651412 84160 325582 1414914 2478703 2780534 2757887 3264275 4170776
34454D170776L73285o38288j401846j810347j726390p51300O29016J043597K77834
$$ 4170776 4544061 3905773 2503927 693580 -1032810 -1784110 -1155094 -111497 166337
34445A66337j37615N58054R13036j71660j156752k59479J289020R90574q25606
$$ 166337 28722 586776 1499812 1328152 171400 -88079 1200941 2191515 1365909
34436A365909j537847n09519J78544m77596q61217J18162J029937M89978m96248
$$ 1365909 -171938 -681457 -502913 -980509 -1841726 -1723564 -693627 -203649 -699897
34427f99897m30245K20352K49837k9127L29712Q15988K56658q97738j034422K7535
$$ -699897 -1130142 -909790 -659953 -689080 -359368 456620 713278 -184460 -1218882 -1191347
34417a191347O97141J12292n75675o9930J072839J283912K66275o11531k98837
$$ -1191347 -494206 -381914 -957589 -1027519 45320 1329232 1595507 983976 685139
34408F85139M22713J12903j037459j249123J66475J396296N38982j414215j705080
$$ 685139 1107852 1220755 183296 -1065827 -899352 496944 1035926 -378289 -2083369
34399b083369K79891K068624J522189m69032j601976j132673p1207O38911Q63584
$$ -2083369 -1803478 265146 1787335 1318303 -283673 -1416346 -1487553 -848642 14942
34390A4942O94277K25101k36446m21118l85225j89639K50577O65889M70191k26891
$$ 14942 709219 934320 697874 276756 -108469 -298108 -47531 618358 1088549 861658
34380H61658m08370M24374J348182J253549L04002n71175r53920r23635m78132
$$ 861658 453288 877662 2225844 3479393 3783395 3212220 2258300 1334665 856533
34371H56533J40837K14507m02207o64640J51697R84622L42806j320388k042512
$$ 856533 997370 1211877 809670 145030 296727 1281349 1624155 303767 -1738745
34362a738745j029416M83377J121295Q46182L12382r1442j80826R4808L04555
$$ -1738745 -2768161 -2284784 -1163489 -317307 -4925 -96367 -277193 -182385 122170
34353A22170n0457n23288o9709J209356J703164L98888j448895j732318j82714
$$ 122170 71713 -451575 -521284 688072 2391236 2790124 1341229 -391089 -573803
34344e73803J328496J161446k72127j355713j283910o33906k06607m6597J95523
$$ -573803 754693 1916139 1644012 288299 -995611 -1629517 -1836124 -1882721 -1687198
34335a687198N35499P66244Q96643R14198M45007o25284j449243j079538K0226
$$ -1687198 -1151699 -385455 511188 1425386 1870393 1245109 -204134 -1283672 -1263446
34326a263446L97267k91876p68338j53918O74781N30717k83097o10378j70247
$$ -1263446 -866179 -1158055 -1926393 -2080311 -1405530 -874813 -1157910 -1768288 -1938535
34317a938535L66939N65877N63381N07403L89587K18589q0566n51448p49835j49916
$$ -1938535 -1571596 -1005719 -442338 65065 454652 673241 592675 41227 -708608 -858524
34307h58524P11102N94184m26581o86173M55844J266276L08138j009611n08505
$$ -858524 -147422 446762 20181 -665992 -210148 1056128 1364266 354655 -153850
34298a53850J215107J629233J31602j255168j038098L139N11684K15793m41432
$$ -153850 1061257 2690490 2822092 1566924 528826 531965 1043649 1259442 818010
34289H18010q54811l03696J127609J816297M91023j353995j076666J033659J809477
$$ 818010 -36801 -340497 787112 2603409 3094432 1740437 663771 1697430 3506907
34280C506907o2523j981309j390869N41756J061536j19488j006063m90533O22957
$$ 3506907 3444384 1463075 72206 613962 1675498 1556010 549947 59414 682371
34271F82371J219916R28467q0107j131403j252813l19234M66648J02141p94531
$$ 682371 1902287 2830754 2750647 1619244 366431 47197 513845 615986 -178545
34262a78545r54190j87145P55613J335539J259045J20076j786361k876883j823742
$$ -178545 -1132735 -1319880 -564267 771272 2030317 2150393 364032 -2512851 -4336593
34253d336593N67735K145680J911529P81564M5198Q827J38130j71847r61194j484191
$$ -4336593 -3768858 -1623178 288351 1069915 1115113 1123940 1262070 1090223 129029 -1355162
34243a355162r75959J05161L99234l20234n59354N42208J504731O23176j201668
$$ -1355162 -2331121 -2225960 -1826726 -2146960 -2706314 -2164106 -659375 -36199 -1237867
34234a237867j622227k85571R09420Q50458M21390M03313K30829m00156n09047
$$ -1237867 -2860094 -3145665 -2236245 -1385787 -964397 -561084 -330255 -730411 -1239458
34225a239458M48806J272769P31706m81088q37961k06275L64966M63532M81125
$$ -1239458 -790652 482117 1213823 732735 -105226 -311501 53465 516997 998122
34216I98122L48613l59861j118820q09554L20350N87586n57125j346856k61578
$$ 998122 1346735 986874 -131946 -941500 -621150 -33564 -590689 -1937545 -2199123
34207b199123J416947J301004m97094j458868m18217Q17873L83454r22142j200641
$$ -2199123 -782176 518828 21734 -1437134 -1855351 -1037478 -654024 -1576166 -2776807
34198b776807l65787K80939M76539R59202J408714O52679q62532j037838O04188
$$ -2776807 -3142594 -2861655 -2385116 -1425914 -17200 635479 -227053 -1264891 -660703
34189f60703J645725K14202j935722j747756O89075K250707J191481o92758r49642
$$ -660703 985022 1199224 -736498 -2484254 -1795179 455528 1647009 954251 4609
34180D609K13330P70374J7751p26173m32775J08946k48110j022859p96676M14295
$$ 4609 217939 988313 1006064 279891 -152884 -43938 -292048 -1314907 -2111583 -1697288
34170a697288Q94514k32002j471934r96392P04124J589595J016789L29530N20893
$$ -1697288 -802774 -1034776 -2506710 -3503102 -2798978 -1209383 -192594 136936 657829
34161F57829R15259O30709m0967m37209o04087p94109p67230l14242K82324Q70314
$$ 657829 1573088 2203797 2162830 1725621 1121534 327425 -439805 -754047 -471723 398591
34151C98591J627982K101724J190629j030443k587557j910311q685R34695M52796
$$ 398591 2026573 4128297 5318926 4288483 1700926 -209385 -218070 716625 1169421
34142A169421j23682K7686L65783L17794O5817j46788l71305m40648o1397M35618
$$ 1169421 1045739 1073425 1439208 1757002 1822819 1676031 1304726 864078 802681 1238299
34132A238299L30751l48880p63565m70464J03259N00678O73458M20678n99559
$$ 1238299 1569050 1220170 456605 -13859 89400 590078 1263536 1684214 1084655
34123A084655j853325j882928q3390K063253K456360Q96179p03171p20119L16540
$$ 1084655 -768670 -2651598 -2734988 -671735 1784625 2680804 1977633 1257514 1574054
34114A574054P21928m8387q95442p64056N7790O46957O50467J86399p14931j684396
$$ 1574054 2295982 2247595 1352153 588097 645887 1292844 1943311 2129710 1414779 -269617
34104b69617j682426l01461J049955P26518o08786p29989P62994J739341Q10488
$$ -269617 -1952043 -2253504 -1203549 -477031 -1085817 -1815806 -1052812 686529 1497017
34095A497017o42395q05407n6444K07107n0331L4850M06982L85593M3352j54703
$$ 1497017 854622 49215 -7229 199878 149547 184397 591379 976972 1020324 865621
34085H65621l60213o63732l22466Q65524J440985K89181j227590j189766k66950
$$ 865621 505408 -158324 -480790 384734 1825719 2114900 887310 -302456 -569406
34076e69406n05412j606733j290932O45479J648452M81962q02838k44764J047495
$$ -569406 -1074818 -2681551 -3972483 -3327004 -1678552 -1196590 -1999428 -2244192 -1196697
34067a196697R61015l71153j189926p83423R1819O71628P41026L29908j47874
$$ -1196697 -235682 -606835 -1796761 -2580184 -2488365 -1816737 -1075711 -745803 -893677
34058h93677l9506N62285P66948L79456L20892Q45687P34884o09919j660295r05741
$$ -893677 -933183 -370898 396050 775506 1096398 1942085 2676969 2067050 406755 -498986
34048d98986O29222Q62864j37403m80141L72763R01386J88721p10466p10823l10662
$$ -498986 130236 993100 855697 375556 748319 1649705 1838426 1127960 417137 106475
34038A06475k94460j95300O67918J523494R73220q07660k002678j458408n7084
$$ 106475 -187985 -383285 284633 1808127 2781347 1973687 -28991 -1487399 -1544483
34029a544483O43344L99769K26381P01895J159644P43012l38117j102209j086925
$$ -1544483 -901139 -501370 -274989 426906 1586550 2329562 1991445 889236 -197689
34020a97689p69187o59608n36249O3848R22992J239321O59499k06780n16196j77658
$$ -197689 -966876 -1626484 -2162733 -2098885 -1175893 63428 722927 516147 -49 -177707
34010a77707J78319P7375l08056n49422m61781p7907M91574R14993P41192L1665
$$ -177707 612 77987 -230069 -779491 -1241272 -1319179 -827605 87388 828580 860245
34000H60245m67590k75599Q3933m9557k71634K47752J149032J147706M3781q29513
$$ 860245 392655 117056 200989 151432 -120202 127550 1276582 2424288 2468069 1638556
33990A638556o14820j42345m12774r93544q85656j12976N52721P57384N40603
$$ 1638556 1023736 881391 468617 -524927 -1410583 -1523559 -970838 -213454 327149
33981C27149j44734r47589q93547K96835J354249J066091Q1375j38066M42252
$$ 327149 182415 -765174 -1658721 -1361886 -7637 1058454 1139829 1001763 1444015
33972A444015O73525K79721J10240M50603N48293k6861p31921r39986n97521k0471
$$ 1444015 2117540 2397261 2507501 2958104 3506397 3479536 2747615 1807629 1210108 1189637
33962A189637K17779m61921j657755j851268l60862J281331J293391K34504q8769
$$ 1189637 1407416 945495 -712260 -2563528 -2924390 -1643059 -349668 -115164 -203933
33953b03933L91477K54451n70943o48543K29399O04604L9111j88515K88207P5939
$$ -203933 187544 441995 -128948 -777491 -548092 56512 95623 -92892 195315 271254
33943B71254j180533j566997N7095J871772J707162J74727o19215j60382M56409
$$ 271254 -909279 -2476276 -2419181 -547409 1159753 1334480 715265 554883 1011292
33934A011292N69957L49296p7116m91707l24603L32695L75033n46400j065355
$$ 1011292 1581249 1930545 1853429 1361722 1037119 1369814 1744847 1198447 133092
33925A33092k27917O89086J53297r68592p33498O78412J245429K79880p38691
$$ 133092 -94825 594261 747558 -221034 -954532 -276120 969309 1249189 510498
33916E10498o03339J23487L87267L456o22847j040324p81538J93066R82343O20928
$$ 510498 -92841 30646 417913 421369 -201478 -1241802 -2023340 -1830274 -847931 -227003
33906b27003m69009q48444J5482J093317J217730L83597n53467q51494m13346
$$ -227003 -696012 -1544456 -1528974 -435657 782073 1165670 612203 -239291 -652637
33897f52637K18181M02420K10969L63307J009416J211863L08297q68021j068767
$$ -652637 -434456 -32036 178933 542240 1551656 2763519 3071816 2203795 1135028
33888A135028m13342k3657k58369m71435l28605j82715j49895P9803M03075L04208
$$ 1135028 721686 698029 439660 -31775 -360380 -543095 -692990 -613187 -210112 94096
33878I4096j05889j8257P66998J290006O59152p44246j750176j726527j016368
$$ 94096 -11793 -30050 736948 2026954 2686106 1941860 191684 -1534843 -2551211
33869b551211k44749L89048R65334J215350N83426p64041j552391q32367N40216
$$ -2551211 -2795960 -2406912 -1441578 -226228 357198 -406843 -1959234 -2791601 -2251385
33860b251385R34181K50516j74310P4406L2392l84446J84923J837070K331717
$$ -2251385 -1317204 -1066688 -1240998 -1166592 -1134200 -1518646 -1333723 503347 2835064
33851B835064M33729j628484j279523M27633O08651q35133j405284k77322P27684
$$ 2835064 3268793 1640309 360786 788419 1397070 561937 -843347 -1120669 -392985
33842c92985N38654K39730N06840L58011o04624j111213n02786L9965k69047l70880
$$ -392985 145669 385399 892239 1250250 645626 -465587 -968373 -928408 -1197455 -1568335
33832a568335N25248J263669P03601l00185n02652l68167q24383j232680n17185
$$ -1568335 -1043087 220582 924183 623998 121346 -246821 -1071204 -2303884 -2821069
33823b821069O94363J014977O26842P10551J110100O18440o21095j022635n1589
$$ -2821069 -2126706 -1111729 -484887 225664 1335764 1954204 1333109 310474 258885
33814B58885R59489Q92429K39321q0822k2039J6455j22506n27999j129735j178901
$$ 258885 1218374 2110803 2350124 2269302 2247263 2263718 2141212 1613213 483478 -695423
33804f95423K9227J592884J556607l08003j711752r19867P12973Q21555l95884
$$ -695423 -666196 926688 2483295 2175292 463540 -456327 256646 1078201 682317
33795F82317p21895L87761R86736n0619j104938m69186P67660L81971j358044
$$ 682317 -39578 348183 1334919 1284300 179362 -289824 477836 859807 -498237
33786d98237j883623j22975J867862J778344N9582j037350m90319O87072J228596
$$ -498237 -2381860 -2504835 -636973 1141371 1200953 163603 -326716 360356 1588952
33777A588952R62430L42623l29459q34173q66097m25875j2092l960j00647J90141
$$ 1588952 2551382 2894005 2564546 1730373 864276 438401 426309 422349 321702 511843
33767E11843O41847M30059o68326j649579j314804K16390J501723J355243M3519
$$ 511843 1153690 1583749 915423 -734156 -2048960 -1832570 -330847 1024396 1067915
33758A067915j196672j412506n36765P61955J483518J009141j34438o22029O9718
$$ 1067915 -128757 -1541263 -2078028 -1316073 167445 1176586 1042148 420119 489837
33749D89837Q45271L93536j007275j869455j404626k32073O58708Q59598N50277
$$ 489837 1335108 1728644 721369 -1148086 -2552712 -2784785 -2126077 -1266479 -716202
33740g16202K50130M36441Q58012O34579l41492q64642k42977L24935l02067r13933
$$ -716202 -466072 -29631 828381 1462960 1121468 256826 13849 338784 36717 -877216
33730h77216K22077J983434J645551o20585j658940l01594Q61815k1139j064468
$$ -877216 -655139 1328295 2973846 2353261 694321 392727 1254542 1233403 168935
33721A68935k30662R96263L04738j344012j426632p9051N39244K6884j71404K40461
$$ 168935 -61727 934536 1239274 -104738 -1531370 -1610421 -1071177 -1044293 -1215697 -975236
33711i75236K50213o1131K74107P97529K01180r86993r62492K06701O57302m9454
$$ -975236 -725023 -786154 -512047 285482 486662 -500331 -1462823 -1256122 -598820 -648274
33701f48274m89843k29727k87271n36423L31307J756257J394998q36083j982447
$$ -648274 -1138117 -1367844 -1655115 -2191538 -1860231 -103974 1291024 454941 -1527506
33692a527506o42534P84783K12269p85288o4858J285444J068732j33270k51702
$$ -1527506 -2170040 -1385257 -1172988 -1958276 -2023134 -737690 331042 197772 -53930
33683e3930M99191K53317q98646r43410N88030J841121J541118M53998m02604
$$ -53930 445261 698578 -200068 -1143478 -555448 1285673 2826791 3280789 2878185
33674B878185j040756j481530j178543j89642M06901K4042n02888j88043O78044
$$ 2878185 1837429 355899 -822644 -1012286 -605385 -581343 -1084231 -1272274 -594230
33665e94230J059841O33426P9604R6584N41123O20518j54459j318732j922266
$$ -594230 465611 1099037 1178641 1275225 1816348 2436866 2282407 963675 -958591
33656i58591j593159q00182p9337M77684Q58075Q89315O62365O18259Q66725R47735
$$ -958591 -2551750 -3351932 -3431269 -2953585 -2095510 -1206195 -543830 74429 941154 1888889
33646A888889N91947J52808n3237k35926n94825r05603j018313j136161j224403
$$ 1888889 2480836 2633644 2580407 2344481 1749656 844053 -174260 -1310421 -2534824
33637b534824q43352l970N41893L70438L8242J55670N32137P64367Q98009R36859
$$ -2534824 -3378176 -3382146 -2840253 -2469815 -2431573 -2275903 -1743766 -979399 -81390 855469
33627H55469N27228k22519m81813M056K70068l41230r45414m90591M85152P41209
$$ 855469 1382697 1160178 678365 682421 952489 611259 -334155 -824746 -339594 401615
33617D01615K97259J09731K68611K1272n99688o70940j1596M24633J28710j29552
$$ 401615 698874 808605 1077216 1098488 498800 -172140 -183736 240897 369607 240055
33607B40055M30440J320943J356861Q8199j677673k548704j725768J51744J432574
$$ 240055 670495 1991438 3348299 3436498 1758825 -789879 -2515647 -2363903 -931329
33598i31329J154879J64823r607P73471J115921J10900j272361j376497k6581
$$ -931329 223550 388373 378766 1152237 2268158 2379058 1106697 -269800 -296381
33589b96381J173325Q29295m93122j081506m50164O7343m74861r63135n473J449116
$$ -296381 876944 1706239 1213117 131611 -318553 -251210 -726071 -1689206 -1694679 -245563
33579b45563J224585n19920j164430L28809J644268P83401p11481l80062J036071
$$ -245563 979022 459102 -705328 -376519 1267749 2051150 1339669 959607 1995678
33570A995678Q99688q40851j559893k59119J032101P79979J20142L09336M36039
$$ 1995678 2895366 2054515 494622 235503 1267604 2047583 2167725 2477061 2913100
33561B913100n49589j426675n33557J180601J278785m54835j647389q09457P67244
$$ 2913100 2363511 936836 403279 1583880 2862665 2407830 760441 -49016 718228
33552G18228J169726L35690n42625q93493r19222o35163M3996N96076L82835k07639
$$ 718228 1887954 2223644 1681019 787526 -131696 -766859 -722863 -126787 256048 48409
33542D8409j22176P11766J069539J73575j047275j087765K19003J538216J552892
$$ 48409 -73767 637999 1707538 1881113 833838 -253927 -34924 1503292 3056184
33533C056184K24137j251695j478958j72287J404128J801259J259903J314730
$$ 3056184 3280321 2028626 549668 377381 1781509 3582768 4842671 6157401
33525F157401K270571K455438Q77550q49298q38727R30o02821k468966l093859
$$ 6157401 8427972 10883410 11760960 10911662 10072935 10073865 9471044 7002078 3908219
33516C908219j578036J26266M32357J67193M23906N92428p2605p76096o46187
$$ 3908219 2330183 2456449 2888806 3055999 3479905 4072333 3999728 3223632 2577445
33507B577445l40360o13437p08604J05999P08645j79607j460607r89719J062627
$$ 2577445 2237085 1623648 915044 1021043 1729688 1550081 89474 -900245 162382
33498A62382K273795J340136m06985j064531l21056P45746J030644L48151m02025
$$ 162382 2436177 3776313 3369328 2304797 1983741 2729487 3760131 4108282 3706257
33489C706257k02184N65956L65822j072935j800625l67184J721007K021401O46172
$$ 3706257 3504073 4070029 4435851 3362916 1562291 1195107 2916114 4937515 5583687
33480E583687l67988m59479q50594j690040j524547n2116R91747N23674l60584
$$ 5583687 5215699 4756220 3905626 2215586 691039 638923 1630670 2154344 1793760
33471A793760m93570l76558o77721p20128J27575R28057N41196m87539p97067
$$ 1793760 1300190 923632 245911 -474217 -346642 581415 1122611 635072 -161995
33462a61995j86207N31006R12394R05168J96631j110710j770597q13105O85775
$$ -161995 -348202 182804 1095198 2000366 2196997 1086287 -684310 -1497415 -811640
33453h11640Q16916l11510o24962P25681J916423J087210q86020j566638j99273
$$ -811640 5276 -306234 -931196 -205515 1710908 2798118 1912098 345460 146187
33444A46187J584987K090924J318667K33111n97968j078981j072286n23548K38759
$$ 146187 1731174 3822098 5140765 5373876 4775908 3696927 2624641 2101093 2339852
33435B339852Q04773J003411O70825l43589j532466j781986p51452M14732N70147
$$ 2339852 3144625 4148036 4818861 4475272 2942806 1160820 409368 824100 1394247
33426A394247J39445K02690O41938N38955k0635j13479K30896R0131m53677k58348
$$ 1394247 1533692 1736382 2378320 2917275 2896640 2783161 3014057 3104188 2650511 2392163
33416B392163P36637J129036L64997l37086q7924L84382L82927M30222Q34703
$$ 2392163 3128800 4257836 4622833 4285747 4197823 4582205 4965132 5395354 6230057
33407F230057Q21659J76625l7734M45896L06403p35812p89251Q60755J725315
$$ 6230057 7051716 7228341 7190607 7636503 7942906 7207094 6417843 7278598 9003913
33398I003913J0549j750892l29884K700796L091243N94411q10276O00241J932304
$$ 9003913 9014462 7263570 6933686 9634482 12725725 13320136 12509860 13110101 15042405
33389A5042405Q69297p06302k69634J251287J394663P8812q49439o88229l36418
$$ 15042405 15911702 15205400 14935766 16187053 17581716 17660528 16811089 16122860 15786442
33380A5786442l88266n41122n85567o86270q10393p28054m68757k94646l95495
$$ 15786442 15398176 14857054 14271487 13585217 12774824 12046770 11578013 11283367 10887872
33371A0887872p78303j142386r40995r4045N71924L19335l54282m78516j78556
$$ 10887872 10109569 8967183 8026188 7932143 8504067 8823402 8469120 7990604 7812048
33362G812048l25298q74173r00554k52469J69297j09035n68389o99194n01666
$$ 7812048 7486750 6612577 5712023 5459554 5628851 5519816 4951427 4252233 3750567
33353C750567m9424M04218J77345q08466j242880j34144J252782R57023o33812
$$ 3750567 3701143 4105361 4282706 3474240 2231360 2097216 3349998 4307021 3673209
33344C673209j356416n99985K17149M32821R17893J757517J649859L22976o92633
$$ 3673209 2316793 1716808 1933957 2366778 3284671 5042188 6692047 7015023 6322390
33335F322390n35735k19895n48912p96840l62835O4976j23341n22845p69823r57067
$$ 6322390 5786655 5566760 5017848 4221008 3858173 3923149 3799808 3276963 2507140 1550073
33325A550073o89075M49248J353786N37026j075691j087134M07194Q55087k26641
$$ 1550073 860998 1310246 2664032 3201058 2125367 1038233 1445427 2300514 2073873
33316B073873l03008J435639K123584M806k291195j826219K48662J139578O67048
$$ 2073873 1770865 3206504 5330088 5334894 3043699 1217480 1466142 2605720 3272768
33307C272768K17445k41408j152642j420129l62679K82712q63485k004073j062702
$$ 3272768 3490213 3248805 2096163 676034 313355 596067 -267418 -2271491 -3334193
33298c334193O22079P24311O7373P16773J710147P38817j202346j117962P90495
$$ -3334193 -2712114 -1987803 -1920430 -1203657 506490 1245307 42961 -1075001 -284506
33289b84506J508425M52142K9623Q51617P04479r79895j735365m10974P73143
$$ -284506 1223919 1676061 1705684 2557301 3261780 2281885 546520 135546 908689
33280I08689J48679o70746Q8920J260424R25661l79068q15590j82592K22343j73487
$$ 908689 1057368 386622 475542 1735966 2661627 2282559 1466969 1284377 1506720 1333233
33270A333233o45519m37703K82658N81692k19470j354163j061891R00676K217031
$$ 1333233 687714 250011 532669 1114361 894891 -459272 -1521163 -620487 1596544
33261A596544J043449r85234j020028N81525R35224n98118j502281l61817J043210
$$ 1596544 2639993 1654759 634731 1216256 2151480 1553362 51081 -310736 732474
33252G32474Q53815l18173j079458j170628o48554O08510J591042O71207j497768
$$ 732474 1586289 1268116 188658 -981970 -1630524 -1022014 569028 1240235 -257533
33243b57533k013602M0844J854656J024151r29622j228034P947O31739M6120m64210
$$ -257533 -2271135 -2230291 -375635 648516 -281106 -1509140 -1501193 -869454 -823334 -1287544
33233a287544j22071N94455J027755P30410m86126j729764j325698Q04958K291320
$$ -1287544 -1409615 -815160 212595 943005 456879 -1272885 -2598583 -1793625 497695
33224D97695J294581q71094j702569q96620M0182M77831Q57711R45007J05050
$$ 497695 1792276 921182 -781387 -1678007 -1637825 -1159994 -302283 642724 747774
33215G47774r53700p62877N52255J283224O45615l22901n96357m04727k63604
$$ 747774 -205926 -968803 -416548 866676 1512291 1189390 593033 188306 -75298
33206g5298o8360K96386M38589J04873l47801n26785m84980l43784K1356N94562
$$ -75298 -143658 152728 591317 696190 348389 -178396 -663376 -1007160 -985804 -391242
33196c91242R24544N73313k84827r30615q01951j08377L73055K44200m213K23592
$$ -391242 533302 1106615 821788 -108827 -910778 -1019155 -646100 -401900 -406113 -182521
33186a82521O48040N85258J61922R8656L16256n4541r95433j219160j32892R80666
$$ -182521 465519 1050777 1212699 1311355 1627611 1573070 577637 -641523 -774415 206251
33176B06251P23460l67439o69198J81116R36662N47987o04820j323948q76457
$$ 206251 929711 562272 -106926 74190 1010852 1558839 954019 -369929 -1246386
33167a246386L37004J119804O68011m44006q69994j93160O07004O06642Q0673
$$ -1246386 -909382 210422 878433 434427 -435567 -628727 -21723 584919 665592
33158F65592k30787k41017k99691m47326m98811m43135k84605J07488O40432R41417
$$ 665592 434805 193788 -105903 -553229 -1052040 -1495175 -1779780 -1672292 -1031860 -90443
33148i0443R02797P43589L94557m16364j275367j220977j49086Q47166R79618
$$ -90443 812354 1555943 1950500 1534136 258769 -962208 -1111294 -264128 715490
33139G15490O51372L66965j41150r53395j154374j2030J642143K123350P24997
$$ 715490 1366862 1733827 1592677 639282 -515092 -527122 1115021 3238371 3963368
33130C963368j584274k937084k020006M99312K104098J132484q08675q04593J025513
$$ 3963368 2379094 -557990 -2577996 -2078684 25414 1157898 349223 -455370 570143
33121E70143J541162m28300j946417n31833J782258J597048o19782j643048o43371
$$ 570143 2111305 1683005 -263412 -795245 987013 2584061 1964279 321231 -322140
33112c22140K04059j09836q8249R68854J430575K70481r62637o28906M35299M74558
$$ -322140 -118081 -227917 -316166 652688 2083263 2353744 1391107 762201 1197500 1672058
33102A672058m39617r14873o09947m21079o35610m18222O32953J519440J055281
$$ 1672058 1232441 317568 -292379 -713458 -1349068 -1767290 -1134337 385103 1440384
33093A440384m47426j390477q02107N30389J187128Q81667L92066P4770m33966
$$ 1440384 992958 -397519 -1199626 -669237 517891 1399558 1791624 1866394 1432428
33084A432428j000696q07502J44554O32290M8553o03691m65385k37402o13355
$$ 1432428 431732 -375770 -231216 401074 449627 -154064 -619449 -856851 -1470206
33075a470206o49004N96662J874248J266741p04210j628209o72848N37748O13137
$$ -1470206 -2119210 -1522548 351700 1618441 914231 -713978 -1386826 -849078 -235941
33066b35941M8658j92294p4795P4470K05480J63225k25317m65140P6643Q95261
$$ -235941 -187283 -379577 -454372 -379902 -174422 -11197 -236514 -701654 -625011 270250
33056B70250Q72198R2614k90659n2539j17989n93050l98359O13492J007610P9493
$$ 270250 1142448 1235062 944403 891864 773875 180825 -217534 395958 1403568 1483061
33046A483061q57687n63892K31804K47778l02329m12137l4624K06417K93538N33237
$$ 1483061 625374 61482 293286 541064 238735 -173402 -208026 -1609 291929 825166
33036H25166N92317J3422p58739r52164o75900n28880l75799L74886J432241J659815
$$ 825166 1417483 1430905 672166 -279998 -955898 -1484778 -1860577 -1485691 -53450 1606365
33026A606365O24107o85524r78597o5620J052625J239451K61992j076479j743858
$$ 1606365 2230472 1544948 566351 500731 1553356 2792807 3054799 1978320 234462
33017B34462j362914l27122O43356Q76000J68961o98669m54383R31026J641174
$$ 234462 -1128452 -1455574 -812218 63782 232743 -465926 -920309 10717 1651891
33008A651891K73703j868455k269113o55050Q55101J008954P22178P59742M30346
$$ 1651891 1925594 57139 -2211974 -2867024 -2011923 -1002969 -280791 478951 909297
32999I09297m60824o09432M02472P91520n23570j594367l15500J908440K072173
$$ 909297 448473 -160959 241513 1033033 509463 -1084904 -1400404 508036 2580209
32990B580209J59905j067792m58292K88423j03560p64341q49973q91675j046801
$$ 2580209 2740114 1672322 1214030 1502453 1398893 634552 -215421 -1107096 -2153897
32981b153897l34008J189764J648466K38346j045566l70240R62690O74881p15245
$$ -2153897 -2487905 -1298141 350325 588671 -456895 -827135 135555 810436 95191
32972I5191q65081L80174P86839l69093r78739L77428J929921J383542n47718
$$ 95191 -769890 -389716 397123 28030 -950709 -573281 1356640 2740182 2192464
32963B192464j270057j39158Q89804L51008q32032j067336l21245K85365K65244
$$ 2192464 922407 783249 1673053 2024061 1192029 124693 -196552 88813 354057
32954C54057J49630M04613P64369O50059j57382j198436j516926n39140R40374
$$ 354057 503687 908300 1672669 2322728 2165346 966910 -550016 -1089156 -148782
32945a48782J244633j12662j451236r78015O58797J202997M9879r49795l76272
$$ -148782 1095851 983189 -468047 -1446062 -787265 415732 465611 -484184 -860456
32936h60456P31456P89119J86793K86618Q17349K33327j516068k482549j421617
$$ -860456 -129000 660119 846912 1133530 1950879 2184206 668138 -1814411 -3236028
32927c236028N08013J436869J009613J53765m10992n54533l10123Q9280J89469
$$ -3236028 -2728015 -1291146 -281533 -127768 -538760 -1093293 -1403416 -1314136 -1124667
32918a124667m6114n4423L51082M84849p5767o11712m04483k0026k83888n85784
$$ -1124667 -1170781 -1225204 -874122 -389273 -465040 -1076752 -1481235 -1501261 -1785149 -2370933
32908b370933K83659J834481K085195L59552j597875j891811o69666O01778R88050
$$ -2370933 -2087274 -252793 1832402 2191954 594079 -1297732 -1967398 -1365620 -377570
32899c77570N04247l55010p48505l8592J069542R35173o25749j521431k06685
$$ -377570 126677 -228333 -976838 -1015430 54112 989285 363536 -1157895 -1364580
32890a364580J778509J826626P6138q85949L3219J007098L39690j049164j326897
$$ -1364580 413929 2240555 2316693 1430744 1463963 2471061 2810751 1761587 434690
32881D34690m98372j6297m09644o88932K1609J238910J699265P78000p71320j488419
$$ 434690 -63682 -79979 -489623 -1178555 -1156946 81964 1781229 2559229 1787909 299490
32871B99490p85032L19622N02799n9966l1373R89656J776240J214801k35338j347726
$$ 299490 -485542 -165920 336879 276913 245540 1235196 3011436 4226237 3990899 2643173
32861B643173j569037j082060j95467O44936Q24717K15632n26254p68235n71442
$$ 2643173 1074136 -7924 -203391 441545 1266262 1481894 955640 187405 -384037
32852c84037k50454J24010M35508M25808K71137M98447R28921O24516n30019j178901
$$ -384037 -634491 -510481 -74973 350835 621972 1120419 2049340 2673856 2143837 964936
32842I64936k99308J163576J500163N31032l31834n6785Q34673J051098L2867
$$ 964936 665628 1829204 3329367 3860399 3528565 3471780 4306453 5357551 5390418
32833E390418j309327j397521Q0620J375104P76347q14086r88159N26551J409759
$$ 5390418 4081091 2683570 2764190 4139294 4915641 4101555 3113396 3639947 5049706
32824E049706M47873o59658l65950K07258l58319j009599k05440R88064M92469
$$ 5049706 5497579 4837921 4471971 4679229 4320910 3311311 3105871 4093935 4586404
32815D586404j178455j635710l14438J084712J460241J255122Q39537J77988j57667
$$ 4586404 3407949 1772239 1457801 2542513 4002754 5257876 6097413 6275401 6117734
32806F117734K81805N10183m00264j223870l87667R38704M65759j119728j040990
$$ 6117734 6399539 6909722 6509458 5285588 4897921 5836625 6302384 5182656 4141666
32797D141666P83051J500686K37581n15593O09223J611275Q78043p8957M89113
$$ 4141666 4924717 6425403 6662984 6147391 6756614 8367889 9245932 9166975 9656088
32788I656088J728411K154380K104165K478415L156581M044343N479993O602607
$$ 9656088 11384499 13538879 15643044 18121459 21278040 25322383 30802376 37404983
32780C7404983O110110N628151Q704081J4917467J9499292K1784512K9201165
$$ 37404983 43515093 49143244 57847325 72764792 92264084 114048596 143249761
32773A43249761M7159578O7172364P0944117M7181426K171686m4767251p3658603
$$ 143249761 190409339 257581703 328525820 375707246 377878932 333111681 259453078
32766B59453078p5019197n5164281l1351497j7674650j4482952j3142870q970978
$$ 259453078 184433881 129269600 97918103 80243453 65760501 52617631 43646653
32759D3646653m989623m255543m832033m027061k672593k557307l078400k936429
$$ 43646653 38657030 34401487 29569454 25542393 22869800 20312493 17234093 14297664
32751A4297664k476031k203133j358660J25106N77623o17423j474026o07749L12313
$$ 14297664 11821633 9618500 8259840 8384946 8962569 8345146 6871120 6263371 6575684
32742F575684m55534j507026p32981Q48535P51690o99678r70063L20072Q04687
$$ 6575684 6120150 4613124 3880143 4728678 5480368 4780690 3810627 4130699 4935386
32733D935386n84689j843180j123753M99420Q96375j8434o30385k50696J72996
$$ 4935386 4350697 2507517 1383764 1883184 2779559 2761125 2130740 1880044 2053040
32724B053040j40729o24336m62487K6120j9682m50857k60001O21664Q93262j15016
$$ 2053040 1912311 1287975 825488 851608 831926 381069 121068 742732 1635994 1520978
32714A520978j133619p50460L80958N90132j61466m15756K39045O54899L24411
$$ 1520978 387359 -363101 17857 607989 446523 30767 269812 924711 1249122
32705A249122J97501P45993R77465K15577o95467r23750r45769j246069j119714
$$ 1249122 1446623 2192616 3170081 3385658 2690191 1766441 820672 -425397 -1545111
32696a545111o3430Q72207N94279j73282r4636N53690N44134m5562o4862N30573
$$ -1545111 -1608541 -736334 -142055 -315337 -409973 143717 687851 642289 577427 1108000
32686A108000O16510N1130L621P10989P24065p10384k065668j639711j18665N32843
$$ 1108000 1724510 1775640 1779261 2490250 3214315 2503931 438263 -1201448 -1320113 -787270
32676g87270P3259P3787J063307J455391O8236j767843j900637k66036J308547
$$ -787270 -714011 -640224 423083 1878474 1946710 178867 -1721770 -1987806 -679259
32667f79259J724096J506309J198279M99878n79551j158646p97859k27953n5536
$$ -679259 1044837 2551146 3749425 4249303 3669752 2511106 1713247 1485294 1429758
32658A429758J29341N89739O29860m7665m15890J91392O76212j8483q43371k55820
$$ 1429758 1559099 2148838 2778698 2731033 2315143 2506535 3182747 3164264 2320893 2065073
32648B065073J025372J054545j28227o61913k7808L75378k2127o9988O84635R84667
$$ 2065073 3090445 4144990 4016763 3354850 3327042 3702420 3680293 3610305 4294940 5279607
32638E279607J77777n06501j26518L24967k40254j010975n53572R75393K181202
$$ 5279607 5457384 4950883 4824365 5149332 4909078 3898103 3344531 4319924 6501126
32629F501126K249740J431635L74975k77006k46865m3815l22363p07337l37234
$$ 6501126 8750866 10182501 10557476 10280470 10033605 9989790 9667427 8960090 8622856
32620H622856M07913K59349o57719p41405L78556J050058L33674n32929n00231
$$ 8622856 9030769 9290118 8632399 7890994 8269550 9319608 9653282 9120353 8620122
32611H620122m18782r63161r75949K63649J087587q219j539463j282663P047q2042
$$ 8620122 8201340 7238179 6262230 6525879 7613466 7605247 6065784 4783121 4790168 4708126
32601D708126j483585j808626l42668R65874P54622m4661l13265l62957o32997
$$ 4708126 3224541 1415915 1073247 2039121 2793743 2749082 2435817 2072860 1439863
32592A439863n85435J25430P22553M52404k90662o72388n00989j09829K15594
$$ 1439863 854428 979858 1702411 2154815 1864153 1191765 690776 580947 796541
32583G96541L47392L22383L47027M01631N6070p71825j261701o76036M37244Q95173
$$ 796541 1143933 1466316 1813343 2214974 2271044 1499219 237518 -438518 -1274 893899
32573H93899M63391p0776j62085k210N6499j25185m29749l53106N02113J390206
$$ 893899 1357290 1286514 1124429 1122219 1178718 1053533 623784 270678 772791 2162997
32563B162997R26074o91757j351445n5513J262889O02266r46983j089836n7523
$$ 2162997 3089071 2397314 1045869 990356 2253245 2855511 1908528 818692 761169
32554G61169K29396k22820K04419J242945R06561o64830r70065M47612P82087
$$ 761169 990565 767745 972164 2215109 3121670 2456840 1486775 1934387 2716474
32545B716474j332984l070091j618105J377724K292816P06263p04003m40042L67177
$$ 2716474 1383490 -1686601 -3304706 -1926982 365834 1072097 368094 -71948 295229
32536B95229M79061J29911j56655m84915q19254o07440K85464J117742J175712
$$ 295229 774290 904201 747546 262631 -556623 -1164063 -878599 239143 1414855
32527A414855N98252K8661j80532k11066m01183p39265q05694l37695L09865N73938
$$ 1414855 2013107 2041768 1861236 1650170 1248987 509722 -295972 -633667 -323802 250136
32517B50136L68139l3979m93408q29178n78165K55025O69209l4766q78526n08236
$$ 250136 618275 584296 90888 -738290 -1316455 -1061430 -392221 -426987 -1305513 -1813749
32507a813749N13457M79311n38200o56462N91534J279944K45492r31100m88098
$$ -1813749 -1300292 -820981 -1359181 -2015643 -1424109 -144165 101327 -829773 -1317871
32498a317871P96208J120046M56633N0783J87557K13477L2965K7907R4875O2399
$$ -1317871 -521663 598383 1055016 1105799 1293356 1506833 1539798 1567705 1662580 1724979
32488A724979L38976R28960P63095n89553j601689q68609M85467M40880p31485
$$ 1724979 2063955 2992915 3756010 3166457 1564768 696159 1181626 1622506 891021
32479H91021j161824o39627o16985j135020n28069J327880K155500P62673r10712
$$ 891021 -270803 -910430 -1527415 -2662435 -3190504 -1862624 292876 1055549 144837
32470A44837p22995N61996Q53080k68m67165q832M33682L04732R2647Q5775j16718
$$ 144837 -578158 -16162 836918 836650 369485 360653 794335 1099067 1191714 1277489 1160771
32459A160771n83111o66238m9517O48278P16716J95048m36587q40326p89499j29656
$$ 1160771 577660 -88578 -138095 510183 1226899 1421947 985360 145034 -644465 -774121
32449g74121P97769J165509O10492j70819l16153P859n0096o70964j113890q30634
$$ -774121 23648 1189157 1799649 1628830 1312677 1320536 1270440 599476 -514414 -1345048
32439a345048p4431P05946J261195J166525R1648j131221r30559O77747J472592
$$ -1345048 -1419479 -713533 547662 1714187 1805835 674614 -255945 421802 1894394
32430A894394Q6604j536865p64800J466313J667029r15969k912672j711051R13659
$$ 1894394 1980998 444133 -320667 1145646 2812675 1896706 -1015966 -2727017 -1813358
32421a813358J799453Q74080L05897O54551N28391n33154j349426j275405r71406
$$ -1813358 -13905 860175 1166072 1820623 2349014 1815860 466434 -808971 -1780377
32412a780377p60792j07483Q50139R82056L8165o43111q5525Q82487R66074J94429
$$ -1780377 -2541169 -2648652 -1798513 -816457 -778292 -1421403 -1506928 -624441 341633 536062
32402E36062m47308l91677K23745R47918J087761J35874j247570j504434k10064
$$ 536062 88754 -302923 -79178 868740 1956501 2092375 844805 -659629 -869693
32393h69693R96198N43273p29823p33588P22967J546539L96911j354844j553974
$$ -869693 126505 669778 -60045 -793633 -70666 1475873 1872784 517940 -1036034
32384a036034j43267J014331P10315l75604r78980p45887j24063M21110N92672
$$ -1036034 -1179301 -164970 545345 169741 -809239 -1555126 -1679189 -1258079 -665407
32375f65407K41089l30771m75502o0745K57942J03541R0877P32640J263683O54675
$$ -665407 -424318 -755089 -1230591 -1291336 -1033394 -929853 -838976 -106336 1157347 1812022
32365A812022n95394r82170k06923N01543L92020P7966N1310k01470q98359j162707
$$ 1812022 1216628 234458 27535 529078 921098 999064 1050374 848904 -49455 -1212162
32355a212162m79358K58994K41010J53489Q59233J663470J363027K59468m25032
$$ -1212162 -1691520 -1432526 -1191516 -1038027 -178794 1484676 2847703 3107171 2682139
32346B682139n64756r30199j367056r53191P3629L15034n39601j056843k49897
$$ 2682139 2117383 1187184 -179872 -1133063 -1059434 -744400 -1284001 -2340844 -2590741
32337b590741R16696J017075J46590m78581k63666K61080L95621R3015j76470
$$ -2590741 -1674045 -656970 -510380 -988961 -1252627 -991547 -595926 -502911 -679381
32328f79381r5237R2901l6270l34890j73668N03317Q53311L43619m07563o78842
$$ -679381 -774618 -681717 -717987 -1052877 -1226545 -723228 130083 473702 66139 -612703
32318f12703p65511j104957j074119J6411J300186J279922J12359o01431k24735
$$ -612703 -1378214 -2483171 -3557290 -3540879 -2240693 -960771 -848412 -1449843 -1674578
32309a674578L13665L85190M51160O82986M36195l52019p13630k29158K69212
$$ -1674578 -1360913 -975723 -524563 158423 594618 242599 -471031 -700189 -430977
32300d30977J71784l7081L4005q090k08622J01754P89412O13590n66488r41872
$$ -430977 -259193 -296274 -262269 -270359 -478981 -377227 412185 1025775 459287 -482585
32290d82585M90913J867953R96523j190270j842131k77989J253438Q74899p05098
$$ -482585 8328 1876281 2872804 1682534 -159597 -437586 815852 1690751 985653
32281I85653j637257j153579J66442J309805J498597O35958n19914j008098o02288
$$ 985653 -651604 -1805183 -1638741 -328936 1169661 1805619 1285705 277607 -324681
32272c24681J60626O68264N86722p2320p29025n56014L64183P79607l8803r83632
$$ -324681 -164055 504209 1090931 1018611 289586 -266428 97755 877362 838559 -145073
32262a45073n72329Q04124J427314P61010o9196l11677n23975j061693j137396
$$ -145073 -717402 86722 1514036 2275046 2205850 1894173 1370198 308505 -828891
32253h28891k46862O24356L27260o41829q01482J85817J108849R24270r117o50597
$$ -828891 -1075753 -451397 -124137 -765966 -1567448 -1381631 -272782 651488 642371 -8226
32243h226n72206j38621J87475K40721L3960k70238k58267L91426J287239J497304
$$ -8226 -580432 -719053 -531578 -290857 -256897 -527135 -785402 -393976 893263 2390567
32233B390567O81778l47038o54270l84033l12835n61713n94683k94762q3782n4919
$$ 2390567 3072345 2725307 2071037 1687004 1374169 812456 217773 -76989 -160771 -215690
32223b15690j1580k70165j129588j550206r6702K355412K845495L70761k187822
$$ -215690 -227270 -497435 -1627023 -3177229 -3273931 -918519 1926976 2297737 109915
32214A09915j868581K76611J093318Q6437m52529M29349J020435J33903r80845
$$ 109915 -1758666 -1482055 -388737 -302300 -754829 -325480 694955 828858 -151987
32205a51987r07118j60243K10187M34803J051640J419580P02231n07905r44024
$$ -151987 -1059105 -1219348 -1009161 -574358 477282 1896862 2599093 2091188 1147164
32196A147164n21907k13109l81112l73750K58593J021309J136108M76483l05259
$$ 1147164 625257 412148 31036 -342714 -84121 937188 2073296 2549779 2244520
32187B244520m77863j06472p2067q33099j439270o32811J118076J847127P07007
$$ 2244520 1766657 1660185 1588118 755019 -684251 -1317062 -198986 1648141 2355148
32178B355148q27603j071111l33631J2583k31098j49525M26024N46942k48413
$$ 2355148 1527545 456434 122803 135386 -95712 -245237 180787 727729 479316
32169D79316j088181r55061k3898O65705N37603P0951Q0258O37109R71193N37222
$$ 479316 -608865 -1563926 -1587824 -922119 -384516 -313565 -233307 403802 1374995 1912217
32159A912217j96612m75178m23560o93731j132441r05636q5703J46004o01314
$$ 1912217 1715605 1240427 816867 123136 -1009305 -1914941 -2000644 -1854640 -2455954
32150b455954j060333j90690J141783J452806P52617J86996K30636M57440N93235
$$ -2455954 -3516287 -3706977 -2565194 -1112388 -359771 -172775 57861 515301 1108536
32141A108536N82930N9233j013133j586354p73509N00447N85199l48911n08341
$$ 1108536 1691466 1750699 737566 -848788 -1622297 -1121850 -536651 -885562 -1393903
32132a393903O68287J555992P72805q94654j750496j258018j06496Q89560J259730
$$ -1393903 -725616 830376 1603181 708527 -1041969 -2299987 -2406483 -1516923 -257193
32123b57193R32653L59810N7023j50766p05651j182256p16960L30567N69150j92834
$$ -257193 675460 1035270 1092293 941527 235876 -946380 -1663340 -1332773 -763623 -956457
32113i56457m75856M16502J103507L83012p32639o92950J16485K56882l16233
$$ -956457 -1432313 -1015811 87696 470708 -261931 -954881 -838396 -581514 -897747
32104h97747m64379N3896M49980N13532P04317Q29124K37522o93403q18852q8969
$$ -897747 -1362126 -1308230 -858250 -344718 359599 1188723 1426245 732842 -86010 -174979
32094a74979K91925k13731p40331n01708K05873P90927J041188P60445j48894
$$ -174979 116946 -96785 -837116 -1338824 -1132951 -342024 699164 1459609 1310715
32085A310715r90547p94052J92693O42974M1487p03482p68341l06222M00807J288586
$$ 1310715 320168 -473884 -281191 361783 403270 -300212 -1068553 -1374775 -973968 314618
32075C14618J671215O21732j208066j738798k86323J266504J110879j42774r06230
$$ 314618 1985833 2607565 1399499 -339299 -625622 640882 1751761 1608987 702757
32066G02757r30822p65725k34328Q67380J582172J035253P1093j5912L81193O6006
$$ 702757 -228065 -993790 -1228118 -360738 1221434 2256687 2327780 2311868 2693061 2759067
32056B759067o60421n59460J57016R7672p95906j081681k94732L79569K53089
$$ 2759067 2098646 1539186 1696202 1793874 997968 -83713 -378445 1124 254213
32047B54213R5843M14237M83166j77686q19159p22168k41155N3116J73598J56335
$$ 254213 350056 764293 1247459 1069773 250614 -471554 -712709 -659593 -485995 -329660
32037c29660j81145m99516j38068N81853N66502j77380l90800K43206M73705k21946
$$ -329660 -510805 -1010321 -1148389 -566536 -34 -177414 -568214 -325008 148697 -73249
32027g3249n72934J61510O59904j76404j114851o32646L78275J32038q87265o97594
$$ -73249 -646183 -484673 175231 -1173 -1116024 -1748670 -1370395 -1238357 -2125622 -2823216
32017b823216P97141J633461R47209L7697m1848Q9358k65375o13414m07067m5092
$$ -2823216 -2026075 -392614 554595 592292 550444 639802 374427 -238987 -646054 -691146
32007f91146N5886K11362N54494M79807k19819o82551k95306K44839J30375j40209
$$ -691146 -635260 -423898 130596 610403 390584 -291967 -587273 -342434 -212059 -352268
31997c52268L02905R64920N62328q01795j403900k55441J338324J348141l94352
$$ -352268 -49363 915557 1477885 676090 -727810 -983251 355073 1703214 1308862
31988A308862k039187k004404n80785R23669J782684J981853J466794L36056n21950
$$ 1308862 -730325 -2734729 -3315514 -2391845 -609161 1372692 2839486 3175542 2653592
31979B653592k67198L59311k26764j775931j946074K04979K114322R97314j873487
$$ 2653592 2386394 2745705 2518941 743010 -1203064 -998085 1116237 2113551 240064
31970B40064k629993k59977K027997J470500o46047j399513l50597O26491M65216
$$ 240064 -2389929 -2649906 -621909 848591 202544 -1196969 -1547566 -921075 -455859
31961d55859j56032n17480o34438l45046P03932J805458J412482o34691k240950
$$ -455859 -611891 -1129371 -1763809 -2108855 -1404923 400535 1813017 1178326 -1062624
31952a062624j471131Q40557K058052J090313m18163n08026N50837R61285M8527
$$ -1062624 -2533755 -1693198 364854 1455167 1037004 528978 1079815 2041100 2089627
31943B089627r31511p07374K94753P20763J33310o70322r05244o08728k05598
$$ 2089627 1158116 450742 745495 1466258 1599568 929246 24002 -584726 -790324
31934g90324R4450K82266L65887L89624L59102R7859m90017r99277q21705j7742
$$ -790324 -695874 -413608 -47721 341903 701005 798864 308847 -690430 -1512135 -1529877
31924a529877N62698L28646k45236k63687L67084Q51307O17429L0926k26182r9815
$$ -1529877 -967179 -638533 -883769 -1147456 -780372 70935 688364 719290 493108 393293
31914C93293l4509q2627K02234Q11099R19846O4904q59721o83964K26506L71962
$$ 393293 358784 276157 478391 1289490 2209336 2274240 1414519 730555 957061 1329023
31904A329023n84900j199845m80746M68489R6861j138368j330038J28518J643287
$$ 1329023 744123 -455722 -936468 -467979 -371118 -1509486 -2839524 -2711006 -1067719
31895a067719J497720q0728j350546j066327L04568J241432Q85099o3407l86630
$$ -1067719 430001 349273 -1001273 -2067600 -1763032 -521600 363499 300092 -86538
31886h6538k4448M4986m52546o07610K5869N63880L47917J20708N57189Q42025
$$ -86538 -110986 -66000 -518546 -1126156 -1100287 -536407 -188490 -67782 489407 1331432
31876A331432J53501n40036M4090J105058Q92505l40841p53148m873M10447m9389
$$ 1331432 1484933 944897 988987 2094045 2986550 2645709 1892561 1887688 2298135 2248746
31866B248746k83311L2004k06640j116446j233045k63402M9896q99159j063855
$$ 2248746 1965435 1997439 1790799 674353 -558692 -822094 -772198 -1671357 -2735212
31857b735212P70656K322686J075386j580687k247084m44321J181231J030003
$$ -2735212 -1964556 358130 1433516 -147171 -2394255 -2838576 -1657345 -627342
31849f27342J78694j59425k54885m20384p4323Q91611J385826O78474m17279p16746
$$ -627342 -448648 -608073 -862958 -1283342 -1357665 -466054 919772 1598246 1180967 464221
31839D64221j91306L50297M82809M29818M27946L18781j76723q60360r46556r37
$$ 464221 272915 623212 1106021 1535839 1963785 2282566 2105843 1245483 298927 297990
31829B97990J079127Q91861m10878j020888p3242R08317K93244j098685j315985
$$ 297990 1377117 2268978 1858100 837212 763970 1672287 1965531 866846 -449139
31820d49139l01969K90156j08606l79749M2327K57754k80667o89098j73491O38264
$$ -449139 -751108 -460952 -569558 -949307 -906980 -649226 -929893 -1618991 -1792482 -1154218
31810a154218P66430L83750L74872R15719J247489P44298k11552n80674n71M48131
$$ -1154218 -387788 -4038 370834 1286553 2534042 3278340 3066788 2486114 2485543 2933674
31800B933674m51136j931573j765272M02952J856085M64251j913772j949328K43003
$$ 2933674 2482538 550965 -1214307 -811355 1044730 1508981 -404791 -2354119 -2111116
31791b111116J530692P42174K0864O86559R86963n05661k018563j337382N34847
$$ -2111116 -580424 161750 182614 869173 1856136 1350475 -668088 -2005470 -1470623
31782a470623J001569o8811m89816N39631J329459N36992q63388j191261l31509
$$ -1470623 -469054 -537865 -1027681 -488050 841409 1378401 515013 -676248 -1007757
31773a007757N03622N72348K78146J98315J65117k82741q52149o64420L02776
$$ -1007757 -504135 68213 346359 544674 709791 427050 -425099 -1089519 -786743
31764g86743Q04054Q2940p54746k66537J065220J578218R95243M68569K80929
$$ -786743 17311 100251 -654495 -921032 144188 1722406 2717649 3186218 3467147
31755C467147l99635j334078j123311J04666L46269r22185j527251k39928Q63779
$$ 3467147 3067512 1733434 610123 714789 1061058 138873 -1388378 -1628306 -764527
31746g64527j55331j535772n27645J930801K456888L51653j666253j679712o07159
$$ -764527 -919858 -2455630 -2983275 -1052474 1404414 1756067 89814 -1589898 -2197057
31737b197057K10804P41374R57460K14209j154401j585152n75608M44234L88161
$$ -2197057 -1986253 -1244879 -287419 -73210 -1227611 -2812763 -3388371 -2944137 -2555976
31728b555976P3961N73660J437714J586709Q22653m14579j700278k284502j322013
$$ -2555976 -2482015 -1908355 -470641 1116068 1938721 1524142 -176136 -2460638 -3782651
31719c782651O60616J702399Q36917m75527m26332O53710J143183N87576j44301
$$ -3782651 -3122035 -1419636 -582719 -1058246 -1484578 -830868 312315 899891 755590
31710G55590n66274q94187r29184j75212Q33739P76262m47466j210449m11866
$$ 755590 189316 -704871 -1634055 -1809267 -975528 -199266 -646732 -1857181 -2269047
31701b269047P82065N37420r17680j515435k91117J264814J406556N31100K30470
$$ -2269047 -1486982 -949562 -1867242 -3382677 -3673794 -2408980 -1002424 -471324 -240854
31692b40854P17836P75026M7219l96854j48209k87458j263561j694705o70407
$$ -240854 476982 1252008 1299227 902373 754164 466706 -796855 -2491560 -3161967
31683c161967L29292l02820j394883o84904J395438K266941J273852M25636P71248
$$ -3161967 -2832675 -3135495 -4530378 -5215282 -3819844 -1552903 -279051 146585 917833
31674I17833Q61518k35108j043487l33744N94559J80726o67684k67035P97369
$$ 917833 1779351 1544243 500756 167012 761571 942297 274613 7578 804947
31665H04947O58937o33018j240388n41066J57837L168k21335K58845R04789Q44574
$$ 804947 1463884 830866 -409522 -950588 -792751 -789583 -1010918 -752073 152716 997290
31655I97290J03838o96659j118296r87356l24356M89670R26733Q56039N33768
$$ 997290 1101128 404469 -713827 -1701183 -2025539 -1535869 -609136 246903 780671
31646G80671J25759l05820m75705j09296N21673Q01189N16363K5664k54251k11995
$$ 780671 906430 600610 124905 15609 537282 1338471 1854834 1880498 1626247 1414252
31636A414252k4663l0092l89626p04335l82635M10581P76889L73928m7108J36074
$$ 1414252 1389589 1359497 969871 265536 -117099 293482 1070371 1444299 1397191 1533265
31626A533265M53922K42161k83076n86321o78130o56916k61854K64074o7010j239066
$$ 1533265 1987187 2229348 1946272 1359951 681821 24905 -236949 27125 -39885 -1278951
31616a278951j438270M13429K420122K023971k28775j546475j060335n16666p78131
$$ -1278951 -2717221 -2303792 116330 2140301 1911526 365051 -695284 -1211950 -1990081
31607a990081n02037Q86707J604670L97951j145298j018216J17704K98261m55380
$$ -1990081 -2492118 -1605411 -741 397210 -748088 -1766304 -1648600 -1350339 -1805719
31598a805719l98193Q97342J813230J140745k89913r01434l16637M87903N11331
$$ -1805719 -2203912 -1306570 506660 1647405 1357492 456058 139421 627324 1138655
31589A138655j47280m89116M3442O87120L71299n83677p96705J7333M79641l15497
$$ 1138655 991375 502259 545701 1232821 1604120 1020443 223738 241071 720712 405215
31579D05215j353897j294311l97772K58054N20694P78817O25447m97108j703862
$$ 405215 -948682 -2242993 -2640765 -2382711 -1862017 -1083200 -457753 -954861 -2658723
31570b658723j365703N20984K046714J762575K42839j036706j401166j128020
$$ -2658723 -4024426 -3503442 -1456728 305847 548686 -488020 -1889186 -3017206
31562c017206o75748k92136J4952M48384J131935J776709J898441J339733L59237
$$ -3017206 -3692954 -3985090 -3970138 -3521754 -2389819 -613110 1285331 2625064 2984301
31553B984301n99344j002105n33287K67686K34027q95773j732339r43229P48227
$$ 2984301 2384957 1382852 849565 1117251 1351278 455505 -1276834 -2220063 -1471836
31544a471836J421401N76601m01232m37220n9930q5395k52324M2809N07909L52818
$$ -1471836 -50435 526166 124934 -312286 -372216 -457611 -709935 -667126 -159217 193601
31534A93601m96621j293023j381283p64258P8860O37402P64587P43167Q00435
$$ 193601 -303020 -1596043 -2977326 -3741584 -3662724 -3025322 -2260735 -1517568 -717133
31525g17133P01264K23380k13552j25770j555p06808j772014j583205J77849J619903
$$ -717133 -15869 207511 -6041 -131811 -133366 -840174 -2612188 -4195393 -4017544 -2397641
31515b397641J188192l1140K396J130055J370944J71613p53456k41413N55724
$$ -2397641 -1209449 -1240589 -1238193 -108138 1262806 1434419 680963 439550 995274
31506I95274K37748n69952m72883K48874J94560p18213j178291p28156k95925
$$ 995274 1233022 663070 190187 439061 633621 -84592 -1262883 -1991039 -2286964
31497b286964k67759J29527R12028P06001p98978j533011L7643K064133J674757
$$ -2286964 -2554723 -2425196 -1513168 -807167 -1606145 -3139156 -3101513 -1037380 637377
31488F37377o36112j609793r6363J433543R11423m02329m22110M76145O07289
$$ 637377 1265 -1608528 -1704891 -271348 640075 237746 -184364 291781 899070
31479H99070o3702k42958K28953K54124m86753j072503q58795j30369O57713J146761
$$ 899070 835368 592410 821363 1075487 588734 -483769 -1342564 -1472933 -815220 331541
31469C31541Q33609k70318j054897o21108K02900N5516o47795l29506R81106J480100
$$ 331541 1165150 894832 -160065 -781173 -578273 -522757 -1170552 -1500058 -518952 961148
31459I61148M84832m78033j84077N01678L61082k41717m02099l25405n53273o22719
$$ 961148 1445980 967947 783870 1285548 1646630 1404913 1002814 677409 124136 -498583
31449d98583J9150O23163K42362m21297l382J044070Q54032q47869k021912j266903
$$ -498583 -479433 143730 386092 -35205 -38587 1005483 1859515 1011646 -1010266 -2277169
31439b277169J80442N41406K15021P29048J776011J393097p69722k364056j477664
$$ -2277169 -2096727 -1555321 -1340300 -611252 1164759 2557856 1788134 -575922 -2053586
31430b053586O78970J620866R94663L60543K83394j66241j044497r99109K25974
$$ -2053586 -1374616 246250 1240913 1601456 1884850 1718609 674112 -324997 -99023
31421i9023Q99563M9836q67993n22136N931n46990r00927O19174K521124J905521
$$ -99023 800540 850376 -17617 -539753 -533822 -1080812 -1981739 -1362565 1158559 3064080
31411C064080p65020k015298o54890O25936j56179j293150o42437Q21944R29496
$$ 3064080 2299060 283762 -371128 254808 98629 -1194521 -1836958 -1015014 -85518
31402h5518j27363m98786K33644Q07522M75801k60385p14073n69140J60966Q30286
$$ -85518 -212881 -711667 -478023 329499 805300 544915 -169158 -738298 -577332 252954
31392B52954N15596n80316j067734m33865J70064Q8699L94409J598514J987394
$$ 252954 768550 188234 -879500 -1313365 -1143301 -1054602 -660193 938321 2925715
31383B925715K67125j698107j275583Q83874J827737O81070o58813r29132q69028
$$ 2925715 3192840 1494733 219150 1103024 2930761 3611831 2953018 2023886 1154858
31374A154858j008832o81451J80849M89237o8668m58589k45798k24130n50335
$$ 1154858 146026 -535425 -354576 134661 65993 -392596 -638394 -862524 -1412859
31365a412859k54260O76363P87007l06175r05369Q027R47711M01874o17185l63209
$$ -1412859 -1667119 -990756 -203749 -509924 -1415293 -1407266 -459555 -57681 -674866 -1038075
31355a038075P13931Q90495M4967m70641k34077j8900K2386M86285J052180N54559
$$ -1038075 -324144 566351 611318 140677 -93400 -112300 -89914 396371 1448551 2003110
31345B003110r58432j860215j179489J27830P26759N47823K01907j94232p18225
$$ 2003110 1044678 -815537 -1995026 -1867196 -1140437 -592614 -390707 -584939 -1303164
31336a303164r20188l68199M67285O97568K03242l15935l59638j07461R2081J92482
$$ -1303164 -2223352 -2591551 -2124266 -1426698 -1223456 -1539391 -1899029 -2006490 -1914409 -1721927
31326a721927L15493M95538O35238N10118q4435q96813j116923k35417J042567
$$ -1721927 -1406434 -910896 -275658 234460 150025 -746788 -1863711 -2099128 -1056561
31317a056561J391730N20518m55490o02275l55745n11352p74885l35582N60926
$$ -1056561 335169 855687 400197 -202078 -557823 -1069175 -1844060 -2179642 -1618716
31308a618716Q43041L43664M8838M00759N94488P8491m10456j24366L48968M7186
$$ -1618716 -775675 -432011 -383173 17586 612074 690565 280109 155743 504711 551897
31298E51897p35015q97983k55747K71023Q5273l65283l76368J37756O43382N04880
$$ 551897 -183118 -1081101 -1336848 -1065825 -980552 -1345835 -1722203 -1584447 -941065 -436185
31288d36185l75319j179440q29305O11794J717957J395411K23842n16612n06231
$$ -436185 -811504 -1990944 -2820249 -2208455 -490498 904913 1128755 612143 105912
31279A05912k66572l6732K04887J31024l71206m58898N64224J701131J261034
$$ 105912 -160660 -197392 7495 138519 -232687 -691585 -127361 1573770 2834804
31270B834804n96725j758047r07674Q37361J506686N23664j062830j825496j115818
$$ 2834804 2238079 480032 -427642 409719 1916405 2440069 1377239 -448257 -1564075
31261a564075L78768J102088K95260r02808q52758L06553R47346M45386n7330
$$ -1564075 -1185307 -83219 212041 -690767 -1543525 -1236972 -289626 155760 98430
31252I8430L26955Q97497P08254L0333l66668m72122p05949r63872p53901N7496
$$ 98430 425385 1322882 2031136 2061469 1694801 1222679 516730 -447142 -1201043 -1143547
31242a143547J058226J544846R19352o10681j815746j711059q83075n42152n15527
$$ -1143547 -85321 1459525 2378877 1768196 -47550 -1758609 -2641684 -3183836 -3699363
31233c699363L29974J694521J757809J1206j658036j613284n28893K56967P69325
$$ -3699363 -3369389 -1674868 82941 94147 -1563889 -3177173 -3706066 -3449099 -2679774
31224b679774J377181J301820m6975j361490r89138M95535J089666K79660n74521
$$ -2679774 -1302593 -773 -47748 -1409238 -2398376 -1902841 -813175 -533515 -1108036
31215a108036n20548k6686K67685L66142L57624J91547N1983L5506k93971j034525
$$ -1108036 -1628584 -1655270 -1387585 -1021443 -663819 -472272 -420289 -384783 -678754 -1713279
31205a713279j129017K35892J851236J778178K57278n23354K62024R60041K48678
$$ -1713279 -2842296 -2606404 -755168 1023010 1280288 756934 1018958 1978999 2227677
31196B227677q49977r00001l75508n04516r40279m00357R21680J414669N42873
$$ 2227677 1377700 477699 102191 -402325 -1342604 -1742961 -821281 593388 1136261
31187A136261l53258j96773K94088N6531m57550j39063O86550N66125o56667j274036
$$ 1136261 783003 586230 880318 936849 479299 340236 1026786 1592911 936244 -337792
31177c37792k42908J033484O52742r58225j694112q20065L19403O43802O14123
$$ -337792 -580700 452784 1105526 147301 -1546811 -2366876 -2047473 -1403671 -789548
31168g89548O96351K99974p58538j227982k29766J017446Q27099l66915p01188
$$ -789548 -93197 206777 -551761 -1779743 -2009509 -992063 -164964 -531879 -1233067
31159a233067K51099R93648M94557m70471p18971k15142K66876K15566k63860
$$ -1233067 -981968 11680 506237 35766 -683205 -898347 -631471 -415905 -679765
31150f79765n94783j12195J106969J879696J187178k60374p46810M5959N11559
$$ -679765 -1274548 -1386743 -279774 1599922 2787100 2526726 1779916 1825875 2337434
31141B337434n40798k092440k288517q93072N76017Q52720K05766k80632n4335
$$ 2337434 1796636 -295804 -2584321 -3477393 -2901376 -2048656 -1842890 -2123522 -2177857
31132b177857M90488O10539J8741p96117r77633j20888J231375J953269J335359
$$ -2177857 -1687369 -1076830 -1058089 -1854206 -2831839 -2952727 -1721352 231917 1567276
31123A567276j77107j316340j204034j84478O88917Q41558N47865K72381J64548
$$ 1567276 1390169 73829 -1130205 -1314683 -625766 215792 763657 1036038 1200586
31114A200586K38370M86927O32803K76104m70788r52820p89939k79073J55613
$$ 1200586 1438956 1925883 2558686 2834790 2364002 1411182 621243 342170 497783
31105D97783L73405K84713r4173k39736L38232R61781L32939j335317k054957
$$ 497783 871188 1155901 1061728 821992 1160224 2122005 2454944 1119627 -935330
31096i35330p71751R59448J210496M01207K02602O55497L45397r29648j671600
$$ -935330 -1707081 -747633 462863 864070 1066672 1722169 2067566 1137918 -533682
31087e33682j029917O8666N48033N13390M46715L00007M875o4948K77121O31901
$$ -533682 -1563599 -1494933 -946900 -433510 13205 313212 318087 253139 530260 1162161
31077A162161O23223K93825k59588r25995j191763n92015L34697N07895r5022
$$ 1162161 1785384 2079209 1819621 893626 -298137 -890152 -555455 -47560 -142582
31068a42582l46446K26705O77431K17803n03891m98406K0829J07241m21367q33777
$$ -142582 -489028 -262323 415108 632911 129020 -369386 -348557 -241316 -662683 -1496460
31058a496460o14444n8985K20903j3016m08377l54151L21962J000765R47241K96407
$$ -1496460 -2110904 -2169889 -1948986 -1962002 -2370379 -2724530 -2402568 -1401803 -454562 -158155
31048a58155j26504K1397K16364j2872m08683m90981k20279J21188K93896J56686
$$ -158155 -284659 -263262 -46898 -59770 -468453 -959434 -1179713 -1058525 -764629 -607943
31038f07943k36693m88940k49193K13285L55448K61290M80666Q97499O49249m75033
$$ -607943 -844636 -1333576 -1582769 -1369484 -1014036 -752746 -272080 625419 1274668 799635
31028G99635j395922j088930M4490P70865N37921k00939q02488r31160m60821
$$ 799635 -596287 -1685217 -1640727 -869862 -331941 -532880 -1335368 -2266528 -2727349
31019b727349M50978J156623R27206j85536j179301j100082j49722N25906K86915
$$ -2727349 -2276371 -1119748 -192542 -378078 -1557379 -2657461 -2807183 -2281277 -1994362
31010a994362j45359K43380J123894J130444q5798j130371p50105M53402J026438
$$ -1994362 -2139721 -1896341 -772447 357997 272199 -858172 -1608277 -1154875 -128437
31001a28437O48591J10352j30772k31956j45093L23010P62313N26860j89116n53934
$$ -128437 520154 630506 499734 267778 122685 445695 1208008 1734868 1545752 991818
30991I91818k88442J83052N45285O52859J07885j144346k074731j597508j44862
$$ 991818 703376 886428 1431713 2084572 2192457 1048111 -1026620 -2624128 -2768990
30982b768990R15334J133210J011234O19974k64748r61972n93435J69902l5329
$$ -2768990 -1853656 -720446 290788 910762 646014 -315958 -909393 -739491 -774820
30973g74820p60968k78360J263571J680129L11291q13941l69224K53279k34857
$$ -774820 -1535788 -1814148 -550577 1129552 1440843 626902 257678 510957 276100
30964B76100o13682M60510J728282J306512j49471o53089j12727J7973n12249
$$ 276100 -337582 122928 1851210 3157722 3008251 2355162 2242435 2260408 1748159
30955A748159o89103m06900m99875q68683n97184K07013N59150M61278P81501
$$ 1748159 1059056 652156 152281 -716402 -1313586 -1106573 -547423 -86145 695356
30946F95356J330940R45383l64087j146316p27782o2522K2071j19790j13481k81371
$$ 695356 2026296 2971679 2607592 1461276 733494 670972 693043 573253 459772 178401
30936A78401n92388k76757P59846J335843O40097n17130r44610p06162o08545
$$ 178401 -413987 -690744 69102 1404945 2045042 1527912 583302 -122860 -731405
30927g31405p23658m31194L58569R08606O24398k19091q40610p73551k17626L28832
$$ -731405 -1455063 -1886257 -1527688 -619082 5316 -213775 -1054385 -1827936 -2045562 -1716730
30917a716730O30676P45334N97614K102p23185p54440J64005J139294J197027
$$ -1716730 -1086054 -340720 256894 258996 -464189 -1218629 -1054624 84670 1281697
30908A281697M72122k97000r16144j493929j541476n14119Q85319J189740J47794
$$ 1281697 1753819 1456819 540675 -953254 -2494730 -3008849 -2123530 -933790 -785996
30899g85996q62050p24015R4774N66652N32403M52014M16131J82401j64614k79751
$$ -785996 -1648046 -2372061 -2277287 -1710635 -1178232 -726218 -310087 -127686 -292300 -572051
30889e72051j39680l2082l0128P1019K75991K66308o2616k57826J27171P34012
$$ -572051 -711731 -743813 -773941 -702922 -426931 -160623 -223239 -481065 -353894 380118
30879C80118O78104j89008q52608m88157K53693J80978n31800n75159K96798P02595
$$ 380118 1058222 869214 16606 -471551 -217858 -36880 -568680 -1143839 -847041 -144446
30869a44446j73240j157832q38052L57720J029551Q94685O49058M09574j66179
$$ -144446 -317686 -1475518 -2313570 -1955850 -926299 -31614 617444 1027018 860839
30860H60839n81017L7389J180691J244393j22594j342190j086317N2711O86224
$$ 860839 279822 317211 1497902 2742295 2619701 1277511 191194 243905 930129
30851I30129M16735k00866o66325p42267k56323N65904R72069N24801k25048m52399
$$ 930129 1346864 1145998 479673 -262594 -518917 46987 1019056 1543857 1318809 866410
30841H66410j72382q0744m57307q15174o64492j38017L06137M51045L51922P2291
$$ 866410 694028 613284 155977 -659197 -1323689 -1461706 -1155569 -704524 -352602 -280311
30831b80311k43678j87341M82582J144231P35545o92404j553100p04944P24515
$$ -280311 -523989 -711330 -228748 915483 1651028 958624 -594476 -1299420 -574905
30822e74905P66725m17909o78561P31886J760982O01549j449229j797813k08647
$$ -574905 191820 -226089 -904650 -172764 1588218 2189767 740538 -1057275 -1265922
30813a265922J179262J022704J42131k90658k69059k15938l7377M04664P12481
$$ -1265922 -86660 936044 1078175 787517 518458 302520 265143 669807 1382288
30804A382288M89144k7892l15882k26493j5008L9495j42149m30621o04196n22960
$$ 1382288 1871432 1843540 1527658 1301165 1286157 1325652 1183503 752882 148686 -374274
30794c74274j66947M06483R03839P72951j14044q59886m14161R07095J683634
$$ -374274 -541221 -134738 769101 1542052 1428008 568122 153961 1061056 2744690
30785B744690J278328L79113m78169j489428k281510j753783r3634P72543m2916
$$ 2744690 4023018 4402131 3923962 2434534 153024 -1600759 -1694393 -921850 -964766
30776i64766q57374j66327Q23233L82391o15541k36312J020497J020126l68555
$$ -964766 -1822140 -1988467 -1165234 -782843 -1398384 -1634696 -614199 405927 37372
30767C7372j193380p18583j49619o8722K82786R39780Q67069O1277k29386K54483
$$ 37372 -1156008 -1874591 -2024210 -2092932 -1810146 -870366 -3297 57980 -171406 83077
30757H3077M53278J24231P0173Q8251p85739j734162p40413J656326K271242R4239
$$ 83077 536355 660586 730759 819010 33271 -1700891 -2441304 -784978 1486264 1580503
30747A580503j840418j047920Q06559J004304o4095l31452L42310O23823L36725
$$ 1580503 -259915 -1307835 -501276 503028 438933 107481 449791 1073614 1410339
30738A410339J95972J0030o61271j049428m18216K28469k98862j081609m69987
$$ 1410339 1606311 1616341 955070 -94358 -512574 -284105 -582967 -1664576 -2134563
30729b134563J052064J540149N81579m19847n64561k00589L25368R34462J118592
$$ -2134563 -1082499 457650 1039229 619382 54821 -145768 179600 1114062 2232654
30720B232654N18254j59090j73398r2222o46710j082009m02944N41039K48632
$$ 2232654 2750908 2591818 2418420 2326198 1679488 597479 194535 735574 984206
30711I84206p74086p43861L85122R05820K49696l43449j74571K0083j87551k57525
$$ 984206 210120 -533741 -148619 757201 1006897 663448 488877 508960 321409 63884
30701F3884j22803m23318r29195n62045N96249J124647N45965j4358O4046N308
$$ 63884 -58919 -482237 -1411432 -1973477 -1377228 -252581 293384 279026 343072 348380
30691C48380n39021p01330k27859j81818q42828q25110M68593J380540N66042
$$ 348380 -190641 -891971 -1119830 -1301648 -2144476 -2969586 -2500993 -1120453 -554411
30682e54411o30825k68799J037327J200203N2893n98904m0899L91565k82169j126571
$$ -554411 -1185236 -1454035 -416708 783495 836388 237484 196585 588150 305981 -820590
30672h20590q66602J95418O87714m6034j306875j884409j208534J37131R46392
$$ -820590 -1687192 -1491774 -804060 -850094 -2156969 -4041378 -5249912 -5112781 -4166389
30663d166389O42892o3623p9872O55140J141834O88113k43526p39245n22806o008
$$ -4166389 -3523497 -3587120 -3666992 -3011852 -1870018 -1181905 -1425431 -2164676 -2687482 -2693490
30653b693490M39340P92988J020969Q76030L06868k35300k78323J9472J17246
$$ -2693490 -2254150 -1461162 -440193 435837 742705 507405 229082 248554 365800
30644C65800q0471j58935L7513K20562L64694P74132J107268L49568j475740k546841
$$ 365800 285329 126394 163907 384469 749163 1523295 2630563 2980131 1504391 -1042450
30634a042450j396625Q64266J900382J266569N26135M62391J45184q42288j257830
$$ -1042450 -2439075 -1574809 325573 1592142 2118277 2580668 2725852 1883564 625734
30625F25734l24671O58676K74078o92991n55507M95939P77762p7927o24846j12009
$$ 625734 301063 959739 1233817 540826 -14681 481258 1259020 1181093 556247 444238
30615D44238L14264l36605j130416o97450M79902P26991k48870r23336k81665
$$ 444238 758502 421897 -708519 -1405969 -926067 -199076 -447946 -1371282 -1652947
30606a652947P49539Q74064L69955L48747O99511K15877j201234j906258p46895
$$ -1652947 -903408 -29344 340611 689358 1388869 1604746 403512 -1502746 -2249641
30597b249641J098253J506866Q7360j488312j576324j70928J456552K024753J183143
$$ -2249641 -1151388 355478 442838 -1045474 -2621798 -2792726 -1336174 688579 1871722
30588A871722k55765j044098p88188k51603r5699K4222M98881P23574R1850o34961
$$ 1871722 1615957 571859 -216329 -467932 -563631 -539409 -40528 683046 774896 139935
30578A39935l34195N42950O26583k7885q2427N50134M02372p81165j151785K24187
$$ 139935 -194260 348690 975273 947388 864961 1415095 1817467 1036302 -115483 108704
30568A08704J455142O34613j037081j054814M94139J131474k75317k109799k468606
$$ 108704 1563846 2198459 1161378 106564 600703 1732177 1456860 -652939 -3121545
30559c121545j258471M68021J754179J925621Q67089m22137o46997O6977L46019
$$ -3121545 -4380016 -3911995 -2157816 -232195 634894 212757 -434240 -367263 -21244
30550b1244l14197q63785m99840K14595O21142R51408J202065M65162j352435
$$ -21244 -335441 -1199226 -1699066 -1484471 -863329 88079 1290144 1755306 402871
30541D02871k383519j044183J371741K153655Q35114m79154m17843L586m16853
$$ 402871 -1980648 -3024831 -1653090 500565 1335679 856525 438682 442268 25415
30532B5415j039501p16450J39357K70431l15548l83770N37340J421003J216993
$$ 25415 -1014086 -1730536 -1591179 -1320748 -1636296 -2020066 -1482726 -61723 1155270
30523A155270K01212n23351l67461K53318N29521J24607n21799p19412l28006
$$ 1155270 1356482 833131 465670 718988 1248509 1373116 851317 131905 -196101
30514a96101J51963L11046K74203K25417k3108n32052p07902N2773J319418J869057
$$ -196101 -44138 266908 541111 766528 743420 211368 -496534 -443761 875657 2744714
30504B744714J065940m15069j320200j019507l2365M62285j60095j112321j015078
$$ 2744714 3810654 3395585 2075385 1055878 1023513 1485798 1325703 213382 -801696
30495h01696K10917J067947O33742m2722K39951O82715j25908j410870j095825
$$ -801696 -590779 477168 1110910 1068188 1308139 1990854 1864946 454076 -641749
30486f41749O21676J155444l96457j649104p06289Q56468P30581m08209l87936
$$ -641749 -20073 1135371 738914 -910190 -1616479 -760011 -29430 -437639 -825575
30477h25575O87722R14545K3363m59881j75746k99041q73454n11495P64231J037772
$$ -825575 -137853 776692 800055 340174 164428 -134613 -1008067 -1519562 -755331 282441
30467B82441k66386j175462m06341N60854K14230m05641J39530Q70517J78500
$$ 282441 16055 -1159407 -1565748 -1004894 -790664 -1196305 -1056775 -186258 -7758
30458g758j000527n43191J149661J632569L82274m95469J31614P25771r5015j251712
$$ -7758 -1008285 -1551476 -401815 1230754 1613028 1117559 1249173 1974944 1879929 628217
30448F28217j071177J71889J003429Q80438K75129m41672r82621p87589J47421
$$ 628217 -442960 -271071 732358 1612796 1887925 1446253 463632 -323957 -176536
30439a76536P47607K54495n40660n86534l15632o76941j100559k40607J486037
$$ -176536 571071 825566 284906 -301628 -617260 -1294201 -2394760 -2635367 -1149330
30430a149330K062268Q47298m50847m09384K08498J33935l73268m51911l30907
$$ -1149330 912938 1760236 1309389 900005 1108503 1242438 869170 417259 86352
30421H6352n70026n64821M96753J795359J770035N64366j92823j9167j29047j016432
$$ 86352 -483674 -1048495 -551742 1243617 3013652 3578018 3385195 3366028 3236981 2220549
30411B220549j379015l34794Q84318P10847m27534r25918l98769J20663j8291
$$ 2220549 841534 506740 1391058 2101905 1674371 748453 349684 470347 452056
30402D52056l71617m15263k16797L954K09480L44147L56828L95291N15515L98566
$$ 452056 80439 -334824 -551621 -547667 -338187 5960 362788 758079 1273594 1672160
30392A672160j17409n31503l77384r8794l71168q05331m19307N97763Q25453k76258
$$ 1672160 1554751 1023248 645864 547070 175902 -629429 -1048736 -450973 374480 98222
30382I8222j333283r34129L07627O46750k58740r22921k80940P19678M66845r93088
$$ 98222 -1235061 -2169190 -1861563 -1214813 -1473553 -2396474 -2677414 -1957736 -1490891 -2483979
30372b483979j944629j270601K03126J041369J085672J174215J471404J247254
$$ -2483979 -4428608 -5699209 -5496083 -4454714 -3369042 -2194827 -723423 523831
30364E23831L31520m07785m46280l83346o87028o90609J71444R82296N11103p26221
$$ 523831 855351 447566 1286 -382060 -1069088 -1759697 -1588253 -605957 -94854 -821075
30354h21075j025135j1944Q38989M74870k77421j46095P23064J163007O16756
$$ -821075 -1846210 -1858154 -1019165 -544295 -821716 -967811 -244747 918260 1535016
30345A535016l82114j002329q32705j03280M09578O7437o79890n54832P89219
$$ 1535016 1152902 150573 -682132 -785412 -375834 -308397 -988287 -1543119 -753900
30336g53900J838935R62416j206621k270359j142017N19085O41033m34438o88502
$$ -753900 1085035 2047451 840830 -1429529 -2571546 -2052461 -1411428 -1845866 -2534368
30327b534368M47685J299878O41372l61907k3752J125759J101454m50030j657462
$$ -2534368 -2086683 -786805 -145433 -507340 -531092 594667 1696121 1246091 -411371
30318d11371j116268L60337J208352J017978K96009m91081q48999l18941N54742
$$ -411371 -1527639 -1167302 41050 1059028 1355037 863956 14957 -303984 250758
30309B50758M13190q55616j462541k70907J289889J367377M67795J47500O2436
$$ 250758 663948 -191668 -1654209 -1925116 -635227 732150 1199945 1347445 1409881
30300A409881j131660k572159j893203O72770J941656N07162r87434J9405J995251
$$ 1409881 278221 -2293938 -4187141 -3514371 -1572715 -1065553 -2052987 -2033582 -38331
30291c8331J753640p11206k424148j716287J05548J234245J376690R79323K10560
$$ -38331 1715309 1004103 -1420045 -3136332 -3030784 -1796539 -419849 559474 770034
30282G70034o02222p52570j07157M96217L47951k30021m98175k92969n170L9508
$$ 770034 167812 -584758 -691915 -195698 152253 -77768 -575943 -868912 -874082 -834574
30272h34574j65927l93206k89112L22097J073113J280574P17035j00661n32456
$$ -834574 -1000501 -1393707 -1682819 -1360722 -287609 992965 1710000 1609339 1076883
30263A076883m37026m2666M20836O95561M75650j63722n84431l33289J16918k6710
$$ 1076883 639857 597191 1018027 1713588 2189238 2025516 1441085 1107796 1224714 1198004
30253A198004o41921q27927l40471L1018j56447k76365P0996J72093l09997j23309
$$ 1198004 556083 -271844 -612315 -581297 -737744 -1014109 -943113 -771020 -1081017 -1204326
30243a204326J562527K824094J098652k526274l922776j557827J213308J008123
$$ -1204326 358201 3182295 4280947 1754673 -2168103 -3725930 -2512622 -1504499
30235a504499r23529j203909M43444J397024N78757l12935P0810R28361J034622
$$ -1504499 -2428028 -3631937 -3188493 -1791469 -1212712 -1525647 -1454837 -526476 508146
30226E08146L24892o46356j302652r65018L95375J431018R51821j39445j96438
$$ 508146 833038 186682 -1115970 -2080988 -1685613 -254595 697226 557781 361343
30217C61343L81072k5841r80826l87995J586109K076300L620j934186j340637
$$ 361343 742415 716574 -264252 -652247 933862 3010162 3013782 1079596 -261041
30208b61041M03182P41351j61940m58314Q6493K67296j15755k17814N7613Q6591
$$ -261041 142141 883492 721552 263238 349731 617027 501272 283458 341071 427662
30198D27662j27353j54269j40232k82036k4592Q81327J367429N57075n63806n71026
$$ 427662 300309 146040 5808 -276228 -300820 580507 1947936 2505011 1941205 1370179
30188A370179J04564L0188p65386j025232m92869o5475j2526J67019K93328k92462
$$ 1370179 1474743 1504931 739545 -285687 -778556 -844031 -856557 -689538 -396210 -688672
30178f88672j095706p91226O44467J718008J592289R99151O70317K78427n58560
$$ -688672 -1784378 -2575604 -1931137 -213129 1379160 2378311 3048628 3327055 2768495
30169B768495j380764j540828r63228J707P69857O26275m63849j281497o62082
$$ 2768495 1387731 -153097 -1116325 -1114618 -344761 281514 -182335 -1463832 -2125914
30160b125914P36770J194086M05879j97505K00455O34502J13360p58556p88263
$$ -2125914 -1389144 -195058 210821 13316 213771 848273 961633 203077 -585186
30151e85186N6652P81654P43940K08846k02571j73121Q5982J32578q8590j36835
$$ -585186 -528534 253120 997060 1205906 1003335 830214 916196 1048774 960184 823349
30141H23349J39960J60833m65608j059615p68174M0882K98590j28851m47663l90713
$$ 823349 963309 1124142 658534 -401081 -1169255 -1128373 -829783 -958634 -1406297 -1797010
30131a797010m03624m16425J82752J124962J204306J51710o79103k02437Q53199
$$ -1797010 -2200634 -2617059 -2434307 -1309345 -105039 46671 -632432 -834869 18330
30122A8330J096161L70379l42184l90979o2968K4154l73468q92711q82726k20531
$$ 18330 1114491 1484870 1142686 751707 688739 712893 339425 -553286 -1436012 -1656543
30112a656543L11141M0639l98402J13526J175364J053060o15642j747835n91064
$$ -1656543 -1345402 -1304763 -1703165 -1589639 -414275 638785 23143 -1724692 -2315756
30103b315756J540110J910064J99416j130834m50424Q58342P17813n61413j038955
$$ -2315756 -775646 1134418 1333834 203000 -247424 610918 1328731 767318 -271637
30094b71637k66402K10517m15967q37669Q8411J218701Q64980l53236m15064P47821
$$ -271637 -538039 -327522 -743489 -1581158 -1492747 -274046 590934 237698 -177366 570455
30084E70455J090261p3253q08950J69917J144896Q8938j884108k009949K5412
$$ 570455 1660716 1587463 778513 948430 2093326 2182264 298156 -1711793 -1686381
30075a686381J736344J391817q9136j001181r06136l24010L27616Q44806J053169
$$ -1686381 49963 1441780 1352644 351463 -554673 -878683 -551067 293739 1346908
30066A346908R28746N14042j96068q49495p20233J50271M56145o05530j703468
$$ 1346908 2275654 2789696 2593628 1744133 1023900 1174171 1630316 1024786 -678682
30057f78682j013290Q93037J577682K20028j223154q70730O08042J243984M19342
$$ -678682 -1691972 -798935 778747 998775 -224379 -1095109 -487067 756917 1176259
30048A176259o92372q13468K6219O69244K35955o70369n98822O59785J500419
$$ 1176259 483887 -329581 -303362 365882 601837 -68532 -667354 -7569 1492850
30039A492850P71770m24210m85695J13988j99077j230356j285926j06796O97012
$$ 1492850 2264620 1840410 1354715 1468703 1269626 39270 -1246656 -1353452 -656440
30030f56440L30392k11276k40226l31130n97564j53916Q52037P70910q26931j914609
$$ -656440 -326048 -537324 -777550 -1108680 -1706244 -1860160 -1008123 -237213 -1064144 -2978753
30020b978753r29404P78913J060561J07307l08189L14457R23627Q48729L84371
$$ -2978753 -3908157 -3129244 -2068683 -1961376 -2269565 -1955108 -1031481 -182752 201619
30011B01619j86011p81024r97895n50191l726r9336n76187n29547K90398J277808
$$ 201619 15608 -765416 -1763311 -2313502 -2317228 -2416564 -2992751 -3522298 -3231900 -1954092
30001a954092J813032J665238Q58644k44561r66279r05901l27328K50578M80874
$$ -1954092 -141060 1524178 2382822 2138261 1171982 266081 -61247 189331 670205
29992F70205J59767n93083j061844o35635J62682L10760l4830K32245J111226
$$ 670205 829972 236889 -824955 -1460590 -1297908 -987148 -1021978 -789733 321493
29983C21493J246281K19696o06177l72242j34943q04194j294981l32289J197849
$$ 321493 1567774 1787470 1181293 809051 674108 -130086 -1425067 -1757356 -559507
29974e59507J506576O11242M59K06978M25665J68062k72789p56923j287726j318238
$$ -559507 947069 1558311 1558770 1765748 2191413 2359475 2086686 1329763 42037 -1276201
$$ [...]
##END NTUPLES=NMR SPECTRUM
##END=
