##TITLE=1H_NV87
 CDCl3
 8 sc, 
 22.11.2023
##JCAMPDX= 6.0         $$ Bruker NMR JCAMP-DX V2.0
##DATA TYPE= NMR FID
##DATA CLASS= NTUPLES
##ORIGIN= UXNMR, Bruker Analytische Messtechnik GmbH
##OWNER= root
$$ XWIN-NMR		Version 3.5
$$ Wed Nov 22 12:05:33 2023 Russian Standard Time (UT+4h)  she@DPX200
##.OBSERVE FREQUENCY= 200.1313
##.OBSERVE NUCLEUS= ^1H
##.DELAY= (6, 6)
##.ACQUISITION MODE= SIMULTANEOUS
##.ACQUISITION SCHEME= undefined
##.AVERAGES= 8
##.DIGITISER RES= 18
##SPECTROMETER/DATA SYSTEM= spect
##.PULSE SEQUENCE= zg30
##.SOLVENT NAME= CDCl3
##.SHIFT REFERENCE= (INTERNAL, CDCl3, 0, 15.7039)
##AUDIT TRAIL= $$ (NUMBER, WHEN, WHO, WHERE, WHAT)
$$ ##TITLE= Audit trail, XWIN-NMR		Version 3.5
$$ ##JCAMPDX= 5.01
$$ ##ORIGIN= Bruker BioSpin GmbH
$$ ##OWNER= she
$$ F:/spectra/data/she/nmr/H-F/1/audita.txt
$$ ##AUDIT TRAIL=  $$ (NUMBER, WHEN, WHO, WHERE, WHAT)
(   1,<2023-11-22 12:03:17.37 +0400>,<she>,<DPX200>,
      <created by zg, POWCHK disabled, PULCHK disabled
       configuration hash MD5:
       00 E9 B6 7A A2 85 ED C7 34 08 36 98 17 FE 4E 26
       data hash MD5: 16K
       E1 5B 8B 2C AD 61 67 1D 26 48 1B 1B 8B C5 BA 38>)
$$ ##END=
$$ 
$$ hash MD5
$$ 59 DD F8 C7 0E 2F 53 42 5A A3 59 66 69 AA F5 CF
##$RELAX= 
##$RELAX= 
##$RELAX= 
##$RELAX= 
##$RELAX= 
##$RELAX= 
$$ Bruker specific parameters
$$ --------------------------
##$DU= <F:/spectra>
##$EXPNO= 1
##$NAME= <H-F>
##$PROCNO= 1
##$TYPE= <nmr>
##$USER= <she>
##$AMP= (0..31)
100 100 100 100 100 100 100 100 100 100 100 100 100 100 100 100 100 100 
100 100 100 100 100 100 100 100 100 100 100 100 100 100 
##$AQSEQ= 0
##$AQ_mod= 1
##$AUNM= <au_zg>
##$AUTOPOS= <>
##$BF1= 200.13
##$BF2= 200.13
##$BF3= 200.13
##$BF4= 200.13
##$BF5= 200.13
##$BF6= 200.13
##$BF7= 200.13
##$BF8= 200.13
##$BYTORDA= 1
##$CFDGTYP= 0
##$CFRGTYP= 5
##$CHEMSTR= <none>
##$CNST= (0..31)
1 1 145 1 1 1 1 1 1 1 1 1 1 1 1 1 1 1 1 1 1 1 1 1 1 1 1 1 1 1 1 1 
##$CPDPRG= <>
##$CPDPRG1= <>
##$CPDPRG2= <>
##$CPDPRG3= <>
##$CPDPRG4= <mlev>
##$CPDPRG5= <mlev>
##$CPDPRG6= <mlev>
##$CPDPRG7= <mlev>
##$CPDPRG8= <mlev>
##$CPDPRGB= <>
##$CPDPRGT= <>
##$D= (0..31)
0 1.2 0 0 0 0 0 0 0 0.06 0 0.03 0 0 0 0 0.0002 0 0 0 0 0 0 0 0 0 0 0 0 
0 0 0 
##$DATE= 1700640196
##$DBL= (0..7)
120 120 120 120 120 120 120 120 
##$DBP= (0..7)
150 150 150 150 150 150 150 150 
##$DBP07= 0
##$DBPNAM0= <>
##$DBPNAM1= <>
##$DBPNAM2= <>
##$DBPNAM3= <>
##$DBPNAM4= <>
##$DBPNAM5= <>
##$DBPNAM6= <>
##$DBPNAM7= <>
##$DBPOAL= (0..7)
0.5 0.5 0.5 0.5 0.5 0.5 0.5 0.5 
##$DBPOFFS= (0..7)
0 0 0 0 0 0 0 0 
##$DE= 6
##$DECBNUC= <off>
##$DECIM= 32
##$DECNUC= <off>
##$DECSTAT= 4
##$DIGMOD= 1
##$DIGTYP= 9
##$DL= (0..7)
0 120 120 120 120 120 120 120 
##$DP= (0..7)
150 150 150 150 150 150 150 150 
##$DP07= 0
##$DPNAME0= <>
##$DPNAME1= <>
##$DPNAME2= <>
##$DPNAME3= <>
##$DPNAME4= <>
##$DPNAME5= <>
##$DPNAME6= <>
##$DPNAME7= <>
##$DPOAL= (0..7)
0.5 0.5 0.5 0.5 0.5 0.5 0.5 0.5 
##$DPOFFS= (0..7)
0 0 0 0 0 0 0 0 
##$DQDMODE= 0
##$DR= 18
##$DS= 0
##$DSLIST= <SSSSSSSSSSSSSSS>
$$ [...]
##$SUBNAM2= <"">
##$SUBNAM3= <"">
##$SUBNAM4= <"">
##$SUBNAM5= <"">
##$SUBNAM6= <"">
##$SUBNAM7= <"">
##$SUBNAM8= <"">
##$SUBNAM9= <"">
##$SW= 18.0517328524113
##$SWIBOX= (0..15)
0 0 2 0 0 0 0 0 0 0 0 0 0 0 0 0 
##$SW_h= 3612.71676300578
##$TD= 16384
##$TD0= 1
##$TE= 0
##$TE2= 300
##$TE3= 300
##$TEG= 300
##$TL= (0..7)
0 120 120 120 120 120 120 120 
##$TP= (0..7)
150 150 150 150 150 150 150 150 
##$TP07= 0
##$TPNAME0= <>
##$TPNAME1= <>
##$TPNAME2= <>
##$TPNAME3= <>
##$TPNAME4= <>
##$TPNAME5= <>
##$TPNAME6= <>
##$TPNAME7= <>
##$TPOAL= (0..7)
0.5 0.5 0.5 0.5 0.5 0.5 0.5 0.5 
##$TPOFFS= (0..7)
0 0 0 0 0 0 0 0 
##$TUNHIN= 0
##$TUNHOUT= 0
##$TUNXOUT= 0
##$USERA1= <user>
##$USERA2= <user>
##$USERA3= <user>
##$USERA4= <user>
##$USERA5= <user>
##$V9= 5
##$VALIST= <valist>
##$VCLIST= <CCCCCCCCCCCCCCC>
##$VD= 0
##$VDLIST= <DDDDDDDDDDDDDDD>
##$VPLIST= <PPPPPPPPPPPPPPP>
##$VTLIST= <TTTTTTTTTTTTTTT>
##$WBST= 1024
##$WBSW= 4
##$XGAIN= (0..3)
0 0 0 0 
##$XL= 0
##$YL= 0
##$YMAX_a= 17651
##$YMIN_a= -18025
##$ZGOPTNS= <>
##$ZL1= 120
##$ZL2= 120
##$ZL3= 120
##$ZL4= 120
##$ABSF1= 10
##$ABSF2= 0
##$ABSG= 5
##$ABSL= 3
##$ALPHA= 0
##$AQORDER= 0
##$ASSFAC= 0
##$ASSFACI= 0
##$ASSFACX= 0
##$ASSWID= 0
##$AUNMP= <proc_1d>
##$AZFE= 0.1
##$AZFW= 0.1
##$BCFW= 1
##$BC_mod= 2
##$BYTORDP= 1
##$COROFFS= 0
##$CY= 11.3945322036743
##$DATMOD= 1
##$DC= 2
##$DFILT= <>
##$DTYPP= 0
##$F1P= 15.7292609196834
##$F2P= 12.9074282941183
##$FCOR= 0.5
##$FTSIZE= 0
##$FT_mod= 4
##$GAMMA= 1
##$GB= 0.15
##$INTBC= 1
##$INTSCL= 1
##$ISEN= 128
##$LB= 0.24
##$LEV0= 0
##$LPBIN= 0
##$MAXI= 10000
##$MC2= 0
##$MEAN= 0
##$ME_mod= 0
##$MI= 1.114404
##$NCOEF= 0
##$NC_proc= 0
##$NLEV= 6
##$NOISF1= 3.799351
##$NOISF2= 2.8
##$NSP= 1
##$NTH_PI= 0
##$NZP= 0
##$OFFSET= 15.70392
##$PC= 1
##$PHC0= -24021.07
##$PHC1= 5.252691
##$PH_mod= 1
##$PKNL= yes
##$PPARMOD= 0
##$PSCAL= 0
##$PSIGN= 0
##$REVERSE= no
##$SF= 200.130013532006
##$SI= 16384
##$SIGF1= 3
##$SIGF2= 2
##$SINO= 400
##$SIOLD= 16384
##$SREGLST= <1H.CDCl3>
##$SSB= 0
##$STSI= 0
##$STSR= 0
##$SW_p= 3612.71676300578
##$SYMM= 0
##$S_DEV= 0
##$TDeff= 0
##$TDoff= 0
##$TI= <>
##$TILT= no
##$TM1= 0
##$TM2= 0
##$TOPLEV= 0
##$USERP1= <user>
##$USERP2= <user>
##$USERP3= <user>
##$USERP4= <user>
##$USERP5= <user>
##$WDW= 1
##$XDIM= 8192
##$YMAX_p= 0
##$YMIN_p= 0
$$ End of Bruker specific parameters
$$ ---------------------------------
##NTUPLES= NMR FID
##VAR_NAME=  TIME,          FID/REAL,        FID/IMAG
##SYMBOL=    X,             R,               I
##VAR_TYPE=  INDEPENDENT,   DEPENDENT,       DEPENDENT
##VAR_FORM=  AFFN,          ASDF,            ASDF
##VAR_DIM=   8192,          8192,            8192
##UNITS=     SECONDS,       ARBITRARY UNITS, ARBITRARY UNITS
##FACTOR=    0.0002768,     1,               1
##FIRST=     0,             0,               0
##LAST=      2.2672688,     0,               0
##MIN=       0,             -18025,          0
##MAX=       2.2672688,     17651,           0
$$ Real data points
##PAGE= N=1
##DATA TABLE= (X++(R..R)), XYDATA
0 0 0 0 0 0 0 0 0 0 0 0 0 0 0 0 0 0 0 0 0 0 0 0 0 0 0 0 0 0 0 0 0 0 1 -4 7 -8 8 -8 8 -8 8 -8 12 -14 15 -16 16 -20 22
49 22 -23 27 -28 30 -36 37 -43 46 -51 57 -63 71 -79 89 -100 112 -128 143 -148 81 -268 17651 -1013
72 -1013 -14831 7854 6226 -12385 -1571 10468 -4381 -6005 6904 1315 -6758 2933 5983 -2063
86 -2063 -1912 2311 588 -162 183 -406 524 -448 -2716 191 1129 -2610 -448 2392 -2837 -2315 4708
103 4708 626 -4345 3245 3956 -4282 11 5725 -2334 -3164 5153 -171 -6337 2901 4018 -6007
118 -6007 -2059 5283 -2391 -4618 4062 1761 -4274 1407 3655 -2483 -776 3999 132 -2275 1533
133 1533 1466 -1361 -455 434 -434 -479 -904 -760 306 -587 -910 964 84 -1517 1302 1870 -1526 100
151 100 2978 -702 -1805 2533 976 -2730 746 1779 -2845 -1106 2621 -1534 -2883 2051 791
166 791 -3035 646 2623 -1551 -795 2788 -41 -1515 1850 1288 -1565 138 1422 -1001 -1068 646
182 646 -207 -1081 -281 -181 -500 -118 -112 53 261 -185 305 974 42 -129 1236 444 -925 521 1066 -1146
202 -1146 -696 1010 -742 -1571 752 208 -1633 138 1185 -1039 -500 1684 238 -913 1090 1053 -821
219 -821 304 1208 -503 -762 715 -102 -1049 34 182 -844 -600 198 -163 -384 129 355 107 18 480
238 480 557 106 97 579 329 -431 103 426 -548 -618 342 -295 -1005 77 364 -756 -293 756 -160 -493 862
259 862 662 -521 374 1022 -261 -266 729 0 -784 130 298 -795 -464 287 -415 -692 162 251 -413 6
279 6 561 161 -89 450 518 85 53 351 94 -351 -15 174 -368 -505 13 -132 -650 -111 345 -297 -325 509
301 509 292 -269 377 657 -113 13 665 126 -475 222 255 -564 -319 245 -435 -688 128 99 -534 -40 411
322 411 -83 -174 507 365 -121 261 520 33 -107 227 58 -364 -186 74 -329 -480 -50 -46 -436 -249 206
343 206 3 -215 269 419 -92 118 489 88 -111 385 200 -349 -133 278 -305 -462 85 -49 -519 -50
363 -50 204 -251 -230 347 130 -198 234 465 -41 60 331 106 -189 107 139 -251 -305 54 -124 -392 -150 15
385 15 -185 -214 194 171 -111 114 430 37 26 358 227 -192 52 238 -218 -277 95 -129 -429 -46 84 -309
407 -309 -224 190 19 -203 198 302 -58 104 429 93 -38 270 163 -152 -74 69 -180 -302 -63 -57 -224 -196
429 -196 35 -34 -65 109 168 -18 61 308 161 -43 126 216 -90 -91 151 -88 -324 -58 66 -354 -139 152 -158
452 -158 -297 197 147 -167 184 320 27 5 282 72 -71 117 68 -116 -120 -61 -39 -242 -104 -55 -67 -149 -14 98
476 98 10 -72 201 145 -39 93 243 -61 -42 277 24 -228 30 -12 -324 -199 77 -203 -217 92 -6 -172 90
499 90 176 -81 31 360 66 -73 194 124 -67 17 42 -133 -182 -38 -132 -114 -88 -82 17 -44 -31 22 74 28 146 255
525 255 30 -33 175 74 -89 38 105 -162 -186 93 -140 -254 67 8 -232 -4 117 -39 14 183 82 -17
547 -17 248 151 -68 96 176 -130 -86 4 -78 -150 -47 -98 -141 -22 -55 -67 52 17 -1 115 57 -7 142 133 -48 39
573 39 184 -90 -132 76 -106 -228 61 -10 -287 -46 155 -183 -33 170 19 -74 184 114 -124 122 205 -103
595 -103 -29 161 -76 -131 59 -78 -211 -64 -59 -150 -51 -1 -25 65 114 0 -8 177 64 -5 165 -24 -28 88 -64
620 -64 -92 -39 5 -244 -77 73 -161 -92 103 40 -77 164 139 -116 53 224 13 -4 158 -13 -94 69 10 -190
644 -190 -41 0 -121 -112 -40 -87 -79 0 -9 -9 82 96 16 59 43 4 25 21 -40 25 5 -168 -72 63 -124 -155 44 -25 -94 63
674 63 90 -69 46 179 0 -9 140 35 -71 85 117 -124 -98 -34 -103 -142 5 -51 -134 10 21 -17 40 80 -31
699 -31 113 81 7 4 99 -4 11 24 -38 -91 12 -51 -72 23 54 -143 0 72 -58 -9 116 -22 -9 86 148 -18 116
726 116 69 -98 -38 27 -101 -133 7 -90 -126 -16 -4 -69 -32 65 38 37 108 89 78 49 60 64 52 -9 -24 -14 -65 -56 -38 -20
756 -20 -69 -60 10 -74 -45 44 -4 -36 114 94 -17 119 136 2 -28 71 -35 -59 16 -57 -53 -69 43 -64 -47 31 -39 23
784 23 68 19 12 28 50 54 19 48 25 73 13 54 12 -35 -71 -48 -52 17 -14 6 -51 -37 14 41 -13 36 62 -13 -27 72 37 -64
816 -64 4 -26 -97 8 -30 -48 -43 17 -56 -95 13 -5 35 78 89 36 48 65 12 -19 14 34 -22 -25 -2 -74 -49 -52 -35 4 -40
847 -40 -17 -6 -4 9 -22 17 8 19 60 30 13 45 68 -14 -34 -26 -65 -55 -65 -29 -109 0 30 -51 33 42 9 48 42 47 18 38 54
880 54 -28 -16 7 -31 -13 4 -58 -104 -75 37 17 2 -26 16 7 -36 0 55 -15 -34 91 78 -29 53 38 -13 -75 61 -17
909 -17 -66 -43 -1 -28 22 34 15 6 60 6 -6 62 16 19 22 39 11 -10 -30 -7 -28 -32 -20 -58 -64 9 11 -10 -8 15 59 32 -3 46
943 46 78 -26 48 12 -32 -39 -30 15 -1 10 15 30 -51 9 26 3 31 20 -20 23 33 31 1 35 10 5 -4 -15 -34 -24 -59 -25 -22 -24
977 -24 -40 7 -13 10 4 25 5 -10 68 -5 81 52 45 22 3 6 51 -3 0 14 1 -9 11 -19 1 47 11 -14 31 52 22 19 43
1010 43 -30 66 59 -15 -43 -2 -100 -90 3 -43 -37 15 -2 -10 -18 10 -14 -65 17 5 58 4 -33 -30 19 -41 42 52 6 -13 16 -6 -69
1043 -69 4 -26 -5 -11 30 2 68 35 38 -3 -15 22 28 -31 23 -37 -7 -6 -38 -39 34 -11 -46 -64 -8 0 -31 14 -8 -3 -24 -3 32 39
1077 39 -24 20 32 21 16 -15 -70 -6 -18 -15 -24 -58 13 12 -5 3 15 -11 71 -8 -9 -24 -6 4 -16 11 -5 -29 -35 -12 -17 -76 -31 -41
1111 -41 -17 57 21 -41 71 52 48 30 59 19 -49 29 5 51 -4 -48 -44 -23 -31 -54 9 1 17 -7 50 -39 -36 -34 -37 -32 13 17 58 -10
1145 -10 -12 10 26 51 -36 -36 -16 -26 -6 -30 -42 -56 28 48 -22 -21 64 47 11 77 20 -52 -38 6 -25 -2 -16 -28 -7 -26 -46 32
1177 32 4 12 -3 -15 15 6 -11 35 -2 10 -3 14 10 -6 4 -43 21 -8 8 24 -7 8 -10 17 -15 -17 15 9 -17 64 -14 21 -13
1210 -13 18 -22 7 -33 29 23 11 -78 -36 24 -30 -38 -22 52 17 14 -43 -4 17 -42 -50 -1 20 34 2 60 24 -66 48 -10 -20 -13
1242 -13 57 7 -20 -12 32 -1 39 16 -46 58 39 -62 -34 44 17 -5 -18 9 1 14 -34 -75 -19 -14 -41 10 -12 27 -4 -5 19
1273 19 23 50 -42 20 -19 47 -20 43 1 -35 -17 33 -15 27 33 25 23 22 -13 19 41 57 60 -71 -12 -18 8 6 -14 -14 34 -18 12 30
1307 30 -6 -32 0 29 -8 30 -21 -36 -10 20 14 -3 33 48 38 30 -2 34 27 -15 -25 11 -3 -53 5 39 31 12 -37 3 15 -8
1339 -8 -15 -47 -23 37 43 -9 -34 44 -44 -40 10 -22 6 -33 29 -4 18 -41 -14 -23 26 -25 14 44 -26 -4 15 42 16 -15 42 22 -2
1372 -2 5 -24 -17 0 15 8 -22 -3 -48 46 7 30 46 -9 -1 -8 -25 -9 -18 -12 -8 4 -23 12 -33 -38 -7 8 49 -52 3 24 -2 -13 26
1407 26 23 1 20 32 24 12 43 62 -39 13 11 -8 -29 -5 4 2 -18 -3 -4 -51 3 -15 41 -22 -6 6 -24 -25 14 39 6 18 -38
1440 -38 13 10 -18 -63 4 21 4 -46 -40 -20 55 7 -10 24 62 -32 21 -14 -29 -7 31 7 -4 -14 -13 3 -32 16 29 4 -2 -13
1472 -13 20 -14 -40 -54 -27 -28 -13 3 18 9 -25 -12 43 16 -27 18 25 14 -11 -3 80 15 27 0 18 -6 4 -46 -42 0 -9 45 49 10
1506 10 1 -14 8 -44 -34 -39 11 -8 -6 44 -30 -57 -20 -3 -24 15 21 25 -35 22 2 16 -9 -22 10 20 40 31 39 -45 0 18 -9 -24
1540 -24 27 -14 3 -38 -45 -17 50 51 -19 -40 10 15 -17 -11 54 14 30 -73 3 3 -13 36 18 30 16 -21 6 2 -1 -3 10 17 -1 21
1574 21 37 -6 -1 61 26 35 26 9 31 6 -27 41 22 4 -11 6 -28 -12 -19 36 -20 13 17 19 5 12 23 -19 -22 0 31 -37 -40 -18 4
1609 4 16 3 -12 60 -53 -38 6 45 -44 -30 -1 17 22 -33 14 -46 49 25 29 -21 -6 53 9 -22 1 1 10 37 16 1 27 -48
1641 -48 -30 -21 44 12 7 -19 10 -53 13 10 3 7 53 37 29 -26 -11 -30 -18 15 -46 40 -11 -37 -1 -31 -6 -32 -13 19 -21 23 -65
1674 -65 -2 31 -24 -13 -13 -12 38 -7 -61 -57 2 -54 -4 -7 -10 68 18 27 -32 1 19 -20 -11 -16 48 7 2 33 13 -46 29 -8 5 -32 -32
1709 -32 11 -18 -15 -38 46 32 -26 -50 6 -14 31 -12 -9 -14 64 -48 -32 3 -52 -14 -1 -7 5 18 -23 -6 20 40 0 -16 23 -17
1741 -17 9 -5 54 5 -9 65 -87 32 -38 13 -13 30 33 -40 18 -28 -28 -15 -7 69 31 -5 29 -57 -4 -8 10 11 -2 -39 -39 25
1773 25 -24 -13 -17 -14 8 5 -19 5 -14 -23 17 -37 -30 31 10 -35 36 28 31 30 19 37 -33 -19 -8 -43 -44 9 -6 -30 36 1 -72 -21 14
1808 14 -5 35 -33 -23 -35 10 -43 33 -27 -49 41 -14 35 -8 -52 12 52 -2 36 -8 29 23 18 -48 5 -8 58 -3 -26 14 -15
1839 -15 53 2 -34 10 -58 -17 -10 -42 29 -40 -66 -10 -26 14 6 -37 13 11 -34 27 5 -9 -13 20 -14 -20 -19 -20 -7 12 10 44 38 1 39
1874 39 75 -15 -2 59 0 45 43 -10 8 48 51 44 -13 -4 4 10 13 -1 16 -2 21 18 -53 13 0 -15 -4 -9 33 17 -6 31 -23 -57 24
1909 24 6 27 34 40 -18 -10 31 12 36 42 32 -15 6 16 5 16 9 27 50 61 -9 23 -23 10 -20 -37 8 -22 65 -9 17 -17 -10
1942 -10 -14 37 -26 -49 24 -10 39 11 39 2 -2 22 9 22 49 8 -8 -73 28 83 -4 26 -40 -43 75 -24 -17 -24 -35 16 9 -40
1974 -40 2 -59 -41 13 15 -18 -26 0 -6 63 16 7 21 51 -16 -7 22 25 11 -47 29 -33 4 0 -25 -7 42 30 32 -21 -13 -1 21 5 -19
2009 -19 -28 14 -4 11 -18 -7 -18 13 -35 -51 -18 9 -71 -17 14 27 42 11 -5 -48 19 37 51 -18 29 48 -30 -15 63 -87
2039 -87 21 19 -25 8 -22 -33 -69 -20 -18 -28 -63 -50 -13 -26 -31 -6 6 14 -11 -57 3 1 32 -1 -43 26 15 -11 12 10 0 35 -19
2072 -19 -25 66 24 -11 -13 -45 64 -3 -36 2 -19 28 16 -4 1 -10 21 4 -16 -27 -60 -5 -50 -16 6 -13 -39 -37 -50 -30 -10 -15
2104 -15 -21 -14 -17 10 -40 14 7 38 -10 -13 -7 -9 14 -8 -25 61 14 18 13 -7 -15 47 2 23 2 -27 16 -53 19 9 50 -84 15 17 -8
2139 -8 -53 -13 11 6 45 -6 75 46 44 -3 21 21 15 -15 -12 45 4 64 21 43 36 -13 -11 16 -29 40 -13 27 11 23 5 -1 2 7 41 13
2175 13 -25 19 -7 16 -9 5 -62 -20 1 2 -4 -11 -4 -65 -18 -6 -67 -39 44 83 12 -26 26 9 7 -14 -19 -48 33 -20 16 18 43 22
2209 22 -31 22 32 44 2 -10 25 -7 -10 0 -24 -26 13 -7 -31 -9 -5 -52 -6 -23 14 14 22 -83 17 4 32 -52 11 34 6 20
2241 20 32 -31 -2 90 37 13 9 8 -54 41 8 -7 -45 -22 -15 18 -21 -6 -5 -32 -1 -23 -65 46 31 4 -61 -22 27 3 -15 33
2273 33 6 49 42 -38 46 23 12 3 -25 13 13 -65 30 -14 -31 3 23 12 -37 31 -4 35 41 9 -4 -45 22 -5 -5 -44 26 37 37
2306 37 24 -13 -36 -41 10 -22 -88 -12 -4 -19 6 -42 48 -19 -13 5 33 15 -10 -5 -6 -6 18 -34 44 -8 12 30 15 8 -17 -7 -33 -19
2340 -19 -65 -31 -18 10 -29 -35 -13 -17 -34 73 12 -31 -56 -82 9 -9 47 20 20 -12 -31 7 13 73 4 17 -5 -13 -9 23 -28 -1 14
2373 14 4 34 -75 49 42 -13 -34 6 37 26 -36 -51 -29 -17 29 -26 -17 -4 -20 -15 -19 31 -4 28 -22 19 2 -19 -31 -7 -64
2404 -64 -22 9 -33 44 42 -11 -57 12 1 9 24 50 -2 -2 -65 -12 84 -1 -2 23 -22 49 21 -4 9 12 30 28 -57 -49 -79 -11 28 4
2438 4 43 -45 39 41 -21 7 -22 -41 34 -21 54 -3 7 -9 8 -12 16 10 33 -29 68 -7 -15 -36 -31 19 -48 -29 -22 26 -30 -43 6
2471 6 43 -58 -26 -15 -55 68 49 42 -12 -4 22 18 16 12 -6 18 50 2 -5 6 11 4 13 44 42 31 -10 5 8 -1 -7 6 -33 57 63 48 -11
2508 -11 -12 10 -12 -15 -19 35 10 -47 -5 -56 29 -16 -26 -29 -4 15 -15 42 -51 28 5 38 -21 56 22 -12 41 -37 -25 -4 12 29
2540 29 30 -21 -32 -4 34 8 32 26 -56 -31 4 -17 -4 -46 30 -32 -4 -7 30 21 53 4 45 -22 -32 2 8 -13 -3 -17 -23 49 -4
2573 -4 -55 -34 54 -5 23 82 74 -16 -8 59 44 -19 29 -50 34 27 21 -5 6 19 -38 -7 -17 16 36 -13 -9 -51 -26 19 -9 -17 -20 -11 19
2608 19 -12 -7 32 4 46 6 -4 28 -18 -72 8 2 26 15 3 -10 49 -11 -74 -42 -35 -37 2 -63 9 54 11 -14 -21 12 -16 6 28
2641 28 20 17 -6 -1 -46 -15 -3 -37 36 -24 -20 -16 32 25 -71 -29 53 23 19 -27 -76 8 4 9 -5 13 26 51 -68 5 29 -12 47 -31
2675 -31 24 -5 -2 -8 11 -25 13 7 27 -4 39 14 -17 2 -4 6 -2 28 21 22 -44 25 1 -4 -9 -9 14 16 -11 -15 22 -31 41 35 59 10 55
2712 55 29 33 -29 24 -15 42 19 -2 -49 -48 7 -40 7 -38 -3 57 -55 0 27 -19 18 -21 54 -4 2 56 -10 69 -8 -22 -21 -25
2744 -25 9 37 0 -24 14 0 21 10 20 -15 9 40 16 -15 29 -13 42 55 -6 -33 -20 18 45 32 -16 -34 -22 -7 -38 28
2774 28 -49 7 27 -26 16 -42 -38 18 -30 28 -12 -19 -11 30 -8 18 -49 15 12 36 -29 -35 -20 -49 27 -44 5 -7 14 48 56 -1 -23
2807 -23 18 28 28 26 24 12 2 -13 38 -14 12 -40 -15 36 -20 -21 60 -13 12 -62 20 26 -42 31 -11 -45 -5 17 1 55 -2 28 -41
2840 -41 17 9 -6 -5 7 -18 47 19 8 20 19 4 -19 -23 -16 -48 -17 -36 30 63 12 35 -13 0 -18 21 -29 1 -14 13 1 -24 -6
2873 -6 44 67 10 47 -2 61 -1 28 77 -2 24 -24 -26 -10 -13 5 -50 -75 -7 -12 -32 -6 21 -23 -26 15 -16 7 53 -2 -21 -36 9
2906 9 26 -10 67 20 51 25 36 0 95 44 -15 -27 8 13 34 49 19 -41 14 -3 16 24 -40 25 -5 -25 -19 23 28 -12 13 18 -37
2939 -37 -6 -16 36 -12 -44 -45 6 -9 -33 18 3 -10 -36 18 -14 1 6 49 -4 -11 -44 40 -6 44 -39 29 25 2 64 31 11 2 -1
2972 -1 2 22 10 -12 -7 30 20 -13 31 -65 -7 -19 -31 4 -10 25 -22 9 -12 36 -78 -26 -6 -36 11 -47 36 38 9 24 -49 9
3004 9 -10 12 -10 8 -21 54 54 -8 34 6 -39 -60 14 -30 8 28 13 46 -7 -41 22 6 26 -11 22 48 -21 -25 6 -5 51 22
3036 22 -3 -55 52 10 8 -47 -5 8 3 -6 15 -16 6 21 -52 -29 26 3 44 -9 22 5 -32 4 -29 -19 28 48 -48 -8 -53
3067 -53 -1 50 31 16 73 -17 -31 2 -2 35 26 -28 -19 -24 17 -15 -3 32 35 9 2 16 17 -37 13 -24 16 25 37 -40 -27 0 -14 -28
3101 -28 -2 -34 -44 -18 20 -19 48 -32 15 40 10 42 2 17 -14 11 -22 9 -13 -18 -7 35 29 14 19 50 -15 89 -29 -44 13
3132 13 -4 -17 24 13 6 -63 -22 -9 -28 28 20 20 -46 13 5 -11 50 -29 64 -24 44 -29 -23 1 59 10 -10 -23 25 13 -70 -30 13
3165 13 9 48 -16 -5 18 42 14 -16 -18 14 27 36 21 -30 -47 24 14 -32 44 -7 -23 29 42 22 6 24 -24 -3 57 14 42 43
3197 43 31 8 28 -19 -42 6 -44 -15 -8 -5 -83 53 3 -50 -10 47 35 -13 35 11 40 16 -2 7 -37 -5 -51 48 7 -9 14
3228 14 -51 43 56 12 35 -26 -15 37 -23 18 -21 -2 -48 4 14 44 17 -43 -8 18 15 -35 -44 16 -21 31 11 -6 6 16 -3
3259 -3 -9 3 -21 -2 39 1 12 -2 -11 7 2 5 -30 59 -25 40 57 -8 -3 -25 24 -7 41 26 32 -19 -4 -19 20 40 45 60 12 11 -16
3294 -16 -3 3 -25 16 20 -63 0 88 -7 -64 -68 19 -47 21 59 22 33 -4 6 35 -23 -39 12 -14 -15 2 13 4 35 26 5 -41 -32 -28
3328 -28 -4 -4 62 56 21 4 -31 12 66 22 -18 -4 -40 -14 -27 26 -33 -16 31 -21 20 -34 -27 -29 24 48 -40 10 36 -19 -11 18 -6
3361 -6 36 20 -21 -28 14 32 42 40 -22 74 10 1 32 10 2 -48 -34 5 30 11 -16 -16 -34 -30 8 -45 19 53 -3 -48 14 -32 -5 -22
3395 -22 0 -71 -29 -30 18 31 66 25 36 44 9 -32 26 22 -27 14 1 59 -6 4 -13 -6 -15 -62 19 13 17 -1 -20 -43 77 53 -40
3428 -40 27 -4 -4 0 49 -28 -28 16 13 24 -14 14 100 -31 -8 11 39 -17 -33 17 -9 13 18 18 -40 -18 -17 -8 32 32 28 23 -44 9 -29
3463 -29 -49 -44 26 -30 -32 -30 28 -4 -61 13 -5 50 44 13 53 -58 44 81 62 -13 -78 1 28 -22 50 -20 46 48 -8 -15 0 0 54
3496 54 56 46 19 67 16 30 31 23 -46 -35 30 22 38 18 12 35 -34 -47 52 8 7 -27 -30 15 62 42 -6 13 54 1 32 -42 -17 50
3530 50 56 0 38 20 22 -35 4 19 8 23 -8 17 -56 -10 32 36 25 -30 49 -64 -49 27 22 35 25 -1 -22 -71 -38 -33 34 38 -42
3563 -42 -6 -22 -25 20 -25 -14 -20 -43 -7 -2 36 -34 27 19 78 38 38 -3 3 17 -20 30 15 -34 -45 -20 -18 34 -23 -36 -3 -32 -18 1
3597 1 10 1 -25 15 -14 22 -23 34 18 46 -18 -52 68 -2 -56 -19 16 9 41 10 -16 9 -10 10 -49 -7 7 -33 -18 3 -12 -58
3629 -58 -24 -45 36 -4 16 -71 40 22 -64 -15 -5 -16 0 -50 32 12 6 -9 -27 -36 27 8 -55 23 -7 83 -32 -4 2 -8 6
3660 6 22 -3 18 -16 6 15 6 -10 -6 16 32 42 16 23 13 -12 37 14 18 9 -3 17 -31 8 -26 -1 -2 14 -33 -29 3 5 -9 52 -7
3695 -7 39 -22 -56 12 -16 26 26 8 -27 53 -46 19 27 30 36 41 29 5 10 -48 -16 15 -44 12 -48 23 13 -3 -56 -1 20 -18 -14 26
3729 26 -3 -1 18 -42 23 -14 10 2 -34 21 1 16 2 -8 -5 4 0 36 -16 -37 -27 8 -47 6 -23 17 6 -35 0 61 8 -61 -32
3762 -32 -24 -5 -43 12 13 -41 -23 32 0 -61 -26 17 24 11 34 -30 -8 24 21 -12 -54 1 -11 -12 -44 3 -12 -6 -25 29 -17 35 23
3795 23 -33 56 33 23 40 -6 -7 -78 -4 -17 -6 -17 -66 -1 14 -9 22 -38 -4 64 28 -29 12 0 -13 -39 9 7 -33 4 24
3826 24 -2 -21 12 -59 31 -10 -14 20 38 3 -42 14 -42 -37 -22 -2 21 -41 7 -15 28 -18 -36 56 -39 -25 -36 -7 -12 45 26 13
3858 13 -57 34 -26 -64 18 25 -48 3 -51 -17 -17 -28 25 -40 57 -28 17 -34 3 -7 18 15 -28 10 24 28 -14 -23 -22 11 -10 26 3
3891 3 34 71 -14 10 -60 -18 -5 25 14 -23 73 10 -30 32 -14 -5 6 19 -15 19 5 -16 -26 -9 -3 24 35 7 8 -36 -9 9
3923 9 28 -38 -20 -9 -3 -16 8 2 -32 -5 13 -20 -16 -11 -34 -30 31 20 18 26 26 32 -25 -28 26 41 60 22 29 49 -15 16 -4 35 41 27 -3
3960 -3 -36 0 47 34 11 19 14 -17 -26 -4 32 70 -18 -31 -35 -9 -30 -42 13 49 21 -1 27 48 3 -53 60 10 42 35 13 -13 30
3993 30 -69 5 -53 -30 -15 20 3 -46 28 29 -29 -36 14 -2 -14 2 -26 -63 -8 28 2 -33 46 6 -34 75 21 -8 42 -30 -18
4024 -18 22 75 -20 -29 17 -30 6 -5 -13 17 -52 -10 26 27 11 38 24 -33 -25 -14 19 -43 20 1 21 -5 16 -25 -1 50 49 -54
4056 -54 6 58 -8 31 -23 -9 7 -8 25 11 -9 2 2 19 -20 -20 -9 64 14 -32 24 -41 40 -16 -48 -8 -26 37 8 67 20
4087 20 50 5 13 9 -44 40 4 12 -14 16 19 31 -8 11 -4 3 -33 46 -13 -3 -6 -13 36 12 -33 -10 -17 32 2 -15 3 -21 29 2
4121 2 42 -28 -33 29 19 57 -28 23 35 -11 -21 3 4 -15 -66 17 -6 -24 0 8 20 2 -29 -44 34 -38 -12 -19 13 50 -28 25 13
4154 13 -28 -13 -12 -39 22 39 -33 -8 19 61 9 62 39 24 -15 -16 -40 9 -4 4 2 -27 33 22 -22 -21 16 31 -36 -6 -12 -19 -28 34
4188 34 6 -34 -2 19 -15 -21 -2 27 -38 40 -36 12 86 4 1 5 -38 10 42 48 -19 -5 32 -34 9 -7 16 -51 44 4 70 -69
4220 -69 1 22 -6 -21 2 -7 46 -14 4 23 59 45 19 25 54 -5 50 -10 8 8 35 30 49 38 -21 -22 -3 -41 1 34 -45 32 -5
4253 -5 2 40 15 44 18 -24 3 -18 -71 -42 -52 -21 -29 32 -59 -21 -11 -20 -26 -26 22 37 -45 36 47 59 -2 -72 18 -10 24 6 10 -33
4287 -33 17 5 27 3 -8 20 -25 -27 20 16 -16 30 -46 19 9 23 6 26 41 -7 18 4 -15 -28 -15 -3 -21 -14 -37 -6 -21 -25
4319 -25 41 -50 -5 -19 61 -41 4 38 20 27 39 -24 -6 31 29 -6 15 2 -51 -11 -4 38 22 0 -48 -87 -35 -44 -47 40 -38 20
4351 20 -26 50 -33 -14 12 36 32 1 -11 11 55 -27 5 21 21 27 21 24 17 45 -35 48 -13 22 16 -35 69 7 10 -28 -67 11 -9 -49
4385 -49 48 -17 -19 -69 -15 -49 9 2 17 13 13 -29 16 -27 -1 -10 -24 27 21 -20 -14 30 4 -31 12 9 1 -44 -34 12 -19 -3 42 5 32
4420 32 -16 -16 23 52 -37 -13 -23 -22 20 37 -26 -11 12 3 -13 -51 0 28 20 -11 35 9 3 27 28 3 17 31 18 28 -38 -26 0
4453 0 -40 -21 3 -4 52 -23 -21 -4 27 -14 2 41 8 -29 -37 -54 -13 -17 -2 -22 -37 -30 23 -7 51 -50 55 -35 -37 20 -8 28 33
4486 33 11 8 17 -35 23 1 15 8 -12 1 39 50 60 46 43 68 40 49 -15 27 -19 -41 -40 20 -24 30 21 8 -6 -44 4 0 -45 7
4520 7 20 -22 -8 5 -16 62 67 6 -5 10 12 4 -29 -29 42 -4 -27 18 -27 20 10 5 -21 9 29 -73 -60 -91 -54 -2 18 -53 -39
4553 -39 17 40 25 16 -33 -36 -28 11 -15 32 66 13 -19 -13 -53 -8 7 -5 -35 53 11 -5 7 61 31 48 45 9 7 41 14 26 6
4586 6 -48 23 20 2 -8 0 10 41 31 44 -42 -2 -43 18 39 -6 -10 8 54 27 -2 1 61 33 -17 104 -6 36 46 -33 33 8
4618 8 14 28 7 -11 50 -36 -29 -17 39 -34 -49 31 -5 25 -24 -51 5 -28 67 -4 -5 -14 12 8 46 8 15 20 -53 49 19 1 22 10
4652 10 -19 32 -35 7 -59 15 20 -35 21 15 6 34 40 12 -15 49 7 -23 -2 8 3 -11 31 15 -76 -78 27 -23 47 30 -26 -6 31
4685 31 -2 46 22 21 18 61 -31 16 -31 -11 22 46 -9 -70 -10 24 -19 14 8 -21 47 -7 -1 -16 -23 46 -4 12 12 -12 -51 -18 49
4718 49 -17 -27 14 -14 -5 -31 50 12 -25 7 -39 -66 47 60 -11 -13 42 13 -2 26 -38 -10 18 13 37 9 17 -2 -4 16 33 10
4750 10 38 33 14 5 26 -5 -12 26 1 2 45 -25 -16 9 29 -21 6 1 -12 -23 -6 0 -61 -30 -48 12 37 -38 6 46 10 -3 -12 24
4784 24 -37 -6 -25 43 6 14 63 38 66 51 20 10 -38 6 25 15 -34 42 -57 19 -26 -6 -39 -15 -38 19 -31 -52 -7 33 -13
4815 -13 -23 16 -23 -58 4 0 16 -21 -43 56 32 -1 -8 2 -14 2 -4 1 8 -8 57 11 -12 -5 -16 -25 -88 17 -26 6 49 -27 46
4848 46 15 31 -5 6 -38 -35 -1 -21 -15 -28 38 8 -23 -12 5 -47 51 28 40 75 -73 2 -47 -3 14 -13 12 -24 -7 31 -10
4879 -10 -46 27 -18 -1 -39 -23 -4 22 14 -65 10 -9 23 -5 39 -51 -22 2 -10 14 17 -44 45 -8 2 25 32 -15 46 29 42 20
4911 20 -36 32 66 30 6 -22 59 -46 -23 -35 -16 -38 -23 18 -32 -24 -34 73 -2 16 -8 13 -3 58 -47 -32 -5 15 -54
4940 -54 -12 19 5 -13 -1 2 0 4 65 21 0 -43 -35 101 35 -12 -5 -30 -26 25 -8 -8 -13 56 -56 -41 41 26 5 -32 -44 19 -18
4973 -18 2 68 -37 40 31 56 50 36 68 -26 20 2 76 28 4 1 16 57 10 52 38 28 57 34 -1 0 -18 2 21 47 9 -13
5005 -13 -18 -35 -14 -37 51 20 7 53 2 -1 23 55 35 -7 -16 2 -1 -41 27 -17 -42 0 -19 33 39 22 21 -33 35 -12 25 31 -1 69
5039 69 11 27 18 1 -49 -28 2 42 28 53 9 -2 -7 9 34 35 6 14 6 2 7 22 -13 11 -34 4 26 47 46 32 6 1 15 36 -22
5074 -22 29 12 42 -11 -1 -11 34 -11 52 7 -43 -54 7 -17 4 -16 36 -6 -26 -6 -26 -10 7 13 -2 -24 10 1 -2 25 -13 -5
5106 -5 3 31 -46 23 44 36 1 43 -31 43 7 23 -11 -73 10 1 -3 8 2 -2 -28 -6 3 -39 -2 -23 17 -3 12 -29 -1 13 -12 -6 -37
5141 -37 56 30 11 -8 -8 6 11 14 9 36 -31 6 0 -12 -49 -6 7 9 -44 42 20 15 21 23 28 -28 -6 8 5 -33 -5 12 18 9 -7 -20 36
5178 36 -14 15 12 -15 38 -8 58 42 28 -16 17 -23 26 -4 22 18 2 -56 29 57 -24 -1 -18 -3 0 1 -3 -26 -13 71 0 41 9
5211 9 15 1 -36 31 20 -43 -31 17 4 7 19 2 -33 -42 -50 -34 9 -29 -47 6 28 0 7 13 -3 22 19 34 78 44 -5 15 4 -8
5245 -8 20 -50 8 2 41 -41 -35 33 14 2 -29 -25 -15 -8 11 -41 37 -54 -48 5 61 50 -10 5 -33 73 35 25 27 10 -3 -2 2 -38
5279 -38 7 10 -1 20 -20 -7 64 -9 16 -24 -3 -6 5 38 56 48 13 33 36 52 10 -14 -32 -2 27 -48 -45 10 -23 12 -8 -17 -25 44
5313 44 10 -19 25 78 34 32 -6 -41 47 41 -43 -6 26 26 -15 -27 -32 13 -4 29 39 17 -37 -45 46 12 4 -42 -19 -3 42 -24 -53
5346 -53 -15 -13 1 7 59 -8 16 25 3 74 -12 -19 14 36 -30 -17 38 -3 8 36 -46 57 -17 -4 59 -29 17 9 22 -86 -14 -26
5378 -26 -54 2 -26 -17 0 7 19 31 21 1 14 5 -9 24 -50 -24 -57 -10 4 13 -4 23 -27 -21 -23 -7 -4 7 36 2 38 38 40 -1 37
5413 37 21 17 22 -31 35 68 -36 -13 33 2 68 -23 1 -41 -10 -6 15 -38 -3 18 12 -17 -30 32 51 35 8 18 18 4 -32 -14
5445 -14 -18 -18 30 33 -17 -10 7 76 -72 -18 -18 -20 20 21 13 2 22 14 -8 -46 12 -25 9 -47 -14 -52 -37 34 -26 -3 76 20 11 -24 7
5480 7 87 -8 22 54 -13 -10 -1 22 5 42 -15 30 -33 -16 -31 43 7 21 -14 -17 -34 -3 9 -9 44 11 47 -45 27 -50 1 -37
5512 -37 3 -64 8 -14 -49 -16 -15 3 -26 21 -34 36 8 -31 8 2 -32 -15 56 29 48 -28 -11 10 -12 60 -6 -23 25 24 -9 -20
5544 -20 30 -34 -28 -7 17 -4 37 -13 -41 32 -10 15 16 -50 -4 2 -50 32 26 1 18 0 17 -8 32 -36 28 17 65 10 32 6
5576 6 10 6 -18 15 -16 62 -8 -26 62 -37 -24 14 -27 -23 -7 17 27 0 -21 39 31 -9 -47 -48 55 34 -51 50 -44 28 11 14 -7
5609 -7 0 27 57 80 9 -23 -1 36 0 23 31 20 22 25 62 3 27 15 1 75 1 9 34 1 -39 -28 9 16 -24 19 19 -39 -59 12
5643 12 9 -24 -14 -42 -11 -32 -15 34 -15 8 -27 39 -59 11 18 -15 8 -12 26 -75 11 31 12 86 66 -44 -22 -21 29 -6 12
5674 12 -8 -18 -33 -45 12 11 -5 8 -50 -16 3 -19 7 -16 13 -16 33 35 43 -14 52 -30 17 13 15 18 -25 2 28 -21 -37 -7 -4 25
5708 25 -22 -9 -45 22 26 -25 34 -3 -51 14 39 3 6 -4 -2 29 -28 25 7 -13 28 8 -40 -18 31 26 47 -20 63 23 -28 -41
5740 -41 -23 -1 11 47 -2 42 -17 32 22 24 12 79 27 4 18 1 -28 62 31 29 30 25 -26 -44 14 40 -23 -1 -13 45 29 17
5772 17 -5 17 3 2 8 34 -1 -6 35 53 24 7 -14 1 16 -3 -14 4 -12 9 -4 -11 9 -42 -41 -5 38 15 -13 29 7 -32 -31
5805 -31 49 22 -25 2 -71 -24 10 14 79 2 15 -10 15 7 1 -15 -9 14 -10 45 30 31 -43 10 -33 -44 24 12 21 26 21 28 -2 -72 19
5840 19 -51 -16 -20 27 -29 2 37 28 -19 4 -28 -41 15 88 -32 35 14 37 10 -13 -22 -27 76 11 8 -29 0 62 25 24 -35 3
5872 3 -13 32 -12 12 25 -13 -11 15 41 -29 11 76 9 -39 -2 -18 25 -19 29 -28 6 -3 23 2 -36 12 -39 56 21 39 -26 18
5904 18 -20 -61 10 -3 28 -47 -7 48 -63 25 46 13 44 -16 -24 72 37 -6 22 5 13 -14 36 -33 -3 31 -18 32 15 -2 17
5935 17 -1 -28 28 18 -14 21 46 -18 8 1 53 24 -7 -8 -4 8 -5 -32 -3 25 -17 -22 -22 -47 42 19 35 -12 -18 6 -56 60 13
5968 13 -10 20 -28 13 0 11 -49 -56 -27 61 3 -23 9 -7 56 11 -45 58 -14 -4 10 -25 9 -13 27 -17 -3 -12 -16 7 31
5999 31 -6 -11 -10 24 22 -31 -37 9 -27 -26 9 21 -28 12 24 18 -27 29 -32 -18 7 -11 -11 72 15 75 12 8 -53 -13 -2 71 -26 25
6033 25 11 16 19 -18 34 -20 -42 11 10 15 48 -19 -34 41 -29 7 30 -23 -43 -36 3 11 -28 2 -1 -40 -17 20 -13 16 -47 25 19 22 33
6068 33 39 -2 -33 18 40 2 28 25 19 -45 27 -20 46 -4 11 13 45 -22 -28 13 2 -47 -15 -26 -22 -12 -4 64 12 8 26 -18 3 27
6102 27 -69 -1 -21 -14 32 -54 -6 14 35 10 41 18 -11 6 -21 -6 90 16 -2 -43 19 32 -19 -1 -5 2 -14 -13 53 15 19 17 -39
6135 -39 -24 -53 -11 -14 27 -6 41 6 16 -65 50 -36 1 8 40 55 22 -14 -18 30 33 -14 -12 31 -45 27 -1 0 -13 27 19 16 16 1
6169 1 -30 24 42 17 -26 -51 -3 -11 -22 -18 -11 -10 -12 26 13 14 -16 -10 3 24 -18 10 -6 -2 6 5 15 36 53 -21 -10 -36 -30 8 79 25
6205 25 -30 72 46 49 -41 -42 6 -6 11 40 -23 -20 -9 -32 -25 -35 -19 51 15 39 19 -69 -20 39 23 -38 -78 -18 4 10 40 41 4
6238 4 -37 -16 -34 1 -1 49 21 29 20 65 -20 -36 12 12 14 36 0 19 -15 1 -10 -33 20 -40 -45 -39 -49 16 -1 2 -23 30 -21 -22 3
6273 3 -42 8 -48 -30 -29 15 -19 54 19 8 -26 -9 47 -22 -7 60 8 56 4 -10 5 25 4 12 -24 -6 73 24 25 2 -9 56
6305 56 -17 -14 22 -36 -15 -32 23 24 -39 -12 -18 24 43 -37 -7 -6 -35 65 -36 -12 -39 -8 -6 -49 28 -84 -49 -34 -47 -29 28
6336 28 -32 -49 -27 -25 -8 12 -22 14 -5 23 23 1 7 -22 -17 -29 0 54 -44 -24 44 25 6 24 -13 -37 61 35 -3 -4 27 20 32
6369 32 -29 8 27 32 17 -26 -25 22 -56 -21 -49 11 13 15 -4 -24 -42 36 -66 -54 -9 1 -11 13 -26 14 60 -7 2 -14 -23 37 -10
6402 -10 32 19 -9 24 44 26 16 73 76 -39 66 38 -3 -24 -9 -13 3 -1 -5 -20 -8 38 4 8 20 -40 -18 -4 -40 24 5 1
6434 1 9 3 3 18 -35 28 12 -43 32 4 -37 8 21 20 11 -13 -6 76 46 56 28 3 74 27 28 -19 -49 -53 -16 -10 -9 -55 15 -22 -2 12
6470 12 22 9 53 -73 -23 3 10 -3 9 5 0 42 55 -55 33 16 -34 79 -55 -35 26 23 18 38 4 1 -16 9 20 1 12
6501 12 0 -18 -6 -6 2 13 23 -3 27 -5 -1 -15 53 -22 14 11 -9 -35 70 -8 30 22 21 -24 13 37 15 68 -10 38 1 -8 22
6534 22 28 -31 7 5 -41 38 24 8 -28 -18 72 11 -7 -2 36 21 4 80 3 44 -22 -93 -20 -37 13 -43 30 -22 -66 -38 41 22
6566 22 -63 14 67 -7 -21 10 -7 -35 -11 10 -14 3 6 43 4 12 16 29 45 -1 -35 30 34 -15 24 24 3 -44 -45 21 6 41 -24
6599 -24 51 -59 -6 17 -14 27 7 14 -58 -40 -4 -11 -22 15 13 -22 40 10 -6 1 25 67 -28 -40 19 -7 30 -8 -61 -15 -6 25
6631 25 88 6 -20 20 -21 24 15 -22 4 38 13 56 20 -36 -6 25 3 -33 -35 68 -40 20 -6 3 -5 24 17 5 -33 -7 28 -36
6663 -36 53 -17 -45 -2 -68 46 4 3 47 -7 37 14 -7 -35 -5 -50 31 -2 -25 -25 -7 33 6 66 -9 -72 25 60 -25 18 -2
6694 -2 -2 -21 29 -15 -3 33 27 29 11 -60 51 -54 -1 -9 -31 7 19 -20 3 40 -27 -21 -26 52 35 69 47 -3 67 -15 -4 -27 -35
6727 -35 30 23 17 -4 6 53 31 59 21 -47 28 16 -18 27 -5 36 21 -19 -6 -18 -2 -1 -23 -87 -15 -30 -82 -20 46 39 6 14 1
6760 1 3 -39 -31 -56 -4 -27 -3 7 62 -42 -33 -16 -53 -29 -5 -13 47 30 -71 1 -50 30 -16 -55 28 32 -5 5 36 68 -86 -1
6792 -1 50 22 8 -20 18 -8 5 20 7 -53 -21 -50 49 -18 -34 -8 -13 -10 -7 1 -27 3 24 32 26 -51 -14 -3 16 -27 20 34 -1 22
6826 22 32 93 17 -39 29 -12 62 20 -45 2 -57 6 25 10 -45 -12 10 25 -6 13 26 14 -5 13 -5 1 -9 -11 104 15 6
6857 6 43 -27 25 23 38 -21 -13 -5 -30 -34 20 27 16 2 11 -40 8 53 37 41 -51 -4 31 -45 -20 -19 -36 -24 11 -20 -30 24 18 47 -18
6892 -18 48 9 34 -4 20 24 5 2 18 -7 -30 -20 -1 59 -61 13 32 37 24 47 -41 -14 29 -25 -30 16 30 -35 5 -20 -43 5
6924 5 22 -15 14 18 -19 -21 31 13 16 57 14 34 -23 15 -35 -20 6 8 72 -18 9 -27 8 29 6 -24 -1 -6 -15 -27 65 34 -53 39
6958 39 29 13 -25 20 26 5 -2 -7 -11 37 -15 45 -6 -20 -42 25 25 -2 -48 4 8 13 22 -7 -14 -23 -5 9 51 -23 61 -25 6 3 -34 -93
6994 -93 25 -59 -30 -17 25 -10 56 -20 9 -22 31 -25 -18 -6 -39 -1 20 11 -4 54 8 20 -32 -55 -47 35 5 1 -35 30 -11 48
7026 48 34 25 8 4 23 20 28 59 17 -9 0 -22 -30 108 -18 -20 -37 9 -8 -34 -15 2 -18 -48 -24 4 16 -36 -35 5 2 35 7 43
7060 43 32 39 -13 -36 28 13 19 -22 48 27 -14 39 51 82 -3 -7 2 6 64 9 -21 25 -25 -50 -29 28 1 27 -33 -7 -13 -9 37 -8
7094 -8 25 20 -22 -40 -8 -16 15 18 21 -7 10 18 -28 -25 -21 -42 21 12 41 41 24 12 1 -29 -8 32 24 11 -21 19 30 -1 8 -11 21 28 -3
7131 -3 20 -40 -38 10 -29 11 -21 -15 -6 33 -62 -51 8 -12 -20 -16 19 -14 34 -3 -42 -9 -3 0 2 -25 -5 -4 -37 19 -12 4 63 -9 -75
7166 -75 -8 14 16 -17 0 19 10 -46 32 -41 -28 -52 -27 40 -11 -35 -34 -14 -26 -66 -4 22 -44 -2 66 30 27 3 9 -13 -20 -35 8
7199 8 26 6 58 16 -35 18 23 -25 7 -7 -69 57 -9 2 -16 2 -25 13 -11 -27 -10 7 -6 -24 -27 16 35 44 11 -15 28 3
7231 3 73 -14 72 -32 -26 84 -9 14 2 -1 21 5 20 24 -36 12 -24 2 -30 25 -34 31 9 9 -59 38 -4 26 17 18 15 -15 -19 7
7265 7 23 -26 11 -29 14 47 -1 10 29 0 29 -35 -7 -31 -46 -10 -32 1 -1 32 2 -15 10 -1 -13 -45 38 -45 20 31 -16
7296 -16 11 -17 10 -20 -31 25 -26 -48 -29 10 5 -13 -52 14 8 31 12 29 32 20 3 26 25 8 17 6 86 -13 -8 11 -14 -29 45
7329 45 -6 -66 43 42 -29 -5 3 -18 -7 -28 -50 16 49 64 5 -32 15 -9 27 15 17 -25 -2 42 -46 39 50 -27 14 10 14 -14
7361 -14 -21 -19 4 -22 41 16 21 -13 7 -15 -7 33 64 15 31 5 22 -33 36 -16 9 39 -26 32 3 -23 -19 37 -35 -7 -49 12 -9
7394 -9 24 43 7 6 -3 -50 -2 -58 30 -9 0 -17 34 43 15 19 27 -37 12 31 5 -21 1 25 63 7 32 -43 28 66 -59 7 -42
7427 -42 -10 -41 -66 -12 -5 23 -30 22 20 15 -40 9 -22 7 5 -9 28 9 -5 30 -10 -10 47 11 41 27 29 33 0 3 -16 -4 -33 -26 50
7462 50 13 5 -10 -31 1 29 -23 -40 -4 14 40 30 19 -55 4 1 31 10 -36 35 12 26 -2 9 -6 9 47 -22 -15 -12 -9 7 46
7495 46 60 17 12 67 5 18 30 26 13 4 -12 29 -14 -2 9 -10 22 -40 36 -48 -7 -15 -43 2 20 9 3 78 -7 58 -13 15 29
7528 29 20 29 -20 6 48 2 46 -35 -56 58 -35 16 41 27 16 0 -52 57 1 9 -27 13 48 -48 -47 35 -62 -41 -67 -32 10
7559 10 -20 2 -5 48 2 -41 -64 -40 -11 7 -16 54 1 29 25 32 -43 -37 40 40 2 -21 -11 18 33 -23 56 -14 -24 6 -33 14 26
7592 26 -8 -15 34 -48 -14 -22 -18 10 -7 38 -2 -28 11 32 -18 -13 7 27 21 0 10 -9 -20 12 -51 40 -22 7 30 27 32 -13 18 7
7626 7 -7 63 -23 45 -30 -2 2 -30 -11 -25 -3 7 -8 -40 -21 5 -25 -29 -18 26 -20 1 -16 51 -55 16 18 17 60 23 55 -23
7658 -23 -13 -18 50 13 39 -74 -32 6 -5 13 39 -3 16 -72 -43 3 -58 -31 16 53 29 -52 39 19 -51 25 11 -10 1 7 -48
7689 -48 20 59 50 -43 -7 -7 29 -19 -30 45 -4 -25 -6 -21 -5 0 -36 -4 7 -14 8 48 30 -26 -44 3 -4 -24 5 6 22 10 -3
7722 -3 21 -31 19 47 19 21 14 58 39 -63 12 23 34 3 -1 -49 -29 43 8 57 14 -24 -21 38 -43 113 22 24 107 5 -3 24
7754 24 24 -36 -7 3 7 2 19 -32 -16 -27 -63 -66 -19 58 -16 53 -71 17 -16 -16 -2 -14 2 -14 -33 -14 4 25 32 53 22 -12 -39
7787 -39 -7 -2 6 13 -9 9 40 80 -50 -4 -13 -16 14 -3 15 25 -19 43 -30 8 24 -3 -14 -22 -36 -24 -24 -16 41 -39 87 -38 19
7820 19 62 -6 5 49 26 22 56 79 46 20 5 13 -25 1 -52 -23 22 3 2 -23 -20 -42 -16 0 -1 6 -47 -12 -5 10 6 -25 -27 6 18
7855 18 6 12 12 20 -22 -24 -33 8 13 -8 13 -8 -14 -1 32 -53 29 -1 30 58 48 37 4 -20 -4 -2 -1 43 -4 -23 17 -9 3 12 -17
7890 -17 -43 54 28 -22 -84 20 10 -1 -29 -23 21 26 4 5 20 -60 -18 46 2 -25 -7 -55 58 -15 42 5 14 -1 14 -37 -30 41
7922 41 -3 -102 1 -26 24 -30 -24 -10 -17 -30 4 -19 15 -1 -56 3 -17 22 14 57 23 6 -8 -21 -24 17 -21 26 12 -9 -43 -47
7954 -47 6 30 -20 -19 -44 -79 -34 -28 -51 16 -13 18 27 -42 5 -11 -37 -44 5 25 3 9 -42 -21 -1 -24 -25 19 22 -4 -7 70 12 -55
7988 -55 9 24 40 -23 7 36 13 20 40 0 40 -16 -21 -11 29 -34 39 37 12 7 -30 -8 15 -1 -32 -60 -27 -15 -19 6 44 14 -7
8021 -7 -36 -28 36 -2 29 -9 10 -18 -31 -45 19 10 43 -26 -27 42 28 3 4 12 48 -14 -44 39 11 -29 16 -39 -7 -39 -16 -2 -48
8054 -48 -5 44 -24 -69 8 15 8 46 0 -27 -20 13 28 23 19 -22 9 17 -45 1 0 25 -13 -3 8 33 -14 -5 -38 -24 1 -43 41 -19
8088 -19 51 -21 -31 3 -26 -6 -40 -11 3 -48 -42 10 -39 5 64 -3 31 -50 13 -30 11 5 36 -28 -15 -16 -20 33 31 -13 4 -6 4
8121 4 -25 -30 1 45 31 10 -1 19 15 18 48 -21 20 34 -4 -17 -39 3 37 -31 14 20 -36 5 38 -52 -7 21 -41 42 31 -29 -12
8154 -12 -2 -59 -1 -39 23 -1 -30 -1 27 -17 45 -6 8 57 22 36 14 -11 33 37 29 24 23 -10 -6 -39 -24 -12 40 42 14 -3 32
8187 32 12 -17 23 30
8191C0
$$ Imaginary data points
##PAGE= N=2
##DATA TABLE= (X++(I..I)), XYDATA
0 0 0 0 0 0 0 0 0 0 0 0 0 0 0 0 0 0 0 0 0 0 0 8 -8 8 -8 8 -8 8 -14 16 -16 16 -24 24 -24 32 -32 40 -40 48 -50 56 -64
43 -64 72 -80 88 -96 106 -115 129 -141 154 -170 187 -210 232 -257 286 -320 360 -408 467 -542 639
64 639 -773 965 -1270 1839 -3239 15472 7494 -18025 6452 9741 -9735 -4609 11856 -3106
78 -3106 -9092 4699 3116 -8173 616 5770 -2714 -3881 2956 1463 -418 720 892 939 1028 -1300
94 -1300 560 2236 -1412 -1424 2073 -2102 -3380 3173 994 -5500 759 3984 -4077 -1910 5756 -675
110 -675 -4070 4618 2421 -5266 2190 5804 -4416 -2998 5815 -647 -5730 2691 2647 -5019 -775 3517
126 3517 -2626 -2520 3503 574 -2968 1249 2420 -840 -19 1614 457 -65 34 -84 541 -197 -1199
143 -1199 109 -19 -1818 -4 1257 -1893 -1196 2380 -262 -2281 2041 2033 -2125 469 2993 -1436
159 -1436 -1205 3030 -100 -3000 1593 1421 -3243 -629 2433 -1722 -2230 1886 151 -2159 1112 1657
175 1657 -1492 -90 2164 -59 -760 1267 717 -700 79 380 -462 -348 -217 -397 -363 -594 -442 306
193 306 -276 -597 710 539 -785 449 1562 -381 -430 1468 213 -1173 819 734 -1595 -374 1077
210 1077 -1078 -1368 939 -66 -1627 423 1025 -908 -247 1388 78 -520 1048 672 -591 345 867
227 867 -353 -434 391 -159 -694 -240 -32 -496 -573 -54 137 -132 -193 313 366 -112 322 793 47 -180 711
248 711 327 -682 143 489 -701 -657 423 -334 -1053 270 345 -858 -96 861 -101 -378 881 597 -456
267 -456 414 875 -231 -273 538 -39 -695 4 166 -664 -474 51 -258 -489 4 217 -88 -127 450 319 -3
288 -3 184 525 123 -157 350 151 -457 -167 234 -354 -629 37 -43 -655 -154 429 -252 -319 584 308 -263 431
310 431 711 -89 -68 699 102 -443 147 253 -542 -340 226 -335 -619 54 110 -360 -69 345 -10 -118 417
331 417 332 -43 97 487 113 -193 150 175 -281 -315 60 -225 -513 -149 92 -364 -229 276 33 -243 346
352 346 460 -104 87 556 94 -193 284 180 -347 -101 175 -280 -495 56 -53 -441 -104 180 -176 -162 320
373 320 182 -135 213 428 67 -26 228 130 -209 -3 82 -149 -329 21 -124 -363 -148 144 -157 -220 226 185
395 185 -187 89 469 88 -66 367 232 -182 15 226 -261 -289 139 -119 -462 -108 109 -246 -202 173 -52
416 -52 -129 254 308 -48 109 340 111 -17 140 140 -118 -147 28 -72 -263 -82 -17 -201 -204 127 82 -150 77 317
440 317 55 12 316 222 -105 94 239 -130 -122 129 -132 -343 13 -75 -344 -139 71 -136 -206 158 140 11 149
463 149 285 105 95 161 84 -22 12 24 -59 -146 -136 -93 -201 -178 -17 -26 -157 -66 242 -5 -50 316 176 -149 191
488 191 314 -116 -46 161 -49 -262 36 7 -294 -127 34 -252 -222 167 35 -194 135 186 -32 62 254 91
510 91 17 194 106 -17 12 6 -90 -84 -145 -97 -40 -158 -74 35 3 -46 119 120 -25 154 159 -2 3 216 0 -189 100
537 100 98 -192 -139 26 -138 -235 114 -18 -187 -7 118 -75 39 215 4 36 226 95 37 76 61 -63 -19
560 -19 -47 -78 -42 -175 -119 -40 -88 -157 26 130 -63 57 210 96 -10 167 34 -131 89 148 -180 -30 101
583 101 -175 -225 112 -87 -213 -6 65 -108 -7 208 5 68 214 141 -46 162 150 -5 56 54 -116 -16 35
606 35 -150 -156 -63 -102 -73 16 34 -34 69 34 0 146 128 5 39 141 -45 -28 144 -50 -136 -4 -45 -223 -55 109
632 109 -239 -59 114 -24 -99 161 113 -76 149 149 -32 43 166 -23 -40 43 -95 -136 2 -23 -82 -43 -33 -86 35
657 35 48 -39 33 136 70 96 83 22 19 109 -37 -94 39 -45 -140 -51 -26 -124 -148 95 -69 -125 160 31 -56 101 152
684 152 -15 70 118 33 -61 68 2 -118 -5 -28 -101 -80 -12 -64 -52 33 -7 -7 98 51 22 103 72 13 76 48 -48 50
712 50 13 -112 2 20 -122 -148 23 -21 -145 23 72 -97 14 179 -21 55 111 6 -28 103 76 -47 3 74
736 74 -64 -55 -23 -109 -66 -45 0 -8 -15 71 -35 84 77 32 93 -2 -26 11 21 1 -13 -22 -63 -30 -46 -6 -98 -7 -14 -73 18 3
768 3 57 9 131 64 4 -11 111 2 -29 31 -55 -25 -25 -95 -121 -81 -17 -73 -69 25 -41 9 -11 22 28 105 94 11 -3 80 10
799 10 -29 -29 19 -12 -42 -45 -31 -3 -73 -9 51 -19 -19 98 27 23 63 62 -8 23 85 -25 -32 27 8 -78 -22 -18 -58 -77 -28 -32 -74 42
833 42 61 0 42 -1 -7 50 37 24 14 8 56 4 28 -28 -64 -44 -91 32 -40 -20 -65 -1 41 28 14 -18 -27 43 41 1 -15 129
865 129 33 -27 -17 -44 -61 -10 -30 -57 -80 -17 -28 11 -27 90 -10 8 61 14 32 77 53 14 66 5 -16 -34 50 -53 -16
894 -16 -19 -19 19 35 -36 -13 4 14 -16 73 15 -6 7 9 -3 34 45 -66 -77 37 9 -95 -9 -44 -64 18 49 -33 61 56 48 19
926 19 62 72 13 -14 43 -5 37 17 16 -27 -3 -14 -55 -32 -30 -17 -10 17 30 -7 -29 4 29 17 18 1 75 -19 18 8 -67 -54 -9
959 -9 -31 -43 -45 -22 -43 -47 -2 -56 -23 0 58 -33 38 67 42 31 -23 10 -6 -18 -19 -13 -8 -32 55 -4 -55 -19 7 -27 -23 4 41 26
993 26 29 45 -4 31 -29 -14 -75 -59 25 -37 -19 -8 -36 -46 20 -13 -5 35 -1 33 -17 62 -32 -1 26 19 -11 105 37 -55 -31 15
1025 15 -15 -50 -11 25 -28 -16 -26 30 0 -8 -43 21 -1 -39 17 -6 -25 -27 4 -20 -88 25 -34 -110 -2 40 0 23 71 5
1055 5 -23 62 -9 -10 18 31 -34 -60 -37 1 -36 11 -49 -29 20 -53 -27 -27 -39 -36 10 -61 -46 -23 53 -30 -5 -29 -15 25 -29 -23 -48
1088 -48 -31 -15 2 6 -25 -41 1 30 12 16 53 -18 2 19 9 -39 37 42 -21 -44 -24 3 -48 -14 -74 -88 25 -42 -18 -20 28 -13
1120 -13 20 -5 10 1 46 -12 -21 29 -47 -18 -36 8 -26 -33 12 9 -14 41 -6 -28 14 -15 -16 5 -33 -66 -10 19 5 52 -4 -22 25
1153 25 -51 -4 -52 -26 -65 -19 -37 43 -11 -2 7 13 24 73 19 -46 -18 13 37 -12 -23 -50 -28 6 -51 -13 -26 -34 3 -86 -42 -14
1185 -14 36 19 -69 54 -1 21 -19 15 -26 -18 1 13 -28 -12 65 -1 -45 -39 17 -11 14 -9 -13 -30 -16 -5 82 52 16 16 38 -15
1217 -15 13 34 19 -53 10 19 10 -12 30 0 3 -26 -21 -14 65 2 -13 -23 34 19 11 -29 -14 31 10 -10 -20 9 16 7 4 8 26 -40 1
1252 1 -66 20 11 -45 20 27 23 16 -20 -10 -44 35 26 -7 0 -39 -25 -19 -38 -18 -23 35 5 -10 50 -29 -9 -7 28 13 1 6 -6 11 -73 -71
1288 -71 11 -51 14 4 34 -11 -19 41 -7 -4 47 12 -15 -34 -41 -15 20 1 46 5 14 29 -15 -43 33 -20 8 44 1 -18 8 48
1320 48 14 -4 -7 -16 5 -23 28 16 34 1 -48 17 -102 -25 -7 -12 -41 -44 28 7 -51 1 51 -6 -14 47 -30 6 -46 36 -2 19
1352 19 43 -55 -3 3 -25 6 53 -12 1 -21 17 32 15 35 24 14 0 -15 -22 22 -26 3 31 -7 -64 14 -37 23 -24 -21 -8 1
1384 1 7 -33 10 37 39 -9 -15 -18 -3 12 -50 -39 6 -19 24 -14 -12 -18 -22 -3 -15 -17 23 30 51 -22 9 -13 28 -21 29 -39 -32 50 6 9
1420 9 61 -20 19 -12 49 -20 52 -23 23 3 7 -3 17 -8 29 23 7 4 1 14 32 -17 12 -10 16 7 -27 -12 26 31 -5 0 44 -4
1454 -4 -39 35 18 -18 21 -8 2 -3 -19 13 -28 13 28 -2 59 -27 22 27 60 59 30 34 43 -26 0 53 9 -39 25 -8 5 -29 -32 -10
1488 -10 8 -8 -37 35 -7 34 2 -28 16 49 -5 -9 -29 -38 -51 15 -20 4 -55 22 -46 -11 -13 60 -15 12 -2 43 42 19 19 10 -18
1521 -18 56 27 16 25 -10 -25 27 -54 -39 -8 -12 -45 15 42 4 -20 49 -29 6 13 16 -12 15 -42 11 -28 7 28 -74 -3 -69 15
1553 15 -46 22 24 62 13 25 18 -34 20 89 7 5 55 19 20 20 0 5 -33 -33 -54 -69 -15 55 30 2 -13 -70 4 11 -2 16 75 33
1587 33 -17 9 66 -16 0 10 44 -24 30 61 -38 56 69 17 38 41 15 63 -11 36 37 11 -30 29 40 33 16 -6 32 0 -35 -23
1619 -23 6 5 18 -65 -20 -35 -11 27 34 3 -14 6 -17 -17 27 58 -10 -17 -33 15 -43 31 18 16 -3 5 17 24 -16 -7 1 4 23 -15 -42
1654 -42 -70 -26 31 30 -9 -4 30 -9 -47 -25 24 -5 -1 27 -7 16 51 -38 -29 22 -17 36 -11 -41 -14 -4 86 33 -29 8 12 14 15 47
1688 47 15 5 -4 19 3 56 -26 24 46 11 -49 49 27 58 -38 -60 16 20 9 -36 -26 4 10 13 -20 14 14 44 -46 16 41 -10 3
1721 3 -33 -4 -60 -1 -41 -24 9 10 43 15 -23 -5 -2 25 -35 5 0 13 -17 -58 2 6 -71 0 -23 -19 3 33 -13 45 -21 -36 13
1754 13 -14 -11 22 15 88 -1 -64 -36 2 -24 -15 36 0 75 18 14 5 20 -11 -6 28 -26 11 -18 -1 -107 -13 81 -11 15 -12 0 3
1787 3 2 -13 6 -23 -10 -68 57 19 25 45 -23 -4 0 -19 -5 -30 -25 -36 35 10 31 22 6 12 -43 44 23 28 23 -17 22 -7 -32 -19
1821 -19 42 -18 12 44 -31 -5 -19 -17 -59 26 10 -67 -26 10 -4 -26 20 -60 -44 -31 4 -22 -2 42 -31 9 16 -2 24 -11 -40
1852 -40 27 -53 -27 43 35 -4 24 -63 46 -21 9 -17 12 -23 -24 3 20 -43 -36 -45 5 -23 34 -18 20 10 -43 -40 44 9 -13 -49
1884 -49 37 28 -42 30 21 -51 -26 27 -11 1 -27 24 26 9 71 9 -16 11 -15 24 21 -18 49 34 16 -32 22 -3 -22 23 20 3 -16
1917 -16 -21 14 16 33 1 -34 -8 -34 -8 64 10 43 -12 -36 13 -35 -34 36 45 -11 -14 2 4 -35 27 -41 -40 8 69 -24 12 2 -24 -34
1951 -34 -20 2 -26 -16 -46 -25 7 -20 10 62 -38 -45 -32 36 8 31 12 9 -7 53 -16 62 2 -44 6 -4 -70 8 -11 -32 -49
1982 -49 -6 1 1 16 -10 27 -9 -20 -45 -23 -19 31 24 15 -15 21 -48 -39 -59 1 -11 -20 -4 29 -2 8 -21 1 20 -29 -7 28 -24 -23
2016 -23 26 21 -31 23 36 57 25 3 -32 -18 7 12 7 -68 34 -3 -25 -14 -18 -15 10 -51 35 -58 -9 42 -7 -44 -27 -23 -33 12 -8
2049 -8 17 -68 -41 -20 -5 42 -43 -10 62 11 -17 36 13 54 1 -15 -13 30 56 -2 -21 30 5 -32 7 -4 -55 -12 -46 -36 9
2080 9 -27 -63 12 -22 9 1 45 -6 2 -4 -26 -65 20 23 -32 -25 1 31 35 23 47 13 54 -40 13 8 -23 10 60 -15 20 -11 -9 9 -15
2115 -15 -30 2 -72 33 -4 3 4 -31 18 -67 31 -24 -34 -25 -44 42 41 -20 -34 -6 -3 26 -21 26 5 24 13 17 -3 -22 20 -25 -42
2148 -42 -37 -14 52 27 -42 -31 25 -11 49 41 -67 -23 -26 -8 -21 11 -5 -97 58 18 5 -20 -10 -3 -2 1 54 49 -45 -13 6 -1 -41
2181 -41 2 46 -14 0 29 2 3 -46 50 26 -27 20 1 0 -27 -39 -19 -11 -26 -54 -5 -13 -59 21 -10 6 2 -8 47 -28 6 -41 -22
2214 -22 -6 -5 -60 -17 -27 -15 27 8 -10 26 62 45 22 -20 46 21 -43 28 37 9 5 -2 20 -8 16 -4 17 1 -14 -17 -43 57
2246 57 -40 44 -9 -31 -16 -15 -7 -46 -34 21 68 43 1 32 14 37 3 14 -19 0 14 -13 -7 -14 -41 13 -6 15 -28 -31 7 22 -21
2279 -21 -68 -13 7 10 21 49 20 -48 0 7 22 -13 49 -36 -8 50 29 -51 -6 -35 -16 -15 -28 -4 -6 14 -21 52 -20 4 51 55 11
2312 11 28 -8 61 -7 -4 -47 -22 2 -28 10 14 15 -6 39 -17 -18 -61 -33 11 -21 -29 36 27 26 -19 -33 -6 -33 13 24 47 40 -75 9
2346 9 -29 63 -1 -5 21 2 -21 73 39 -45 -21 10 -11 52 -11 -14 2 12 -59 -13 -44 -8 21 -21 42 -22 -36 -2 25 -16 21 29
2378 29 -30 2 -62 -3 16 -24 51 42 56 -21 -49 -39 10 3 -22 29 21 15 54 1 -27 54 -1 -4 38 12 -24 -36 -28 -65 17 2 17
2411 17 -28 -61 39 -41 -20 -10 -25 -5 -24 -2 34 0 14 17 23 2 11 -8 -9 -40 20 -6 -14 -18 -4 -19 -56 55 -10 9 -41 1
2443 1 5 6 -2 -21 -40 -18 -54 -44 -8 7 8 11 24 14 14 35 33 -58 -9 -12 17 -4 -10 31 -29 -49 25 -17 40 38 -43 34 -28 31 44 10
2479 10 -38 14 0 -15 12 -27 -25 2 -56 -21 23 -57 -27 27 24 36 33 -49 -29 -15 -46 -55 -42 51 10 -21 -2 16 -28 21 -34 -19
2511 -19 11 -26 48 20 6 29 -4 -5 -6 -7 29 -27 -6 24 -6 -28 3 -24 1 6 -69 18 2 -29 -16 17 -29 -7 23 65 -40 -22
2543 -22 59 20 -43 -11 34 34 2 -12 -31 -5 -12 32 -41 -5 -14 -23 2 9 -1 -12 -18 -32 15 -40 -14 -11 7 -27 10 -39 9 -16 -34 -49
2577 -49 27 -43 -48 -35 -39 -29 46 -3 -33 6 15 -38 -27 8 -50 -26 20 -19 -11 3 41 7 -26 -1 -25 7 -10 -33 -30 -11 -11 14 -41
2610 -41 -56 44 7 -24 -19 -29 30 -16 -34 -49 21 3 -11 -51 -22 24 -11 30 1 24 -34 -75 2 -16 -7 11 -15 24 9 -11 6
2641 6 17 -19 -27 48 74 10 42 21 -7 2 -8 5 43 -3 57 2 -19 -16 14 -4 -51 17 -25 -31 -10 21 -81 -11 -43 0 -39 0
2673 0 -9 5 -1 -32 14 8 1 73 -12 -25 25 13 20 29 -53 -3 42 8 -27 40 12 7 -44 29 6 10 -47 -42 66 19 -15 -8 33 -52 -11
2708 -11 14 -19 -3 -17 13 15 3 -20 -57 2 -18 10 -1 8 -44 -10 39 9 26 16 -5 33 -3 10 32 -35 50 -35 27 -33 50
2739 50 30 -70 -43 -29 -4 -10 19 9 37 61 -91 0 -7 5 27 -64 32 -2 5 -9 -2 -67 -33 8 18 -10 46 12 -4 -8 -37 -10
2771 -10 -22 57 42 -6 -3 21 16 -44 1 38 -40 -26 1 68 8 -37 -60 25 50 15 87 32 -51 -11 -15 -19 25 -23 3 17 26 -6 26
2804 26 3 45 -13 37 -7 51 -33 1 35 -39 -34 6 -10 52 -11 -35 -10 -12 1 -27 -3 -29 10 -41 -16 -33 -69 -47 21 28 -22 -32
2836 -32 32 -17 17 -7 -16 28 -33 38 45 7 20 -14 21 -34 4 12 -46 -34 -39 11 28 41 -19 -51 26 -31 36 -41 3 37 14 -48
2868 -48 -34 9 -32 -18 11 -8 -68 46 -37 -45 44 18 37 0 43 -9 6 22 19 -7 -32 -31 11 11 27 19 -35 -33 2 -28 29 -40 2
2901 2 5 14 -67 15 -35 16 -5 -4 2 26 -15 -14 16 1 11 -46 17 17 -48 4 -42 -7 -22 17 -18 -3 -12 -6 42 72 51 53 26 40 22
2936 22 -45 11 -11 4 31 18 -5 4 20 -41 -45 -8 -1 39 13 -26 -17 43 -17 -49 -1 4 -15 20 -3 37 19 -31 -3 1 -34 11 -21
2969 -21 18 39 -22 -14 50 -23 1 22 73 55 -10 -1 52 23 -17 25 -5 10 26 -11 -10 -17 31 42 -64 -47 -24 30 33 17 -87 -27
3001 -27 -50 -27 -47 -27 6 -8 22 14 33 -28 -6 -10 7 -18 62 23 16 -7 4 11 46 40 -16 -19 -11 -48 12 -29 5 39 -18 -9 3 26
3035 26 2 9 14 15 -49 -43 10 13 50 -16 -44 1 -1 -27 -10 56 6 -30 84 14 -4 -4 30 -7 17 -17 -16 22 0 46 7 -23 4 38
3069 38 -58 48 24 32 -11 -9 -21 37 -18 -6 -8 38 -63 -1 3 0 22 -14 18 0 8 -17 18 20 29 10 6 33 12 -52 4 62 34 2
3103 2 15 36 13 14 -25 30 77 -66 -45 -20 -2 33 -24 -58 -49 25 1 -42 -35 -7 27 8 44 -23 8 14 0 49 8 -5 -27 -14
3135 -14 47 -4 26 13 1 -16 39 26 33 3 -16 41 16 -25 12 21 -25 -6 -34 -29 7 -31 -13 50 -27 5 23 -12 -48 -39 -24 10
3167 10 -6 -5 3 -45 -19 1 4 39 0 -8 -18 41 -23 -29 61 -1 -2 -15 31 -29 -5 38 44 -18 39 0 -21 -15 15 -1 15 -8 -30 -21 -76
3202 -76 -17 12 16 -40 27 46 -30 -57 -7 -41 -64 16 -17 -26 31 6 -1 9 1 43 -20 41 46 -11 17 2 71 2 4 -6 -5 8 -4 -13
3236 -13 22 43 24 4 -28 1 28 -27 2 15 -24 -38 -27 2 -57 -31 2 2 -17 4 -38 65 8 -29 -23 -12 68 -13 18 13 48
3267 48 46 -31 40 56 28 -31 7 -13 -24 49 -6 68 23 -5 16 1 30 10 -15 -8 -33 -1 15 15 -16 1 0 -2 17 -34 -33 35 -10
3300 -10 45 6 -23 29 -40 55 -49 -26 -14 36 4 2 15 -31 20 -11 53 -9 35 9 44 -25 16 -23 -49 -27 -76 -24 33 1
3330 1 -31 21 22 34 -20 44 9 16 15 -15 9 22 -11 -16 -30 36 13 43 -11 -3 -5 21 -5 -40 33 -36 -39 6 63 43 20 38 -40 46
3364 46 69 27 39 5 -5 -18 53 -34 -45 -43 -19 34 54 -43 8 -4 3 36 37 -1 -8 -15 -27 5 1 -10 -1 20 -9 -1 30 -6 -21 -41
3398 -41 -21 -4 23 -56 20 -52 31 -5 50 19 51 -50 -17 21 -15 -21 -21 -22 -20 -19 1 -35 76 14 31 -44 -6 15 10 49 -45 14
3430 14 -15 -15 -44 0 13 -52 20 -47 -24 68 51 -1 -33 -24 16 -3 6 3 38 -57 -58 57 -27 -4 28 46 -35 8 58 31 -27 7
3462 7 -27 -42 22 23 18 44 21 21 -8 -14 -13 -1 -12 -24 7 -90 50 -40 -26 -17 6 -33 -33 27 -31 -48 -20 21 -9 -26 20 65 -70
3495 -70 -21 -52 34 -16 -61 4 -28 71 -40 -17 16 -51 -6 39 6 12 12 19 -1 -14 7 -11 -13 -5 -11 41 42 -43 -19 -31 -40 -38 -26 31
3529 31 -52 -16 16 25 -29 -50 50 -21 16 -43 7 -64 11 9 22 -7 9 -26 29 -1 19 -82 15 7 -26 -32 -36 -10 -6 15 -47 -10
3561 -10 -27 63 3 -23 -11 46 -11 4 -25 -33 -2 32 10 -30 -13 -39 6 -41 -9 15 -7 39 -4 34 15 2 -19 14 12 6 28 20
3593 20 -10 -14 -14 -31 10 5 -54 -5 14 28 40 9 -41 -4 -6 -13 -16 -16 -17 -25 -2 -52 -41 6 -64 15 -18 38 -33 47 2 40 6 51 34
3628 34 -27 17 -36 41 44 -4 -55 82 9 -17 9 3 -20 -29 -14 28 -26 53 -38 -23 20 37 27 13 -27 -34 -30 -8 9 -17 1 21
3660 21 -61 -56 3 -3 15 16 1 -16 -44 -6 28 -34 -37 26 -8 6 -12 -15 -39 47 25 -6 -9 -22 -26 -16 50 5 -28 16 11 65 5 23
3694 23 18 -30 60 46 22 -15 -42 -6 -50 -20 0 -23 -52 -4 27 -11 75 11 -1 19 -16 28 31 9 18 12 57 -42 10 -16 -7 -6 -34
3727 -34 -8 33 32 -56 -10 -37 49 -12 -37 -24 -44 -60 -23 2 48 -21 7 42 -15 -11 -30 -15 -31 28 36 -37 -11 -15 -35 -16 -14 26 62
3760 62 -34 15 56 8 35 35 43 -29 -24 24 -6 -32 9 -13 41 -13 -52 3 13 -4 -15 32 -24 -7 4 15 -4 -9 -51 -21 -49 -35
3792 -35 30 55 -11 19 27 -11 1 -19 8 11 16 0 -17 -23 -15 48 43 -1 12 30 12 5 7 6 29 12 14 8 -44 2 15 -11 -46 2 -54 19
3828 19 -28 3 -18 -2 -13 -20 -31 -32 25 2 45 -6 -37 -26 11 30 -27 23 -45 -31 43 33 22 24 -49 -52 -12 27 -2 38 23 -6
3860 -6 43 6 -55 12 -58 -13 -43 20 -14 33 -39 -29 31 -90 48 -23 -1 85 -30 -23 27 32 17 -31 -16 35 16 8 1 -7 21 10
3892 10 -34 86 18 33 -45 -68 1 -11 2 -91 22 27 -19 -22 -30 14 1 -30 58 4 -20 -20 -5 34 -1 -64 25 -69 -33 18 -1
3923 -1 -3 23 17 24 46 -12 23 5 32 -13 17 0 -17 9 -5 33 17 32 20 18 25 -17 -61 -39 32 -14 24 41 24 -36 21 12 10 21
3957 21 -23 24 24 20 -31 -43 16 -16 10 33 10 29 -2 17 8 41 22 -7 50 -14 42 32 -3 -48 2 23 1 18 -16 41 -26 3
3989 3 38 -2 -9 -16 22 -57 -41 -24 -24 32 29 29 12 29 17 6 1 -35 -11 -9 25 22 0 48 26 37 57 18 1 13 6 -10 -36 -37 -9 -64
4025 -64 -30 -26 14 -15 11 -9 6 -37 -23 -42 5 12 19 -39 -2 9 -24 -19 0 12 12 13 -8 -15 25 -27 11 -22 35 -50 6 11 30 -43
4059 -43 -10 6 -46 17 -8 32 -25 -22 -28 -13 -12 -9 -39 -43 -50 47 3 -32 6 -58 -33 -20 -6 -21 11 23 -73 -47 11 -24 -16 13 -18 -9
4093 -9 -40 48 8 -6 15 10 19 -1 77 21 -54 11 -29 -11 11 18 33 -60 3 -23 -52 3 -19 -54 -9 19 -10 9 29 58 -6 20
4125 20 -3 -29 -31 -7 -32 -13 -1 -33 -32 24 -21 7 43 24 10 52 29 -30 65 -56 14 2 -4 3 42 10 13 -46 14 -4 -57 -15
4157 -15 -24 -48 -19 49 -28 18 -45 17 -26 -37 25 -24 -17 52 -24 -31 -36 -5 -12 26 -18 -31 39 30 -35 -29 -21 11 29 -11 15 -12 38 53
4191 53 -27 20 24 13 95 -3 -44 -6 -46 -7 7 -29 12 -6 12 -7 5 -55 -42 53 -40 -30 -49 -12 44 -6 28 -12 26 -15 16
4222 16 13 17 25 -45 -5 -24 -13 62 -25 -19 37 -25 -8 -18 -10 -4 -10 -28 -29 -18 -7 -14 -21 4 -17 2 22 -17 18 16 -19 7 -36 -46 7 -4
4258 -4 -48 26 -43 -5 -32 48 -17 44 31 -6 -41 28 11 34 -23 -9 14 -35 -9 -14 -60 9 6 -18 18 -21 -7 24 29 30 -51 -3 -24
4291 -24 19 4 56 -39 -24 20 7 -20 -31 -21 30 25 29 46 27 63 32 23 -15 30 -17 19 15 20 -31 1 -36 -3 -75 -67 -57 21 -29
4324 -29 28 -17 -26 28 6 -24 -67 23 24 -32 9 0 18 -15 15 -1 33 5 4 46 28 12 18 12 25 -1 -30 42 9 21 -5 33 -2
4357 -2 26 42 -21 -7 11 -27 5 -4 7 15 -43 -66 -61 -38 -10 -7 -24 -11 -17 -27 11 -3 -19 38 45 17 10 -52 16 50 -36 33 26 -26 13
4392 13 17 -11 60 -49 -50 -32 5 -34 19 18 -67 -4 -5 16 -36 -6 -39 27 -28 -41 -33 -17 16 -18 -21 -28 -41 -31 -23 -8 -28 -51 -9 19
4426 19 21 89 -17 -2 25 -25 -15 12 33 1 -30 -12 -15 8 15 38 17 9 -35 -43 18 -4 -16 -37 -27 23 3 6 -23 51 -5 27 -77
4459 -77 31 -2 -17 10 -69 11 -39 43 32 18 0 -9 35 1 28 -44 0 19 26 14 16 -21 -45 24 -13 30 7 -8 -26 28 -29
4490 -29 -10 -7 -31 24 59 -76 -5 -88 -13 -30 10 -16 5 -24 39 61 52 43 -16 28 -2 -18 2 -64 9 24 -12 -15 22 10 15 21 5
4523 5 65 30 26 29 -13 -4 65 -2 19 -9 27 -48 27 14 -39 12 -37 -38 67 -11 -7 65 -8 14 42 35 -49 -6 20 -2 2 -6 29 4
4557 4 -23 36 5 24 -33 8 76 15 -13 55 -31 -22 2 -5 11 -63 -5 2 12 -49 -34 3 18 -34 -53 -5 -38 -7 9 11 16 37 -41
4590 -41 -10 17 -47 5 -30 31 -14 17 -19 -35 15 -24 -8 3 4 39 -23 38 8 7 1 -1 9 -16 20 41 22 7 1 -18 5 30 -43
4623 -43 -1 12 2 -29 -12 0 -6 4 35 -20 -34 22 6 -5 -6 -40 3 44 -14 -19 2 -47 5 -24 10 60 -31 25 6 1 15 31
4655 31 9 -33 -36 -40 -7 20 -2 7 -18 11 -10 68 -26 5 33 -15 29 16 57 54 7 38 -43 12 -19 17 30 6 35 26 48 -1 -55
4688 -55 5 -5 -16 -6 38 -30 -34 -20 -7 -34 -39 28 -32 22 -21 -25 28 3 -40 -18 0 -17 -28 -63 -78 9 15 2 -32 57 -26 -20 -21
4721 -21 18 0 -13 35 39 11 -11 19 21 20 -8 48 14 -3 27 6 -20 49 -25 -26 31 -2 -6 -58 34 2 -14 34 -27 18 15 -13 -38
4754 -38 27 -19 -55 -9 -28 -45 45 -3 25 30 -27 -2 -1 1 -82 44 -23 6 -26 31 75 -19 -13 -11 15 3 13 -23 -4 34 20 -21
4786 -21 -34 37 -12 -34 -27 -33 28 -58 8 19 -4 -17 20 20 -13 30 23 -24 -22 29 55 -16 -15 42 17 64 23 -41 34 10 -14 60 -28
4819 -28 -29 3 25 29 -42 60 -57 8 -3 33 27 36 2 43 47 22 14 -2 12 -1 71 17 8 -5 21 4 4 21 -43 -54 11 20 -30 13
4853 13 2 -36 -23 -32 37 -19 4 52 18 -75 -52 -29 4 -21 27 40 57 -17 -34 -14 46 -27 -19 7 -25 1 17 -19 -13 8 -4 -16
4885 -16 -49 30 -45 34 -14 27 -4 3 -1 47 27 17 -20 -67 -13 39 -13 27 -44 33 35 7 -3 15 -38 -19 0 14 1 32 52 4
4917 4 -23 1 8 -32 -18 -11 -35 -12 5 -42 -42 21 14 -32 23 46 5 -23 1 -44 3 -31 -15 -24 37 -4 34 -26 54 46 -3 -42 -1 11
4951 11 -19 -29 -46 39 16 -33 -11 36 16 14 -50 -54 -24 -23 -26 22 13 -5 50 23 -22 -14 10 0 26 -26 -4 68 31 13 12 23 -24 27
4985 27 30 31 -15 -18 -43 36 -37 37 50 5 21 41 -27 -11 13 33 26 23 -20 -22 55 -49 -17 66 66 22 34 -31 -28 -30 49 5 15 -10
5019 -10 -20 -43 -5 18 24 9 -12 1 -17 42 -26 -12 18 13 10 -41 12 -2 -54 -17 -19 -62 22 -38 46 -83 28 5 -36 34 27 41
5051 41 25 -23 42 3 29 22 -24 -4 12 -17 7 19 -31 -23 27 7 -36 -7 -24 8 -2 10 12 6 17 11 -2 -45 -1 0 16 32 59
5084 59 15 -11 -34 -48 -15 -55 61 -16 -4 -27 42 58 25 24 0 4 -48 42 23 -16 17 63 2 6 -13 3 7 -14 -31 36 -18 -22
5116 -22 -34 23 24 -32 -16 -44 22 -37 -31 -16 -28 -2 9 -23 -52 -15 -69 23 -10 24 -9 3 17 46 -23 32 44 -44 -5 -5 -2 -35
5148 -35 -3 12 -53 6 -4 -56 -21 1 -4 -5 11 13 42 -11 -25 3 -48 27 12 -4 24 8 -9 -40 33 57 46 -6 66 -10 -30 23
5180 23 28 14 -27 28 24 -1 50 42 -29 -48 0 26 -21 -33 -38 -36 -10 -8 -22 -15 25 -44 -51 -9 -24 -4 -95 -25 15 -16 54 -35 -26 -22 0
5215 0 -16 -15 -11 -18 63 63 -54 15 21 47 -3 53 60 13 46 -22 44 39 -17 -4 -27 36 9 37 9 -52 49 14 -16 -25 30 3 -29 21
5249 21 -3 28 -4 27 -47 -3 -41 -45 27 36 -23 6 47 1 -13 31 -38 32 21 -45 10 -19 -22 20 -25 7 16 30 -9 15 -3 28
5281 28 25 -37 -15 -7 36 -9 11 -5 -67 61 -5 -32 -25 -75 -7 13 -2 -90 8 31 30 30 43 -10 -11 65 15 12 -1 11 -15 51 22
5314 22 16 -12 18 -32 24 17 2 42 -16 23 6 -12 -12 6 35 -22 -7 12 -9 40 61 28 -17 14 -14 38 -13 -11 19 -36 -26 -23 1
5347 1 -14 53 31 28 -16 17 -45 6 34 18 -8 -21 -18 -24 -5 26 19 10 -16 7 -8 -6 -31 -22 40 -80 20 -24 -56 -11 30 -12 -7 -25
5381 -25 28 5 -35 -36 -15 33 13 35 14 32 5 -15 -46 0 -21 4 -31 3 -9 -29 -20 26 -46 6 -3 -2 -23 -25 -23 -28 -44 -9 12 -24
5415 -24 -2 11 39 17 -59 -28 30 10 -45 -50 29 3 -35 -38 19 -44 2 10 6 22 -17 -3 22 -4 -31 -36 58 38 -32 -5 -1 21 -23
5448 -23 21 1 14 -7 17 6 34 35 24 -29 -36 -23 35 -37 47 22 -10 -44 -17 -19 -10 -12 44 -5 -3 15 -1 -24 31 -18 2 96 -13
5481 -13 -5 -23 23 -12 10 15 41 18 35 27 0 -7 -24 -14 -1 -21 5 21 -29 -11 -23 -6 -37 -33 -10 -52 -23 -46 35 36 -17 2 -3 -32
5515 -32 -18 2 -1 7 6 60 -50 43 -35 -29 7 11 13 -41 39 -15 16 -21 16 37 48 -16 -27 0 -48 -73 -48 -47 51 53 29 -65 -6 -36
5549 -36 74 -56 22 48 34 -32 26 30 54 16 -17 -26 12 -21 0 36 39 2 17 -62 4 42 -34 19 36 31 10 12 -17 -48 12 1
5581 1 6 -14 -3 54 -22 -20 7 -18 -22 -1 31 56 28 30 0 -5 40 3 -5 29 -3 4 25 52 -23 -51 -7 14 -9 20 -3 -47 26 -15
5615 -15 53 -21 -27 -47 -22 -43 31 -27 -15 -43 7 35 -5 -2 -26 -30 -33 12 27 35 24 -16 39 -12 7 -7 -35 -15 -17 -4 25 26 -10 13
5649 13 -29 18 -10 21 -53 -68 21 54 -18 4 3 -1 -61 -1 -10 -53 -6 -64 0 4 33 -2 -72 29 -25 48 -2 -49 -32 61 1 -5
5681 -5 47 -13 -2 -24 29 -9 -2 0 -43 -10 76 -8 52 2 -8 -29 -16 -34 -31 -4 -13 -23 -4 -41 6 30 -34 16 -47 -15 -23 31 -34
5714 -34 37 22 -6 20 43 -18 -25 13 15 -68 27 -2 7 17 -22 4 17 39 -26 26 -42 -19 -17 -1 -7 -1 4 -17 -70 -1 -39 2 42 -21
5748 -21 20 -6 -12 -37 27 -2 15 34 63 -35 5 -29 -9 0 2 25 -30 -15 -14 28 46 26 0 13 -35 37 -14 -29 3 21 -23 -24 -13
5781 -13 42 8 15 2 23 8 20 21 5 -3 11 6 1 -53 48 -15 17 67 -9 -27 -1 15 47 25 14 32 12 -34 50 -9 76 33
5813 33 -19 -4 -10 5 -9 27 -25 0 -33 -50 -40 -21 -20 -23 -27 -24 78 30 -59 70 -34 -25 1 20 24 2 34 15 32 -16 42 43 51
5846 51 -44 -28 41 -16 19 11 -33 43 22 -14 3 6 -33 -9 -15 -20 28 -36 48 -27 -42 4 34 -22 -20 12 16 -14 -56 23 7 46 -27
5879 -27 6 52 -10 -16 56 -22 -17 25 13 -29 7 22 -34 -29 -35 15 14 -53 28 16 0 -43 0 -76 -14 -6 27 -20 28 -11 -16 -16 0 17
5913 17 -18 14 18 40 -14 -34 -30 -16 9 40 -35 13 25 49 -17 19 -35 -28 18 0 -1 1 19 20 1 21 -18 -35 -34 -76 -13 -5 -17 -13 -13
5948 -13 -27 -39 16 -11 -2 9 -5 -41 8 -17 -31 -30 -19 8 -45 20 -11 56 -49 1 81 -17 34 -1 29 19 -24 -39 49 -1 30
5979 30 56 -10 6 -28 6 15 -3 -40 58 0 45 24 -29 45 21 -16 1 -28 27 -5 -48 -17 -29 -5 -27 9 63 16 31 26 -28
6010 -28 -24 27 -32 6 8 -5 2 -13 42 -6 18 8 -45 67 -27 14 49 -31 -32 -25 -26 -10 -34 -33 -4 -41 18 -35 -14 1 -28 1 37
6043 37 -43 -29 0 52 -13 -23 11 -1 -37 15 1 105 11 -13 13 16 42 31 55 -14 -61 -2 22 -2 24 -38 -20 -30 38 -21
6073 -21 -12 -6 -35 -27 0 -66 -61 -1 10 21 -25 -42 12 3 1 42 12 23 -41 28 19 27 -70 64 3 -46 -11 -17 41 -12 13 -61 -13 -19 48
6108 48 46 15 -33 -1 22 41 -46 -15 -43 33 0 -16 -7 -22 -20 23 19 -50 15 -17 -25 -49 20 3 20 20 12 -2 -52 -2 -2 -9 24 -30 18
6143 18 -7 16 19 -45 54 -8 19 83 -19 -41 36 63 36 -37 51 -37 16 -40 -12 -11 -19 -3 19 -66 -51 -29 -7 5 49 14 31
6174 31 -24 3 24 -20 -10 -24 8 -24 -16 -20 16 -14 1 -17 4 34 3 1 10 -29 -8 -43 7 -32 -26 -45 -52 16 20 23 -22 -3 -14 -60
6208 -60 6 -46 -1 -21 -27 -14 10 30 -27 63 -25 19 -32 -33 -9 1 -50 13 33 -43 51 -15 45 5 -2 -9 6 -52 0 -22 46 0
6240 0 4 -40 -28 7 36 -48 -37 1 -58 -24 -6 -23 -31 -7 -39 -14 4 3 -25 -34 -8 14 -9 52 43 -1 34 -11 8 -21 14 6 11 -27
6274 -27 9 -32 -15 -6 -28 15 49 -33 -47 -21 -5 -23 -47 -10 -44 20 20 -13 -73 24 -50 -33 -36 -10 -11 43 -22 40 -11 -16 46 -31 -33
6307 -33 -16 10 -5 24 -13 -30 -15 -18 -5 2 -10 -6 8 1 -40 43 8 -31 36 -6 -51 4 -9 -6 -13 -10 -18 -45 -57 16 2 -14 -5 -14 -57
6342 -57 51 30 5 40 -84 35 20 14 12 -21 -36 8 -26 -27 -18 2 27 -18 5 25 -23 51 -15 -18 18 -8 -63 0 53 0 -15
6373 -15 19 -17 -36 5 -7 -4 26 -16 34 2 -35 -20 3 -15 -1 48 -2 -24 15 0 9 8 6 -6 -7 -23 -59 20 1 22 40 14 32
6406 32 -7 26 -2 -45 22 -13 -36 -60 -39 -40 10 -60 35 12 -3 -21 -36 -14 -6 -25 -1 25 1 22 15 49 21 -3 -58 15 19 30
6438 30 -24 -2 -10 52 -51 -64 -12 -34 -4 -16 17 -2 -5 6 -38 -33 -21 46 29 -44 25 15 -43 -26 -49 -7 -34 -39 -40 -12 -26 -38
6470 -38 6 6 5 -11 20 29 -13 -43 41 -34 -16 12 19 10 -39 37 37 18 -32 -28 2 -17 27 -56 -18 -39 -87 -70 -7 -18 4 24 42 0
6504 0 -10 17 -41 -21 -89 -4 13 52 -28 0 53 -62 -37 2 29 10 -98 22 25 -11 1 -20 -1 2 16 -31 12 18 -36 -53 3
6535 3 -49 -8 -7 44 -23 21 38 20 35 -1 -11 -8 15 1 44 17 13 -10 18 -58 -30 12 16 30 50 38 -40 -60 39 -18 20 -53 5
6568 5 13 35 -61 7 -30 15 30 -21 4 -14 51 -20 12 -10 -22 22 -3 -22 -14 -25 7 32 0 -44 39 -15 56 -41 -16 27 44 15
6600 15 -29 -38 -24 -75 15 24 35 64 -2 28 -11 6 16 -1 16 5 -32 -12 60 -85 0 -47 -9 23 -11 31 8 -29 -14 -22 21
6631 21 4 -8 33 3 49 30 -35 49 17 -43 10 14 -66 -10 3 -18 10 9 -2 8 17 42 -33 26 -8 -64 -78 27 30 43 -33 -15
6663 -15 -4 -2 -31 10 28 28 18 5 17 -13 21 29 17 -26 76 17 39 30 25 64 -8 -32 -21 -4 9 -14 -39 52 -31 44 12 -41
6695 -41 -19 -11 7 -7 -29 30 -3 -16 1 -39 -43 24 0 -32 14 -26 -11 -29 6 49 -23 0 19 -3 -26 21 -22 -12 30 4 -21
6726 -21 38 62 36 25 1 -4 18 -38 23 -22 -49 41 -69 -39 0 -3 14 -47 15 -28 31 2 -20 -62 20 -23 40 23 -42 -27 -17
6757 -17 17 63 -9 -11 4 -8 -18 63 10 12 6 -1 56 22 8 14 3 17 -5 -8 29 10 -58 13 16 52 15 -43 8 -50 22 -17 1 0
6791 0 -19 8 -9 26 14 -8 13 12 -60 -18 3 68 12 -20 24 10 71 32 -20 30 19 -54 -67 -8 -45 -32 17 14 -23 0 -3 19
6823 19 11 -18 19 6 5 -55 -13 -2 -42 -45 1 -30 3 -46 -55 5 -35 8 -34 -19 28 -11 -3 -4 -43 34 -48 11 -15 -20 -14 10 -33 -6
6857 -6 -47 -34 -9 4 -6 26 -18 4 -10 -7 34 27 8 -34 -21 2 -14 8 -36 -70 23 25 8 -20 51 -2 -2 45 -1 26 -52 28 35
6890 35 -32 98 6 -8 5 -16 4 10 -49 -4 -3 24 -21 -32 -9 10 -21 11 -22 0 -36 -34 76 37 7 24 4 -25 -26 -56 27
6921 27 14 -56 -2 -6 -5 -15 -20 -1 71 47 75 -25 -5 -11 -26 45 21 45 18 4 49 3 87 25 -7 41 33 48 10 5 15 -64 -92
6954 -92 7 -27 -28 3 -32 2 17 -4 -19 -26 40 66 9 53 8 -53 -17 52 -22 -16 37 -21 6 2 -42 -16 27 -22 -9 -34 -4 13
6986 13 -40 -2 -52 -4 -8 -27 -45 -41 -46 0 -22 -33 -35 -10 -21 -24 17 -12 -7 21 -33 33 29 -10 -23 41 -47 -20 66 -17 59 12 19 21 0
7021 0 -21 16 11 32 -30 -27 -29 19 -18 -47 -72 30 41 -13 15 21 26 14 -14 -21 -33 23 15 -72 23 22 7 -13 35 -26 21 11 -32 8
7055 8 32 -31 53 5 46 20 14 8 -55 -19 -25 -29 -92 -57 -70 -43 44 13 21 25 17 -43 37 11 -4 -56 -14 -33 -20 63 -1 4 1 -64 13
7090 13 -16 28 -48 12 -31 -24 -7 29 -16 -31 26 -62 16 9 -21 -6 -31 -14 -14 20 -7 13 -49 -6 -17 8 -1 11 14 -4 23 0 16
7123 16 29 4 17 -4 18 73 36 -20 8 17 3 -13 7 -24 34 -38 22 44 43 32 13 -4 -55 33 8 -28 33 -7 71 -18 18
7154 18 46 -41 -27 3 -25 -28 -24 -10 5 -15 -6 -35 30 -39 -14 -4 -2 20 60 -26 17 52 21 27 14 43 14 -49 -6 73 45 -38 -19
7187 -19 -22 -26 45 27 -2 -52 -23 -17 -27 -21 -14 50 -28 -30 21 -14 -14 61 -88 -117 28 28 -7 6 -38 -3 -7 -3 -65 47 -70 -1 -22
7220 -22 0 -11 -89 -18 15 -30 -33 -20 -20 8 0 8 -1 29 -47 22 -13 -5 21 -9 21 -60 -8 -30 -7 -2 1 -2 -30 -13 -6 9 -13 50 -8
7255 -8 33 -3 28 -12 -19 24 -23 38 -16 53 31 -48 10 1 -56 42 -15 -4 2 -77 -32 -55 47 7 -22 17 3 -52 -23 2 -47 8
7287 8 15 -16 43 11 -24 -37 -85 -38 54 42 33 6 26 1 14 -1 3 27 -34 48 16 -2 13 19 5 62 -6 61 -40 -8 -5 -2 2 7
7321 7 -29 -3 -34 -44 13 21 -13 34 8 43 5 -14 -19 -15 -18 38 45 -7 18 12 -9 15 -20 -1 -13 11 -8 -4 -34 35 -22 0 51 22
7355 22 -20 33 7 -16 -18 -35 -1 -9 -11 -24 -16 -77 -15 -3 20 -14 8 -35 -24 10 -14 -25 -29 -59 5 -23 -30 10 -10 17 -23 0 -10
7388 -10 -52 -9 10 -32 4 22 -9 14 -12 10 2 2 34 -46 24 7 -1 -43 28 -11 9 -35 -67 -34 16 -2 -48 3 15 -11 13 19
7420 19 41 -21 -25 19 -25 -4 42 -10 -32 -47 4 20 3 50 -54 -30 -41 3 23 -46 32 15 2 -64 19 -35 2 -27 -22 4 -15
7451 -15 39 -3 -14 -12 32 -7 -22 -39 -25 44 16 2 -8 -11 -10 -24 19 -8 56 78 8 52 45 -50 -17 -40 -8 -31 0 6 26 41 17
7484 17 4 -41 -53 25 -2 -10 -34 -13 29 -37 0 -4 -39 15 -16 -60 -37 -27 -12 26 80 -25 13 9 -20 26 -11 1 15 16 19 60
7516 60 -24 -34 2 -80 -17 -42 14 -17 48 48 33 32 10 -51 31 -46 18 -22 -48 9 45 -14 -13 16 49 5 12 14 -27 -28 23 39 11
7549 11 -55 -50 40 15 2 -16 -31 -27 -26 15 -19 11 5 14 52 21 39 14 -41 -38 29 30 6 -21 7 -43 11 0 -2 -15 19 34 -40 16
7583 16 -2 -18 -33 0 47 -7 12 4 32 38 16 26 2 9 32 -12 -28 52 -26 3 4 -18 2 5 -5 -49 -13 -15 -43 3 -30 54 9
7616 9 -16 -4 48 21 59 -67 23 -34 41 -1 -25 -18 -3 36 -56 29 13 12 1 28 -14 -48 17 71 -13 29 12 -30 32 27 18 36
7648 36 -17 29 2 -55 -58 -37 -28 -26 22 0 34 15 -17 -36 -28 -39 18 -21 -16 -49 29 -5 -24 -6 -26 35 29 3 -20 -26 8 43 -3 -9
7682 -9 24 2 1 25 -45 -2 3 -12 -35 -72 -29 3 17 13 -49 11 -41 -15 -29 -25 -42 19 -15 -51 -23 -9 -42 -26 -2 24 -18 7 23
7715 23 29 45 -58 -7 -26 46 -8 14 -45 53 -2 -33 40 28 6 29 2 13 11 -44 -71 -22 21 1 6 33 -63 8 21 -59 -10
7746 -10 -54 -19 14 -14 -34 -18 -53 -8 6 34 -4 30 -35 -3 32 -4 -12 -52 13 -1 -13 45 -8 0 43 16 52 -11 -14 -1 -13 -38
7778 -38 6 49 16 1 5 3 22 12 52 -21 11 -41 29 12 -15 1 -62 7 -33 -59 18 26 -3 -3 22 28 65 -24 -1 29 -8 5 60
7811 60 61 1 -7 -14 -23 24 -7 -30 -41 30 -14 78 22 10 -47 10 8 47 -80 -41 13 -35 -3 14 -4 -63 20 2 -7 -32 -16 17 56
7844 56 45 35 -45 15 -26 15 -19 28 56 -11 -11 -32 34 31 -9 0 -15 -31 -29 30 -57 -27 3 38 -17 -32 -17 6 -12 -27 40 -15
7876 -15 37 0 -24 8 -20 21 58 -2 22 22 24 31 24 -13 22 0 -5 -28 35 -4 11 28 -70 39 -9 0 -22 -25 19 -12 39 31 29 -41
7910 -41 9 26 35 -19 -39 -52 9 6 -16 -14 -36 87 13 47 -41 -52 11 18 -20 -9 -37 -13 -12 -3 18 59 91 20 -7 11 3 -71 -7
7943 -7 34 29 2 -9 24 41 -22 -89 1 -56 33 -9 24 -13 -39 27 -2 -61 -59 -21 -33 -26 27 -49 -23 9 29 12 6 31 -7 52 7
7976 7 2 10 99 -48 13 6 2 25 -32 -40 -31 -10 45 11 -18 10 -20 -21 -13 55 -12 5 54 9 61 -34 -44 19 8 36 63 6 -13 32
8010 32 35 -14 -30 34 32 39 -3 29 -1 21 -51 -32 -17 13 10 -20 -30 -50 5 -19 18 59 -30 -11 -8 -23 -44 19 -2 2 1 -16 14 -4
8044 -4 25 -54 4 9 -78 -44 13 29 -15 4 -34 45 36 7 -77 43 24 25 47 -33 -4 36 -26 3 -14 -17 -27 5 -6 13 0 24
8076 24 -55 27 18 -85 17 -21 -53 -3 35 -14 -17 -26 -38 11 22 -28 21 -3 -41 2 -35 -7 -16 -25 23 17 -40 8 32 24 -2 17 -32
8109 -32 6 9 5 -18 19 -17 25 -70 -29 -19 -15 -85 -25 7 24 21 13 -22 30 24 -12 -33 -30 25 17 3 -12 -52 -34 12 -10 10 -25 49
8143 49 -31 47 3 -10 59 16 -18 -37 -25 8 -27 46 -8 -7 6 20 -35 -24 -6 -32 -24 11 0 -39 15 10 -13 -2 -16 -4 -34 2
8175 2 -15 2 -26 -43 21 8 -18 7 -21 -15 57 25 37 9 11 23
8191B3
##END NTUPLES=NMR FID
##END=
