##TITLE=1H_NV86
 CDCl3
 8 sc, 
 22.11.2023
##JCAMPDX= 6.0         $$ Bruker NMR JCAMP-DX V2.0
##DATA TYPE= NMR FID
##DATA CLASS= NTUPLES
##ORIGIN= UXNMR, Bruker Analytische Messtechnik GmbH
##OWNER= root
$$ XWIN-NMR		Version 3.5
$$ Wed Nov 22 11:57:44 2023 Russian Standard Time (UT+4h)  she@DPX200
##.OBSERVE FREQUENCY= 200.1313
##.OBSERVE NUCLEUS= ^1H
##.DELAY= (6, 6)
##.ACQUISITION MODE= SIMULTANEOUS
##.ACQUISITION SCHEME= undefined
##.AVERAGES= 8
##.DIGITISER RES= 18
##SPECTROMETER/DATA SYSTEM= spect
##.PULSE SEQUENCE= zg30
##.SOLVENT NAME= CDCl3
##.SHIFT REFERENCE= (INTERNAL, CDCl3, 0, 15.7039)
##AUDIT TRAIL= $$ (NUMBER, WHEN, WHO, WHERE, WHAT)
$$ ##TITLE= Audit trail, XWIN-NMR		Version 3.5
$$ ##JCAMPDX= 5.01
$$ ##ORIGIN= Bruker BioSpin GmbH
$$ ##OWNER= she
$$ F:/spectra/data/she/nmr/H-F/1/audita.txt
$$ ##AUDIT TRAIL=  $$ (NUMBER, WHEN, WHO, WHERE, WHAT)
(   1,<2023-11-22 11:56:42.23 +0400>,<she>,<DPX200>,
      <created by zg, POWCHK disabled, PULCHK disabled
       configuration hash MD5:
       00 E9 B6 7A A2 85 ED C7 34 08 36 98 17 FE 4E 26
       data hash MD5: 16K
       BB 48 D5 EB 30 31 98 46 04 C7 A0 70 BB CC 81 69>)
$$ ##END=
$$ 
$$ hash MD5
$$ 6A 41 1E 49 D0 EA 60 F4 A0 B8 2D 19 10 0A B0 22
##$RELAX= 
##$RELAX= 
##$RELAX= 
##$RELAX= 
##$RELAX= 
##$RELAX= 
$$ Bruker specific parameters
$$ --------------------------
##$DU= <F:/spectra>
##$EXPNO= 1
##$NAME= <H-F>
##$PROCNO= 1
##$TYPE= <nmr>
##$USER= <she>
##$AMP= (0..31)
100 100 100 100 100 100 100 100 100 100 100 100 100 100 100 100 100 100 
100 100 100 100 100 100 100 100 100 100 100 100 100 100 
##$AQSEQ= 0
##$AQ_mod= 1
##$AUNM= <au_zg>
##$AUTOPOS= <>
##$BF1= 200.13
##$BF2= 200.13
##$BF3= 200.13
##$BF4= 200.13
##$BF5= 200.13
##$BF6= 200.13
##$BF7= 200.13
##$BF8= 200.13
##$BYTORDA= 1
##$CFDGTYP= 0
##$CFRGTYP= 5
##$CHEMSTR= <none>
##$CNST= (0..31)
1 1 145 1 1 1 1 1 1 1 1 1 1 1 1 1 1 1 1 1 1 1 1 1 1 1 1 1 1 1 1 1 
##$CPDPRG= <>
##$CPDPRG1= <>
##$CPDPRG2= <>
##$CPDPRG3= <>
##$CPDPRG4= <mlev>
##$CPDPRG5= <mlev>
##$CPDPRG6= <mlev>
##$CPDPRG7= <mlev>
##$CPDPRG8= <mlev>
##$CPDPRGB= <>
##$CPDPRGT= <>
##$D= (0..31)
0 1.2 0 0 0 0 0 0 0 0.06 0 0.03 0 0 0 0 0.0002 0 0 0 0 0 0 0 0 0 0 0 0 
0 0 0 
##$DATE= 1700639801
##$DBL= (0..7)
120 120 120 120 120 120 120 120 
##$DBP= (0..7)
150 150 150 150 150 150 150 150 
##$DBP07= 0
##$DBPNAM0= <>
##$DBPNAM1= <>
##$DBPNAM2= <>
##$DBPNAM3= <>
##$DBPNAM4= <>
##$DBPNAM5= <>
##$DBPNAM6= <>
##$DBPNAM7= <>
##$DBPOAL= (0..7)
0.5 0.5 0.5 0.5 0.5 0.5 0.5 0.5 
##$DBPOFFS= (0..7)
0 0 0 0 0 0 0 0 
##$DE= 6
##$DECBNUC= <off>
##$DECIM= 32
##$DECNUC= <off>
##$DECSTAT= 4
##$DIGMOD= 1
##$DIGTYP= 9
##$DL= (0..7)
0 120 120 120 120 120 120 120 
##$DP= (0..7)
150 150 150 150 150 150 150 150 
##$DP07= 0
##$DPNAME0= <>
##$DPNAME1= <>
##$DPNAME2= <>
##$DPNAME3= <>
##$DPNAME4= <>
##$DPNAME5= <>
##$DPNAME6= <>
##$DPNAME7= <>
##$DPOAL= (0..7)
0.5 0.5 0.5 0.5 0.5 0.5 0.5 0.5 
##$DPOFFS= (0..7)
0 0 0 0 0 0 0 0 
##$DQDMODE= 0
##$DR= 18
##$DS= 0
##$DSLIST= <SSSSSSSSSSSSSSS>
$$ [...]
##$SUBNAM2= <"">
##$SUBNAM3= <"">
##$SUBNAM4= <"">
##$SUBNAM5= <"">
##$SUBNAM6= <"">
##$SUBNAM7= <"">
##$SUBNAM8= <"">
##$SUBNAM9= <"">
##$SW= 18.0517328524113
##$SWIBOX= (0..15)
0 0 2 0 0 0 0 0 0 0 0 0 0 0 0 0 
##$SW_h= 3612.71676300578
##$TD= 16384
##$TD0= 1
##$TE= 0
##$TE2= 300
##$TE3= 300
##$TEG= 300
##$TL= (0..7)
0 120 120 120 120 120 120 120 
##$TP= (0..7)
150 150 150 150 150 150 150 150 
##$TP07= 0
##$TPNAME0= <>
##$TPNAME1= <>
##$TPNAME2= <>
##$TPNAME3= <>
##$TPNAME4= <>
##$TPNAME5= <>
##$TPNAME6= <>
##$TPNAME7= <>
##$TPOAL= (0..7)
0.5 0.5 0.5 0.5 0.5 0.5 0.5 0.5 
##$TPOFFS= (0..7)
0 0 0 0 0 0 0 0 
##$TUNHIN= 0
##$TUNHOUT= 0
##$TUNXOUT= 0
##$USERA1= <user>
##$USERA2= <user>
##$USERA3= <user>
##$USERA4= <user>
##$USERA5= <user>
##$V9= 5
##$VALIST= <valist>
##$VCLIST= <CCCCCCCCCCCCCCC>
##$VD= 0
##$VDLIST= <DDDDDDDDDDDDDDD>
##$VPLIST= <PPPPPPPPPPPPPPP>
##$VTLIST= <TTTTTTTTTTTTTTT>
##$WBST= 1024
##$WBSW= 4
##$XGAIN= (0..3)
0 0 0 0 
##$XL= 0
##$YL= 0
##$YMAX_a= 200470
##$YMIN_a= -195126
##$ZGOPTNS= <>
##$ZL1= 120
##$ZL2= 120
##$ZL3= 120
##$ZL4= 120
##$ABSF1= 10
##$ABSF2= 0
##$ABSG= 5
##$ABSL= 3
##$ALPHA= 0
##$AQORDER= 0
##$ASSFAC= 0
##$ASSFACI= 0
##$ASSFACX= 0
##$ASSWID= 0
##$AUNMP= <proc_1d>
##$AZFE= 0.1
##$AZFW= 0.1
##$BCFW= 1
##$BC_mod= 2
##$BYTORDP= 1
##$COROFFS= 0
##$CY= 11.3945322036743
##$DATMOD= 1
##$DC= 2
##$DFILT= <>
##$DTYPP= 0
##$F1P= 15.7292609196834
##$F2P= 12.9074282941183
##$FCOR= 0.5
##$FTSIZE= 0
##$FT_mod= 4
##$GAMMA= 1
##$GB= 0.15
##$INTBC= 1
##$INTSCL= 1
##$ISEN= 128
##$LB= 0.24
##$LEV0= 0
##$LPBIN= 0
##$MAXI= 10000
##$MC2= 0
##$MEAN= 0
##$ME_mod= 0
##$MI= 1.114404
##$NCOEF= 0
##$NC_proc= 0
##$NLEV= 6
##$NOISF1= 3.799351
##$NOISF2= 2.8
##$NSP= 1
##$NTH_PI= 0
##$NZP= 0
##$OFFSET= 15.70392
##$PC= 1
##$PHC0= -24026.05
##$PHC1= 11.05269
##$PH_mod= 1
##$PKNL= yes
##$PPARMOD= 0
##$PSCAL= 0
##$PSIGN= 0
##$REVERSE= no
##$SF= 200.130013532006
##$SI= 16384
##$SIGF1= 3
##$SIGF2= 2
##$SINO= 400
##$SIOLD= 16384
##$SREGLST= <1H.CDCl3>
##$SSB= 0
##$STSI= 0
##$STSR= 0
##$SW_p= 3612.71676300578
##$SYMM= 0
##$S_DEV= 0
##$TDeff= 0
##$TDoff= 0
##$TI= <>
##$TILT= no
##$TM1= 0
##$TM2= 0
##$TOPLEV= 0
##$USERP1= <user>
##$USERP2= <user>
##$USERP3= <user>
##$USERP4= <user>
##$USERP5= <user>
##$WDW= 1
##$XDIM= 8192
##$YMAX_p= 0
##$YMIN_p= 0
$$ End of Bruker specific parameters
$$ ---------------------------------
##NTUPLES= NMR FID
##VAR_NAME=  TIME,          FID/REAL,        FID/IMAG
##SYMBOL=    X,             R,               I
##VAR_TYPE=  INDEPENDENT,   DEPENDENT,       DEPENDENT
##VAR_FORM=  AFFN,          ASDF,            ASDF
##VAR_DIM=   8192,          8192,            8192
##UNITS=     SECONDS,       ARBITRARY UNITS, ARBITRARY UNITS
##FACTOR=    0.0002768,     1,               1
##FIRST=     0,             0,               0
##LAST=      2.2672688,     0,               0
##MIN=       0,             -195126,         0
##MAX=       2.2672688,     200470,          0
$$ Real data points
##PAGE= N=1
##DATA TABLE= (X++(R..R)), XYDATA
$$ plain form
0 0 0 0 0 0 0 0 0 0 0 0 0 0 0 0 0 0 0 0 4 -8 8 -8 8 -8 12 -16 16 -17 24 -25 30 -33 38 -45 52 -57 63 -71 82 -93
40 -93 103 -115 130 -141 156 -175 194 -213 234 -260 286 -314 347 -380 419 -462 509 -562 624 -691
60 -691 770 -861 966 -1089 1231 -1390 1537 -1529 496 12206 200470 -11102 -169793 129833
74 129833 135047 -108382 -12751 126133 -30904 -61067 43460 -21753 -63025 21614 -21126
85 -21126 -65884 26252 26366 -44534 17637 54735 -1536 15460 36961 -7540 17934 28246 -51199
98 -51199 -22710 45676 -48647 -77262 43201 10655 -77661 23200 58523 -41529 15292 80609
110 80609 -31668 -14215 98685 -20146 -93801 73843 45385 -137859 -23156 107501 -64563
121 -64563 -105244 82629 52010 -82165 9328 84841 -6699 -20095 37567 13910 -7560 2286
$$ packed form
0@%%%%%%%%%%%%%%%%%%Mj2J6j6J6j6K0k8L2l3M1m9N5o3P1q3R7j09J20j34J53j75
40i3J96k18K45k71K97l31L69m07M47m94N46o00O61p27P99q81R71j071J186j315
60f91J461j631J827k055K320k621K927l066K025J1710J88264k11572j58691K99626
74A29833N214k43429R5631J38884j57037l0163J04527o5213m1272Q4639m2740
85b1126m4758R2136J14p0900O2171L7098n6271J6996K1501m4501K5474J0312p9445
98e1199K8489O8386r4323k8615J20463l2546q8316J00861L5323j00052N6821O5317
110H0609j12277J7453J12900j18831p3655J67644k8458j83244J14703J30657j72064
121f4563m0681J87873l0619j34175R1493P5513r1540j3396N7662k3657k1470R846
$$ plain form
133 2286 -18789 -11625 8125 -30342 -32029 18250 -2371 -30100 17406 24071 -11264 16380 30092
146 30092 -8073 7625 26982 -17777 -15912 20095 -18072 -34989 13211 -4468 -36020 15103
158 15103 18782 -30695 13699 47849 -21556 -13668 58465 3930 -50608 26172 34190 -53083 -26339
171 -26339 38298 -14845 -45596 14952 20828 -19317 -1898 22908 9433 3876 7111 6037 10566
184 10566 354 -14550 -378 3478 -20143 -14822 4968 -7450 -11846 6265 4230 1345 13363
197 13363 5473 1807 19949 5375 -15855 11700 13185 -30211 -12909 23104 -18682 -35375 21473
210 21473 14555 -34537 3896 39894 -9803 -16924 34203 15946 -24357 5287 21191 -15805
222 -15805 -18169 7532 -2721 -17486 -4879 3314 -1280 -1890 1929 8713 9443 454 3114 12162
$$ packed form
133B286k1075P164J9750l8467j687N0279k0621k7729M7506O665l5335K7644J3712
146C0092l8165J5698J9357m4759J865L6007l8167j6917M8200j7679l1552N1123
158A5103L679m9477M4394L4150o9405P888P2133n4535n4538P6780Q018q7273K6744
171b6339O4637n3143l0751O0548N876m0145J7419K4806j3475n557L235j074M529
184A0566j0212j4904J4172L856k3621N321J9790j2418m396J8111k035k885J2018
197A3363p890l666J8142j4574k1230K7555J485m3396J7302L6013m1786j6693N6848
210B1473o918m9092L8433L5998m9697p121N1127j8257m0303K9644J5904l6996
222a5805k364K5701j0253j4765J2607Q193m594o10L819O784P30q989K660R048
$$ plain form
236 12162 1554 -7598 2446 857 -11273 -5625 -1502 -8585 -2327 2416 -6454 3037 14729 -3246
250 -3246 -3837 21522 6839 -18385 8411 18844 -20837 -17349 19569 -2985 -30456 5359 18786
263 18786 -17490 -10570 23813 6903 -14105 10056 18404 -6162 -6498 9821 1203 -11489 -4187
276 -4187 1220 -5557 -7577 -1626 1433 -572 -388 3828 5391 3309 3373 3946 2012 1867 610 -4293
292 -4293 -2529 1375 -6273 -9146 3367 2553 -10925 -727 13770 -1976 -9187 13045 11591 -12178
306 -12178 -1687 16710 -3877 -16021 7530 8212 -15501 -6814 12480 -1964 -12397 6051 9831
319 9831 -6333 -2796 9910 2427 -5742 2060 4527 -3318 -3580 1315 -725 -3421 -577 317 -1406
334 -1406 584 2247 -508 302 4453 1146 -3423 2490 4627 -5201 -4824 6146 101 -10655 1211
$$ packed form
236A2162j0608r152J0044j589j2130N648M123p083O258M743q870R491J1692j7975
250c246n91K5359j4683k5224K6796J0433l9681L488L6918k2554k7471L5815J3427
263A8786l6276O920L4383j6910k1008K4161Q348k4566l36J6319q618j2692P302
276d187N407o777k020N951L059k005J84M216J563k082O4N73j934j45j257m903
292d293J764L904p648k873J2513q14j3478J0198J4497j5746p211K2232j454k3769
306a2178J0491J8397k0587j2144K3551O82k3713Q687J9294j4444j0433J8448L780
319I831j6164L537J2706p483q169P802K467p845k62M895k040k696K844Q94j723
334a406J990J663k755Q10M151l307m569N913K137r828L77J0970o045j0756J1866
$$ plain form
349 1211 8886 -7004 -7541 11180 4716 -11387 2736 13343 -5529 -8574 10393 4518 -11678
362 -11678 -441 8879 -5394 -7964 5209 2513 -6488 -131 4933 -1024 -1721 3072 1766 -696
376 -696 1033 1190 -682 -216 437 -1200 -1643 456 274 -2565 -842 2916 -525 -3523 2902 4056 -4505
393 -4505 -1836 7147 -537 -7559 4323 6297 -7864 -3309 9527 -1015 -9446 5130 7201 -7664
407 -7664 -3479 8700 -78 -7716 2635 5453 -4394 -3777 4147 1568 -4094 -580 3881 95 -2892
422 -2892 1726 3327 -2042 -1528 3358 -132 -3538 1903 1262 -4346 440 3364 -4257 -1725 5934 -1989
438 -1989 -5301 6392 3043 -7903 2390 8157 -6236 -4268 9032 -821 -8634 5020 4647 -7953
452 -7953 -436 6564 -3776 -3450 5030 -344 -3174 3007 120 -2323 2925 -619 -3421 4099 771
$$ packed form
349A211P675j5890n37J8721o464j6103J4123J0607j8872l045J8967n875j6196
362a1678J1237R320j4273k570J3173k696r001O357N064n957o97M793j306k462
376f96J729J57j872M66O53j637m43K099j82k839J723L758l441k998O425J154q561
393d505K669Q983p684p022J1882J974j4161M555J2836j0542q431J4576K071j4865
407g664M185J2179q778p638J0351K818r847O17P924k579n662L514M461l786k987
422b892M618J601n369N14M886l490l406N441o41n608M786K924p621K532P659p923
438a989l312J1693l349j0946J0293N767j4393J968J3300r853p813J3654l73j2600
452g953P517P000j0340L26Q480n374k830O181k887k443N248l544k802P520l328
$$ plain form
467 771 -5956 3756 4692 -7356 136 8610 -5528 -5306 9399 -987 -9495 6795 4158 -10800
481 -10800 2693 8461 -9695 -2215 12150 -5920 -8366 13097 1267 -13448 8726 9241 -14043
494 -14043 192 14125 -9763 -8538 14230 -2123 -14215 10004 6371 -14826 2765 12592 -10119
507 -10119 -4665 13473 -2947 -8883 9615 2268 -9314 5100 4152 -8641 2415 5424 -8715
520 -8715 327 8123 -8046 -3257 11191 -4866 -8086 12328 742 -13131 9770 8602 -16103
533 -16103 1781 16374 -12596 -9956 18376 -1704 -18055 11639 9923 -17128 1072 15230
545 15230 -10329 -6876 14542 -3051 -11467 10856 3724 -13208 4702 9421 -10428 -2540 10706
558 10706 -3897 -6224 7146 582 -4895 3887 347 -3835 4405 -306 -6392 5090 2875 -9428
$$ packed form
467G71o727R712R36j2048P492Q474j4138K22J4705j0386q508J6290k637j4958
481a0800J3493N768j8156P480J4365j8070k446K1463j1830j4715K2174N15k3284
494a4043J4235J3933k3888J225K2768j6353j2092K4219l633k1197J7591R827k2711
507a0119N454J8138j6420n936J8498p347j1582J4414r48j2793J1056L009j4139
520h715R042P796j6169M789J4448j6057l220K0414j1586j3873K2901j168k4705
533a6103J7884J4593k8970K640K8332k0080j6351K9694j716k7051J8200J4158
545A5230k5559L453K1418j7593q416K2323p132j6932J7910M719j9849P888J3246
558A0706j4603k327J3370o564n477Q782l540m182Q240m711o086J1482k215j2303
$$ plain form
572 -9428 2345 8156 -8851 -2915 11894 -4396 -8749 12057 3055 -13636 6344 11450 -12752
585 -12752 -4499 14476 -4336 -12553 8727 5131 -11121 378 7565 -4327 -2344 4938 -991
598 -991 -809 3727 -1573 -1136 4274 -1461 -3548 3334 -35 -4259 1839 614 -3939 2219 1648 -4852
614 -4852 2334 5143 -5380 -1030 8093 -2786 -5774 7193 1526 -8208 3464 5179 -7774 -767
628 -767 7513 -4938 -4791 7730 -64 -7171 4724 4223 -6085 414 4822 -3232 -1307 3144 -2511
643 -2511 -864 3404 -3166 -1991 5682 -1609 -5109 5682 2492 -6722 2386 5388 -5654 -1206 5882
658 5882 -3842 -3518 5794 -2010 -5660 5905 1444 -7564 4142 5992 -7418 -154 9076 -4560
672 -4560 -5178 8627 -196 -8668 5203 4148 -9146 348 7081 -6286 -3826 7642 -1493 -5752
$$ packed form
572i428J1773N811j7007N936J4809j6290m353K0806r002j6691J9980N106k4202
585a2752Q253J8975j8812q217K1280l596j6252J1499P187j1892J983P282n929
598i91J82M536n300M37N410n735k087O882l369m224O098j225m553O158n71o500
614d852P186K809j0523M350R123j0879k988J2967n667r734J1672J715j2953P007
628g67Q280j2451J47J2521p794p107J1895n01j0308O499M408q054J925M451n655
643b511J647M268o570J175P673p291l500J0791l190r214R108L002j1042M448P088
658E882r724L24R312p804l650J1565m461r008J1706J850j3410P264R230j3636
672d560o18J3805q823q472J3871j055j3294R494O733j3367K460J1468r135m259
$$ plain form
686 -5752 6033 2416 -5570 3423 4233 -5081 699 4875 -4567 -2133 5165 -2999 -4634 4681 -61
701 -61 -5491 3303 2736 -4718 1854 4347 -3934 137 5349 -3530 -2611 6023 -1822 -6039 5244 2046
717 2046 -7906 2027 6268 -6218 -2524 7899 -1804 -5889 5911 2524 -6593 1910 4880 -5003
731 -5003 -1682 5059 -2211 -3537 4070 475 -3675 2488 2206 -3013 856 2776 -2361 -634 2471
746 2471 -1664 -1655 1895 -869 -2004 1698 -101 -1886 1920 821 -2045 2027 2061 -2788 782 3572
762 3572 -2829 -2164 4094 -931 -4850 2585 2252 -5052 -399 4414 -2268 -2717 4008 1045 -2993 2010
778 2010 2550 -2134 33 2248 -1462 -1228 1595 -886 -1917 993 16 -1876 322 967 -827 -42
794 -42 1032 239 163 410 57 734 148 -1193 512 1008 -2111 -878 2238 -1059 -2549 2335 1592 -3230
$$ packed form
686e752J1785l617p986Q993Q10r314N780M176r442K434P298q164j635R315m742
701f1n430Q794n67p454O572K493q281M071N212q879R19Q634p845m217J1283l198
717B046r952R933M241j2486L694J0423r703m085J1800l387r117Q503K970r883
731e003L321O741p270j326P607l595m150O163k82n219L869J920n137J727L105
746B471m135RL550k764j135L702j799j785L806j099k866M072L4m849L570K790
762C572o401O65O258n025l919P435l33p304M653M813o682m49O725k963m038N003
778B010N40m684K167K215l710K34K823k481j031K910r77j892K198O45j794P85
794d2J074p93p6K47l53O77n86j341J705M96l119J233L116l297j490M884p43m822
$$ plain form
812 -3230 441 3657 -1792 -2214 3324 648 -3501 878 2297 -2505 -1312 2157 -418 -1692 1325
827 1325 809 -839 881 857 -544 632 678 -1070 -164 681 -1250 -1255 474 -310 -1114 76 561 322 292
846 292 259 1168 1431 -591 -353 2183 -244 -2974 861 1663 -3611 -2049 3044 -835 -3732 2223 2729
863 2729 -2642 30 4023 -152 -1681 2304 1089 -1839 16 544 -1414 -774 -307 -1164 37 159
879 159 -1115 685 1628 -900 97 2477 -208 -1255 1642 343 -1949 345 321 -1838 150 483 -1802
896 -1802 689 1950 -2181 -195 4091 -1291 -3028 4076 1446 -5399 1009 4304 -4362 -3008 4847
911 4847 -697 -4682 3105 2727 -3476 862 3773 -1832 -590 2908 -1343 -1471 2160 -1511 -2465 2264
927 2264 -860 -3571 2532 1534 -4054 1658 4285 -3168 -702 5413 -1299 -3212 4319 347 -4815
$$ packed form
812c230L671L216n449m22N538k676m149M379J419m802J193L469k575j274L017
827A325n16j648J720k4j401J176M6j748R06Q45j931nJ729p84q04J190M85k39l0
846B92l3R09K63k022K38K536k427k730L835Q02n274J562N093l879k897N955N06
863B729n371K672L993m175j529L985j215k928J855N28j958O40M67q57J201J22
879A59j274J800R43k528R97K380k685j047K897j299k292K294k4k159J988L33k285
896a802K491J261m131J986M286n382j737P104k630o845O408L295q666J354P855
911D847n544l985P787l78o203M338K911n605J242L498m251j28L631l671r54M729
927B264l124k711O103r98n588N712K627p453K466O115o712j913P531l972n162
$$ plain form
942 -4815 2392 1803 -5546 586 3822 -4989 -1634 6129 -2354 -4420 6464 1860 -6328 3558 5415
957 5415 -5891 -1051 6391 -3381 -4639 5094 -316 -5817 3040 2328 -5077 1466 4071 -3811 70
972 70 5006 -2915 -2001 5409 -1729 -4694 4914 824 -6897 2742 4524 -6508 -952 7065 -3103
987 -3103 -4168 6512 759 -5471 3851 2957 -5435 994 3812 -4961 -1247 4729 -3533 -3285 5452
1002 5452 -603 -4731 4773 2690 -5155 2468 4748 -4746 -740 5377 -3614 -3866 4991 -1327 -6065
1017 -6065 3826 2317 -6165 1577 5641 -4096 -1341 6520 -1088 -3717 4856 1187 -5064 1811 2576
1032 2576 -4695 -904 3050 -2750 -2027 2720 -620 -1368 2530 -41 -812 3230 -207 -2505 3409 999
1048 999 -5065 1490 3630 -5265 -2126 5479 -2137 -4944 4772 2165 -5197 1886 4601 -3473 -1161
$$ packed form
942d815P207n89p349O132L236q811L355P763q483k066J0884m604q188R886J857
957E415j1306M840P442r772j258R733n410n501Q857p12p405O543K605p882L881
972G0M936p921R14P410p138k965R608m090p721R639J782j1032N556Q017j0168
987c103j065J0680n753o230R322q94q392O429K818q773L714N976q262K48Q737
1002E452o055m128R504k083p845P623K280r494M006O117q991k52Q857o318m738
1017f065R891j509q482P742M064r737K755P861p608k629Q573l669o251O875P65
1032B576p271L791L954n800P23M747l340p48L898k571p71M042l437k298N914k410
1048I99o064O555K140q895L139P605p616k807R716k607p362P083K715q074K312
$$ plain form
1063 -1161 4467 -1461 -3049 2792 220 -3305 1022 1173 -2157 329 1224 -1067 817 1262 -1323 949
1079 949 1837 -2116 -242 2685 -2207 -2196 3008 -948 -3734 2882 1508 -4449 1618 4281 -3652 -1103
1095 -1103 5753 -1309 -4181 4406 1654 -5450 976 3554 -4144 -1945 3660 -1421 -2675 2733 408
1110 408 -2017 2237 1045 -1682 1987 1290 -2457 1282 1832 -3322 -145 3014 -3139 -2270 3991 -1187
1126 -1187 -4235 3690 2144 -4700 1460 4507 -3388 -1307 4877 -1445 -3353 3701 377 -4398 2184
1141 2184 2120 -4502 352 3840 -3244 -1741 4555 -923 -3433 3619 1339 -3968 1589 2680 -3397
1156 -3397 -295 3156 -2434 -1688 3290 -979 -2623 2936 689 -3030 1889 2053 -2985 578 2733
1171 2733 -2744 -1061 3152 -1849 -2733 3232 199 -3776 2126 2416 -3252 305 3523 -1892 -1336 3341
$$ packed form
1063a161N628n928j588N841k572l525M327J51l330K486Q95k291J884M45k585K272
1079I49Q88l953J874K927m892J1N204l956k786O616j374n957O067K663p933K549
1095a103O856p062k872Q587k752p104O426K578p698K199N605n081j254N408k325
1110D08k425M254j192k727L669o97l747L739N50n154L177L159o153Q69O261n178
1126a187l048P925j546o844O160L047p895K081O184o322j908P054l324m775O582
1141B184o4o622M854L488p084J503O296n478k510P052k280n307N557J091o077
1156c397L102L451n590P46M978m269j644N559k247l719M919J64n038L563K155
1171B733n477J683M213n001q84N965l033l975N902K90n668L557L218n415N56M677
$$ plain form
1187 3341 -684 -2521 2493 443 -3330 1260 1727 -3358 -341 2985 -1978 -1820 3175 151 -2347
1202 -2347 2136 1646 -2088 705 1981 -1669 -491 1780 -1351 -1394 1436 -754 -1845 1267 252 -1733
1218 -1733 1042 1242 -1432 656 1906 -1155 -246 2144 -828 -1614 1702 33 -2387 724 971 -2130
1234 -2130 -209 1580 -1152 -622 1896 -184 -999 1720 559 -1507 1023 1042 -1798 -212 1373 -1265
1250 -1265 -1196 1334 -129 -1321 920 729 -698 567 793 -482 259 534 -877 -138 558 -1165 -781
1267 -781 907 -531 -1146 1156 655 -1000 905 1427 -602 218 1388 -636 -674 910 -579 -1462 481
1284 481 -120 -1652 293 830 -1045 244 1761 -211 -180 1850 362 -898 959 516 -1600 -304
1300 -304 416 -1426 -1081 512 -499 -792 610 417 40 918 565 159 992 330 -791 414 374 -1554
$$ packed form
1187C341m025j837N014k050l773M590M67n085L017L326m963J58M995l024k498
1202b347M483m90l734K793J276l650J178K271l131m3K830k190j091L112j015j985
1218a733K775K00k674K088J250l061R09K390k972p86L316j669k420L111K47l101
1234b130J921J789k732N30K518k080q15K719j161k066K530J9k840J586J585k638
1250a265O9K530j463j192K241j91j427J265K26j275P41K75j411P39O96j723L84
1267g81J688j438o15K302n01j655J905N22k029Q20J170k024l8J584j489q83J943
1284D81o01j532J945N37j875J289J517j972L1K030j488j260J857m43k116J296
1300c04P20j842L45J593j011k93J402j93l77Q78l53m06Q33o62j121J205m0j928
$$ plain form
1318 -1554 -555 676 -1078 -1258 925 174 -971 944 1069 -407 526 1191 -470 -155 846 -826 -969
1335 -969 587 -598 -1509 481 413 -1173 357 1433 -305 141 1542 81 -516 826 -95 -1193 6
1352 6 -230 -1458 -332 125 -839 60 900 -144 525 1432 108 113 1586 -102 -1232 775 49 -2278
1370 -2278 -430 672 -1763 -1187 1253 -167 -899 1583 1096 -387 1379 1303 -698 415 1029 -1423
1386 -1423 -999 815 -1320 -1920 664 -101 -1691 745 1297 -683 677 1868 -229 71 1649 -321
1402 -321 -1068 857 -414 -1927 140 50 -1715 -12 1061 -841 256 1873 -226 -44 2141 69
1418 69 -1443 1284 447 -2490 -338 921 -2073 -1304 1484 -475 -1152 1777 1045 -703 1511 1650 -926
1435 -926 393 1289 -1387 -1237 701 -1244 -1918 317 -320 -1395 759 922 -434 1216 1908 -189 638
$$ packed form
1318a554R99J231j754j80K183p51j145J915J25j476R33O65j661L15J001j672j43
1335i69J556j185r11J990o8j586J530J076j738M46J401j461n97J342r21j098J199
1352Fk36j228J126M57r64Q99Q40j044O69R07j324NJ473j688j130K007p26k327
1370b278J848J102k435N76K440j420p32K482m87j483J766p6k001J113O14k452
1386a423M24J814k135o00K584p65j590K436N52j980J360J191k097L00J578j970
1402c21p47J925j271j513K067r0j765J703J073j902J097J617k099J82K185k072
1418F9j512K727q37k937K152J259k994P69K788j959o77K929p32j748K214J39k576
1435i26J319Q96k676J50J938j945o74K235o37j075K154J63j356J650O92k097Q27
$$ plain form
1452 638 1838 -579 -865 876 -910 -2083 26 -527 -2035 -2 761 -1047 420 1938 90 286
1468 286 2186 515 -666 1073 162 -1739 -274 -177 -1884 -766 275 -1074 -213 1323 33 52 1931
1485 1931 644 -273 1389 547 -1289 148 211 -1933 -786 485 -1466 -959 1319 -40 -574 1763
1501 1763 1149 -446 1388 1177 -1052 178 592 -1839 -987 491 -1759 -1445 1280 -391 -1316 2084
1517 2084 1352 -1108 1687 2351 -1259 113 2162 -1533 -1958 1397 -1101 -3081 845 454 -2691 609
1533 609 2430 -1195 162 3282 -2 -816 2615 403 -2114 1021 285 -3011 -331 804 -2690 -789
1549 -789 2043 -1281 -925 3061 456 -1433 2857 1539 -2463 1203 2056 -3137 -1016 2400 -2469 -2774
1565 -2774 2594 -146 -3178 2265 2393 -2518 947 3502 -1579 -863 3061 -962 -2549 1951 -196
$$ packed form
1452F38J200k417k86J741j786j173K109n53j508K033P63j808J467J518j848J96
1468B86J900j671j181J739r11j901J465R7j707J118J041j349Q61J536j290J9J879
1485A931j287r17J662q42j836J437O3k144J147J271j951N07K278j359n34K337
1501A763o14j595J834k11k229J230M14k431Q52J478k250L14K725j671r25L400
1517B084p32k460K795O64l610J372K049l695m25L355k498j980L926l91l145L300
1533F09J821l625J357L120l284q14L431k212k517L135p36l296K680J135l494J901
1549g89K832l324L56L986k605j889M290j318m002L666Q53n193K121L416m869l05
1565b774N368k740l032N443J28m911L465K555n081P16L924m023j587M500k147
$$ plain form
1580 -196 -3504 939 1246 -3053 192 2861 -1577 -633 3481 -11 -1633 2696 750 -2651 1043 1124
1596 1124 -3196 -520 1808 -2570 -1566 2645 -745 -1867 3019 1324 -2068 2135 2508 -2372 187
1611 187 2659 -2339 -2061 2251 -1175 -3349 1619 790 -3033 867 2565 -1631 35 3224 -464 -1013
1627 -1013 2589 -1 -2218 1349 373 -3000 95 1274 -2493 -755 2233 -869 -1100 2446 621
1642 621 -1304 1784 1197 -1660 548 1171 -2009 -682 1291 -1666 -1490 1599 -316 -1643 1730 1173
1658 1173 -1509 1133 2054 -1351 -310 1948 -1043 -1699 1186 -258 -2272 579 710 -1586 253 1628
1674 1628 -597 67 1846 -59 -418 1556 -83 -1379 590 136 -1911 -279 506 -1414 -631 1100
1690 1100 -255 -306 1447 432 -196 1309 570 -771 690 504 -1521 -315 613 -1552 -1057 1062 -458
$$ packed form
1580a96l308M443L07m299L245K669m438R44M114l492j622M329j946l401L694Q1
1596A124m320K676K328m378J004M211l390j122M886j695l392M203L73m880K559
1611A87K472m998K78M312l426k174M968q29l823L900J698m196J666L189l688n49
1627a013L602k590k217L567r76l373L095J179l767J738K988l102k31L546j825
1642F21j925L088n87k857K208O23l180J327J973k957J76L089j915j327L373n57
1658A173k682K642R21l405J041K258k991o56K885j444k014K851J31k296J839J375
1674A628k225O64J779j905l59J974j639j296J969m54k047J632P85j920P83J731
1690A100j355n1J753j015o28J505p39j341J461j86k025J206R28k165M95K119j520
$$ plain form
1707 -458 -1244 1175 777 -834 835 1434 -469 76 1182 -442 -768 502 -443 -1148 147 -194 -1078
1724 -1078 413 441 -818 453 1187 -456 1 1399 -114 -855 732 145 -1214 -21 255 -876 -245
1741 -245 543 -458 44 945 -197 -76 1238 -52 -802 940 335 -1488 -28 795 -1261 -847 967
1758 967 -234 -907 793 615 -614 555 914 -493 211 702 -588 -352 526 -698 -843 509 -363
1775 -363 -1032 567 454 -865 405 1164 -427 -80 1203 -11 -628 724 199 -875 127 223 -805
1792 -805 -37 242 -732 -38 748 -550 -248 1185 -66 -836 953 675 -1132 166 1012 -780 -567 770
1810 770 -144 -754 509 210 -541 447 282 -565 344 546 -768 -74 833 -574 -666 803 -51 -885 510
1829 510 552 -711 206 774 -469 -151 772 -293 -529 591 -125 -713 383 73 -858 302 513 -703
$$ packed form
1707d58p86K419l98j611J669N99j903N45J106j624l26J270r45p05J295l41q84
1724a078J491K8j259J271P34j643M57J398j513p41J587n87j359J193K76j131O31
1741b45P88j001N02R01j142J21J314j290p50J742o05j823J460Q23k056M14J814
1758I67j201o73J700j78j229J169L59j407P04M91j290K36Q78j224j45J352q72
1775c63o69J599j13j319J270P59j591L47J283j214o17J352n25j074J002R6j028
1792h05P68K79r74O94P86j298L02J433j251p70J789k78j807J298Q46j792K13J337
1810G70r14o10J263k99p51R88j65q47R09K02j314O94R07j407r2J469q54q34J395
1829E10M2j263R17N68j243L18R23j065k36J120p16n88J096l10r31J160K11j216
$$ plain form
1847 -703 66 955 -484 -422 1188 116 -871 653 590 -951 -102 681 -593 -496 498 -318 -433 477 -175
1866 -175 -384 695 200 -750 502 748 -742 -86 1051 -336 -783 728 121 -849 246 408 -630
1883 -630 -63 499 -373 -77 508 -293 -292 634 -139 -560 556 272 -707 246 647 -540 -205 734 -179 -452
1903 -452 492 126 -601 211 218 -511 8 296 -339 -113 420 -199 -143 569 31 -370 383 305 -435 57 415
1924 415 -295 -316 246 21 -381 -77 -12 -24 -110 -65 263 253 -236 -76 567 32 -507 229 515 -412 -289 406
1946 406 29 -443 32 255 -67 -33 -20 66 138 -177 -141 413 97 -457 181 396 -473 -211 534 -145 -431 458
1968 458 33 -571 337 386 -631 67 533 -447 -346 542 -205 -495 540 49 -673 545 433 -748 169
1987 169 978 -533 -372 998 -90 -752 562 306 -780 136 359 -697 33 472 -746 -165 1057
$$ packed form
1847g03P69Q89j439O2J610j072r87J524o3j541Q49P83j274R7R94q16j15R10o52
1866a75k09J079m95r50J252K46j490O56J137j387m47J511o07r70J095J62j038
1883f30N67N62q72K96N85q01JR26p73m21J116k84r79R53M01j187L35R39r13k73
1903d52R44l66p27Q12Pp29N19K88o35K26N33o19N6P12n38m01P53p8p40M92L58
1924D15p10k1N62k25m02L04O5j2q6M5L28j0m89J60O43n35n39P36K86r27J23O95
1946D06l77m72M75K23l22L4J3Q6P2l15L6N54l16n54O38K15q69K62P45o79k86Q89
1968D58m25o04R08M9j017O98M66r80J01Q88p47k90J035m91p22J218j12j181R17
1987A69Q09j511J61J370j088o62J314k56j086R16K23j056P30M39j218N81J222
$$ plain form
2004 1057 -412 -719 1241 398 -1136 598 1192 -999 -381 1158 -510 -1004 773 -13 -1193 433
2020 433 525 -982 51 936 -561 -200 999 -157 -377 845 9 -722 649 168 -1235 303 759
2037 759 -1198 -367 1224 -549 -879 1212 309 -1063 660 913 -898 108 1059 -804 -578 1056 -485
2054 -485 -1136 854 384 -1315 341 1077 -779 -292 1106 -186 -639 747 130 -781 439 260 -903
2071 -903 77 549 -666 -141 809 -315 -273 921 47 -428 708 313 -806 293 473 -1030 -366 732
2089 732 -657 -747 678 145 -752 510 702 -401 273 845 -290 -159 645 -281 -679 364 24 -962
2107 -962 -32 345 -591 -243 583 68 -93 461 310 13 351 188 -126 103 -27 -419 -50 -53 -502 -160 129
2128 129 -243 -112 384 9 -98 505 197 -208 231 232 -362 -157 188 -345 -383 77 -118 -253 187 194 -30 161
$$ packed form
2004A057j469l07J960q43j534J734N94k191O18J539j668m94J777p86j180J626
2020D33R2j507J033Q85j497L61J199j156k20J222q36p31J371m81j403J538M56
2037G59j957Q31J591j773l30K091r03j372J723K53j811J006R51j863K26J634j541
2054d85o51J990m70j699J656P36j856M87J398j292m53J386o17r11J220j79j163
2071i03R80M72j215N25R50j124M2J194q74m75J136l95j119J099J80j503O64J098
2089G32j389r0J425n33q97J262J92j103O74N72j135J31Q04r26l98J043l40r86
2107i62R30L77r36L48Q26n15j61N54j51k97L38j63l14K29j30l92L69lm49L42K89
2128A29l72J31M96l75j07O03l08m05M39Jn94K05L45n33l8M60j95j35M40Pk24J91
$$ plain form
2150 161 362 69 106 198 -42 -69 -26 -133 -174 -212 -330 -73 166 -196 -16 574 168 -175 525 455 -389 -6
2172 -6 443 -304 -534 126 -221 -707 26 39 -464 13 441 -89 175 626 72 9 571 103 -326 164 44
2193 44 -566 -161 76 -523 -310 240 -131 -204 471 289 -41 522 296 -80 326 198 -437 -7 203 -638 -460
2214 -460 384 -347 -711 436 362 -620 156 855 -170 -191 665 71 -355 222 40 -478 -13 -54 -506 38
2234 38 249 -385 23 653 -66 -221 679 273 -465 224 420 -521 -267 239 -385 -448 158 -55 -276 332 139
2255 139 -97 551 301 -186 344 475 -446 -223 462 -500 -782 243 -80 -811 5 525 -324 -92 697 237
2275 237 -23 544 274 -74 299 -7 -463 85 -157 -724 -183 168 -619 -287 661 62 -337 571 554 -199
2295 -199 138 613 -52 -249 141 -209 -244 -63 -395 -286 209 -166 -347 507 381 -286 253 758 -155 -260
$$ packed form
2150A61K01k93L7R2k40k7M3j07m1l8j18K57K39l62J80N90m06l43P00p0q44L83
2172fM49p47k30O60l47m86P33J3n03M77M28n30K64M51n54o3N62m68m29M90j20
2193D4o10M05K37n99K13N50l71p3O75j82l30N63k26l76M06j28o35M30K10q41J78
2214d60Q44p31l64J147p4r82P76O99j025k1Q56n94m26N77j82n18M65m1m52N44
2234C8K11o34M08O30p19j55R00m06p38O89J96r41K54N06o24o3O06k13k21O08j93
2255A39k36O48k50m87N30J31r21K23O85r62k82J025l23p31Q16N20q49K32P89m60
2275B37k60N67k70l48L73l06m56N48k42n67N41L51p87L32R48n99l99R08j7p53
2295a99L37M75o65j97L90l50l5J81l32J09M95l75j81Q54j26o67N39N05r13j05
$$ plain form
2315 -260 548 -2 -656 83 160 -622 -278 200 -211 -181 332 96 -14 315 192 -20 296 12 -285 183 32
2336 32 -611 -133 263 -423 -479 297 260 -343 153 578 130 -38 231 206 39 -97 -216 -41 -23 -526 -404 209
2358 209 -81 -483 107 525 -43 -60 586 446 -44 106 341 -56 -270 -158 -33 -280 -377 -103 -59 -192 -128
2379 -128 227 113 -12 282 434 51 -40 295 98 -189 -178 -10 -55 -361 -321 160 83 -371 -81 574 157 -434
2401 -434 328 654 -214 -306 436 99 -467 -119 150 -90 -145 -173 -40 251 66 -198 275 493 -268 -162 558
2422 558 -28 -638 188 230 -699 -166 427 -304 -379 513 155 -334 298 440 -193 113 281 -196 30 61 -529
2443 -529 -120 361 -556 -591 708 120 -936 452 987 -632 -341 1059 187 -779 378 454 -521 -137 228
2462 228 -356 -100 103 -440 37 562 -412 -319 917 88 -696 654 590 -849 7 801 -483 -584 798
$$ packed form
2315b60Q08n50o54P39P7p82L44M78m11L0N13k36j10L29j23k12L16k84k97M68j51
2336C2o43M78L96o86n6P76l7o03M96M25m48j68K69k5j67j36j19J75J8n03J22O13
2358B09k90m02N90M18n68j7O46j40m90J50K35l97k14J12J25k47r7K74M4j33O4
2379a28L55j14j25K94J52l83r1L35j97k87J1J68m5l06M0M81p7m54K90O55m17n91
2401d34P62L26q68r2P42l37n66L48K69k40n5k8J33K91j85k64M73K18p61J06P20
2422E58n86o10Q26M2r29N33N93p31p5Q92l58m89O32J42o33L06J68m77K26L1n90
2443e29M09M81r17l5J299n88j056J388N35j619K91J400q72r66J157P6r75L84L65
2462B28n84K56K03n43M77N25r74R3J236q29p84J350o4j439Q56P94j284j01J382
$$ plain form
2481 798 -91 -840 452 422 -666 54 668 -346 -110 585 -191 -230 549 -187 -566 669 168 -961 350
2500 350 806 -845 -383 1030 -72 -840 537 557 -641 -57 454 -309 -198 186 -284 -85 372 -367 -244
2519 -244 729 -8 -741 623 592 -787 -38 847 -387 -635 689 132 -827 219 417 -618 -77 529
2537 529 -337 -232 428 -40 -223 380 60 -220 303 148 -440 161 343 -563 -230 590 -191 -626 300 303 -487
2558 -487 -34 378 -137 -89 211 31 45 124 -107 60 313 -228 -381 355 112 -565 -27 506 -286 -353 437
2579 437 217 -362 46 330 -130 -136 121 53 -53 -71 -11 -19 -22 -84 26 75 -107 -109 142 31 -230 42 88 -151 -32
2604 -32 141 -28 -110 42 73 3 5 -65 129 193 -111 -52 270 65 -321 98 250 -296 -221 187 31 -299 58
2627 58 188 -84 -23 70 144 119 -75 -51 248 96 -350 -1 339 -260 -347 259 4 -444 113 337 -273 -104
$$ packed form
2481G98q89p49J292l0j088P20O14j014K36O95p76l9P79p36l79J235n01j129J311
2500C50M56j651M62J413j102p68J377K0j198N84N11p63J11L84m70J99M57p39J23
2519b44R73p37p33J364l1j379P49Q85j234k48J324n57r59J046J98j035N41O06
2537E29q66J05O60m68j83O03l20k80N23j55n88O01J82r06L33Q20p81m35R26Lp90
2558d87M53M12n15M8L00j80J4P9k31J67K53n41j53P36k43o77N38N33p92o7P90
2579D37k20n79M08K84m60oK57o8j06j8O0qlo2J10M9j82kK51j11k61K72M6k39J19
2604c2J73j69q2J52L1p0Kp0J94O4l04N9L22k05l86M19J52n46P5M08j56l30L57
2627E8J30k72O1R3P4k5j94K4K99j52m46L49L40n99q7O06k55m48N57K24o10J69
$$ plain form
2649 -104 315 -23 -220 206 100 -196 186 114 -195 83 112 -268 0 227 -257 -192 304 -80 -374 263 199
2670 199 -351 37 389 -166 -196 278 -8 -204 157 37 -226 167 12 -348 134 152 -355 -17 405 -269 -302
2691 -302 448 72 -412 143 329 -321 -104 431 -163 -196 275 -6 -186 203 139 -227 120 184 -264 -40 241
2712 241 -214 -149 262 -136 -292 234 148 -353 172 319 -253 50 322 -29 -130 273 -12 -198 20 -69 -312
2733 -312 123 56 -347 -11 343 -181 -156 428 107 -259 271 262 -249 28 236 -156 -182 201 -129 -210 186 -47
2755 -47 -322 94 99 -238 50 221 -64 -100 201 2 -142 111 -41 -137 168 44 -288 59 194 -206 -92 244
2777 244 -92 -226 158 81 -225 34 71 -126 26 202 -117 -62 218 -63 -142 177 102 -187 32 121 -177 -92
2799 -92 95 -92 -180 141 -19 -192 57 166 -124 44 167 -21 -69 105 78 30 -20 -5 0 -7 -108 -131 82 25
$$ packed form
2649a04M19l38j97M26j06k96L82p2l09K78K9l80K68K27m84O5M96l84k94O37o4
2670A99n50L88L52n55l0M74k86j96L61j20k63L93j55l60M82J8n07L38M22o74l3
2691c02P50l76m84N55J86o50K17N35n94l3M71k81j80L89o4l66L47O4m48K24K81
2712B41m55O5M11l98j56N26q6n01N25J47n72L03K72l51j01M03k85j86K18q9k43
2733c12M35o7m03L36L54n24K5N84l21l66N30rn11K77K08l92k6L83l30q1L96k33
2755d7k75M16Nl37K88J71k85l6L01j99j44K53j52r6L05j24l32L47J35m00J14L36
2777B44l36j34L84p7l06K59L7j97J52J76l19N5K80k81p9L19p5k89K19Q9k98Q5
2799i2J87j87q8L21j60j73K49J09k90J68J23j88m8J74k7m8n0J5Npj01k3K13n7
$$ plain form
2823 25 -164 -25 169 -33 -131 174 145 -176 -9 235 -10 -149 -16 159 -65 -85 36 22 -49 -73 -26 -8 39
2846 39 -104 32 44 5 -88 21 85 -100 -105 189 36 -152 72 107 -72 -159 174 8 -162 14 107 -145 -158 127
2870 127 0 -167 -30 96 5 -81 69 137 56 -20 2 245 54 -305 -9 335 -198 -296 200 208 -449 -106 345
2893 345 -111 -216 205 149 -110 17 112 -19 42 81 -145 -10 164 -254 -150 293 -90 -345 163 182 -286 38
2915 38 306 -193 -88 321 -64 -232 229 173 -263 -7 148 -156 -91 130 -123 -105 158 -183 -203 344 32 -371
2937 -371 287 279 -436 -128 578 -104 -500 300 288 -337 -57 336 -57 -109 99 -25 -43 130 -164 -163 256 -120
2959 -120 -388 215 205 -372 20 409 -169 -297 399 87 -428 167 275 -395 -51 333 -135 -232 256 8 -301
2980 -301 52 90 -217 148 53 -234 123 320 -228 -116 444 42 -317 230 334 -304 -115 255 -52 -248 -1
$$ packed form
2823B5j89J39J94k02r8L05k9l21J67K44k45j39J33J75k24k0J21j4p1k4M7J8M7
2846C9j43J36J2l9r3J09O4j85nK94j53j88K24L5j79q7L33j66j70J76R3k52j3K85
2870A27j27j67J37J26r1q6J50O8q1p6K2K43j91l59K96L44n33r8M96Qo57L43M51
2893C45m56j05M21n6k59J27R5j31O1L9k26J35J74m18J04M43l83k55N08J9m68L24
2915C8K68m99J05M09l85j68M61n6m36K56J55l04O5K21k53J8K63l41k0N47l12m03
2937c71O58qp15L08P06o82l96Q00j2o25K80L93l93n2K08j24j8J73k94JM19l76
2959a20k68O03j0n77L92L89n78j28O96l12n15N95J08o70L44L84m68r7M88k48l09
2980c01L53L8l07L65r5k87L57J97n48J12N60m02l59N47J04o38J89L70l07j96K47
$$ plain form
3001 -1 75 -47 -10 -95 -114 179 -107 -248 281 254 -334 -23 406 -82 -351 296 225 -387 -46 376 -216 -268 237
3024 237 63 -215 19 190 -73 -84 148 85 -8 -11 38 101 145 -141 -4 152 -32 -218 100 193 -158 -209 127
3047 127 171 -112 -31 199 49 -191 -35 199 10 -231 -50 114 9 -107 -3 244 -9 -211 122 243 -173
3068 -173 -204 233 47 -303 -24 253 -190 -302 247 189 -212 -17 362 59 -164 204 191 -136 -64 96 -35
3089 -35 -88 -111 -56 35 -70 -213 127 266 -110 -175 333 191 -254 53 317 -125 -299 114 123 -243 -152 65 -23
3112 -23 -82 -32 32 202 -42 -101 240 270 -209 -126 369 -31 -448 112 284 -364 -236 389 32 -328 129 348
3134 348 -205 -57 259 72 -90 3 47 -28 -64 -158 9 176 -136 -140 275 59 -232 44 406 -159 -179 293 72
3157 72 -280 5 204 -117 -171 58 -6 -1 -100 18 168 194 -121 40 354 -25 -333 294 272 -416 -212 299 -79
$$ packed form
3001aP6j22L7q5j9K93k86j41N29k7n88L11M29m88k69O47p1o12L41M22n92n2N05
3024B37j74k78K34J71k63j1K32o3r3lM9O3M4k86J37J56j84j86L18R3l51n1L36
3047A27M4k83Q1K30j50k40J56K34j89k41J81J64j05j16J04K47k53k02L33J21m16
3068a73l1M37j86l50K79K77m43j12N49n8m01J95L79l03k23L68j3l27P2J60j31
3089c5n3k3N5R1j05j43L40J39l76o5N08j42m45L07K64m42j74M13Rl66R1K17q8
3112b3n9N0O4J70k44n9L41L0m79Q3M95m00m17N60J72o48J28O25l57l60M57K19
3134C48n53J48L16j87j62R3M4p5l6r4J67J67l12mM15k16k91K76L62n65k0M72k21
3157G2l52K85J99l21n4K29o4Nr9J18J50K6l15J61L14l79l08O27k2o88K04N11l78
$$ plain form
3180 -79 -448 75 272 -235 -114 286 82 -80 5 210 118 -41 -31 140 59 -172 -149 206 -82 -370 74 283
3202 283 -224 -183 340 93 -239 155 289 -36 -95 144 68 -79 -88 -4 -37 -60 -120 -5 128 -138 -164 156 120 -219
3226 -219 15 266 -7 -266 80 162 -197 -163 167 94 -172 -13 143 131 -136 10 295 52 -128 77 291
3247 291 -150 -307 126 118 -242 -116 300 -41 -252 128 252 -125 -69 268 146 -84 -83 98 35 -142 -161 64
3269 64 -29 -139 -74 173 23 -162 102 232 6 -70 178 213 -111 0 156 51 -144 -73 114 -72 -172 -37
3291 -37 172 54 -139 74 136 -84 -73 165 94 -121 -53 124 -36 -145 41 98 -121 -135 8 93 -103 -38 126
3314 126 35 -89 -20 229 -4 -144 68 121 -29 -126 96 26 -15 10 111 82 85 -65 95 168 -53 -69 139 30
3338 30 -254 -59 175 -43 -207 140 88 -134 -43 115 47 -42 71 89 38 23 -15 52 104 -91 -99 69 -111 -154 121
$$ packed form
3180g9l69N23J97n07J21M00k04j62Q5K05r2j59J0J71q1k31K3L55k88k88M44K09
3202B83n07M1N23k47l32L94J34l25n9K39p6j47rQ4l3k3o0J15J33k66k6L20l6l39
3226b19K34K51k73k59L46Q2l59L4L30p3k66J59J56j2k67J46K85k43j80K05K14
3247B91m41j57M33ql60J26M16l41k11L80J24l77N6L37j22k30JJ81o3j77j9K25
3269F4r3j10O5K47j50j85K64J30k26p6K48L5l24J11J56j05j95P1J87j86j00J35
3291c7K09j18j93K13O2k20J1K38p1k15O8J77j60j09J86N7k19j4J43Q5j96O5J64
3314A26r1j24O9K49k33j40K12N3j50r7K22p0m1K5J01k9Lj50J60P3k21j6K08j09
3338C0k84J95K34k18j64L47n2k22R1J58o8q9J13J8n1j5l8O7N2j95qJ68j80m3K75
$$ plain form
3363 121 156 -135 12 262 -55 -34 277 80 -167 72 115 -35 -90 108 -54 -158 23 -103 -85 107 -27 -152
3385 -152 138 146 -240 55 349 -108 -204 148 136 -214 -100 79 -95 -54 45 -2 45 116 -88 27 278 -107 -150
3408 -150 229 54 -362 23 253 -295 -187 289 27 -182 219 159 -156 60 277 -39 -59 148 -51 -156 21
3429 21 -69 -126 6 -83 -160 73 119 -129 106 305 -99 -76 291 98 -256 110 98 -220 -86 83 -96 -141 47
3452 47 8 -96 215 141 -57 267 171 -147 52 232 -179 -214 126 -81 -327 5 116 -128 -53 120 41 -20 141
3475 141 67 -41 75 -30 -56 67 -98 -105 66 57 -212 -55 141 -108 -156 199 95 -120 115 174 -51 -76 150
3498 150 10 -133 37 13 -159 -62 49 7 0 87 50 17 63 -8 -66 69 -20 -91 -70 20 -98 -72 -53 -21 -29 17 26 77
3526 77 15 152 149 16 23 30 -4 -46 -83 -68 -18 -94 -97 -23 37 -23 -56 108 141 -10 66 137 7 -41 29 -13 -150 -19 -30
$$ packed form
3363A21L5k91J47K50l17K1L11j97k47K39M3j50n5J98j62j04J81j26J8J92j34j25
3385a52K90Ql86K95K94m57r6L52j2l50J14J79j74M1R9m7M7P1k04J15K51l85m3
3408a50L79j75m16L85K30n48J08M76k62k09M01o0l15K16K17l16k0K07j99j05J77
3429B1r0n7J32q9p7K33M6k48K35J99m04K3L67j93l54L66j2l18J34J69j79m5J88
3452D7l9j04L11p4j98L24r6l18J99J80m11l5L40k07k46L32J11k44P5J73p9o1J61
3475A41p4j08J16j05k6J23j65pJ71rk69J57J96k49m8L55j04k15K35N9k25k5K26
3498A50j40j43J70k4j72R7J11m2pQ7l7l3M6p1n8J35q9p1K1R0j18K6J9L2qM6RN1
3526G7o2J37lj33PPl4m2l7J5N0p6lP4O0o0l3J64L3j51P6P1j30m8P0m2j37J31j1
$$ plain form
3555 -30 -127 -88 49 -87 -12 66 59 -73 99 128 -21 32 147 -54 -144 -52 43 -98 1 37 -10 -48 51 33 35 119 115 29
3583 29 105 24 -47 22 4 -114 -26 39 -121 -91 131 55 -87 87 125 -79 41 95 -48 -41 47 -59 -147 -12 -66 -114
3609 -114 7 30 -113 78 191 -18 47 288 122 -103 140 111 -160 -132 49 -81 -159 44 25 -71 -7 62 27
3632 27 39 38 36 135 101 -65 42 99 -141 -151 106 -47 -271 61 121 -132 -21 136 103 -38 67 104 18 -50 58
3657 58 7 -28 -25 -87 39 -33 -140 -11 133 26 -75 150 134 -58 21 132 22 -72 53 -1 -180 -127 29 -39
3681 -39 -81 -11 109 87 3 14 124 83 -75 -7 142 -60 -137 0 42 -171 -79 118 64 -92 56 151 67 -49 127
3706 127 145 -14 -30 58 5 -71 -74 -11 7 -167 -103 69 -43 -113 54 123 11 -43 98 146 -105 -44 22 -22 -105 -72
3732 -72 63 -2 -125 3 80 41 -25 105 79 -12 -122 111 12 -77 -46 20 -59 -143 -38 58 -14 -81 137 97 -46 -25
$$ packed form
3555c0r7L9J37j36P5P8pj32J72K9j49N3J15k01r0R2R5j41R9L6m7l8R9j8KQ4mq6
3583B9P6q1p1O9j8j18Q8O5j60L0K22p6j42J74L8k04J20N4j43PQ8j06q8J35n4m8
3609a14J21K3j43J91J13k09O5K41j66k25K43k9k71K8J81j30p8K03j9r6O4O9l5
3632B7J2jkR9l4j66J07N7k40j0K57j53k24L32O0k53J11J57l3j41J05L7q6o8J08
3657E8n1l5Lo2J26p2j07J29J44j07j01K25j6j92P9J11j10r4J25n4j79N3J56o8
3681c9m2P0J20k2q4J1J10m1j58O8J49k02p7J37M2k13R2J97n4j56J48R5q4j16J76
3706A27J8j59j6Q8n3p6lO3J8j74O4J72j12p0J67O9j12n4J41M8k51O1O6m4q3L3
3732g2J35o5j23J28P7l9o6J30k6r1j10K33r9q9L1O6p9q4J05R6p2o7K18m0j43K1
$$ plain form
3758 -25 156 84 -152 -17 75 -44 -115 3 32 -65 -73 81 64 -10 -5 137 60 29 -35 75 37 -146 -20 88 -44
3783 -44 -187 29 112 -44 -46 100 21 -12 98 132 -29 64 15 -13 -37 -61 -57 -5 -39 -62 -14 87 -74 -39 131 31
3809 31 -94 110 140 -56 -29 76 44 -107 27 28 -30 16 66 -47 1 85 -81 37 140 -50 2 109 4 -136
3833 -136 33 88 -111 -59 98 -57 -77 107 3 -65 77 69 -61 118 21 -81 8 58 -133 -60 41 -110 -170 101
3857 101 -11 -83 116 128 -34 39 234 -15 -52 58 61 -136 7 13 -119 -18 17 -74 -19 140 -42 -18 152 103
3881 103 -31 133 79 -80 7 26 -87 -80 68 -58 -89 79 3 -102 67 81 -100 56 159 3 -47 115 8
3904 8 -89 76 27 -104 2 119 -49 -57 95 -8 0 46 -48 -4 40 -24 -9 0 1 -88 -2 73 -63 -72 111 0 -101 15
3932 15 82 -87 -27 66 30 -77 56 -52 -74 35 -31 -76 17 -1 -40 -3 66 58 -23 75 36 1 30 64 22 -40 -10 31
$$ packed form
3758b5J81p2k36J35R2j19p1J18K9r7qJ54j7p4NJ42p7l1o4J10l8j83J26J08j32
3783d4j43K16Q3j56kJ46p9l3J10L4j61R3m9k8k4k4MN2l4k3M8J01j61L5J70j00
3809C1j25K04L0j96K7J05l2j51J34Jn8M6N0j13M8Q4j66J18J03j90N2J07j05j40
3833a36J69N5j99N2J57j55k0J84j04o8J42qj30J79r7j02Q9N0j91P3J01j51o0K71
3857A01j12p2J99J2j62P3J95k49l7J10Lj97J43Oj32J01L5r1N5J59j82K4J70m9
3881A03j34J64n4j59Q7J9j13PJ48j26l1J68p6j05J69J4j81J56J03j56n0J62j07
3904Hr7J65m9j31J06J17j68qJ52j03QM6r4M4M4o4J5RJq9Q6P5j36rJ83j11j01J16
3932A5O7j69O0R3l6j07J33j08k2J09o6m5R3j8l9L7O9qq1R8l9l5K9L4m2o2L0M1
$$ plain form
3960 31 -7 -40 49 -3 -107 14 23 62 -39 31 39 37 -19 1 37 -60 -84 2 11 -35 -8 70 23 -65 10 63 -16 -42 69 33
3990 33 -55 15 52 -53 -79 60 26 -34 20 80 -55 -15 43 -22 -39 -37 -74 -45 42 -14 -90 -13 2 -70 18 68 -21 -68 76
4019 76 62 -89 28 106 -78 -7 14 -17 -60 14 -70 11 63 -105 -60 98 -18 -122 100 117 -54 -29 87 -27 -104
4044 -104 86 6 -152 45 111 -94 -45 50 -47 -81 -5 51 -85 71 -7 -31 -20 37 -46 -12 75 -58 -49 83 -8 -72
4070 -72 64 76 -31 4 50 -34 -14 -18 21 -59 55 37 -37 116 70 -51 21 116 -38 -6 123 -34 -105 25 29 -58 -42
4097 -42 81 -77 -79 95 25 -90 33 62 -33 37 45 24 44 57 31 21 28 -70 -9 31 -37 -14 -20 32 -12 19 30 44 13 53
4127 53 -3 14 8 37 -59 37 -1 -90 -26 16 -57 -60 40 -6 -24 2 45 17 -34 76 7 -63 25 77 -18 22 15 -36 37 39 54
4158 54 -33 -17 10 2 -48 -45 0 -18 -62 -40 10 32 -76 6 -26 -31 -40 3 3 -21 14 74 17 -42 -41 -55 -25 -51 30 -20 -22 -23 47 -10
$$ packed form
3960C1l8l3Q9n2j04J21RL9j01P0Qkn6K0L6r7k4Q6Rm6K7P8m7q8P5N3p9k6J11l6
3990C3q8P0L7j05k6J39l4o0N4O0j35M0N8o5j7Kl7K9Q7n6p6P7J5p2Q8N0q9m7J44
4019G6j4j51J17P8j84P1K1l1m3P4q4Q1N2j68M5J58j16j04K22J7j71K5J16j14p7
4044a04J90q0j58J97O6k05M9R5r7l4P6N6j36J56p8k4J1N7q3L4Q7j33RJ32r1o4
4070g2J36J2j07L5M6q4K0mL9q0J14j8p4J53m6j21P2R5j54L2J29j57p1J30Mq7J6
4097d2J23j58kJ74p0j15J23K9r5P0Qk1K0J3k6j0Pr8O1M0o8K3oN2m4L1J1J4l1M0
4127E3n6J7oK9r6R6l8q9O4M2p3lJ00m6j8K6M3k8n1J10o9p0Q8N2r5M0pn1P3KJ5
4158E4q7J6K7qn0LM5j8m4K2N0K2j08Q2l2nrM3%k4L5O0n7n9Jj4L0k6Q1n0kjP0n7
$$ plain form
4192 -10 -21 21 80 17 20 52 -29 21 28 -11 -58 7 67 -59 -27 43 -67 -30 23 67 -1 22 -13 70 0 54 -37 -1 -18 -85
4222 -85 -13 23 -21 -49 -7 -33 -8 81 61 -45 16 24 -74 -24 39 -35 -12 57 70 -19 -47 63 47 57 55 4 77 14 -21 -49
4252 -49 51 12 -138 1 42 -59 -45 39 -1 -27 68 43 14 26 30 -56 25 16 -98 -45 45 -98 -116 24 26 -69 81 1
4280 1 -57 9 151 -33 -33 138 -36 -62 7 43 -108 4 34 -151 2 24 -129 -1 28 -55 -23 109 -10 -51 76
4305 76 -9 -77 31 21 -105 -72 84 -44 -93 36 69 -61 63 66 -46 34 40 -33 -1 65 2 -21 38 -3 -81 78 66
4332 66 -104 -3 114 -33 -80 65 -31 -108 -10 -8 -78 -27 71 -80 -64 94 -16 -32 104 45 -12 77 -8 -78 71 23
4358 23 -71 -30 -21 -28 -115 6 50 -4 14 41 -42 -50 52 -15 19 11 -30 -41 0 -3 -56 2 -29 -75 13 30 -22 21 56 6 -46 74
4390 74 -3 2 -78 -21 -11 -58 4 21 15 -53 -16 12 34 26 43 95 37 -19 42 29 -16 25 -23 -5 -67 -14 59 8 -4 93 87 -85
$$ packed form
4192a0j1M2N9o3LL2q1N0Pl9m7O5O0j26L2P0j10L7N3M4o8K3l5Q3p0N4r1L6j7o7
4222h5P2L6m4k8M2k6K5Q9k0j06O1Qr8N0O3p4K3O9J3q9k8J10j6J0kn1P3o3l5k8
4252d9J00l9j50J39M1j01J4Q4m0k6R5k5k9J2Mq6Q1rj14N3R0j43j8J40Kr5J50q0
4280An8O6J42j84%J71j74k6O9L6j51J12L0j85J53K2j53J28K9q3L2J32j19m1J27
4305G6q5o8J08j0j26L3J56j28m9J29L3j30J24Lj12Q0Op3L2O6o3k3N9m1p8J59j2
4332F6j70J01J17j47m7J45r6p7R8Kp0N1R8j51J6J58j10j6J36n9n7Q9q5p0J49m8
4358B3r4M1Rpq7J21M4n4J8K7q3qJ02o7L4qm1j1M1ln3N8l1m6Q8J7n2M3L5n0n2J20
4390G4p7Nq0N7J0m7O2J7oo8L7K8K2qJ7N2n8n6O1j3m5M1m8J8o2N3P3n1j2R7oj72
$$ plain form
4422 -85 -43 29 -19 -75 11 65 -79 -47 -3 11 -111 -63 38 -58 43 27 13 51 -7 7 67 28 -9 50 -15 -35 -64 -28
4450 -28 -51 -89 -43 19 -21 -34 127 -3 -19 29 55 4 -3 -10 -73 -76 32 -84 -19 37 -22 -62 89 41 -85 12 17 -47 -85
4479 -85 30 13 -49 30 31 -54 -50 29 -6 -51 44 64 12 -26 -47 -37 65 3 -29 8 -13 -76 -5 88 -81 -71 21 1 -98 3
4509 3 92 -79 -48 74 -11 -20 -58 -45 -45 -59 -1 -18 -13 -21 -39 38 -51 -27 32 92 39 6 63 103 -9 31 35 -38 -87 91 44
4540 44 -50 -18 10 -7 -36 24 -19 21 48 30 6 32 -7 -42 31 0 -95 2 -47 -27 -60 71 -23 -45 50 22 0 -23 64 40
4570 40 8 -11 -25 42 59 -5 33 34 -4 -60 -34 -11 -22 -34 -22 4 -65 51 -23 -76 -9 101 -58 -83 1 0 -5 -36 96 4
4600 4 -58 -24 38 64 -35 -59 -5 24 -32 14 97 -41 -53 37 45 -16 -43 77 65 21 28 81 76 11 26 -9 -51 -17 -27 18 -52
4631 -52 -22 32 42 -32 3 9 82 24 9 -19 -10 41 -22 14 3 -48 44 -1 -92 -9 10 -78 -62 34 -4 -13 10 26 -4 10 39 -4
$$ packed form
4422h5M2P2m8n6Q6N4j44L2M4J4j22M8J01r6J01j6j4L8n8J4O0l9l7N9o5k0k9L6
4450b8k3l8M6O2m0j3J61j30j6M8K6n1ppo3lJ08j16O5N6n9m0J51m8j26R7No4l8
4479h5J15j7o2P9Jq5MP9l5m5R5K0n2l8k1J0J02o2l2L7k1o3P1R3j69J0R2k0r9J01
4509CQ9j71L1J22q5rl8J3%j4N8j7Nqj8P7q9K4N9O0n3l3N7M0j12M0Mp3m9J78m7
4540D4r4L2K8j7k9O0m3M0K7j8k4K6l9l5P3l1r5R7m9K0l3J31r4k2R5k8k2k3Q7k4
4570D0l2j9j4O7J7o4L8Jl8n6K6K3j1j2J2K6o9J16p4n3O7J10j59k5Q4jnl1J32r2
4600Do2L4O2K6r9k4N4K9n6M6Q3j38j2R0Qo1k7J20j2m4PN3no5J5l5m2L4j0M5p0
4631e2L0N4J0p4L5OP3n8j5k8RN1o3L6j1n1R2m5r1Q3J9q8J6R6l8rK3J6l0J4K9m3
$$ plain form
4663 -4 -34 6 -43 43 49 -16 -11 43 3 -63 12 63 -24 -18 82 28 -122 46 15 -89 23 60 5 16 21 -29 -54 60 38 -14
4693 -14 95 -31 -75 17 89 -129 -23 73 -61 -113 81 20 -14 61 67 -11 13 124 -16 -17 19 -74 -44 15 15 -81 1 4
4721 4 -67 -23 38 -20 -87 80 -24 -62 62 33 -49 21 72 -73 -22 57 -50 -64 -3 27 5 94 2 6 78 84 -48 26 86
4750 86 -62 -27 29 23 -56 38 3 -115 42 70 -98 -21 44 -26 -24 49 -11 -24 1 -1 -99 46 42 -55 -29 71 -4 -71 54
4779 54 50 -9 27 56 -62 34 84 -55 10 -12 -46 -71 29 42 -11 8 87 -50 36 85 -49 -6 35 41 -77 21 -35 -59
4807 -59 -30 -79 -60 -14 22 -33 -3 36 48 -39 18 -17 18 34 48 49 34 70 -14 -59 22 8 -23 -31 -26 -59 33 -32 -7 -16 -50 11
4839 11 21 -7 -19 -10 -15 -71 36 54 -19 -12 2 8 -42 35 32 -15 6 -65 -46 -86 21 -59 27 21 33 27 26 32 5 32 -9 -10 4 23
4873 23 -47 -28 -39 -3 1 -6 -13 7 39 -19 -41 59 46 -27 18 38 -28 -11 19 -33 -85 20 -36 -32 -12 1 -72 21 67 -4 -25
$$ packed form
4663dl0M0m9Q6Oo5NN4m0o6P5N1q7OJ00n4j50J68l1j04J12L7n5J1Nn0k5J14k2n2
4693a4J09j26m4R2P2k18J06R6j34n2J94o1l4P5Op8K4J11j40jL6r3L0N9%r6Q2L
4721Dp1M4O1n8o7J67j04l8J24k9q2P0N1j45N1P9j07j4O1L0k2Q9r2MP2Oj32P4O0
4750H6j48L5N6op9R4l5j18J57K8j68P7O5p0KP3o0j3K5kr8J45mr7K6J00p5o7J25
4779E4mn9L6K9j18R6N0j39O5k2l4k5J00J3n3J9P9j37Q6M9j34M3M1Oj18R8n6k4
4807e9K9m9J9M6L6n5L0L9J2q7N7l5L5J6J4Jj5L6q4m5Q1j4l1qNl3R2o5K5rl4O1
4839A1J0k8j2Rnn6J07J8p3PJ4On0P7lm7K1p1J9m0J07q0Q6oJ2ojOk7K7m1jJ4J9
4873B3p0J9j1L6MppK0L2n8k2J00j3p3M5K0o6J7L0n2n2J05n6MK0J3p3R3M6p1k1
$$ plain form
4904 -25 71 -12 13 87 5 -57 12 69 -14 -18 20 -26 -33 19 -8 11 65 8 -13 -41 65 -3 -13 32 -51 -65 19 -35 -31 61 -7
4935 -7 -45 -20 89 -65 -4 63 -13 -24 92 29 -75 26 -13 -71 -26 14 -26 18 79 3 -32 4 24 -37 41 7 -38 2
4963 2 6 -81 -49 8 -14 -53 81 41 -29 6 56 -3 17 45 23 -25 36 20 -53 20 1 -2 12 66 38 -25 68 51 -3 75 71 -38
4995 -38 66 30 -41 -20 18 -11 -107 -25 41 -53 -55 16 10 3 32 -14 -16 20 -12 -76 -84 -11 -97 -16 -3 -55 -28 83 -2 -5 7 36
5027 36 57 11 70 -5 -31 -9 -2 -27 26 1 -60 -54 -33 24 27 46 43 68 51 -27 53 35 -70 -29 -13 -59 -98 -107 3 -9 8 38
5059 38 53 -19 32 62 45 -33 19 35 -18 -4 -51 -17 -21 -12 -36 24 15 -8 34 -5 11 -30 24 63 -4 30 30 31 0 -50 -93 4 -14
5092 -14 -6 35 6 -46 55 40 53 -66 -15 -12 -66 2 10 13 -98 12 43 8 -44 26 61 -35 -14 91 55 -38 34 -8 -9 19
5122 19 52 17 -51 67 40 -12 4 18 -2 82 -56 -46 -20 -1 -17 -43 -35 23 -49 22 -38 -28 5 9 10 -5 31 -37 42 23 -32
$$ packed form
4904b5R6q3K5P4q2o2O9N7q3mL8m6pN2k7J9N4n7k1k8J06o8j0M5q3j4Q4n4MR2o8
4935gl8K5J09j54O1O7p6j1J16o3j04J01l9n8M5M0m0M4O1p6l5L6K0o1P8l4m5M0
4963BMq7L2N7k2l9J34m0p0L5N0n9K0K8k2m8O1j6p3P3j9lJ4N4k8o3R3j7n4P8mj09
4995c8J04l6p1K1L8k9r6Q2O6r4kP1opK9m6kL6l2o4qP3q6Q1J3n2K7J11q5lJ2K9
5027C6K1m6N9p5k6K2Pk5N3k5o1OK1N7LJ9lK5j7p8Q0j8j05M1J6m6l9rJ10j2J7L0
5059C8J5p2N1L0j7p8N2J6n3J4m7L4mRk4O0rk3M2l9J6m1N4L9o7L4%Jl1n0m3R7j8
5092a4QM1k9n2J01j5J3j19N1Ln4O8QLj11J10L1l5n2P0L5r6K1J05l6r3P2m2jK8
5122A9L3l5o8J18k7n2J6J4k0Q4j38J0K6J9j6k6QN8p2P1o0J0L3MJj5L6o8P9j9n5
$$ plain form
5153 -32 4 82 -48 -41 76 3 -111 -11 28 -89 -11 76 -5 -34 65 99 -48 -59 -35 20 -60 49 -1 -73 1 -17 -74
5180 -74 -1 58 -39 53 17 -40 -74 84 -71 -22 29 -5 -96 -44 56 -32 -21 9 29 28 46 -8 25 73 7 -23 23 16 -30 -46
5210 -46 -3 -27 -69 34 39 -99 75 47 -70 19 79 -9 -49 1 14 6 -59 -42 -35 14 -39 -4 54 69 -64 31 55 -42 -96
5239 -96 41 21 -8 -34 64 23 -26 40 45 -20 9 3 20 35 -60 -8 44 -8 -57 -40 -13 -27 -58 0 -54 -10 -41 86 -8 -71
5269 -71 33 42 -55 -8 39 10 -1 13 21 -19 -39 -38 27 -18 -8 21 93 -25 20 28 49 9 -29 100 35 -21 13 84 -23 -87
5299 -87 43 -3 4 -20 18 20 -15 29 3 -9 -72 -68 -16 -75 -121 -26 73 16 -78 26 76 -63 -80 123 29 -13 34 102 10 -20
5329 -20 90 38 -24 -36 40 -18 -61 -25 41 42 -68 -24 39 9 -73 -5 86 -46 -51 25 32 -67 -29 71 27 -98 27 110 -25
5358 -25 -24 0 88 24 -14 63 52 -59 -74 71 14 -69 -72 85 6 -105 28 85 -78 -32 82 46 -40 28 27 -51 -72 -30
$$ packed form
5153c2L6P8j30PJ17p3j14J00L9j17P8Q7q1k9R9L4j47j1K4N5q0J09n0p2P4j8n7
5180g4P3N9r7R2l6n7l4J58j55M9N1l4r1N2J00q8J1L0K0jJ8n4L3M8o6l0M6pm6j6
5210d6M3k4m2J03Nj38J74k8j17Q9O0q8m0N0J3qo5J7PM9n3L5N8J5j33R5K4r7n4
5239i6J37k0k9k6R8m1m9O6No5K9oJ7J5r5N2N2n2m9J7K7j4l1N8n4M4l1J27r4o3
5269g1J04Rr7M7M7k9j1J4Qm0k0JO5m5J0K9P2j18M5QK1m0l8J29o5n6L4P1j07o4
5299h7J30m6Pk4L8Kl5M4k6j2o3MN2n9m6R5R9n7r4J04N0j39j7K03r4m2M7O8r2l0
5329b0J10n2o2j2P6n8m3L6O6Jj10M4O3l0q2O8R1j32nP6Pr9L8J00m4j25J25Q3j35
5358b5JK4Q8o4l8P7j1j11j5J45n7q3lJ57p9j11J33N7j63M6J14l6q6O8jp8k1M2
$$ plain form
5386 -30 39 -18 -75 -34 137 -9 -49 37 75 9 17 101 58 -60 21 105 10 -53 34 37 -26 -43 74 48 -77 14 127 45
5414 45 -34 -14 45 8 -79 14 51 -9 -106 28 101 -15 18 101 17 -116 -34 82 15 -120 -38 6 -80 -78 57 55 -18 -54
5442 -54 -10 47 17 -22 47 33 -76 4 108 14 -60 118 77 -73 -86 38 29 -54 -42 32 9 -81 -26 26 -19 -26 12 53 -37
5471 -37 -57 10 16 -6 -48 23 5 -86 11 66 -36 -43 39 82 -64 -81 105 51 -73 -8 60 -28 7 -19 40 7 -58 30 59
5500 59 21 -84 -14 105 -36 -52 42 -17 -89 -11 64 -21 -37 -37 43 -12 -81 -8 -36 -31 -47 49 9 -89 -58 23 21 -100 33
5529 33 101 -20 -95 61 35 -97 -44 116 49 -48 13 71 -23 -29 44 53 -7 0 14 54 -62 -62 56 115 -29 -10 71 -15 -66
5558 -66 12 86 -32 -136 16 9 -92 -80 -1 31 -68 -24 61 -36 -67 24 34 0 -43 24 98 -14 -67 21 96 -38 -83 31
5586 31 11 -97 -12 74 -29 -99 -23 16 -59 6 35 1 -3 3 30 -33 14 -16 65 -31 -31 13 23 -28 -94 23 38 -54 -15 68
$$ packed form
5386c0O9n7n7M1J71j46m0Q6L8o6QQ4m3j18Q1Q4r5o3Q7Lo3j7J17k6j25R1J13q2
5414D5p9K0N9l7q7R3L7o0r7J34P3j16L3Q3q4j33Q2J16o7j35Q2M4q6KJ35kp3l6
5442e4M4N7l0l9O9j4j09Q0J04r4p4J78m1j50j3J24rq3J2P4k3r0N5N2m5pL8M1r0
5471c7k0O7Ok2m2P1j8r1R7N5j02pQ2M3j46j7J86n4j24O5O8q8L5k6N9l3o5Q8K9
5500E9l8j05P0J19j41j6R4n9p2P8P5q5j6%Q0n5o9P3k8Nj6R6m0r8L1Q1kj21J33
5529C3O8j21p5J56k6j32N3J60o7r7O1N8r4oP3Ro0PJ4M0j16%J18N9j44J9Q1q6n1
5558f6P8P4j18j04J52pj01J2P9L2r9M4Q5r7l1R1J0l4m3O7P4j12n3Q8P5j34m5J14
5586C1k0j08Q5Q6j03p0P6L9p5O5K9l4mOK7o3M7l0Q1r6%M4J0n1o6J17J5r2L9Q3
$$ plain form
5616 68 2 -67 17 48 12 14 15 5 -17 34 50 41 -8 -85 2 12 0 -102 50 -38 -84 14 93 -62 -95 70 20 -83 -5
5645 -5 -2 -39 -66 44 77 -58 -23 17 -6 -28 -79 -19 107 5 -59 59 6 -22 -5 76 -9 -28 109 69 -42 -5 55 -7
5673 -7 3 -23 24 -24 -11 -89 -44 20 -67 -60 51 -16 -49 50 87 -97 -1 61 -19 -75 16 14 2 -10 -1 26 -21 3 -34 38 36 -13
5705 -13 65 7 -11 -76 17 54 -74 -51 81 -43 -6 25 -11 -33 -57 23 -4 -55 -46 39 18 -82 -44 39 35 -65 43 55
5733 55 -28 -53 -10 62 -24 10 23 12 -19 -13 4 3 32 0 57 15 -3 3 59 -44 -21 15 -23 -37 14 41 -5 -37 20 27 -40 9
5765 9 -21 -30 -56 3 -20 -33 41 -64 -7 12 -86 -24 23 2 -14 39 23 -40 20 7 45 -22 27 49 -18 -22 -57 3 24 42 -4
5796 -4 -3 2 -3 53 29 -103 19 43 -18 3 -10 51 -38 8 31 -43 -81 21 5 -21 4 10 -50 39 -41 -40 67 -30 -47 -8 55
5827 55 -24 -29 136 -13 -7 27 38 -46 13 56 43 -62 38 -47 -68 33 -21 -44 -24 8 -28 -43 -15 -68 4 17 -77 -3 4
$$ packed form
5616F8o6o9Q4L1l6KJj0k2N1J6rm9p7Q7J0j2j02J52q8m6R8P9j55l3J65n0j03P8
5645eLl7k7J10L3j35L5M0k3k2n1O0J26j02o4J18n3k8J7Q1q5j9J37m0j11L7O0o2
5673gJ0k6M7m8J3p8M5O4q7PJ11o7l3R9L7j84R6O2q0n6R1kj2j2RK7m7K4l7P2km9
5705a3P8n8j8o5R3L7j28K3J32j24L7L1l6k2k4Q0k7n1RQ5k1j00L8Q3mj00J08J2
5733E5q3k5M3P2q6L4J3j1l1OJ7jK9l2N7m2j8ON6j03K3L6l8j4N1K7m6l2N7Po7M9
5765Il0rk6N9k3j3P4j05N7J9r8O2M7k1j6N3j6o3O0j3L8o7M9K2o7ml5O0K1J8m6
5796dJNnN6k4j32J22K4o1K1j3O1q9M6K3p4l8J02j6k6K5Oo0Q9q0JJ07r7j7L9O3
5827E5p9nJ65j49OL4J1q4N9M3j3j05J00q5k1J01n4k3K0L2l6j5K8n3P2J3r4P4P
$$ plain form
5856 4 29 -24 5 -13 -19 54 57 -33 -13 34 30 -40 -4 33 14 -49 -14 1 34 -30 6 -3 2 -16 -2 2 -38 -83 49 12 -46 -18 -11 -19
5890 -19 -80 -7 3 -4 -19 16 0 -18 32 -12 11 8 48 -24 -59 30 17 -47 50 30 0 52 -6 -2 17 22 5 -15 -3 -24 -20 -9 -5
5923 -5 -40 -11 0 -16 -4 1 -18 32 -6 23 19 69 34 0 35 -10 -10 -9 64 -67 -49 3 14 -37 -38 21 8 2 9 1 -2 30 -22 53 8
5958 8 15 -31 -7 54 24 -19 9 -10 -50 43 -29 -71 -1 13 -47 -25 42 -14 0 -18 -33 -41 -31 41 25 -35 -19 33 58 13 -14 67
5990 67 26 -38 -6 64 31 2 -26 -10 21 -12 28 75 -20 27 -21 0 -66 37 -12 11 -31 22 -7 12 -2 -42 -41 -2 -10 -19 16
6021 16 -24 10 2 -37 -53 -22 -8 9 4 70 -2 -88 -28 -5 2 -34 -18 61 -9 -50 41 -33 14 -28 37 8 42 -11 -5 4 -37 -19 -7
6054 -7 9 -42 9 35 -31 -38 -29 -21 -2 -52 -29 13 -6 30 21 -22 -48 -36 18 -21 -3 53 40 -28 -47 -65 -17 -41 -38 40 -9 -55 -42
6087 -42 20 -8 13 4 28 -17 -23 -1 -25 -25 16 86 14 -35 9 26 5 -66 2 56 27 -52 18 11 -22 -26 -32 31 -12 22 24 -36 31 68
$$ packed form
5856DK5n3K9j8oP3Lr0K0M7mp0L6L7j9o3L5J5L3o4L6rNj8J4Mm0m5J32l7n8K8Pq
5890a9o1P3J0pj5L5j6j8N0m4K3lM0p2l5Q9j3o4R7k0l0N2n8MJ9Nj7k0J2k1MJ1M
5923el5K9J1j6J2Nj9N0l8K9mN0l5l4L5m5%JP3j31J8N2J1n1jN9j3oPqlL2n2P5m5
5958HPm6K4O1l0m3K8j9m0R3p2m2P0J4o0K2O7n6J4j8j5qJ0P2j6o0J6N2K5m5k7Q1
5990F7m1o4L2P0l3k9k8J6L1l3M0M7r5M7m8K1o6J03m9K3m2N3k9J9j4m0JL9qrL5
6021A6m0L4ql9j6L1J4J7nO6p2q6O0K3Pl6J6P9p0m1R1p4M7m2O5k9L4n3ORm1J8J2
6054gJ6n1N1K6o6pRQJ9n0K3M2j9L6rm3k6J2N4l9J8N6j3o8j9j8M8k4LP8m9m6J3
6087d2O2k8K1rK4m5oK2k4%M1P0p2m9M4J7k1p1O8N4k9p9P0pl3moO3m3L4Ko0O7L7
$$ plain form
6121 68 6 29 -24 10 13 -36 -52 4 -4 -29 -56 23 -34 -24 -26 5 -39 -51 -20 43 -80 -44 -11 -12 -44 -70 21 -2 -30 -28 6 14 -10
6154 -10 25 -8 -44 16 25 15 -27 43 62 36 -29 55 36 -21 -11 24 -8 -80 -10 -33 32 41 -40 35 -36 -22 -6 7 -54 -27 37
6185 37 -36 -68 -24 59 26 -77 -27 44 62 -54 70 51 -1 -2 17 30 9 10 46 10 20 -46 32 95 -46 2 54 35 -61
6214 -61 73 -48 -56 -3 18 -28 -76 11 25 -32 -36 -5 3 23 -25 -23 -11 3 7 10 -21 -16 -48 -3 66 -25 -10 53 12 19 14 -15 15 -3
6248 -3 32 -67 23 -1 23 -3 -25 21 3 10 -28 -18 -7 -27 -18 61 -19 34 -13 18 -8 9 15 18 0 -22 19 -14 -61 -39 48 41 16
6281 16 20 23 46 26 1 61 -7 -35 48 -3 9 19 -8 -9 -15 1 -1 9 21 75 61 -25 -35 -21 -32 -17 -60 -36 -44 -1 8 -3 -8 -2 40
6316 40 49 -22 -28 20 30 -10 -40 -19 -35 53 -10 20 -27 -52 36 -4 34 -6 22 29 23 7 -5 25 -53 57 23 -27 -9 27 10 -23
6348 -23 -38 4 28 -22 -32 63 16 -20 34 5 -6 -27 36 -31 -18 11 3 37 -6 -21 -11 -22 -14 7 -1 -7 -23 -29 -29 -41 25 12 -21
$$ packed form
6121F8o2K3n3L4Lm9j6N6qk5k7P9n7J0kL1m4j2L1O3j23L6L3jl2k6R1k3k8KL4Qk4
6154a0L5l3l6O0Rj0m2P0J9k6o5Q4j9n7J0L5l2p2P0k3O5Rq1P5p1J4J6J3o1K7O4
6185C7p3l2M4Q3l3j03N0P1J8j16J24j9n2jJ9J3k1JL6l6J0o6P8O3j41M8N2j9r6
6214f1J34j21qN3K1m6m8Q7J4n7mL1QK0m8KJ2J4MLl1Nl2M5O9r1J5O3m1Pnk9L0j8
6248cL5r9R0k4K4k6k2M6j8Pl8J0J1k0RP9q0N3m7L1k6J7OLj8k2M1l3m7K2Q7pk5
6281A6MLK3k0k5O0o8k8Q3n1J2J0k7joJ6kJ0J2N4j4q6j0J4j1J5m3K4qM3Rj1nOM2
6316D0Rp1oM8J0m0l0K1j6Q8o3L0m7k5Q8m0L8m0K8Poj6j2L0p8J10l4n0J8L6j7l3
6348b3j5M2K4n0j0R5m7l6N4k9j1k1O3o7J3K9qL4m3j5J0j1QK1qoj6o%j2O6j3l3
$$ plain form
6381 -21 -39 14 40 -22 -20 -44 -60 -22 24 -33 -30 8 20 -42 -13 1 -56 6 43 6 60 68 -11 -52 17 24 8 9 -7 -5 27 -19 -14 62
6415 62 -26 15 55 38 36 31 35 -15 4 10 41 -70 -17 29 38 -22 -18 -43 6 -9 -7 -33 -14 43 -8 -38 -22 -9 -70 34 -36 -11 59
6448 59 45 -8 8 23 -17 7 -21 14 -14 0 -31 25 11 15 43 -72 -25 -69 2 -17 -11 13 13 5 -27 1 -26 -56 32 41 -24 49
6480 49 -4 -10 -24 -18 19 -9 -43 -13 3 -1 -7 -18 37 -4 -1 -6 -28 -58 1 -5 11 -49 2 49 9 -10 -43 -54 48 -3 9 21 -24
6513 -24 -47 -46 36 -14 -8 -27 0 -52 21 8 46 -5 -32 38 12 -46 7 -4 1 -16 3 30 8 7 8 57 21 73 59 23 25 40 -29
6546 -29 32 -11 21 36 -1 59 -19 13 -22 4 -22 12 -6 -33 6 11 -31 -42 9 -48 52 -42 20 -27 3 51 53 33 32 14 1
6577 1 -10 -5 33 39 22 -3 -34 -13 -8 -40 28 -11 -29 28 -15 -76 -8 44 -16 -26 21 33 -13 -48 24 -48 -13 -28 -28 -35 -29 56 25 -1
6611 -1 -22 -33 -78 -1 9 -2 64 -13 -1 33 -28 59 6 7 29 73 -20 9 -16 3 -19 19 10 -13 35 -41 18 68 -47 -1 50
$$ packed form
6381b1j8N3K6o2Kk4j6L8M6n7LL8J2o2K9J4n7O2L7l7N4Qp9m1O9Pj6Jj6KL2m6NP6
6415F2q8M1M0j7knMn0J9OL1j11N3M6Ro0Mk5M9j5Kk6J9N7n1l0J6J3o1J04p0K5P0
6448E9j4n3J6J5m0K4k8L5k8J4l1N6j4MK8j15M7m4P1j9OK4%ql2K8k7l0Q8Ro5P3
6480D9n3oj4OL7k8l4L0J6moj1N5m1Lnk2l0N9oJ6o0N1M7m0j9l3j1J02n1J2J2m5
6513b4k3JQ2n0Oj9K7n2P3j3L8n1k7P0k6n8N3j1Nj7J9K7k2jJM9l6N2j4l6KJ5o9
6546b9O1m3L2J5l7O0p8L2l5K6k6L4j8k7L9Nm2j1N1n7J00r4O2m7L0M8Kk0jj8j3
6577Aj1NL8Oj7k5l1K1Nl2O8l9j8N7m3o1O8N2o0j0M7J2m6l5P2p2L5j5%pOQ5l1k6
6611ak1j1m5P7J0j1O6p7J2L4o1Q7n3JK2M4r3K9k5J9k2L8rk3M8p6N9N0j15M6N1
$$ plain form
6642 50 10 -22 32 -1 12 -6 -33 -5 -29 -8 49 3 -85 9 -16 23 8 40 41 22 1 39 26 -13 63 11 1 33 -41 -2 19
6673 19 2 -30 -21 22 4 2 -21 -17 48 10 -21 -27 -4 -55 -20 30 17 10 -6 -14 33 55 14 12 -24 -20 -25 8 3 15 -42 -17 -30 -3 25
6708 25 24 28 45 11 16 36 -15 -42 -29 16 26 -5 -15 -11 -3 -10 42 -6 -54 25 -11 32 0 36 -33 -9 -29 -34 -6 -29 7 47 42 -8
6742 -8 24 -28 -15 34 16 35 13 -45 36 10 -40 17 -4 -56 37 5 3 -31 -9 -13 -29 1 60 31 -52 82 13 -78 -23 -30 46 34
6774 34 12 -11 28 12 28 29 -13 39 5 29 46 2 43 43 2 -45 22 55 38 25 -23 33 23 17 -56 73 44 63 -12 -24 -17 38
6806 38 29 18 8 -43 -5 44 -4 -2 -17 35 2 -13 -63 0 36 -15 19 9 45 23 -56 -7 39 4 105 -17 18 -19 -9 -14 42
6837 42 40 25 -7 29 -29 -19 -33 12 -25 -22 -26 -41 12 -24 -8 35 -23 49 27 57 -18 20 -17 -4 -18 2 35 6 -14 65 -18 10
6869 10 7 66 -17 -3 8 37 43 57 11 -37 -17 19 28 51 -6 -3 31 -42 -37 37 1 -23 31 -15 17 19 -60 -28 9 -20 34 -6 30
$$ packed form
6642E0m0l2N4l3J3j8k7K8k4K1N7m6q8R4k5L9j5L2Jj9k1L8j3l9P6n2j0L2p4L9K1
6673A9j7l2RM3j8kk3MO5l8l1oK3n1L5N0j3pj6qM7K2m1kl6MnL3nJ2n7K5j3K7K8
6708B5jMJ7l4NK0n1k7J3M5J0l1j0MQpN2m8m8P9l6M3l2L6o9K4k0nK8k3L6M0nn0
6742hL2n2J3M9j8J9k2n8Q1k6n0N7k1n2R3l2kl4K2mj6L0N9k9q3J34o9r1N5pP6j2
6774C4k2k3L9j6J6Jm2N2l4K4J7m4M1%m1m7O7L3j7j3m8N6j0op3J29k9J9p5j2PN5
6806C8rj1j0n1L8M9m8Kj5N2l3j5n0O3L6n1L4j0L6k2p9M9M6l5J01j22L5l7J0nN6
6837D2kj5l2L6n8J0j4M5l7Lmj5N3l6J6M3n8P2k2L0p5L8l7J3j4K0L3k9k0P9q3K8
6869A0lN9q3J4J1K9OJ4m6m8K0L6RK3n7LL4p3NP4l6k4N4m6L2Kp9L2L7k9N4m0L6
$$ plain form
6902 30 1 4 28 -9 -19 34 6 40 28 36 -29 5 12 -15 -5 -10 26 12 0 14 -19 70 32 -2 18 -66 6 -107 -41 -54 -23 6
6934 6 -10 30 -18 -37 21 -24 -37 18 -6 79 -35 37 24 -10 -50 -6 -61 35 13 13 46 18 26 14 -1 73 25 8 6 26 26 8
6966 8 -10 -47 -3 -21 -68 -18 42 -66 -16 -11 -26 14 24 -14 -3 -50 21 37 -5 -13 42 -17 49 -11 57 -32 51 6 -11 -12 7 17
6998 17 33 -48 40 -16 62 -16 -33 -12 -14 31 11 -19 -42 18 -83 -12 48 -42 -65 -16 8 -15 -58 52 55 7 -24 36 65 6
7028 6 -46 -19 -53 27 17 15 34 -19 25 8 13 -42 34 -59 53 -10 36 -25 -35 -6 8 41 -2 -23 3 -20 38 -26 13 20 19 -6
7060 -6 -1 -9 -23 8 38 25 -51 24 -24 -19 -20 -14 20 18 8 -27 -12 27 28 -21 5 -35 -20 -1 19 -8 -54 23 18 5 -45 -60 4 22 30
7095 30 -34 8 12 -6 -44 2 12 -16 53 -33 -68 3 59 20 16 -21 -20 -42 -18 3 -30 7 6 -14 5 8 43 22 -1 9 -12 11 -4
7128 -4 5 30 25 -25 -33 19 48 -27 -15 35 23 22 -32 -49 24 8 -12 1 -41 -2 -5 -37 -5 -39 23 35 -32 3 39 -7 1 21 -69 -7
$$ packed form
6902C0k9LK4l7j0N3k8L4j2Qo5L4Pk7J0nL6j4j2J4l3Q9l8l4K0q4P2j13O6j3L1K9
6934Fj6M0m8j9N8m5j3N5k4Q5j14P2j3l4m0M4n5R6k2%L3k8Qj2j5P4m8j7kK0%j8
6966Hj8l7M4j8m7N0O0j08N0Nj5M0J0l8J1m7P1J6m2qN5n9O6o0O8q9Q3m5j7jJ9J0
6998A7J6q1Q8n6P8p8j7K1kM5k0l0k3O0j01P1O0r0k3M9K4k3m3J10Lm8l1O0K9n9
7028Fn2K7l4Q0j0kJ9n3M4j7Nn5P6r3J12o3M6o1j0K9J4L3m3k1K6k3N8o4L9Pjk5
7060fNqj4L1L0j3p6P5m8NjOL4kj0l5J5L9Jm9K6m0J5J9K0k7m6P7nj3n0j5O4J8Q
7095C0o4M2Mj8l8M6J0k8O9q6l5P1N6l9ml7Jk2K4K1l3L7jk0J9LL5k1k3J0k1K3j5
7128dRK5nn0qN2K9p5J2N0j2jn4j7P3j6k0J3m2L9ll2L2l4O2J2o7L5L6m6QK0r0O2
$$ plain form
7162 -7 51 -9 -26 -47 -2 -22 -22 4 20 25 3 4 -61 28 -29 -6 -5 -6 6 -15 -9 -44 -39 33 -51 14 1 -19 -4 -4 -17 -9 0 30 30 4
7198 4 16 35 44 42 34 18 39 2 -18 50 -6 68 -23 35 -6 -76 -3 -23 -68 -15 -16 34 8 -42 -1 -30 -45 -15 20 -38 -17 19 -20
7231 -20 12 -19 -6 -1 -45 -9 -43 21 7 -31 -41 17 27 26 17 -40 -14 49 53 -16 -9 27 24 14 45 26 -28 -25 -3 -86 -21 -37 -4 -31
7265 -31 -9 -45 -9 1 -49 6 -20 -24 19 36 -12 4 -34 11 -20 -32 44 13 -43 -45 27 13 -6 40 34 -46 12 26 2 18 -20 11
7297 11 8 -4 -28 -11 -17 -8 -59 5 -2 -42 -44 -28 -47 -1 -16 -40 6 -29 42 69 -16 -22 -16 33 25 2 4 37 26 -15 19 -40 -36 -27 -11 -56
7333 -56 11 -9 -34 -4 -17 -2 -11 -59 -34 9 -3 -26 -5 -62 -42 -46 -42 66 0 6 25 3 2 -13 31 38 -1 2 45 33 68 31 -5
7366 -5 -35 -22 -26 -16 1 -16 69 27 56 -18 -46 5 28 12 0 53 -51 -84 -2 -28 -26 0 -4 -30 56 18 8 -62 -50 0 -26 27
7398 27 -49 -50 -42 -17 12 9 -38 17 27 81 -1 15 -51 8 7 -7 52 8 -2 9 -16 57 -5 -22 51 -7 -16 -24 -33 13 -12 -37 -31 -25 -17
$$ packed form
7162gN8o0j7k1M5k0%K6J6Nk2Jo5Q9n7K3JjJ2k1Ol5NP2q4O5j3k0J5%j3QRL0%k6
7198DJ2J9Rkqj6K1l7k0O8n6P4r1N8m1p0P3k0m5N3jN0k6n0M1k9j5L0L5n8K1L6l9
7231b0L2l1J3Nm4L6l4O4j4l8j0N8J0jrn7K6O3Mo9PL6lj0L1j9n4LK2q3O5j6L3k7
7265c1K2l6L6J0n0N5k6mM3J7m8J6l8M5l1j2P6l1n6kP2j4j9M6oq0N8J4k4J6l8L1
7297A1lj2k4J7oRn1O4pm0kJ6j9M6j5k4M6l5P1K7q5oOM9qk3KL3j1m1L4n9MRJ6m5
7333e6O7k0k5L0j3J5rm8K5M3j2k3K1n7K0mMJ08o6OJ9k2jj5M4Pl9LM3j2L5l7l6
7366el0J3mJ0J7j7Q5m2K9p4k8N1K3j6j2N3j04l3Q2k6KK6mk6Q6l8j0p0J2N0k6N3
7398B7p6jQK5K9lm7N5J0N4q2J6o6N9jj4N9m4j0J1k5P3o2j7P3n8rqrM6k5k5OOQ
$$ plain form
7433 -17 -37 -54 11 -16 -17 -31 -12 1 -15 -37 -17 8 -4 63 -8 -63 -16 -7 4 10 -20 -6 -34 -1 53 20 25 34 15 35 38 28 15
7466 15 -34 -56 36 -9 -50 -16 -52 -36 -9 -33 -10 -10 -1 10 -23 11 48 26 22 -9 -21 -7 -1 27 13 -16 -31 -23 10 -3 3 -43 -12
7499 -12 36 -19 0 35 -2 25 -15 11 -6 17 17 -14 -57 -37 -46 -42 -30 -17 -87 -11 17 -68 -41 -64 -64 63 24 -72 -17 -24 49 5
7531 5 -2 24 -24 9 -3 58 11 44 -22 26 -28 -27 -23 42 28 -30 35 -59 10 -31 -2 -17 -35 5 2 -22 -33 2 17 -17 11 28 -58
7564 -58 2 4 2 -11 29 11 9 3 14 46 -10 9 -9 -40 -17 27 6 34 23 6 12 -33 2 50 -1 -8 2 -4 -26 -13 7 26 -26 -3
7598 -3 -22 25 5 8 -8 -11 -2 -61 0 -36 -3 -12 27 29 -23 -10 6 -2 8 30 48 28 21 -19 40 9 -14 -21 0 10 -20 -30 24 -39 -63
7633 -63 14 -53 1 -52 -16 -20 6 -1 -13 -17 18 18 7 1 -31 -3 -18 -53 -52 5 33 -20 -30 30 -4 13 14 36 25 -3 12 -34 -26 -24 -33
7668 -33 -30 27 -21 -49 12 16 7 -44 1 13 26 18 28 37 8 4 -9 -12 -36 33 23 53 -29 13 19 -15 -29 -36 -24 14 -3 46 14 14 -23
$$ packed form
7433a7k0j7O5k7jj4J9J3j6k2K0K5j2O7p1n5M7RJ1Ol0J4k8L3N4l3NRj9K0Lj0j3
7466A5m9k2R2m5m1L4l6J6K7k4K3%RJ1l3L4L7k2ml1j2J4OK8j4k9j5QL3j3Om6L1
7499a2M8n5J9L5l7K7m0K6j7K3%l1m3K0rMJ2J3p0P6K8q5K7k3%J27l9r6N5pP3m4
7531EpK6m8L3j2O1m7L3o6M8n4JMO5j4n8O5r4O9m1K9j5j8M0lk4j1L5J5l4K8J7q6
7564e8O0Kkj3M0j8koJ1L2n6J9j8l1K3M4k1K8j1j7Om5L5M8n1pJ0ok2J3K0J9n2K3
7598cj9M7k0Lj6lRn9O1l6L3rL9Kn2J3J6qJ0K2J8k0pm0N9l1k3pK1J0l0j0N4o3k4
7633f3P7o7N4n3L6mK6pj2mL5%j1ol2K8j5l5JN7K8n3j0O0l4J7JK2j1k8J5m6QKr
7668c3LN7m8k8O1Mrn1M5J2J3qJ0Rk9mj3lk4O9j0L0q2M2Ol4j4pJ2L8j7M9l2%l7
$$ plain form
7703 -23 24 -38 14 19 -38 41 26 -10 -75 15 -8 48 -25 33 -44 5 -9 -24 28 -79 -32 -13 0 15 -18 -17 -28 -50 -27 -18 -8
7734 -8 -18 23 6 -2 11 -15 -12 3 -7 1 2 -11 -59 -6 -10 23 12 13 -9 -41 -15 -9 16 -11 -7 1 -7 -5 -23 19 -71 -7 -5 5 14 10 26 -21
7772 -21 -54 13 39 -6 63 47 18 -3 -45 -56 -20 30 -5 49 -7 6 18 13 45 30 -26 2 -36 -38 -39 15 27 4 12 43 -18 -4
7804 -4 64 -5 3 -21 46 -8 -13 -39 -39 -10 -43 15 -16 10 -56 -1 44 -48 2 -12 25 -8 30 1 18 -50 49 16 1 -47 -37 -27
7836 -27 12 -46 68 -10 5 -16 -20 -33 27 -1 13 -50 -31 3 11 26 -15 17 27 -8 6 -46 24 19 -66 15 20 -18 4 25 26 44
7868 44 51 -17 -29 25 -49 -8 -28 8 45 19 -26 14 19 26 17 15 24 14 29 -8 -17 -77 3 24 -33 -56 -39 8 -27 7 -1 30 -45 3
7902 3 -14 45 -8 -40 33 -28 -54 32 4 15 38 -60 -45 -32 -54 12 -22 -15 26 55 42 7 11 26 -30 -32 -6 -45 -87 -21 60 -10
7934 -10 -45 21 22 0 6 -9 -45 -2 -27 6 10 1 -23 32 -15 16 49 54 -30 29 -59 2 -39 5 -27 -40 -35 11 10 -64 -2 29 -4 18
$$ packed form
7703b3M7o2N2Nn7P9j5l6o5R0k3N6p3N8p7M9j4j5N2j07M7J9J3J5l3Jj1k2K3RJ0
7734hj0M1j7qJ3k6LJ5j0QJj3m8N3mL3j1Jk2l2K6OK5k7MQqKj8M2r0O4KJ0RmJ6m7
7772b1l3O7K6m5O9j6k9k1m2j1L6N0l5N4n6J3J2nL2j5n6K8l8kjN4J2k3QL1o1J4
7804dO8o9Qk4O7n4nk6%K9l3N8l1K6o6N5M5r2N0j4L7l3L8k9J7o8R9l3j5m8J0J0
7836b7L9n8J14p8J5k1mj3O0k8J4o3J9L4QJ5m1L2J0l5J4n2P0nq5Q1Nl8K2K1JJ8
7868D4Po8j2N4p4M1k0L6L7k6m5M0NPrkRj0J5l7ro0Q0K1n7k3J7M7l5L4qL1p5M8
7902Cj7N9n3l2P3o1k6Q6k8J1K3r8J5J3k2O6l4PM1K9j3l5MJ5n6kK6l9m2O6Q1p0
7934a0l5O6Jk2Oj5l6M3k5L3Mrk4N5m7L1L3Nq4N9q8O1m1M4l2j3NM6jp4O2L1l3K2
$$ plain form
7968 18 -13 23 -45 -27 -4 -2 10 -41 14 -51 -38 -30 -9 -34 -33 0 -19 9 -11 -32 20 -50 70 -14 -23 -36 -20 38 63 42 15 -5
8000 -5 -35 28 13 5 32 13 -57 1 9 10 1 -22 -25 17 24 33 -18 6 10 10 -58 3 30 -14 34 2 6 1 9 44 23 -13 43 15 -13 -18 44
8037 44 64 30 -4 -29 42 13 8 24 22 -4 13 39 -22 33 -23 0 -27 -24 -52 -5 -7 -22 23 -7 -2 -12 -35 11 -39 8 -4 4 13 -58
8071 -58 -54 -16 -7 -31 -29 -12 43 20 47 -17 14 19 -2 34 -7 18 43 -32 -70 -14 12 -3 -12 1 16 32 -3 4 -37 34 -14 12 -17
8104 -17 24 17 -5 -15 -13 20 22 -14 -21 -7 3 -9 29 45 -71 -45 3 8 1 -2 45 -70 -13 -9 -39 11 -31 17 -22 39 18 -53 0
8137 0 -29 -19 -17 9 -16 -70 12 4 4 11 16 2 -19 -12 -1 -11 -14 37 -10 -13 -12 59 -7 3 3 -17 24 -38 -33 -6 59 -30 27 14 52 -84
8173 -84 -41 -21 35 13 -18 -9 -47 0 -26 12 -37 -39 -32 -13 -58 2 -31 20
$$ packed form
7968A8l1L6o8J8K3KJ2n1N5o5J3QK1k5JL3j9K8k0k1N2p0J20q4rj3J6N8K5k1k7k0
8000el0O3j5qK7j9p0N8QJrk3lM2PRn1K4M%o8O1K7m4M8l2MnQL5k1l6N6k8k8nO2
8037D4K0l4l4k5P1k9nJ6kk6J7K6o1N5n6K3k7Lk8M7kj5M5l0Nj0k3M6n0M7j2QRp1
8071e8ML8Rk4KJ7N5k3K7o4L1Nk1L6m1K5K5p5l8N6K6j5rJ3J5J6l5Pm1P1m8K6k9
8104a7M1pk2j0KL3Kl6pJ4J0j2L8J6j16K6M8NplM7j15N7Ml0N0m2M8l9O1k1p1N3
8137@k9J0KK6k5n4Q2q%PNj4k1PJ1j0lN1m7lJP1o6J0%k0M1o2NK7O5q9N7j3L8j36
8173h4M3K0N6k2l1Rl8M7k6L8m9kPJ9m5O0l3N1
8191B0
$$ Imaginary data points
##PAGE= N=2
##DATA TABLE= (X++(I..I)), XYDATA
$$ plain form
0 0 0 0 0 0 0 0 0 0 0 0 0 8 -8 8 -8 8 -16 16 -19 24 -32 33 -41 48 -57 65 -76 89 -105 117 -137 154 -172 196
34 196 -221 251 -283 316 -351 391 -439 487 -538 595 -659 729 -804 887 -976 1074 -1184 1303
52 1303 -1437 1587 -1754 1942 -2157 2405 -2691 3031 -3438 3936 -4571 5399 -6533 8184 -10816
67 -10816 15678 -27557 116265 66088 -195126 98212 153878 -118213 -84326 116895 -31863
78 -31863 -109300 23188 6888 -70493 22117 20272 -40778 34333 63896 -25080 11898 64519
90 64519 -2066 -16904 22652 -19731 -20774 7908 -48412 -42321 40506 -20113 -67981 48989
102 48989 53003 -54828 18241 84482 -23102 -14483 71578 -22594 -54042 62043 -10462 -112159
114 -112159 36792 63289 -117162 -40136 126908 -18643 -103129 86149 90073 -76086 -11120
$$ packed form
0@%%%%%%%%%%%Qj6J6j6J6k4L2l5M3n6O5p4Q9j05J22j41J65j94K22k54K91l26L68
34A96m17M72n34N99o67P42q30R26j025J133j254J388j533J691j863K050k258K487
52A303k740L024l341L696m099M562n096N722o469P374q507R970j1932J4717j9000
67a0816K6494m3235J43822n0177k61214K93338N5666k72091L3887K01221j48758
78c1863p7437J32488j6300p7381R2610j845o1050P5111K9563q8976L6978N2621
90F4519o6585j4838L9556m2383j043K8682n6320O091Q2827o0619m7868J16970
102D8989M014j07831P3069O6241j07584Q619Q6061r4172l1448J16085p2505j01697
114a12159J48951K6497j80451P7026J67044j45551q4486J89278L924j66159O4966
$$ plain form
125 -11120 92234 -8124 -53504 21050 8555 -32987 -13095 -15148 -16413 10159 -10825 -20578
137 -20578 29898 22888 -17337 19576 37059 -9187 229 23654 -15203 -16937 12288 -21581 -31712
150 -31712 12597 -6820 -33237 15627 18582 -21787 16573 37277 -16265 3748 47150 -14520
162 -14520 -31849 39686 5161 -62969 4441 36764 -47883 -36028 44424 4473 -41309 20344
174 20344 39073 -12051 -4067 27733 8931 -6905 -82 -1620 -2254 -7138 -18854 -6438 4825
187 4825 -13728 -11299 13503 5639 -5537 12182 13403 1586 8964 5305 -5699 6529 408
200 408 -22368 -1772 10919 -25583 -17245 25784 -2826 -29123 23443 29884 -24556 -1074 42351
213 42351 -4584 -28004 22692 14687 -33722 -9207 18806 -15796 -23571 10042 6443 -12222 1782
$$ packed form
125a1120J03354j00358m5380P4554j2495m1542J9892k053j265K6572k0984r753
137b0578N0476p010m0225L6913J7483m6246R416K3425l8857j734K9225l3869j0131
150c1712M4309j9417k6417M8864K955m0369L8360K0704n3542K0013M3402o1670
162a4520j7329P1535l4525o8130O7410L2323q4647J1855Q0452l9951m5782O1653
174B0344J8729n1124P984L1800j8802j5836O823j538o34m884j1716J2416J1263
187D825j8553K429K4802p864j1176J7719J221j1817P378l659j1004J2228o121
200D08k2776K0596J2691l6502Q338M3029k8610k6297N2566O441n4440K3482M3425
213D2351m6935k3420N0696q005m8409K4515K8013l4602p775L3613l599j8665J4004
$$ plain form
226 1782 14006 5720 2454 6113 8411 6270 -3200 -4384 3560 -4257 -14609 -3979 273 -10707
240 -10707 -5430 4693 -875 1619 9591 1938 4085 15115 316 -7982 13198 5032 -22778 -2592
254 -2592 15722 -18753 -22315 18031 5757 -26231 5168 27246 -9220 -11832 24647 11545 -17399
267 -17399 3088 16600 -9488 -14180 6009 933 -13459 -4625 4854 -1586 -4107 3019 6086 2687
281 2687 1383 4221 4482 645 -897 -206 -1917 -2905 -2648 -5001 -3467 1815 -2136 -5260 5670 7621
297 7621 -5310 85 14410 862 -10996 7796 10253 -13982 -8548 12889 -3033 -18489 4552
310 4552 11677 -11967 -7075 15532 3927 -10936 6058 12962 -5139 -5523 8514 2116 -8892
323 -8892 -1280 3628 -4438 -5577 1210 552 -2734 353 2595 561 1402 3280 783 109 3282 926
$$ packed form
226A782J2224q286l266L659K298k141r470j184P944p817j0352J0630M252j0980
240a0707N277J0123n568K494P972p653K147J1030j4799q298K1180q166k7810K0186
254b592J8314l4475l562M0346j2274l1988L1399K2078l6466k612L6479j3102k8944
267a7399K0487J3512k6088m692K0189n076j4392Q834R479o440k521P126L067l399
281B687j304K838K61l837j542O91j711r88K57k353J534N282l951l124J0930J951
297G621j2931N395J4325j3548j1858J8792K457k4235N434K1437j5922j5456K3041
310D552P125k3644M892K2607j1605j4863J6994O904j8101l84J4037o398j1008
323h892P612M908q066j139O787o58l286L087K242k034Q41J878k497o74L173k356
$$ plain form
339 926 -3995 162 3461 -4730 -5939 4699 1800 -9195 16 9940 -3968 -8142 9752 6955
353 6955 -11042 -570 13056 -4021 -11140 8150 6546 -11676 -2725 10365 -2752 -8690 5504
366 5504 5290 -5957 -1088 5957 -516 -3334 2116 1506 -2249 -623 645 -1178 -834 560 -379 -864
382 -864 1090 1427 -901 -82 3183 571 -3231 1529 3749 -4129 -3659 5300 179 -8057 2048 6912
398 6912 -6286 -4852 9188 1777 -9198 3724 9157 -6101 -5021 8649 1631 -8539 1174
411 1174 6293 -4174 -5057 3858 2094 -4524 -1134 3924 351 -3280 1009 3488 -1555 -2205 3044
426 3044 947 -3393 1220 2618 -3291 -542 4081 -2548 -2886 5088 -186 -6171 4070 4216 -7694
441 -7694 -699 8293 -4545 -6500 8150 1997 -8978 3507 7339 -6464 -2156 7931 -1713 -5092
$$ packed form
339I26m921M157L299q191j209J0638k899j0995R211R924j3908m174J7894k797
353F955j7997J0472J3626j7077p119J9290j604j8222Q951J3090j3117n938J4194
366E504k14j1247M869P045o473k818N450o10l755J626J268j823L44J394r39m85
382h64J954L37k328Q19L265k612l802M760K220p878M70Q959n121q236J0105M864
398F912j3198J434J4040p411j0975J2922N433j5258J080J3670p018j0170R713
411A174N119j0467q83Q915j764o618L390N058l573l631M289K479n043o50N249
426C044k097m340M613J398n909K749M623o629l38P974n274n985J0241J46j1910
441g694O995Q992j2838j955J4650o153j0975J2485L832j3803M308J0087r644l379
$$ plain form
455 -5092 4740 1238 -4760 1586 1184 -3566 1231 733 -3853 2380 2523 -5170 1779 6275 -5343 -2104
471 -2104 8963 -2487 -7293 7969 2365 -10198 3788 6872 -9846 -1197 9958 -6877 -6028
484 -6028 11566 -1873 -10875 10209 5451 -13732 4161 12382 -11744 -4648 15038 -5268 -12069
497 -12069 12642 3313 -15229 6372 10743 -13366 -2021 14395 -7059 -9248 12473 630 -11924
510 -11924 6803 5858 -10229 1787 7384 -7343 -673 7895 -5777 -2594 9378 -4233 -6273
523 -6273 10236 -774 -10609 8773 4556 -14006 4176 11290 -13840 -3918 17100 -7415 -13712
536 -13712 16633 4781 -18727 7572 15161 -14866 -4250 17237 -6322 -11881 12907 1451
548 1451 -14343 6932 7534 -13274 378 11755 -8077 -5982 11542 -466 -8297 6566 3855
$$ packed form
455e092R832l502n998O346m02m750M797m98m586O233J43p693O949M496j1618L239
471b104J1067j1450m806J5262n604j2563J3986L084j6718Q649J1155j6835Q49
484f028J7594j3439r002K1084m758j9183J7893Q221k4126P096J9686k0306o801
497a2069K4711r329j8542K1601M371k4109J1345J6416k1454k189K1721j1843j2554
510a1924J8727r45j6087J2016N597j4727O670Q568j3672L183J1972j3611k040
523f273J6509j1010r835J9382m217j8562J8182P114k5130R922K1018k4515o297
536a3712L0345j1852k3508K6299P589l0027J0616K1487k3559n559K4788j1456
548A451j5794K1275O02k0808J3652J1377j9832K095J7524j2008p831J4863k711
$$ plain form
561 3855 -6097 2333 2990 -4472 1986 1841 -6355 2173 4757 -8043 -873 9169 -5878 -5938 11069
576 11069 -292 -10707 8875 6713 -13233 1884 13307 -9993 -8319 14248 -175 -14271
588 -14271 6818 9003 -10624 -2259 9697 -2859 -5064 5110 390 -3129 2718 -509 -2800 3207
602 3207 -141 -4236 2684 1990 -4001 1287 2985 -2996 1009 3337 -3718 156 5306 -4180 -3696 6725
618 6725 -1244 -7740 4916 3647 -8303 1007 7265 -5629 -2800 8610 -1691 -6031 7182 2702
632 2702 -7688 2626 5800 -6099 -2346 5254 -2661 -3736 3122 -1082 -2476 3313 -1067 -2763
646 -2763 5088 810 -5249 4307 4516 -6251 116 6416 -4375 -3784 5823 -1834 -5576 4712 589
661 589 -6469 4046 3877 -7029 1615 7498 -5728 -2938 9070 -2057 -7393 7071 2676 -9294
$$ packed form
561C855r952Q430O57p462O458j45q196Q528K584j2800P170J0042j5047o0J7007
576A1069j1361j0415J9582k162j9946J5117J1423k3300J674K2567j4423j4096
588a4271K1089K185j9627Q365J1956j2556k205J0174m720l519N847l227k291O007
602C207l348m095O920o94n991N288J698n981M005K328p055L874N150r486M84J0421
618F725p969o496J2656j269j1950R310O258j2894K829J1410j0301m340J3213m480
632B702j0390J0314L174j1899L753P600p915j075O858m204j394N789m380j696
646b763P851m278o059R556K09j0767O367O300j0791N91R607p657l742J0288m123
661E89p058J0515j69j0906Q644N883j3226K790J2008j1127n336J4464m395j1970
$$ plain form
675 -9294 2751 6547 -7831 -2170 8441 -3691 -5826 7408 1138 -7132 4183 4352 -6261 642
689 642 5265 -4675 -1864 5330 -2873 -3757 5363 -308 -5091 4334 2685 -5308 1956 4476 -4399 -573
705 -573 4720 -3367 -2693 4616 -2254 -4580 4962 341 -6414 3871 4648 -6528 420 7937 -3883
720 -3883 -4201 7636 438 -7289 3869 3879 -7056 -762 5486 -4173 -3759 5166 -387 -4383 3644
735 3644 2456 -3649 1631 3592 -2602 -336 3274 -1783 -1930 2342 -951 -2573 1604 62 -2433
750 -2433 1241 875 -1929 1168 1689 -1981 790 2486 -2293 -605 3482 -1814 -3034 3572 604 -4767
766 -4767 1768 3595 -4028 -1406 4877 -1037 -3755 3257 1818 -3701 568 2822 -2277 -1296 2383
781 2383 -823 -1817 1767 281 -1663 1178 1236 -1315 337 1591 -618 -526 932 -134 -737 -186 -530
$$ packed form
675i294J2045L796j4378N661J0611j2132k135J3234o270q270J1315J69j0613O903
689F42M623r940K811P194q203q84R120n671m783R425j649p993P264K520q875L826
705e73N293q087O74P309o870k326R542m621o755J0285P77j1176O948P517j1820
720c883l18J1837p198p727J1158J0j0935O294O248r659M14Q925n553l996Q027
735C644j188o105N280J961o194K266L610n057j47M272l293j622M177j542k495
750b433L674l66k804L097N21l670K771J696m779J688M087n296j220O606k968n371
766d767O535J827p623K622O283n914k718P012j439n519M269K254n099R81L679
781B383l206r94L584j486j944K841N8k551J652J254k209R2J458j066o03N51l44
$$ plain form
798 -530 -267 -172 -1194 9 1167 -1156 -752 2589 417 -2057 2071 2542 -2639 -491 3448 -1353 -3393
815 -3393 2247 1007 -4020 -343 2582 -2010 -1923 2506 590 -1633 1468 1746 -679 526 1262 -589
831 -589 -111 530 -1184 -883 458 -1004 -1371 522 187 -875 285 1057 310 232 292 643 872 -734 -946
850 -946 1363 19 -2843 299 2168 -2394 -2016 3455 645 -3350 1812 3505 -2456 -1369 3461 -153
866 -153 -3079 1132 1158 -2418 -671 1124 -857 -502 905 35 510 1165 -260 507 1682 -806 -999
883 -999 1419 -550 -2451 461 305 -2380 -294 1160 -1089 105 1702 -541 583 2617 -1016 -842
899 -842 3537 -515 -3922 2425 1990 -5512 -864 4522 -3178 -4078 4693 1252 -4721 2387 4300 -3077
915 -3077 -462 4194 -1312 -2081 2599 -582 -2668 1595 -413 -2855 1726 720 -3338 1770 2887
$$ packed form
798e30K63R5j022J203J158k323M04L341k172k474M128M71n181K148L939m801k040
815c393N640j240n027L677K925m592Q7M429j916k223L101K78k425J205P36j851
831e89M78O41j714L01J341j462l67J893l35j062J160P72p47p8O0L51K29j606k12
850i46K309j344k862L142J869m562L78N471k810l995N162J693n961J087M830l614
866a53k926M211K6l576J747J795j981L55J407q70M75O55j425P67J175k488j93
883i99K418j969j901K912j56k685K086J454k249J194J597k243J124K034l633J74
899h42M379m052l407O347m35p502M648N386p700r00Q771l441n973P108J913p377
915c077K615M656n506p69M680l181k086M263k008k442M581j006m058N108J117
$$ plain form
930 2887 -3364 176 4647 -2352 -2572 4637 -250 -4606 2903 1781 -5004 956 3523 -4250 -666
945 -666 5099 -2770 -2788 6066 -249 -5512 4716 3279 -6858 697 5943 -5360 -3671 6317 -1447
960 -1447 -5858 4650 2483 -5535 2198 4731 -4008 -145 5042 -2787 -2319 4613 -1856 -4246 3956
975 3956 -287 -5875 3145 2797 -6343 1044 6336 -4461 -2399 7737 -672 -5467 5474 2687 -6396
990 -6396 1513 4126 -5443 -1450 4482 -3738 -3081 5019 -1296 -4183 5050 1834 -5012 3317 4381
1005 4381 -4980 108 5327 -3853 -3136 5130 -1916 -5319 4294 1127 -6086 2671 4462 -5142 -120
1020 -120 6464 -2785 -3391 5781 101 -5445 3093 2399 -5447 219 3862 -3623 -1865 4239 -884 -2481
1036 -2481 3289 967 -2012 1972 674 -1968 1595 173 -3449 1492 1582 -4732 -40 4616 -3389
$$ packed form
930B887o251L540M471o999k20P209m887m356P509j122o785N960K567p773L584
945f66N765p869j8Q854o315n263J0228j437j0137P555N246j1303J689R988p764
960a447m411J0508k167q018P733K533q739L863N187p829M68O932o469k390Q202
975C956m243n588R020l48r140P387N292j0797K062J0136q409m795J0941k787r083
990f396P909K613r569L993N932q220O57Q100o315k887R233l216o846Q329J064
1005D381r361N088N219r180P17Q266p046l403R613l167p213Q757J791r604N022
1020a20O584r249o06R172n680n546Q538o94p846N666L643p485J758O104n123j597
1036b481N770k322k979L984j298k642L563j422l622M941R0o314M692M656q005
$$ plain form
1051 -3389 -2825 6021 383 -4992 4045 4064 -5012 15 5126 -3203 -3387 3784 -652 -4474 1951 1375
1067 1375 -3458 506 2513 -1409 124 2321 -338 255 1764 -922 -154 1673 -1809 -1520 2179 -1486
1083 -1486 -3009 2419 464 -3751 1945 2893 -3643 232 4893 -2414 -2661 5110 105 -5114 2954
1098 2954 2978 -5334 -445 4591 -2889 -2950 4038 89 -3317 2382 1663 -2529 1138 1632 -2149 484
1114 484 1632 -2547 -102 2335 -2531 -1102 3425 -1448 -2752 3942 768 -4194 2594 3354 -4431
1129 -4431 -398 4714 -2784 -3258 4163 -338 -4521 2636 1978 -4356 1095 3689 -3308 -675 4783
1144 4783 -1697 -2756 4330 396 -4312 2323 2231 -4325 -156 3183 -3009 -1719 3387 -1162 -2428
1159 -2428 3322 618 -2805 2461 2084 -2918 883 2782 -2649 -836 2828 -2014 -2346 2887 -655
$$ packed form
1051c389N64Q846n638n375R037J9r076N027N111q329j84P171m436l822O425n76
1067A375m833L964K007l922J533K197k659N93J509k686P68J827l482K89L699l665
1083a486j523N428j955m215N696R48o536L875M661p307k47P771n005n219Q068
1098B954K4q312M889N036p480o1O988l949l406N699p19m192L667M94l781K633
1114D84J148m179K445K437m866J429M527m873j304O694l174m962O788P60p785
1129d431M033N112p498m74P421m501m183P157o58o334N451K594o997K633N458
1144D783o480j059P086l934m708O635r2o556M169L339o192J290N106m549j266
1159b428N750k704l423N266l77n002L801J899n431J813L664m842l32N233l542
$$ plain form
1174 -655 -3415 2482 1464 -3780 1067 3384 -2704 -884 3860 -937 -2441 2967 417 -3146 1604
1189 1604 1516 -3219 357 2554 -2631 -1204 3296 -961 -2500 2777 1056 -2867 1123 2187 -2207
1204 -2207 -439 2173 -1366 -1334 1823 -517 -1678 1534 391 -1775 1144 1197 -1579 420 1600 -1392
1220 -1392 -403 1687 -1109 -1337 1610 -425 -2042 1289 777 -2083 512 1954 -1289 -344 2242 -317
1236 -317 -1035 1751 236 -1700 801 502 -2025 -76 1006 -1735 -843 1629 -528 -1149 1639 905
1252 905 -969 928 1436 -581 37 882 -705 -492 233 -1013 -783 424 -779 -918 1011 152 -916
1269 -916 1139 1260 -783 456 1538 -627 -499 1030 -598 -1311 552 -268 -1574 307 564 -1174
1285 -1174 225 1426 -528 -163 1696 -53 -891 1095 232 -1499 161 577 -1534 -512 990 -607
$$ packed form
1174f55k760N897j018n244M847K317o088J820M744m797j504N408k550l563M750
1189A604q8m735L576K197n185J427M500m257j539N277j721l923L990J064m394
1204b207J768K612l539L2L157k340j161L212j143k166K919N3k776J999J180k992
1220a392R89K090k796k28K947k035j617L331n12k860K595J442l243R45K586k559
1236c17p18K786j515j936K501k99k527J949J082k741Q92K472k157o21K788p34
1252I05j874J897N08k017O18Q45j587K13P25j246K30J207j203j39J929q59j068
1269i16K055J21k043J239J082k165J28J529j628p13J863q20j306J881K57j738
1285a174J399J201j954L65J859j749q38J986q63j731J660M16k111J022J502j597
$$ plain form
1301 -607 -752 1190 459 -435 860 785 -199 349 256 -635 -39 -192 -1292 -299 364 -1215 -545 1333 -19
1320 -19 -670 1566 1175 -618 718 1302 -694 -418 585 -944 -1170 221 -838 -1353 492 172 -1001
1337 -1001 780 1416 -449 461 1872 33 -411 1088 -69 -1268 92 -247 -1553 -352 118 -1015
1353 -1015 -197 915 -170 217 1309 302 102 1109 2 -629 733 -208 -1723 124 349 -1835
1369 -1835 -494 1423 -667 -828 1786 788 -863 1237 1231 -972 160 777 -1419 -844 610 -1287 -1299
1386 -1299 1095 -173 -1345 1328 1378 -814 891 1965 -482 -141 1430 -666 -1278 551 -789 -2022
1402 -2022 178 77 -1724 323 1306 -598 452 2078 180 145 1895 2 -1023 1098 -313 -2459
1418 -2459 -21 360 -2531 -874 1526 -1017 -1118 2207 876 -866 1791 1678 -956 532 1405 -1441
$$ packed form
1301f07j45J942p31q94J295p5r84N48r3q91N96j53j100R93O63j579O70J878j352
1320a9o51K236l91j793J336N84j996K76J003j529k26J391j059n15J845l20j173
1337a001J781O36j865R10J411j839m44J499j157j199J360l39j306J201M70j133
1353a015Q18J112j085L87J092j007k00J007j107o31J362r41j515J847K25k184
1369a835J341J917k090j61K614r98j651K100ok203J132O17k196N75J454j897j2
1386a299K394j268j172K673N0k192J705J074k447L41J571k096o12J829j340j233
1402b022K200j01j801K047R83j904J050J626j898l5J750j893j025K121j411k146
1418b459K438L81k891J657K400k543j01L325j331j742K657j13k634J488Q73k846
$$ plain form
1434 -1441 -978 764 -1466 -1869 579 -398 -1592 902 1015 -693 971 1726 -165 524 1551 -645
1450 -645 -756 888 -959 -1858 340 -372 -1776 334 893 -953 586 1894 -120 250 1964 42
1466 42 -885 952 -283 -1951 -184 -58 -1897 -596 665 -827 -49 1621 386 364 1900 691 -310
1483 -310 1183 227 -1445 -102 -170 -2092 -880 242 -1463 -692 1351 -42 -255 2180 1161 -353
1499 -353 1544 1318 -1092 103 605 -1764 -1201 222 -1679 -1414 892 -537 -993 1833 981 -816 1855
1516 1855 2007 -1243 466 1924 -1648 -1465 1386 -1347 -2661 1166 93 -2613 1026 2037 -1580
1531 -1580 510 3197 -584 -839 2639 -50 -2237 1132 192 -2986 -79 972 -2401 -420 2146
1546 2146 -997 -550 2957 244 -1159 2650 943 -2396 1106 1241 -3234 -774 1810 -2766 -2041 2673
$$ packed form
1434a441M63J742k230m03K448r77j194K494J13j708J664P55j891O89J027k196
1450f45j11J644j847q99K198p12j404K110N59j846J539J308k014L70J714j922
1466D2r27J837j235j668J767J26j839J301J261j492P78J670j235k2J536j209j001
1483c10J493r56j672J343o8j922J212J122j705P71K043j393k13K435j019j514
1499c53J897k26k410J195N02k369N63J423j901K65K306j429m56K826q52j797K671
1516A855J52l250J709J458l572J83K851k733j314L827j073k706L639J011l617
1531a580K090K687l781k55L478k689k187L369r40l178K907J051l373J981K566
1546B146l143M47L507k713j403L809j707l339L502J35m475K460K584m576P25M714
$$ plain form
1562 2673 -733 -2578 3020 1910 -2573 1857 3467 -2089 -535 3212 -1493 -2650 2073 -634 -3634
1577 -3634 1058 868 -3202 556 2675 -1807 -105 3740 -437 -1404 3044 538 -2650 1309 998 -3335
1593 -3335 -277 1531 -2767 -1224 2495 -1099 -1694 3079 693 -2074 2381 1999 -2458 542 2409
1608 2409 -2522 -1540 2425 -1586 -2846 2195 317 -3036 1635 2445 -2176 376 3323 -1145 -1184 2664
1624 2664 -413 -2421 1372 142 -2969 418 1121 -2425 -77 2354 -1075 -674 2957 336 -1454
1639 -1454 2049 1054 -1980 441 1013 -2267 -781 1007 -1786 -1266 1611 -456 -1273 2090 990 -1323
1655 -1323 1602 1919 -1414 127 1871 -1491 -1520 1374 -893 -2429 823 401 -1976 450 1664 -891
1671 -891 112 2085 -82 -497 1596 70 -1268 725 -3 -1869 20 436 -1654 -435 1246 -498
$$ packed form
1562B673l406j845N598j110m483M430J610n556J554L747m705j157M723k707l000
1577c634M692j90m070L758K119m482J702L845m177r67M448k506l188L959l11m333
1593c335L058J808m298J543L719l594n95M773k386k767M455l82m457L000J867
1608B409m931R82L965m011j260N041j878l353M671Q10m621K552K947m468l9L848
1624B664l077k008L793j230l111L387P03l546K348K431l429M01L631k621j790
1639a454L503r95l034K421N72l280J486J788k793N20K877k067q17L363j100k313
1655a323K925L17l333J541J744l362k9K894k267j536L252m22k377K426J214k555
1671h91J003J973k167m15K093j526j338J993p28j866J889M16k090J219J681j744
$$ plain form
1687 -498 -463 1513 435 -486 1211 648 -824 499 318 -1317 -134 425 -1400 -573 1066 -601 -887
1704 -887 1465 615 -951 1055 1257 -924 55 1181 -901 -964 645 -564 -1322 282 -15 -968 464
1721 464 761 -386 628 1203 -327 233 1168 -497 -780 799 -323 -1510 88 172 -1295 -242 784
1738 784 -450 -117 1065 119 61 1047 105 -383 852 18 -1214 284 346 -1515 -470 991 -786 -929
1756 -929 1186 288 -963 795 946 -627 113 884 -509 -348 558 -459 -599 448 -298 -789 619
1773 619 281 -781 485 836 -640 26 1046 -480 -658 808 -42 -1100 334 402 -875 -52 545
1790 545 -396 -39 677 -248 -23 772 -292 -525 893 35 -1211 384 607 -1240 -428 1065 -467 -879
1808 -879 891 407 -680 554 672 -426 233 565 -557 -30 519 -740 -518 723 -425 -888 711
$$ packed form
1687d98L5J976j078r21J697n63j472J323j81j635J183N59j825Q27J639j667k86
1704h87K352q50j566K006K02k181R79J126k082o3J609j209p58J604k97r53J432
1721D64K97j147J014N75j530N60R35j665k83J579j122j187J598Q4j467J053J026
1738G84j234L33J182r46n8R86r42m88J235q34j232J498O2j861J045J461j777j43
1756i29K115q98j251J758J51j573P40P71j393J61R06j017j40J047p46m91J408
1773F19l38j062J266L51j476O66J020j526j78J466q50j058J434O8j277Q23N97
1790E45r41L57P16r25K25P95j064k33J418q58j246J595K23j847Q12J493j532m12
1808h79J770m84j087J234J18j098O59L32j122N27N49j259K22J241j148m63J599
$$ plain form
1825 711 249 -904 315 822 -578 11 964 -263 -394 745 -15 -702 500 112 -801 201 320 -741
1843 -741 -7 630 -644 -319 901 -244 -713 897 300 -1028 351 811 -840 -329 903 -251 -631
1860 -631 598 113 -486 398 123 -544 408 275 -832 126 678 -719 -486 952 -123 -892 639 600
1878 600 -725 158 725 -330 -198 569 -198 -384 409 -182 -558 342 6 -708 274 432 -690 -5 776
1897 776 -330 -352 812 101 -539 456 312 -559 -13 374 -421 -201 341 -288 -292 339 -167 -367 358 139
1917 139 -435 252 382 -403 -59 490 -119 -372 344 181 -281 45 266 -15 -153 -40 44 145 -287 -303 369
1938 369 60 -562 100 540 -305 -389 594 254 -303 99 368 -72 -127 51 64 39 -179 -296 183 80 -573
1959 -573 -21 461 -297 -311 562 43 -386 474 378 -499 197 618 -407 -246 626 -303 -616 375 49 -664
$$ packed form
1825G11m62j153J219N07j400N89R53j227j31J139p60o87J202l88r13J002J19j061
1843g41P34O37j274L25J220j145m69J610n97j328J379M60j651N11J232j154l80
1860f31J229m85n99Q84k75o67R52j33j107R58N52j397K33J438j075p69J531l9
1878F00j325Q83N67j055J32P67p67j86P93n91l76R00l36p14R82J58j122O85P81
1897G76j106k2J164p11o40R95j44q71N46L87p95K20N42o29mO31n06k00P25k19
1917A39n74O87J30p85L44N49o09k53P16j63m62L26K21k81j38J13Q4J01m32j6O72
1938C69l09o22O62M40q45q4R83l40n57M02K69m40n5J78J3k5k18j17M79j03o53
1959e73N52M82p58j4Q73n19m29Q60r6q77O96M21j025J61Q72r29l13R91l26p13
$$ plain form
1979 -664 262 210 -586 187 560 -582 -57 967 -343 -552 919 280 -911 298 605 -765 -146 541
1997 541 -582 -271 678 -492 -426 968 -125 -968 896 725 -1226 95 1296 -811 -782 1181 -82
2014 -82 -1115 694 527 -1065 244 944 -720 -224 964 -322 -633 794 -40 -873 488 197 -861
2031 -861 393 533 -955 156 1062 -687 -457 1387 -9 -1105 921 707 -1270 49 923 -1032
2047 -1032 -546 856 -580 -982 914 60 -1071 807 970 -1029 174 1406 -418 -661 1042 -26
2063 -26 -1064 336 166 -1026 -1 403 -775 -90 721 -373 -205 919 40 -420 806 312 -673 387
2081 387 466 -894 -111 654 -838 -603 771 -266 -814 748 459 -691 351 834 -406 -209 670 -280
2099 -280 -579 432 -192 -825 308 277 -744 -7 760 -259 -241 692 216 -346 289 235 -340 -32 -37 -345
$$ packed form
1979f64R26n2p96P73L73j142N25J024j310k09J471o39j191J209L07j370O19O87
1997E41j123L11R49j170O6J394j093q43J864j71j951J321J201k107K9J963j263
2014h2j033J809j67j592J309P00j664M96J188j286l11J427q34q33J361k91j058
2031h61J254J40j488J111R06j749K30J844j396j096K026k14j977J319Q74j955
2047a032M86J402j436m02J896q54j131J878J63j999J203J232j824k43J703j068
2063b6j038J400j70j192J025M04j178O85Q11j094J68J124q79m60J226m94r85J060
2081C87P9j360P83P65j492K35J374j037n48J562k89j150J042M83j240J97Q79r50
2099b80k99J011o24o33J133l1j021P37P67j019J8R33m76n62O35n4n75L08nl08
$$ plain form
2119 -345 -163 -72 -336 -23 185 -94 89 498 111 70 508 95 -274 185 56 -585 -159 86 -547 -408 208
2140 208 -111 -275 334 300 -60 397 466 -16 196 301 -147 -249 32 -247 -385 -230 -241 -169 -113 -134 87 331
2162 331 -9 97 614 198 -280 288 394 -482 -281 316 -312 -630 115 87 -500 74 415 -130 90 514
2182 514 -29 -82 438 -22 -322 217 -22 -557 -84 119 -488 -129 314 -171 -138 558 177 -159 347 342 -213
2203 -213 109 89 -452 -95 39 -573 -193 317 -300 -345 629 197 -403 565 754 -396 48 744 -239 -617
2223 -617 247 -18 -772 -116 27 -505 -72 195 -212 191 613 27 -18 768 127 -376 435 244 -732 -169
2243 -169 237 -628 -525 258 -147 -454 317 203 -122 378 371 -42 354 366 -302 10 299 -556 -434 361 -354
2264 -354 -744 310 315 -625 59 807 -182 -179 707 211 -348 247 150 -386 -67 -12 -381 -40 119 -416 -9 482
$$ packed form
2119c45J82R1k64L13K08k79J83M09l87m1M38m13l69M59j29o41M26K45o33J39O16
2140B08l19j64O09l4l60M57O9m82K12J05m48j02K81k79j38J55j1P2N6k1K21K44
2162C31l40J06N17m16m78N68J06q76K01N97o28l18P45k8n87N74L41n45K20M24
2182E14n43n3N20m60l00N39k39n35M73K03o07L59M43m85L3O96l81l36N06nn55
2203b13L22k0n41L57J34o12L80N10o17m5R74m32o00R68J89j150M44O96r83l78
2223f17Q64k65p54O56J43n32M33K67m07M03M22n86m5P86o41n03Q11j91r76N63
2243a69M06q65J03P83m05l07P71j14l25N00pm13L96J2o68L12K89q55J22P95p15
2264c54l90J054Nr40O84P48r89LQ86m96n59N95r7n36L19N5l69L41J59n35M07M91
$$ plain form
2286 482 -147 -149 756 292 -439 352 476 -485 -285 306 -324 -539 15 -79 -242 93 47 -28 495 240 -148 418
2308 418 563 -321 -59 479 -307 -682 180 -27 -766 -117 268 -344 -150 518 191 5 524 363 33 271
2328 271 120 -212 -40 -109 -530 -144 -27 -540 -279 373 -127 -370 432 552 -190 104 607 116 -179 147
2348 147 50 -165 -234 -304 -87 7 -363 -278 360 238 -268 221 614 18 -274 374 287 -378 -197 175 -108 -376
2370 -376 -151 38 -113 -144 173 290 59 65 342 163 -129 100 194 -244 -289 -12 -61 -396 -254 115 46 -190
2392 -190 -31 379 380 -103 -37 642 247 -483 52 442 -421 -584 212 57 -580 -217 235 26 -56 160 234 338
2414 338 285 -143 221 445 -257 -399 293 -101 -767 -64 277 -584 -284 547 -38 -391 493 418 -362 209 539
2435 539 -250 -170 331 -158 -265 70 -358 -219 391 -303 -499 698 420 -824 227 1060 -566 -701 890
$$ packed form
2286D82o29kR05m64p31P91J24r61K00N91o30k15N54r4j63L35m6p5N23k55l88N66
2308D18J45q84K62N38p86l75Q62k07p39O49L85o12J94O68l27j86N19j61l30K38
2328B71j51l32J72o9m21L86J17n13K61O52n00k43Q02J20p42K94N03m91k95L26
2348A47r7k15o9p0K17R4l70Q5O38j22n06M89L93n96k92O48q7o65J81L72k83k68
2370c76K25J89j51l1L17J17k31OK77j79k92K29R4m38m5K77m9l35J42L69o9k36
2392a90J59M10Jm83O6O79l95p30N35L90q63j63P96j55o37L63M52k09q2K16P4J04
2414C38n3m28L64K24p02j42O92l94o66P03L41q61L00Q31n85l53Q84p5p80N71L30
2435E39p89Q0N01m89j07L35m28J39O10o94j96J197k78j244J051Q33j626j35J591
$$ plain form
2454 890 230 -975 94 608 -525 -355 390 -127 -62 338 -100 -77 564 -162 -437 680 158 -904 166
2473 166 584 -834 -394 789 -303 -743 794 329 -788 429 784 -441 -85 750 -205 -476 451 -138
2491 -138 -520 326 -2 -698 393 358 -813 130 988 -548 -560 1060 232 -943 367 821 -611 -372
2509 -372 508 -152 -443 233 -174 -335 370 -168 -425 584 247 -752 333 739 -602 -292 923 -189
2527 -189 -789 614 360 -789 98 614 -517 -315 586 -138 -411 388 140 -422 249 178 -352 146 261
2546 261 -422 51 443 -317 -354 606 23 -620 279 467 -480 -181 483 -58 -303 130 85 -176 17 -109 -76
2567 -76 285 -54 -232 356 327 -413 -37 643 -100 -430 333 272 -526 -99 318 -223 -195 75 11 -199 -16 108
2589 108 -18 115 8 -19 190 18 -82 203 54 -206 -32 119 -138 -138 70 -128 -136 20 68 38 15 -1 47
$$ packed form
2454H90o60j205J069N14j133J70P45n17O5M00m38K3O41p26k75J117n22j062J070
2473A66M18j418M40J183j092m40J537m65j117J217L55j225L56Q35r55k71R27n89
2491a38l82Q46l28o96J091l5j171R43Q58j536j2J620q28j175J310M54j432K39
2509c72Q80o60k91O76m07j61P05n38k57J009l37r99J085M06j341L10J215j112
2527a89o00J403k54j149Q87N16j131K02R01p24k73P99k48n62O71p1n30M98J15
2546B61o83M73L92p60l7R60n83o43Q99J88r47K99O64n41k45M33m5k61J93j26L3
2567g6L61l39j78N88k9p40L76O80p43l30P63o1p98M27M17n41K8K70o4k10J83J24
2589A08j26J33j07k7K09j72j00K85j49k60J74J51k57%K08j98qJ56M8l0k3j6M8
$$ plain form
2612 47 156 50 -70 235 97 -272 56 281 -231 -287 185 125 -330 -43 174 -50 -117 34 124 98 -47 -91
2634 -91 174 76 -284 -39 355 -106 -298 286 229 -359 -29 321 -192 -217 277 -11 -301 145 119 -278 49 154
2656 154 -182 19 214 -107 -33 301 -47 -222 318 45 -306 160 255 -336 -136 308 -175 -342 229 31 -256
2677 -256 93 104 -195 131 175 -168 131 322 -193 -111 419 -99 -344 304 128 -521 -7 354 -372 -289 340
2698 340 -35 -266 272 166 -218 189 224 -140 74 264 -190 -156 251 -203 -287 224 -13 -304 125 189 -257
2719 -257 15 333 -140 -142 284 -23 -282 168 86 -267 31 85 -286 39 160 -229 -33 350 -86 -274 343
2740 343 159 -362 101 261 -264 -133 313 -99 -146 281 66 -190 188 164 -248 54 247 -102 -131 223 -124
2761 -124 -229 124 -69 -231 140 -33 -208 153 215 -205 80 365 -20 -168 251 54 -202 75 134 -195 3
$$ packed form
2612D7J09j06j20L05j38l69L28K25n12n6M72o0m55K87K17k24o7J51R0k6j45m4
2634i1K65r8l60K45L94m61j92N84n7n88L30L50n13k5M94k88k90M46k6l97L27J05
2656A54l36K01J95l21P4L34l48j75N40k73l51M66R5n91K00M44m83j67N71j98k87
2677b56L49J1k99L26M4l43K99J91n15Q2N30n18k45O48j76o49N14L61p26Q3O29
2698C40l75k31N38j06l84M07L5l64K14J90m54L4M07m54q4N11k37k91M29O4m46
2719b57K72L18m73kM26l07k59M50q2l53K98N4l71L25J21l89J96L83m36j88O17
2740C43j84n21M63J60n25J31M46m12m7M27k15k56L78k4m12L02J93l49k9L54l47
2761a24j05L53j93j62L71j73j75L61O2m20K85K85l85j48M19j97k56K77N9l29J98
$$ plain form
2782 3 126 -214 -84 112 -125 -117 174 19 -146 141 177 -183 79 177 -191 -114 158 -34 -181 113 24 -186 -10
2805 -10 140 -155 -126 169 -12 -147 70 41 -57 -8 67 -5 32 39 -16 69 86 -120 -31 196 -30 -240 81 90 -220
2830 -220 -114 156 12 -148 98 159 -25 -44 46 121 2 0 51 67 16 -88 -19 37 -56 -140 -60 112 -70 -119 90
2855 90 60 -100 13 244 -18 -99 170 119 -170 -6 167 -77 -124 61 13 -145 -50 160 -7 -22 24 139 64
2878 64 -62 -57 131 -6 -214 -45 272 -90 -345 213 254 -342 -181 380 28 -322 102 247 -181 -52 159
2899 159 -60 -89 24 -161 -3 186 -95 -135 246 86 -253 158 294 -234 -41 229 -133 -226 187 -7 -398
2920 -398 84 188 -322 -72 211 -105 -90 249 45 -69 196 21 -201 230 97 -396 60 342 -390 -298 497
2941 497 -4 -507 204 418 -297 -144 434 27 -185 136 101 -54 100 -86 -178 237 -64 -372 172 259 -424
$$ packed form
2782CJ23l40J30J96k37QK91j55j65K87L6l60K62R8l68P7K72j92j47K94q9k10J76
2805a0J50k95K9K95j81j35K17k9r8M9P5p2L7Pn5Q5J7k06Q9K27k26k10L21Rl10
2830b20J06K70j44j60K46O1j84j9R0P5j19kN1J6n1j04O9N6r3q4Q0J72j82m9K09
2855I0l0j60J13K31k62q1K69n1k89J64J73k44m7J85m8j58R5K10j67j5M6J15p5
2878F4j26NJ88j37k08J69L17l62k55N58M1n96J61N61l52l50M24J45m28J29K11
2899A59k19k9J13j85J58J89k81m0L81j60l39M11J36n28J93K70l62r3M13j94l91
2920c98M82J04n10K50K83l16J5L39k04j14K65j75k22M31j33m93M56K82p32R2P95
2941D97n01n03P11K14p15J53N78m07k12L21l5j55J54j86r2M15l01l08N44Q7o83
$$ plain form
2962 -424 -149 421 -169 -414 353 210 -414 157 365 -270 -179 445 -37 -330 200 122 -275 8 136 -180 -18
2983 -18 148 -170 -79 309 -201 -204 300 107 -395 153 386 -145 -211 281 85 -250 39 143 -73 -51 -24 -87 112
3006 112 -74 -255 120 244 -285 -144 370 -30 -391 220 252 -316 -131 352 -18 -228 201 145 -215 -72 273
3027 273 -93 -199 83 3 -78 -35 -54 33 59 -78 5 219 55 -186 52 254 -91 -238 180 159 -250 -162 131
3050 131 -8 -233 -93 118 -30 -206 -26 228 82 -117 58 272 7 -131 83 252 -146 -281 162 162 -395
3071 -395 -80 313 -55 -315 219 262 -218 -70 325 40 -178 79 233 -181 -110 93 35 -101 -91 -32 37 -13
3093 -13 -142 94 208 -81 -183 200 132 -389 -78 288 -125 -351 155 181 -220 -82 207 114 -1 5 141 124
3115 124 -37 -169 88 160 -281 -244 280 -14 -485 98 410 -268 -231 479 160 -306 179 329 -233 -141 241
$$ packed form
2962d24K75N70n90k45P67j43o24N71K08o35R1O24m82k93N30p8l97K83J28l16J62
2983a8J66l18R1L88n10lN04j93n02N48K33n31o6M92j96l35K89J04k16K2K7o3J99
3006A12j86j81L75J24n29J41N14m00l61O11L2n68J85M83l70k10M29n6l60J43L45
3027B73l66j06K82q0q1M3j9Q7K6j37Q3K14j64k41K38K02l45j47M18k1m09Q8K93
3050A31j39k25J40K11j48j76J80K54j46j99J75K14k65j38K14J69l98j35M43%n57
3071c95L15L93l68k60N34M3m80J48L95k85k18K57J54m14P1K03n8j36J0N9O9n0
3093a3j29K36J14k89j02L83o8n21L11L66m13k26N06K6m01J38K89r3j15OJ36j7
3115A24j61j32K57P2m41L7N24k94m71N83L12o78L7P10l19m66M85J50n62R2L82
$$ plain form
3136 241 -4 -245 -49 8 -51 -81 -89 33 129 -84 -122 261 189 -209 70 420 -135 -250 222 151 -382 -63 234
3159 234 -142 -192 104 106 -26 15 -30 127 149 -112 -57 237 -73 -363 112 319 -319 -261 392 59 -388 49 327
3182 327 -194 -186 255 189 -159 -28 74 3 -117 -60 75 32 -180 -59 243 58 -165 206 340 -176 -178 277 108
3205 108 -274 1 195 -183 -268 78 51 -205 -43 46 64 -6 -65 81 202 30 -95 225 170 -237 -144 214 -53
3228 -53 -344 29 136 -153 -237 124 156 -155 -6 180 93 -92 23 174 45 -200 -33 179 -111 -271 31
3249 31 138 -252 -181 290 -23 -283 23 292 -128 -114 204 159 -194 -99 89 -44 -130 -109 135 -3 -120 -42 206
3272 206 26 -110 57 154 -26 -180 72 100 -153 -79 103 -17 -148 -37 157 63 -93 -7 175 34 -125 71
3294 71 176 -123 -151 70 73 -147 -72 95 -28 -83 11 121 0 -45 126 69 4 -14 70 48 -119 -94 74 -59 -239
$$ packed form
3136B41k45k41J96N7n9l0qJ22R6k13l8L83p2l98K79L50n55j15M72p1n33L19K97
3159B34l76n0K96Kj32M1m5J57K2k61N5K94l10k90M75K07o38N8O53l33m47M37K78
3182C27n21QM41o6l48J31J02p1j20N7J35m3k12J21L02j85k23L71J34n16kM55j69
3205A08l82K75J94l78q5L46k7k56J62Q9J8p0n9J46J21j72j25L20n5m07R3L58k67
3228e3k91L73J07k89q4L61L2l11J49J86q7j85J15J51j29k45J67K12k90j60L02
3249C1J07l90P1M71l13k60L06K69m20J4L18m5l53R5J88j33q6K1K44j38j17P8K48
3272B06j80j36J67R7j80j54K52K8k53P4J82j20j31J11J94r4j56Q6J82j41j59J96
3294G1J05k99k8K21Lk20P5J67j23n5R4J10j21m5J71n7o5j8Q4k2j67K5J68j33j80
$$ plain form
3319 -239 18 58 -73 -100 73 70 -21 -5 139 106 -52 -73 105 99 -108 -176 105 33 -231 -77 178 -12 -259 59
3343 59 175 -92 -75 170 11 -69 11 60 17 -11 -88 -13 -11 -105 -72 105 2 -110 59 141 -79 -25 160 -33 -152
3368 -152 193 89 -156 44 185 -103 -155 136 -1 -18 59 52 -75 92 59 -140 121 143 -235 -117 204 -115
3390 -115 -294 139 128 -261 -57 232 -3 14 156 54 31 111 -29 -4 127 -81 -254 119 10 -371 -110 250
3412 250 -172 -195 345 83 -114 131 273 -189 -29 212 -85 -241 62 -80 -219 -12 -31 -128 -52 81 -99
3433 -99 115 188 -115 19 269 -85 -179 205 53 -277 -14 249 -210 -138 196 20 -189 178 52 -57 135
3454 135 47 -120 39 37 -264 -58 102 -94 -299 155 92 -263 51 255 -61 -23 209 66 -81 32 17 -133
3476 -133 -72 -51 -88 -56 -54 -156 16 133 -47 31 221 24 -83 203 80 -208 -37 164 -136 -190 4 -42 -227
$$ packed form
3319b39K57M0j31k7J73lr1J6J44l3j58k1J78ok07o8K81p2k64J54K55j90k47L18
3343E9J16k67J7K45j59q0Q0M9m3k8p7P5Kr4L3J77j03j12J69Q2k20N4J85j93j19
3368a52L45j04k45K00J41k88n2K91j37j7P7pj27J67l3j99K61K2l78J18L21l19
3390a15j79M33j1l89K04K89k35J7J42j02k3Q0j40K5J31k08j73L73j09l81K61L60
3412B50m22k3N40k62j97K45J42m62J60K41k97j56L03j42j39K07j9r7P6J33j80
3433i9K14P3l03J34K50l54r4L84j52l30K63K63m59P2L34j76k09L67j26j09J92
3454A35q8j67J59kl01K06J60j96k05M54o3l55L14K04l16L8K32j43j47J13j5j50
3476a33O1K1l7L2Kj02J72J17j80P8J90j97j07K86j23k88J71K01l00n4J94m6j85
$$ plain form
3499 -227 34 102 -59 -43 165 101 9 121 52 -9 -6 49 -59 8 -13 -98 -139 -54 -57 -70 36 29 53 41 97 15 -93 60
3527 60 48 0 -70 -21 -29 -52 -63 -62 -40 -4 -28 36 70 35 -42 73 105 -8 14 59 -106 -143 3 17 -110 -55 31 -27 34
3556 34 105 45 -16 119 62 -103 -34 74 -109 -128 22 -71 -173 18 21 -86 54 143 54 -4 138 157 23 34 33 -68
3582 -68 -12 -79 -142 -11 10 -129 -45 104 -74 -39 112 140 -38 71 212 -87 4 65 -60 -117 4 -29 -157 -24
3606 -24 40 -88 110 64 -16 78 197 -16 -40 203 -14 -154 -6 77 -202 -151 69 -32 -83 25 142 -19 -21 91
3630 91 82 0 1 1 -34 -34 -188 -31 30 -168 -139 179 61 -111 61 153 -16 -101 143 98 -91 14 32 -82 -83 -60 -66
3657 -66 -6 -91 -21 61 96 31 50 169 56 -77 96 83 -81 -109 60 -93 -239 -63 31 -87 -96 59 -8 -38 -16
3682 -16 122 100 7 -34 123 27 -92 -68 105 -15 -189 57 90 -84 -147 163 116 -63 -6 190 57 -71 50
$$ packed form
3499b27K61O8j61J6K08o4r2J12o9o1LN5j08O7k1q5m1Q5lj3J06pK4j2N6q2j08J53
3527F0j2m8p0M9qk3j1JK2L6k4O4L4l5p7J15L2j13K2M5j65l7J46J4j27N5Q6n8O1
3556C4P1o0o1J35n7j65O9J08j83j9J50r3j02J91Lj07J40Q9q9n8J42J9j34J1jj01
3582f8N6o7o3J31K1j39Q4J49j78L5J51K8j78J09J41k99R1O1j25n7J21l3j28J33
3606b4O4j28J98m6q0R4J19k13k4K43k17j40J48Q3k79N1K20j01n1J08J17j61kJ12
3630I1rq2J%l5%j54J57O1j98K9L18j18j72J72R2j69q5K44m5j89J05J8j14jK3o
3657f6O0q5P0Q2L5o5J9J19j13j33J73j3j64k8J69j53j46J76R4j18rJ55o7l0K2
3682a6J38k2r3m1J57r6j19K4J73j20j74K46L3j74o3L10m7j79N7J96j33j28J21
$$ plain form
3705 50 142 -59 -156 21 -41 -125 -91 -2 91 -51 -2 164 74 -79 47 86 -57 -68 23 24 -166 -166 42 57 -82 38
3731 38 115 -9 -27 137 158 83 -2 35 38 -71 -53 16 4 -105 -118 57 -60 -58 43 103 3 3 66 87 -36 -58 82
3758 82 58 -164 -78 92 -86 -192 -53 42 -103 -21 83 190 -85 22 105 60 -34 -38 136 -17 -98 -89 30 -6 -103
3783 -103 28 89 -56 -29 74 58 -29 27 81 -45 -32 -12 11 -44 -67 -26 30 -19 -33 17 14 -4 -7 104 28 -90 2 97
3811 97 -140 -127 61 -44 -152 9 77 -12 -57 125 81 155 34 49 63 87 2 -60 44 2 -163 -29 36 -109 -100
3836 -100 70 0 -118 103 49 -49 23 102 -75 23 53 -31 -48 34 -107 -22 26 -23 -80 119 25 -111 72 172 -93
3861 -93 -54 162 5 -128 52 7 -155 -74 76 -43 -51 45 -40 -17 72 1 -137 81 46 -155 -44 -14 -92 -62 35
$$ packed form
3705E0R2k01r7J77o2q4L4Q9R3j42M9J66r0j53J26L9j43j1R1Jj90%K08J5j39J20
3731C8P7j24j8J64K1p5q5L7Lj09J8O9j2j09j3J75j17KJ01O0j00%O3K1j23k2J40
3758H2k4k22Q6J70j78j06J39R5j45Q2J04J07k75J07Q3m5r4mJ74j53q1RJ19l6r7
3783a03J31O1j45K7J03j6q7N6N4j26J3K0K3n5k3M1N6m9j4N0lj8lJ11p6j18R2R5
3811I7k37J3J88j05j08J61O8q9m5J82m4P4j21J5J4K4q5o2J04m2j65J34O5j45R
3836a00J70p0j18K21n4r8P2P9j77R8L0q4j7Q2j41Q5M8m9n7J99r4j36J83J00k65
3861i3L9K16j57j33J80m5j62Q1J50j19qR6q5K3Q9p1j38K18l5k01J11L0p8L0R7
$$ [...]
8191c8
##END NTUPLES=NMR FID
##END=
