##TITLE=1H_AM_NV137
 CDCl3
 8 sc, 
 6.3.2024
##JCAMPDX= 6.0         $$ Bruker NMR JCAMP-DX V2.0
##DATA TYPE= NMR FID
##DATA CLASS= NTUPLES
##ORIGIN= UXNMR, Bruker Analytische Messtechnik GmbH
##OWNER= root
$$ XWIN-NMR		Version 3.5
$$ Wed Mar  6 16:46:10 2024 Russian Standard Time (UT+4h)  she@DPX200
##.OBSERVE FREQUENCY= 200.1313
##.OBSERVE NUCLEUS= ^1H
##.DELAY= (6, 6)
##.ACQUISITION MODE= SIMULTANEOUS
##.ACQUISITION SCHEME= undefined
##.AVERAGES= 8
##.DIGITISER RES= 18
##SPECTROMETER/DATA SYSTEM= spect
##.PULSE SEQUENCE= zg30
##.SOLVENT NAME= CDCl3
##.SHIFT REFERENCE= (INTERNAL, CDCl3, 0, 15.7039)
##AUDIT TRAIL= $$ (NUMBER, WHEN, WHO, WHERE, WHAT)
$$ ##TITLE= Audit trail, XWIN-NMR		Version 3.5
$$ ##JCAMPDX= 5.01
$$ ##ORIGIN= Bruker BioSpin GmbH
$$ ##OWNER= she
$$ F:/spectra/data/she/nmr/H-F/1/audita.txt
$$ ##AUDIT TRAIL=  $$ (NUMBER, WHEN, WHO, WHERE, WHAT)
(   1,<2024-03-06 16:44:06.39 +0400>,<she>,<DPX200>,
      <created by zg, POWCHK disabled, PULCHK disabled
       configuration hash MD5:
       00 E9 B6 7A A2 85 ED C7 34 08 36 98 17 FE 4E 26
       data hash MD5: 16K
       44 44 DE 28 A3 DF A9 C8 30 5B 95 A0 6D 28 FA 36>)
$$ ##END=
$$ 
$$ hash MD5
$$ 22 D9 AB 4C 2D 7A 36 22 B5 DE A4 41 CC 8D 2E 49
##$RELAX= 
##$RELAX= 
##$RELAX= 
##$RELAX= 
##$RELAX= 
##$RELAX= 
$$ Bruker specific parameters
$$ --------------------------
##$DU= <F:/spectra>
##$EXPNO= 1
##$NAME= <H-F>
##$PROCNO= 1
##$TYPE= <nmr>
##$USER= <she>
##$AMP= (0..31)
100 100 100 100 100 100 100 100 100 100 100 100 100 100 100 100 100 100 
100 100 100 100 100 100 100 100 100 100 100 100 100 100 
##$AQSEQ= 0
##$AQ_mod= 1
##$AUNM= <au_zg>
##$AUTOPOS= <>
##$BF1= 200.13
##$BF2= 200.13
##$BF3= 200.13
##$BF4= 200.13
##$BF5= 200.13
##$BF6= 200.13
##$BF7= 200.13
##$BF8= 200.13
##$BYTORDA= 1
##$CFDGTYP= 0
##$CFRGTYP= 5
##$CHEMSTR= <none>
##$CNST= (0..31)
1 1 145 1 1 1 1 1 1 1 1 1 1 1 1 1 1 1 1 1 1 1 1 1 1 1 1 1 1 1 1 1 
##$CPDPRG= <>
##$CPDPRG1= <>
##$CPDPRG2= <>
##$CPDPRG3= <>
##$CPDPRG4= <mlev>
##$CPDPRG5= <mlev>
##$CPDPRG6= <mlev>
##$CPDPRG7= <mlev>
##$CPDPRG8= <mlev>
##$CPDPRGB= <>
##$CPDPRGT= <>
##$D= (0..31)
0 1.2 0 0 0 0 0 0 0 0.06 0 0.03 0 0 0 0 0.0002 0 0 0 0 0 0 0 0 0 0 0 0 
0 0 0 
##$DATE= 1709729045
##$DBL= (0..7)
120 120 120 120 120 120 120 120 
##$DBP= (0..7)
150 150 150 150 150 150 150 150 
##$DBP07= 0
##$DBPNAM0= <>
##$DBPNAM1= <>
##$DBPNAM2= <>
##$DBPNAM3= <>
##$DBPNAM4= <>
##$DBPNAM5= <>
##$DBPNAM6= <>
##$DBPNAM7= <>
##$DBPOAL= (0..7)
0.5 0.5 0.5 0.5 0.5 0.5 0.5 0.5 
##$DBPOFFS= (0..7)
0 0 0 0 0 0 0 0 
##$DE= 6
##$DECBNUC= <off>
##$DECIM= 32
##$DECNUC= <off>
##$DECSTAT= 4
##$DIGMOD= 1
##$DIGTYP= 9
##$DL= (0..7)
0 120 120 120 120 120 120 120 
##$DP= (0..7)
150 150 150 150 150 150 150 150 
##$DP07= 0
##$DPNAME0= <>
##$DPNAME1= <>
##$DPNAME2= <>
##$DPNAME3= <>
##$DPNAME4= <>
##$DPNAME5= <>
##$DPNAME6= <>
##$DPNAME7= <>
##$DPOAL= (0..7)
0.5 0.5 0.5 0.5 0.5 0.5 0.5 0.5 
##$DPOFFS= (0..7)
0 0 0 0 0 0 0 0 
##$DQDMODE= 0
##$DR= 18
##$DS= 0
##$DSLIST= <SSSSSSSSSSSSSSS>
$$ [...]
##$SUBNAM2= <"">
##$SUBNAM3= <"">
##$SUBNAM4= <"">
##$SUBNAM5= <"">
##$SUBNAM6= <"">
##$SUBNAM7= <"">
##$SUBNAM8= <"">
##$SUBNAM9= <"">
##$SW= 18.0517328524113
##$SWIBOX= (0..15)
0 0 2 0 0 0 0 0 0 0 0 0 0 0 0 0 
##$SW_h= 3612.71676300578
##$TD= 16384
##$TD0= 1
##$TE= 0
##$TE2= 300
##$TE3= 300
##$TEG= 300
##$TL= (0..7)
0 120 120 120 120 120 120 120 
##$TP= (0..7)
150 150 150 150 150 150 150 150 
##$TP07= 0
##$TPNAME0= <>
##$TPNAME1= <>
##$TPNAME2= <>
##$TPNAME3= <>
##$TPNAME4= <>
##$TPNAME5= <>
##$TPNAME6= <>
##$TPNAME7= <>
##$TPOAL= (0..7)
0.5 0.5 0.5 0.5 0.5 0.5 0.5 0.5 
##$TPOFFS= (0..7)
0 0 0 0 0 0 0 0 
##$TUNHIN= 0
##$TUNHOUT= 0
##$TUNXOUT= 0
##$USERA1= <user>
##$USERA2= <user>
##$USERA3= <user>
##$USERA4= <user>
##$USERA5= <user>
##$V9= 5
##$VALIST= <valist>
##$VCLIST= <CCCCCCCCCCCCCCC>
##$VD= 0
##$VDLIST= <DDDDDDDDDDDDDDD>
##$VPLIST= <PPPPPPPPPPPPPPP>
##$VTLIST= <TTTTTTTTTTTTTTT>
##$WBST= 1024
##$WBSW= 4
##$XGAIN= (0..3)
0 0 0 0 
##$XL= 0
##$YL= 0
##$YMAX_a= 109653
##$YMIN_a= -136631
##$ZGOPTNS= <>
##$ZL1= 120
##$ZL2= 120
##$ZL3= 120
##$ZL4= 120
##$ABSF1= 10
##$ABSF2= 0
##$ABSG= 5
##$ABSL= 3
##$ALPHA= 0
##$AQORDER= 0
##$ASSFAC= 0
##$ASSFACI= 0
##$ASSFACX= 0
##$ASSWID= 0
##$AUNMP= <proc_1d>
##$AZFE= 0.1
##$AZFW= 0.1
##$BCFW= 1
##$BC_mod= 2
##$BYTORDP= 1
##$COROFFS= 0
##$CY= 11.3945322036743
##$DATMOD= 1
##$DC= 2
##$DFILT= <>
##$DTYPP= 0
##$F1P= 15.7292609196834
##$F2P= 12.9074282941183
##$FCOR= 0.5
##$FTSIZE= 0
##$FT_mod= 4
##$GAMMA= 1
##$GB= 0.15
##$INTBC= 1
##$INTSCL= 1
##$ISEN= 128
##$LB= 0.24
##$LEV0= 0
##$LPBIN= 0
##$MAXI= 10000
##$MC2= 0
##$MEAN= 0
##$ME_mod= 0
##$MI= 1.114404
##$NCOEF= 0
##$NC_proc= 0
##$NLEV= 6
##$NOISF1= 3.799351
##$NOISF2= 2.8
##$NSP= 1
##$NTH_PI= 0
##$NZP= 0
##$OFFSET= 15.70392
##$PC= 1
##$PHC0= -24857.01
##$PHC1= 15.98731
##$PH_mod= 1
##$PKNL= yes
##$PPARMOD= 0
##$PSCAL= 0
##$PSIGN= 0
##$REVERSE= no
##$SF= 200.130013532006
##$SI= 16384
##$SIGF1= 3
##$SIGF2= 2
##$SINO= 400
##$SIOLD= 16384
##$SREGLST= <1H.CDCl3>
##$SSB= 0
##$STSI= 0
##$STSR= 0
##$SW_p= 3612.71676300578
##$SYMM= 0
##$S_DEV= 0
##$TDeff= 0
##$TDoff= 0
##$TI= <>
##$TILT= no
##$TM1= 0
##$TM2= 0
##$TOPLEV= 0
##$USERP1= <user>
##$USERP2= <user>
##$USERP3= <user>
##$USERP4= <user>
##$USERP5= <user>
##$WDW= 1
##$XDIM= 8192
##$YMAX_p= 0
##$YMIN_p= 0
$$ End of Bruker specific parameters
$$ ---------------------------------
##NTUPLES= NMR FID
##VAR_NAME=  TIME,          FID/REAL,        FID/IMAG
##SYMBOL=    X,             R,               I
##VAR_TYPE=  INDEPENDENT,   DEPENDENT,       DEPENDENT
##VAR_FORM=  AFFN,          ASDF,            ASDF
##VAR_DIM=   8192,          8192,            8192
##UNITS=     SECONDS,       ARBITRARY UNITS, ARBITRARY UNITS
##FACTOR=    0.0002768,     1,               1
##FIRST=     0,             0,               0
##LAST=      2.2672688,     0,               0
##MIN=       0,             -136631,         0
##MAX=       2.2672688,     109653,          0
$$ Real data points
##PAGE= N=1
##DATA TABLE= (X++(R..R)), XYDATA
$$ plain form
0 0 0 0 0 0 0 0 0 0 0 0 0 0 0 1 -8 8 -8 8 -9 16 -16 24 -24 32 -32 40 -48 56 -64 72 -81 90 -105 120 -132 148
36 148 -169 187 -211 235 -261 291 -324 356 -396 437 -480 528 -584 642 -708 780 -860 949
54 949 -1050 1162 -1290 1437 -1608 1809 -2050 2346 -2719 3205 -3869 4827 -6352 9131 -15855
69 -15855 66027 16336 -129876 38659 99708 -37997 -71623 48238 19037 -55510 -6563
80 -6563 27536 -42772 -20634 46987 -6809 -59845 31859 62077 -37970 -40957 67551 46087
92 46087 -53584 -23907 54913 15491 -39400 -6613 18590 -14961 -21228 4326 1659 -13650 -5400
105 -5400 2094 -329 3492 6150 873 4794 12668 7162 -2482 -1693 5328 9927 1388 -15058 -11278
120 -11278 8103 2227 -16341 -4312 9544 -10152 -14488 15010 13007 -16621 -2818 24289 1198
$$ packed form
0@%%%%%%%%%%%%%JrJ6j6J6j7K5l2M0m8N6o4P2q8J04j20J36j53J71j95K25k52K80
36A48l17L56l98M46m96N52o15O80p52Q33r17J008j112J226j350J488j640J809
54I49j999K212k452K727l045L417l859M396n065N924p074Q696j1179J5483k4986
69a5855Q1882m9691j46212J68535O1049j37705l3626J19861k9201p4547M8947
80f563L4099p0308K2138O7621n3796n3036R1704L0218j00047k987J08508k1464
92D6087r9671K9677P8820l9422n4891L2787K5203l3551o267K5554k667j5309Q250
105e400P494k423L821K658n277L921P874n506r644P89P021M599q539j6446L780
120a1278J9381n876j8568J2029J3856j9696m336K9498k003k9628J3803K7107k3091
$$ plain form
133 1198 -18031 11290 19146 -12250 -9446 15811 13 -18590 3208 11496 -9782 -6043 7667
146 7667 -8972 -10729 18748 10739 -24042 -6934 26292 2485 -22445 5639 19389 -8971 -11794
159 -11794 10888 3423 -10036 5117 8840 -9181 -4348 9919 -2108 -8301 9002 5578 -14585
172 -14585 -4743 12106 -1829 -10497 5838 4802 -11665 -1801 13597 568 -9175 5139 9349
185 9349 -2577 -2730 3299 1409 2562 2604 -8808 -8619 8183 4976 -13984 -6639 10891 -752 -13977
200 -13977 2531 14020 -441 -6821 4064 6766 2374 2827 48 -2026 5182 2974 -11493 -6971
214 -6971 10394 2121 -16344 -6207 9588 -775 -10052 2622 9335 -505 -3371 3197 5466 5143
228 5143 3386 -2422 -1725 5265 864 -8471 -2175 5768 -3999 -11415 -1464 4048 -2716 -2991 2649 1247
$$ packed form
133A198j9229K9321P856l1396K804K5257j5798j8603K1798Q288k1278L739J3710
146G667j6639j757K9477q009l4781J7108L3226k3807k4930K8084J3750k8360k823
159a1794K2682p465j3459J5153L723j8021M833J4267j2027o193J7303l424k0163
172a4585R842J6849j3935q668J6335j036j6467R864J5398j3029r743J4314M210
185I349j1926j53O029j890J153M2j1412J89J6802l207j8960P345J7530j1643j3225
200a3977J6508J1489j4461o380J0885K702m392M53k779k074P208k208j4467M522
214f971J7365q273j8465J0137J5795j0363r277J2674O713r840k866O568K269l23
228E143j757n808O97O990m401r335O296P943r767p416R951N512o764k75N640j402
$$ plain form
244 1247 -453 3016 3286 2596 5489 2453 -3727 1105 5859 -3053 -6440 3698 1759 -11244 -6116
259 -6116 6867 132 -8449 745 5300 -3138 -1410 6858 2794 -725 5037 1634 -5428 3491 8746
274 8746 -5851 -9104 6761 3864 -13313 -5364 11126 616 -11929 -160 7494 -2147 -2226 6328
288 6328 2082 -2960 3340 3074 -3654 1781 6900 -3853 -8184 3580 4578 -6969 -4620 5532 876
303 876 -6905 -1520 4127 1242 -3 1223 -412 -37 2694 1083 -501 2207 983 -3593 -1393 2567
319 2567 -343 -2408 519 -494 -3211 191 2117 -1608 -289 3726 -698 -4199 2521 5002 -1791
334 -1791 -1662 3471 -825 -4489 2605 4148 -3922 -2869 3761 -951 -5363 2550 5020 -3764 -3360 4322
350 4322 937 -4286 1991 4956 -2163 -2838 2584 80 -2699 2638 2808 -4112 -2614 3221 16 -3133
$$ packed form
244A247j700L469K70o90K893l036o180M832M754q912l387J0138j939j3003N128
259f116J2983o735q581R194M555q438J728Q268m064l519N762l403p062Q919N255
274H746j4597l253J5865k897j7177P949J6490j0510j2545J1769P654r641p9Q554
288F328m246n042O300k66o728N435N119j0753m331J1764R98j1547K349J0152m656
303H76p781N385N647k885j245J226j635L75K731j611j584K708j224m576K200L960
319B567k910k065K927j013k717L402J926l725J319M015m424l501O720K481o793
334a791J29N133m296l664P094J543q070J053O630m712m412P913K470q784M04P682
350D322l385n223O277K965p119o75N422k504k779N337J70o920J498N835l205l149
$$ plain form
366 -3133 1955 2635 -3111 -2078 2631 787 -1043 1830 831 -2330 77 1824 -1195 -152 2889 -1157
382 -1157 -4182 1192 2891 -2353 -1100 3394 -972 -4408 1956 3987 -2187 -1409 3603 -553 -4220
397 -4220 2131 4099 -2647 -2151 3335 -613 -4712 1802 4448 -2764 -3183 3154 646 -4087 1403 5084
413 5084 -1646 -3923 2340 2338 -2848 -433 3843 -204 -3890 -125 2123 -716 -877 1433 -151 -2255
429 -2255 -7 1718 -87 -323 1590 273 -2454 -549 2980 1219 -2341 -767 1897 -594 -2776
444 -2776 873 3264 -770 -3180 179 1763 -628 -277 1864 16 -1896 295 1054 -941 398 2426
460 2426 -1172 -3568 1061 3160 -1540 -2045 2619 1184 -3611 -983 3527 910 -2096 218 827 -1691
476 -1691 -382 2207 87 -1792 390 447 -2006 -232 3008 556 -2559 -163 1963 -476 -1027 1923
$$ packed form
366c133N088O80n746J033M709j844j830K873r99l161K407J747l019J043L041m046
382a157l025N374J699n244J253M494m366l436O364K031o174P78N012m156l667
397d220O351J968o746M96N486l948m099O514K646p212m19O337k508m733N490L681
413E084o730k277O263kn186K415M276m047l686L765K248k839j61K310j584k104
429b255K248J725j805k36J913j317k727J905L529j761l560J574K664k491k182
444b776L649K391m034k410L359J584k391L51K141j848j912K191P59j995J339K028
460B426l598k396M629K099m700n05M664j435m795K628M510k617l006K314O09k518
476a691J309K589k120j879K182N7k453J774L240k452l115K396K126k439n51K950
$$ plain form
492 1923 1514 -1800 -1534 972 442 -688 607 496 -1887 -1518 1226 991 -817 190 1294 -793 -1463
509 -1463 1420 2233 -419 -892 864 -193 -1720 396 1903 -675 -2072 54 210 -1547 93 2411
525 2411 95 -2217 235 1914 -154 -146 2077 589 -2168 -355 1644 -472 -1098 1169 -26 -2925
541 -2925 -972 1948 97 -1393 890 915 -1742 -393 2708 1285 -1103 294 1074 -1056 -876 1587
557 1587 870 -1579 -1169 -20 -827 -779 968 682 -1174 -846 693 476 119 1289 1320 -556 -1012 507
575 507 1010 116 -91 -22 -799 -1240 -296 436 46 -236 -275 -611 -618 463 1317 737 -146 -216 79 82 340 829
597 829 395 -716 -964 -342 -147 -101 482 202 -1034 -1044 360 732 242 552 576 -624 -732 748 1009 -68
617 -68 6 219 -894 -1102 507 870 -333 -440 -97 -877 -605 1219 1140 -695 -441 811 -188 -988 966
$$ packed form
492A923m09l314K66K506n30j130J295j11k383L69K744k35j808J007J104k087o70
509a463K883Q13k652m73J756j057j527K116J507k578j397K126J56j757J640K318
525B411k316k312K452J679k068QK223j488k757J813J999k116o26K267j195k899
541b925J953K920j851j490K283K5k657J349L101j423k388J397P80k130J80K463
557A587p17k449M10J149q07M8J747k86j856L28J539k17l57J170L1j876m56J519
575E07N03q94k07O9p77m41R44P32l90k82l9l36pJ081Q54n80q83p0K95LK58M89
597H29m34j111k48O22J95M6N83k80j236j0J404L72m90L10K4j200j08J480K61j077
617f8P4K13j113k08J609L63j203j07L43p80K72J824p9j835K54J252r99q00J954
$$ plain form
636 966 1788 -516 -1585 -4 431 -332 252 693 -677 -1130 368 281 -619 632 1573 -730 -1949 495
654 495 1743 -123 -590 705 -16 -1341 -139 1220 156 -476 241 -247 -1221 38 1517 431 -929
671 -929 -272 200 -378 78 1097 363 -897 -438 304 -285 -205 1032 689 -1194 -1171 522 833 -81 -13 286
691 286 -380 -640 219 558 215 392 138 -988 -847 872 1154 -329 -605 87 -114 -506 229 794 -53
710 -53 -369 -368 -495 -220 860 918 -440 -886 -48 238 7 336 542 -158 -647 -264 24 220 667 340 -791
731 -791 -914 149 604 179 64 86 -381 -468 54 396 446 431 -94 -831 -472 642 752 -47 -326 -133 -384
752 -384 -376 234 597 182 -285 -446 -482 12 750 650 -220 -539 -106 84 -10 369 603 -51 -833 -535 205 409
774 409 264 80 -377 -664 -204 415 349 168 235 -187 -699 -123 880 661 -156 -286 -186 -333 -91 470 380
$$ packed form
636I66Q22k304j069J581M35p63N84M41j370m53J498q7r00J251R41k303j219K444
654D95J248j866m67J295p21j325J202J359j064o32P17m88r74J259J479j086j360
671i29O57M72n78M56J019p34j260M59P42n89Q0J237l43j883K3J693L11r14O8K99
691B86o66k60Q59L39l43J77k54j126J41J719K82j483k76O92k01l92P35N65q47
710e3l16Jj27K75J080N8j358m46Q38K86k31L29K06p00m89L83K88J96M47l27j131
731g91j23J063M55m25j15K2m67q7N22L42N0j5n25p37L59J114J10p99k79J93k51
752c84QO10L63m15m67j61l6M94P38j00q70l19M33J90r4L79K34o54p82K98P40K04
774D09j45j84m57k87M60O19o6j81O7m22n12N76J003k19q17j30J00j47K42N61r0
$$ plain form
795 380 -180 -341 -438 -482 234 866 277 -646 -471 150 136 130 530 370 -324 -469 -156 138 482 598 -219 -1019
817 -1019 -473 511 288 -155 151 169 -549 -581 354 709 291 102 -189 -639 -143 896 625 -430 -381 239
837 239 -266 -653 336 922 -64 -840 -389 59 71 553 626 -381 -787 206 601 -179 39 923 139 -1237
857 -1237 -498 920 503 -342 -4 -119 -871 -272 857 307 -519 64 264 -700 -406 1114 868 -484 -500
876 -500 123 -90 -20 746 383 -708 -531 166 -97 -271 517 552 -580 -890 -4 511 406 268 -72 -451
896 -451 -180 343 253 83 341 114 -668 -619 301 628 139 -296 -405 -404 -62 414 316 17 -24 -72 -385 -156 653
919 653 747 -72 -555 -280 94 129 241 291 -156 -627 -402 103 195 201 295 -175 -712 -265 621 515 -75 43 103
942 103 -444 -383 617 750 -200 -456 -39 -245 -357 409 664 -305 -657 -58 39 -169 461 732 -329 -848
$$ packed form
795C80n60j61r7m4P16O32n89r23J75O21j4oM00j60o94j45L13K94L44J16q17q00
817a019N46R84k23m43L06J8p18l2R35L55m18j89k91m50M96J039k71j055M9O20
837B39n05l87R89N86r86p76M51M48J2M82P3j007m06R93L95p80K18Q84p84j376
857a237P39J418m17q45L38j15p52N99J129n50q26N83K00r64K94J520k46j352j6
876e00O23k13P0P66l63j091J77O97k63j74P88L5j132l10Q86N15j05j38l40l79
896d51K71N23r0j70K58k27p82M9R20L27m89m35j09JL42M76r8k99m1m8l13K29Q09
919F53R4q19m83K75L74L5J12N0m47m71K25N05R2OR4m70n37M47Q86j06n90J18O0
942A03n47O1J000J33r50k56M17k06j12P66K55r69l52N99R7k08O30K71j061n19
$$ plain form
962 -848 100 585 18 19 545 -27 -840 -302 527 317 -65 -30 -336 -707 -59 679 231 -357 -91 135 -366
983 -366 -229 659 758 -170 -602 -181 118 179 342 195 -354 -481 -74 14 -36 290 356 -393 -732 -57 617 385
1005 385 9 -56 -161 -279 38 361 321 83 -146 -411 -421 115 493 214 -289 -406 -331 -33 289 332 32 -160
1027 -160 -140 -224 11 510 513 -26 -358 -303 -120 192 487 153 -485 -397 44 -67 -136 354 433 -404 -713 25 481
1050 481 256 222 138 -334 -415 272 461 4 18 185 -401 -712 124 727 95 -432 -188 -141 -232 186 532 160
1072 160 -305 -144 -20 -52 233 558 187 -439 -443 -12 326 241 49 -175 -276 -275 -107 175 365 154 -259 -377
1094 -377 -162 223 486 339 -217 -357 6 86 -46 260 476 -184 -753 -259 359 236 -31 8 -175 -451 -131
1115 -131 323 330 161 95 -228 -384 122 624 313 -183 -167 -107 -270 -69 346 339 -239 -515 -321 38 237 222 76
$$ packed form
962h48R48M85n67JN26n72q13N38Q29k10l82L5l06l71O48P38m48n88K66K26n01
983c66J37Q88R9r28m32M21K99O1J63j47n49j27M07Q8n0L26O6p49l39O75O74k32
1005C85l76o5j05j18L17L23m0k38k29k65j0N36L78k79n03j17P5K98L22M3l00j92
1027a60K0q4K35M99Ln39l32N5J83L12K95l34o38Q8M41j11o9M90P9q37l09P38M56
1050D81k25l4q4m72q1O87J89m57J4J67n86l11Q36O03o32n27K44M7r1M18L46l72
1072A60m65J61J24l2K85L25l71o26mM31L38q5j92k24j01JJ68K82J90k11m13j18
1094c77K15L85K63j47n56j40L63Q0j32L06K16o60n69M94O18j23k67L9j83k76L20
1115a31M54Pj69o6l23j56N06N02l11m96J6O0j63K01M15pn78k76J94L59J99j5j46
$$ plain form
1138 76 -95 -206 -182 120 439 417 -54 -333 -188 -14 120 291 148 -252 -441 -203 -25 134 299 106 -380
1159 -380 -358 99 314 219 245 192 -266 -366 105 445 261 -117 -253 -247 -249 -47 312 279 -173 -357 -200 -10 141
1182 141 405 299 -235 -342 28 182 82 220 248 -317 -545 -34 358 176 -2 -64 -246 -322 27 376 292
1203 292 37 -121 -281 -175 155 406 149 -179 -252 -230 -94 179 359 131 -183 -315 -130 173 339 206 -100
1224 -100 -234 -207 -134 52 308 185 -259 -431 -149 67 177 291 131 -246 -226 50 185 285 318 16 -427
1245 -427 -344 145 228 -22 -83 -121 -349 -363 79 376 233 -93 -155 -77 85 344 411 212 -117 -231 -161 -53 142
1268 142 225 -153 -577 -413 43 40 -53 224 236 -301 -321 358 620 247 38 111 -150 -276 117 339 -33 -284
1290 -284 -287 -436 -348 222 398 -128 -367 39 177 -72 272 687 239 -420 -231 273 248 -9 26 -105 -429 -407
$$ packed form
1138G6j71j11K4L02L19k2m71k79J45J74J34J71j43m00j89K38J78J59J65j93m86
1159c80K2M57K15r5K6n3m58j00M71L40j84l78j36OkK02L59l3m52j84J57J90J51
1182A41K64j06n34j07L70J54j00J38K8n65k28N11L92j82j78o2j82p6L49L49q4
1203B92k55j58j60J06L30K51k57l28p3K2J36K73J80k28l14j32J85L03J66j33l06
1224a00j34K7P3J86K56j23m44j72K82K16J10J14j60l77K0K76J35J00L3l02m43
1245d27Q3M89Q3k50o1l8k28j4M42K97j43l26o2P8J62K59O7j99l29j14P0J08J95
1268A42Q3l78m24J64M56lr3K77J2n37k0O79K62l73k09P3k61j26L93K22l72k51
1290b84lj49Q8N70J76n26k39M06J38k49L44M15m48o59J89N04k5k57L5j31l24K2
$$ plain form
1312 -407 -132 138 203 56 -314 -345 106 419 286 116 141 34 -185 -147 228 436 102 -491 -516 3 170 -126
1334 -126 -81 238 -54 -516 -152 585 531 -85 -212 -21 5 -1 114 121 7 -110 -342 -397 97 573 185 -445 -291
1357 -291 254 197 -133 202 510 -84 -665 -216 464 233 -251 -188 -63 -178 -178 140 280 192 25 -144 -193 152
1379 152 542 300 -235 -260 -23 -212 -259 227 317 -475 -739 16 366 29 -76 340 220 -165 -53 351 449
1400 449 339 11 -389 -325 101 121 -304 -205 -8 -392 -625 -15 618 341 -178 -152 215 415 393 205 149 258
1422 258 -14 -455 -347 271 172 -437 -622 -290 -220 -158 201 307 -34 -202 112 401 449 441 257 -28 -103 6
1444 6 -61 -11 113 -190 -693 -518 87 56 -285 -43 312 42 -316 81 735 780 81 -397 -147 455 351 -265
1466 -265 -361 14 -73 -612 -587 143 424 -99 -473 -224 308 390 219 185 325 201 -182 -174 296 507 -15 -539
$$ packed form
1312d07K75K70O5j47l70l1M51L13j33j70K5j07k19L8L75K08l34n93k5N19J67k96
1334a26M5L19k92m62L64P37n4o16j27J91K6oJ15Pj14j17k32n5M94M76l88o30J54
1357b91N45n7l30L35L08n94n81M49O80k31m84O3J25j15%L18J40q8j67j69m9L45
1379A52L90k42n35k5K37j89m7M86R0p92k64P55L50l37j05M16j20l85J12M04R8
1400D49j10l28m00O4M26K0m25R9J97l84k33O10O33k77n19K6L67K00k2j88n6J09
1422B58k72m41J08O18r9o09j85L32P0O2L59J06l41j68L14K89M8qj84k85p5J09
1444Fo7N0J24l03n03J75O05l1l41K42L55k70l58L97O54M5o99m78K50O02j04o16
1466b65r6L75q7n39K5P30K81n23l74K49N32Q2j71l4J40j24l83QM70K11n22n24
$$ plain form
1488 -539 -463 -37 13 -82 -42 -10 -203 -283 59 326 280 73 141 117 -90 -83 283 428 27 -409 -427 -73 191 121
1512 121 -196 -263 -50 23 -155 -21 469 394 -285 -480 149 510 99 -164 35 76 -210 -205 56 263 220 -76
1534 -76 -445 -282 319 453 -39 -314 16 110 -150 -125 272 273 -150 -299 -107 86 181 205 43 -157 -175 -11 64
1557 64 175 204 12 -296 -249 18 180 87 38 -72 -196 -198 125 376 200 -96 -116 40 51 22 155 267 3
1580 3 -357 -335 80 306 66 -216 -214 -69 -52 39 197 214 42 -132 -122 61 322 323 -56 -253 -66 -21 -147 -10
1604 -10 251 -35 -444 -308 134 164 30 135 112 -190 -138 307 340 99 27 8 -234 -151 196 187 -146 -113 -96 -339
1628 -339 -239 307 347 -127 -258 88 88 -22 261 368 -66 -236 4 47 -41 161 136 -285 -417 -78 76 -19
1650 -19 85 84 -191 -246 81 260 217 221 94 -183 -90 218 252 14 -40 -62 -309 -296 66 189 -83 -195 -125 -121 -71
$$ packed form
1488e39P6M26N0r5M0L2j93q0L42K67m6k07O8k4k07PL66J45m01m36j8L54K64p0
1512A21l17o7K13P3j78J34M90p5o79j95O29L61m11k63J99M1k86NK61K07m3k96
1534g6l69J63O01J34m92k75L30R4k60K5L97Jm23j49J92J93R5K4j62k00j8J64P5
1557F4J11K9j92l08M7K67J62r3m9j10j24kL23K51j76k96k0J56J1k9J33J12k64
1580Cl60K2M15K26k40k82KJ45J7R1J58J7j72j74J0J83K61Jl79j97J87M5j26J37
1604a0K61k86m09J36M42L0j34J05k3l02N2M45L3k41p2j9k42Q3L47rl33L3J7k43
1628c39J00N46M0m74j31L46%j10K83J07m34j70K40M3q8K02k5m21j32L39J54r5
1650a9J04jk75n5L27J79m3Mj27k77R3L08L4k38n4k2k47J3L62J23k72j12P0MN0
$$ plain form
1675 -71 241 321 109 -21 -14 -10 129 364 183 -221 -221 -49 -143 -203 58 113 -290 -406 -131 157 196 130 101 33 25 115
1701 115 159 265 299 43 -298 -280 92 139 -149 -245 -172 -231 -328 -67 255 219 -58 -100 68 221 311 317 185 -6
1725 -6 -25 -60 -94 26 122 -166 -553 -333 34 -90 -120 68 89 -162 -91 312 415 263 215 123 -86 -20 206 139
1749 139 -155 -141 -160 -443 -359 120 122 -255 -226 42 -20 -8 384 441 107 13 122 72 108 315 79 -342 -274 -48
1773 -48 -169 -265 70 42 -331 -343 65 236 196 203 110 -23 82 244 138 114 257 -1 -419 -204 219 78 -233
1796 -233 -194 -60 -240 -206 129 230 27 -39 -73 -37 142 366 187 -108 -20 53 -113 -83 254 150 -281 -354 -28
1819 -28 52 -63 2 93 -91 -247 -91 188 234 122 -13 -75 -49 65 165 128 96 -17 -140 -196 -9 265 108
1842 108 -281 -252 -8 -47 -147 72 235 -89 -309 -16 247 178 136 163 11 -64 65 155 72 102 17 -279 -334 -46
$$ packed form
1675g1L12Q0k12j30PMJ39K35j81m04%J72r4o0K61N5m03j16K75K88L9o6k9o8qR0
1701A15M4J06L4k56l41J8L72M7k88r6P3n9r7K61L22l6k77m2J68J53R0Oj32j91
1725fj9l5l4J20R6k88l87K20L67j24l0J88K1k51P1M03J03j52m8r2k09O6K26o7
1749A39k94J4j9k83Q4M79Kl77K9K68o2J2L92N7l34r4J09n0L6K07k36m21O8K26
1773d8j21r6L35k8l73j2M08J71m0Pr3j33J05J62j06k4J43k58m18K15M23j41l11
1796b33L9J34j80L4L35J01k03o6l4L6J79K24j79k95Q8P3j66L0L37j04m31p3L26
1819b8Q0j15O5R1j84j56J56K79M6j12j35o2K6J14J00l7l2j13j23n6J87K74j57
1842A08l89K9K44l9j00K19J63l24k20K93K63o9m2K7j52p5J29R0q3L0q5k96n5K88
$$ plain form
1866 -46 143 -91 -227 -45 -99 -184 44 325 252 35 -7 89 168 247 245 44 -27 -102 -227 -191 73 61 -277 -402 -153
1891 -153 -47 -64 132 215 22 -29 110 245 286 348 154 -132 -125 66 -17 -135 -21 -55 -418 -452 -43 143 -28
1914 -28 -47 36 -9 17 202 332 256 173 62 -96 -37 183 121 -161 -262 -198 -252 -289 -19 86 -81 -219 -103 66
1938 66 186 248 266 104 -3 92 98 130 186 117 -249 -328 -86 3 -115 -96 -16 -191 -301 21 269 144 60 146 74
1963 74 -63 141 369 91 -138 33 -34 -290 -98 275 -54 -485 -162 105 -194 -155 329 170 -316 -116 311
1984 311 140 -25 328 212 -320 -175 308 125 -214 74 146 -418 -360 256 211 -287 -82 218 -180 -315 305
2005 305 433 -99 -174 198 46 -163 181 345 -126 -266 26 1 -153 115 237 -199 -362 20 134 -128 4
2026 4 274 -53 -340 25 319 105 -20 140 34 -190 -19 206 45 -80 -42 -144 -259 2 220 -30 -228
$$ packed form
1866d6J89k34j36J82n4q5K28K81p3k17m2R6P9P9kk01p1p5j25L6K64j2l38j25K49
1891a53J06j7J96Q3j93n1J39J35M1O2j94k86PJ91q3j18J14l4l63l4M09J86j71
1914b8j9Q3m5K6J85J30p6q3j11j58N9K20o2k82j01O4n4l7K70J05j67j38J16J69
1938F6J20O2J8j62j07R5OL2N6o9l66p9K42Q9j18J9Q0j75j10L22K48j25q4Q6p2
1963G4j37K04K28k78k29J71o7k56J92L73l29m31L23K67k99L9M84j59m86K00M27
1984C11j71j65L53j16n32J45M83j83l39K88P2n64N8O16m5m98K05L00l98j35O20
2005C05J28n32p5L72j52k09L44J64m71j40K92k5j54K68J22m36j63L82J14k62J32
2026DK70l27k87L65K94k14j25J60j06k24J71K25j61j25L8j02j15K61K18k50j98
$$ plain form
2047 -228 10 21 -154 21 334 187 -191 -85 110 55 39 223 89 -178 -142 6 -55 -8 134 -71 -345 -115
2069 -115 188 4 -59 217 101 -245 -72 338 201 -29 95 26 -220 -65 184 41 -156 -8 -52 -284 -69
2090 -69 313 74 -246 -7 85 -156 -21 343 148 -168 -55 93 -65 -2 258 16 -309 -84 89 -92 -82
2111 -82 228 42 -329 -141 237 74 -70 193 119 -221 -94 223 148 -45 85 10 -255 -80 229 92 -194
2132 -194 7 66 -239 -147 254 231 -181 -142 106 10 -86 154 251 -89 -198 33 58 -36 121 131 -187 -234 69 110
2156 110 -85 39 192 -90 -308 81 321 -9 -151 131 68 -236 -25 305 113 -148 -37 6 -131 -5 199
2177 199 42 -178 -66 22 -116 14 261 75 -259 -92 162 17 -72 152 115 -190 -145 100 133 2 -12 -18 -107
2200 -107 -65 60 47 58 85 -50 -211 -16 227 79 -55 6 20 -98 -54 144 172 -2 -128 -103 -7 79 74 -3 -49
$$ packed form
2047b28K38J1j75J75L13j47l78J06J95n5j6J84j34k67L6J48o1M7J42k05k74K30
2069a15L03j84o3K76j16l46J73M10j37k30J24o9k46J55K49j43j97J48m4k32K15
2090f9L82k39l20K39R2k41J35L64j95l16J13J48j58O3K60k42l25K25J73j81J0
2111h2L10j86l71J88L78j63j44K63p4l40J27L17p5j93J30p5k65J75L09j37k86
2132a94K01N9l05R2M01k3m12L9K48r6r6K40R7l40j09K31K5r4J57J0l18m7L03M1
2156A10j95J24J53k82k18L89K40l30j42K82o3l04K11L30j92k61J11M3j37J26K04
2177A99j57k20J12Q8j38J30K47j86l34J67K54j45q9K24l7l05M5K45L3j31j4oq9
2200a07M2J25j3J1K7j35j61J95K43j48j34O1J4j18M4J98K8j74j26K5R6Q6np7m6
$$ plain form
2225 -49 -74 -92 -68 94 157 26 -137 -97 44 67 43 74 58 -74 -138 -4 144 97 -4 -51 -91 -70 -7 65 63 -6 -74
2252 -74 -111 -54 88 173 32 -71 -25 -52 1 58 153 27 -117 -110 -22 26 39 82 -52 -149 -91 57 28 36 60 33 -147
2279 -147 -110 90 139 53 -35 -28 -39 7 102 94 32 -5 -73 -166 -1 156 99 -110 -75 21 -20 -55 102 203 -15 -185 -64
2306 -64 113 57 31 44 -18 -113 -85 -7 109 83 -41 -132 -131 32 99 6 11 70 -5 -144 -25 218 143 -114 -103 10 -8
2333 -8 -54 93 98 -37 -144 -84 -15 77 87 1 -115 -54 -33 21 48 129 43 -142 -109 72 108 16 27 -20 -102 -72 43 77
2361 77 56 15 -93 -123 21 91 42 26 58 -8 -131 18 164 76 -41 -38 -12 -101 3 139 9 -82 -43 -41 -101 70
2387 70 136 -31 -118 -11 -1 -65 93 172 -27 -164 10 77 -23 7 108 -27 -187 -77 97 37 -23 37 -20 -134
2411 -134 -15 137 89 22 40 -23 -130 29 177 80 -58 -23 -17 -108 -44 121 99 -116 -139 -26 22 -4 69 82 -24
$$ packed form
2225d9k5j8K4J62O3j31j63M0J41K3k4L1j6j32o4J34J48m7j01m7m0K1O3P2ko9o8
2252g4l7N7J42Q5j41j03M6k7N3N7R5j26j44PQ8M8J3M3j34r7N8J48k9QK4k7j80
2279a47L7K00M9q6q8Pj1M6R5qo2l7o8r3J65J57n7k09L5R6m1l5J57J01k18j70J21
2306f4J77n6k6J3o2r5K8P8J16k6j24r1JJ63O7r3NN9p5j39J19K43p5k57J1J13j8
2333hm6J47Nj35j07O0O9R2J0q6j16O1K1N4K7Q1q6j85L3J81L6r2J1m7q2L0J15L4
2361G7k1m1j08l0J44P0m9j6L2o6j23J49J46q8j17LK6q9J04J36j30r1L9Ko0J71
2387G0O6j67q7J07J0o4J58P9j99j37J74O7j00L0J01j35j60J10J74o0o0O0n7j14
2411a34J19J52m8o7J8o3j07J59J48r7j38L5Or1O4J65k2k15k3J13M8k6P3J3j06
$$ plain form
2436 -24 -101 -44 66 85 70 0 -38 -52 -23 66 63 2 -34 -88 -99 10 98 85 -37 -36 -29 -40 2 125 103 -24 -70 -23 40
2465 40 29 49 36 -63 -115 -59 -14 94 62 -52 -74 -13 -4 -4 107 101 -69 -100 -9 66 18 77 12 -52 -96 22 44 53 40 15
2495 15 -105 -114 41 117 12 13 30 -46 -99 85 182 34 -74 -51 -5 -29 49 65 9 -100 -74 -68 -10 58 75 23 -80 -63
2523 -63 -12 43 82 68 -6 -53 -34 45 82 56 8 -84 -51 -46 4 69 59 -39 -112 -45 14 27 75 62 -13 -89 -19 85 67 31
2553 31 34 -27 -103 -59 52 61 -25 -74 -39 -77 -47 95 80 -43 -80 -6 -24 -8 130 114 -51 -110 36 47 -5 62 80 -89
2581 -89 -145 16 105 -6 -1 76 -70 -107 34 121 14 -18 32 -18 -82 32 142 -13 -77 -18 -54 -94 -9 132 30 -92
2607 -92 -60 16 -25 12 100 62 -72 -63 11 40 59 51 4 -78 -95 11 58 26 -4 -35 -66 -70 -9 84 36 -20 -58 -21 6 46 93
2638 93 53 -31 -84 -13 36 41 45 26 -94 -87 -12 33 19 55 -22 -110 -44 4 87 55 20 -30 -77 -4 35 77 52 -4 -77 -65 -31
$$ packed form
2436b4p7N7J10J9j5p0l8j4K9Q9lo1l6n4j1J09Q8j3j22JPj1M2J23k2j27m6M7O3
2465D0j1K0j3r9n2N6M5J08l2j14k2O1R%J11oj70l1R1P5m8N9o5o4m4J18K2Rj3k5
2495A5j20rJ55P6j05JJ7p6n3J84R7j48j08K3M6k4P8J6n6j09K6ON8O8J7n2j03J7
2523f3N1N5L9j4p4m7J9P9L7k6m8r2L3NN0O5j0r8p3O7N9J3M8j3p5p6P0J04j8l6
2553C1Lo1p6M4J11Rq6m9L5l8L0J42j5j23l7P4j8J6J38j6j65n9J46J1n2O7J8j69
2581h9n6J61Q9j11NP7j46l7J41Q7j07l2N0n0o4J14J10j55o4N9l6m0Q5J41j02j22
2607i2L2P6m1L7Q8l8j34RP4K9J9qm7q2j7J06M7l2l0l1l1mO1R3m8n6l8L7K7M0M7
2638I3m0q4n3P1M9NMj9j20PP5M5j4L6p7q8O6M8Q3l2l5n0m7P3L9M2k5n6p3J2L4
$$ plain form
2669 -31 28 56 7 -53 -69 -56 28 55 64 17 -60 -79 13 51 69 48 -35 -66 -47 10 66 30 -31 -25 -49 -43 18 76 64 -11 -46 -9
2701 -9 -5 65 91 22 -29 -55 0 18 64 88 -28 -55 -38 -14 -5 27 18 -35 -106 -45 6 45 68 34 -62 -84 -9 65 45 24 0 -25
2733 -25 -85 -5 71 31 -9 -50 -48 -17 3 60 40 -3 -57 -46 -1 86 63 29 -1 -52 -5 30 65 34 1 -30 -53 -83 50 81
2763 81 -25 -65 -39 -41 -37 23 102 30 1 -10 -10 24 52 67 -4 -74 -63 22 22 34 18 -31 -97 -42 61 49 5 23 -1 -39 -41 61
2795 61 102 6 -53 -17 -3 -18 46 27 10 -81 -51 -17 -2 38 37 -48 -54 -29 30 24 37 51 27 -60 -48 48 87 14 -37 -3 -36 -53
2827 -53 15 86 -1 -53 -48 -30 11 63 47 19 -20 -21 23 51 60 60 16 -104 -29 35 38 -10 -14 -15 -51 -75 54 69 36 -33 -47 -19 17
2860 17 52 36 59 -16 -56 -13 27 72 53 2 -48 -39 20 23 1 26 31 -71 -71 42 112 31 -7 -27 -19 -28 24 94 42 -27 -55 -47 0
2893 0 51 48 -27 -56 -25 -9 -26 58 107 17 -80 -39 36 44 30 45 23 -46 -19 -13 58 45 21 -104 -51 22 44 -22 33 24 -19 -198
$$ packed form
2669c1N9K8m9o0j6J3Q4K7Rm7p7j9R2L8J8k1q3l1J9N7N6l6o1Ok4OO1N8j2p5l5L7
2701iMP0K6o9n1k6N5J8M6K4j16k7J7K4RL2rn3p1O1N1L9K3l4r6k2P5P4k0k1k4k5
2733b5o0Q0P6m0m0m1KL1K0N7k0m3n4J1M5Q7k3l4l0n1M7L5L5l1l3l1k3l0J33L1
2763H1j06m0K6kMO0P9p2k9j1%L4K8J5p1p0J1Q5%J2j6m9o6N5J03j2m4J8k4l8kJ02
2795F1M1r6n9L6J4j5O4j9j7r1L0L4J5M0jq5oK5N9oJ3J4k4q7J2R6L9p3n1L4l3j7
2827e3O8P1q7n2NJ8M1N2j6k8l9jM4K8R%m4j20P5O4Lm8mjl6k4J29J5l3o9j4K8L6
2860A7L5j6K3p5m0M3M0M5j9n1n0RN9Lk2K5Nj02%J13P0q1l8k0QrN2P0n2o9k8QM7
2893@N1lp5k9L1J6j7Q4M9r0r7M1P5Qj4J5k2o9K7OP1j3k4j25N3P3K2o6N5rm3j79
$$ plain form
2925 -198 -29 100 35 15 -11 -20 -27 54 30 37 15 -25 -90 -51 48 32 -30 -69 2 -44 -11 45 76 13 -55 -45 32 68 55 25
2955 25 -44 -19 -6 -9 24 78 20 -47 -64 24 54 28 3 4 -7 -33 -25 22 86 20 -97 -27 17 37 2 16 27 -30 -65 -4 58
2986 58 33 32 -20 -54 -36 38 26 18 35 2 -48 7 43 112 -13 -54 -34 -11 1 17 43 -9 -27 -26 -42 19 52 13 -31 -30 -3 -3
3018 -3 4 33 19 -27 -76 -8 11 29 39 -29 -42 -41 -34 2 51 18 -21 -51 -23 24 67 53 21 -12 -23 20 37 53 24 -27 -70 -68 2
3051 2 26 20 4 -17 -39 -38 42 72 17 24 -30 -10 0 50 46 -14 21 -56 -54 10 57 1 14 -7 -32 -18 39 61 -6 -2 0 -9 -17 57 83
3086 83 12 -49 -5 -32 -19 21 32 -41 -90 -39 15 20 29 34 -7 -70 7 57 82 12 -20 -9 -52 -27 26 38 3 -15 -18 -27 -8 47 45
3119 45 2 -24 -21 6 36 75 41 -13 -39 -11 17 34 8 0 -15 -51 -50 50 40 21 10 -21 -28 -4 56 26 -9 7 -51 -47 -21 67
3151 67 29 -57 -44 5 -45 7 55 56 -38 -28 14 4 52 59 -1 -39 -42 13 -16 -5 64 -44 -59 -52 43 58 37 30 4 -28 -11 70
$$ packed form
2925a98J69J29o5k0k6rpQ1k4Pk2m0o5L9R9j6o2l9P1m6L3N6L1o3o8J0P7L6j3l0
2955B5o9K5J3lL3N4n8o7j7Q8L0k6k5Jj1k6QM7O4o6j17P0M4K0l5J4J1n7l5O1O2
2986E8k5jn2l4J8P4j2qJ7l3n0N5L6O9j25m1K0K3J2J6K6n2j8Jj6O1L3l9m4JK7%
3018cPK9j4m6m9O8J9J8J0o8j3JPL6M9l3l9l0K8M7M3j4l2l3j1M3J7J6k9n1m3KP0
3051BK4oj6k1k2JQ0L0n5Pn4K0J0N0mo0L5p7KO4M7n6J3k1k5J4N7K2o7MKrqP4K6
3086H3p1o1M4k7J3M0J1p3m9N1N4NRNm1o3P7N0K5p0l2J1m3K5N3J2l5j8lrJ9N5k
3119D5m3k6LK7L0L9l4n4k6K8K8J7k6qj5l6JJ00j0j9j1l1pK4O0l0l5J6n8MK6Q8
3151F7l8q6J3M9n0N2M8Jr4J0M2j0M8Po0l8lN5k9J1O9j08j5PR5J5k1pk6l2J7Q1
$$ plain form
3183 70 52 17 -8 -45 -60 -39 18 -20 -17 -28 -40 -21 8 71 69 -13 -43 15 40 23 23 66 -8 -70 -47 -11 24 -6 -31 -50 -36 -12
3215 -12 38 18 28 61 7 -48 4 89 41 -38 -18 -3 -48 -63 27 22 -26 -45 -65 -18 40 56 6 -6 44 36 -10 26 70 44 -72
3246 -72 -79 22 -16 -14 11 -9 -40 -64 -17 38 55 62 7 -33 25 62 31 -9 -16 14 -103 -24 40 39 -43 -46 -12 -17 9 11 24 30 -10 -13
3280 -13 -5 41 80 24 -18 -40 -4 -1 -20 -10 9 -22 -60 -39 55 28 13 -20 -6 7 -2 63 53 50 -18 -66 -21 -8 43 1 -39 -25
3312 -25 -21 -16 10 18 42 0 -13 -17 40 29 3 1 -35 -13 -8 -6 32 29 -47 -66 -11 16 27 42 21 6 -35 -5 42 31 30 -19 -25 -55 -20
3347 -20 9 20 -8 -6 -25 -64 12 39 48 -13 -1 -1 -21 2 55 25 2 -46 -36 -28 8 39 13 -22 -13 20 11 40 58 0 -30 -29 12 31
3381 31 11 -5 -51 -38 -36 7 13 12 -6 -37 -52 -19 32 27 -14 -9 13 13 9 39 80 6 -25 -53 -25 -28 -8 11 -11 -43 -16 -10 18 54 52
3416 52 16 -39 13 37 34 12 15 24 -66 -12 -14 16 -26 -26 -18 -18 19 18 16 -7 1 -26 -19 17 17 -16 -30 -12 -23 -15 -4 30 4 -38 -37 -23 26
$$ packed form
3183G0j8l5k5l7j5K1N7l8Lj1j2J9K9O3kq2l0N8K5j7%M3p4o2K3L6L5l0k5j9J4K4
3215a2N0k0J0L3n4n5N2Q5m8p9K0J5m5j5R0nm8j9k0M7N8J6n0j2N0qm6L6M4k6j16
3246g2pJ01l8KK5k0l1k4M7N5J7Pn5m0N8L7l1m0pL0j17P9O4jq2lL4nK6KJ3Om0l
3280a3QM6L9n6m2k2L6Lj9J0J9l1l8K1R4k7j5l3J4J3rO5j0lo8m8M5J3N1m2m0J4
3312b5MNK6QK4m2j3mN7j1k6kl6K2NKL8lp6j9N5K7J1J5k1j5m1L0M7j1jm9ol0L5
3347b0K9J1k8Kj9l9P6K7Ro1J2%k0K3N3l0k3m8J0QL6L1k6l5RL3rK9J8n8l0JM1J9
3381C1k0j6m6J3KM3Ojj8l1j5L3N1nm1NK2%mL0M1p4l1k8K8lK0J9k2l2K7OK8L6k
3416E2l6n5N2K4lk2LRr0N4kL0m2%Q%L7jkk3Qk7PL6%l3j4J8j1QJ1L4k6m2JJ4M9
$$ plain form
3453 26 17 9 -10 -20 -28 25 24 27 53 -5 -30 -32 28 33 -47 -34 -7 -14 -5 4 24 28 -26 -22 -40 -21 36 7 -12 -5 -8 -31 -12 39 36 -6 -46 13
3491 13 1 10 10 -13 2 -39 -10 1 38 35 7 -7 3 30 32 20 26 -3 -23 -62 27 36 26 -13 -14 -18 -14 -1 8 18 19 3 -46 18 32 22
3527 22 -21 -7 4 -10 -15 18 53 -8 -30 -28 18 10 32 24 -8 -17 1 6 -7 40 -7 -34 -59 15 -3 29 -9 -19 -9 -21 -1 17 31
3560 31 -10 -6 -46 -10 10 39 1 6 -12 -17 -26 26 33 14 -18 -25 25 21 -10 29 40 -15 -31 -5 32 25 -15 -9 -1 -44 18 7 27 5 14 -40
3596 -40 -10 60 53 -1 -19 40 41 -10 31 80 1 -15 -11 9 1 -4 -5 -19 -6 -16 -29 11 32 55 19 -13 -13 44 5 -9 15 -17 -61 -37
3630 -37 40 0 11 -30 -42 -36 -8 14 34 -15 11 -17 -6 6 46 20 -19 -43 -33 -28 2 44 11 -25 -46 -13 -5 24 -15 11 -19 -9
3662 -9 16 29 28 23 -19 -14 -4 -9 35 30 8 -5 -28 -27 -10 31 -4 -14 -41 12 11 15 12 -5 -9 2 7 12 1 21 19 -32 -2 13 -9 18 6
3699 6 5 -30 -35 31 15 38 -18 -4 -23 22 13 1 29 24 -24 -32 30 45 9 10 -10 -24 -37 30 19 20 17 -21 -22 -21 19 11 -1 -19 -6 14
$$ packed form
3453B6rqj9j0qN3jLK6n8k5kO0Nq0J3K7pRRK0Mn4Mj8J9N7k9j9Plk3J9N1lm2m0N9
3491A3j2R%k3J5m1K9J1L7lk8j4J0K7Kj2Ok9k0l9Q9Rj0l9jmMJ3RJ0Jj6m9O4J4j0
3527B2m3J4J1j4nL3L5o1k2KM6qK2ql2rJ8Nj3M7m7k7k5P4j8L2l8j0J0j2K0J8J4
3560C1m1Mm0L6K0K9l8Nj8nrN2Pj9l2pN0ml1L9J1n5j6K6L7pm0OQm3O2j1K0k2Rn4
3596d0L0P0pn4j8N9Jn1M1M9p9j6MK0qnjj4J3j0j3M0K1K3l6l2%N7l9j4K4l2m4K4
3630c7P7m0J1m1j2OK8K2K0m9K6k8J1J2M0k6l9k4J0NL0M2l3l6k1L3QK9l9K6l0J0
3662iK5J3jnm2NJ0nM4nk2j3k3JJ7M1l5j0k7N3jMlj7mJ1NNj1K0kn1L0J5k2K7j2
3699Fjl5nO6j6K3n6J4j9M5rj2K8nm8qO2J5l6Jk0j4j3O7j1Jll8jJM0qj2j8J3K0
$$ plain form
3735 14 -8 41 36 -8 -6 4 2 21 31 23 -4 -29 -34 -5 16 37 31 -10 -20 4 3 8 12 6 -16 -15 6 30 13 16 0 -36 -34 -5 -1 -6 24 -32
3773 -32 -26 22 -14 15 20 -15 8 8 6 12 33 18 -37 -29 10 24 3 -1 -12 0 -19 1 28 27 -9 -11 14 1 4 8 29 -10 -16 -26 17 28
3809 28 10 5 -61 -39 6 16 4 31 24 -7 -6 -21 19 26 11 21 12 -3 -9 15 25 7 -12 -3 -40 17 14 12 12 3 -39 -19 26 -5 16 -15
3845 -15 -6 29 11 5 12 -18 -18 -26 -16 -21 -5 28 -1 -30 8 -35 12 35 18 -8 21 23 25 25 16 16 10 10 -8 12 22 -6 0 -21 -19 0 21 -11
3883 -11 -4 -23 8 -14 3 36 -13 -2 -21 -11 -15 5 4 10 -12 -25 -29 -12 -8 -1 8 7 -34 2 6 3 -9 22 -13 -24 33 2 22 6 -5 17
3919 17 -11 6 -5 -52 -13 -27 -1 4 9 9 -6 12 -2 -51 -12 6 -2 -16 -20 0 -9 -10 -7 6 -8 -24 -13 -15 1 27 -7 3 6 12 -1 0
3955 0 1 -15 -25 21 0 20 -20 -4 21 -17 21 1 12 24 2 -5 -21 -15 1 15 -10 8 2 -26 -6 -2 -7 -13 -22 -31 -7 28 -14 -14 2 14
3991 14 -12 15 34 16 -15 -24 -1 5 35 22 21 16 -3 -22 -21 5 23 -13 34 -13 -3 -16 -17 -19 -19 10 -3 1 13 24 -2 -11 -1 -14 27
$$ packed form
3735A4k2M9nm4KJ0kJ9J0qk7k5nK9K1K1om1j0K4jNMok2JK1K4j7Lj6l6KK9MnL0n6
3773c2OM8l6K9Nl5K3%kOK1j5n5QL9J4k1mj1J2j9K0K7jl6kK5j3LMK1l9oj0M3J1
3809B8j8no6K2M5J0j2K7pl1Jj5M0Pj5J0rj5oK4J0j8j9Rl7N7lk%rm2K0M5l1K1l1
3845a5RL5j8oPl0%qJ0nJ6L3k9k9L8m3M7K3j7k6K9KK%r%o%j8K0J0k8Ok1KJ9K1l2
3883a1Pj9L1k2J7L3m9J1j9J0mK0jOk2j3mJ7MPRjm1L6Mlj2L1l5j1N7l1K0j6j1K2
3919A7k8J7j1m7L9j4K6NN%j5J8j4m9L9J8qj4mK0rjLJ3j4j6J1kJ6K6l4J0LOj3J
3955@Jj6j0M6k1K0m0J6K5l8L8k0J1J2k2pj6OJ6J4k5J8ok8K0MnorrK4L5m2%J6J2
3991A4k6K7J9j8l1rK3OL0j3jnj9j9JK6J8l6M7m7J0j3jk%K9j3MJ2J1k6rJ0j3M1
$$ plain form
4026 27 17 5 -11 4 16 8 20 -15 -20 10 -14 -6 -17 12 3 20 5 5 3 13 49 16 6 0 -24 -18 15 2 -19 -32 -6 -21 -6 21
4060 21 10 -23 3 -28 -26 3 -12 -42 -3 16 3 -29 -12 29 3 -12 -7 6 9 4 3 -11 -11 -9 -10 27 36 -10 9 3 11 -24 10 22 -18 -12
4096 -12 -21 5 13 -5 6 30 -22 -6 2 10 -16 15 -4 -26 13 25 40 -4 -11 -6 -17 -15 2 24 15 -33 16 -4 5 10 2 8 17 -7 -9 18 27 1
4134 1 -5 8 12 -7 1 -6 -32 -8 14 -1 18 1 -12 -38 -21 -4 -17 -5 20 6 -15 5 -10 4 -1 21 -11 -9 3 4 0 20 -20 -28 -18
4169 -18 -20 4 15 -8 17 21 -12 7 11 -12 4 -10 -19 2 8 28 12 -17 -3 -24 -18 -20 -1 -8 -42 3 -27 12 15 11 35 -3 7 35 4
4204 4 40 14 9 -20 -9 32 -5 5 -7 -33 -12 23 -5 9 4 10 -20 7 -9 -4 -7 -3 8 -22 17 -2 35 25 -4 2 -17 14 -5 -7 12
4239 12 -8 -14 20 21 33 -12 21 4 16 -7 17 42 21 13 -22 11 -5 4 -3 -2 -8 -34 -8 2 6 -19 6 -19 -15 10 7 7 -27 2 3 1 -16
4276 -16 28 2 1 -6 5 -27 13 16 10 -22 -5 26 15 8 23 36 15 0 -29 -14 22 17 9 0 1 7 3 -8 8 -7 -9 13 6 -3 9 12 -10 -33
$$ packed form
4026B7j0j2j6J5J2qJ2l5nL0k4Qj1K9rJ7j5%kJ0L6l3j0ok4OL3j3k1j3K6j5J5K7
4060B1j1l3K6l1KK9j5l0L9J9j3l2J7M1k6j5NJ3Lnjj4%KjL7Rm6J9oQl5L4J2m0O
4096a2rK6Qj8J1K4n2J6QQk6L1j9k2L9J2J5m4pNj1KJ7K2rm8M9k0RNqORk4kK7Rk6
4134AoJ3Mj9Qpk6K4K2j5J9j7j3k6J7J7j3J2K5j4k1K0j5J4nK2l2KJ2JmK0m0qJ0
4169a8kK4J1k3K5Ml3J9Mk3J6j4rK1OK0j6k9J4k1OkJ9pl4M5l0L9LmK4l8J0K8l1
4204DL6k6nk9J1M1l7J0j2k6K1L5k8J4nOl0K7j6NlMJ1l0L9j9L7j0k9Oj9L1j9kJ9
4239A2k0oL4JJ2m5L3j7J2k3K4K5k1ql5L3j6RpJok6K6J0Mk5K5k5MK5l%l4K9Jkj7
4276a6M4k6jpJ1l2M0Lol2J7L1j1pJ5J3k1j5k9J5L6nqrJOmj1J6j5kK2prJ2Lk2k3
$$ plain form
4314 -33 8 20 16 9 10 13 -5 1 40 12 -27 22 17 8 -8 3 24 -13 16 -1 -19 15 20 33 -9 -17 -32 14 10 33 15 13 -5 -6 4 -7
4350 -7 -1 -4 -7 15 14 18 14 -17 -19 -24 5 12 8 16 -1 8 -1 13 0 21 25 -21 -18 7 11 9 16 23 -24 -5 6 14 0 19 -7 -7 -38 -5 1 11 14 0
4392 0 8 16 7 -4 3 -12 5 -26 -5 23 10 3 -24 -15 -30 -11 7 3 8 -18 0 19 -6 26 12 2 10 8 16 -33 42 -5 -4 -6 7 12 -2 -8
4430 -8 -3 -28 5 24 -3 -7 -13 -17 -44 -32 -9 19 14 8 -17 -15 -13 -11 3 15 1 -17 -11 6 -6 -25 -32 -6 20 30 12 15 10 8 1 14 10 3 -15
4469 -15 -15 -37 -9 -18 -14 19 8 -5 -19 -32 16 30 20 -4 -10 -32 -20 -12 9 12 -5 -10 9 6 19 18 30 24 9 7 18 22 23 9 18 7 -5
4506 -5 10 1 44 24 8 -1 10 7 8 -8 19 -4 -34 -17 -16 10 -8 -37 -15 -30 -5 25 9 2 -29 -1 3 -9 9 23 -27 -21 3 0 7 2
4542 2 15 4 -13 0 22 5 0 -23 -10 8 -5 23 -7 0 -14 -7 -11 24 26 -1 -13 -14 10 13 11 -5 19 -13 -7 15 0 20 -1 -18 27
4577 27 42 32 31 7 13 -8 -2 -1 46 -6 19 23 1 9 17 1 1 13 -5 -21 9 13 24 12 0 5 -41 -6 -17 33 13 6 -8 2 -17 -7
$$ packed form
4314c3M1J2mpJLj8OL9k8l9M9nrj6J1K1l7K9j7j8L4NJ3m2qj5M6mK3j8kj8jJ0j1
4350gOllK2jMml1knK9PmQj7RrJ4j3K1Mm6LK5MkPPm7J9J1Qj4J9k6%l1L3OJ0Lj4
4392@QQrj1Pj5J7l1K1K8j3pk7Rj5J9J8mNk6J8J9k5L2j4j0QkQm9P5m7JkJ3Nj4o
4430hNk5L3J9k7momk7J2K3K8nok5KKKJ4J2j4j8OJ7j2j9pK6K6J0j8LnkpJ3mpj8
4469a5%k2K8rML3j1j3j4j3M8J4j0k4ok2J2QK1Lj7nJ9lJ3jJ2oj5kJ1MJj4Rj1j2
4506eJ5rM3k0j6rJ1lJj6K7k3l0J7JK6j8k9K2j5K5L0j6pl1K8Mj2J8J4n0OK4lPn
4542BJ3j1j7J3K2j7nk3J3J8j3K8l0Pj4PmL5Kk7j2jK4Lkj6K4l2OK2j5K0k1j7M5
4577B7J5j0jk4Ok1OJM7n2K5Mk2QQj6%J2j8j6L0MJ1j2j2Nm6L5j1N0k0pj4J0j9J0
$$ plain form
4613 -7 12 1 26 -7 5 27 -7 4 10 -15 -23 21 14 16 -6 -2 4 -13 -3 17 -14 3 9 -4 -3 9 2 15 11 6 -20 -17 0 13 18 -36 -20
4650 -20 10 -3 15 23 -21 -16 -6 30 10 -1 8 -6 -8 -4 6 9 -9 5 34 11 12 24 8 13 -6 -15 -9 2 -9 5 -3 7 -12 -18 -1 -4 7
4687 7 5 -5 -17 11 0 1 -15 14 -11 -10 8 8 5 3 -23 -14 7 18 30 1 20 -1 -2 14 36 -14 -13 -5 0 1 -20 26 10 -5 15 1 7
4724 7 -14 -16 -4 -18 11 -12 27 -3 12 -4 -8 -13 -15 12 -5 0 -13 7 30 16 14 2 19 0 -10 9 22 6 16 5 34 -21 9 -4
4758 -4 24 32 -16 -11 -26 20 13 -8 0 -11 -20 1 17 9 15 -6 -22 -8 -11 8 10 16 -6 -16 5 6 -1 0 -11 -4 -9 -11 -10 11 -1 4 11 11 21 19 -2
4799 -2 0 -15 -8 -5 -2 -3 -11 1 -12 -4 3 1 10 11 -5 -15 2 -1 -28 0 10 -13 11 -14 -6 2 13 -1 -7 1 3 -10 13 -21 -3 25 -15 -29 4
4838 4 -18 -8 -31 -3 12 -26 13 0 5 13 25 -8 21 0 -13 -20 11 -4 4 -10 0 -10 -25 -5 6 19 -3 -1 -16 -6 34 16 8 -4
4872 -4 -10 7 -20 0 36 -2 3 1 32 1 8 38 -25 -32 26 -19 -11 18 22 3 14 -2 3 19 22 0 0 4 -3 -17 -15 4 -23 -22 -8 -11 -27 14
$$ packed form
4613gJ9j1K5l3J2K2l4J1Ok5qM4pKk2MOj7J0K0l1J7Oj3JJ2pJ3mnk6LJ7J3Nn4J6
4650b0L0j3J8Qm4NJ0L6k0j1Rj4kMJ0Lj8J4K9k3JJ2j6Nj9rOJ1j1J4qJ0j9oJ7lJ1
4687Gkj0j2K8j1Jj6K9k5JJ8%lkk6RK1J1J2k9J9k1jJ6K2n0JQNJk1M6j6j5K0j4O
4724Gk1kJ2j4K9k3L9l0J5j6mnkK7j7Nj3K0K3j4kj2J7j9j0J9J3j6J0j1K9n5L0j3
4758dK8Qm8Nj5M6pk1Qj1rK1J6qOk1j6J4lJ9KOk2j0K1JpJj1PnkJK1j2NP%J0kk1
4799bKj5PLLjqJ2j3QPkRJj6j0J7lk7K8J0k3K4k5QQJ1j4oQKj3K3l4J8K8m0j4L3
4838Dk2J0k3K8J5l8L9j3NQJ2l3K9k1j3pL1j5Qj4J0j0j5K0J1J3k2Kj5J0M0j8qj2
4872doJ7k7K0L6l8NkL1l1PL0o3pN8m5QK9Mj9J1j6NJ6Lk2%Mpj4KJ9k7JJ4lj6M1
$$ plain form
4910 14 7 2 -30 -5 3 26 32 1 20 -24 -9 9 7 4 8 -16 -12 -6 4 -12 -5 5 -19 -11 -29 -24 29 12 -3 -7 -11 -10 2 -11 -13 2 -29 -1
4948 -1 -12 -4 -4 7 5 0 3 0 -3 25 3 -3 20 16 -18 -6 -25 -8 -3 3 22 12 9 -1 -6 -12 -18 2 -3 4 0 1 9 16 -16 22 1 -12 16 10 1 7 7
4991 7 -1 15 1 18 -12 -1 -7 -8 -4 -5 -12 16 7 1 -24 5 9 -8 3 -6 -6 -17 2 1 -2 -13 2 16 -2 12 34 4 -8 7 5 11 24 21 -19
5030 -19 -17 11 2 -17 11 -8 12 -5 -22 -28 7 1 17 2 4 1 9 19 33 3 6 16 11 23 -2 3 -4 -19 -21 -14 -9 -22 2 -12 -18 2 14 -1
5068 -1 17 5 10 -20 -16 -10 22 -1 12 1 4 2 -11 7 18 27 12 -3 -8 20 -4 5 -11 25 14 3 36 -31 -13 11 -11 4 -11 -1 -23
5103 -23 20 -7 27 -24 4 -7 -2 6 -8 18 15 -5 8 -16 -1 1 4 -25 -1 -10 21 -18 -23 -10 -3 -23 -21 12 0 25 -5 -9 8 -4 -16
5138 -16 -20 -8 -3 6 -11 -20 -22 14 5 1 3 9 -16 -1 -2 -17 32 -5 -3 -1 12 15 16 -8 15 2 12 18 18 -1 -10 -9 2 15 7 -14 -7 -8 2 -17 -23
5179 -23 15 -18 -1 -24 -14 -12 -13 -2 12 -10 -1 -27 -27 -2 -3 2 -6 -2 -8 7 2 -16 -25 14 -1 0 16 -21 16 -4 -3 9 -3 15 4 -13 0
$$ packed form
4910A4pnl2K5QK3Ol1J9m4J5J8klMk4MOJ0j6PJ0k4Qj8NN3j7j5mmJJ2j3kJ5l1K8
4948aj1Q%J1knLllK8k2oK3ml4J2j9J7NOJ9j0lj0nooK0nPmJQPl2L8k1j3K8orO%
4991GqJ6j4J7l0J1ojMjpK8rok5K9Mj7J1r%j1J9jlj1J5J4j8J4K2l0j2J5kOJ3lm0
5030a9KK8rj9K8j9K0j7j7oL5oJ6j5KlQJ0J4l0LJ0nJ2k5Npj5kPNj3K4j4oK0J2j5
5068aJ8j2Nl0MOL2k3J3j1Lkj3J8J1Rj5j5nK8k4Rj6L6j1j1L3o7J8K4k2J5j5J0k2
5103b3M3k7L4n1K8j1NQj4K6lk0J3k4J5KLk9K4rL1l9nJ3Pk0KL3j2K5l0mJ7j2j2
5138a6mJ2NRj7rkL6rmKOk5J5jj5M9l7KKJ3LJk4K3j3J0O%j9rJJ1J3qk1PjJ0j9o
5179b3L8l3J7k3J0KjJ1J4k2Rk6%K5jNqMoJ5nj8rL9j5JJ6l7L7k0JJ2j2J8j1j7J3
$$ plain form
5216 0 12 -21 -3 -12 -15 0 2 3 -14 -15 -2 -7 -7 23 18 -7 11 3 14 10 9 -9 7 5 -3 30 1 2 -13 3 28 16 11 -3 7 9 14 25 29 8
5256 8 -10 7 -3 12 -1 15 -17 2 -2 5 -18 -29 17 -9 -2 -4 -10 14 3 -15 -20 11 5 37 -10 -5 -6 -5 18 31 -6 11 -1 -24 -15 16
5292 16 11 -8 15 -36 -10 -16 21 19 16 -7 -5 -8 -3 3 -1 -31 -9 -38 -12 -8 7 18 18 -15 -14 22 -26 -7 -11 9 7 11 13 -10 5 -3 -8 -9 -5 10
5332 10 4 7 -17 -16 28 20 22 4 24 0 19 8 -23 12 16 -7 -33 6 -36 23 -14 6 -14 -21 -18 10 -1 -14 8 -6 2 6 18 -5 13
5367 13 -6 -3 11 19 28 14 23 21 -17 12 2 12 19 -30 29 6 16 9 8 10 -13 -5 0 -3 15 -16 -19 -16 3 -4 -7 -6 -17 5 7 -27 -18 24 -8 16
5407 16 -25 12 6 -9 -7 -5 19 2 28 9 6 -27 10 6 19 6 -7 -1 20 3 -20 7 18 0 -22 10 8 -10 8 10 -13 -20 -4 -18 -17
5442 -17 -6 -5 1 -5 0 8 -9 20 -24 0 -8 -4 -9 13 0 11 -13 -7 24 14 -9 26 17 -12 -20 20 -11 6 -14 5 9 7 -11 1 -19 -2 -11
5479 -11 -22 -3 -48 -19 9 12 -27 19 -23 7 17 20 4 -2 6 27 42 6 3 -7 16 8 13 11 -10 5 4 3 -3 10 1 4 -2 -15 0 -7 -4 9
$$ packed form
5216@J2l3J8rlJ5KJj7jJ3n%L0nk5J8qJ1mjj8J6kqL3k9Jj5J6K5j2nj4J0KNJ1Mk1
5256Hj8J7j0J5j3J6l2J9mPk3j1M6k6PkoK4j1j8nL1oL2m7NjJK3J3l7J7j2k3RL1
5292A6nj9K3n1K6oL7klk3KlNOml0K2k9K6MJ5J1%l3JL6m8J9mK0kMKk3J5qnjMJ5
5332A0oLk4JM4qKj8K0k4J9j1l1L5Mk3k6L9m2N9l7K0k0pLK8j1j3K2j4QMJ2k3J8
5367A3j9LJ4QRj4Rkl8K9j0J0Pm9N9k3J0pjKk3QNlJ8l1lLJ9plJj1K2Kl4RM2l2K4
5407A6m1L7oj5KKK4j7K6j9ll3L7mJ3j3j3OK1j7k3K7J1j8k2L2kj8J8Kk3pJ6j4J
5442a7J1JOoNQj7K9m4K4qMnK2j3J1k4OL1j0k3L5rk9qM0l1J7k0J9Mkj8J2k0J7r
5479a1j1J9m5K9K8Ll9M6m2L0J0Lj6oQK1J5l6lj0K3qNkk1J5jjoJ3rLoj3J5pLJ3
$$ plain form
5517 9 -6 -25 -1 -11 -3 -19 15 -10 -32 -19 -45 9 -3 -9 6 -19 13 1 11 4 -2 -4 17 -3 8 1 18 -19 -6 -4 9 6 -2 9 -12
5552 -12 -8 2 -15 -11 -14 5 -4 -1 7 11 -3 -38 -2 -19 1 9 -12 -15 -6 -16 6 -12 6 14 -11 -2 -3 -13 -2 -10 15 14 7 -2 -5 19 -2 27 11
5591 11 20 -32 -1 -17 -4 -14 4 14 12 -3 -1 6 -2 -14 -15 -2 -6 5 16 -35 -6 -19 -5 -1 -23 18 -16 7 9 3 24 44 -18 -7 16
5626 16 24 54 24 13 -11 4 9 -20 -23 12 22 -18 -3 8 -15 -17 -14 15 20 -8 14 3 -16 4 -22 -27 19 -2 14 -15 -17 -35 -3 -12 28
5661 28 3 20 11 3 12 -23 44 -4 1 -54 -14 15 30 -16 8 34 16 2 8 22 -20 -32 -31 8 -9 -8 -16 14 -19 -30 -16 7 -13 -6 -14
5696 -14 -9 -7 -15 -11 22 18 -4 0 -1 -10 2 -6 22 -10 10 9 -1 4 10 -14 29 19 -12 -16 14 19 12 -20 2 14 -3 1 -9 -12 4 -9 -20 2 1
5735 1 -4 6 11 1 -16 11 17 9 -1 15 38 8 12 -16 -23 -11 -6 9 0 4 -21 14 12 12 4 -20 -4 1 -3 7 -3 7 -23 -12 -19 -18 -26 5 -10
5774 -10 11 5 11 -16 6 -19 -10 18 -8 -19 24 -11 -1 14 -7 -2 4 4 8 6 -24 -8 1 2 11 2 -26 10 19 23 -2 -2 22 10 -49 24 8 17
$$ packed form
5517Ij5j9K4j0Qj6L4k5k2J3k6N4j2oJ5k5L2j2J0pokK1k0J1pJ7l7J3KJ3lqJ1k1
5552a2MJ0j7MlJ9rLQMj4l5L6j7K0Qk1lRj0K2j8J8Qk5Rjj0J1qK5jprlK4k1K9j6
5591A1Rn2L1j6J3j0J8J0kj5KPqj2jJ3mJ1J1n1K9j3J4Mk2M1l4K3KoK1K0o2J1K3
5626A6QL0l0j1k4J5Nk9lL5J0m0J5J1k3kLK9Nk8K2j1j9K0k6nM6k1J6k9kj8L2rM0
5661B8k5J7rqRl5O7m8Nn5M0K9J5m6K4K6j8j4OJ4m2j2JL9j7JqL0l3j1J4K3k0Pq
5696a4NKqML3mk2MjrJ2qK8l2K0jj0NOk4M3j0l1mL0Npl2K2J2j7Mj0lJ6j3j1K2j
5735AnJ0Nj0j7K7Oqj0J6K3l0Mk8pJ2NJ5rMk5L5k%qk4J6NmJ0j0J0l0J1pJqL1j5
5774a0K1oOk7K2k5RK8k6j1M3l5J0J5k1NO%Mkl0J6RJRrk8L6RMk5%K4j2n9P3j6R
$$ plain form
5812 17 -20 14 14 0 -22 -6 -9 -24 13 -34 20 0 -1 -8 -1 18 2 -3 37 14 1 10 -2 -4 8 16 -20 4 5 -24 -3 19 -12 -29 -16
5847 -16 1 -6 -2 -4 -11 -8 -5 -28 -18 -23 -5 -7 -16 11 -10 -3 -14 -17 -23 -25 12 -17 14 29 10 16 10 -1 0 -3 7 1 25 -1 34 -37 69 -117
5885 -117 -177 16 -64 -61 -74 -170 12 83 -117 20 20 -27 -63 -40 -36 19 -66 -27 31 20 -10 -45 8 -3 53 -51 18 80 -9
5914 -9 56 49 -25 91 75 -139 -9 -18 -46 8 -6 12 -151 75 116 -62 27 -26 41 -24 32 -20 8 -21 -23 -26 2 -23 1 -12
5944 -12 8 -14 12 -19 -5 6 2 -4 -20 -14 19 9 0 11 12 19 1 18 19 22 -9 9 0 12 -16 -21 28 -7 -13 -18 13 20 -24 -10 -9 -6 -13 -9 -1
5983 -1 -10 -24 -27 -12 -32 6 22 9 6 -8 -2 12 29 28 13 7 8 1 -10 18 6 13 18 10 9 -5 5 -8 4 -7 -7 -21 -18 -21 -25 -22 21 -18 -34
6022 -34 -5 7 -26 -13 3 -4 4 9 12 13 -3 37 5 -18 0 -13 -2 7 5 24 -5 12 22 6 -1 -17 7 15 -16 10 -18 -20 10 16 4 9
6058 9 -12 17 -4 -10 -9 -6 3 -21 -42 -27 -8 -13 11 -24 8 3 9 17 -10 22 19 10 8 12 30 -4 -9 -6 7 0 -5 -12 -2 -1 12 -19 13 -14 10 -8
$$ packed form
5812A7l7L4%j4k2J6lj5L7m7N4k0jpPJ9j6nM0k3j3Rj2kJ2Ql6K4Jk9K1K2l1j7J3
5847a6J7pMkpLLk3J0nJ8krK7k1Pj1lokL7k9L1J5j9Ooj1JlJ0oK4k6L5p1J06j86
5885a17o0J93q0Lj3r6J82P1k00J37%m7l6K3MN5q5L9N8j1l0l5N3j1N6j04O9O2q9
5914iO5pp4J16j6k14J30rk8N4j4J8j63K26M1j78Q9n3O7o5N6n2K8k9klK8k5K4j3
5944a2K0k2K6l1J4J1moj6OL3j0rJ1JPj8J7JLl1J8rJ2k8nM9l5onL1Pm4J4JLpMQ
5983arj4lJ5k0L8J6j3lj4OJ4J7jj5oJpj1K8j2PNqjj4J0j3J2j1%j4LlmLM3l9j6
6022c4K9J2l3J3J6pQNLJj6M0l2k3J8j3J1RkJ9k9J7J0j6pj6K4Ql1K6k8kL0Oj2N
6058Ik1K9k1oJLRk4k1J5J9nK4l5L2nOQk7L2lrkMJ8l4nLJ3pnpJ0JJ3l1L2k7K4j8
$$ plain form
6098 -8 -36 24 6 -8 7 19 1 -7 -17 -14 22 -6 -2 0 15 -2 -3 -13 -15 -14 -14 21 9 -10 11 -13 -10 17 15 16 0 17 -8 -7 9 1 14
6135 14 30 14 -8 -1 -14 0 -22 -14 2 -1 -11 -10 -4 -29 -21 -17 -1 -2 -24 18 -17 -13 8 -23 -3 31 -7 -1 -8 24 10 -3 -8 22 -32 -11
6171 -11 -2 12 -3 -18 -15 -9 -5 -13 -6 1 22 2 1 4 8 -26 -3 -13 -15 -30 -14 -17 -1 -8 -2 -22 6 -29 -9 21 -11 12 -2 7 16 15 -12 5 8
6210 8 -4 26 -7 9 0 8 1 0 3 -34 -4 -3 -5 -12 -2 6 -16 -11 16 -6 12 -15 -36 -32 -24 0 -12 -12 16 -9 6 2 -14 23 3 -20 12 -13
6248 -13 -17 31 -1 20 -14 1 10 -8 -2 14 0 25 -17 11 -9 -6 -7 8 5 -21 -17 -17 -8 -21 -23 -8 -3 -2 -9 -33 -3 -6 -31 -11 -2 -12 -10 -19 5
6287 5 -22 16 2 1 -13 -5 2 8 -20 -9 1 11 -18 -22 11 5 -16 -34 -6 -24 -15 0 -6 0 11 -11 8 15 11 -33 -2 -2 28 11 16 -2 -20
6324 -20 -9 -12 1 3 3 -2 -24 -4 3 16 -29 18 23 9 12 -13 2 2 7 -33 -16 -24 -2 -8 -31 -18 10 23 -12 0 1 -23 -9 12 -36 6
6360 6 -12 -1 9 -14 -19 2 -1 -6 -2 -8 7 6 -7 3 27 9 17 -1 -4 -9 -1 -5 0 -15 15 -5 -7 4 -15 9 0 -3 -18 -10 -8 -17 -24 -6 -2 -8 -4 10
$$ packed form
6098hk8O0j8j4J5J2j8qj0LL6k8MKJ5j7jj0kJ%L5j2j9K1k4LK7kJj6J7k5JJ6qJ3
6135A4J6j6k2Pj3J4k2QJ6lj0JOk5QMJ6jk2M2l5MK1l1K0L4l8OpL2j4j3nL0n4K1
6171a1RJ4j5j5LOMqPPK1k0jLMl4K3j0kj5J6lJ6pOk0K8l5K0L0l2K3j4RRjk7J7L
6210Hj2L0l3J6rQpjLl7L0JkpJ0Qk2NK7k2J8k7k1MQK4j2%K8k5J5mj6L7k0k3L2k5
6248a3mM8l2K1l4J5Rj8OJ6j4K5m2K8k0LjJ5lk6M%Rj3kJ5NJpk4L0lk5K0Rj0KrK4
6287Ek7L8j4jj4QPOk8J1J0J0k9mL3ok1j8K8j8RJ5oOJ1k2J9Pmm4L1%L0j7Nj8j8
6324b0J1lJ3K%nk2K0PJ3m5M7Nj4Lk5J5%Nm0J7qK2ok3J3K8J3l5J2Jk4J4K1m8M2
6360Fj8J1J0k3nK1lnMoJ5jj3J0K4j8Qj8lnQmNj5L0k0kJ1j9K4rlj5QKrpJ8MoMJ4
$$ plain form
6402 10 14 -33 -10 -1 -6 -35 -10 -2 10 -8 -3 23 -13 6 2 0 0 11 14 -7 -32 5 -39 0 -7 13 -9 -7 -22 5 -20 -1 26 -23 7 6
6438 6 -18 8 -19 -23 -32 -30 -14 -4 20 -7 7 -1 -33 5 0 5 0 -11 32 -15 -9 -9 17 -6 8 -9 7 17 12 0 12 -19 -11 -20 -13 7 -20
6475 -20 -6 -16 -11 -6 -14 -29 12 -35 -9 -4 -3 -9 -11 -14 -10 32 -14 2 -10 -15 9 -15 16 7 -18 -15 9 24 -32 5 -4 0 12 6 4 -16 3 -3 -2
6514 -2 -24 -31 -8 -12 -13 17 -15 -9 -2 8 15 6 0 -6 -2 -5 -11 -39 -3 0 1 3 -3 12 37 -15 -25 -5 -4 -24 11 -6 -10 -16 -8 2 0 11 19 19 21 7 -20
6557 -20 -4 2 2 14 -2 -11 6 -28 -8 26 1 5 -10 13 10 -12 -12 -2 -27 -19 -24 -8 -18 14 16 -10 -10 19 25 5 -17 22 -5 -9 20 -4
6593 -4 12 -2 -16 0 -13 -1 10 -15 3 12 -10 -33 -16 -22 -21 -5 -11 12 -15 9 -13 -5 -4 -21 7 25 17 4 6 14 -2 36 12 11 11 23
6629 23 8 -13 -10 15 -15 -16 -3 3 4 -19 0 0 -11 -18 -16 -24 -40 -6 -4 8 -22 1 -1 1 -25 -7 1 -5 -10 -18 -2 -6 4 -13 22 -5 7 -11
6667 -11 -4 -11 11 22 -15 6 -13 14 -9 12 -6 11 -17 -6 -22 -10 -12 -2 -5 0 -28 -33 -12 -20 -11 -10 -22 -2 6 1 -21 13 -10 7 15 5
$$ packed form
6402A0Mm7K3Rnk9K5QJ2j8NK6l6J9mk%J1Lk1k5L7m4L9pK0k2Kj5K7k5J9K7m9L0j
6438Fk4K6k7mrKJ6J0K4k7J4ql2L8nNnj1M3m7O%K6k3J4j7J6J0nj2J2l1QrPK0k7
6475b0J4j0NNqj5M1m7K6NJoklMM2m6J6j2nK4k4L1rk5LK4J5n6L7rMJ2okk0J9oJ
6514bk2pK3mjL0l2OPJ0ProoMlok8L6LJKoJ5K5n2j0K0Jk0L5j7moQJ0kJ1Q%Kj4k7
6557b0J6O%J2j6rJ7l4K0L4k5Mj5K3lk2%J0k5QnJ6j0L2Kk6%K9Ok0k2L9k7mK9k4
6593dJ6j4j4J6j3J2J1k5J8Rk2k3J7oJJ6oK3k7K4k2QJj7K8J8qj3KQj6L8k4j%J2
6629B3j5k1LK5l0jJ3OJk3J9%j1pKqj6L4KJ2l0K3kKk6J8QonqJ6mJ0j7L5k7J2j8
6667a1PpK2J1l7K1j9K7k3K1j8J7k8J1j6J2kJ0lNk8nK1qRJj2K0Qnk2L4k3J7Qj0
$$ plain form
6703 5 -3 -15 16 24 7 4 29 -17 27 12 -17 -8 -24 9 3 -3 -18 -3 -5 -15 7 -12 2 11 -4 -7 -17 -5 -17 -10 -18 -29 -14 20 -4 0 -2
6740 -2 -20 8 -18 22 -8 22 6 14 -28 -8 2 0 -15 -19 -22 8 3 0 -12 -8 -39 -32 -9 12 -36 10 -26 -6 -8 -6 17 6 -16 0 -6 7
6776 7 -13 -26 -32 -13 -30 3 -5 26 15 7 -12 4 13 4 2 -28 -13 -2 49 -3 -5 -5 -10 -17 -7 -1 -23 -16 -8 3 1 -30 -15 -5 -9 4 -23 7
6814 7 18 -15 -27 -8 -6 -4 -1 -12 3 -4 -14 -27 -2 3 4 -2 -2 -13 -20 15 0 11 -1 -1 -6 -10 9 6 -24 2 2 -24 8 -26 -24 6 -21 14
6852 14 -15 5 -3 -6 -18 -6 24 3 -9 -10 -7 10 7 -18 -38 25 14 15 -17 8 3 -4 -8 28 -3 10 2 20 15 25 1 -4 5 -8 -8 -17 0 1
6890 1 -6 -8 -8 0 33 -14 -3 -5 -18 -25 -13 -4 14 15 -3 3 14 -4 -22 -6 8 26 6 23 8 27 6 -5 18 -22 1 15 14 1 -7 10
6926 10 8 -18 14 14 1 6 14 -5 -5 -17 4 -15 -1 -22 2 -20 -18 -31 -27 -23 3 -1 6 -3 -11 3 -22 -5 23 -15 -22 -12 -10 -9 -5 -6 13 19 22 -9
6966 -9 0 12 0 0 -9 17 -7 -2 -6 -15 -18 -5 -4 1 3 5 -22 -4 1 -8 15 -13 13 -14 14 -1 -8 4 2 4 -6 21 -19 -12 15 -3 -15 2 -4 26
$$ packed form
6703Eqj2L1Qj7lK5m6M4j5k9Rj6L3ooj5J5kj0K2j9J4Rj5lj0J2j2Pqj1J5L4k4Mk
6740bj8K8k6M0l0L0j6Qm2K0J0kj5mlL0nlj2Ml1PK3K1m8M6l6K0kKK3j1k2J6oJ3
6776Gk0j3oJ9j7L3qL1j1qj9J6Rrkl0J5J1N1n2k%npJ0Ok2PQJ1kl1J5J0mJ3k7L0
6814GJ1l3j2J9KKLj1J5pj0j3K5NJo%j1pL5j5J1j2%nmJ9ll0K6%k6L2l4KL0k7L5
6852A4k9K0qlj2J2L0k1j2jLJ7lk5k0O3j1Jl2K5npmL6l1J3qJ8nJ0k4nRj3%rJ7J
6890Apk%QL3m7J1kj3pJ2RJ8Jj8OJ1j8j8J6J4J8k0J7j5J9k1j1K3m0K3J4jj3qJ7
6926A0kk6L2%j3NQj9%j2K1j9J4k1K4k2Kj3MMK6mPrqJ4k5J7K8l8pJ0KJMjJ9OLl1
6966iRJ2j2%rK6k4NmrlJ3JNKKk7J8NrK3k8K6k7K8j5pJ2kKj0K7m0PK7j8j2J7oL0
$$ plain form
7006 26 -24 17 -15 -8 28 -5 -10 19 -32 -21 5 -4 -1 -17 -2 -36 -12 -4 7 -3 -3 -3 -6 -17 -12 -7 22 3 11 -6 -10 -10 4 12 10 -18 6 -14
7044 -14 15 -9 9 -5 2 -9 -13 -8 4 -1 -17 4 0 10 16 -5 -15 0 -26 -9 -19 -2 -26 -21 -4 -15 -3 -1 7 -16 -8 11 22 -11 7
7079 7 -3 -8 13 2 -22 17 22 19 5 -14 -1 25 7 24 19 16 10 1 14 1 -4 -27 -17 10 -31 -8 8 -8 -26 -9 -4 -8 -13 -5 1 -5 -2 -23
7117 -23 4 5 -2 -12 -4 11 2 12 16 0 -5 -8 -9 -3 5 17 20 -23 7 -8 9 -2 7 1 -15 -29 -13 -14 -39 -23 -4 -24 -14 -4 0 -9 13 -7
7155 -7 7 -8 1 12 -1 -15 -21 -14 17 -5 15 24 17 -15 3 21 9 -7 -11 -8 -22 5 11 -3 18 3 -5 -16 16 -9 0 15 -25 -15 -2 4
7191 4 -6 15 -18 13 -14 3 -5 -1 7 -18 -6 -3 16 -5 -15 17 13 -25 -15 32 7 14 16 16 -10 9 19 16 24 7 -12 -10 24 -19 -11 -6 8
7228 8 -12 7 15 -12 -21 -9 -22 -4 -9 10 -6 -3 -1 -11 6 6 8 11 1 -21 13 -21 7 27 -2 -11 1 7 -2 13 -15 7 6 13 -3 -12 0 -5
7266 -5 -9 -24 10 -3 -6 -8 -41 -18 -4 -9 -2 3 3 6 -17 -8 13 10 -1 -6 -26 5 -2 6 0 -4 11 17 -18 1 -7 6 -2 8 -3 0 2 -12 9 -7 4
$$ packed form
7006B6n0M1l2PL6l3nK9n1J1K6rLj6J5l4K4QJ1j0%%lj1NNK9j9Qj7m%J4Qkk8K4k0
7044a4K9k4J8j4Pj1mNJ2nj6K1mJ0Ok1j0J5k6J7j0J7k4NJ7j1J2KQk3QJ9J1l3J8
7079Gj0nK1j1k4L9Nlj4j9J3K6j8J7nlorJ3j3nk3J0K7m1K3J6j6j8J7NmnQOoLk1
7117b3K7Jpj0QJ5rJ0Mj6nljOQJ2Lm3L0j5J7j1Roj6j4J6jk5J6J9k0J0J0MrK2k0
7155gJ4j5RJ1j3j4oPL1k2K0Rpl2J8J8j2j6mLj4K7Oj4K1j5qj1L2k5RJ5m0J0J3O
7191Dj0K1l3L1k7J7qMQk5J2LJ9k1j0L2ml8J0M7k5PK%k6J9J0lQj7j9KL4m3QNJ4
7228Hk0J9Qk7rJ2j3J8nJ9j6LKj0J7%KLj0k2L4l4K8K0k9rJ2OrJ5k8K2jPj6rJ2n
7266emj5L4j3lkl3K3J4nPN%Lk3RK1lj1nk0L1pQomJ5Ol5J9qJ3qJ0j1LKj4K1j6J1
$$ plain form
7307 4 13 -13 -22 -10 3 -27 2 -9 -25 -25 -19 -19 -12 -27 -1 -4 2 0 -18 2 23 24 -3 16 -24 20 -8 13 20 -4 12 -9 28 14 24 -10
7343 -10 16 17 -11 6 8 -11 12 -17 1 -25 -1 -1 2 -11 -4 -25 -42 -39 -17 -11 -25 -2 -4 -4 -25 -7 4 -14 -28 -3 15 -4 23 2 -8
7378 -8 3 8 10 -9 13 32 -9 -4 3 11 -6 -4 -1 -20 -22 -12 21 -1 -1 1 -30 -54 -13 -22 -18 -6 10 6 -13 7 7 0 -11 -18 6 -28 15 11 2 -4
7418 -4 12 -11 -17 26 -17 -9 -1 -14 -13 28 -9 -6 -2 1 21 3 -9 9 4 -21 -15 -12 -1 -29 -1 -8 -4 -6 0 2 -5 -7 4 23 9 10 -14 -5 8 -11
7458 -11 -11 -18 10 9 -8 -2 15 -17 -14 -9 -8 10 -43 -9 9 10 15 -21 -1 11 -15 -34 3 -14 -11 -7 -43 -4 -35 -11 -11 3 10 -20 -7 -5 -23
7495 -23 7 -4 -17 -1 6 -6 -6 -6 -8 21 4 0 31 -23 -6 14 -12 -8 -10 6 0 -9 4 -9 -18 -3 16 -20 -20 -21 -21 3 10 -12 -7 1 -13 18
7533 18 12 13 -3 15 8 29 9 -5 12 8 9 -2 1 -3 21 -4 -19 -23 -12 -11 4 -9 -18 0 -4 1 -17 -15 -2 -25 12 -1 -3 1 -17 11 -25 -12
7571 -12 2 -3 7 5 18 -14 -26 -6 -17 -2 -11 -29 13 10 9 -5 -3 8 -23 15 6 -26 29 3 -7 -1 -12 -6 -11 -11 3 -7 -25 -9 -15 -24 -7
$$ packed form
7307DRk6rJ2J3l0K9j1j6%O%Pj5K6lOkj8K0K1Jk7J9m0M4k8K1Pk4J6k1L7j4J0l4
7343a0K6Jk8J7Kj9K3k9J8k6K4%Lj3Pk1j7LK2Oj4K3k%k1J8J1j8j4K5J8j9K7k1j0
7378hJ1NKj9K2J9m1NPQj7KLj9kJ0L3k2%Kl1k4M1rMJ2J6mj9K0%pj1pK4l4M3mro
7418dJ6k3oM3m3QQj3JM1l7LMLK0j8j2J8nk5OLJ1k8K8pMkOKpkJ1J9j4Jk4RJ3j9
7458a1%pK8jj7OJ7l2LNJJ8n3L4J8JNl6K0J2k6j9L7j7LMl6L9l1K4%J4Pl0J3Kj8
7495b3L0j1j3J6Pj2%%kK9j7mL1n4J7K0k6MkJ6orJ3j3rJ5J9l6%j%K4Pk2NQj4L1
7533A8oJj6J8pK1k0j4J7mJj1LmK4k5j5mJ1JJ5j3rJ8mNj8KJ3k3L7j3kMj8K8l6J3
7571a2J4nJ0kJ3l2j2K0j1J5rj8M2ljj4KJ1l1L8rl2N5k6j0Oj1On%J4j0j8J6orJ7
$$ plain form
7608 -7 -23 -41 -22 -12 8 -24 -26 7 -15 -14 6 -12 4 -13 -9 7 9 -30 -5 8 4 11 -8 -21 8 -3 20 -11 -24 -11 -4 17 -24 -27 -12
7643 -12 -22 9 3 12 -16 -1 -24 -11 7 -22 0 -22 -3 2 -15 -21 23 -25 -4 12 7 -10 -1 -16 -7 14 0 10 -10 5 9 20 4 -8
7677 -8 -8 -16 32 -19 -4 -25 -15 -5 7 3 -28 -2 -19 0 10 -7 -6 -20 -9 -14 -20 12 -24 0 -18 -5 -29 -1 22 -4 4 -4 -11 -8 7 19
7713 19 -4 -1 6 -14 -4 21 12 15 -12 0 7 2 -7 0 -15 -4 14 30 4 -21 9 -16 -7 -10 -14 -38 -25 -6 -13 -10 -7 -13 -34 2 -13 -6 -25 -16 8
7752 8 13 -12 0 -5 13 12 -7 -13 21 21 -3 -21 -20 -11 -1 14 -6 -10 -18 31 -16 -16 -7 -21 -6 -4 1 -25 -5 -7 -4 -4 -9 -5 -4 0 -4 32 11 8 2 11 -5
7795 -5 16 -17 -20 -6 -11 -14 11 -13 10 5 -1 -3 -30 -16 -2 8 10 -14 -19 7 -4 -9 -9 -42 -37 -7 -1 6 -15 -30 1 -6 19 5 -7 16 -13 5
7833 5 1 -1 18 -6 -9 2 -1 -38 -6 2 6 3 2 -10 -8 -4 -7 -25 -15 -3 -38 4 17 8 3 -2 -6 -11 -21 -11 -7 -22 2 -7 0 -26 19 -1 -29 4
7873 4 -11 -18 8 14 5 4 -11 13 -3 -1 -6 -5 -12 3 -11 -29 0 -6 4 -30 -20 -12 2 -5 1 -15 -5 0 -12 -16 -19 8 -18 -17 3 12 0 -2 -11 8
$$ packed form
7608gj6j8J9J0K0l2kL3k2JK0j8J6j7MJ6Kl9K5J3mPj9j3K9j1K3l1j3J3PK1m1lJ5
7643a2j0L1oRk8J5k3J3J8k9K2k2J9Nj7oM4m8K1J6nj7Rj5RK1j4J0k0J5MJ1j6j2
7677h%qM8n1J5k1J0J0J2ml1K6j7J9J0j7Jj4J1noL2l6K4j8J3k4K8K3k6QqpLJ5J2
7713A9k3LPk0J0K5rLk7J2PnrPj5J1J8J6k6k5L0k5Rlmk4J3J9pLLok1L6j5Pj9RK4
7752HNk5J2nJ8jj9oL4%k4j8JRJ0J5k0mqM9m7%Rj4J5KNk6K0kL%nMJMmL6k1loRj6
7795eK1l3lJ4nlK5k4K3nokk7J4J4J0Kk4nK6j1n%l3NL0OPk1j5L1pK5j4j2K3k9J8
7833EmkJ9k4lJ1ll7L2QMljj2KMlj8J0J2l5M2J3rnnmnj0J0Mj5K4rPk6M5k0k8L3
7873Dj5pK6Orjj5K4j6KnJpJ5j4j8K9oJ0l4J0QJ4pOj6J0Nj2mlK7k6JK0Rj2krJ9
$$ plain form
7913 8 -16 3 -2 8 -17 -12 -13 -4 7 0 3 0 11 6 -2 8 -8 -6 -5 -16 12 -26 -29 -20 -12 -12 -10 -2 -2 -19 2 12 10 7 -19 -13 -15 0 -7 -8 0 -8 -4 -8 -2
7958 -2 -12 -10 -3 -17 10 2 7 6 1 -3 37 -28 -1 9 7 4 0 1 0 -18 -12 -8 7 -29 -12 16 -23 -7 -24 -13 -3 -18 15 3 9 11 -3 -11 -5 11
7998 11 17 -3 18 19 13 16 -2 1 1 -18 29 21 -32 24 -19 -23 4 -7 -1 -12 0 -18 6 3 -24 -31 -21 -5 -2 -4 -14 1 -17 -10 -1 -4 -13 -5 -18
8037 -18 -9 7 13 -4 6 3 -14 10 38 -1 -5 -25 -26 3 -7 9 8 3 -13 4 -18 14 -16 -16 -11 -27 -15 -4 21 -16 -16 -1 2 -4 -13 -8 3
8074 3 -25 -12 17 14 1 -19 -3 7 -3 -43 -17 -1 -13 -5 -5 0 -23 -5 11 -7 38 4 -25 4 23 6 -4 10 6 -31 -2 0 7 -26
8108 -26 14 -7 -23 -19 -16 12 -38 -5 -10 -13 -5 -16 -7 5 -6 -6 -20 -10 -2 0 6 -7 30 21 3 2 11 13 6 -4 6 -7 -1 0 13 -13 2 -17 -2
8147 -2 16 6 0 -12 -2 -26 -9 -33 -10 19 -10 7 20 -10 1 0 7 -7 -11 6 6 24 -3 -19 31 -9 5 1 29 -16 10 -14 -5 -11 -33
8182 -33 -6 -5 23 0 4 7 -24 -24 -19
$$ packed form
7913Hk4J9nJ0k5NjRJ1pLlJ1nqJ0j6KJj1K8l8lRQ%KQ%j7K1J0klk6OkJ5pjQqMmO
7958bj0KPj4K7qNjnmM0o5K7J0klmJjj8OMJ5l6J7K8l9J6j7J1J0j5L3j2OKj4qOJ6
7998A1Ok0K1JoLj8L%j9M7qn3N6m3mK7j1Oj1J2j8K4lk7pJ0J6Lkj0J5j8PRlrQj3
8037a8RJ6Oj7J0lj7K4K8l9mk0jK9j0J6jnj6J7k2L2l0%Nj6J2J1K5l7%J5LorNJ1
8074Ck8J3K9lj3k0J6J0j0m0K6J6j2Q%Nk3J8J6j8M5l4k9K9J9j7j0J4ml7K9KPl3
8108b6M0k1j6MLK8n0L3nlQj1RJ2j1%j4J0QKOj3L7rj8jRKpj0J0j3OJJ3k6J5j9J5
8147bJ8j0oj2J0k4J7k4K3K9k9J7J3l0J1jPj4mJ7%J8k7j6N0m0J4mK8m5K6k4Rok2
8182c3K7JK8k3MLl1%N
8191a9
$$ Imaginary data points
##PAGE= N=2
##DATA TABLE= (X++(I..I)), XYDATA
$$ plain form
0 0 0 0 0 0 0 0 0 0 0 0 0 0 0 0 0 0 0 0 0 0 0 0 0 0 0 -1 2 -5 8 -8 8 -8 8 -8 8 -9 11 -13 15 -16 17 -18 20 -21 25 -27
46 -27 30 -32 35 -38 43 -47 52 -57 65 -73 83 -93 110 -128 153 -185 231 -299 406 -587 931 -1722 4232
69 4232 -26674 -136631 10449 109653 -44096 -92999 38766 39736 -56925 -14606 42490 -17660
81 -17660 -21360 50609 12397 -49199 25247 67028 -31306 -49256 54987 42953 -64104 -38653
93 -38653 50950 14900 -52557 -15740 24570 -7815 -21032 10318 12332 -7189 -32 11944 6539
106 6539 5065 7358 1530 1258 6850 481 -9409 -6409 1406 2473 -5569 -16071 -9521 9927 6538
121 6538 -12265 -3093 14253 -877 -9749 15460 16683 -13968 -6697 21708 2396 -21811 4437
134 4437 17806 -13619 -16448 12494 3148 -18739 1303 15386 -6806 -8958 9493 -426 -8171
$$ packed form
0@%%%%%%%%%%%%%%%%%%%%%%%%%jLpJ3j6J6j6J6j6J6j7K0k4K8l1L3l5L8m1M6n2
46b7N7o2O7p3Q1r0R9j09J22j38J56j76K03k38K81l38M16n30P05r93J518k653N954
69D232l0906j09957J47080R9204j53749m8903J31765R70r6661M2319N7096o0150
81a7660l700P1969l8212o1596P4446M1781r8334j7950J04243j2034j07057K5451
93c8653Q9603l6050o7457L6817M0310l2385j3217L1350K014j9521P157J1976n405
106F539j474K293n828k72N592o369r890L000P815J067q042j0502O550J9448l389
121F538j8803R172J7346j5130q872K5209J223l0651P271K8405j9312k4207K6248
134D437J3369l1425k829K8942r346k1887K0042J4083k2192k152J8451r919p745
$$ plain form
147 -8171 15317 11882 -21444 -8847 25872 4970 -24860 1383 20788 -8091 -16250 10011 7680
160 7680 -10576 1243 9820 -7518 -6848 10020 1323 -9418 5373 6486 -12846 -5827 13518
173 13518 1456 -11622 3887 7896 -8505 -2424 14008 2096 -10855 3058 9733 -4043 -6206
186 -6206 2864 1330 -1631 -678 -7075 -6992 7833 6606 -11504 -6002 12957 3849 -11274 3399 15873
201 15873 -259 -9499 3236 7368 -884 -2267 -1969 -3993 735 856 -10016 -6438 10135 3960
215 3960 -14005 -4150 13926 4045 -8250 3597 11422 -325 -5141 2998 5010 1014 -1477 -4955
229 -4955 -4352 2173 -161 -8460 -2957 6146 -1736 -9053 1655 8830 706 -2001 4304 3517 -241
244 -241 2264 2953 112 922 -734 -5887 -2169 3525 -3401 -7681 2068 3139 -8160 -3956 9855
$$ packed form
147h171K3488l435l3326J2597L4719k0902k9830K6243J9405k8879q159K6261k331
160G680j8256J1819Q577j7338O70J6868q697j0741J4791J113j9332P019J9345
173A3518j2062j3078J5509M009j6401O081J6432j1912j2951J3913O675j3776k163
186f206R070j534k961R53o397Q3J4825j227j8110N502J8959r108j5123J4673J2474
201A5873j6132r240J2735M132q252j383K98k024M728J21j0872L578J6573o175
215C960j7965R855J8076r881j2295J1847P825j1747m816Q139K012l996k491l478
229d955O03O525k334q299N503R103p882p317J0708P175q124k707O305p87l758
244b41K505O89k841Q10j656n153L718N694o926m280R749J071j1299M204J3811
$$ plain form
259 9855 4165 -6689 1504 8299 -724 -2115 6282 2746 -3914 718 582 -6266 -187 6134 -5882
274 -5882 -10339 5332 5963 -10369 -4438 13018 3708 -10954 574 10976 72 -3887 5055 2334
288 2334 -4949 344 2668 -4219 -1468 4461 -3905 -8603 3191 6245 -5371 -4400 6722 3151 -5763
303 -5763 -339 6492 2141 -1521 303 -275 -860 1464 298 -2205 -156 -26 -3657 -1734 2970 527
319 527 -2556 587 1228 -1530 956 3487 -268 -805 2960 -101 -4030 1620 4622 -2522 -3982 2012
335 2012 -155 -4518 1543 4282 -3461 -3692 3969 1271 -4177 2396 5862 -2827 -4026 4353 2417
350 2417 -4243 584 4570 -2573 -4510 1994 1124 -3006 1089 2561 -3750 -2908 3911 1687 -2800 1441
366 1441 3294 -2349 -2103 3306 1761 -1733 544 682 -2572 -761 1864 -950 -1422 1685 -888 -3917
$$ packed form
259I855n690j0854Q193O795r023j391Q397l536o660M632j36o848O079O321j2016
274e882m457J5671O31j6332N931J7456r310j4662J1528J0402j0904l959Q942k721
288B334p283N293K324o887K751N929q366m698J1794L054j1616R71J1122l571q914
303e763N424O831m351l662J824n78n85K324j166k503K049J30l631J923M704k443
319E27l083L143O41k758K486K531l755n37L765l061l929N650L002p144j460N994
335B012k167m363O061K739p743k31P661k698n448O573L466q689j199Q379j936
350B417o660M827L986p143j937O504q70m130M095J472o311Q42O819k224m487M241
366A441J853n643K46N409j545l494K277J38l254J811K625k814m72L107k573l029
$$ plain form
382 -3917 1134 3847 -1465 -1801 3197 375 -3597 1978 4817 -1781 -2703 2862 237 -4230 1156 3969
398 3969 -2822 -3712 2536 413 -4285 1243 4775 -2218 -3760 3254 2326 -3180 924 5081 -1344 -4491
414 -4491 2013 3135 -2660 -1514 3083 -428 -4427 -305 2809 -480 -1617 1007 240 -1810 375
429 375 2455 427 -655 1070 434 -1858 -201 2908 913 -2834 -1321 1761 -194 -2550 578 2849
445 2849 -1121 -3539 358 2576 -203 -799 1460 272 -1774 348 1834 -312 -171 1701 -894 -3143
461 -3143 1064 3382 -1370 -2803 1800 1318 -3383 -1159 3633 966 -2923 -422 1474 -902 -347 2285
477 2285 481 -1929 242 1266 -1027 -126 2653 340 -3006 -606 2046 -302 -1639 995 943 -2264
493 -2264 -1735 1354 1097 -650 267 702 -1097 -686 2031 1752 -675 -215 1077 -576 -1456 1026 1685
$$ packed form
382c917N051K713n312l36M998k822l972N575K839o598r22N565k625m467N386K813
398C969o791q90O248k123m698N528L532o993j542P014r28n506M104M157o425l147
414d491O504J122n795J146M597l511l999M122L114l289j137K624p67k050K185
429C75K080k028j082J725o36k292J657L109j995l747J513L082j955k356L128K271
445B849l970k418L897K218k779n96K259j188k046K122J486k146J41J872k595k249
461c143M207K318m752j433M603m82m701K224M792k667l889K501J896k376N55K632
477B285j804k410K171J024k293R01K779k313l346K400K652k348j337K634n2l207
493b264N29L089k57j747R17M35j799M11K717k79k427M60J292j653q80K482O59
$$ plain form
510 1685 -1295 -2071 61 -142 -1613 130 1736 -636 -2003 487 1473 -286 541 2529 404 -2075
526 -2075 305 2333 -55 -1107 910 -128 -2747 -988 1484 -435 -1741 474 280 -2158 -290
541 -290 2922 1058 -1206 865 1590 -912 -215 2632 1045 -2023 -821 638 -1105 -1399 940 384
557 384 -2107 -1470 517 153 -159 1257 1092 -704 -330 1457 1245 230 763 710 -1030 -1387 252 731
575 731 -581 -1032 -621 -947 -1003 110 862 303 -200 35 122 277 1095 1506 551 -535 -423 145 147 60 167
596 167 -317 -1255 -1162 -200 155 -25 198 33 -768 -518 974 1316 378 252 411 -405 -486 888 1025 -421
616 -421 -715 -180 -766 -963 525 828 -647 -916 -114 -326 -176 1263 1070 -823 -658 934 351 -628 858
635 858 1572 -756 -1825 120 967 -194 -158 395 -834 -1225 367 702 -444 193 1073 -714 -1726 772
$$ packed form
510A685k980p76K132k03j471J743J606k372j367K490R86j759Q27J988k125k479
526b075K380K028k388j052K017j038k619J759K472j919j306K215j94k438J868
541b90L212j864k264K071P25k502O97K847j587l068J202J459j743k94K339n56
557C84k491O37J987l64l12J416j65j796L74J787k12j015N33n3j740l57J639M79
575G31j312m51M11l26n6J113P52n59n03K35Q7J55Q18M11r55j086J12N68Kq7J07
596A67m84r38R3R62L55j80K23j65q01K50J492L42r38j26J59q16q1J374J37j446
616d21k94N35n86j97J488L03j475k69Q02k12J50J439j93j893J65J592n83r79J486
635H58P14k328j069J945Q47j161L6N53j229l91J592L35j146O37Q80j787j012K498
$$ plain form
653 772 2132 -49 -997 512 319 -971 67 1408 145 -964 -142 -84 -903 75 1298 30 -1410
670 -1410 -482 488 -11 88 917 263 -938 -314 753 335 -22 796 475 -1200 -1019 817 992 -388 -601
689 -601 -60 -487 -631 314 643 22 -56 -61 -636 -350 1224 1256 -452 -824 180 227 -262 250 687 -205 -739
710 -739 -555 -322 -30 599 496 -799 -1024 163 683 231 291 424 -132 -486 99 531 432 407 -4 -900 -819
731 -819 351 698 -55 -401 -262 -420 -392 229 565 317 88 -207 -550 -43 990 851 -216 -548 -111 -72
751 -72 -137 305 447 -192 -673 -522 -225 200 628 324 -554 -616 78 455 280 364 419 -151 -676 -156 645 571
773 571 53 -271 -467 -542 -24 530 255 -221 -204 -319 -531 86 947 540 -433 -437 17 131 216 585 310 -390
795 -390 -465 -189 -97 337 630 -103 -984 -554 296 306 93 229 84 -450 -401 214 483 496 353 -330 -857 -132
$$ packed form
653G72J360k181r48J509j93j290J038J341j263j109Q22N8q19R78J223j268j440
670a410R28R70m99R9Q29o54j201O24J067m18l57Q18l21j675J81J836J75j380k13
689f01N41m27j44R45L29o21p8nn75K86J574L2j708l72J004M7m89N12M37q92n34
710g39J84K33K92O29j03j295k25J187N20m52O0J33n56l54N85M32r9k5m11q96Q1
731h19J170L47p53l46J39j58K8O21L36k48k29k95l43N07J033j39j067l32M37L9
751g2o5M42J42o39m81J51K97M25M28l04q78o2O94L77j75Q4N5n70n25N20Q01p4
773E71n18l24j96p5N18N54k75m76J7j15k12O17Q61m07r73mM54J14Q5L69k75p00
795c90p5K76R2M34K93p33q81M30Q50J0k13J36j45n34M9O15K69J3j43o83n27P25
$$ plain form
817 -132 813 457 -324 -184 -4 -516 -458 465 617 -70 -378 -339 -394 122 978 538 -600 -480 363 147 -294
838 -294 424 831 -286 -1039 -292 368 219 224 196 -635 -855 244 755 -133 -190 578 69 -1050 -223 1289
858 1289 689 -547 -259 41 -473 -49 903 274 -822 -309 232 -444 -355 922 608 -847 -779 305 301 109
878 109 585 314 -690 -470 497 304 -151 316 347 -687 -844 204 652 198 -190 -373 -502 -122 493 368
898 368 -27 94 69 -470 -293 658 798 -3 -533 -359 -154 139 440 171 -303 -337 -187 -239 -18 586 488 -340
920 -340 -691 -46 435 389 259 176 -194 -480 -124 415 337 53 -53 -351 -680 -129 650 407 -381 -352 11 -236
942 -236 -184 652 703 -357 -570 115 208 -33 452 538 -426 -776 -20 313 -80 176 370 -530 -919 129 761
963 761 45 -204 309 -30 -685 -30 866 485 -244 -177 -179 -368 137 725 128 -624 -314 83 -227 -179 567 511
$$ packed form
817a32R45l56p81J40J80n12N8R23J52o87l08L9n5N16Q56m40j138J20Q43k16m41
838b94P18M07j117p53P47O60j49Nk8q31k20J099N11q88n7P68n09j119Q27J512
858A289o00j236K88L00n14M24R52o29j096N13N41o76Q9J277l14j455O8J084mj92
878A09M76k71j004K20R67j93m55M67L1j034j57J048M48m54l88j83j29L80O15j25
898C68l95J21k5n39J77R51J40q01n30J74K05K93L01k69m74l4J50n2K21O04r8q28
920c40l51O45M81m6j30q3l70k86L56N39p8k84j06k98l29N51P79k43p88K9L63k47
942b36N2Q36N1j060k13O85R3k41M85Q6r64l50P56L33l93K56J94r00l89J048O32
963G61p16k49N13l39o55O55Q96l81p29O7kj89N05N88n97p52L10L97l10M8P46n6
$$ plain form
985 511 -472 -697 41 447 348 252 74 -348 -320 195 317 82 161 98 -504 -701 105 664 184 -365 -342 -173
1007 -173 -116 159 420 247 -78 -226 -223 -47 395 591 80 -434 -422 -78 154 327 181 -232 -380 -229 -82
1028 -82 89 392 291 -244 -453 -125 236 416 453 58 -502 -306 259 202 -69 213 208 -532 -722 166 603 86
1050 86 -152 -111 -314 -288 395 584 -50 -140 133 -164 -380 383 807 22 -649 -301 52 -42 151 354 -95 -529
1072 -529 -261 101 116 216 402 19 -493 -299 340 544 261 -82 -240 -226 -97 56 228 201 -126 -437 -390
1093 -390 18 308 364 102 -382 -355 160 317 150 201 329 -207 -623 -16 608 305 -233 -191 -215 -319 -20 382
1115 382 217 -156 -179 -253 -231 269 621 170 -313 -211 71 62 141 396 215 -341 -484 -99 248 281 79 -165
1137 -165 -269 -231 -77 201 370 200 -247 -376 -18 246 285 280 24 -281 -307 27 214 207 131 -72 -461 -335 185
$$ packed form
985E11r83k25P38M06r9r6j78m22K8N15J22k35P9o3o02j97Q06N59m80n49K3J69
1007a73N7K75K61j73l25j48LJ76M42J96n11n14J2L44K32J73j46m13j48J51J47
1028h2J71L03j01n35k09L28L61J80L7l95n60J96N65n7k71K82np40j90Q88M37n17
1050H6k38M1k03K6O83J89o34r0K73k97k16P63M24p85o71L48L53r4J93K03m49m34
1072e29K68L62J5J00J86l83n12J94O39K04k83l43j58J4J29J53J72k7l27l11M7
1093c90M08K90N6k62m84K7N15J57j67N1J28n36m16O07O24l03n38M2k4j04K99M02
1115C82j65l73k3p4K2N00L52m51m83J02K82rP9K55j81n56j43L85L47L3k02k44
1137a65j04L8J54K78J69j70m47j29L58K64L9nk56l05k6L34J87pp6k03l89J26N20
$$ plain form
1160 185 371 59 -58 -86 -299 -294 249 545 165 -222 -265 -42 21 197 372 179 -297 -377 -114 143 135 157 -24
1183 -24 -439 -430 80 314 96 69 62 -239 -317 263 601 258 -124 -134 -131 -158 157 334 14 -295 -355 -294 -155 175
1207 175 311 -2 -313 -237 44 210 381 361 89 -217 -197 76 291 271 -8 -355 -376 -193 -51 42 145 -35
1229 -35 -393 -345 109 354 303 301 104 -176 -75 271 352 198 78 -251 -533 -314 152 188 -193 -271 -201 -228 -136 301
1253 301 496 214 -112 -94 113 270 360 290 -36 -359 -339 -135 13 75 8 -330 -586 -284 257 290 37 110 200
1276 200 -167 -127 479 654 68 -241 -86 -160 -230 117 248 -174 -464 -279 -196 -81 338 398 -162 -395 146 374
1298 374 56 193 497 39 -590 -263 352 233 -167 -158 -166 -347 -228 140 252 138 -65 -294 -213 265 470 152
1320 152 -104 -50 -53 -139 -58 251 353 -74 -503 -345 228 370 -7 -126 98 -55 -421 -52 569 325 -374 -451
$$ packed form
1160A85J86l12j17k8k13NN43K96l80l87m3K23O3J76J75j93m76q0K63K57qK2j81
1183b4m15RN10K34k18k7pl01p8N80L38l43l82j0Lk7L15J77l20l09o0O1J39L30
1207A75J36l13l11P6K81J66J71k0k72l06K0K73K15k0k79l47k1J83J42R3J03j80
1229c5l58M8M54K45n1kj97k80J01L46Q1j54j20l29k82K19M66L6l81p8P0k7R2M37
1253C01J95k82l26J8K07J57R0p0l26l23K0K04J48O2o7l38k56L02N41L3k53P3R0
1276B00l67M0O06J75n86l09J55p4p0L47J31m22k90J85Q3J15M19O0n60k33N41K28
1298C74l18J37L04m58o29L27O15j19m00Rqj81J19L68J12j14k03k29Q1M78K05l18
1320A52k56N4lq6Q1L09J02m27m29J58N73J42l77j19K24j53l66L69O21k44o99p7
$$ plain form
1342 -451 -24 98 57 116 117 -55 -130 -105 -31 349 595 105 -540 -314 304 232 -225 -78 178 -306 -728 -115 565
1365 565 254 -297 -213 138 146 132 349 407 159 -70 -135 -93 161 307 -54 -589 -504 -75 -117 -222 158 270 -337
1388 -337 -484 362 750 263 43 335 251 -145 -37 296 239 -135 -436 -612 -415 41 80 -322 -291 62 -107
1409 -107 -201 382 871 412 -186 -65 369 470 231 -69 -194 -126 -290 -570 -360 149 54 -547 -542 12 256 217
1431 217 412 447 74 -58 295 522 353 99 -94 -300 -309 -160 -151 -183 -96 -331 -613 -274 377 350 -64 58 425
1454 425 226 -114 214 748 500 -273 -623 -164 360 165 -485 -544 -69 -9 -437 -294 389 548 -78 -416 31
1475 31 494 493 105 15 94 5 -259 -184 244 260 -279 -651 -314 163 191 -39 -76 -3 -117 -112 196 382 212 -59
1499 -59 -41 18 -88 -25 233 290 -153 -512 -267 184 311 102 -223 -231 11 98 -44 -8 313 189 -413 -489 235
$$ packed form
1342d51M27J22m1N9Jj72p5K5P4L80K46m90o45K26O18p2m57J47K56m84m22O13O80
1365E65l11n51Q4L51Qj4K17N8k48k29o5M2K54J46l61n35Q5M29m2j05L80J12o07
1388c37j47Q46L88m87k20K92q4l96J08L33n7l74l01j76J97M56L9m02L1L53j69
1409a07r4N83M89m59n98J21M34J01k39l00j25O8j64k80K10N09r5o01NN54K44l9
1431B17J95L5l73j32L53K27j69k54j93k06rJ49Rl2Q7k35k82L39O51k7m14J22L67
1454D25j99l40L28N34k48p73l50M59N24j95o50n9M75O0m28J43O83J59o26l38M47
1475C1M63jl88r0P9q9k64P5M28J6n39l72L37M77K8k30l7P3j14NL08J86j70k71
1499e9J8N9j06O3K58N7m43l59K45M51J27k09l25qK42Q7j42L6L21j24o02p6P24
$$ plain form
1522 235 532 37 -273 -10 132 -99 -103 234 306 95 -220 -374 -141 341 388 -233 -504 -107 147 -93 -111 255
1544 255 231 -236 -294 87 291 301 157 -1 -197 -110 78 124 70 -11 -229 -396 -235 108 200 -13 -97 -122 -142 33
1568 33 280 407 149 -152 -81 104 126 46 66 36 -167 -429 -270 143 256 -57 -345 -225 83 134 124 231 198
1591 198 -34 -122 -27 182 315 192 -217 -366 -110 61 -76 -65 135 -98 -437 -195 285 265 5 56 96 -127
1613 -127 -17 359 331 -28 -134 -76 -160 -94 193 139 -243 -232 -62 -149 -111 333 322 -218 -294 159 252 50 200 260
1637 260 -134 -306 26 157 -2 56 22 -305 -376 61 210 -5 -11 24 -150 -167 186 307 132 33 -37 -183 -91
1660 -91 229 228 -73 -203 -72 -198 -166 178 237 -117 -186 -41 29 86 242 231 -33 -176 -50 -9 101 258 0
1683 0 -347 -280 38 24 -71 90 163 -215 -285 98 379 236 48 -23 -37 -40 70 120 94 25 -180 -388 -206 208 201
$$ packed form
1522B35K97m95l10K63J42k31mL37P2k11l15j54K33M82M7o21k71L97K54k40j8L66
1544B55k4m67n8L81K04J0j44j58j96Q7J88M6n4q1k18j67J61L43R2k13q4k5k0J75
1568C3K47J27k58l01P1J85K2q0K0l0k03k62J59M13J13l13k88J20L08N1j0J07l3
1591A98k32q8R5K09J33j23m09j49K56J71j37J1K00k33l39K42M80k0k60N1M0k23
1613a27J10L76k8l59j06N8q4O6K87n4l82J1J70q7L8M44j1n40p6M53R3k02J50O0
1637B60l94j72L32J31j59N8l4l27p1M37J49k15oL5j74j7L53J21j75r9p0j46R2
1660i1L20jl01j30J31j26L2L44N9l54o9J45P0N7J56j1k64j43J26M1J10J57k58
1683@l47O7L18j4r5J61P3l78p0L83K81j43j88p1j4lJ10N0k6o9k05k08J82M14p
$$ plain form
1708 201 -123 -188 -18 28 -52 147 367 234 -116 -119 101 185 148 64 -109 -246 -194 -124 -69 5 85 -157 -391 -79
1732 -79 323 249 34 167 153 -95 -19 295 291 -20 -165 -159 -278 -179 130 -2 -265 -219 -71 -180 -57 380 361 -94
1756 -94 -94 235 209 100 255 237 -175 -308 -67 -58 -93 27 -130 -481 -254 127 63 -51 204 218 -117 -119 326 425
1780 425 183 32 -39 -156 -29 122 -50 -150 -32 -212 -451 -151 297 184 -227 -111 135 61 57 318 343 15
1802 15 -125 -32 -2 93 187 -43 -324 -215 -5 -87 -53 177 102 -280 -233 202 242 102 71 150 -37 -145 47 244
1826 244 153 -26 -211 -165 -40 40 90 9 -97 -156 -120 -75 66 247 74 -290 -195 164 162 -11 120 193 -92 -282
1850 -282 67 285 134 -57 -48 -133 -182 22 84 -16 -80 -82 -209 -178 143 302 22 -138 39 128 29 128 325 149
1874 149 -146 -146 -14 58 61 3 -206 -235 -163 -149 -76 132 117 -174 -185 114 270 162 215 211 -15 -106 50 150 84 1
$$ packed form
1708B01l24o5J70M6q0J99K20j33l50lK20Q4l7q4j73j37N2P0N5P4Q0k42k34L12
1732g9M02p4k15J33j4k48P6L14ml11j45Oj19R9L09j32k63M6J48j09J23M37j9m55
1756i4%L29k6j09J55j8m12j33K41Rl5J20j57l51K27L81o4j14K55J4l35kM45R9
1780D25k42j51p1j17J27J51j72j00J18j80k39L00M48j13m11J16K46p4mK61K5l28
1802A5j40R3L0R5R4k30k81J09K10q2L4K30p5l82M7M35M0j40l1P9j87j08J92J97
1826B44r1j79j85M6J25Q0N0q1j06n9L6M5J41J81j73l64R5L59kj73J31P3k85j90
1850b82L49K18j51j91Rq5m9K04O2j00o4kj27L1L21J59k80j60J77Q9r9R9J97j76
1874A49k95%J32P2Ln8k09k9P2J4P3K08j5k91j1K99J56j08N3mk26r1J56J00o6q3
$$ plain form
1900 1 -122 -373 -268 27 -47 -159 -53 18 -199 -159 265 434 153 12 111 115 63 166 206 -1 -193 -198 -236 -154 49
1925 49 -17 -265 -281 -36 55 24 192 277 59 -49 115 272 231 164 47 -132 -187 -71 -22 -58 -97 -126 -304 -315 40
1950 40 212 58 -2 123 34 -74 212 412 162 -72 -9 11 -133 39 177 -123 -341 -144 -52 -218 -13 265
1972 265 43 -358 -37 334 87 -15 353 218 -282 -161 347 117 -189 34 58 -426 -307 244 136 -306
1992 -306 -48 133 -254 -205 396 372 -189 -82 276 11 -188 294 403 -234 -333 106 42 -205 23 210 -196
2013 -196 -374 34 171 -52 81 224 -146 -279 145 330 -30 -29 236 -27 -320 20 325 43 -195 -46 -31
2034 -31 -197 -46 193 60 -157 -51 -56 -64 129 283 38 -208 27 147 -76 9 299 68 -324 -162 151 17
2056 17 -89 43 -12 -253 -120 122 67 14 123 -25 -213 18 330 102 -100 117 64 -275 -120 255 123 -235
$$ packed form
1900Aj23k51J05K95p4j12J06P1k17M0M24J69k81j41R9Mn2J03M0k07j92nl8Q2K03
1925D9o6k48j6K45R1l1J68Q5k18j08J64J57m1o7j17j79n5J16M9l6l9k9j78j1L55
1950D0J72j54o0J25q9j08K86K00k50k34O3K0j44J72J38l00k18J97R2j66K05K78
1972B65k22m01L21L71k47j02L68j35n00J21N08k30l06K23K4m84J19N51j08m42
1992c06K58J81l87M9O01k4n61J07L58k65j99M82J09o37r9M39o4k47K28J87m06
2013a96j78M08J37k23J33J43l70j33M24J85l60JK65k63k93L40L05k82k38J49J5
2034c1j66J51K39j33k17J06nqJ93J54k45k46K35J20k23Q5K90k31l92J62L13j34
2056A7j06J32n5k41J33K42n5n3J09j48j88K31L12k28k02K17n3l39J55L75j32l58
$$ plain form
2078 -235 -116 -42 -180 -69 213 86 -183 -13 77 -133 81 389 130 -225 -36 182 -69 -55 192 45 -316
2099 -316 -195 89 -50 -57 152 12 -301 -60 229 53 -19 229 106 -266 -82 313 132 -130 30 8 -230
2120 -230 -142 183 81 -172 -66 -7 -174 -50 291 151 -208 -22 136 -67 -69 312 216 -239 -208 125 60 -122
2142 -122 62 120 -191 -274 30 96 5 50 119 -138 -184 191 237 -10 -23 155 -100 -281 75 316 -38 -282 12
2165 12 43 -214 -58 226 73 -229 -97 104 16 45 216 59 -188 -20 88 -7 10 187 -10 -333 -125 201
2187 201 48 -97 47 61 -170 -169 173 217 10 -75 5 -40 -5 132 93 15 -39 -103 -155 40 188 30 -150 -74 8
2212 8 -33 -26 126 131 -70 -147 -44 102 128 89 -3 -63 -42 -38 1 67 107 -38 -180 -99 64 70 -17 -1 -9 -99 -81 85 207
2241 207 92 -43 -65 -43 10 45 112 41 -71 -129 -70 -8 52 118 -35 -164 -72 21 34 44 136 32 -124 -76 66 95
$$ packed form
2078b35J19P4j38J11K82j27k69J70R0k10K14L08k59l55J89K18k51J4K47j47l61
2099c16J21K84j39pK09j40l13K41K89j76p2K48j23l72J84L95j81k62J60k2k38
2120b30Q8L25j02k53J06N9j67J24L41j40l59J86J58k03kL81r6m55L1L33o5j82
2142a22J84N8l11q3L04O6r1M5O9k57m6L75M6k47j3J78k55j81L56K41l54k44K94
2165A2L1k57J56K84j53l02J32K01q8K9J71j57k47J68J08r5J7J77j97l23K08L26
2187B01j53j45J44J4k31JL42M4k07q5Q0m5L5J37l9p8n4o4n2J95J48j58j80P6Q2
2212Hm1PJ52Nk01p7J03J46K6l9r2o0K1ML9O6M0j45j42Q1J63Oq7J6qr0J8J66J22
2241B07j15j35k2K2N3L5O7p1j12n8N9O2O0O6j53j29R2R3J3J0R2j04j56M8J42K9
$$ plain form
2267 95 57 31 -74 -161 -63 79 52 -13 -29 -25 -161 -103 131 143 2 -88 -44 -24 56 129 94 -6 -42 -65 -90 39 158
2294 158 32 -183 -128 21 13 -62 66 119 -78 -197 -24 159 116 20 -1 -21 -52 -19 74 95 33 -62 -136 -93 89 108
2320 108 -17 -90 -23 0 -125 11 213 105 -153 -131 82 88 -1 52 75 -59 -148 -41 105 98 27 -84 -129 -44 52
2345 52 20 6 67 16 -141 -86 121 149 28 -28 -17 -39 -70 87 97 -3 -63 -114 -74 46 102 7 -80 -22 -8 -97 54
2372 54 194 43 -114 -54 19 -28 72 160 5 -127 -58 -1 -13 72 117 -53 -159 -41 57 -8 50 132 -25 -190 14
2397 14 180 20 -32 82 -4 -174 -15 147 93 -51 -16 -28 -105 -18 133 75 -69 -32 -44 -54 60 170 65 -100
2421 -100 -41 30 -22 -1 153 73 -153 -148 33 77 12 17 9 -55 -90 16 87 78 27 -34 -61 -34 47 110 79 -14 -54 -54 -56 30 106
2452 106 20 -84 -99 -4 17 20 99 13 -84 -110 3 64 62 47 5 -45 -72 11 82 102 24 -110 -94 18 23 26 39 48 -109 -103
$$ packed form
2267I5l8k6j05q7R8J42k7o5j6Mj36N8K34J2j41r0M4K0Q0P3l5j00l6k3k5J29J19
2294A58j26k15N5J49qp5J28N3j97j19J73J83m3r6k1k0l1L3R3K1o2r5p4M3J82J9
2320A08j25p3O7K3j25J36K02j08k58K2K13Oq9N3K3j34q9J07J46pp1j11m5Q5R6
2345E2l2j4O1n1j57N5K07K8j21n6J1k2l1J57J0j00o0n1M0J20N6r5q7N8J4q9J51
2372E4J40j51j57O0P3m7J00Q8j55j32O9N7j2Q5M5j70j06J18R8o5N8Q2j57j65K04
2397A4J66j60n2J14q6j70J59J62n4j44L5j2p7Q7J51n8j44L7j2j0J14J10j05j65
2421a00N9P1n2K1J54q0k26NJ81M4o5Nqo4l5J06P1rn1o1k7K7Q1O3l1r3m0%kQ6P6
2452A06q6j04j5R5K1LP9q6r7k6J13O1kj5m2n0k7Q3P1K0p8j34J6J12NLJ3Rj57O
$$ plain form
2482 -103 15 96 49 24 7 -58 -56 53 99 23 3 -11 -101 -82 68 80 -58 -30 -35 -70 -49 61 123 -16 -104 -50 40 21
2510 21 61 78 3 -65 -41 4 54 68 34 -91 -102 -19 34 67 47 4 -70 -94 -7 67 95 53 -45 -36 -7 11 30 76 25 -51
2540 -51 -79 -6 63 28 -2 -22 -72 -78 -1 99 67 -8 -13 -48 -29 16 97 55 -50 -66 7 -24 1 77 66 -105 -102 8 38 9
2570 9 30 61 -89 -121 31 103 0 39 65 -73 -111 59 150 12 -38 13 -54 -110 7 138 23 -77 -25 -18 -54 34
2596 34 147 35 -116 -17 33 -39 25 130 20 -108 -72 40 12 -8 29 -9 -102 -97 69 65 23 12 -27 -27 -25 70 102 41
2624 41 -6 -36 -42 -9 43 84 34 -80 -90 -9 22 26 59 -2 -102 -82 13 46 64 27 -22 -44 -55 72 73 38 7 -38 -69 -30
2654 -30 57 61 -3 -48 -58 -16 -30 65 74 27 -34 -46 -1 77 68 60 -15 -54 -50 -19 42 51 -9 -23 -54 -42 26 30 41 -12 -29 -51 -16 64
2688 64 93 30 -17 -45 -43 17 59 58 29 -50 -76 -39 21 34 29 -26 -49 -56 1 64 84 38 -11 -60 -13 50 56 30 16 -70 -92 -46 35
$$ packed form
2482a03J18Q1m7k5j7o5KJ09M6p6k0j4r0J9J50J2j38K8nl5K1J10O2j39q8N4R0j9
2510B1M0J7p5o8K4M5N0J4l4j25j1Q3N3L3k0m3p4k4Q7P4K8m2r8RK9J8J9M6n1p6
2540e1k8P3O9l5l0k0n0oP7J00l2p5nl5J9M5Q1m2j05j6P3l1K5P6j1j71LJ10L0k9
2570IK1L1j50l2J52P2j03L9K6j38l8J70R1j38n0N1o7n6J17J31j15j00N2Pl6Q8
2596C4J13j12j51R9N0p2O4J05j10j28L6J12k8k0L7l8r3NJ66mm2j1l9%KR5L2o1
2624D1m7l0oL3N2M1n0j14j0Q1L1ML3o1j00K0R5L3J8l7m9k2j1J27Jl5l1m5l1L9
2654c0Q7Mo4m5j0M2j4R5Rm7o1j2M5P8rqp5l9ML1O1Ro0j4l1J2O8MJ1n3j7k2L5Q0
2688F4K9o3m7k8KO0M2jk9p9k6L7O0J3nn5k3pN7O3K0m6m9m9M7O3Ok6j4q6k2M6Q1
$$ plain form
2721 35 37 3 -41 -38 -46 6 87 44 -27 -28 -49 -43 46 88 69 -47 -60 -33 3 70 37 3 -52 -77 0 29 50 38 -13 -44 -35 -17 54
2754 54 72 0 -22 -13 -15 9 58 51 -42 -79 -50 -15 14 46 68 -30 -72 -43 52 68 32 46 -34 -76 -22 73 70 28 -20 -34 -77 -9
2786 -9 87 42 -58 -34 -28 -69 -14 61 70 -24 -75 -19 9 38 62 37 -17 -46 -69 11 44 20 6 -46 -74 -13 58 28 -4 25 -18
2817 -18 -62 -30 87 103 -4 -60 -10 20 19 30 53 -8 -99 -72 -5 48 51 0 -35 -61 -46 16 46 53 15 -39 -74 -16 78 39 21
2848 21 -16 -39 -44 -42 78 56 6 -63 -60 11 7 44 15 -12 -49 -59 15 42 70 30 -37 -46 -3 41 52 -2 0 3 -63 -38 29 87 5
2881 5 -78 -16 9 -2 14 63 24 -41 -56 -4 48 38 48 -35 -84 0 -4 15 29 19 -54 -105 -18 68 50 -6 -5 -10 -14 -11 54 44 35 -11
2915 -11 -75 -18 45 57 -6 -16 -31 -18 -74 55 110 0 -37 -83 -8 35 51 47 -13 -2 32 -14 -4 78 57 -86 -45 -9 9
2944 9 -34 66 55 -18 -69 -59 39 52 31 1 -42 8 23 21 47 27 50 -78 -28 45 62 3 -20 -44 -35 -20 -1 42 54 -8 -72
$$ packed form
2721C5Kl4m4LqN2Q1m3p1jk1OQ9M2j9j16j3K7L6O7l3l4n5k5P7K9K1j2n1l1RJ8P1
2754E4J8p2k2RkK4M9pr3l7K9L5K9L2K2r8m2K9R5J6l6J4q0m2N4R5lm2m8j4m3O8
2786iR6m5j00K4Om1N5P5Rr4n1N6K8K9K4k5n4k9k3Q0L3k4j4n2k8O1P1l0l2K9m3
2817a8m4L2J17J6j07n6N0L0jJ1K3o1r1K7O7N3Ln1l5k6J5O2L0Pl8n4l5N8R4l9j8
2848B1l7k3nKJ20k2n0o9LP1mL7k9k7l7j0P4K7K8m0o7rM3M4J1n4KLo6K5O7N8q2
2881Eq3O2K5j1J6M9l9o5j5N2N2j0J0q3m9Q4mJ9J4j0p3n1Q7Q6j8n6JnmLO5j0rm6
2915a1o4N7O3J2o3j0j5J3n6J29N5j10l7m6P5M3J6mo0J1L4m6J0Q2k1j43M1L6J8
2944Im3J00j1p3n1J0R8J3k1l0m3N0J5kK6k0K3j28N0P3J7n9k3k4RJ5J9M3J2o2o4
$$ plain form
2975 -72 -17 73 78 29 22 5 -36 -41 29 60 29 -15 -48 -54 -17 49 32 -29 -5 3 -18 -37 75 78 -33 -40 -24 -2 20 32 3 -34 -48
3008 -48 -12 -6 12 32 36 -46 -30 2 24 16 29 27 -19 -33 -3 52 44 -20 -23 -44 -26 -2 60 53 -3 -62 -35 1 36 51 22 -16 -31 -8
3042 -8 -8 28 20 20 -30 -42 -6 21 29 -4 -11 -3 -42 -22 35 59 10 -41 -41 -36 -18 63 13 -40 -40 -22 -35 15 75 0 -31 -6 -9 8 71 60
3078 60 0 -66 -13 3 -23 14 61 -32 -82 -21 32 27 62 33 -27 -37 20 48 36 39 4 -25 -80 -16 24 10 -24 -23 -58 -81 -51 65
3110 65 51 10 -6 -1 4 26 75 47 11 -56 3 12 -1 30 -6 -68 -79 -25 26 11 -13 2 6 -23 1 70 54 24 -22 -9 -25 14
3142 14 10 18 -28 -27 -42 -40 21 52 0 -56 -7 42 10 38 65 66 -8 -55 27 40 -6 6 -23 -85 -29 0 -20 2 36 -27 -58 -24 84
3175 84 50 19 20 19 -40 -44 12 19 -13 -45 -50 -48 23 26 -17 -30 -5 10 -24 3 97 46 -36 -31 12 41 20 -8 34 -49 -84 -59 30 34 8
3210 8 -11 -51 -13 10 52 41 5 34 -10 -61 -13 68 -8 -62 -30 24 -15 -26 61 39 1 -33 15 33 59 57 -11 -28 -14 19 -9
$$ packed form
2975g2N5R0Nm9pj7m1nP0L1l1m4l3oL7O6j7o1K4Qk1j9J12Lj11pJ6K2K2J2k9l7j4
3008d8L6OJ8K0Mq2J6L2K2qJ3km6j4L0N5qo4lk1J8K4O2pn6n9K7L6L5J5k9l8j5K3
3042h%L6q%n0j2L6K7Ql3pQl9K0N7K4m9n1%NJ8Q1n0n3%J8j3N0O0p5l1K5lJ7O3j1
3078F0o0o6N3J6k6L7M7r3n0O1N3nL5k9o0j0N7K8j2Ll5k9n5O4M0j4l4Jl5k3L0J16
3110F5j4m1j6NNK2M9k8l6o7N9Rj3L1l6o2j1N4N1j5k4J5Mk9K4O9j6l0m6J3j6L9
3142A4mQm6Jj5KO1L1n2n6M9M9l2K8K7Jp4m7Q2J3m6J2k9o2N6K9k0K2L4o3l1L4J08
3175H4l4l1Jjn9mN6Pl2l2nKP1Lm3j3K5J5l4K7R4n1q2NM3K9k1k8M2q3l5K5Q9Mk6
3210Hj9m0L8K3M2j1l6K9m4n1M8Q1p6n4L2N4l9j1Q7k2l8l4M8J8K6ko8j7J4L3k8
$$ plain form
3241 -9 -7 25 -31 -88 -38 48 25 -14 35 53 -16 -7 43 66 26 13 -45 -31 -2 40 7 -56 -7 -29 -69 -28 46 82 -5 -40 22 52
3273 52 21 58 47 24 -40 -30 3 22 11 -20 -56 -33 1 -8 0 15 9 -17 -12 16 80 58 19 -35 16 -6 -1 24 2 -26 -63 -56 -15
3306 -15 -4 29 -21 -3 -7 13 25 31 70 40 -13 -19 10 4 16 -22 -37 -57 -19 -2 13 6 29 -33 -21 32 67 67 22 33 -17 -21 -6 7
3340 7 14 -14 -40 -43 -15 -11 32 16 -24 -28 -28 -27 10 56 -5 -28 -41 -7 3 14 36 18 -30 -60 -7 8 14 6 -15 -35 -28 46 24 28 -7 21
3376 21 -46 -1 41 36 -6 -24 -17 -53 -18 -3 31 -8 6 -28 -19 32 33 21 -14 -22 2 -6 -2 15 46 -35 -48 -19 27 4 28 44 -30 -15
3410 -15 3 19 26 5 17 -36 -38 3 34 40 -9 -7 -10 -16 -15 34 7 -20 -25 -24 -4 43 51 32 -16 -14 1 -11 15 37 13 -49 -40 5 10 9 38
3447 38 2 15 1 12 51 27 -4 -28 -24 -14 12 22 18 -19 -7 -25 -27 16 32 17 -21 -11 -1 28 39 19 19 -14 -22 -38 21 19 20 -45
3481 -45 -33 -5 -6 -10 47 21 -22 -12 29 19 14 2 1 -10 9 11 19 12 0 -33 -68 -21 0 13 -3 -8 -14 -26 -23 11 66 16 -34 -34 22 8
$$ packed form
3241iKL2n6n7N0Q6k3l9M9J8o9RN0K3m0j3n8J4K9M2l3o3M9k2m0M1P4L6q7l5O2L0
3273E2l1L7j1k3o4J0L3J9j1l1l6K3L4rQJ5ok6NK8O4k2l9n4N1k2NK5k2k8l7PM1
3306a5J1L3n0J8mK0J2OL9l0n3oK9oJ2l8j5k0L8J7J5pK3o2J2N3L5%m5J1n0mJ5J3
3340GPk8k6lK8MM3j6m0m%JL7M6o1k3j3L4J0J1K2j8m8l0N3J5Oqk1k0PP4k2Ml5K8
3376B1o7M5M2nm2j8Pl6L5J5L4l9J4l4RN1Jj2l5qK4qMJ7L1q1j3K9M6k3K4J6p4J5
3410a5J8J6Pk1J2n3kM1L1Om9KloJM9k7k7nJK0M7Qj9m8KJ5j2K6K2k4o2RM5NjK9
3447C8l6J3j4J1L9k4l1k4MJ0K6J0ml7J2j8kM3J6j5l8J0J0K9J1k0%l3qj6N9kJo5
3481d5J2K8jmN7k6m3J0M1j0nj2jj1J9KQpj2l3l5M7K1J3j6noj2LL4N5n0n0%N6j4
$$ plain form
3517 8 14 23 17 -17 -22 3 -5 16 2 -50 -31 0 -2 14 42 25 -4 -29 -7 45 12 36 16 -43 -19 -2 19 9 -5 -17 -47 -43 4 44
3551 44 4 -15 23 -12 -4 -11 39 58 -9 -37 -14 18 16 3 -4 -22 -18 -28 -30 27 36 7 -65 -23 39 38 25 11 6 -6 -22 -6 37 -5 -22
3586 -22 -63 -30 -8 0 13 -10 -4 -9 -31 6 30 40 8 -34 6 9 -26 29 31 14 -57 -18 0 23 26 14 1 -30 12 5 13 36 19 -6
3620 -6 -30 5 52 10 -5 4 1 -12 15 53 19 -9 -11 -37 -17 5 14 -4 -7 -11 -16 -5 54 54 -1 4 -11 6 -2 27 14 -4 -3 -23 -33 13
3656 13 23 9 -17 1 -10 26 -11 28 30 -33 -21 14 5 34 7 -8 22 -1 -12 16 41 -8 -23 -26 -11 -6 11 -8 -2 -37 -15 2 -1
3689 -1 6 -26 -41 -49 -1 33 10 32 14 -3 -26 -11 32 11 -2 -12 -42 -20 12 32 20 13 -23 -22 -41 24 50 -10 -23 4 -16 2 28
3722 28 14 -7 -7 -25 -51 2 29 23 -23 -44 -15 2 -1 37 29 9 -33 -14 31 9 -4 10 -13 -38 -33 23 40 32 1 -39 -12 14 30
3755 30 12 9 20 -16 0 41 31 13 2 -54 3 11 -7 24 13 0 -5 -35 0 11 -2 -9 -22 -2 -16 17 22 19 15 -6 -23 10 39 -12
$$ packed form
3517HORol4nK5qK1j4n2J9L1kJ6K8j7k9k5K2N2l3K4k0n9K4J7K1j0j4j2l0MM7M0
3551D4m0j9L8l5QpN0J9o7k8K3L2kj3pj8Mj0kN7Rk9p2M2O2jj3j4nj2j6J6M3m2j7
3586b2m1L3K2QJ3k3Onk2L7K4J0l2m2M0Ll5N5Kj7p1L9J8K3Lj2j3l1M2pQK3j7k5
3620fk4L5M7m2j5Rlj3K7L8l4k8kk6K0K2Rj8lmnJ1N9%n5Nj5J7qK9j3j8Jk0j0M6
3656A3J0j4k6J8j1L6l7L9Ko3J2L5rK9k7j5L0k3j1K8K5m9j5lJ5NJ7j9Ol5K2J7l
3689aPl2j5qM8L4k3K2j8j7k3J5M3k1j3j0l0K2L2K0j2pl6Jj9O5K6o0j3K7k0J8K6
3722B8j4k1%j8k6N3K7om6k1K9J7lL8qk0m2J9M5k2j3J4k3k5NN6J7ql1m0K7K6J6
3755C0j8lJ1l6J6M1j0j8j1n6N7Qj8L1j1j3nl0L5J1j3pj3K0j4L3Nlmk1j7L3K9n1
$$ plain form
3789 -12 -9 -37 -13 -22 -5 25 6 -21 -1 -23 -6 -1 31 9 -10 -5 -5 -15 -1 17 3 -26 -5 8 13 8 20 14 -19 -29 44 32 -12 -10 -11
3824 -11 8 -31 0 16 -14 -21 -16 -15 -15 35 15 -14 -13 -21 -46 3 12 10 -28 -24 6 -8 4 -8 -11 -38 -24 10 0 19 20 -10 -39 -20 -12 15
3860 15 27 8 -12 -18 -5 11 29 -6 -12 4 -10 7 -3 15 0 28 -5 -3 11 -6 33 15 -4 -29 -5 7 12 6 0 0 -26 -5 8 13
3894 13 5 -1 -9 -33 -31 7 38 5 -5 -30 11 -1 18 -6 -2 20 3 -11 35 14 4 4 17 11 -19 24 12 -2 -14 5 -14 3 19 23
3928 23 -32 -11 11 6 -13 19 9 -35 -37 -15 9 -4 15 15 -30 -9 4 5 34 25 11 -1 -5 0 -5 3 12 -36 9 17 6 7 11 -16 23 -21 19
3965 19 14 21 -5 -15 -4 -33 15 24 12 -17 -3 4 -8 17 3 6 15 11 -13 -12 31 15 -20 17 -25 -22 23 7 14 -11 -3 -8 -1 5 1 3 -8 -19
4003 -19 -9 -24 23 20 -14 3 -7 0 13 12 18 5 -23 19 -19 -4 17 -20 -3 -21 -10 15 -16 -15 17 11 -28 25 12 6 7 -29 -12 -18 22
4038 22 -10 5 -7 -8 0 8 4 -14 20 5 -37 3 21 58 12 -20 -9 -2 23 26 -6 -1 -30 -6 -23 -6 0 -7 -22 -10 -30 -11 24 36 15
$$ packed form
3789a2Lk8K4rJ7L0j9k7K0k2J7NL2k2j9N%j0J4J8j4k9K1J3NnJ2ol3j0P3j2m4Kj
3824a1J9l9L1J6l0pNJ%N0k0k9Jqk5M9Rkl8ML0j4J2j2lk7J4L4j0J9Jl0k9J9QK7
3860A5J2j9k0oJ3J6J8l5oJ6j4J7j0J8j5K8l3KJ4j7L9j8j9k5K4J2Noo%k6K1J3N
3894A3qoqk4KL8L1l3j0k5M1j2J9k4MK2j7j4M6k1j0%J3ol0M3j2j4j2J9j9J7J6M
3928B3n5K1K2nj9L2j0m4kK2K4j3J9%m5K1J3JK9rj4j2mNnQRm8M5Qj1JMk7L9m4M0
3965A9nPk6j0J1k9M8Rj2k9J4Pj2K5j4LRmk4JM3j6l5L7m2LM5j6Pk5QnPOmKj1j1
4003a9J0j5M7ll4J7j0PJ3jOj3k8M2l8J5K1l7J7j8J1K5l1JL2ol9N3j3oJl6J7oM0
4038B2l2J5j2jQQmj8L4j5m2M0J8L7m6l2J1PK5Ll2Nk9K4j7J7Opj5J2k0J9L5J2k1
$$ plain form
4073 15 -7 1 6 11 17 11 0 -22 9 21 20 25 -3 8 -36 -2 -6 -7 -2 6 -11 -16 -44 16 35 14 11 -29 15 -30 9 17 4 -13 -27 -7 28
4110 28 20 13 -27 -13 11 -17 1 17 7 -18 -2 -1 -9 -3 22 -11 -6 -13 6 1 26 3 -8 -4 -25 9 25 18 -15 5 -31 -23 11 -11 14 -23
4146 -23 -15 -7 -22 1 -8 11 -20 27 -17 27 2 -3 6 -4 21 0 25 11 12 2 13 -12 0 -1 28 16 10 -17 -5 23 -6 -15 -11 1 -18
4181 -18 -2 -1 -32 11 6 -26 19 -16 1 20 -6 -11 -24 -21 8 13 16 3 11 -15 -9 -2 -1 15 -11 -12 -16 5 37 13 -19 -5 0 4 -10 26 -2
4218 -2 -25 -55 -31 -13 10 20 -8 5 -17 -13 8 6 21 17 -8 -16 8 10 -7 -11 -15 -28 -24 -2 5 3 -13 -2 6 8 5 26 -4 -11 -5 11 13 15 9 -3
4258 -3 1 -7 15 -29 -3 -2 -8 -24 -8 -6 -4 0 -23 1 -5 34 15 18 7 -13 9 24 -19 15 -17 4 -30 6 41 19 15 -12 -14 3 14 8 1
4295 1 19 14 15 -27 11 39 5 4 -13 -1 -18 -28 4 17 2 -8 -7 -37 4 -13 11 -4 -14 31 17 32 29 10 -1 -5 -8 7 30 3
4329 3 4 8 -23 -16 -16 3 1 -6 -1 -25 -7 -2 6 -9 -24 -22 0 -7 -2 5 1 -20 -28 -1 -1 21 -2 -7 -37 -10 -18 0 19 -14 5 -7 25 -12 30 29
$$ packed form
4073A5k2QNNOoj1k2L1J2jNk8J1m4L4mjNQj7nk8O0J9k1lm0M4m5L9Qj3j7j4K0L5
4110B8qpm0J4K4k8J8J6j0k5J6JqOK5l3NpJ9nK5k3j1Mk1L4J6pl3K0l6QL4k2K5l7
4146b3QQj5K3rJ9l1M7m4M4k5nRj0K5k1K5j4Jj0J1k5J2jK9j2ok7J2K8k9rMJ2j9
4181a8J6Jl1M3nl2M5l5J7J9k6nj3LK9NLj3Qk6OPJJ6k6jmK1L2k4l2J4NMj4L6k8
4218bk3l0K4J8K3J0k8J3k2MK1kJ5mk5qK4Kj7mmj3MK2Pkj6J1QKlK1l0pOJ6KKoj2
4258cMqK2m4K6Joj6J6KKMk3K4oL9j9Lj1k0K2J5m3L4l2K1l4L6L5k2mk7kJ7J1op
4295AJ8nJm2L8K8l4jj7J2j7j0L2J3j5j0Jl0M1j7K4j5j0M5j4J5lj9j1mlJ5K3k7
4329CJMl1P%J9kpNk4J8NQj5j5KK2pNPmk1qK7%K2k3nl0K7qJ8J9l3J9j2L2l7M2j
$$ plain form
4369 29 11 -9 -8 -34 -11 -5 -19 9 -7 -18 -5 4 16 -6 -20 -10 2 10 6 -23 -5 -12 -13 -12 19 -18 -22 -13 -8 -12 -5 -3 2 -11 -12 8 -5 24
4407 24 13 9 2 -3 16 14 -2 -3 9 1 -24 0 -4 -8 0 9 -8 18 31 19 -1 -25 -4 -17 12 9 -7 4 -4 13 -7 12 -2 3 -24 -7 0
4444 0 -7 16 7 13 1 0 5 5 -1 -1 1 1 -12 -4 -10 8 10 1 6 -19 -2 -5 28 24 9 -55 -12 -4 16 26 17 -7 12 -2 -9 -11 4 -10 -5 11 -11 0
4486 0 6 14 15 -2 -17 -15 5 15 -8 -17 -1 1 -2 -1 3 3 3 -7 12 17 -20 -1 10 -7 6 17 -12 -15 10 3 -25 -43 16 22 1 -11 -3 1 -1 17
4526 17 7 -8 25 -16 -2 -5 7 -8 -6 -5 -18 4 29 -17 25 3 11 3 1 -15 1 -13 -3 -7 6 26 -6 -11 -4 2 -4 -20 4 8 3 -5 -10 -16
4564 -16 26 3 -17 -1 14 15 -17 -8 0 -18 7 3 -9 15 3 -23 5 8 -3 -10 14 28 -1 -10 -4 6 -8 -3 20 -16 -5 -13 -3 4 -9 -14
4600 -14 9 -16 5 2 17 33 -2 -13 -8 -9 0 -6 -30 -24 9 9 34 38 -13 5 2 -7 17 -10 15 23 -21 -11 -17 -21 10 -11 6 -19 -3 -16 -8
4637 -8 29 -15 8 -15 -10 -5 17 -1 -6 19 -25 -8 -10 30 8 8 -9 13 4 1 4 31 9 -11 7 22 -11 7 9 -4 -15 14 1 8 10 -3
$$ packed form
4369B9j8k0Jk6K3Oj4K8j6j1J3RJ2k2j4J0J2Qmk9J8pjJL1l7mRNmPKNj3jK0j3K9
4407B4j1mpnJ9kj6jJ2qk5K4mmQRj7K6J3j2k0k4K1j3K9lj6J1qJ7k0J9j4Nk7J7P
4444@pK3rOj2jN%o%K%j3QoJ8KrNk5J7lL3mj5o4M3QK0J0rk4J9j4pkJ5j4NJ6k2J1
4486@OQJj7j5KK0J0k3rJ6KlJM%%j0J9Nl7J9J1j7J3J1k9lK5pk8j8N9Ok1j2QMkJ8
4526A7j0j5L3m1J4lJ2j5KJj3K2K5m6M2k2Qqkj6J6j4J0mJ3K0l2nPOoj6K4Mnqno
4564a6M2k3k0J6J5Jl2RQj8K5mj2K4j2k6K8Lj1pK4J4k9rOJ0j4NK3l6J1qJ0Pj3n
4600a4K3k5K1lJ5J6l5j1NjRok4OL3%K5Mn1J8lrK4k7K5Qm4J0omL1k1J7k5J6j3Q
4637hL7m4K3k3NNK2j8nK5m4J7kM0k2%j7K2rlLK7k2k0J8J5l3J8Kj3j1K9j3PKj3
$$ plain form
4673 -3 3 5 8 2 15 7 -15 -19 1 9 -20 -1 0 10 -5 1 1 5 -12 6 5 -1 -1 8 36 11 4 20 -2 18 -6 -11 5 -5 -22 4 22 -8 4
4712 4 9 -25 -9 14 3 -16 -7 14 -6 -5 -1 -7 18 9 30 -1 -10 -17 -1 3 14 14 -13 18 2 4 26 1 22 11 -10 8 13 4 5 1 3 18 -2
4751 -2 -12 0 -18 -8 -12 4 -11 -17 2 0 5 3 -15 -21 -3 -3 -10 -1 -24 5 -21 -32 -25 -10 2 16 -13 -26 -3 13 3 -3 13 5 -23 -8 18
4788 18 12 -20 -3 -33 -26 -16 5 11 27 7 -24 -7 0 1 33 -4 -8 22 -5 -1 11 -22 -11 -3 -10 -5 5 8 -9 -25 8 -13 6 -18 -6 11
4824 11 -8 -9 -13 13 26 14 11 5 -2 12 -24 -5 6 4 -31 -8 11 -2 -12 -8 -6 -11 -12 35 1 12 0 17 12 12 -8 -1 1 -27 -8 -14 9 11
4862 11 7 0 -29 1 -9 14 41 -15 11 -15 38 -9 -2 -5 -5 1 2 -28 3 -10 -20 -37 -19 -10 -21 4 -10 -12 3 -10 -28 0 -1 -19 -28 -21
4898 -21 -23 13 1 6 0 -16 -3 -25 23 -1 -4 -5 -28 -20 -16 1 -18 -12 2 4 6 9 -10 23 4 -20 -26 -3 -4 -12 14 8 -8 -29 -8 17 -3 -23
4936 -23 -17 7 -11 11 10 10 -9 -24 14 -7 -9 6 3 -4 -3 -13 2 -7 -1 -1 -13 -35 -28 9 -18 -6 -11 11 -16 18 10 16 -7 -6 5 8 2 -33 13
$$ packed form
4673cOKLoJ3qk2mK0Qk9J9JJ0j5O%Mj7J8jo%RK8k5pJ6k2K0k4nJ6j0j7K6J8l0J2
4712DNl4J6K3j1j9RK1k0JMoK5rK1l1rpJ6MJ1%k7L1j6KK2k5K1j1k1J8NrJmKJ5k0
4751bj0J2j8J0mJ6j5oJ9kNkj8oJ8%pRk3K9k6j1PJ5J2J4k9j3K3J6j0oJ6qk8J5K6
4788A8ol2J7l0PJ0K1OJ6k0l1J7PJL2l7mL0k7MJ2l3J1QpNJ0Lj7j6L3k1J9k4J2J7
4824A1j9jmK6J3j2lopJ4l6J9J1kl5K3J9j3j0MKnjM7l4J1j2J7n%k0PKk8J9oK3K
4862A1mpk9L0j0K3K7n6K6k6N3m7Pl%OJl0L1j3j0j7J8Rj1K5j4kJ5j3j8K8jj8rP
4898b1kL6j2Noj6J3k2M8k4ljk3QMJ7j9OJ4KKLj9L3j9k4oK3jqK6oj6k1K1K5k0k0
4936b3OK4j8K2j%j9j5L8k1kJ5lpJj0J5rO%j2k2PL7k7J2nK2k7L4qOk3JJ1Lol5M6
$$ plain form
4975 13 10 4 -2 9 -22 -6 -5 -19 -4 -16 -20 7 -6 -4 -5 17 -10 3 14 13 -17 -16 -7 21 6 5 19 0 4 -17 18 -5 24 0 18 27 22
5012 22 -4 2 12 -3 -22 6 -14 13 7 2 -3 -20 -12 27 43 -8 12 9 3 -9 -8 -6 12 -17 12 18 18 -15 -6 -2 -11 10 19 -13 26 -5 5 -20
5050 -20 13 13 8 23 6 1 7 -1 5 3 25 -8 0 -16 -12 4 10 -18 -3 26 -5 -7 21 -27 -10 -21 10 16 13 5 20 -2 -3 -3 9 4 -14 17 1
5089 1 9 -6 13 0 17 14 -13 4 1 -19 -5 41 -14 26 21 1 5 -11 -9 -9 -6 11 -4 5 28 12 1 26 38 7 6 9 1 5 -2 -21 19 7
5127 7 -17 6 -18 -1 18 15 24 -7 -8 8 17 -26 -4 13 6 -5 9 7 6 -4 11 -38 -14 -2 1 -9 -21 -4 -5 17 2 27 -4 32 5
5162 5 18 -6 3 6 4 14 -12 -1 3 -22 13 -9 -1 -5 1 11 14 -3 -11 5 18 -9 -21 -33 8 -12 -11 -12 13 -4 -3 7 -1 -1 -4 0 3 6 10 -7
5202 -7 -1 13 -13 16 23 -13 8 -21 -39 3 9 -2 5 17 -3 9 -5 17 -24 -17 9 -7 -11 9 25 -17 -39 36 15 22 8 27 18 -7 -23
5237 -23 -2 -8 -4 -8 -17 -27 -8 6 -1 -22 2 -20 -21 16 1 -6 -4 -5 -7 -9 4 15 14 -5 -4 3 25 -22 1 20 -15 15 8 18 -10 7 9 2 9
$$ packed form
4975A3looJ1l1J6Jj4J5j2mK7j3KjK2k7J3J1jl0JRK8j5jJ4j9Mk1L5k3K9k4J8Rn
5012B2k6OJ0j5j9K8k0K7onnj7QL9J6n1K0loj2JKJ8k9K9O%l3RMrK1Rl2L9l1J0k5
5050b0L3%nJ5j7nOqOkK2l3Qj6MJ6Ok8J5K9l1kK8m8J7j1L1OlqJ5k2j%J2nj8L1j6
5089AQj5J9j3J7lk7J7lk0J4M6n5M0nk0Mj6K%LJ7j5RK3j6j1K5J2l1jLqMpj9M0j2
5127Gk4K3k4J7J9lRl1jJ6Rm3K2J7pj1J4kjj0J5m9K4J2Lj0j2J7jK2j5K5l1L6k7
5162EJ3k4RLkJ0k6J1Mk5L5k2QmOJ0Lj7qJ6J3k7j2j2M1k0JjK5j7JJ0q%lMLLMj7
5202gOJ4k6K9Pl6K1k9j8M2Oj1PJ2k0J2j4K2m1PK6j6mK0J6m2k2P5k1Pj4J9rk5j6
5237b3K1oMmrj0J9J4pk1K4k2jL7j5pKjkkJ3J1jj9JPK2m7K3J9l5L0pJ0k8J7KpP
$$ plain form
5276 9 37 21 16 15 34 20 11 22 5 2 -11 -19 1 2 19 -18 -12 7 7 19 -13 -5 -3 7 -30 2 -9 24 -7 -22 -16 -11 20 17 29 2 4 -1
5314 -1 -4 -1 17 1 23 -7 3 5 7 10 16 4 -7 8 31 -5 13 10 17 11 4 23 3 -9 -6 3 36 5 6 -24 -14 18 1 -7 0 -5 6 -4 -5
5353 -5 13 -9 -6 -9 45 7 -2 -21 12 -1 19 -6 8 -6 5 6 23 14 -21 6 -5 16 0 6 -1 3 13 23 -17 13 13 11 -25 2 2 8 -9
5390 -9 -5 23 -6 4 -6 -48 35 9 3 -28 8 -9 -13 6 -5 0 -3 0 2 -3 -14 16 1 14 2 1 -15 -14 -4 23 18 11 24 -13 14 11 -2
5427 -2 -5 11 29 -19 4 -1 4 -2 5 -6 -20 4 -19 28 12 26 21 6 -6 3 38 0 -3 28 8 -13 2 36 10 -1 -12 -31 -9 -5 7
5462 7 11 0 -6 8 -7 -40 11 -2 -28 -3 24 5 6 4 -4 23 9 3 41 13 9 15 4 -7 19 6 21 17 31 -28 -2 4 26 6 16 0
5498 0 0 19 -2 8 23 3 -11 -16 11 -13 17 19 -9 -12 -11 -15 -3 -9 9 -14 13 -6 -8 30 5 -6 30 -6 12 -3 -18 20 4 -1 4 -1
5534 -1 -4 12 12 12 6 0 -7 -6 -1 -2 -5 14 -7 -11 23 15 -1 -6 10 -17 -13 2 5 -2 -26 3 -9 12 13 20 -13 -6 4 -3 -5 35 58 27 7 -7 47
$$ packed form
5276IK8j6njJ9j4rJ1j7lj3qK0JJ7l7OJ9%J2l2QKJ0l7L2j1L3l1j5ONL1lJ2k7Kn
5314alLJ8j6K2l0J0KKLOj2j1J5K3l6J8lPopJ9k0j2LRL3l1Jl0J0L2j7qPnJ1j0j
5353eJ8k2LlN4l8rj9L3j3K0k5J4j4J1JJ7rl5K7j1K1j6OpMJ0J0m0L0%kl6K7%Oj7
5390iMK8k9J0j0m2Q3k6ol1L6j7mJ9j1NlLKnj1L0j5J3j2jj6JJ0K7npJ3l7K7lj3
5427blJ6J8m8K3nNoPj1j4K4k3M7j6J4nj5j2RL5l8lL1k0k1J5L4k6j1j1j9K2MJ2
5462GMj1oJ4j5l3N1j3k6K5K7j9JkqK7j4oL8k8mOj1j1K6j3J5mJ4n9K6OK2k0J0j6
5498@%J9k1J0J5k0j4nK7k4L0Kk8lJmJ2oJ8k3K7j9kL8k5j1L6l6J8j5j5L8j6nNn
5534alJ6%%oopJNjlJ9k1mL4qj6nJ6k7MJ5Lpk4K9j2K1JPl3PJ0pkM0K3l1k0j4N4
$$ plain form
5575 47 19 14 13 4 2 1 7 -3 0 28 0 -10 -10 0 2 -3 0 13 -13 12 10 -8 -3 -5 3 10 17 24 11 3 2 0 -5 14 -15 -11 10 10 1 -3 5 -9 6 20
5619 20 23 -3 35 -12 -8 -18 -13 -22 17 4 -4 -11 -15 20 6 34 10 6 3 -7 -20 2 -15 -9 3 4 -11 38 6 14 1 8 9 3 1 -10 7 -16
5657 -16 1 -31 7 20 24 -6 13 -10 6 -10 12 -16 8 10 -23 8 -14 18 1 13 15 -25 0 -12 2 7 6 14 -19 -11 -12 -13 24 -5 3
5692 3 38 -11 0 -1 -20 -10 0 3 19 -31 -19 16 -10 33 -2 11 -9 -13 24 1 -5 6 -3 -13 -16 17 10 22 1 -22 -15 -5 -5 0 14 -3
5728 -3 17 -20 4 -6 -7 -8 -9 -11 4 15 16 -4 -27 12 17 12 -13 -17 -2 -1 -4 -13 -11 18 -27 -3 -5 3 6 -25 10 6 0 -8 -6 -14 -9 10 -13 -26 -16
5769 -16 -10 3 -9 14 -17 7 17 7 -4 -12 19 8 -22 -12 -22 -2 12 -9 -10 -34 32 9 12 -7 -8 -4 -19 -16 -9 17 16 5 -21 -17 -3
5804 -3 -2 -1 22 2 -10 -2 -15 9 -25 5 -8 -14 26 7 -6 9 -6 2 43 -2 -9 4 -5 -8 25 -18 4 -8 3 16 3 -3 22 19 -3 -15
5840 -15 -3 -1 -2 -8 -4 3 -10 11 8 -16 -5 -3 10 -27 -28 -23 12 14 10 -6 -17 -16 -7 30 18 -1 21 -12 1 -17 7 -21 6 -8 13 9 24
$$ packed form
5575D7k8njrkjOj0LK8k8j0%J0KnLJ3k6K5kj8NkQPPPj3qjknJ9k9MK1%rmQj4J5J4
5619B0Lk6L8m7Mj0NrL9j3qpmL5j4K8k4mlj0j3K2j7OJ2Jj5M9l2Qj3PJokj1J7k3
5657a6J7l2L8J3Ml0J9k3J6j6K2k8K4Kl3L1k2L2j7J2Km0K5j2J4NjQl3QjjL7k9Q
5692CL5m9J1jj9J0J0LJ6n0J2L5k6M3l5J3k0mL7k3oJ1rj0lL3pJ2k1k3PJ0%NJ4j7
5728cK0l7K4j0jjjkJ5J1Jk0k3L9Nnk5mJ5JlrKK9m5K4kQLl1L5moqKqNJ9k3j3J0
5769a6OJ3j2K3l1K4J0j0j1qL1j1l0J0j0K0J4k1jk4O6k3Lj9jMj5LPK6jj1k6MJ4
5804cJJK3k0j2Qj3K4l4L0j3oM0j9j3J5j5QM1m5pJ3rlL3m3K2j2J1J3j3oK5lk2j2
5840a5J2KjoMPj3K1lk4J1KJ3l7jNL5Kmj6j1JRL7j2j9K2l3J3j8K4k8K7j4K1mJ5
$$ plain form
5877 24 -3 31 -17 59 91 -15 12 -95 -108 -7 -25 -55 -143 54 161 127 21 -2 38 58 -2 62 -112 36 -19 -24 -13
5904 -13 81 -15 -18 -26 19 73 70 64 8 -20 -44 32 42 -4 -11 10 -64 -27 9 -110 61 -115 -129 -35 -27 48 -5 27 -10 9 -13 -11
5936 -11 26 2 1 2 -2 -42 -14 5 24 30 -4 25 1 13 1 8 -1 5 15 1 3 -20 -4 -7 -21 14 -1 -15 -14 1 8 16 -20 22 -8 -1 11
5973 11 -2 8 -13 3 1 3 3 -14 6 -9 25 10 -1 3 -4 -8 -1 9 3 -7 -3 22 -11 13 2 6 12 11 -1 12 8 23 -11 -3 31 -6 12
6010 12 4 3 -3 4 15 -6 -12 9 -9 12 8 -4 -4 -1 31 7 -11 34 11 -21 6 37 15 -17 15 18 -10 -11 9 28 -10 -28 -29 -4 -3 3 4
6047 4 17 42 6 5 -2 15 4 5 2 -14 -35 1 8 4 12 13 9 19 -1 -1 26 -3 7 -11 8 -5 28 10 -1 27 3 -2 47 16 9 -9 -1
6084 -1 12 8 2 -16 1 2 -20 1 7 2 6 -23 -11 -27 10 -6 -16 9 -4 3 6 10 17 6 -8 17 7 -17 10 -2 11 -10 -6 -25 2 -7 16
6121 16 39 4 -7 -3 5 -2 0 -11 -18 8 -2 -16 -12 19 -27 -6 13 1 9 -32 26 11 -12 -9 -11 18 30 6 13 -12 4 -1 28 -7 12 13
$$ packed form
5877B4k7L4m8P6L2j06K7j07j3J01j8l0q8J97J07l4j06k3M0K0o0O4j74J48n5nJ1
5904a3R4r6lqM5N4lon6k8k4P6J0m6pK1p4L7L6j19J71j76j4R4QP5n3L2l7J9k2K
5936a1L7k4jJmm0K8J9J9Ol4K9k4J2j2PrOJ0j4Kk3J6lj4L5j5j4JJ5PQl6M2l0PJ2
5973A1j3J0k1J6kK%j7K0j5L4j5j1MpmPJ0oj0MK5l3K4j1MOjj2J3mJ5l4QL4l7J8
6010A2qjoPJ1k1oK1j8K1mj2%LL2k4j8M5k3l2K7L1k2l2L2Lk8jK0J9l8j8jK5JOJ
6047DJ3K5l6jpJ7j1Jlj6k1L6PmQJmJ0k0%K7k9J0j8J9j3L3j8j1K8k4nM9l1pj8Q
6084aJ3moj8J7Jk2K1OnMk9J2j6L7j6j0K5j3PLMPj1j4K5j0k4K7j2J3k1Mj9K7rK3
6121A6K3l5j1MQpKj1pK6j0j4ML1m6K1J9j2Qm1N8j5k3LkK9J2k4Pk5J6nK9l5J9J
$$ plain form
6157 13 21 11 22 -15 -9 7 2 -8 -4 -1 11 14 -9 15 6 -1 -17 17 -9 5 3 -15 1 0 -3 18 21 -4 -13 7 -4 21 -8 12 17 19 7 4
6195 4 5 21 21 4 -5 -4 5 -7 -12 -12 -10 7 25 -5 -6 -9 19 -9 -6 -5 -19 6 8 3 -39 -16 -33 -3 -14 -13 14 6 6 10 -17 -14 3 -6 -2 4 -20 14
6237 14 -8 -11 -6 11 8 -4 27 -2 17 21 0 16 16 -5 2 17 -17 5 1 -2 -1 -1 -5 22 0 -2 -12 -2 -9 -26 18 2 -15 -16 -2 -10 15 4
6275 4 -5 -8 7 26 2 7 4 -11 -1 18 -2 10 19 -10 -6 -10 -7 -15 12 -17 -3 21 -13 -14 2 -5 -21 3 12 -3 23 2 -14 -5 -11 9 -17 -1
6313 -1 12 10 10 -23 0 5 -1 -3 4 1 39 -5 -3 -5 6 -3 -15 0 -11 -2 -2 10 5 30 1 -1 -1 -1 -18 -13 -18 13 -5 16 4 3 -29 -4 15 42
6353 42 4 8 -14 -13 6 -7 6 -24 6 -4 -4 -2 18 -11 -2 5 -2 -7 -22 -13 2 22 0 5 3 -19 0 4 0 -2 11 -11 2 -12 -7 -10 -5 11 -18
6392 -18 -5 -9 2 15 13 4 -5 16 -23 19 -12 21 8 -14 7 -8 -3 -6 -3 0 39 -34 20 19 2 20 12 23 24 -2 2 4 -10 15 4 -1 -6 0
6430 0 -29 -3 -6 -10 4 6 10 10 0 -14 6 6 -8 -14 5 -5 -17 7 -7 -6 10 11 8 7 -12 -1 0 20 5 5 0 -1 1 -18 2 -19 -3 -4 -25
$$ packed form
6157A3Qj0J1l7OJ6nj0MLJ2Lk3K4rpj6L4k6J4kj8J6jlK1Lk5rK0j1K5k9K0NKj2l
6195DJJ6%j7rJRj2n%KJ7J8l0jlK8k8LJj4K5Knm2K3j7L0j1JK7q%Mk7LJ7rMOk4L4
6237A4k2lNJ7lj2L1k9J9Mk1J6%k1PJ5l4K2mlJ%mK7k2kj0J0pj7M4j6j7jJ4qK5j1
6275DrlJ5J9k4Nlj5J0J9k0J2Rk9MmLqK7k9J4K4l4jJ6pj6K4Rj5K6k1j6RoK0k6J6
6313aJ3k%l3K3NokPlL8m4KkJ1rj2J5j1R%J2nK5k9k%%j7NnL1j8K1j2jl2K5J9K7
6353D2l8Mk2JJ9j3J3l0L0j0%KK0k9RPpnj5RJ5K0k2Nkk2J9MmkJ3k2J3j4NlNJ6k9
6392a8J3mJ1J3krrK1l9M2l1L3j3k2K1j5NlLLL9p3N4jj7J8qJ1Jk6MKj4K5j1nnO
6430@k9K6lmJ4KM%j0j4K0%j4oJ9j0j2K4j4JJ6Jljj9J1JK0j5%njKj9K0k1J6jk1
$$ plain form
6469 -25 -41 26 18 5 6 -12 10 4 -16 18 -4 -24 -1 -5 8 -19 -25 -4 13 -1 -10 7 -3 3 5 -17 -23 0 1 5 -22 9 -29 21 -16 2
6505 2 -6 -24 -16 -39 8 9 -2 18 -2 -38 9 18 -17 -14 -1 -27 -19 7 7 -13 8 34 31 -20 14 7 -4 -13 16 5 11 30 -16 7 -21 8
6541 8 9 17 -3 -5 3 28 5 8 -5 -4 -6 -16 27 0 -3 -9 28 0 -6 -5 16 10 -1 -15 -20 -34 12 1 -6 25 -1 1 0 -10 -24 27 16 9 15 10
6581 10 7 4 10 2 10 -8 10 5 -19 4 15 -20 -11 -8 -10 13 -4 11 -7 11 24 -3 -8 5 -20 2 11 1 4 -23 -6 6 -9 29 1 13
6617 13 -4 1 16 -6 26 -12 -9 0 8 14 23 14 -10 1 -6 -11 -4 5 -5 11 11 -2 -8 -8 -15 -22 13 -11 -25 -19 -12 0 -28 5 6 -8 -32 23 2 32
6657 32 -5 13 -8 15 -16 24 11 -5 -3 -6 11 0 -3 4 0 4 14 10 28 -10 -32 -4 -13 4 -8 0 -7 -21 18 0 -12 -13 5 5 -10 4
6693 4 3 -14 16 -11 5 8 5 19 15 -12 16 19 11 2 20 17 -10 -23 18 15 3 -2 -13 -3 10 -4 -5 15 -17 -21 -42 5 -11 -11 5 -6 3 7
6731 7 -20 13 16 -10 7 7 6 7 6 3 -5 16 16 -6 -3 -15 14 7 -3 8 -5 6 -27 -8 1 23 -9 11 6 3 -9 -12 9 -12 10 3 -8 7
$$ packed form
6469b5j6O7qj3Jj8K2ok0L4k2k0K3mJ3k7oK1J7j4rJ7j0OKk2oK3JMk7L1l8N0l7J8
6505Bqj8Qk3M7Jj1K0k0l6M7Rl5LJ3k6QK6%k0K1K6ln1L4pj1rK9j1OJ9m6K3k8K9
6541HJQk0kQK5k3Lj3Jkj0M3k7loL7k8oJK1oj1j4nj4M6j1pL1k6Kjj0j4N1j1pOn
6581A0llOqQj8J8nk4K3J1l5RLkK3j7J5j8J8J3k7nJ3k5K2Rj0Lk7J7J2j5L8k8J2
6617A3j7NJ5k2L2l8LRQORrk4J1pnPRj0J6%j3o%ppL5k4j4OPJ2k8L3Jj4k4N5k1L0
6657C2l7J8k1K3l1M0j3j6KlJ7j1lPmMJ0mJ8l8k2K8rJ7j2Qpj4L9j8j2jJ8%j5J4
6693Djj7L0k7J6LlJ4mk7K8LqrJ8lk7j3M1lj2nj1J0J3j4jK0l2mk1M7j6%J6j1RM
6731Gk7L3Lk6J7%jJjlqK1%k2Lj2K9pj0J1j3J1l3J9RK2l2K0nlj2lK1k1K2pj1J5
$$ plain form
6769 7 -13 6 13 1 26 11 21 17 -13 0 -2 -6 10 1 8 7 5 11 -16 14 10 -7 -1 4 -1 1 8 -2 9 18 -13 7 -5 39 22 6 -1 -6 -8 2
6809 2 -4 -13 -4 -18 4 -5 -12 13 -10 -19 2 -1 -23 -13 5 6 10 -17 13 12 19 21 21 15 -19 -8 -6 -16 10 -13 17 -22 -1 -3 -12 17 -12 -23 25
6848 25 12 -10 6 -4 -23 -21 -9 -14 13 -1 -5 15 8 26 18 14 14 15 -2 6 -18 1 13 10 19 12 12 12 6 2 -2 1 -19 -4 -32 1 11 -6 11
6887 11 9 -12 19 -3 -16 -20 -5 -10 0 -1 3 6 17 7 -14 18 2 1 0 -21 4 -2 -17 11 -2 -10 4 18 -15 1 7 -18 2 -17 -22 17
6923 17 -16 -12 -27 -4 7 -2 -11 6 -6 -12 19 -8 -35 15 -5 8 18 -15 -1 -8 29 26 7 12 -2 2 16 -12 17 5 7 7 4 0 14 -3
6959 -3 3 -19 -4 -24 7 -7 1 35 9 0 6 2 0 16 -7 30 -10 4 -30 -5 -31 1 -17 -4 37 -2 -19 3 -9 11 -1 -17 0 6
6993 6 11 -12 -14 10 17 8 10 -2 -1 7 -7 -1 -19 18 -4 8 6 -13 1 -1 25 -18 -18 8 -6 0 5 -4 18 2 -7 17 0 6 8 -26 5 21 -2
7032 -2 -10 10 1 -11 11 -3 3 20 10 14 -1 -17 16 4 29 -11 -26 -10 -10 24 20 11 1 -20 8 24 4 -24 -16 23 -4 16 -17 -5 -9
$$ packed form
6769Gk0J9Pj2K5j5J0ml0J3kmJ6rPjkOk7L0mj7ONnKPj0J1Rl1K0j2M4j7j6pnkJ0
6809BorRj4K2rpK5k3rK1lk2J0J8JMk7L0jPK%ol4J1Kj0K6k3L0l9K1krK9k9j1M8
6848B5j3k2J6j0j9KJ2nK7j4mK0pJ8qm%Jj7Qk4J9J2lRp%%ommLk0J5k8L3J0j7J7
6887A1kk1L1k2j3mJ5nJ0jMLJ1j0k1L2j6jjk1K5oj5K8j3qJ4J4l3J6Ok5K0j9nL9
6923A7l3Mj5K3J1rrJ7j2oL1k7k7N0k0J3J0l3J4pL7lj9Nj4MJ4k8K9j2K%lmJ4j7
6959cOk2J5k0L1j4QL4k6rOmkJ6k3L7m0J4l4K5k6L2j8J3M1l9j7K2j2K0j2j6J7O
6993FNk3kK4PrKj2JQj4Oj8L7k2J2kj9J4kK6m3%K6j4ONrK2j6rK4j7OKl4L1J6k3
7032bqK0rj2K2j4OJ7j0Mj5j6L3j2K5m0j5J6%L4mrj0k1K8J6k0k8QL9k7K0l3J2m
$$ plain form
7067 -9 3 36 0 3 27 -9 -22 8 14 8 29 4 -1 8 12 13 2 12 0 10 -12 -24 -9 -19 4 -4 -2 -6 -23 9 -1 -20 -8 -5 -18 -12 12
$$ packed form
7067iJ2L3l6LK4l6j3L0OoK1k5nRMJj1J0j2J0k2j2J5j0K3qKmj7L2j0j9J2Lj3OK4
$$ [...]
8191A
##END NTUPLES=NMR FID
##END=
