##TITLE=1H_AM_NV127
 
 8 sc, 
 13.2.2024
##JCAMPDX= 6.0         $$ Bruker NMR JCAMP-DX V2.0
##DATA TYPE= NMR FID
##DATA CLASS= NTUPLES
##ORIGIN= UXNMR, Bruker Analytische Messtechnik GmbH
##OWNER= root
$$ XWIN-NMR		Version 3.5
$$ Tue Feb 13 15:43:56 2024 Russian Standard Time (UT+4h)  she@DPX200
##.OBSERVE FREQUENCY= 200.1308
##.OBSERVE NUCLEUS= ^1H
##.DELAY= (6, 6)
##.ACQUISITION MODE= SIMULTANEOUS
##.ACQUISITION SCHEME= undefined
##.AVERAGES= 8
##.DIGITISER RES= 18
##SPECTROMETER/DATA SYSTEM= spect
##.PULSE SEQUENCE= zg30
##.SOLVENT NAME= CDCl3
##.SHIFT REFERENCE= (INTERNAL, CDCl3, 0, 15.7039)
##AUDIT TRAIL= $$ (NUMBER, WHEN, WHO, WHERE, WHAT)
$$ ##TITLE= Audit trail, XWIN-NMR		Version 3.5
$$ ##JCAMPDX= 5.01
$$ ##ORIGIN= Bruker BioSpin GmbH
$$ ##OWNER= she
$$ F:/spectra/data/she/nmr/H-F/1/audita.txt
$$ ##AUDIT TRAIL=  $$ (NUMBER, WHEN, WHO, WHERE, WHAT)
(   1,<2024-02-13 15:41:59.42 +0400>,<she>,<DPX200>,
      <created by zg, POWCHK disabled, PULCHK disabled
       configuration hash MD5:
       00 E9 B6 7A A2 85 ED C7 34 08 36 98 17 FE 4E 26
       data hash MD5: 16K
       98 DC 55 CA 62 D3 15 75 0E 60 5F 96 3E 67 D9 6B>)
$$ ##END=
$$ 
$$ hash MD5
$$ 80 41 A4 65 D4 7C E6 5C 30 22 F5 38 F7 47 87 66
##$RELAX= 
##$RELAX= 
##$RELAX= 
##$RELAX= 
##$RELAX= 
##$RELAX= 
$$ Bruker specific parameters
$$ --------------------------
##$DU= <F:/spectra>
##$EXPNO= 1
##$NAME= <H-F>
##$PROCNO= 1
##$TYPE= <nmr>
##$USER= <she>
##$AMP= (0..31)
100 100 100 100 100 100 100 100 100 100 100 100 100 100 100 100 100 100 
100 100 100 100 100 100 100 100 100 100 100 100 100 100 
##$AQSEQ= 0
##$AQ_mod= 1
##$AUNM= <au_zg>
##$AUTOPOS= <>
##$BF1= 200.13
##$BF2= 200.13
##$BF3= 200.13
##$BF4= 200.13
##$BF5= 200.13
##$BF6= 200.13
##$BF7= 200.13
##$BF8= 200.13
##$BYTORDA= 1
##$CFDGTYP= 0
##$CFRGTYP= 5
##$CHEMSTR= <none>
##$CNST= (0..31)
1 1 145 1 1 1 1 1 1 1 1 1 1 1 1 1 1 1 1 1 1 1 1 1 1 1 1 1 1 1 1 1 
##$CPDPRG= <>
##$CPDPRG1= <>
##$CPDPRG2= <>
##$CPDPRG3= <>
##$CPDPRG4= <mlev>
##$CPDPRG5= <mlev>
##$CPDPRG6= <mlev>
##$CPDPRG7= <mlev>
##$CPDPRG8= <mlev>
##$CPDPRGB= <>
##$CPDPRGT= <>
##$D= (0..31)
0 1.2 0 0 0 0 0 0 0 0.06 0 0.03 0 0 0 0 0.0002 0 0 0 0 0 0 0 0 0 0 0 0 
0 0 0 
##$DATE= 1707824518
##$DBL= (0..7)
120 120 120 120 120 120 120 120 
##$DBP= (0..7)
150 150 150 150 150 150 150 150 
##$DBP07= 0
##$DBPNAM0= <>
##$DBPNAM1= <>
##$DBPNAM2= <>
##$DBPNAM3= <>
##$DBPNAM4= <>
##$DBPNAM5= <>
##$DBPNAM6= <>
##$DBPNAM7= <>
##$DBPOAL= (0..7)
0.5 0.5 0.5 0.5 0.5 0.5 0.5 0.5 
##$DBPOFFS= (0..7)
0 0 0 0 0 0 0 0 
##$DE= 6
##$DECBNUC= <off>
##$DECIM= 32
##$DECNUC= <off>
##$DECSTAT= 4
##$DIGMOD= 1
##$DIGTYP= 9
##$DL= (0..7)
0 120 120 120 120 120 120 120 
##$DP= (0..7)
150 150 150 150 150 150 150 150 
##$DP07= 0
##$DPNAME0= <>
##$DPNAME1= <>
##$DPNAME2= <>
##$DPNAME3= <>
##$DPNAME4= <>
##$DPNAME5= <>
##$DPNAME6= <>
##$DPNAME7= <>
##$DPOAL= (0..7)
0.5 0.5 0.5 0.5 0.5 0.5 0.5 0.5 
##$DPOFFS= (0..7)
0 0 0 0 0 0 0 0 
##$DQDMODE= 0
##$DR= 18
##$DS= 0
##$DSLIST= <SSSSSSSSSSSSSSS>
##$DSPFIRM= 0
$$ [...]
##$SUBNAM2= <"">
##$SUBNAM3= <"">
##$SUBNAM4= <"">
##$SUBNAM5= <"">
##$SUBNAM6= <"">
##$SUBNAM7= <"">
##$SUBNAM8= <"">
##$SUBNAM9= <"">
##$SW= 18.0517779522481
##$SWIBOX= (0..15)
0 0 2 0 0 0 0 0 0 0 0 0 0 0 0 0 
##$SW_h= 3612.71676300578
##$TD= 16384
##$TD0= 1
##$TE= 0
##$TE2= 300
##$TE3= 300
##$TEG= 300
##$TL= (0..7)
0 120 120 120 120 120 120 120 
##$TP= (0..7)
150 150 150 150 150 150 150 150 
##$TP07= 0
##$TPNAME0= <>
##$TPNAME1= <>
##$TPNAME2= <>
##$TPNAME3= <>
##$TPNAME4= <>
##$TPNAME5= <>
##$TPNAME6= <>
##$TPNAME7= <>
##$TPOAL= (0..7)
0.5 0.5 0.5 0.5 0.5 0.5 0.5 0.5 
##$TPOFFS= (0..7)
0 0 0 0 0 0 0 0 
##$TUNHIN= 0
##$TUNHOUT= 0
##$TUNXOUT= 0
##$USERA1= <user>
##$USERA2= <user>
##$USERA3= <user>
##$USERA4= <user>
##$USERA5= <user>
##$V9= 5
##$VALIST= <valist>
##$VCLIST= <CCCCCCCCCCCCCCC>
##$VD= 0
##$VDLIST= <DDDDDDDDDDDDDDD>
##$VPLIST= <PPPPPPPPPPPPPPP>
##$VTLIST= <TTTTTTTTTTTTTTT>
##$WBST= 1024
##$WBSW= 4
##$XGAIN= (0..3)
0 0 0 0 
##$XL= 0
##$YL= 0
##$YMAX_a= 682722
##$YMIN_a= -732074
##$ZGOPTNS= <>
##$ZL1= 120
##$ZL2= 120
##$ZL3= 120
##$ZL4= 120
##$ABSF1= 10
##$ABSF2= 0
##$ABSG= 5
##$ABSL= 3
##$ALPHA= 0
##$AQORDER= 0
##$ASSFAC= 0
##$ASSFACI= 0
##$ASSFACX= 0
##$ASSWID= 0
##$AUNMP= <proc_1d>
##$AZFE= 0.1
##$AZFW= 0.1
##$BCFW= 1
##$BC_mod= 2
##$BYTORDP= 1
##$COROFFS= 0
##$CY= 11.3945322036743
##$DATMOD= 1
##$DC= 2
##$DFILT= <>
##$DTYPP= 0
##$F1P= 15.7292609196834
##$F2P= 12.9074282941183
##$FCOR= 0.5
##$FTSIZE= 0
##$FT_mod= 4
##$GAMMA= 1
##$GB= 0.15
##$INTBC= 1
##$INTSCL= 1
##$ISEN= 128
##$LB= 0.24
##$LEV0= 0
##$LPBIN= 0
##$MAXI= 10000
##$MC2= 0
##$MEAN= 0
##$ME_mod= 0
##$MI= 1.114404
##$NCOEF= 0
##$NC_proc= 0
##$NLEV= 6
##$NOISF1= 3.799351
##$NOISF2= 2.8
##$NSP= 1
##$NTH_PI= 0
##$NZP= 0
##$OFFSET= 15.70392
##$PC= 1
##$PHC0= -24883.87
##$PHC1= 55.85268
##$PH_mod= 1
##$PKNL= yes
##$PPARMOD= 0
##$PSCAL= 0
##$PSIGN= 0
##$REVERSE= no
##$SF= 200.130013532006
##$SI= 16384
##$SIGF1= 3
##$SIGF2= 2
##$SINO= 400
##$SIOLD= 16384
##$SREGLST= <1H.CDCl3>
##$SSB= 0
##$STSI= 0
##$STSR= 0
##$SW_p= 3612.71676300578
##$SYMM= 0
##$S_DEV= 0
##$TDeff= 0
##$TDoff= 0
##$TI= <>
##$TILT= no
##$TM1= 0
##$TM2= 0
##$TOPLEV= 0
##$USERP1= <user>
##$USERP2= <user>
##$USERP3= <user>
##$USERP4= <user>
##$USERP5= <user>
##$WDW= 1
##$XDIM= 8192
##$YMAX_p= 0
##$YMIN_p= 0
$$ End of Bruker specific parameters
$$ ---------------------------------
##NTUPLES= NMR FID
##VAR_NAME=  TIME,          FID/REAL,        FID/IMAG
##SYMBOL=    X,             R,               I
##VAR_TYPE=  INDEPENDENT,   DEPENDENT,       DEPENDENT
##VAR_FORM=  AFFN,          ASDF,            ASDF
##VAR_DIM=   8192,          8192,            8192
##UNITS=     SECONDS,       ARBITRARY UNITS, ARBITRARY UNITS
##FACTOR=    0.0002768,     1,               1
##FIRST=     0,             0,               0
##LAST=      2.2672688,     0,               0
##MIN=       0,             -732074,         0
##MAX=       2.2672688,     682722,          0
$$ Real data points
##PAGE= N=1
##DATA TABLE= (X++(R..R)), XYDATA
0@%%%%%%%%%Qj6J6k4L2m0M8n6P2q1R7j20J44j76K06k39K81l28L80m37N03n76O53
32C47p47Q49r56J080j215J364j526J702j900K110k341K596k871L177l507L865
48B027m263M697n174N701o282O932p656Q468r391J0444j1664J3095j4801J6881
62I014j9474K2817k7318L3741m3728O1552j03196L85336K55792n82336m17611
73d25411l00574J17050L54541N18335L44637P4144k82436m40972m34261j81455
83f56402J20160L93273M38811K97846m776k75352m28791l55746j29999J68033
93d32943L65148L95590K24964m0476k89594l85314l03281p2354J85032L55524
103B296L44641J71060q2230k85586l53904k50784k8588K07579L34058K97221J21210
$$ plain form
0 0 0 0 0 0 0 0 0 0 0 8 -8 8 -16 16 -24 24 -32 40 -41 56 -64 80 -96 110 -129 152 -176 204 -233 270 -306 347
32 347 -400 449 -507 573 -642 722 -804 898 -1002 1108 -1233 1363 -1508 1669 -1838 2027
48 2027 -2236 2461 -2713 2988 -3294 3638 -4018 4450 -4941 5503 -6161 6934 -7867 9014
62 9014 -10460 12357 -14961 18780 -24948 36604 -66592 318744 574536 -7800 -425411
73 -425411 -725985 -608935 -254394 263941 608578 682722 400286 -40686 -474947 -656402
83 -656402 -536242 -142969 295842 593688 588912 313560 -115231 -470977 -600976 -432943
93 -432943 -67795 327795 552759 512283 222689 -162625 -465906 -538260 -353228 2296
103 2296 346937 517997 435767 150181 -203723 -454507 -483095 -275516 58542 355763 476973
114D76973j06315k83338l22097k02449J4552K15776L07446K52947Q0822j29624
124C04693k74543k81829j52704M3530K13158K78868K10851M2036j43612k54703
134a4255k40733j13060O5152K08180K48203J68920J1179j48632k33970k04726
144b53742p8059Q1738J98472K19447J35795j2931j53323k15307j72179m9692R3276
155b06505J91188J96489J05100l5715j54228j95822j45343k6928J04692J84390
165A7318J71709P6254n1668j51653j78877j20326l431J12982J70916J45449N2339
176B41012o3334j47185j58930r3548J5277J13640J55043J21717L1067p2358j38634
187C767j37221p0255K9093J12152J38946R8831J3254p6746j29139j18704n0592
$$ plain form
114 476973 370658 87320 -234777 -437226 -422674 -206898 100548 353495 434317 304693
124 304693 30150 -251679 -404383 -360853 -147695 131173 342024 384060 240448 -14255
134 -14255 -254988 -368048 -302896 -94716 153487 322407 333586 184954 -49016 -253742
144 -253742 -331801 -250063 -51591 167856 303651 290720 137397 -77910 -250089 -299781 -206505
155 -206505 -15317 181172 286272 250557 96329 -99493 -244836 -271764 -167072 17318
165 17318 189027 265281 213613 61960 -116917 -237243 -240674 -127692 43224 188673 241012
176 241012 177678 30493 -128437 -221985 -206708 -93068 61975 183692 214759 142401 3767
187 3767 -133454 -203709 -174616 -62464 76482 175313 188567 111821 -17318 -136022 -186614
198a86614M0553J09128J23980Q0513o69q1379j21615j01375l2853M8734J05461
209a6136J12023O4831j3989q4871j12551q5634j9199N5175J02764J00248M8751
220A51412k5270q4918j02538p1315o767O0212R7188Q6488L4419l2775q2708r2010
232f8582n7281M034O2294Q9581P3221K1925l8568p8701q0644m4571J2318O2786
244d2188Q1857O0768J1186m2090p4309p1120l3693K0079O2975P4053M9618K570
256I9706m5028p0937o2256k3150K6458O1805O6840M0429n094m7964o7007n3038
268g9236j3771L1008N9907N9913L1314j2112m8995o1438m4085o017L3984N6918
280G390N2353K2801j7338m8319n5313l5527N87L5433N2791M4849J5372k1154m6521
$$ plain form
198 -186614 -146061 -36933 87047 167560 166891 85512 -36103 -137478 -170331 -121597 -16136
209 -16136 95887 160718 146729 61858 -50693 -136327 -155526 -100351 2413 102661 151412
220 151412 126142 41224 -61314 -132629 -139396 -79184 18004 104492 138911 106136 23428 -68582
232 -68582 -125863 -121829 -59535 30046 103267 125192 86624 7923 -72721 -117292 -104974 -42188
244 -42188 39669 100437 111623 69533 -4776 -75896 -109589 -89510 -26535 47518 97136 99706
256 99706 54678 -16259 -78515 -101665 -75207 -13402 53438 93867 88773 40809 -26198 -79236
268 -79236 -93007 -61999 -2092 57821 89135 77023 28028 -33410 -77495 -83512 -49528 7390
280 7390 59743 82544 65206 16887 -38426 -73953 -73366 -37933 14858 59707 75079 53925 7404
293G404m8834k7958N508L5913M8878L7984Q770k3987m4111m2938k1619R796L6273
306a8921M4811L1402L204k5670m1722l7838j5946J3660L6119M0542K5457j380
318E3718k6954l9272l2719j0413J6603L4961L6120K0050n180k7492l6337k7618
330d4533n648J8655L3246L1596J5077q261k7335l3024k2655j523J9774L0911K7308
343C3588J0869j0655k6789k9634j8033J851K0240K8632K3422P010j2735k5813
355A953k6075j3949M410K0392K6453J9768L453j4177k4432k2816j0483O661K0386
368h456K4099J6152M92j4967k2842j9779p387Q420J9945K1649J2910j917j5382
381A2937k1151j6898m654R771J9192J9153R930l780j5319j9381j4287k308J0731
$$ plain form
293 7404 -41430 -69388 -63880 -27967 20911 58895 67665 43678 -433 -43371 -64990 -55194 -18921
306 -18921 25890 57292 60496 34826 -6896 -44734 -60680 -47020 -10901 29641 55098 53718
318 53718 26764 -12508 -45227 -55640 -39037 -4076 32044 52094 46914 19422 -16915 -44533
330 -44533 -50181 -31526 1720 33316 48393 40132 12797 -20227 -42882 -44405 -24631 6280 33588
343 33588 44457 33802 7013 -22621 -40654 -38803 -18563 10069 33491 40501 27766 1953
355 1953 -24122 -38071 -33661 -13269 13184 32952 36405 22228 -2204 -25020 -35503 -28842 -8456
368 -8456 15643 31795 32287 17320 -5522 -25301 -32688 -24268 -4323 17326 30236 28319 12937
381 12937 -8214 -25112 -29766 -19995 -803 18350 28280 24500 9181 -10200 -24487 -26795 -16064
394a6064J8156J6689P400n172j5083j7711j1788j38J1251J6814J4383N291o315
407A7713j4721j5881r356J515J1341J5555J2337L314p255j4105j4022p201K880
420a7886J1314J4192J0363J580p872j3367j2260n330L985J1155J2926Q608L6q416
434I028j2487j0548l693M787J0910J1738O892j326q583j1534r037k345N503J0615
448h0J0412N217k331q512j0586p643j043O030R971R055L879l096q349r608o254
463a2938P8O256R255P749K626l656q004q528n025J009O383Q455O509J580m055
478G694p689p620l776J844O322P673N457O75m471p374o583k658K414O184P029
493E121M516k21m839o848n609j762K873O063O306L508r46m848o307m765r70L241
$$ plain form
394 -16064 2092 18781 26181 21009 5926 -11785 -23573 -23711 -12460 4354 18737 24028 17713
407 17713 2992 -12889 -22245 -20730 -9389 6166 18503 21817 14562 457 -13565 -20766 -17886
420 -17886 -6572 7620 17983 19563 11691 -1676 -13936 -19266 -15281 -4126 8800 17408 17444 9028
434 9028 -3459 -14007 -17700 -12913 -2003 9735 16627 15301 6718 -4816 -13853 -16198 -10695 -80
448 -80 10332 15549 13218 4706 -5880 -13523 -14566 -8536 1435 10490 14369 11273 2924 -6684 -12938
463 -12938 -12860 -6604 2651 10400 13026 9370 1366 -7162 -12187 -11178 -4795 3660 10169 11749 7694
478 7694 5 -7615 -11391 -9547 -3225 4448 9905 10580 6109 -1265 -7848 -10506 -8092 -1908 5121
493 5121 9637 9416 4577 -2271 -7880 -9642 -6769 -706 5600 9108 8162 3314 -2993 -7758 -8728 -5487
509e487N781N505K661j493m788n711l859k96L369N387M798J857j910m638n050
524c874l126K18L535N072M018J093k164m391m549k485Q03L641M540L356N74k391
540C870m254m039j778J244L557M159K757Q8k612m033l406j227J491L474L741K175
556E207l12k637l702k959p29J701L291L296J688o06k638l396k398k98J761L032
572C01K895J285q98k605k996j916l3J808K859K492Q19j080k444k630j561K23J899
589a582K630K071M73j189k313k370j184M79J897K375J705K48j317k222k006q58
605c163O24J871K157J366j1j355k021j746o24Q03J795J897J051j71j322j906j496
622b251l38Q93J645J638Q70l18j380j704j177j55R08J543J432O45m70j313j500
$$ plain form
509 -5487 294 5799 8460 6967 2179 -3532 -7391 -7687 -4318 1069 5867 7724 5814 1176 -3874
524 -3874 -7000 -6782 -3247 1825 5843 6936 4772 381 -4168 -6653 -5850 -2209 2331 5687 6261 3870
540 3870 -384 -4423 -6201 -4957 -1400 2759 5516 5604 2992 -1041 -4447 -5674 -4183 -709 3032 5207
556 5207 4895 2258 -1444 -4403 -5132 -3431 -140 3156 4844 4238 1600 -1796 -4194 -4492 -2731 301
572 301 3196 4481 3583 978 -2018 -3934 -3967 -2159 700 3192 4011 2931 487 -2143 -3704 -3481 -1582
589 -1582 1048 3119 3592 2403 90 -2280 -3464 -2985 -1088 1287 2992 3240 1923 -299 -2305 -3163
605 -3163 -2539 -668 1489 2855 2844 1489 -532 -2278 -2902 -2099 -304 1593 2644 2473 1151 -755 -2251
622 -2251 -2589 -1696 -51 1587 2457 2139 759 -945 -2122 -2277 -1369 174 1606 2251 1781 468 -1032
639a032r84LR62J428J233M11n43j231j364p46J34R41J310J039K72o31j191j154
657a143n76K31R49J219Q67Q3p03j091r83m68L19R65J101O69k8o62j026q88l15
676a480M38Q90R31N30r9o77r40p02j74M53Q22Q28L78j76o59p81n98p9M42P62O69
697G78K72j97o28p17m58K1M80O43N87J87k80o35o18l60J10M92O30M97Q9l71o08
718h6n30k62J61N25N89M04j1l72n82n11j57K46N09N50L07n9m27n42m14q8K57M94
740AM89K14j08l95m85l47m1K79M83M23J36j38l90m56k86J4L03M67L47J14j87l92
762D5m14k40Q1L23M15K97O5k16m08l58j76J01L75L84K48J6k69l76l20j20J58L07
784h2L61K30m1k44l51k80m5J27K86K86J73m0k30k87k24m6J30K58K70J25n9k10
$$ plain form
639 -1032 -2016 -2013 -1051 377 1610 2021 1478 247 -1117 -1863 -1729 -788 522 1561 1833 1202 11 -1143
657 -1143 -1719 -1488 -539 680 1547 1630 927 -164 -1147 -1615 -1296 -331 770 1439 1411 749 -277 -1165 -1480
676 -1480 -1042 -152 779 1309 1210 533 -407 -1109 -1283 -830 -8 820 1198 1022 363 -418 -1016 -1095 -653 109 778
697 778 1050 853 225 -492 -950 -929 -449 194 781 968 688 53 -565 -925 -815 -323 307 804 893 522 -86
718 -86 -616 -878 -717 -192 397 801 790 418 -164 -675 -832 -586 -77 473 780 721 294 -248 -662 -750 -493 1
740 1 490 704 596 201 -284 -631 -672 -393 90 513 649 511 121 -335 -621 -607 -304 163 510 624 437 45
762 45 -369 -609 -528 -205 210 507 572 356 -52 -410 -586 -485 -110 274 522 538 269 -107 -427 -547 -389 -82
784 -82 279 509 468 224 -127 -407 -452 -325 -39 247 420 380 150 -137 -361 -407 -277 -19 251 376 317 107
806A07k57j82k1J44K56K22P6p9k06k53j36J6J70K51J73M3j20k39j81j22O4K10
828f4K00J64j7j25k08j78m5N5J86J89R9k5j26j99j30j7P1J61J34Q3l1j33j37j01
852a94j0J01J38J21M9o8j05j33q7J3J06J43Q8J8q4j28j22m3N7J01J39P3oq0j29
877d2j15l8M8J47J22P1l1q9j46r7j9O6J36J07O3k3j23j07r5k5P9J13J06O5k7q6
903F0j15r4j5P1J17J06M9k9j11j21p7J4O3J20Q5O4n1j38j19n4OR2J26P8M8p4j23
930b2r5n8N3Q9J09O4J9o8j14j05l8L7Q9J20N1pn5j06m8n1M1Q0J15L2l1o7q9m9
958a04k4N4R4O4L6n1n3q2n1J6N1J00N0j1l1r0p1k7N2O9P6M7lq9o8n6j9O9O9P0
988H7K2oo0j14n2J3M5J02O4L3n5p7o0p8J3O4J08P1K2o3q2j09l4%J02J00P2J7o3
$$ plain form
806 107 -150 -332 -353 -209 47 269 345 266 60 -193 -329 -313 -143 108 281 324 204 -35 -216 -338 -274 -64
828 -64 136 300 283 158 -50 -228 -273 -218 -32 157 256 231 105 -94 -224 -241 -170 -9 125 208 177 44 -93 -194
852 -194 -204 -103 35 156 205 137 32 -101 -188 -175 -69 74 162 180 96 -32 -154 -197 -140 -39 100 173 167 87 -42
877 -42 -157 -195 -147 0 122 193 162 73 -73 -170 -189 -123 13 120 183 160 37 -70 -165 -190 -111 2 108 173 146 60
903 60 -55 -149 -164 -93 24 130 179 150 39 -82 -159 -145 -82 38 123 187 136 -2 -121 -175 -169 -77 49 127 175 101 -22
930 -22 -117 -175 -122 -33 76 140 159 91 -23 -128 -166 -129 -40 80 131 124 69 -37 -85 -136 -95 -15 100 132 101 34 -55 -104
958 -104 -128 -74 20 84 120 69 16 -66 -117 -101 -50 50 100 89 58 -32 -103 -130 -78 -9 67 114 111 22 -46 -102 -121 -52 17 87
988 87 109 103 43 -71 -123 -110 -65 37 101 134 79 2 -58 -136 -123 -59 49 120 142 79 -3 -112 -146 -146 -44 56 128 145 82
1017H2j13r3m3O4Q4R0Q1qo8j04r1l1M0Q9J14O7l0o2j21r1kK0J10J04Q2k3r6j09
1045e8r4k9O0J19J00M8qj09j06o8k3O3J05R4P4l5j04j15n8k5O8J39Q9N4m3r9j20
1072h1r1MP6J42Q8J9k3j01j13p0j9Q1J23J02M4n9r3j49m3j9Q9J41Q8L7l7j13j22
1099i9o9MQ3J04J04M1m5j00j13p5J7N1J21J19K0m6q4j23o2PP2J12J03J8l9j03
1125A8j22o8K2P4J21R4K5m6j20j04m9jR6J16Q2J7n7r6j09p5M8J04R5P9J6p9q2
1152aj02n2K1R5R7R2Op0j13r6k2K5J07J12N2J1r2j10r1k9M4R8J13P7l3q3j10r6
1180a50k3N4J09J11N0np7j22j06j1O3J27R8O6j9j12j01j04l2Q6J03J20N8nj37
1205D1j04q6k9P9J03J16O3m1j02j26r3lQ6J00J18N8m8q0j50o9j1Q0J13R3N0n1
$$ plain form
1017 82 -31 -124 -167 -103 -19 71 152 144 76 -28 -119 -150 -110 -21 93 160 130 68 -53 -144 -146 -126 -16 88 170 147 51 -58
1045 -58 -152 -181 -121 -2 98 146 138 29 -77 -145 -168 -105 0 94 168 133 29 -86 -144 -169 -101 38 127 181 138 39 -81
1072 -81 -172 -168 -92 50 138 157 134 33 -80 -150 -169 -88 35 137 181 122 29 -120 -163 -182 -93 48 136 173 136 23 -99
1099 -99 -168 -164 -81 23 127 168 123 23 -90 -165 -148 -97 24 143 163 117 33 -90 -152 -145 -73 39 142 160 121 18
1125 18 -104 -172 -150 -76 45 139 164 118 -2 -106 -155 -156 -60 56 138 155 98 2 -107 -182 -134 -30 65 144 160 81 -1
1152 -1 -103 -155 -134 -39 58 150 156 86 -27 -123 -145 -120 -13 99 151 162 70 -40 -131 -160 -116 -18 95 172 139 56 -54 -150
1180 -150 -173 -119 -10 101 151 146 69 -53 -159 -170 -107 20 118 184 165 53 -48 -152 -184 -98 5 125 183 178 41
1205 41 -63 -149 -178 -99 4 120 183 142 40 -86 -179 -182 -96 4 122 180 132 52 -98 -167 -178 -98 15 108 158 107
1231A07r1j07o9k7R1J37R4L8m2j18r8o2mQ2J16J01K1m7j07j06o3PQ6J13Q4Qm6
1258I8j13j08k1K3P8J09Q6Ro1j11j08l7M8P1J09N4J1p6r3r6j5L6J00Q0O5Lq3q2
1286b4r0j5N2P0R5O1j6q3q9p1k8P7N7R5L8k9p1q0p1kN0O5J01L3k7q5o4o1ON3Q5
1317C2O7K4m4q4q8k8K1N9P8N9J3l9p9o7l2KO7R2N1J4n8n3r8j3jQ0P5N4Mn4p1p5
1349i2l8L0N9R1M7J5n3r0n5l1J2P8P8O3J4m4r9p3l7K9P7Q8L5On9p1q2l7M3P3R2
1380F9N0lm6r2q6j2J6R3Q3O0k3n4r8q1j2K6R4Q3O9j5q8o8r4k1N5Q4J18L1j2o5
1410F1r1p8k3N0Q8P9N5l0o1j03o6lL5Q6P3M9k3n4j01o2K6J0J03P3M2l5o2r3o5
1439a20MM5Q5R5Lj9p7r5m2%P5Q6N4J5l3n8r0l1J3O9O4M7J3l8q6n7l7K8O6O1N2
$$ plain form
1231 107 16 -91 -160 -187 -96 41 135 173 131 13 -85 -147 -151 -69 47 148 169 122 15 -91 -154 -147 -61 52 136 144 98
1258 98 -15 -123 -144 -121 -43 66 152 161 100 -11 -119 -156 -108 -37 72 126 137 61 -32 -128 -143 -107 -7 73 138 141 58 -24
1286 -24 -114 -129 -77 -7 88 149 133 50 -39 -110 -138 -61 -4 91 129 100 29 -51 -122 -124 -74 -9 92 125 98 13 -51 -112 -106 -53 32
1317 32 99 123 79 -5 -93 -121 -100 -41 37 96 109 70 -9 -76 -108 -106 -39 53 104 118 60 7 -91 -104 -105 -25 50 104 108 54 -17 -92
1349 -92 -130 -100 -41 50 97 112 59 -31 -86 -117 -105 -27 51 114 128 84 -15 -88 -125 -96 -19 69 104 110 51 -20 -102 -139 -96 -23 69
1380 69 119 116 70 -22 -108 -120 -104 -11 72 132 109 55 -43 -124 -136 -110 -16 67 136 121 33 -35 -129 -150 -95 -11 107 138 126 61
1410 61 -30 -108 -131 -81 7 86 141 111 50 -53 -119 -122 -87 -1 72 121 98 44 -57 -119 -93 -83 20 93 135 100 38 -55 -120
1439 -120 -116 -71 14 109 112 93 16 -79 -121 -121 -46 40 94 109 76 18 -72 -103 -90 -21 43 90 103 65 -21 -78 -115 -87 -21 40 92
1470I2lm1p3n8qJ5N4P6L8j1k5p4o4j3K1P0O9K2km3q5k5j3J7N1P5M5j4m7n8n7k2
1502i1L8N4O0M0k7l9p3k8k1M1N8N5K2j0n4p1j7l2N9N3M0OMn7l1m5j2L1N1N0L8
1533I2k5n0l7m2j7L4M6O5J1k6l1m5m5j6K7N2M3L1k2l3l8k4k4M3L7K3M0j5m4m1
1563c1k7j9K0O1M6J6k2l4m6k3LK2O6K3J3j9k4o2j7J2L6J9O3nk2n2n7k1J0P0K0
1594A9L8Jk4l9o3NRN8M2kOl5l9l2j6K7L8N8L4m2m6l7l1MK3M8N3J7l0k4m8k9J1
1627d6L0N1J4Ppm7l7l2OL3M9K9Jno2m6PlN3M2K5j1j9n6l1oL0K1N0K7J1o2l9k9
1661e2j3L4J3L8M6l4%o5l0J1J9L0N1J6j4m4l2k9JJ2K9N4jJ8m9l9l5LM1L1K6Rr
1694C6l1k3l7J0K6M2K4Jpk6l5pj0K0J0M5K0m1ll5j4j1L5JK1L2k1j7j8j4JL1mL1
$$ plain form
1470 92 89 48 -25 -83 -91 -76 -22 54 92 81 56 -18 -82 -95 -74 -4 65 87 85 42 -43 -68 -81 -64 -13 62 107 93 46 -12 -69 -91
1502 -91 -53 1 61 101 74 35 -38 -66 -87 -46 12 67 89 79 25 -46 -63 -95 -36 17 57 63 67 10 -21 -66 -78 -47 4 54 92
1533 92 67 17 -20 -62 -79 -45 1 66 77 51 20 -25 -70 -86 -59 -7 36 67 45 12 -26 -50 -74 -31 6 29 69 54 10 -31
1563 -31 -58 -77 -57 4 50 66 44 10 -36 -59 -56 -34 32 55 68 49 25 -37 -54 -42 -6 13 76 71 49 -3 -60 -81 -71 -1 19
1594 19 57 58 34 -5 -68 -63 -54 4 46 44 50 15 -24 -56 -72 -45 -7 51 85 43 -3 -40 -71 -67 -44 4 57 74 44 20 -28 -57 -46
1627 -46 -16 35 49 56 49 2 -35 -67 -61 -28 21 50 51 46 -16 -62 -55 -58 -5 37 62 51 32 -24 -55 -61 -31 -10 40 67 78 16 -23 -52
1661 -52 -65 -31 -18 20 66 32 32 -33 -63 -52 -33 -3 48 64 50 6 -26 -55 -54 -42 -13 41 40 58 9 -30 -65 -62 -21 10 36 45 36
1694 36 5 -18 -55 -45 -19 23 47 48 41 15 -20 -27 -37 -17 -7 38 58 17 14 -21 -35 -46 -11 -10 11 43 22 5 -13 -27 -26 5 1 32
1728C2nj8kk7k2MJL8K5jmlk2l2MPL1K5J3l0Kl2j8KJL7J1K8j4nl4l1NJ9qL0L4r
1766C2j7k9j1k2J4K2K5J5Nj6k8m0J0J7J4K4K6Jk3l3j3pJ9K3L3Nnk3k5j1mKJ4L9
1800C3J1j3k8j9pj2qO0KRj1pk1j8NMK6L0mj6ol7qj2M1J1L2mkl1k0oj5K2L2J9P
1837C9qk7k1j4K1J0K6%Ol4jj8j5KK0NK9mJ1l7j4k4K8J7J0J7Ol1ooj7K3MJ5oJ1
1873A7ppk9RMJ4j4J7QpKj4MJJ9qrmQj5nMJoLK2J2k2onLJ2pj5K9Oj2j5J2JjJ2k
1916A0Oj7J1l0J0%PMRjKMj2qjoJL1j4J5k2j5J1LqJ1K2k5Ljk0J6Nj8L7k1MqK0k4
1956iLqJ2K9k0MMkrj2oNJ4Qk3J7j8J3j3J3noJ4K0m8L0k1j7K7J8kjj1j1nPmL6j0
1995A3LqnPl2RjJ9K1J1j6j4j9k6OJ9K1J4J4j2K4J4r6K9kK3J5qj5l7j2RRJ7L1q
$$ plain form
1728 32 27 9 7 -20 -42 -38 -37 1 26 25 21 18 -4 -36 -32 -25 6 31 44 14 16 -16 -34 -32 -31 6 17 45 31 26 -8 -39 -34 -15 -23 7 41 32
1766 32 15 -14 -25 -47 -33 -11 14 29 34 18 -10 -50 -40 -23 -9 15 41 42 19 -14 -27 -34 -15 8 41 46 41 18 -7 -18 -22 -20 -6 33
1800 33 44 31 3 -16 -23 -35 -43 17 19 28 17 10 -11 -29 -24 -20 6 36 32 16 10 -27 -35 -47 -6 5 37 33 31 0 -20 -26 -41 -19 13 32 39
1837 39 31 4 -17 -31 -10 0 26 26 32 -2 -3 -21 -36 -34 -14 -9 20 16 27 -10 -24 -48 -20 -3 7 24 30 -1 -7 -13 -30 -7 -3 12 6 17
1873 17 10 3 -26 -17 -13 1 -13 4 12 5 7 -7 -3 -2 17 9 0 -4 4 -11 -16 -12 -11 -17 -14 8 20 -2 -8 -13 -10 2 -5 -20 9 15 3 -12 0 1 0 12 10
1916 10 16 -1 10 -20 -10 -10 -3 1 10 9 11 15 3 -5 -6 -12 -11 20 6 21 -1 -16 -5 -2 -10 1 23 -2 1 0 -20 -4 1 -17 20 -1 3 -5 15 -9
1956 -9 -6 -14 -2 27 7 11 15 13 4 -8 -14 -9 5 13 -10 7 -11 2 -11 2 -3 -9 5 25 -23 7 -14 -31 -4 14 12 11 0 -11 -16 -9 -13 23 13
1995 13 16 8 3 10 -22 -13 -14 5 26 37 21 7 -12 -38 -32 -13 8 22 36 24 48 62 -34 -5 -7 16 31 23 8 -29 -41 -32 -23 -6 25 17
2031A7K4l6Lk1j4J6K0K4Kmm2Nk3J9rK8J5Npl3jj1RNJ3L1j5Kk8j7j9J6K0PJ7Lj1
2068A0j2l2lK5K3oJ9Nk7pm1K0j2M0K1lOj7k6noJ4K8QJ2rm7Njj2K4K0kJ%j8qqN
2107a6KJ6J6pJ4k8l1J3j2K7QJ3Jqj4rkj0PlL4K8k7pnk8KNK3K2j3RKk4Kk4j3K0
2145a7J0K2nkk0j0k2J1J8K2L6qrl7j3JJ8RP%J2j4j2k3J7j1K0j6K5K6j9k0j0j3
2179b7J2kL4J3j7J4k6j5ooJ7J9K0Kk0j7l4LJ0K5J9JnNk7k2OlJ2M0kNk0k5k2MJ2
2216b3K2K6POl2k9j2K4j0%M6koj5j9rk2J8K2J6K3jk9l2j1NJ5L0PJ0kk1%j7nJJ6
2253cL6Oj3ml4j8qK7J8nK0Jl5rj2jK8K2J2j0qRj8k5pJ1K7J5pr%m3QNJ5K4JJ2l3
2292eJ5l0kOJ9J4K0j3k3J7k1j8OOJ3pK4j4poj0LJK2N%opj8oJ3Q%J4Mrj3klpJ1
$$ plain form
2031 17 41 5 8 -13 -27 -11 9 33 35 31 -11 -6 -29 -10 -19 9 24 29 22 -11 -12 -23 -14 -9 4 35 20 22 -6 -23 -42 -26 -6 1 18 21 10
2068 10 -2 -34 -37 -12 11 5 24 29 2 -5 -46 -26 -38 2 23 20 26 9 -17 -22 -28 -14 14 22 34 25 -22 -17 -18 -30 -6 14 12 13 13 -5 -13 -21 -16
2107 -16 -14 2 18 11 25 -3 -34 -21 -33 -6 2 15 16 8 -6 -15 -17 -27 -20 -23 11 39 12 5 0 -28 -26 -21 2 24 11 20 22 -2 0 -24 -37 -17
2145 -17 -7 15 10 8 -12 -22 -44 -33 -15 7 43 35 26 -11 -24 -23 -5 4 11 11 23 9 -3 -26 -9 -20 0 -16 9 35 16 -4 -14 -27
2179 -27 -15 -17 17 30 13 27 1 -14 -20 -26 -9 10 30 32 12 -5 -39 -36 -26 -1 18 19 14 19 -8 -30 -24 -27 -15 25 23 28 8 -17 -39 -35 -23
2216 -23 -1 25 32 38 6 -23 -35 -11 -21 -21 25 23 17 2 -17 -26 -48 -30 -8 8 31 30 1 -31 -42 -37 -22 8 15 25 23 2 2 -15 -20 -19 -3
2253 -3 33 39 26 22 -12 -30 -38 -11 7 2 22 23 -12 -21 -33 -34 -6 16 28 18 10 19 1 -24 -31 -20 7 22 15 6 6 -37 -29 -24 -9 15 16 28 -5
2292 -5 10 -20 -22 -16 3 17 37 24 1 18 -3 -21 -15 -9 4 -3 21 7 0 -6 -16 -13 -12 10 15 15 9 2 -16 -22 -9 -1 -1 13 17 8 -5 -7 -10 -17 -6
2333fJ8KlnQj2j8rK3J6kJk0J7j8J7l9L6JQJJol2Rjj1K1J8%j5j1j8jJ1K7Nookl
2374dj1Jj5L5J0LJ9l4lk3lJ7K0j4K7Pm4mj0K7rJ8J1Mk3j0j4lKJ2J7PJ2j6k1%j1
2411b3NMK5J4pj0j5j3rK0KL0J3kl1j5mk0J7J9K3j2J7k0j4jj9J6K0J2kk1pJk5k
2447c4K3jJ1J6Lk3rk4QJ3RK5pj4J2j8j0OJK4K6k2Kkm0Rj5M0jrMOk4prJ7mK1LJ2
2487A8j3j8lk0JK6K3oJ4qj6k4Mj7J4K9PJ3rqk4%jK7k0L1mrqj3lqRRK6kj7jj1j4
2527b6QPmK6%Pj4rqk2M3k4K7%qJ6k1j8MJ9J9j3J1jj9j3nJ2Lj3M0nKj9j3q%K0J0
2566A1J9j4%j7j3mj6K3K2jNj5j9J4oJ3k4L6K0k0J5l1qpK0OJ4Rpj8k4j1L0%l%L
2603BMMqj3j1K4OK4k3mjk8mJ2J0K4nJ9l3k4%K2MKopJ2NpOj7JJ9J3j%j8Pj6%j9
$$ plain form
2333 -6 12 14 11 6 14 2 -16 -25 -2 14 12 13 -7 10 -8 9 -30 6 7 15 16 17 11 -21 -12 -13 -24 -3 15 15 0 -11 -29 -30 -19 8 13 7 1 -1 -4
2374 -4 -15 -14 -29 6 16 19 38 4 1 -22 -25 -8 12 -2 25 32 -12 -16 -26 1 -8 10 21 25 2 -8 -22 -25 -23 -11 6 13 25 9 -12 -12 -23
2411 -23 -18 -14 11 25 18 8 -7 -20 -29 -9 -7 23 36 34 3 -12 -16 -36 -19 0 23 11 28 8 -6 -7 -26 -10 10 22 20 -1 -8 -7 -32 -34
2447 -34 -11 -12 -1 15 18 -5 -14 -38 -30 -17 -8 17 10 -4 8 -10 -20 -14 -13 11 37 15 17 15 -25 -16 -31 9 8 -1 3 9 -15 -22 -31 -14 -18 3 6 18
2487 18 5 -13 -16 -36 -35 -9 14 8 22 14 -2 -26 -22 -39 -25 4 11 24 15 7 -17 -17 -18 9 -11 20 16 7 -1 -14 -17 -25 -16 -7 19 17 0 -1 -12 -26
2527 -26 -18 -11 -15 11 11 18 4 -5 -13 -35 8 -16 11 11 3 19 -2 -20 -16 3 22 9 20 19 0 -13 -18 -6 -3 -16 24 19 21 2 -11 -19 -19 1 11
2566 11 30 16 16 -1 -14 -18 -34 -11 11 10 15 0 -19 -5 -11 2 -22 14 34 14 29 -2 -10 -17 3 9 23 32 25 7 -17 -28 2 2 -1 -1 2
2603 2 6 10 2 -11 -22 2 8 32 9 5 4 -24 -28 -16 -6 18 13 32 -1 -25 -25 -3 1 3 -3 -10 2 7 0 6 -11 -10 9 22 21 21 3 10 -6 -6 -25
2644b5K4J6nNj4%k4J1nMK5Qk1K8l7QmJ6j0lJ2oj7J3Rnj0oj0L0lRj2j1JJ5pqJ8
2683InJ0%j0JoNJ3k1J2lJ5rnk2PMpJ3J2rJ0pljML%j8oK1pj6jJ7P%pJ3qj0J0j0
2726enJ5Nj6POMj3pLJ9J1l0Nj0J2j3ojJ2J8Jk7Rj6J0ORLjJ0j4k0PNK0Ko%Qj4j8
2768a5J4KJoMoj0K4k2nK5jlJ1J7k0qok4L4lK2lk4Qk3nJ1RMJ3J2k5j9j8NQqK9K1
2808B0rj2Qj8jJ1j3J6LJ8k7j1oMRRK3Jj0mk2Oj4RJ1J5qOj0lk5j0K5NJ2MLk8Lj0
2848b0J8NJ5j6OJ2k4j6nRMRRjk0poLJ2j1QJ9K5l9krJ5j3J9mmL4j5j3mqlJ7j0J5
2888DRj1jmj3jJ0J0J9j3pK0l3jnJ7pK2o%Kk2mmKL4opj4JJj1Qj7K2kK2kk1LoqJ2
2931hL2lojj6j2NpRNK2J2l4J1j4qnOK0Mlj0nj2l%J1kK2mRj9j6oNOJ3J8j0Kok0
$$ plain form
2644 -25 -1 15 10 15 1 1 -23 -12 -17 -13 12 20 -1 27 -10 -2 -6 10 0 -3 9 3 -14 -1 8 3 -7 -13 -23 7 4 13 1 -10 -9 6 -1 -9 9
2683 9 4 14 14 4 5 -1 4 17 -4 8 5 20 11 6 -16 -9 -5 -12 1 13 4 14 7 4 3 7 10 10 -8 -14 7 0 -16 -17 0 7 7 0 13 5 -5 5 -5
2726 -5 -10 5 10 -6 1 7 11 -2 -9 -6 13 24 -6 -1 -11 1 -12 -18 -19 -7 11 12 -15 -6 -22 -12 -6 3 6 5 15 1 -19 -12 -7 13 15 9 9 17 3 -15
2768 -15 -1 1 2 -4 0 -6 -16 8 -14 -19 6 5 2 13 30 10 2 -4 -28 6 3 25 22 -2 6 -17 -22 -11 -2 2 15 27 2 -17 -35 -30 -22 -30 -1 20
2808 20 11 -1 7 -11 -12 -1 -14 2 5 23 -4 -15 -21 -17 -8 1 24 25 15 11 -11 -5 -19 -10 1 16 8 14 4 1 -24 -34 -9 -4 8 12 15 -13 -10 -20
2848 -20 -2 3 18 2 8 20 -4 -20 -25 -16 -12 -3 6 5 -15 -22 -28 -25 -13 -24 -16 3 28 -11 -13 -22 -7 -20 -1 -5 -9 25 10 -3 -7 -15 -18 -1 -11 4
2888 4 13 2 1 -3 -16 -17 -7 3 22 9 2 22 -11 -12 -17 0 -7 15 9 9 11 -11 -15 -19 -17 17 11 4 -10 -9 -8 -19 -11 -28 -6 -8 14 12 -9 -6 -12 -20 -8
2931 -8 24 21 15 14 -2 -14 -9 -16 -7 -2 20 32 -2 9 -5 -13 -18 -12 8 12 9 -1 -6 -18 -21 -21 -10 -12 10 6 15 -4 -20 -26 -21 -15 -2 16 6 8 2 -18
2973a8LKNJ4J5j8mjk6OJ2KJ8j1J8kj8j0qj0K6J6Qj4moNj1Jj%K8ok2Pj9qJ1K4o
3013bJ7j2j0j1J0JoK4%JKj8kOkj1MK6mk6NkrNqK8KmkjKj4NJ9MJj1k7J9mqJ7Lj0
3057cK0j6%nk1qJ3J4K3j5qPJ4j2olqK3oK%k1NJ4mK0nKj4NkJj7MMOm%oJ5k0PlK3
3101A5j0ljoK4k9j4J9J6k0K5pqOrj2J9%J2lj4lrlqJ9J5Ljlkj1j7jJ2pJ5K0J0k4
3141EjqQk3L7Kj4Ooj5k0J1oJ8QJ2npmj7rJ9kJ9KRk3oj6J0K3kmJ1Kj6j7J8pmJ1
3182aJ5Kpj1mqnJ9QJ5prqLk1KJ7MJ7j5J2k9Mj1j0L1mJ0Pk3kpjJ5KJ2kpJ3k6On
3224iMKRJ6mk1Oj6lJ6RJLKJ2k5qnJ6R%rNrj3nLJ4j0K1J2mj2j1Kj6J8J7jj0L0k7
3266Iqj8J8kMJ4Kj0Knj9nJ7KjJ3pj5J1Pj1oORJ8k1Lkj8pNK3nJJ1j1j8J5n%J3m
$$ plain form
2973 -18 -15 -13 -8 6 21 3 -1 -2 -28 -22 -10 -8 10 -1 17 15 -3 -13 -21 -31 -5 11 19 5 1 -5 0 -11 -10 -11 -11 17 11 -11 -4 -23 -31 -20 4 -2
3013 -2 15 3 -7 -18 -8 -7 -13 11 11 12 14 -4 -6 0 -2 -13 -9 17 13 -13 -8 -10 -19 -14 -22 6 8 4 2 1 3 -11 -6 13 17 18 7 -20 -1 -5 -13 4 7 -3
3057 -3 17 1 1 -4 -25 -33 -20 -6 17 2 -6 1 15 3 -3 -6 -14 9 3 5 5 -16 -11 3 -1 19 14 16 2 7 5 6 -11 -7 -3 3 -1 -1 -7 8 -12 -5 -8 15
3101 15 5 2 1 -5 19 -10 -24 -5 11 -9 16 9 1 7 -2 -14 5 5 17 14 0 -3 -12 -15 -23 -4 11 14 13 10 8 -3 -20 -21 -9 -16 -1 19 29 5
3141 5 4 -4 4 -19 18 20 6 12 6 -9 -29 -18 -24 -6 2 14 9 2 -2 -19 -28 -9 -11 8 10 19 -4 -10 -26 -16 7 5 1 12 14 -2 -19 -1 -8 -12 -1
3182 -1 14 16 9 -2 -6 -14 -19 0 8 23 16 7 -1 2 -19 -17 0 4 21 6 18 -11 -7 -18 -28 3 -1 9 16 -7 -9 -16 -17 -2 0 12 10 3 16 -10 -4 -9
3224 -9 -5 -3 6 22 18 -3 3 -13 -16 0 9 10 13 15 27 2 -6 -11 5 14 14 5 10 1 -12 -17 -14 0 -10 11 23 19 7 -4 -2 -18 0 17 16 6 36 9
3266 9 1 -17 1 -1 3 17 19 9 11 6 -13 -18 -1 1 0 13 6 -9 2 9 -2 -8 -2 7 25 4 7 5 -13 -20 -15 8 3 4 15 4 -14 1 -4 -4 9 5
3308EQomk1J8npK1MjPj2rj8nORJ1J2j0j0j8K1jP%J7jjk2j1qLJ1J1J3MJk2j5OO
3350fj6L7Oj8nK1l6LJ1kJ7Qmk0nJ9j5nJ3KK1k5J4l8OOlNJ0kJ5pkj9J0kNjOJ4j2
3391Fkj1Ooj1L3jqj3QOk3J0k8M7mmmljqJ4lnMJ4k0Qn%pnK7j5OLoj1%K8j3J4j5
3434BQ%j0J4j4jj5K3Oj4qJ9k7PJ3R%Nj7j3OJ9j4MJ3p%rkQlrKJ5j8NKpJ5pj1N%
3477fQJQ%j4Qqj0K3Pk1jLj3J0nJ5j1J1j4NNj0PlJ6j3lJj0lK7j5j0kJ1MQMk1KK
3519gkJ2RmLk3QJj1K8j0mRnr%Kj2OMrJ6%%j5Oj2K4j2K7nOl3nJ8j6RkK6oj6KLJ
3563BJ4pj0nJ3Jk2MJ0j5J0L5nl1jJrkJ3k1K0%nnOPj0J1LLNNk3qnJ2J3MQlKj4j1
3606a0J9k4J0J2j1J7k7O%J%OkPJ5rj0J4k3KJ1Oj1PJj3oMj2QK0j2J2j9KoKJ4j2
$$ plain form
3308 5 13 7 3 -18 0 -5 -12 9 13 12 19 7 -2 -20 -25 -19 -10 1 13 3 -7 -25 -4 -5 2 2 19 18 17 -5 -16 -24 -21 -10 1 14 18 19 -3 -18 -12 -6
3350 -6 -22 15 21 3 -2 19 -17 -14 -3 -5 12 20 16 -4 -9 10 -5 -10 3 5 26 1 15 -23 -17 -11 -14 -9 1 -1 14 7 5 -14 -4 -6 -1 -2 4 18 6
3391 6 4 -7 -1 -7 -18 15 14 6 -7 1 7 -16 -6 -34 13 9 5 1 -2 -3 -11 3 0 -5 -1 13 -7 1 -4 -4 -11 -16 11 -4 2 5 -1 -12 -12 16 3 17 2
3434 2 10 10 0 14 0 -1 -16 7 13 -1 -9 10 -17 -10 3 12 12 17 0 -13 -7 12 -2 2 15 8 8 -1 -3 5 2 -7 -5 10 -8 -3 -1 -8 7 0 -11 -6 -6
3477 -6 2 3 11 11 -3 5 -3 -13 10 17 -4 -5 -2 -15 -5 -10 5 -6 5 -9 -4 1 -9 -2 -5 11 -2 -5 -4 -14 -17 10 -5 -15 -17 -6 -2 6 10 -11 -9 -7
3519 -7 -9 3 12 8 11 -12 -4 -3 -14 14 4 0 9 4 -5 -5 -3 -15 -9 -5 -14 2 2 2 -13 -7 -19 5 -7 20 15 21 -12 -17 1 -15 -6 -8 18 12 -4 -2 1 2
3563 2 16 9 -1 -6 7 8 -14 -10 0 -15 -5 30 25 -6 -7 -6 -15 -17 -4 -25 -5 -5 -10 -15 -9 -2 -12 -1 2 5 10 15 -8 -16 -21 -9 4 8 16 13 15 1 -10
3606 -10 9 -15 -5 7 -4 13 -14 -8 -8 -7 -7 -1 -3 4 19 10 0 14 -9 -7 4 10 -1 6 7 -6 -12 -8 -20 -12 8 -4 8 -11 -9 -15 -13 1 -11
3645a1K1JMnk1j1K4j1RRj8K3l9K3ppMK1pOJjj5lPoqK4pL6l4J2mk5PPmnJ1jJ0j0
3687@lqOJJ6j6o%Kqj6K1MR%pj1JMJ1JJ5%j8ONk6pmJ4J8NMJ2k4j4RKmJ5lrLqMp
3733a1RkJ7Njj1oj5J1p%J6j1J9j2lq%OjJ5pMJ0l0j2L0j6NPJ1Kl8J9k2lK5K6no
3773A0j1kj4J3kNJ3lj1jjj0j3J1J1J1%qK4k0j7PPj3K6lrnj0j5J4NpJ3lJ2lJm%
3813bj0J1K5j4Kj0rK3j4k0nL0J1krl5J0J1oK5Mjj3RJ1l0OmLMPlqKk4J6rJ7K1k1
3853aPOk4LoRRnPPk1J6j0kJ1loJ8lok0nJ7KOjjJPJ2l3Lj6L5Nj1mj0J9roJ0nJ8
3897B0j2k1K3k2kMRJ5k1J3Kj5MK5j7Ol0K3J5j1pqllNJ9%rQQl0j4J5j0J5J4Mj5
3935clkRj6MJ7LJ3j7j2mojRRJ3jJk3NlPKJ6rj3QJLj7J8qRMjj9qQj6J9J5rR%k6
$$ plain form
3645 -11 10 11 15 10 -11 -22 2 -9 0 9 -9 14 -25 -2 -9 -16 -12 9 2 8 9 8 -7 -10 -3 -9 -17 7 0 36 2 14 10 -15 -8 -1 -5 -10 1 0 10 0
3687 0 -3 -11 -5 -4 12 -4 -10 -10 -8 -16 -32 -11 -7 2 2 -5 -16 -15 -11 0 1 16 16 -2 4 9 -17 -24 -28 -14 4 9 13 25 1 -13 -4 -2 -6 9 6 -3 0 -8 -4 -11
3733 -11 -2 -4 13 18 17 6 0 -15 -4 -11 -11 5 -6 13 1 -2 -10 -10 -4 -5 10 3 7 17 -13 -25 5 -11 -6 1 12 14 -24 -5 -27 -30 -5 21 16 10
3773 10 -1 -3 -17 -4 -6 -1 12 9 -2 -3 -4 -14 -27 -16 -5 6 6 -2 22 2 -15 -8 -1 -14 12 9 0 -5 -15 -30 -16 -11 -18 -5 -8 4 1 2 -2 -2
3813 -2 -12 -1 24 10 12 2 -7 16 2 -18 -23 7 18 16 7 -28 -18 -7 -13 12 16 15 2 11 22 -8 -2 -6 -3 1 8 5 -3 -1 -25 -9 -18 -1 20 -1
3853 -1 6 12 -12 -9 -15 -6 3 -2 5 12 -9 7 -3 -5 6 3 -3 15 12 6 -14 -19 -2 0 6 5 4 5 12 24 -9 -6 -22 13 18 7 3 -7 12 3 -3 7 2 20
3897 20 8 -13 10 -12 -14 -10 -1 14 -7 6 8 -7 -3 22 5 11 -19 4 19 8 1 -7 -10 -13 -8 11 11 2 10 18 -12 -26 -11 -21 -6 8 12 -3
3935 -3 -6 -8 1 -15 -11 6 9 22 5 -7 -11 -17 -18 -9 0 13 12 13 -10 -5 -8 -1 1 17 8 -5 3 4 7 -10 8 0 9 13 12 -7 -15 -7 -23 -4 11 2 11 11 -15
3980a5J8j1J1NJK0k5Qmpmj%NK2nj3opMj7J7J0%OQl0oJ5k3K3J5KqPj8j5Qj6J4K7
4021A5rJomKj1jmK7lpJ2qmnJ2jJrQKOk8MpOJ5mPj2NKmJ0JjloomLRj6K3qkJ1j5
4069fMJk6J3LK1pj0J9k0k1J2L5j0J1l0LJ4k4qJ2J2LpJ6j1p%j0P%K4joj4J1oJj
4108cK1l%j7lj6J2Mj8J8jJ8J9j2pl2J7JkJ9NM%ol9J7rJ6J%J4k7J2Kj7nOLL6m4
4148a6K2Kk2MJ1j5J0J6qPk9J8j0Qj1J5J4j1pJ0j0j3J7LQJj8RpmJ2LpJ0J6oj5j
4186FLj6J0Nmj2PLj6LoJJ5QJRk6ljJRJ1MoOj4Nk8J3QNMOoqqPoMOQPJ0m1J1kJ3
4233FkLk2K0Rk2mj0nJ6J5LLj0mnnjnJ9pK7k0qrPNPrMK4j8nj8K2j0pK4KPj3j1L
4276dJJMKQJoJj5j7J9j2RJ3pqRnqqL9NJ0l6KMq%KpQjNkKnj9J6MmJ5Qk1J2k3PL
$$ plain form
3980 -15 3 -8 3 8 9 29 4 12 8 1 -3 -4 -4 1 23 18 5 -1 -8 -4 -21 -4 6 6 12 20 -10 -16 -1 -24 -1 14 16 8 15 -3 -18 -10 -26 -12 15
4021 15 6 7 1 -3 -1 -12 -13 -17 10 7 0 12 4 0 -5 7 6 7 -2 6 8 14 -14 -10 -17 -11 4 0 7 -5 0 2 -2 8 9 8 5 -1 -7 -11 -8 1 -15 8 0 -2 9 -6
4069 -6 -2 -1 -27 -14 -11 10 3 -7 12 -8 -29 -17 18 8 19 -11 -8 6 -18 -26 -14 -2 1 -6 10 -1 -8 -8 -18 -11 -11 13 12 6 -8 3 -3 -2 -3
4108 -3 18 15 15 -2 -5 -21 -9 -5 -23 -5 -6 12 31 19 12 -20 -3 -2 -4 15 20 24 24 18 -21 -4 -13 3 4 4 18 -9 3 5 -12 -17 -11 -8 28 -16
4148 -16 6 8 -14 -10 1 -14 -4 12 4 11 -18 0 -10 -2 -13 2 16 5 -2 8 -2 -15 2 5 13 14 -4 5 -2 -6 6 9 2 12 28 22 7 6
4186 6 9 -7 3 8 4 -8 -1 2 -14 -11 -17 -16 -1 7 8 17 -9 -12 -13 -12 -3 8 12 6 12 -2 3 -25 -12 -4 1 5 11 5 -3 -11 -4 -10 -6 0 8 15 25 -16 -5 -7 6
4233 6 4 7 -15 5 14 -8 -12 -22 -27 -11 4 7 10 0 -4 -9 -14 -15 -20 -1 -8 19 -1 -9 -18 -11 -6 1 -8 -4 20 2 -3 -21 1 -9 -16 8 10 17 4 -7 -4
4276 -4 -3 -2 2 4 12 13 7 8 -7 -24 -5 -17 -8 5 -2 -10 -1 -6 -14 -22 17 22 32 -4 -2 2 -6 -6 -4 -11 -3 -4 1 -1 1 -4 -23 -7 -3 -7 8 16 -5 7 -16 -9 -6
4323fkJ3J5Jqnj6qQJ7j3J0Roj1oj0POJ9j8J5j0j5OrJ5Pjj4pJ8j0qJ1j7J8jJ5J1
4363B0k2j0Pj1QrL1Nk4Qj1rlJ1MJ9nrkj3kJ1LPK3j2j1jj5K4j6QlJ0JJopj4nJ3
4404fJ6qj4K0mJk1J4%K7nnrkj1k3J8J9K%pj9nKPKJ4MjKj2JLj4J6KrK2j0Jok4J6
4447fnQJ1kkjj7OjQJJ1j8J6j3j0J1RqNOOj5LKj7LjJ0pJ7%%Kj9J2j1JK2k1J2J0
4489A8j7j4J3lL0j5%qmljjPK7l8L8j5k5%j7L5rRj3J8Lqj2j6K2QoJ2J6j4l3PlK0
4528HlNMOk1pK3l2MJ1J4k0J9j5OlnnLJ3j2J0ro%lJ7J7k3J2%J1l9K4k1J0LRLjj8
4569a1J4j8J2Nj5J2LJ3k3krK4k%KkqRLk7K4k0OPJJ2k8MmLJ1lMJ2r%j5LlNJ3Om
4612EPPk4OqmJ8OLk4J2j0qJ5Rj3QplPj3MjK2qpJ8k7J3j2kK3k2J8j3K1j6Lk3RQ
$$ plain form
4323 -6 -8 5 20 21 13 8 -8 -16 -8 9 -4 6 15 9 -2 -8 -18 -11 -5 14 -4 11 1 -14 -8 -17 -2 5 4 -10 -17 1 -9 -17 -6 -23 -5 -6 9 20
4363 20 -2 -12 -5 -16 -8 -17 14 19 -5 3 -8 -17 -20 -9 -5 14 9 0 -2 -15 -17 -6 -3 4 27 15 4 3 -12 12 -4 4 1 11 12 13 7 0 -14 -19 -6
4404 -6 10 2 -12 8 4 5 -16 -2 -2 25 20 15 6 4 -7 -30 -12 7 9 9 2 -17 -22 -20 -13 -11 3 7 6 8 -4 -3 0 -14 2 4 -5 17 7 8 2 -22 -6
4447 -6 -11 -3 8 6 4 3 -14 -8 -9 -1 0 11 -7 9 -4 -14 -3 6 -2 3 9 15 0 3 5 -12 -9 -10 0 -7 10 10 10 12 -7 5 -6 -5 17 -4 8 18
4489 18 1 -13 0 -3 27 12 12 4 0 -3 -4 -5 2 29 -9 29 14 -11 -11 -28 7 -2 7 -6 12 15 7 -5 -21 1 9 3 15 31 17 -16 -9 -12 8
4528 8 5 10 14 20 -1 -8 15 -17 -13 -2 12 -8 11 -4 2 -1 -6 -11 -8 5 -7 3 -6 -12 -12 -15 2 19 -4 8 8 19 -20 4 -17 -7 -4 5 8 7 -11
4569 -11 3 -15 -3 2 -13 -1 2 15 -8 -10 -19 5 3 3 5 3 -5 4 7 -20 4 -16 -10 -3 -2 10 -18 -14 -18 -15 -4 -7 -3 9 0 0 -15 -12 -15 -10 3 9 5
4612 5 12 19 -5 1 -7 -11 7 13 16 -8 4 -6 -14 1 10 -3 5 -2 -5 2 -11 -7 -8 14 6 -1 17 -10 3 -9 -11 12 -10 8 -5 16 0 3 -20 -11 -3
4653cJ1nKJkJ1k9QQJ5k0RPpj5jnJ4J4j2KpNJj4J0Lj4RmJ2Kqj0OOORJ0k5j3J8j0
4696ej0mJ9J2J1j5J3k0jmqJ5NJJ0j7kjj2P%J1Lj1lQk1QONLJ9j4LmlLJKj5K8j9
4738DoKj1RkJ4kNmj3rpK6%MmNnKOj9J0JMoRLk6j1OJ5pJ6pOpMorJ4J2j7Qkn%j7
4785a7%NNJ5Mj5LkmkmQJ1KMj0JjnmoK0j3nRj2J0KJ1Kj4J9rrJ7k2roK2Kj5J9k4
4828a7K4k5QJ3mRJ8l5NnnJ7j9J9Rj7J3jKmj9J1J2Omlj7J2j7NJMJ3j0OJ0ok7PQ
4868crJ8knJ5k3oJ5j5J5PJ2j1Rj9j1lJ6jJkMMj2J5j2j5J8Oj2Nj1nJ0lK8mk2J2
4907DK0j6j6rJ7MoRKnpOk0QjJ7qJkK0l4nJ9MKoJ2rpk1J7kK1qJ8j2Qj3j1qJ2J5
4949A0Jj8J3Kk1J2j3KmPLJ7qj7J9j0PpLQj5Nj5J5J0Lj9RjmjJ3j4rLKRj1RnjlJ8
$$ plain form
4653 -3 8 3 5 6 4 15 -14 -6 2 17 -3 6 13 6 -9 -10 -15 -1 13 1 3 -4 1 2 -12 -2 1 -13 -4 -8 4 6 -2 -12 -6 0 6 15 25 0 -13 5 -5
4696 -5 -15 -19 0 12 23 8 21 1 0 -4 -12 3 8 9 19 2 0 -1 -13 -6 -6 5 8 -3 -6 2 -19 -11 -5 0 3 22 8 11 7 4 7 8 10 -5 23 4
4738 4 -2 0 -11 -2 -4 10 8 13 9 -4 -13 -20 6 6 10 6 11 6 8 14 -5 5 6 10 4 13 16 -10 -21 -15 0 -7 9 2 8 1 5 -1 -10 4 16 -1 7 5 0 0 -17
4785 -17 -17 -12 -7 8 12 -3 0 -2 -6 -8 -12 -4 7 9 13 3 4 3 -2 -6 -12 8 -5 -10 -1 -13 -3 -1 10 12 -2 17 8 -1 16 -6 -15 -21 1 3 -12 7 -17
4828 -17 7 -18 -10 3 -1 8 26 -9 -4 -9 -14 3 -16 3 12 -5 8 7 9 5 -14 -3 9 15 11 8 -9 3 -14 -9 -8 -4 9 -1 5 15 9 -18 -11 -3
4868 -3 -12 6 4 -1 14 -9 -15 0 -15 0 7 19 8 17 -2 -13 -16 0 -1 0 -2 2 6 -6 9 -3 -18 0 6 -6 -1 -12 -17 -7 -10 18 14 -8 4
4907 4 24 8 -8 -17 0 4 -2 7 9 4 -3 3 -17 -9 -10 7 -1 0 -2 18 -16 -21 -2 2 4 -2 10 1 -6 -27 -10 -12 9 1 19 7 15 2 -9 -17 -5 10
4949 10 11 -7 6 8 -13 -1 -14 -12 -16 -9 -6 11 3 -14 5 -5 2 -5 -2 6 -9 -4 -19 -4 6 9 -10 -1 -2 -6 -7 6 -8 -17 -14 -12 -3 -14 -5 -10 -11 -14 4
4992DqL4k4oKqJ3j6jnJ2qK8lk5J7j3j8K4jlJKQj6JPj5K2Oj5K%j5J6Nj1J1%J2k6
5033a0QJ1j1qJ6qJ2j3MoPqK8l7MK0pQj8pJ9j5J2qnJ8j3Nj%J0pJ2omJ1pMLj6OJ0
5075A3JrjJ0j6jLJ0j3J4kLk0J1rkLmJ5Mk0J2nKNj0klJ9Oj7j9J3LkK2j3kMj3J4
5116DRLqrK1j4J0l0R%J9j5J7%mjk8J9l%RpJ4J8k7j0nK5j5JMoKpJ1k1J7lRj2K0
5157A6rLj6J8mj6J6J1mPj6qj2QJ9j3NkPopNj0jJ5J2j7J0mk4J6JlROJ1l6ORlLM
5199FOj2PKrnNjo%LK5j3k1PJ3Kj2Rj5oL1pk0mK5Mj3nKQqj3LJ0KKJ1j0lQj5J5J
5243Ik8J6qRkLoR%Qj3KJ5l3J1jONJ6l0RJ0Lk5K7j7MQRqk1K1rj4KJ4KJ7j8JnOj5
5286a1QJ4pmJ2j4j2J7j0J2Pk4K6k2nJ9npNPJqJ0j8KOMJ1nj0Rmnrj1J7k4K6oJ4
$$ plain form
4992 4 -4 30 6 0 2 -6 7 -9 -10 -15 -3 -11 17 14 -11 6 -7 -25 -1 -2 -5 -4 -2 6 -10 -9 -2 -17 5 11 -4 -2 -2 -17 -1 4 -7 4 4 16 -10
5033 -10 -2 9 -2 -10 6 -2 10 -3 1 -5 2 -6 22 -15 -11 9 2 10 -8 -15 4 -11 1 -7 -12 6 -7 -2 -3 -3 7 0 12 6 2 13 6 10 13 -3 3 13
5075 13 14 5 4 14 -2 -3 0 10 -3 11 9 12 -8 3 -6 -8 -5 -9 6 10 -10 2 -3 -1 4 -6 -8 -11 8 14 -3 -22 -9 -6 -8 14 1 -1 3 -10 4
5116 4 13 16 8 -1 20 6 16 -14 -5 -5 14 -1 16 16 12 11 -17 2 -1 -1 8 1 15 33 6 -4 -9 16 1 2 6 0 2 -5 6 -15 2 -1 8 -4 16
5157 16 7 10 -6 12 8 -8 8 19 15 22 6 -2 -14 -6 13 0 5 3 10 4 -3 2 -8 -9 6 18 1 11 7 -17 -1 0 -3 6 12 23 -13 -7 2 -1 2 6
5199 6 12 0 7 9 0 -5 0 -1 -7 -7 -4 21 8 -13 -6 7 9 -3 6 -9 -15 16 9 -11 -15 10 14 1 -4 -2 6 -2 -15 -12 -2 0 2 13 3 0 8 -7 8 9
5243 9 -19 -3 -11 -2 -4 -1 -7 2 2 10 -3 -1 14 -19 -8 -9 -3 2 18 -12 -3 7 10 -15 12 -5 -1 7 16 8 -13 8 -1 -15 -13 1 3 20 2 3 -2 4 -11
5286 -11 -3 11 4 0 12 -2 -14 3 -7 5 12 -12 14 -8 -13 6 1 -6 -1 6 7 -1 9 -9 -7 -1 3 14 9 -1 8 4 -1 -10 -21 -4 -28 -2 -8 6
5326FLmj3KKJ0Ll%QnMLj7KQklmjj0J3oK4j4J4j4j9lKJ2RJ1k5K7l3J6j3Q%Nj8J7
5369BQjr%mnJ4pPqRJ5j7qOlRj2%kRNnqj2QK0j0QkpjRj7lJ7j0L1rj4J3j7lJ0Jj5
5415hjLj4nK2pJ3rOJ7pj0lpOjj0J3POk0J7j7K1Pj8lMjjKrkK0j2J1jMj3llQJ6j9
5459aJ0pppRj5J2J1R%Pk4KNj5KJ5j5RJ3rLMNoOk1J5lpMqj2J3PjNj3lQkJ6oJ4k3
5504apmJ5j8OJ8%OJ2j9qJ7k1nrK2j1L0j9J7j1k6L1nj2nJ6MNj2j6pJ0K2Ok4J2K
5542A1qj3jK2j6J8pMj2J7qjj6J7qJK5j5jj6J2j5J8nRPj8K4l0J8j2qJ5lJ4j1lj3
5580hJ0qPJ9j8Kj4PKk0J4J6KljoRkJ0j3j0JOJ8j0lqj1mJ6J5j3Lj3J3lnNoJ0kR
5622A3j0LppMJ0J6j4Qj7j2J9j3OJ4kj2%NJ3qj6j0J5J0nRpJ2j8jQlrJJ6j3jj1J
$$ plain form
5326 6 9 5 -8 -6 -4 6 9 6 6 14 9 13 16 -1 1 9 7 4 0 -1 -11 2 -4 20 6 20 6 -13 -16 -14 -2 7 18 -7 20 -13 3 -10 -2 -2 3 -15 2
5369 2 10 9 0 0 -4 -9 5 -2 5 -3 6 21 4 -4 2 -1 8 -4 -4 -6 3 8 3 -5 -17 -9 11 1 9 7 0 -1 8 -9 -12 5 -5 26 17 3 16 -1 -4 6 7 -8
5415 -8 -9 -6 -20 -25 -3 -10 3 -6 0 17 10 0 -3 -10 -4 -5 -15 -2 5 11 -9 8 -9 12 19 1 -2 2 1 0 2 -7 -9 11 -1 10 9 13 0 -3 -6 2 18 -1
5459 -1 9 2 -5 -12 -3 -18 -6 5 14 14 21 -3 -1 4 -11 -9 6 -9 0 13 4 7 11 16 10 16 -5 10 7 0 4 -4 -16 -3 4 3 8 -5 -8 0 -2 14 8 22 -1
5504 -1 -8 -12 3 -15 -9 9 9 15 27 8 0 17 -4 -9 -18 4 -7 23 4 21 10 -16 15 10 -2 -7 9 13 18 6 -10 -17 -7 15 21 -3 9 11
5542 11 3 -10 -11 11 -5 13 6 10 -2 15 7 6 -10 7 -1 0 25 10 9 -7 5 -10 8 3 12 19 1 25 -5 13 1 -7 8 5 19 8 5 -8
5580 -8 2 -6 1 20 2 4 -10 -3 -1 -21 -7 9 11 8 7 1 10 8 18 5 -5 -4 2 20 10 7 -1 -12 -16 0 15 2 5 -8 5 2 -3 2 -4 6 4 13
5622 13 3 6 -1 -8 -4 6 22 8 16 -1 -13 6 -7 -1 13 11 -1 -1 4 17 9 -7 -17 -2 8 3 12 5 17 -1 -2 6 3 -6 -5 11 -2 -3 -14 -13
5662a3J4JMmnmkJ6J7j0j4kmOoJ0pMj6J6J0k3J0j6OJ4klMlMnKJ9k1k1O0k4lPj7
5703anKj3LKJ1qJK2qjJ7j6mJ3j1Lmk%pOJ9k3nJ5J0j3nklJ2RrJpJj0K2k4J8nK4
5746B5pj8kNj2pJ6j2L2j3qrO%MnJ2jj1J4j7J2NoJ2nPk4MLj3OJ6k5K6%Rj6oJ6p
5787F%mJ5k0K0k9JQmlK6mk3J1KPj1j3kJ8lp%o%J2K2j7Oj0J1k4J4J7j6lL%Oj1K0
5828A5j3JopJ5oJ1jmkpnJ6lRLlpnk0J1p%K6j2nJ4Mj1Mnj3LJ5Oj9lKjKJKRkkj0
5874a0J0kjJ0J4k8J4lk0NRJlJ6oJ2j4rkj2J3kKpJ6k2MMK1k6J7QrmJ3j2Kj0QK3
5914B0j3Ml2PQKPPj2J0j4J4j6QMj0NK9j6lmj5QMMj1LJ2ol4L9k1Pj3K0kQj0Jk2
5954b3J8J2k4K2J5Jj1qmj%Kj0K1j7nnJ5qJ4PppPlJ8oj6J6j8K4j0J3j7J1mk5%K9
$$ plain form
5662 -13 1 2 6 2 -3 -7 -9 7 24 14 0 -2 -6 0 -6 4 -3 1 -15 1 11 -12 -2 -18 -12 2 0 -3 1 -2 2 -3 -1 18 -3 -24 36 12 9 16 -1
5703 -1 -6 -4 -17 -14 -12 -1 -9 -8 14 6 5 22 6 2 15 4 7 3 1 1 -6 0 19 -4 -9 6 16 3 -2 -4 -7 5 14 5 6 -1 0 -10 12 -12 6 1 25
5746 25 18 0 -2 3 -9 -16 0 -12 20 7 -1 -10 -4 -4 0 -5 7 6 -5 9 -8 4 9 3 15 10 17 -7 -3 0 -13 -7 9 -16 10 10 19 3 -3 13 6
5787 6 6 2 17 -3 17 -12 -11 -3 -7 -10 16 12 -11 0 2 9 -2 -15 -17 1 -2 -9 -9 -15 -15 -3 19 2 8 -2 9 -15 -1 16 0 -3 0 0 6 -5 15
5828 15 2 3 -3 -10 5 -1 10 9 5 3 -4 -9 7 4 13 16 13 6 1 -19 -8 -15 -15 11 -1 -6 8 12 1 5 0 -13 -10 5 11 -8 -11 -9 -10 -8 -7 -5 4 2 0 -10
5874 -10 0 -2 -3 7 21 -7 7 4 -16 -11 -2 -1 -4 12 6 18 4 -5 -7 -19 -6 -8 -6 -13 3 -19 -15 -11 10 -16 1 9 0 -4 9 -3 -1 -11 -3 20
5914 20 7 11 -21 -14 -6 -4 3 10 -2 8 -6 8 -8 0 4 -6 -1 28 12 9 5 -10 -2 2 6 -5 -2 10 4 -30 9 -12 -5 -18 2 0 8 -2 -1 -23
5954 -23 -5 7 -17 5 20 21 10 2 -2 -3 -3 -1 -11 10 -7 -12 -17 -2 -10 4 11 4 -3 4 1 19 13 -3 13 -5 19 9 22 5 16 12 -13 -13 16
5993A6j9K1l3J9nJ7j7jJ7j6Rj2J9j1mkqMMkJ6j3J2l0J0J6qnJ0oRqj2QNQKMrJ0
6033A5k2MjJ6k1K6j8J5k0J8k5K3%jLj3Lj2MNRJ3k1K1j3J0JNj8k4PJ2pJ0oqP%l
6072fKmK6j5jJ5j9J5k7NJ8j7J1J2jm1K3J5j5krJJ1Pj9kJ1mK5k6J6%Nj3Lj1jJ4
6110BLkMj6lJ9k4K0O%pp%jrK9j3KklOj2PJ5j1J4k2jLoKj6J8jJ5RooqqJ8j1NmN
6155CPNj7jJLMj2MJ5j4rpRkOJ7j9J1Klj3LnJ3lRJ3j2Kj5pJ3%nLRj6K0rj5KMJ3
6199Gpj1jMK7l8NK4nqJ6l0K0okrJ0j2J9K0j9Rj0nnRj4lK3Nk1K9pj1j3J9llrrJ8
6240Ck9QJ7kKJ2j2J9k8PjJ2loMJj1jMmQOLJ6k4J4oj6J6%lOk8J1J7q%K1l2J0mj6
6282a7K2ljm%L%J1m%j2LJ6l0K5j0J1Qj2j2jJJ3jpJqKKjjPkQjNjkOj8kJ8l3K3l
$$ plain form
5993 16 -3 18 -15 4 -1 16 -1 -2 15 -1 8 -4 15 4 0 -2 -10 -6 -2 -4 12 -1 11 -19 -9 7 -1 -6 4 -2 7 -1 -13 -5 0 8 10 14 5 15
6033 15 -7 -3 -4 12 -9 17 -1 14 -6 12 -13 10 10 9 12 -1 2 -10 -6 -1 8 21 0 21 8 18 19 24 6 -18 -11 1 -6 4 -2 -10 -3 -3 -6
6072 -6 -4 -8 18 3 2 17 -2 13 -14 -9 9 -8 3 15 14 -27 -4 11 -4 -6 -15 -14 -3 4 -15 -17 -6 -10 15 -11 5 5 10 -3 0 -11 -12 2
6110 2 5 3 7 -9 -12 7 -17 3 9 9 2 -5 -5 -6 -15 14 1 3 1 -2 4 -8 -1 14 3 17 -5 -6 -3 -9 -7 -23 -5 -6 9 18 12 6 -2 -10 8 -3 2 -2 3
6155 3 10 15 -2 -3 -2 1 5 -7 -3 12 -2 -11 -18 -9 -11 -5 12 -7 4 6 3 -10 -7 -12 1 -2 7 20 8 10 -5 -12 1 1 -4 -1 8 -8 12 3 -12 -10 -6 7
6199 7 0 -11 -12 -8 19 -19 -14 10 5 -3 13 -17 3 -3 -5 -14 -4 -16 3 23 4 13 3 -2 -7 2 -12 -15 8 13 -8 21 14 3 -10 9 6 3 -6 -15 3
6240 3 -26 -18 -1 -3 -1 11 -1 18 -10 -3 -4 8 5 -1 3 4 -7 -8 -4 -8 0 6 9 25 1 15 9 -7 9 9 6 12 -16 -5 12 4 4 25 -7 3 -1 -17
6282 -17 5 2 1 -3 -3 0 0 11 7 7 -5 -2 14 -16 9 -1 10 18 6 -6 -7 -6 7 6 -1 0 -8 -6 -4 -5 -6 1 -1 7 6 11 10 8 14 -4 -6 12 -21 2 -1
6327aMnkOj1nL1k2J1Nlj1Rj2mJ5kLmJ3k1PrJ6k0J0NLj2jnJ7lNjnNj0QOpMJ5j3
6371Ij2Pj9J3mJ0nJ2pj4POOnqNJ4j2j5J1J1OroPKj0jmlJ3k4%MK4jopKMj6J7Nj3
6415fJ4J0j0jmj2QjQqJ7j8jPj0J3LJrljj1K9n%J3j9jN%mrLjOj5PLJj5J8mrJ2j4
6460a3kL3Pnk3LkJ0Mk4RmKL1j4k4MJ5j1JkOJj3J1kQRj5RoKj1qJ3Olj5kJ0ljKJ6
6504ImRk0Rj0J1lmRr%%oOMNPjj1kRrLj5PojJ4pPj0RQlj4M2k3k2J0Oj8J8j5J6J
6549Fj3p%J3L%Ljjj0J8mk0J6k0J0L1k5J4nj9K1Qj4lpkJ0KJnOnJ5nk2J4%%J2k0
6590eK1j3nJ4p%JNj5J0j3J3kjljmQNrlkNpOojJj6J0J9rlJ0j5K4j1rK3k6JQJ1j7
6634hPJ0Kjk2J4j2J7j1J1rpOJ0Qj3j3PJ6j2J0j2jQJplj3J1Mj7J1J9n%j1J7l1J8
$$ plain form
6327 -1 3 -2 -4 2 -9 -14 17 -5 6 11 8 -3 6 -6 -10 5 3 6 2 15 -6 1 -8 8 -12 -2 3 6 -6 -7 -12 5 2 7 6 1 6 -4 4 10 3 7 22 9
6371 9 -3 4 -15 -2 -6 4 -1 11 4 -10 -3 3 9 4 -4 1 15 3 -12 -1 10 16 7 1 8 10 0 -1 -5 -8 5 -19 -19 -15 9 8 2 -5 -3 1 -15 2 7 -6
6415 -6 8 18 8 7 3 -9 -1 -2 6 -2 15 -3 -4 3 -7 6 9 10 1 -2 -3 -14 15 10 10 23 4 3 8 8 4 -5 -2 -3 3 -12 -5 -2 -1 -16 2 -2 -11 1 -13
6460 -13 -15 18 25 20 -3 0 -2 8 12 -12 -3 -7 -5 26 12 -12 -8 7 -4 -3 -5 1 2 -11 0 -2 6 15 0 9 3 5 -6 -14 -1 5 2 -13 -15 -5 -8 -9 -7 9
6504 9 5 14 -6 3 -7 4 1 -3 6 -3 -3 -3 -9 -3 1 6 13 12 1 -1 8 -1 2 -13 -6 -12 -13 1 -6 1 -9 0 8 5 -9 33 10 -12 -2 4 -14 4 -11 5 6
6549 6 -7 -14 -14 -1 2 2 5 4 3 -7 11 7 -13 3 -17 -7 24 -1 13 8 -11 10 18 4 1 -6 -8 2 4 5 0 6 1 16 11 -11 3 3 3 15 -5
6590 -5 16 3 -2 12 5 5 6 11 -4 6 -7 6 4 3 0 -1 -5 3 8 -1 -4 -6 -1 -8 -2 -8 -9 -8 -24 -14 5 -4 -7 3 -12 12 1 -8 15 -11 -10 -2 9 -8
6634 -8 -1 9 11 10 -12 2 -10 7 -4 7 -2 -9 -3 7 15 2 -11 -4 12 0 10 -2 -3 5 6 -1 -4 -17 -6 -2 -19 -8 11 6 6 -5 12 -19 -1
6673aLprJ3Lj%NMJ0j0k0J4k3K0r%J5j2mJ0PnpJ4j1POk2PJ1jMrPKqj3J9mlj2lJ3
6717@j0J2JqKNkmJ5k6J9QpkJ3j3jJ2olj6Qj5OQnpjK3lj3OJRnLkJ0%j3mmK0pk4
6762b0J3NplMJ0Rj6lnK4nj6Kj3L2Lj7jJ0Orj2jQNnlj3J2j1K1k0K8k3J2Qj3QpP
6803D%%Ok1kORopJ2J9l4MpK0mpJ8j4J4mJMj3%Koj8J1Jj0K7k0jkJ5NJ1npLk3lJ5
6847gj5J5Pj8J0jrK3qMNj5pJ0J5j8KJ1%j4JJ3%J8j9nKj9J3KJ6pLMmj1NOj1Nj9
6888a7jNJ8k0%RMQNNRk7j9J8OqOOk0nPJ7k3K1Mj6J7pj5JJ3ONj9J8j8J3j3J9pr
6929dMJ4k3J8k2K2Jj4J4j5J6kNLk3R%K5j7j7MJ0kj3j2K8qQjmmp%JklQMOmkQMj3
6973@J2j6J5j3MqoJ3qJ2J1j6jj2J3JlJJKjJ1jj6J2MpnJ3nmpj2O%QJ3j7pL6j6k1
$$ plain form
6673 -1 2 -5 -14 -1 2 1 1 6 10 20 10 -10 4 -19 1 -8 -8 7 -5 -9 1 8 3 -4 10 -1 6 12 -10 -3 8 7 11 2 9 11 3 -10 9 5 2 -10 -13 0
6717 0 -10 2 3 -5 -3 2 0 -4 11 -15 4 12 5 3 16 3 2 14 8 5 -11 -3 -18 -12 -4 -9 -16 -17 6 3 -10 -4 -3 6 1 4 2 12 12 -1 -5 -9 11 4 -20
6762 -20 -7 -2 -9 -12 -8 2 11 -5 -8 -13 11 6 -10 -8 -21 11 14 -3 -4 6 12 3 -9 -10 -2 3 -2 -5 -18 -6 -17 4 -16 12 -11 1 9 -4 4 -3 4
6803 4 4 4 10 -11 -13 -7 2 -4 -11 1 20 -14 -10 -17 3 -1 -8 10 -4 10 6 7 11 -2 -2 0 -6 -24 -13 -12 -22 5 -15 -16 -18 -3 2 13 8 1 4 -19 -22 -7
6847 -7 -22 -7 0 -18 -8 -9 -18 5 -3 1 6 -9 -16 -6 9 -9 -7 4 4 -10 -9 4 4 22 3 -2 0 -19 -6 -4 12 5 8 12 8 -3 2 8 -3 2 -17
6888 -17 -18 -13 5 -15 -15 -6 -2 6 11 16 25 -2 -21 -3 3 -5 1 7 -13 -18 -11 6 -17 4 8 -8 9 2 -13 -12 1 7 12 -7 11 -7 6 -7 12 5 -4
6929 -4 0 14 -9 9 -13 9 10 -4 10 -5 11 9 14 17 -6 3 3 28 11 -6 -2 8 6 -7 -19 9 1 9 8 4 0 -7 -7 -6 -8 -11 -3 1 7 3 1 9 13 0
6973 0 12 -4 11 -2 2 -6 -12 1 -7 5 16 0 -1 -13 0 1 -2 -1 0 2 1 12 11 -5 7 11 4 -1 12 7 3 -4 -16 -10 -10 -2 11 -6 -13 23 7 -14
7015a4K5k2J9nlNk3OoK2k0J9Mj6J6omlRlqJ1Q%j1KPLjj1KkQj3NLoj3J5J2%j4J1
7058H%mNpjPPNk9PMkJJ9j8J7j6j0NQj0qJ0JjrJ6o%oJ6j4J0%orRjRKj5jJ5J4j5
7103Gj2rJ7lmkJ3Pk4J5j4kK2jj1J3J7k1Jmj4MJ1%loQJk4K8pj6K0Lj6K3k0qJ6L
7143Hj2j1J9Pnj1LpJkRLJ1rlNKLLn%pmK0j3Qjj4RqRmj1Rj0j8K8mlKNj7J6jKPk
7190Gj6J0Pj9RmJ2k1K6Qok6J3mK0Oj5Ol0K1OmokJ7jlkJ2j5kjrkJ4Mj1LkQlMj0
7233aJ3r%Lj4J9MojNkj0Prj6J2J0jmPmJk3K6rJ0j0lL2m0J9J4jrkloqJ4Pj2kJ3
7276A1rJ5mrNjmlJ9Nolk0K3j3j2LJ8j1Qj6ONk7J9J0j3J4j5J4jJ0j7J1Jj0j6J2
7314a%Kjj5J5j%NjmJ2rk%J0nNK1l3NRqj3K1k1K8l1J6lJ8pk4K0LlNpj7J5Lj7oJ2
$$ plain form
7015 -14 11 -11 8 3 0 5 -18 -12 -18 4 -16 3 7 -9 7 1 -3 -6 3 0 -8 3 11 11 0 2 9 12 11 0 2 0 8 -5 0 3 -3 -16 -1 11 11 -3 8
7058 8 8 4 9 2 1 8 15 20 -9 -2 2 0 1 20 2 19 3 -7 -2 6 -4 -12 -2 -1 -2 -11 5 -1 -1 -7 9 -5 5 5 -1 -10 -1 -2 7 9 -6 -7 8 22 7
7103 7 -5 -14 3 0 -4 -6 7 14 -10 5 -9 -11 11 10 -1 12 29 8 9 5 -9 -5 6 6 3 -3 5 6 -18 10 3 -13 7 10 -6 17 -3 -11 5 8
7143 8 -4 -15 4 11 6 -5 -2 -9 -8 -10 -1 2 13 4 1 6 8 11 14 9 9 2 -2 18 5 13 12 -2 7 -1 8 4 -7 2 -8 -26 2 -2 -5 -3 2 -15 1 0 2 9 7
7190 7 -9 1 8 -11 -2 -6 6 -15 11 19 13 -13 0 -4 16 22 7 13 -17 4 10 6 0 -2 15 14 11 9 21 6 4 3 -6 -8 6 10 -1 2 0 8 5 9 -1
7233 -1 12 3 3 6 -8 11 15 9 8 13 11 1 8 -1 -17 -5 5 4 0 7 3 4 -19 7 -2 8 -2 -5 27 -13 6 20 19 10 8 5 -1 -9 5 12 0 -2 11
7276 11 2 17 13 4 9 8 4 1 20 25 19 16 -4 19 6 -6 -3 15 4 12 -4 2 7 -20 -1 9 -4 10 -5 9 8 18 1 12 13 3 -13 -1
7314 -1 -1 1 0 -15 0 -1 -1 4 3 -1 11 2 0 0 10 5 10 31 -2 3 12 4 -9 12 -9 19 -12 4 1 19 12 -12 8 11 8 13 6 -11 4 7 -10 -16 -4
7357dlL0nj4%j4KJ6pqKK1j0Jj6pL9k4QQNj1j1LLkJ0k9M3k0j3J1j1lJ0Jk7K3PJ
7397Elk0J6J3qJ1Jkj2PronJ4j4OLpJ2J6k8J8JklJ3LKk0qJ5moOlMLj6K0k1mQO%
7441BrJ6jk4K7jMKrRj8J4j1nJ0nMLk3J2JMkJ0Jlk1J8mJ0j5NPRjqj2j0J9j4J7r
7483aPj2pPLOmK3j9J4omOljoJ1J6j9J4j2lj8%NJ1k4QJ6j4MKJ6k1J3j7mJ8jj5R
7524bQj5MrK0Lk1J0J1lqoK4k2K2k7K0k4J6JjoJ7Pqj3lMJ5k3K2j6LRmkj1LQJ1n
7565IoJk%J3nj5J1MkQl2K2kmlnJNj3J7j0J2PPj2nj0K6k1PJpjJ8nJk7pL6mnj4R
7609bj2J4j7jJ7j4J1%LJ1Nlk2oJJ2KmKj3RjJ1mj2J5LMroLoOJ3k3oJ8lJ2j7QQJ
7652Hqn%oJ0j4RJ7k3RoKKNPJ2k2jJ8j0j0j3J2jOqJ4J1j0Nl7J8OLmJ5j5J1rJ0J6
$$ plain form
7357 -4 -7 23 18 4 4 -10 -8 8 1 -7 -5 16 6 7 -9 -16 23 -1 7 15 20 9 -2 1 4 2 12 -17 26 6 -7 4 -7 -10 0 1 -26 -3 4 5
7397 5 2 -18 -2 11 3 14 15 13 1 8 -1 -7 -12 2 -12 -6 -3 -10 2 18 -10 8 9 7 4 17 20 22 2 -6 9 5 -1 5 2 6 9 -7 13 -8 -12 -4 2 2
7441 2 -7 9 8 -16 11 10 14 16 7 16 -2 12 1 -4 6 1 5 8 -15 -3 -2 2 0 10 11 8 -13 5 1 11 -4 1 8 17 16 8 -4 -14 5 -9 8 -1
7483 -1 6 -6 -13 -6 -3 3 -1 22 3 17 11 7 13 10 9 3 14 30 11 25 13 10 -8 -8 -3 8 -16 -8 8 -6 -2 0 16 -5 8 -9 -13 5 4 -11 -2
7524 -2 6 -9 -5 -14 6 9 -12 -2 9 6 -2 -8 16 -6 16 -11 9 -15 1 2 1 -5 12 19 11 -2 -5 -1 14 -9 13 -3 0 9 5 3 -8 -5 3 14 9
7565 9 3 4 2 2 15 10 -5 6 10 8 16 -16 6 4 0 -3 -8 -7 -2 -15 2 -8 4 11 18 6 1 -9 17 -4 3 4 -3 -4 14 9 10 -17 -24 12 8 3 -11 -2
7609 -2 -14 0 -17 -18 -1 -15 -4 -4 -1 10 15 12 -10 -16 -15 -3 -1 -5 -3 -16 -7 -8 3 -1 -13 2 5 9 0 -6 -3 -9 -3 10 -13 -19 -1 -4 8 -9 -1 7 8
7652 8 0 -5 -5 -11 -1 -15 -6 11 -12 -3 -9 -7 -5 0 7 19 -3 -4 14 4 -6 -19 -7 -8 -2 -10 4 15 5 10 -27 -9 -3 0 -4 11 -4 7 -2 8 24
7693B4k8J0rQQpq%LJj2J7prOJ3j5K1j3j1J0j3J7LojJpJ3j0j3K0j0J1qpQj3PJ7
7733A1j0pjJ8mj5lJ0PrkJ0j1%LkQj8J9j2J1jMqjpNMLomJ1lnPkk1J7K0j0Pk6J0
7776cKk3L6k1PJ5j3pQoMk2K5MlKJ4kk5PjrRj1ROj3L%%Oj0RORj3J8k2NJ0k7K6j3
7819dk0J2L3l2J9j4LPl6K8JqpJ7MQpLLqj8L0mk2J8J8j8Lk0J2oKqJ0K5k2Nj0qJ7
7859Fk8L8j1K3k5mkJ5j2nK1k6J0j6J7j1j3K2mMJ7%Jk5J9Pj5KJ2j0Jkj1lJ2oJ1
7896Ij5jj0J8mj1J4ljJ3mj0KpJ8k%j6K1j1oK1k7PJ2j6K2j6Ok4J8J2j4J4Ok3J3
7933Ej9J1J5mMo%rJJj6knJ2P%J0j8NJ6mj1J4rrJkK0%rOj1K1k3NlrJ6kLnj%KRp
7979@J7j6lK2k3KLj4PnKJ7j4J8j1pmJNJK0k1J1Nop%PJ1k4J6ooQJ0j9J0k1oK4%
$$ plain form
7693 24 -4 6 -3 5 13 6 -2 -2 1 2 -10 7 0 -9 -3 10 -5 16 3 -8 2 -11 6 9 3 2 3 -4 9 -1 -14 6 -4 7 -1 -8 0 -13 -6 11
7733 11 1 -6 -7 11 7 -8 -11 -1 6 -3 -5 5 -6 -6 -3 -5 3 -15 4 -8 3 2 6 -2 -3 -10 -5 -1 2 -4 -8 3 0 -5 2 0 -21 -4 16 6 13 -13 -3
7776 -3 -1 -24 12 -9 -2 13 0 -7 1 -5 -1 -23 2 6 3 5 19 17 -8 -1 -2 -11 -2 -13 -4 2 -11 -8 -8 -8 -2 -12 -3 3 12 -1 17 -5 0 10 -17 9 -4
7819 -4 -24 -12 21 -11 8 -6 -3 4 -32 -4 -3 -11 -18 -1 3 11 4 7 10 2 -16 14 10 -12 6 24 6 9 -11 1 -5 -3 -11 -1 24 2 7 -3 -11 6
7859 6 -22 16 5 28 3 -1 -3 12 0 -5 16 -10 0 -16 1 -10 -23 -1 -5 -1 16 16 17 -8 11 18 3 5 17 7 8 6 -5 -8 4 -2 9
7896 9 -6 -7 -17 1 -3 -14 0 -3 -4 9 5 -5 -3 -10 8 6 6 -10 11 0 -6 15 -12 -5 7 -9 13 -3 3 -21 -3 9 -5 9 15 -8 5
7933 5 -14 -3 12 8 12 6 6 -3 -2 -1 -17 -19 -24 -12 -5 -5 5 -13 -8 8 4 -7 7 -2 -11 -10 -12 8 8 -1 5 -6 15 -8 -3 -6 -15 1 -1 2 -3 -4 -4 -2 7 0
7979 0 17 1 -2 20 -3 -1 2 -12 -5 -10 -8 9 -5 13 2 -5 -9 -8 -3 -2 18 -3 8 13 7 0 0 7 18 -6 10 4 -2 6 16 -3 7 -14 -20 4 4
8020Dl0K4klO%jKOOj4Lj3J0JOJrnLJ8l2kL1k0NLrJ%J4lLNrKoRj0lQlj0J2nQnJ
8068bLoNLJPj2j0%QJj2J9mJj2J8Rj2rMj0LJ4k0RoJ4rNMlRj0MMj3J3JoJkj7J3j0
8113a2RLmmPk4K5j0LOJ5j2QklNLrpRLj1KrJ4kK1l0nJ2pLmRLJjrK0jj5j3J7LlK
8159Fmnq%J6%j4NpJ3nJ1Nqnj4J4Lj9J4Nj1J1j3J0LMpnPKQ
$$ plain form
8020 4 -26 -2 -4 -7 -1 -1 -2 0 6 12 -2 1 -12 -2 -1 5 6 -3 -8 -5 13 -19 -21 10 -10 -5 -2 -11 -10 -10 4 1 4 9 0 2 -4 5 -5 -8 0 -3 -13 -1 -6 2 -3 -2
8068 -2 1 -5 0 3 4 11 -1 -11 -11 -3 -2 -14 5 1 2 -10 8 17 5 -4 0 -10 -7 7 -13 -4 -10 4 -5 0 4 1 10 0 4 8 -5 8 9 3 4 2 -15 -2 -12
8113 -12 -3 0 -4 -8 -1 -25 0 -10 -7 -1 14 2 10 8 5 10 13 4 -3 6 9 -2 0 -9 5 3 24 -6 -11 1 -6 -3 -7 2 5 6 5 -4 16 15 0 -13 4 7 4 6
8159 6 2 -3 -11 -11 5 5 -9 -4 -11 2 -3 8 13 5 0 -14 0 3 -16 -2 3 -8 3 -10 0 3 7 0 -5 2 4 12
8191A2
$$ Imaginary data points
##PAGE= N=2
##DATA TABLE= (X++(I..I)), XYDATA
0@%%%%%%%%%%%%%%%%Qj3J3j6J6k3K9l0L7m2M5n3O1p0P9r0J03j15J31j47J66j88
38i9K06k30K58k85L16l47L84m27M68n16N70o27O91p60Q39r27J024j137J264j412
58g47J587j792K043k354K753l291M043n177P086j0881K1308j06789m52634j87229
72g32074J60011M34531M88044L20242j1756l28882m83725l94054j26591J98369
82d75885M21090M43022K45618o4552l37615m38036l30237o5939K23500M01217
92B2183L80582J80188j03340l30957l95507k67623j6304K37620L73515L29545
102D09902J25808j35842l24937l51568k12601K3588K46955L49875K79354P4359
112D84893j58962l09117l11870j67281N8596K54092L19583K28344L3369j71383
$$ plain form
0 0 0 0 0 0 0 0 0 0 0 0 0 0 0 0 0 0 8 -5 8 -8 8 -15 14 -16 21 -21 24 -29 32 -38 41 -49 54 -61 70 -77 89 -99
38 -99 107 -123 135 -150 166 -181 203 -224 244 -272 298 -329 362 -398 441 -486 538 -599 665 -747
58 -747 840 -952 1091 -1263 1490 -1801 2242 -2935 4151 -6730 14578 -92211 -544845 -732074
72 -732074 -572063 -137532 350512 670754 658998 330116 -153609 -547663 -674254 -475885
82 -475885 -54795 388227 633845 569293 231678 -206358 -536595 -602534 -379034 22183
92 22183 402765 582953 479613 148656 -246851 -514474 -530778 -293158 80357 409902
102 409902 535710 399868 74931 -276637 -489238 -465650 -218695 131180 410534 484893
112 484893 325931 16814 -295056 -462337 -403741 -149649 169934 398278 431647 260264
122B60264k92793k72803j19769Q8521K46689K81770J83776J533j79135k70643
132g2590k29029p8382J04963K33212K47362J43327k6697j79780k43530j89806
142b90950m6140J16591K18869K13839J08327m6075j76983k21338j56850j7847
152b98557J24781K03922J86225Q0613o3995j76052j99080j25537M189J28694J91706
163E6909J62382N3313p9944j69962j75950r9656K2330J33040J77978J34898K7777
174B43115q8693j59664j53823p4918L9073J31911J58714J08797Q450r3429j48324
185b8791j30979n1532N0691J26500J39984Q5772q165r5301j34867j10114l3301
196a90103N8950J21188J22934O5689k0579r5265j24220r3200j6642O6520J14827
$$ plain form
122 260264 -32529 -305332 -425101 -336580 -89891 191879 375655 377188 198053 -72590
132 -72590 -301619 -380001 -275038 -41826 205536 348863 322166 142386 -101144 -290950
142 -290950 -337090 -220499 -1630 212209 320536 274461 97478 -123860 -280710 -298557
152 -298557 -173776 30146 216371 296984 232989 56937 -142143 -267680 -263491 -134797 56909
163 56909 219291 272604 192660 22698 -153252 -252908 -230578 -97538 80440 215338 243115
174 243115 154422 -5242 -159065 -233983 -194910 -62999 95715 204512 212962 119533 -28791
185 -28791 -159770 -211302 -160611 -34111 105873 191645 183480 88179 -46688 -156802 -190103
196 -190103 -131153 -9965 112969 178658 158079 62814 -61406 -154606 -171248 -104728 10099
207A0099J07169M9732l0447r6069j14546p6458k238P0584J08115R4180L5419m0250
219A15290r5299j02663o0525Q998P2697J00813Q0240K1288m6839r0805r0231m6527
231a33563J8301P2917R1626O6235R451n0856q5168p7681l3433K5387P0967Q2239
243E6422N3790n40n3363p8799o6251k2923L0803O9498P3985M2111r217n4452p2842
256c1778n6794j3673L6114O7580O5367L1922j5731n5026o7819m7816m631M0083
268e2202O4220N6996K2992k1374n4851o1597l8406K910M1874N9738M8730J4830
280H3860k5597n3042n4582k9714Q998M2299N4422M0555P748k8262n0238m7555
292e1108k1849J3586M1444M9102L3527J971l0331m7227m0838j5160J6930M0385
$$ plain form
207 10099 117268 167000 136553 40484 -74062 -150520 -152758 -82174 25941 120121 155540 115290
219 115290 19991 -82672 -143197 -134199 -61502 39311 119551 140839 94000 3195 -87036 -133563
231 -133563 -115262 -42345 49281 115516 124967 74111 -11057 -88738 -122171 -96784 -25817 56422
243 56422 110212 109672 56309 -22490 -88741 -111664 -80861 -11363 62622 104733 95516 41064 -31778
256 -31778 -88572 -102245 -66131 1449 66816 98738 83007 27981 -39838 -87654 -92285 -52202
268 -52202 12018 69014 92006 70632 15781 -45816 -84222 -81312 -39438 20300 69030 83860
280 83860 58263 5221 -49361 -79075 -70077 -27778 26644 67199 74947 46685 -3553 -51108
292 -51108 -72957 -59371 -17927 31175 64702 66673 36342 -10885 -51723 -66883 -49953 -9568
304i568M4451K7134l323l1545m3723l4886r807J9633L9361L9946K1058p689l1868
317A9174m0300k9502m844K1873L7652L4983J5474j0950l1445l6554k4294n10K3202
330b6041L5261L0011J0529j3506l0390l2607j9291L181K3809L2384K5152O236
342D4728j5141k8976k8858j4803O367K3843K9308K0830K714j6465k7576k5152
354b9181j0584Q810K3280K6436J7110l16j7494k5889k1563p012J0528K2608K3748
367B0481J3629l049j7937k3830j8156m024J1725K1578K1051J0426n144j7901k1698
380a2849j5056j459J2552K0347J8354P505o861j7398j9391j2261N66J3012J9054
393F115J5742M877q063j6657j7279r800K419J3308J7498J3177K701q800j5824
$$ plain form
304 -9568 34883 62017 58694 27149 -16574 -51460 -61267 -41634 -2273 37673 58731 51042 19174
317 19174 -21126 -50628 -55472 -33599 4053 39036 54510 43560 12115 -24439 -48733 -49243 -26041
330 -26041 9220 39231 49760 36254 5864 -26743 -46034 -42853 -19044 13340 38492 44728
342 44728 29587 611 -28247 -43050 -36683 -12840 16468 37298 40012 23547 -4029 -29181
354 -29181 -39765 -30955 -7675 18761 35871 35555 18061 -7828 -29391 -36403 -25875 -3267 20481
367 20481 34110 31061 13124 -10706 -28862 -32886 -21161 417 21468 31894 26750 8849 -12849
380 -12849 -27905 -29364 -16812 3535 21889 29394 22533 5135 -14256 -26517 -25951 -12939 6115
393 6115 21857 26734 18671 2014 -15265 -25065 -22646 -9338 8160 21337 24038 15238 -586
406e86j5351p483L966J3236J5869J0925R16r381j4960j3390n358N137J2909J4254
420A0703Q912o00r686j3975j1536l547O038J2419J2705P087j864r837j2969r745
434a5895j892O672J1744J1255N477k978r902j1800q013n49P027J1108R921L905
448A6080l991r662j0536o498N75P270J0404Q458K473m589r230r384n134J580P360
463d824R524P101J288n032q725q189l857K282P265Q687N845K31n272q131p157
478h964k803K971P190P726M630n64n374p595o208j742L526O860O825L700j254
493H924n545p070n161p72L850O468O040K729j872n541o350m172m6M031O115N169
509F797J834k335n312n685l313O37M127N564M353J148k697n091m972k456J071
$$ plain form
406 -586 -15937 -23420 -19454 -6218 9651 20576 21492 12111 -2849 -16239 -21597 -16460 -3551 10703
420 10703 19615 19015 9329 -4646 -16182 -19729 -13691 -1272 11433 18520 16656 6819 -6150 -15895
434 -15895 -17787 -11115 629 11884 17361 14383 4481 -7319 -15332 -15881 -8854 2254 12175 16080
448 16080 12089 2427 -8109 -14607 -14032 -6762 3642 12100 14573 9984 754 -8630 -13764 -12184 -4824
463 -4824 4700 11801 13089 8057 -668 -8857 -12714 -10432 -3167 5520 11365 11596 6324 -1807 -8964
478 -8964 -11767 -8796 -1606 6120 10750 10186 4812 -2783 -8991 -10733 -7207 -347 6478 10178 8924
493 8924 3379 -3691 -8852 -9624 -5774 694 6734 9463 7591 2050 -4300 -8472 -8518 -4487 1628 6797
509 6797 8631 6296 984 -4701 -8014 -7377 -3250 2314 6667 7815 5118 27 -4945 -7401 -6330
524f330M057N112L705M42k974m773m262j826J410M074M685K941j53l014m429l754
540e089j260J816M003M135K303n54l075m134l173o81K056L766L650J753r38l060
556A518l736k616k34K181L561L115J212j151k933l382k107J66K266L205K609Q05
572D479j253k871l030j585M72K208K931K232M87j494k722k576j169O46K150K709
588A614J871J12j588k488k239q70Q44K147K407J487j37j613k316j888n82R84K024
605b31K119J174l15j632k105j563l24J027J943J862Q45n07j558j855j329j27J142
622a434J807J539O14o00j508j692j067J29J125J654J312M17o81j470j506p97K41
639a917J151J487J131K11p55j360j310o29L60J133J338Q94Q1p73j300j137m22
$$ plain form
524 -6330 -2273 2839 6544 6986 4012 -761 -5023 -6849 -5439 -1365 3320 6261 6108 3094 -1335 -5089
540 -5089 -6349 -4533 -530 3605 5908 5354 2279 -1855 -5028 -5709 -3653 113 3763 5516 4578 1518
556 1518 -2218 -4834 -5068 -2887 674 3789 5001 3850 917 -2465 -4572 -4406 -2140 1065 3674 4479
572 4479 3226 355 -2675 -4260 -3788 -1580 1351 3583 4070 2576 -146 -2722 -3891 -3245 -1095 1614
588 1614 3485 3597 2009 -479 -2718 -3588 -2744 -597 1810 3297 3160 1547 -769 -2657 -3239 -2255 -231
605 -231 1888 3062 2747 1115 -990 -2553 -2877 -1850 93 1955 2800 2293 735 -1120 -2449 -2576 -1434
622 -1434 373 1912 2526 1926 418 -1274 -2341 -2212 -1087 567 1879 2296 1615 145 -1361 -2158 -1917
639 -1917 -766 721 1852 2063 1308 -52 -1362 -1991 -1631 -498 840 1734 1815 1042 -258 -1395 -1817
656a817M52J062J208P35m8q41j186r19k62M80J014J061N95j75q57j024p68j57
674a447N23R97R13M16k77p77r40o18l3N64R07P48K71l10p35q28m90N2N60P99O31
695I26K01l73o84p06m06J15N75P32M96Q1l51o62o23k72J64N81O32M14K0m05o29
716a74n29j89K72N56N76L36p3m64o24m01r2L15N46N07K63j76m66n52l35k3L50
737c77N06M66J49k01m51n13k56K0L56M81L92J08k28m42m36k36P6L65M73L21L2
758F05k32m21l83j97J40L71M14K76Jk49m33l44j54J98L79L70K21l4l18l73l07
779d70m2J69L68L16J76q3k95l46k48k4K10L19K83J13q4k86k94j91J2J81K95K23
801C02R8r4k60k57j52K6J79K65K17M2j10k45k39j14O1J82K52J61K2j55k23k05
$$ plain form
656 -1817 -1365 -303 905 1640 1592 751 -435 -1354 -1616 -1136 -122 939 1534 1359 502 -522 -1290 -1447
674 -1447 -924 73 986 1402 1125 348 -592 -1210 -1243 -679 228 976 1247 937 202 -626 -1116 -1064 -504 295 926
695 926 1127 754 70 -636 -1042 -927 -352 380 876 957 606 -56 -679 -951 -787 -206 426 840 860 455 -174
716 -174 -703 -892 -620 -64 512 848 775 311 -313 -714 -806 -491 55 562 825 649 183 -369 -704 -727 -377
737 -377 129 595 744 543 92 -421 -677 -657 -301 180 572 680 452 10 -426 -662 -586 -221 252 573 605
758 605 373 -48 -431 -628 -488 -117 297 573 574 325 -108 -452 -606 -408 -29 341 562 528 210 -163 -470
779 -470 -512 -343 25 341 517 434 139 -207 -455 -479 -269 50 333 446 362 76 -218 -409 -397 -216 79 302
801 302 400 306 46 -211 -363 -337 -158 107 324 366 256 11 -228 -342 -281 -99 153 314 336 181 -42 -247
823b47p3P9J96K21J42m4j49k24j62k6Q0K06J86Q0m1j55j82j08j2J08J73J21L0
846A99m7j12j50j00L2J02J34J10L9o2j24j56l6J9J26J04J18j3q6j34j18m9P3J23
870hJ13Q5j4j21j31r4qP7J10J17P3n2j16j32p2mP0J34J05Q0m8j28j23q5K9P2J11
897D0J09K4n0r3j08p7LJ11R8R6M3o5j18j22o0QR7J23Q2L4p3j22j19n3M3J12J21
924H4Q2Kp5j22r4n6M0J29J13P2qj00j11p9k0M5J12Q4N9k9n8j01p8k1M8R5R7L0
952A40l0q2q4o2nO6R0O8Pk9r5p6k0QR1P6L3K5n3j08n5j1L6Q2N8N5lq1q2p2J0L9
984f4J03P2K7m2q7p5m6NO5R0P9k3l0q4q6n3L2P7P9O5L3o9r5n9n7M0R4Q4O1lo8
1015F5r3q8k9M6R4R8P1k1p3j02q8l3P1R0J08M7k7q3j24o4rM9J08J03N6o1q6j01
$$ plain form
823 -247 -320 -241 -45 176 318 274 125 -99 -261 -287 -207 -1 185 265 224 69 -113 -221 -233 -125 48 169 199
846 199 152 40 -110 -210 -178 -76 58 168 207 145 21 -135 -171 -152 -26 78 196 183 97 -37 -155 -204 -131 -8
870 -8 105 190 176 55 -76 -170 -178 -101 9 126 199 147 31 -101 -173 -177 -107 27 132 212 164 36 -87 -172 -143 -71 40
897 40 149 173 123 30 -78 -155 -152 -41 57 153 196 131 13 -109 -169 -161 -64 59 141 175 102 -20 -139 -192 -149 -37 84
924 84 166 168 93 -29 -123 -179 -139 -10 103 175 167 67 -44 -123 -143 -98 14 98 157 128 70 -31 -109 -130 -82 13 110 140
952 140 110 28 -56 -118 -123 -57 33 101 108 79 -16 -92 -112 -104 -13 63 96 121 68 -40 -95 -106 -70 12 70 125 122 41 -41 -113 -103 -64
984 -64 39 111 138 96 9 -66 -112 -107 -42 48 127 104 74 -10 -96 -149 -117 -40 39 104 137 68 -27 -86 -143 -103 -9 75 136 133 65
1015 65 -28 -116 -145 -99 -5 93 164 143 70 -32 -120 -153 -82 8 116 163 136 53 -71 -135 -144 -95 13 116 172 111 25 -76
1043g6q6J0O8J15R0K7l0r4j19p1OR8J04Q2M2m7j11j03n5J1Q1J09J07J8o8q9j02
1070h3o3OP8J26R8%l6j22j19n3K9Q4J18Q8J5n2j16j34l1K6P2J19Q7K2l7j32j02
1097a12p3N4P4J33Q8J6n2j31j03m7K2J07R4Q9J2n2j23r8n6J4Q7J49O4om9j17j05
1124a21n1L0Q9J25O7K3o4j29q4n2L9Q6J26O2J3n8j39r4m0M6J16R0P6op4j09q6
1151a19l3M8R5J18O1k3p6j09j01rN3J01R9M7j5r7r5j15NO3J32R3M8k2j17j01p6
1178a45k4O2J35J04M1m9q7r4j06%P6J41R3M7o4q5j21q2J0O9J31J01L6n0j08j26
1204i5p2jQ9J31Q7K7m8j19q6r2OQ7J48Q1L6n5j26j10p3L2Q7J22R5L1l8j22j29
1231a07m5J9P8J20P6L7n7j00j31l8J8P3J25R4kp7q9j00n5L0Q9J25O1Lp1j09j09
$$ plain form
1043 -76 -162 -152 -84 31 121 148 118 24 -95 -166 -160 -62 42 124 166 119 8 -95 -150 -139 -58 51 158 176 108 19 -83
1070 -83 -146 -140 -62 64 162 162 126 4 -115 -168 -139 -55 63 151 166 114 -2 -136 -167 -141 -69 50 137 159 122 -10 -112
1097 -112 -185 -131 -57 76 164 180 128 -3 -106 -153 -131 -24 70 159 171 119 -4 -102 -158 -144 -57 92 156 150 101 -16 -121
1124 -121 -172 -142 -53 72 139 162 98 -31 -115 -167 -128 -42 84 146 159 101 -38 -132 -172 -126 -10 80 156 150 76 -33 -119
1151 -119 -152 -104 -9 109 170 147 71 -38 -139 -148 -95 6 105 152 137 40 -55 -170 -165 -102 30 123 171 149 32 -69 -145
1178 -145 -169 -107 28 132 173 124 37 -57 -163 -163 -87 54 147 194 130 45 -76 -158 -148 -79 52 153 189 139 31 -95
1204 -95 -167 -168 -79 52 139 166 118 -1 -87 -179 -173 -86 62 143 179 124 -2 -112 -185 -153 -66 56 151 182 144 22 -107
1231 -107 -152 -133 -55 65 141 178 121 21 -110 -148 -130 -57 68 162 160 83 -6 -106 -161 -131 -42 83 144 147 76 -33 -142
1258a42k8O4Q0J21M8qq2j18p8%L4J06R3P3k9p6j16o7nM2J01R4N0j8q8j22n2PN2
1287f4P6J02L5l2j04r9m6KP1P8O7L2m4p7q0m5J9M2J01Q2nl7r5n8j6JP4P5Q0J5
1317A50p8o6q6k6J8P8O6N7K1q1o0q2k8L1Q3P0N3j5m5r2p4j1L9M8R0O4k0n3r4n3
1347i6l7M8P1R5K9j6m5r1l8n2P0Q4Q0J7Qq1p8o0pK8P9R1L7k0n7r6p1j7N4Q0Q0
1378H9M0rp3j07n3j1M2Q0R2L3k2o0q1q8oO2Q2Q9N2l7o9j09n4pO4Q5R2L7n4n9r5
1409e5p8J2O1R5Q6J7l8p5r8m5ON6Q3P3K4k7r0r2n0MP5Q7O8L1l8q8p1m4nO9R1N8
1441A02L8n7q1o5l0J1O2Q3N4pl4q4p9l1L7M8R4M0j0l5q3n8j7K3N1P9N9j4o0p1
1471c5o7j0K5Q6O4L3j2m1q1m8kJ9O6P8K4l0m0o3m9KL7O3N7K7j2o2q2k8j1L6Q4
$$ plain form
1258 -142 -170 -106 -26 95 143 135 53 -65 -143 -143 -109 -3 90 163 134 58 -58 -125 -130 -88 13 107 157 139 51 -71 -123 -116 -64
1287 -64 12 114 149 117 13 -86 -132 -130 -59 19 86 118 74 -3 -83 -128 -109 -67 34 116 111 74 -21 -79 -95 -94 -20 55 135 150
1317 150 72 6 -80 -106 -88 -10 56 113 134 53 -7 -89 -117 -86 -3 67 120 105 60 -32 -106 -117 -78 -30 60 124 104 51 -43 -96
1347 -96 -133 -85 -14 81 110 94 49 -42 -80 -132 -62 22 102 119 127 46 -32 -92 -99 -71 8 99 136 116 59 -37 -108 -125 -71 9 89
1378 89 129 120 47 -60 -113 -124 -82 -2 90 123 101 41 -40 -128 -134 -72 10 99 151 114 45 -64 -118 -125 -61 24 116 153 99 40 -55
1409 -55 -133 -121 -60 35 121 138 100 25 -73 -118 -112 -56 27 100 124 97 7 -85 -135 -131 -56 31 99 130 92 4 -67 -111 -116 -47 44 102
1441 102 140 83 2 -63 -93 -82 -20 63 117 110 76 -8 -87 -118 -81 -33 61 101 91 56 -27 -85 -102 -79 -28 51 110 96 36 -35
1471 -35 -102 -112 -87 -1 63 96 84 43 -38 -86 -88 -69 -3 75 99 69 29 -34 -83 -81 -44 19 76 103 91 29 -53 -81 -92 -56 28
1502B8L3K7k2n9p0k9J2K7N2N9K6k8m8n4n1K3L4P8L2Lrm4p4j7%N7L0N3K1m9j7m9
1534b5k8pN4K2M4K5j9m7l8o0KM3M7M6RJm4p7k3K6J8L5M1J1Lo0l7j7j6N4L9M0J9
1567H1l5m1l1l0J9M9L0M1j1j6n8l2k7J5K8O1K1pk8m4l9j7MO2N2OMl9m5k8j5J3
1599e7M4M2L5nn1k6l0j7L5N3L8K3m1k7m6k7NN2J8L6J5k0k6n8l3K1M0M3L5km3m3
1631a7k9k5K0K9N6K1j5k6k3n2kJ4N1M2K3Kn4l5j3j4J8M1L5lK1k4m9l7j4L0N8K3
1663E2J1J9m7m9m2j1K7N2M8j5J4n1n5j6PK3M6L6J2j6k5m0l9RL2L7L2K1l4l4k7
1694b3j3OK9K6L7Lk3m1l5kJ0L1K1PJ6l7j2k9%j1K4K0J4K8k9j4l0mJ3qL6K1J0p
1728C4k0k2j8mJ4K4J0L1k1lk2k3JK0K6RPkk5l1l0K0L0pK4K1rl6qjj1j8L2K9J1
$$ plain form
1502 28 61 88 66 7 -63 -92 -80 -53 -1 58 84 56 8 -46 -97 -74 -40 38 70 73 64 20 -54 -71 -71 -14 16 69 90 41 24 -25
1534 -25 -53 -60 -6 16 60 85 66 19 -19 -79 -77 -34 13 59 68 69 25 -52 -75 -49 -31 4 45 56 59 -1 -38 -55 -71 -17 22 62 81
1567 81 46 5 -26 -56 -37 12 42 83 72 56 -2 -34 -61 -46 -18 43 64 57 29 -15 -54 -71 -67 -5 47 53 57 18 -27 -55 -70 -57
1599 -57 -13 29 64 59 8 -18 -48 -65 -30 23 61 84 43 16 -30 -57 -52 0 18 54 69 49 23 -35 -68 -47 -7 36 71 69 26 -17
1631 -17 -46 -71 -51 -22 34 55 40 14 -9 -61 -63 -49 2 44 67 69 15 -20 -33 -47 -29 12 47 44 65 41 -8 -45 -59 -29 29 52
1663 52 63 82 35 -14 -56 -67 -40 12 60 45 59 8 -47 -63 -56 -33 13 49 61 45 20 -20 -59 -50 -18 19 51 72 38 4 -23
1694 -23 -36 -30 -1 25 62 65 42 1 -34 -36 -26 5 26 33 49 12 0 -29 -29 -40 -16 4 18 46 17 3 -27 -31 -18 -26 10 31 41 34
1728 34 14 -8 -26 -30 -16 8 18 49 28 25 3 -20 -19 1 27 36 43 41 16 -15 -45 -25 5 -2 22 43 34 -2 -10 -11 -22 -40 -8 21 32
1763C2qk6j3k0%K8KK6K3j9k6rk2jK3L1jK7Jk7ml8NJL6K0klj0m6Kj1PJ4M6pok7
1801bk2l1J2K9L1OONl8j4k1PK4K0J8J6nl1l3pjL9K7%kj6j4rj2QJ5K6QKk6k7j2
1838b4j4NJ2N4lj1nk1l0K0nJ8J4MPnk6j9LJ3L1KK4pl7kj4J0OJ9%KlMk7JrKK8j2
1878EK2Ml2oj3RLlJ0oJ2j1%k7K0OJPJ8j7JnkjqK4J9kk0J0jj2MJ7k6J1kQlj8J3
1919Ij0J4pJ8k0Qk1Ojj3J3njJ0Nj1j3jJJ2J4Pnj1KolQQOJ4j5jolJj0K6j4LmqL
1962alLj3K7j5Kj6K0pl0J6QJ3nJ5k1j8KNJ1J3MnPlrj8NJ9nJ1J5j4Nk4pJ1J0QK8
2002D4j2j8j1l1J5L%J7J3j5pj0l0J1O6q0K2M2Lj8j6k6LK8K2K3j5%k8Kk9L0J6M
2036A8K0Kj6k5mj2j5K1J2J3J8k6mk2qNJ4L7jqk6j2k4KM1k6N5Jj8nk3nNJJ5RM1
$$ plain form
1763 32 24 -2 -15 -35 -35 -7 -5 21 44 25 -1 -10 -32 -33 -10 21 20 47 48 21 17 -21 -16 -15 21 41 39 36 26 -20 -18 -29 -22 -8 38 31 25 -2
1801 -2 -24 -55 -43 -14 17 23 29 34 -4 -18 -39 -32 -8 12 30 46 41 10 -23 -30 -31 8 35 35 33 17 3 -6 -18 -10 5 31 39 41 15 -12 -24
1838 -24 -38 -33 -21 33 30 19 14 -7 -37 -17 -22 -4 10 14 21 16 -10 -29 -26 -13 18 20 44 37 0 -2 -16 -6 0 19 19 21 18 22 -5 -4 -13 -11 17 5
1878 5 27 31 -1 -7 -20 -11 -8 -11 -1 -7 5 -6 -6 -33 -13 -7 -6 1 19 2 3 -2 -4 -5 -13 11 30 28 8 18 17 5 9 26 0 11 9 17 14 -4 9
1919 9 -1 13 6 24 4 12 -9 -3 -4 -17 -4 -9 -10 0 5 -6 -19 -20 -19 -7 7 14 9 -2 0 -6 -9 -1 7 13 27 12 11 5 2 3 -7 19 5 8 4 -4 -1
1962 -1 -4 -1 -14 13 -2 0 -16 4 -3 -33 -17 -9 4 -1 14 -7 -25 -23 -18 -7 6 10 5 12 9 0 -18 -13 6 1 12 27 13 18 -6 -13 -2 8 16 44
2002 44 32 14 3 -28 -13 -10 -10 7 20 5 -2 -12 -42 -31 35 -45 -23 19 22 4 -12 -38 -35 -7 15 38 23 23 -5 -3 -32 -2 14 18
2036 18 38 40 24 -1 -5 -17 -32 -11 1 14 32 6 2 -20 -28 -23 -9 28 27 19 -7 -19 -43 -41 0 -26 29 30 12 7 -16 -21 -16 -15 0 9 50
2073E0k2l0Qj1j7K5M1kpj1j2k2rJRK1L9j6j5j8k2qNJ6J8J1rlrl6J5j7L2PJ7J5
2109C4k4lj6k5J5J4K7J9j8J0k6j4k3K8lJ9K4j0Rm1j1KnJ3NKOKk0j5Pj6K4jK1J1
2145B1Jk6J3l0oKJ9L4rMk6prQjNM1ojQl0k9QJ2QJ8nk1K1j7j8j1J3KK0K5oj4j7
2184fk5lrK7K1J1%j4rj1k1M5rK9LQjl3k2kJ1K6J5J5j8j0k3j0j7QJ6L6J1j9j4j4
2220hl8LK2J5K8pJ3l5j8k2J4ML6J6OJk0l6LRLOK7K1j0l0k0kOJK4lL0Jj4k5j7k1
2258c7L2K0J6nk5Qk8j7QJ0J4J4QKk0l5J3KL6q%Kplk7JL1nK6j3J3k0Rk6pRRK2J0
2297C2qj3rqnj3J6NJ0J4j4j4qqJ3j0J2K5mJk5MrKNK1qJ0jj2j5jJ2J7J2jkKl0o
2337a1j0QMJ4PJ2oj2j3j8MOK1LQk6jk0RqK6J9Lok0j4jMoK8J6%j8jRj4K0l3L2j
$$ plain form
2073 50 28 -2 6 -5 -22 3 44 42 35 24 12 -10 -19 -18 -9 12 51 35 20 2 -20 -28 -23 -7 11 22 13 10 1 -35 -20 -37 -5 2 19 34
2109 34 10 7 -9 -34 -19 -5 22 41 23 33 7 -7 -30 -2 -5 14 38 28 37 -4 -15 -13 -18 -5 0 2 8 10 -10 -25 -18 -34 -10 -11 10 21
2145 21 22 -4 9 -21 -27 -25 -6 28 19 23 -3 -10 -19 -11 -12 -7 34 28 27 35 5 -24 -16 -4 4 22 17 -4 17 0 -18 -29 -16 -14 6 31 25 11 -6
2184 -6 -31 -34 -43 -16 5 16 16 2 -7 -18 -39 6 -3 26 29 37 36 3 -19 -21 -10 16 31 46 28 18 -5 -15 -32 -24 -8 28 39 20 6 -8
2220 -8 -46 -43 -21 -6 22 15 28 -7 -25 -47 -33 -29 7 23 29 30 10 -26 -23 -14 -11 -5 22 43 33 3 -17 -19 -13 -12 12 9 39 40 26 1 -16 -37
2258 -37 -5 15 31 26 1 9 -19 -36 -28 -18 -4 10 18 20 0 -35 -22 -20 16 8 8 10 3 0 -27 -26 5 0 26 13 26 6 15 -11 -18 -9 0 22 32
2297 32 24 11 2 -6 -11 -24 -8 -3 7 21 7 -7 -15 -23 -10 -20 -8 17 13 14 -11 -7 -16 -14 -9 12 4 14 13 1 -14 -15 -3 14 26 25 23 25 -5 -11
2337 -11 -21 -13 -9 5 12 24 18 6 -7 -25 -21 -15 6 9 17 -9 -10 -30 -21 -29 -3 16 19 13 -7 -21 -22 -18 -24 4 20 20 2 1 10 -4 16 -17 15 14
2377A4QKk8J4k5qK3LOJ2k2Ok2j7J7jJ6J8koj6j7OoK1lJ7J0mj7k0lK2lJ3J0Prj9
2416cJMk2M5QRj5oj4l0lJ8QJ7J8rk5k7noJ0K7nJ6Kj8j4pJ4kK4J6j6J1j3j0q%l
2455a3K5KJ9k0ll0LJ1qL4j2J9Nm8kjjJ0L0nk%l4J4k2QJ3KJ8Nj7j6Ok1K2J3OK2
2493C2Jk2k5J7j1lJ2K3L1k9lj3k6KkQRK1%j3rk2j5J0J6J4K0j6Onl7J5j5K1J6Q
2529A6K1k4j7lj1j0L7PJ5K1k6k4lqrJ8J6MJj2j0j1oJ5j1J4J8j3Oj0Pl6J5J3%J9
2565A9j8j4mJML%J5J5mnlk7j1K8KPJQJ3k6qRoOjJ9Ok4j0j2%LNJ8ljrQj6nqJ3l
2609a5K2J5k7j4PqJ7OJ1%Nj2k5J8pKRL1j3j4lnk1J4kK3j0j2Lkpj6J5J9lKpkk4
2648c0K1k0J5OPNkj0Qj0J1LRj0QlJ2j6j9J5Rjj3J6Qj5Nj7nK7j3K6k1j3J3j0j1
$$ plain form
2377 14 22 24 -4 10 -15 -23 0 3 9 21 -1 5 -17 -34 -17 -18 -2 16 14 8 -8 -25 -19 -25 -4 -7 10 20 16 -1 -21 -24 -2 -5 8 18 25 16 -3
2416 -3 -2 2 -20 25 33 42 27 21 7 -23 -26 -8 0 17 35 26 1 -26 -31 -37 -27 0 -5 11 13 -5 -19 -26 -12 -14 10 26 10 21 8 -2 -10 -10 -13
2455 -13 12 14 33 13 10 -20 -17 -6 -14 20 8 27 32 -16 -18 -19 -20 -10 20 15 13 13 -21 -7 -29 -21 -8 -6 12 17 0 -16 -10 -31 -9 4 10 32
2493 32 33 11 -14 3 -8 -11 1 24 55 26 23 10 -16 -14 -16 -8 1 22 22 9 0 -22 -37 -27 -11 3 23 7 13 8 -29 -14 -29 -8 8 16
2529 16 37 13 -4 -7 -18 -28 9 16 31 52 26 2 -1 -9 -18 0 16 20 21 9 -1 -12 -18 -3 -14 0 18 5 11 1 8 -28 -13 0 0 19
2565 19 1 -13 -17 -16 -12 -9 -9 6 21 17 12 9 -18 -29 -1 1 8 9 17 30 4 -4 5 -1 5 4 23 29 5 -5 -17 -17 -14 -9 9 6 5 -4 4 -12 -17 -25 -12 -15
2609 -15 7 22 -5 -19 -12 -20 -3 3 14 14 19 7 -18 0 -7 -5 4 35 22 8 5 0 -21 -7 -9 14 4 -8 -5 -7 -14 -30 -15 4 1 3 -4 -6 -30
2648 -30 -9 -29 -14 -8 -1 4 2 -8 0 -10 1 4 13 3 11 8 20 4 -15 0 9 8 -5 11 19 4 9 -8 -13 14 1 27 6 -7 6 -4 -15
2685a5K3j3kmJ0oRJj4j5LL7j6OnJ7nkj3J0j8K6j4j0K0J3oj4j0j1K2Rj0kRj9Qk2
2723b3NJ3MnQoj4k%Pj4J9lJLpkJ6lpK1kkj2mJ4j6J9%J3nKj7Oj9PK5j4kNmj2k9
2766c6K4jK8nj0jkk6PO%%NK8j6Nj2Qk3J9oK8Ok3jkmlL9j2JmNj4j9jkK1NjPqj5
2809ek5RMJ6NmJ4j6j7qQJ4OJ6%Kj5j4nk3L3J5OONk9Oj3nML0QJj7rk3QK7k1JmJ8
2851IJ6l3j3O%RMmJ6Mk0j1RoJ5klK3j2kj4j2LJ5OM5l0j1k3L0k0rJ8MMRJj3k9L
2891a8RJ3N%nk5J4j7J2j0J9J5qoJ6j3k0JJ7LpJ7jJqoONm%J7pJj0qj3nJ2K1oK2
2932B9j1l2JNqJj2L7Mj1j5Nj0k1K7NK0prjj9QOJ2J4PJk9J6j8rJ7J0J4Lj0j3Mp
2971Don%K2J1jl2oKoL1l4K4J4lk4mmj5NK2QNmj2Jj1K3j7L0nkJ0l1K0j5jJ5lj0
$$ plain form
2685 -15 8 -5 -7 -11 -1 -7 2 3 -11 -26 -23 14 -2 4 -1 16 11 9 -4 6 -12 14 0 -10 10 23 17 3 -7 -18 4 13 3 1 10 -9 -1 -23
2723 -23 -18 -5 -1 -6 2 -4 -18 -20 -20 -13 -27 -8 -11 -10 -7 -14 -16 0 -3 -10 11 9 7 -5 -9 5 -11 8 8 21 16 18 1 7 -12 -5 20 6 4 9 5 -7 -36
2766 -36 -12 -13 15 10 0 -1 -3 -29 -22 -16 -16 -16 -11 17 1 6 -6 2 -21 -2 -8 20 26 3 2 0 -4 -7 32 20 21 17 22 8 -11 -12 -14 7 12 11 18 10 -5
2809 -5 -30 -21 -17 -1 4 0 14 -2 -19 -27 -19 -5 1 17 17 19 4 -10 -15 -38 -5 10 16 22 27 -2 4 -9 -14 -10 20 28 29 12 3 -20 -12 15 -6 -5 -9 9
2851 9 25 -8 -21 -15 -15 -6 -2 -6 10 14 -6 -17 -8 -14 1 -1 -4 19 7 5 -9 -21 -18 -3 3 48 18 7 -16 14 -6 -15 3 7 11 20 21 8 -21 -18
2891 -18 -9 4 9 9 4 -21 -7 -24 -12 -22 -3 12 4 -2 14 1 -19 -18 -1 2 -5 12 11 12 4 -2 4 9 5 5 22 15 16 6 -2 -15 -20 -8 13 7 29
2932 29 18 -14 -13 -8 -16 -15 -27 10 14 3 -12 -7 -17 -38 -11 -6 14 7 -2 -3 -22 -14 -8 4 18 25 26 -3 13 -5 -14 3 13 27 30 20 7 11 4
2971 4 -2 -7 -7 15 26 25 -7 -13 -11 -17 14 -20 4 18 15 -9 -13 -17 -32 -27 -5 3 8 4 -8 -7 -18 5 -12 18 13 11 21 -10 10 -5 -6 9 6 -4
3011dM2k0k9MQljkK1pj0mk4J7jPJ2J4k1JKk0J1j2K4rK7jLk1j4OOK3mj9K1k0ln
3051eNJ4p%mOj0j1jOKMoK4j2pj6qK4l0K9J2k0J1kjj6OQJ8MqPj6nM%rJ7POmLj3
3095FL%j3K0j5J1pOj3j3lO%QJ1mOk3PpJ4LpJ1kkq%PmJOjK1k1mQljRPj1Omk4kN
3142a0LK2mj2J7j1j5J6j5j3J3jK5j1k4J3nkKK0J7rkj4j3J2%nJ3J5j2pJ0npqRK6
3180B8J5j8k0Rj8k0J2jK5Jqrkrk3J3J0K0J1Ml0J0j6mOJ4POj4J3poj5K8oJ5Ok3
3218DJ6j6j4K0mk0L0jJ2j7k7RpJ1OOJ3k5pOk4K5kqJ2J6j4j4J8k1MJ4nK7k4NJ3
3255A7k9J1j6K6J3Rj9Llj6J4kq%J5Jok7nNKNqJ3Pj9J6k6PnJ7MK3j8Pj3j0ljK4
3295EJ3Ok2J9l0J3JpRnJ0kNj3JqqjK2nJ1j1Lk0k0lK8nJ6LlLj5NJLj1J8J4qj0j4
$$ plain form
3011 -4 38 18 -11 -7 1 -2 -3 -5 16 9 -1 -5 -29 -12 -13 -6 6 20 -1 0 2 -18 -7 -19 5 -4 23 22 25 4 -10 -4 2 25 21 2 23 3 0 -5
3051 -5 0 14 7 7 3 9 -1 -12 -13 -7 -5 -1 -7 17 5 -2 -18 -26 -2 -32 -3 9 -11 0 -2 -3 -19 -13 -5 13 17 9 16 0 -5 -1 -1 -10 7 14 20 16 19 6
3095 6 9 9 -4 16 1 12 5 11 -2 -15 -18 -12 -12 -4 7 3 9 -14 -7 -14 0 3 -4 7 5 3 -5 -5 2 -2 -1 5 4 25 4 0 8 5 4 13 20 9 15 11 -13 -15 -10
3142 -10 -7 15 11 -1 16 5 -10 6 -9 -22 -9 -10 15 4 -20 -7 -12 -14 -12 8 25 16 14 0 -13 -1 -1 -6 7 22 10 3 13 8 1 -7 2 28
3180 28 43 25 5 14 -4 -24 -12 -13 12 13 5 -4 -6 -15 -38 -25 -15 5 16 20 -10 0 -16 -20 -14 0 7 13 -1 12 5 -1 -16 12 6 21 27 4
3218 4 20 4 -10 10 6 -14 16 15 27 10 -17 -8 -15 -4 2 8 21 -4 -11 -5 -29 -4 -6 -14 -2 14 0 -14 4 -17 -13 1 -4 23 -1 4 17
3255 17 -12 -1 -17 9 22 31 12 15 12 -4 10 8 0 0 15 16 10 -17 -22 -17 -15 -10 -18 -5 2 -17 -1 -27 -20 -25 -8 -4 19 1 8 -5 -15 -18 -19 5
3295 5 18 24 2 21 -9 4 5 -2 7 2 12 10 15 2 3 -5 -13 -14 8 3 14 3 6 -14 -34 -37 -9 -14 2 5 2 5 -10 -5 -4 -1 -12 6 20 12 2 -12
3337a2lJ0J9kM%J3k4nj2J5j3K3nJ3j3j6oj4K8k5L3KJ2l1%pMPkK5Ml0jPk5OLOJ9
3377GlJ2j0%k3J6pK6j5K5Jl1J2k7MJ0J3j2ROj4k0LMK1j5mJ1lj1Kj0J2%Pk%MKQ
3417Hqj3K9JpJkRoj4KoRpqJ5Kj5LNPjqPk1J3qKkJ1NnJ4l3K2j3J4j3J2OnQqOnP
3463A0k6J8K8lk4j3QNLj0NOLkjj2%Oj1JmJ3lj4J1pLRk3L4plk0lK2%j1oK1%OJl
3506Gj5J0pMKJ3oj5K0j8J6nlLRk5MPrNNknpjMPj2nJ6k2K7j0Omm%nK2j1j4K2qm
3550hK1mj0J3j2J1rRnomj0J9oNm%j6qRK6j8J2jKmk6NJRoK3J0k6Pj5J0PpKL0k0
3592FJ2j7j8kPJ3MPmk3JPnJ0PmK3k5Lj1qJ4j8RRMj3Jj3J2MJ0q%L3k1pJ6j8J0N
3633A2j3qJ6J0Lj6Oj8LnK0j1J3j5J2jlQqn%J1pj7nMOj2L0j8Pllj5J0OlK2rJ7j7
$$ plain form
3337 -12 -15 -5 14 12 16 16 29 5 0 -12 3 -10 13 8 21 8 -8 -14 -28 0 -25 8 10 22 -9 -9 -16 -12 -5 -7 18 22 -8 -9 -2 -27 -21 -18 -12 7
3377 7 4 16 6 6 -17 -1 -8 18 3 28 29 -2 10 -17 -13 -3 10 -2 7 13 -1 -21 -18 -14 7 -8 -12 -1 -4 -15 -13 -23 -11 -11 -4 -6 -6 -2 0 8
3417 8 0 -13 16 17 10 11 9 18 12 -2 0 -6 3 -4 -12 3 5 -10 -7 -2 5 4 -4 3 -18 -5 -13 -11 -13 -2 3 -2 12 -21 1 -12 2 -11 1 7 2 10 2 8 3 10
3463 10 -16 2 30 27 3 -10 -2 3 6 -4 1 7 10 8 7 -5 -5 1 -10 -9 -13 0 -3 -17 -6 -13 -10 -1 -24 10 3 0 -20 -23 -1 -1 -12 -18 3 3 9 10 7
3506 7 -8 2 -5 -1 1 14 8 -7 13 -5 11 6 3 6 15 -10 -6 1 -8 -3 2 0 -5 -12 -13 -9 -2 -14 -19 -3 -25 2 -8 -2 -6 -10 -10 -15 7 -4 -18 4 -4 -8
3550 -8 13 9 -1 12 0 11 2 11 6 0 -4 -14 5 -1 4 0 0 -16 -24 -15 11 -7 5 4 6 2 -24 -19 -18 -9 -15 8 18 -8 -1 -16 -6 1 -6 -4 26 6
3592 6 18 1 -17 -19 -12 1 5 12 8 -15 -14 -7 -12 -2 5 1 24 -1 2 -9 -17 -3 -21 -12 -3 1 -12 -11 -24 -12 -8 2 -6 -6 27 6 -1 15 -3 7 12
3633 12 -1 -9 7 17 20 4 10 -8 -5 -10 10 -1 12 -3 9 8 5 13 5 0 0 11 4 -13 -18 -14 -8 -20 10 -8 -1 -4 -7 -22 -12 -6 -9 13 4 21 4
3674Dj1PK2k1J1KJ0j3Qqk4K0j5J8J0j1mRj1j7nNJ6Rj4NRpj1j4OjK5kKj3kJqpJ9
3715aMJ9j3Ll0J8rQJ2RJPk4j8MKNK1kj5%j8J3j9J0RmJ8J0pj4k1jKRJ4NpkJrjj9
3758c0L0J6LJ0rk8QPl1J5K8oj4J1nj7J2oJ0J7jnj2j1JrNjJ0J7k4NKl2J7PNOJ8
3797A9jk2OJ1j7jK4j3J0K2l7J6nk4J1JJ7QMl4pRj0J1jrK2Jj4j3LOm%LJ0Jj1rj4
3837c1L1k1K3jK2jk3JJ4nQj2j2K5Kj1qj1kJ7j0J4Mj9Pj2j1nK2LOOpj2K3k3oRK
3876dJPM%k2J2j8J6MJ1JJ1lm7K5nOJ2lmOJk0%qRjMLOlko%%OkK5k2k0K5nk2RJ2
3921aMJ0lj1NmQqL7j6qj5J4j3J6Ok2K4Ol0J5j7pJ4k8L1j3J4KRl9K1j3QKMQqK6
3960B8l6Rk2KJ2NJ6j2%m%%mK9lljlj8J0JjoJ6j1%Nk0J4mLQKoQml2K5K%jPj1qJ3
$$ plain form
3674 4 -7 0 22 1 12 14 24 11 19 11 -13 7 -8 10 20 9 5 14 3 -14 -19 -14 2 11 -3 2 11 4 -7 -21 -15 -16 9 7 9 -4 -6 -5 -13 -20 -1
3715 -1 3 22 9 12 -18 0 -9 -1 11 20 21 28 4 -14 -10 -8 -3 18 16 1 1 -17 -4 -23 -13 -4 -8 10 20 13 -1 -22 -23 -21 -12 2 7 0 -2 -1 -10 -11 -30
3758 -30 0 16 19 29 20 -8 0 7 -24 -9 19 13 -1 10 5 -12 0 -6 4 21 20 15 3 -8 -7 -16 -11 -12 -2 15 -9 -4 -2 -34 -17 -10 -5 1 19
3797 19 18 -4 2 13 -4 -5 19 6 16 38 1 17 12 -12 -1 0 17 25 29 -5 -12 -3 -13 -2 -3 -12 10 11 -3 -16 -13 -7 -11 -11 -8 2 3 -8 -17 -31
3837 -31 0 -21 2 1 23 22 -1 0 14 9 17 5 -7 18 20 9 1 -10 -12 5 -5 9 13 -6 1 -11 -22 -27 -5 -2 4 10 3 -9 14 -9 -15 -6 -4
3876 -4 -3 4 8 8 -14 -2 -20 -4 0 11 12 23 20 -27 -2 -7 -1 11 8 4 10 11 -9 -9 -17 -8 -9 -5 -2 4 1 -1 -7 -7 -7 -1 -3 22 0 -20 5 0 -22 -13 -1
3921 -1 3 13 10 -1 4 0 8 0 37 21 13 -2 12 -1 15 21 -1 23 29 -1 14 -3 -10 4 -24 7 -6 8 10 19 -20 1 -12 -4 -2 2 10 2 28
3960 28 -8 1 -21 -19 -7 -2 14 2 2 -2 -2 -2 -6 23 20 17 16 13 -5 5 6 5 -1 15 4 4 9 -11 3 -1 2 10 12 6 14 10 -22 3 5 5 4 11 0 -8 5
4005El1J7J1J4knK0l1J5j4KJpL3lkrMj7j1lQJ7Qj1oKj6JrK7qNrj6J0j3J7LLJ4
4046A4rkQk1K6j7kJJ4j%J5j3j4OJ0kkkKNk3lOJ3NM%k5KJjj2J3J4rK2nj4k4K0j5
4088a5RPNkJ2j6NJ1j5JJ1J5j1ppOnOnlJ4j2J7prj9J6rRjOlj9J6j0OrjQK4j0jk0
4131a2J0KmOK2qjj3rJ5KK4l1PJ0j0j5j7J6%J1J5pk2RkjmnK7Lk1Qj9Mj1pKK8J8
4171B0nrj1qrJ3J6j0J3OKqj8jPK3j5J6j9J0pmLl7M7ok3J5K7m7J5Kj2OK9j2j2M
4209AppNQN%QqLj7J7J3k6J6o%J1J3j9j7Rk2L0J8pJj7j3jJ8nO%Rj0oRl2mJ3J2J
4251BPMj0k1kLlL5Kj4JjJ9j8mKj2K5KJ5k3j8J3j4MJ6kJ1Jrj6kLj4L1j6j0K9Lm5
4291b6jK1Kj7L2k0J6J3k8Lj5J2KK8j%j3j2J2k4J9J0J0jrOrj1jPj2J4%J1j1lj2
$$ plain form
4005 5 -26 -9 2 16 14 9 29 -2 13 -1 1 2 -5 28 25 23 14 18 1 -10 -13 -5 12 20 9 3 5 -11 -10 -19 8 0 5 -4 -20 -10 -23 -6 -3 0 14
4046 14 5 3 11 -10 16 -1 -3 -2 12 11 11 26 13 -1 5 15 13 11 9 11 16 -7 -10 -4 9 14 18 18 -7 -5 -4 -5 -17 -4 10 1 23 18 4 -20 0 -15
4088 -15 -6 1 6 4 16 0 5 16 1 2 13 28 17 10 3 9 4 10 5 2 16 4 21 14 5 -14 2 -7 2 1 7 4 -15 1 -9 -3 -12 -13 -5 19 9 8 -12
4131 -12 -2 0 -4 2 24 16 15 2 -7 8 10 34 3 10 20 10 -5 -22 -6 -6 5 20 13 -9 0 -2 -3 -7 -12 15 18 -3 5 -14 -10 -21 -28 -26 2 20
4171 20 15 6 -5 -13 -22 -9 7 -3 10 16 18 10 -8 -9 -2 21 6 22 3 13 6 2 5 -32 15 9 -14 1 28 -19 -4 -2 -14 -8 21 9 -3 1
4209 1 -6 -13 -8 0 5 5 13 5 8 -9 8 21 -5 11 5 5 16 29 10 -7 2 -20 10 28 21 22 5 -8 -9 9 4 10 10 19 9 3 12 -20 -24 -11 1 2
4251 2 9 13 3 -18 -20 -17 -20 15 17 3 4 3 22 4 0 2 -10 15 17 32 9 -9 4 -10 -6 10 8 19 20 11 -5 -7 -4 -18 13 -3 -13 16 19 -26
4291 -26 -27 -6 -4 -21 11 -9 7 20 -8 -5 -20 -8 -6 22 21 21 8 -4 8 -16 3 13 23 22 13 19 10 -1 -2 5 -7 7 7 18 7 4 -8
4328hnPJ7%onj6Pj8J3J3K3pJjk9K3j5LlL0oJ3k4KLk5NJ4J6lK0j0j3oj7kMQJ5q
4369A0Lok2%MJ1J1J1l0jMj6NoJ4J3KPKj6K3k0pJ1J2Lk4K8k9KMPqNJ8mmk4J1np
4410hpJ1QJj4Rj1RkLOj2K7k9J3kk6J6K8rNj4mQj1K0qLMJ0j3JrMqJ6rJ4qOj1j1
4452dj0KJ0MJ3qj6pQ%LlJ3PJ1k8oJ6oj7J5NK4npk5J9jqJ1MJ1k1J%MmqOJ1j0Kk
4495DJQnk5K4roJ9j8JLMqNJ0jj0NK7l5LlqL7Mj2Kj4k0K9j9J7Jj5J6lPl7K8k1K0
4536FjNMj7Mj6jJ7omP%K2l2kLJ6rOJNj1J5Jj9NJ9j8RMoK3k7R%Rk1K4j8Kj2Rj1
4579fl%PNlj0Mqj1J7kJ7kRj1pLj7K5JJ3j2qK8l5j7K4QMJ6k5OJ5k5J3nlJ4lMk3
4620cnPPrkJ4j4J5k0kj4K0NPK1k2oNj8J9KqO%LJj4J5J5l1%J0J9oqmm%pQnJ4j4
$$ plain form
4328 -8 -13 -6 11 11 5 0 -16 -9 -27 -14 -1 22 15 16 15 -14 9 -6 -3 -6 24 18 31 7 9 12 -13 -8 6 22 19 39 29 16 10 -7 -9 -5 3 18 10
4369 10 13 7 -15 -15 -11 0 11 22 -8 -9 -5 -21 -16 -22 -8 5 7 14 16 0 23 3 -4 7 19 22 -2 26 -3 -1 3 10 2 7 25 21 17 -7 4 -1 -8
4410 -8 -15 -4 4 5 -9 0 -11 -2 -4 -1 5 -7 20 -9 4 2 -24 -8 20 11 16 2 -2 6 -5 15 7 10 14 24 11 12 3 7 -1 15 6 20 12 18 7 -4
4452 -4 -14 -12 -2 2 15 7 -9 -16 -8 -8 -5 -8 5 12 23 -5 -11 5 -1 -18 -3 2 26 21 14 -11 8 7 -1 10 14 25 4 5 5 9 5 -3 3 14 4 6 4
4495 4 5 13 8 -17 7 -2 -8 11 -7 -6 -3 1 -7 -2 8 7 -3 2 29 -6 -3 -6 -14 23 27 15 17 3 -17 12 -7 10 11 -4 12 9 16 -21 7 -14 6
4536 6 5 10 14 -3 1 -15 -16 1 -5 -9 -2 -2 20 -12 -14 -11 5 -4 2 3 8 -3 12 13 -6 -1 18 0 9 13 7 30 3 12 12 21 0 24 6 8 -4 5 -6
4579 -6 -9 -9 -2 3 0 -10 -6 -14 -25 -8 -10 7 5 14 3 -4 -1 -18 7 8 21 9 1 29 -6 -23 1 9 13 29 4 10 25 0 13 8 5 19 16 20 -3
4620 -3 -8 -1 6 -3 -5 9 -5 10 -10 -12 -26 -6 -1 6 27 5 -1 4 -14 5 7 -1 5 5 8 9 -5 10 25 -6 -6 4 23 17 9 5 1 1 -6 2 -3 11 -3
4663cJ1jkrj4RMRmJ0pj5KPKkOJ3k0JJ1j1rQK3j0J5k2%J2j0rJ3j3PJ7%k5kRPj0
4705bNJ3jk5Mj5J6rJ1J1JQl9Lj1L0j8J0J8%nKj7J3OpNJ1mj0pjK1l2QLJ5mJ2kk2
4746eJ1j4pJ2J2moj3OKrK0j5J1rK2mj6p%J0RrJ0jJPj8mLPK3j2Pj6J0l1PQJMj1
4788hJ8k5%JOK1k3qNJ4qrj0J3kJ6LLj0qJj2J7pL3Jj8J0Koj4RKj2J3Rlj1pj1Rm
4830a0QoL6l8J1%l4K3rJ8nJ8Mj4Jj2KPJJOLj3Jj4J1kJ0KNJ1k5K6k3mJ5Jj8QJQ
4871A1k4NmPMkJ1Lk1KPq%jJ0J0j3pmNpjJ3J6j2J2Qk5KkR%MMlk0NLj0J6QPj1jN
4916A1rj0K7k5K0j7J2l7Rj3K9l1K1J4J2Kl2RNjRJ2k1J4knnnK0k9K3RppMk3jJ3
4954eoRj0QQqljRNj5K%PKpj2J1kJ1moJ1oJpOJ6j1Oj3J0k%Nj1mLK7qj0opkJ3mJ3
$$ plain form
4663 -3 8 7 5 -4 -18 -9 -5 4 0 10 3 -12 -10 -3 -1 -3 3 16 -4 -3 8 -3 -12 -4 19 9 24 2 2 14 4 -5 8 -5 2 19 19 -6 -8 1 8 -2
4705 -2 3 16 15 -10 -6 -21 -5 -14 -3 8 9 17 -22 -19 -30 0 -18 -8 10 10 5 7 -10 3 9 2 7 18 14 4 -3 -4 17 -15 -7 -4 11 7 19 17 -5
4746 -5 6 -8 -15 -3 9 5 -1 -14 -8 -6 -15 5 -10 1 -8 14 10 -6 -13 -13 -3 6 -3 7 6 7 14 -4 -8 -5 2 25 13 20 4 14 -17 -10 -2 -1 3 -8
4788 -8 10 -15 -15 -14 -8 13 -10 -18 -13 1 -7 -16 -26 -13 -15 1 4 7 -3 -11 -10 -22 -5 -12 21 22 4 14 16 10 -4 5 7 -5 8 17 14 3 -4 -15 -6 -10
4830 -10 -2 -8 28 -10 1 1 -33 -10 -19 -1 -6 12 16 2 3 -9 -7 0 1 2 8 11 -2 -1 -15 -4 -6 4 6 11 22 -3 23 0 -4 11 12 -6 2 3 11
4871 11 -13 -8 -12 -5 -1 -3 8 11 -10 -8 -1 -9 -9 -10 0 10 -3 -10 -14 -9 -16 -17 -4 12 0 12 20 -5 -3 -5 4 4 8 12 9 -11 -6 -3 -13 3 11 18 7 6 11
4916 11 2 -8 19 -6 14 -3 9 -28 -19 -32 -3 -34 -13 1 13 15 -17 -8 -3 -4 5 17 -4 10 8 3 -2 -7 13 -16 7 16 9 2 6 -17 -18 -5
4954 -5 -11 -2 -12 -4 4 -4 -7 -8 1 6 -9 -7 -7 0 2 -5 -17 -6 -8 3 -1 -7 4 -2 -1 -8 -2 14 3 9 -4 6 4 4 9 -2 -6 -3 24 16 6 0 -7 -9 4 0 13
5001A3l1K6Rl4K3j8Rm%K0k6PrQMj5LkK4Rj7qj3J5LK2j1nLK3k8kRj9K3J3omlj7
5041fLP%j6j0J9%n%NjkKnJ0J2j4j4J7k1J8J3%Nj3oMJ3j5LkoJ9lmj7%JJ3rJJ1Q
5084A5j5j6J1jj2ROjRj4jJnQRJ1j8%KjRo%Mj6K2qJJ7j7nKLL0j5l6J0J2omRNPj7
5128bjpkk2J7K1Kj4J5omn%kJ5MpNkqPNj3mPmJ9j0%N%j9L4j5J8j1mj7J1j9RMmR
5172Eplj2jLKNJ4j9J2Lj7J7koKKN%j4PLnOoK2k2J4qoj0OKJ9oJ5j1j0MmjnJ2%l2
5217b7OJ5nJ1j5J3l%NOlKl3J9K0j3j1K2J1j8J4nj3PrK4j2jpNk4K5j5K2n%oj7J3
5256bJ2rlj0J4ooJ0k2J3PMqJNMpj6K2JOk2K0J1j2j2OpJJ5NnRkj7j3POj3J6j0J1
5298DkJj3kjMJ1Qk9J3k0J3KRlQJ6k2J0j7J0QMj1jKJ2lj5%RJ3j3MlKqkJ1j2pJ6
$$ plain form
5001 13 -18 8 17 -17 6 -12 -3 -7 -7 13 -13 -6 -15 -7 -3 -18 -15 -17 7 16 -1 -9 -22 -7 -4 18 7 2 5 28 0 -2 7 -12 11 24 18 14 11 -6
5041 -6 -3 4 4 -12 -22 -3 -3 -8 -8 -3 -4 -6 -4 -9 1 13 -1 -15 2 -19 -1 12 12 17 4 -2 2 15 0 3 1 -5 14 11 7 -10 -10 -9 4 -5 -4 7 15
5084 15 0 -16 -5 -6 -18 -9 -3 -4 5 -9 -10 -9 -14 -6 3 14 -4 -4 -2 -3 6 0 0 4 -12 10 2 3 20 3 -2 0 3 33 18 -18 -8 4 -2 -6 3 8 15 -2
5128 -2 -3 -10 -12 -34 -17 4 6 -8 7 1 -3 -8 -8 -10 5 9 2 7 5 -3 4 9 -4 -8 -1 -5 14 4 4 9 9 -10 24 9 27 16 12 -5 6 -13 -4 0 -4 5
5172 5 -2 -5 -17 -18 -15 -13 -8 6 -13 -1 2 -15 2 0 -6 -4 -2 3 3 -11 -4 -1 -6 0 -6 16 -6 8 0 -6 -16 -10 -8 11 5 20 9 -1 3 -1 -2 -7 5 5 -27
5217 -27 -21 -6 -11 0 -15 -2 -5 -5 0 6 3 5 -28 -9 11 -2 -13 9 20 2 16 11 -2 5 -4 20 8 7 0 5 -19 6 -9 13 8 8 2 -15 -2
5256 -2 10 1 -2 -12 2 -4 -10 0 -22 -9 -2 2 -6 -5 0 4 -3 -19 3 4 10 -12 8 19 7 -5 1 -6 -5 10 15 10 19 17 0 -13 -6 0 -13 3 -7 4
5298 4 2 3 -10 -12 -13 -9 2 10 -19 -6 -26 -13 -11 -2 -5 3 19 -3 7 -10 0 8 12 1 0 2 14 11 -4 -4 5 18 5 9 6 8 0 -2 9 -3 -10 6
5340FnRnj6pK1j0QNj0J1k3J9j6j7K5K4Nlk4NjlJ0KpJ3k2K0j1K2k4oJ2j3J1NKj5
5379cjRj5J3qJ2mNj4jlQnJ1LoJ3j6%Oj4J8MrQjMk7J5nKPJ7j9MPk4L0k4%J8j9L
5422arJ5nmj2J8l%lJ1rkj6J6NnO%JJ3l1J8lJJ3J7k0Lj1J8l6J0J2NlMNj7qpJ9N
5464A0oLqqPMk2K3j0J5j4kJ4qlJ0l1J8J1KpOJ5qJkNpLnJ1k5%J7j1%K0mj2J2jj7
5506djjLqqJ8J4k4kJ5j5KJ6j3J4Mk0Nj3R%K4J6l2LpJ5j3oJ1kKK5j5Llk5J3MLJ
5547Hmj2mlJ1nKQK0l6J2j2Mj1J9nJ6rqNJ%KJK6l2J7Kj5MNJ4j5MlMJ4k2%%j6J7
5589DjJ0krqjnJJMlnJ3jmMJ0NNrMrjmPk7L1QJj4j5K3rpQJ6j7MK1j7j0qJ5Qj4N
5635HrRj3nJMpJ8j9J8kJj8J7KQKp%jjJPj0Kj1PJ6j7QjloJ1Lj1KrMnNPrqK0j4r
$$ plain form
5340 6 1 10 5 -11 -18 3 -7 1 6 -4 7 -16 3 -13 -30 -5 19 24 21 -3 2 1 -2 8 10 3 16 -6 14 3 25 1 -5 7 -6 5 10 12 -3
5379 -3 -4 5 -10 3 -5 7 3 8 -6 -7 -10 -2 -7 4 7 1 14 -2 -2 4 -10 8 12 3 11 10 14 -13 2 -3 -1 6 23 4 8 15 -9 21 -3 -3 15 -4 -1
5422 -1 -10 5 0 -4 -16 2 -1 -1 -4 7 -2 -4 -20 -4 1 -4 2 2 3 16 -15 3 0 1 14 31 11 14 3 21 -15 -5 7 12 9 13 18 1 -7 -14 5 10
5464 10 4 7 -1 -9 -2 2 -20 3 -7 8 -6 -8 6 -2 -5 5 -26 -8 3 5 -2 4 19 11 12 10 15 8 11 6 17 -8 -8 9 -2 -2 18 14 2 14 13 -4
5506 -4 -5 -6 -3 -11 -19 -1 13 -11 -13 2 -13 -11 5 -8 6 10 -10 -5 -18 -9 -9 15 31 -1 2 -5 10 -3 -9 2 0 2 27 12 15 12 -13 0 4 7 8
5547 8 4 -8 -12 -15 -4 -9 -7 1 21 -15 -3 -15 -11 -22 -3 -8 8 -1 -9 -4 -3 -3 -1 0 26 -6 11 13 -2 2 7 21 6 10 7 11 25 3 3 3 -13 4
5589 4 3 13 11 2 -6 -7 -12 -11 -10 -6 -9 -14 -1 -2 -6 -2 8 13 18 9 13 4 3 -1 6 -21 10 18 19 5 -10 13 4 -3 5 21 4 8 29 12 2 -6 9 17 3 8
5635 8 -1 8 -5 -10 -9 -5 -12 6 -13 5 3 4 -14 3 5 13 15 8 8 7 6 7 14 4 6 -5 2 18 1 9 8 5 -1 10 13 2 4 -5 -1 -6 -1 6 -3 -11 9 -5 -14
5682a4J3rKKkJ4rJ2j1jNMJ5l0J2LjMJ2j0j2K4mnk%Qj8MmNj2RRmj6k%L5l6kJMJ2
5726Elmk3J3QJ2Kj5jJ4Noj4KlJ4Pj4jpJ2NKJ3k0J2j6J6j5j4K4qmnkJ3J2k2mkq
5767b0J3J1k2K1qJ2j3oORJ0nMj1qJ8j9KJ1J3k4J4pJ3JrJ4k9oJ7KOk9K7j0j2K0
5804Fmrj1OjlOJ0j7K7j4qmLJ3KKJJ2j9J7k4MQJ0j1pRQnKPl2K1J2rnj2J8klkj1
5847imJNJ1qj3qJ2JJ2jrJ0rj4QJ5J0lKqOJ4k1Oj0J7j0Njjj7nJ1MLk1J4J3Ljlk2
5890a5J7pkrQLNJ2k8L3j9Nj2kJ5KMmMnMJ1nj9%J4J0j0j2J7Rk3%J0j6J2%k3LkK2
5931GpNj8QonK1k5J3MJ8j1Jk1J0JNJ8j4PlKj7J2J2qJ3j8K1k6Rj6NQJ%%nJrJ0o
5973cJ4lrnojJ2llQj3J3lj2J2j0%K2okJ3j1knOrjJ8KjkKLrLj2lJ5j1QqkJ2j1j1
$$ plain form
5682 -14 -1 -10 -8 -6 -8 6 -3 9 -2 -3 2 6 21 -9 3 6 5 9 21 11 -1 23 19 14 12 12 20 2 6 2 7 -5 4 13 9 -7 -9 -9 26 -10 -12 -11 -7 5
5726 5 2 -2 -25 -12 -4 8 10 -5 -6 8 13 7 -7 -5 -8 6 13 -1 -2 -9 3 8 10 23 3 15 -1 15 0 -14 10 2 -2 -7 -9 4 16 -6 -10 -12 -20
5767 -20 -7 4 -18 3 -5 7 -6 -12 -6 3 13 8 12 1 -7 11 -8 -6 5 18 -6 8 1 14 15 6 20 -9 -15 2 4 10 -19 8 -2 -14 6
5804 6 2 -7 -18 -12 -13 -16 -10 0 -17 10 -4 -12 -16 -13 0 2 4 5 17 -2 15 -9 -5 3 13 2 -5 4 12 7 9 16 -16 5 17 8 3 -9 9 7 4 2 -9
5847 -9 -13 -12 -7 4 -4 -17 -25 -13 -12 0 -1 -10 0 -9 -23 -15 0 10 7 9 1 7 21 0 6 -4 13 3 8 7 6 -11 -16 -5 -1 2 -19 -5 8 11 10 7 -15
5890 -15 2 -5 -7 -16 -8 -5 0 12 -16 17 -2 3 -9 -11 4 6 10 6 10 5 9 20 15 -4 -4 10 20 10 -2 15 24 1 1 11 -5 7 7 -16 -13 -15 7
5931 7 0 5 -13 -5 -11 -16 5 -20 -7 -3 15 4 5 -16 -6 -5 0 18 4 11 8 10 -7 5 17 9 22 4 25 -1 8 -8 -3 5 6 6 6 1 2 -7 3 -3
5973 -3 11 8 -1 -6 -12 -13 -1 -4 -7 1 -12 1 -2 -14 -2 -12 -12 10 4 2 15 4 2 -3 3 -6 -7 11 13 12 10 12 15 6 9 -3 -6 9 -2 6 -2 -4 8 -3 -14
6018a4Lj1K1lJ2Kj8J0j0J4r%J0%%nKKOQk3K9j5k1J2J6nJ0j4oJ2j8LLr%MPmp%K
6060dj4J0j1K7j5kQj5J3J1j4%MJnRJmPj7K1%Qj6K3j2rJ0j6NRJk5J2Qr%rJ0J6j8
6101aJ0%rrLLR%k3J6kk0K5MJ3k0K1k4J9j1j3OK6k4J3Mnqj2J8nj5jJ9%nJlkj1Q
6142eJKj1J3%jj7NPJ7j9K2k4J4qmlKK0Jj3J1Kj6J3Oj9MKPNkj2mlpK8k0kJj3K0
6184@LKk6K3mLlj2jJ3%MRj3LnMJJkjJ9kj3KJ9j8pkmJ3oJlkKK%oJ9j8J5j4QNj3
6230dJ5j0k0J7OqpNpKJ3j7J0jj4J8KK%lMKKkj1K1qj9J9Pj3Mj8J1Jj0J2KPopJ1
6272Hl0K3qKLj8L3k6J9j3J7mj4JQOJ5j8NMrnJ5Jj8J5j6nJ4nJ8mj0Qj3mkJpJNj
6314hJ9k2nMoQmMnK1Lj0KpJ9j8kMjL3k5Nj1MJ5k5J6j3Rpk0J9J0ook%OMj5PrOJ0
$$ plain form
6018 -14 -11 -22 -1 -4 8 10 -8 2 -8 6 -3 -3 7 7 7 2 4 6 12 20 -3 26 11 -10 2 18 13 23 9 3 15 -3 0 3 -6 -6 -2 5 1 -6 -6 -4
6060 -4 -18 -8 -19 8 -7 -9 -1 -16 -3 8 -6 -6 -2 -1 -6 3 4 0 7 -10 11 11 19 3 26 14 5 15 -1 4 13 14 -11 1 9 0 0 -9 1 17 -1
6101 -1 9 9 0 -9 -6 -3 6 6 -17 -1 -3 -23 2 6 19 -1 20 -4 15 4 -9 -3 23 -1 12 16 11 3 -9 9 4 -11 -12 7 7 2 3 0 -2 -13 -5
6142 -5 -4 -2 -13 0 0 -1 -18 -13 -6 11 -8 14 -10 4 -4 -8 -11 -9 11 12 -1 10 12 -4 9 15 -4 0 2 9 14 12 0 -4 -7 -14 14 -6 -8 -7 -20 0
6184 0 3 5 -21 2 -2 1 -2 -14 -15 -2 -2 2 11 -2 1 -4 0 1 2 0 -1 18 16 3 5 24 6 -1 -3 -7 6 0 1 -2 -4 -2 0 0 -6 13 -5 10 -4 4 9 -4
6230 -4 11 1 -19 -2 4 -4 -11 -6 -13 -11 2 -15 -5 -6 -20 -2 0 2 2 -1 3 5 7 5 -6 15 7 -12 7 14 1 5 -13 -2 -1 -11 1 3 10 4 -3 8
6272 8 -22 1 -7 -5 -2 -20 13 -13 6 -7 10 6 -8 -7 1 7 22 4 9 13 4 -1 14 15 -3 12 -4 -9 5 0 18 14 4 12 -1 -5 -7 -6 -13 -12 -7 -8
6314 -8 11 -11 -16 -12 -18 -10 -14 -10 -15 6 9 -1 1 -6 13 -5 -7 -3 -4 29 4 9 -2 2 17 -8 8 -5 4 -3 -23 -4 6 0 -6 -8 -8 -2 2 -13 -6 -15 -9 1
6358A%oJLj3RKJpPJRMl6K0JNpJ6j1nJ8k8K3rJ6j2oPOoj0LKJ0j0J0rQj9lPOpQq
6404hNn%K4j3pj0J4OJ5k9J7pJ3k7KJ4KJ0mj0jloJ5pRj9J8j1kJ0j9QJ1j0qqRMj
6445ikJ1j0QJ2l6L0jNj5J4j2MLNj0rjJ6mKkPj5J4jj5J1Lj7J6J2k8JQoKQOJqj4
6487a6J1pqMLmPj9K4J0Lnpj9L4j6J2j0nRqK1j0j7K6j4JNj7MoJ6j7K2mj9J0jNK
6527@j0moKPKlj3J5%rK2j1J3j9K2j0J1j3qK2mpjoJ2j1J5%j0lJ1mpj5K5KpJ1k4
6567a3JJ7j6NnJ8qj2JqK0J3j0rJ2MMj7J3nj6J4PqJ2j1%oqJ4jnqKPJ6k4pJJ7j2
6608a1Pk0J7qJ2%LQj0pJ4pjJ7nLjj7K8rpmJ3oj2K3k6RK1k4J3J1k2moNj2K2kjl
6649Ak4OMJLlJ2lJ3k6K1jJR%j2nQJ7l2J1QLmJlPqmMoJ3lJ2l0MNj0K0%j2mNJj0
$$ plain form
6358 1 1 -5 -4 -1 -14 -5 -3 -2 -9 -2 -1 8 12 -24 -4 -3 2 -5 11 0 -5 13 -15 8 -1 15 3 -3 4 10 4 -6 -3 -1 9 -1 9 0 8 -11 -14 -7 -1 -8 0 -8
6404 -8 -3 -8 -8 16 3 -4 -14 0 6 21 -8 9 2 15 -12 -10 4 6 16 12 2 1 -2 -8 7 0 9 -10 8 -3 -5 5 -14 -6 5 -5 -13 -21 -12 -8 -9
6445 -9 -11 0 -10 -2 10 -26 4 3 8 -7 7 -5 -1 2 7 -3 -12 -13 3 -1 1 -1 6 -9 5 4 -11 0 3 -14 2 14 -14 -13 -5 -11 -9 -1 5 6 -2 -16
6487 -16 -5 -12 -20 -16 -13 -17 -10 -29 -5 5 8 3 -4 -23 11 -5 7 -3 -8 1 -7 14 4 -13 13 -1 0 5 -12 -8 -14 2 -15 7 3 -16 -6 -7 -2 0
6527 0 -10 -14 -20 -18 -11 -9 -12 -25 -10 -10 -19 3 -8 5 -14 8 -2 9 -4 -12 10 6 -1 -2 -8 4 -7 8 8 -2 -5 6 2 -5 -20 5 7 0 11 -13
6567 -13 -12 5 -11 -6 -11 7 -1 -13 -12 -20 0 13 3 -6 6 10 14 -3 10 5 -11 3 10 2 14 3 3 -3 -11 3 2 -3 -11 -9 -2 14 -10 -17 -16 1 -11
6608 -11 -4 -24 -7 -15 -3 -3 0 8 -2 -9 5 -2 -3 14 9 12 11 -6 22 13 6 2 15 9 -3 20 -6 3 24 0 13 24 2 -2 -8 -3 -15 7 5 4 1
6649 1 -23 -17 -13 -12 -9 -12 0 -3 10 -16 5 4 5 14 14 2 -3 5 22 -10 1 9 12 8 9 6 13 5 1 5 -1 12 9 21 -9 -5 0 -10 10 10 -2 -6 -1 0 -10
6694a0mJ2k2K2KJ1jj8K2nKk3J0NMnLnQqJ7k1J4KkJj8L2l3J6pM%j0J8k3j0J8lo
6734a1Q%pJ5j1OkrK1lOj2mQnJ3Lj3j9K1J4rLj0kMlJ6Lj3j2J5lknkK9l8NJMk1J1
6777a0K0lkpj0LJ7k5J4mJ2kj6J4pJ4jJrK8j4j2J3plk0K4mOlJ1Lj9pLOJmj6J4j6
6818a7mK6j0Nnj0K7k0MrJ4rK0Jpjok2M1j4MkPj4MRJ3l0lnK5kj4jjJ4Nnj4Kj0P
6860gjJ0rJJ5kj2Oj5K0mjOk6K3kJ1ok3J9LJ1k1J1JLj5J9jmj6kkK4k0RQj6%MnK1
6902A5lk9K6k1RmJ1j4%J9mk4J2j1L1Jpkk4L3k2QLRj7K9j0j8nJRRj5j0J1J4j6N
6940aJ6k8J1rkJ7j2MOJNj9OJ1k6K0QJ0q%j6K6j3J2Lj2JpJ7j7P%j5J6nj3J2Jlm
6980@kJ1oMJj9LMOQj0j7J9J2k5MOLMKkJ0j0j9J0K4Kj6lRj8K5qj3LkOnMJ0k2mM
$$ plain form
6694 -10 -14 -2 -24 -2 0 11 10 -8 14 9 11 -12 -2 3 7 2 5 0 8 0 17 -4 10 12 10 11 -7 25 -8 8 1 5 5 -5 13 -10 -20 -2 -5 -11
6734 -11 -3 -3 -10 5 -6 0 -2 -11 10 7 13 1 -3 5 0 13 16 3 -16 5 19 10 13 3 1 5 2 18 21 8 -4 11 8 6 1 -1 28 -10 -5 -4 0 -21 -10
6777 -10 10 7 5 -2 -12 -9 8 -17 -3 -7 5 3 -13 1 -6 8 7 8 -1 27 13 1 14 7 4 -16 8 4 10 7 18 21 2 -5 -2 4 5 1 -15 -1 -17
6818 -17 -21 5 -5 0 -5 -15 12 -8 -4 -13 1 -8 12 13 6 5 -1 -23 18 4 8 6 13 -1 3 12 25 -5 -8 -13 12 10 -4 -5 -6 8 13 8 -6 -4 -14 -7
6860 -7 -8 2 -7 -6 9 7 -5 1 -14 6 2 1 7 -19 4 2 13 7 -16 3 6 17 -4 7 8 11 -4 15 14 10 -6 -8 -10 14 -6 3 11 -5 -5 -1 -6 15
6902 15 12 -17 9 -12 -3 -7 4 -10 -10 9 5 -19 -7 -18 13 14 7 5 -19 14 -8 0 3 12 -5 24 14 -4 -9 -8 1 10 -5 -15 -4 10 -6 -1
6940 -1 15 -13 -2 -11 -13 4 -8 -4 2 3 8 -11 -5 6 -20 0 8 18 10 10 -6 20 7 19 22 10 11 4 21 4 11 11 -4 12 7 -6 6 7 4 0
6980 0 -2 9 3 7 8 -11 -8 -4 2 10 0 -17 2 14 -11 -7 -1 2 6 8 6 16 6 -13 -3 21 23 7 4 13 -5 20 12 -1 2 0 6 1 5 15 -7 -11 -7
7023gLnmJ8Jk9qL3pQqkkOj4OJ2j1JJ%Nj1QK7j6Rk0J5j9oJ5kNppJ7qnJ1lOj8PK
7068cj4J2J9j3Pj1%j2POqJ8k1K4k4J5joRMj0lLOj%l%%lQMj7J3mJPj6J5Nk5K4j3
7111alJNpJ0j3LJ5j5JNJ5rlrJ0lj2NjkK7j9pJ0j5J7jMrLQk5J9Ql0J4N%KoORj2
7155@j8J2j2J4J2j3oJ2oNj4POpMlQJ6rJ0j5PppKJ4nj2J3rOqK5j7qjK7k4J%mLj
7198bQj0NjkMnj3J8j5J5NOj9J0qQNlJ0j2jNj5J6qPrPJ2j7OKj3J2k2J1NMnjqMJ4
7242A0jj2k3RK4j5OJ4Jj3kLJ1j1KMPjlj0J2k4K1mPpJ6j3Nj2kLoJ7k3J9oqqKkJ2
7284ankRrKJ3jqoJ7j6J1rJ5jqJ6j1jJ2k1nJ4kqKnJ3Qj8PpJj0K1kjnj3K1ok4J4
7327iJ6j9J0J4pkj5OPKMj1RMqMqLJ5knK0j0j6LkkOnnPj8ROjkJ1k0kJ2oOJj1J5
$$ plain form
7023 -7 -4 -9 -13 5 6 -23 -31 2 -5 3 -5 -7 -9 -3 -17 -11 1 -10 -9 -8 -8 -3 -14 -6 21 5 14 -6 9 -10 -16 -1 -3 2 -5 -12 5 -3 -8 3 0 6 -12 -5 -3
7068 -3 -17 -5 14 1 8 -3 -3 -15 -8 -2 -10 8 -13 11 -13 2 1 -5 4 8 -2 -5 -2 4 3 3 0 0 0 -3 5 9 -8 5 1 2 9 -7 8 13 -12 12 -1
7111 -1 -4 -3 2 -5 5 -8 -5 10 -5 -4 1 16 7 4 -5 5 2 -10 -5 -6 -8 19 0 -7 3 -12 5 4 8 -1 2 10 -15 4 12 -18 -4 1 1 3 -3 3 12 0
7155 0 -18 -6 -18 -4 8 -5 -11 1 -5 0 -14 -7 -1 -8 -4 -7 1 17 8 18 3 10 3 -4 -2 12 7 -5 8 -1 5 -3 22 5 -3 -4 23 -1 0 0 -4 -1 -2
7198 -2 6 -4 1 0 -2 2 -3 -16 2 -13 2 7 13 -6 4 -4 4 9 6 16 4 3 8 -7 9 1 8 -1 6 18 1 7 9 -4 8 -14 -3 2 6 1 0 -8 -4 10
7242 10 9 -3 -26 -17 7 -8 -2 12 13 0 -2 1 12 1 3 7 14 13 10 0 12 -12 9 5 12 5 21 8 13 1 -1 2 -4 13 -10 9 3 -5 -13 -11 -13 -1
7284 -1 -6 -8 1 -8 -6 7 6 -2 -8 9 -7 4 -5 10 9 1 17 6 5 17 -4 -9 5 3 -5 -3 -8 5 13 -5 2 -5 -4 -14 7 5 4 -1 -14 7 1 -23 -9
7327 -9 7 -12 -2 12 5 3 -12 -6 1 3 7 -4 5 9 1 5 -3 0 15 13 8 28 18 2 5 3 1 7 2 -3 4 -14 -5 1 0 -2 9 -11 -13 -1 -7 -1 0 -11 4
7372Dj7JOJ0jj8QJ0kJ3j1qR%j2QRKqPmN%j9J2qJ9j3j0J3jLqJ4j8Okj0J7j7jJ5
7414Ckj3J7j5K5k1PJ6rk1J5j2J3OLLj3QkqJ4j7J1LrlrJ5jk2LQpJ8omnkNrmJ0o
7457a7J3j1nJ9nJ0j8J3OQj6j5J1jJ0NJJmJj7J9Rj3MMj4JJ3mj0KMmJ2rj0%oJ0K2
7498A9k3k1K4joJ9mpJ2k0J2J2j4jpJ5Mk0J9oNj4K1j6Lj3J0Jj5MPQj0j4J0Lk3L7
7536A0%j7K2k8OJRrOKj0J4j2J1j2J5r%J4j7oJ6nJ6j1J0j9J3%k0QOKk1K4k0K0r
7574@nnnLJ7rJ7j5j6K3pJj7J0J3J8k1Rj1rRRpPjpJ0j4J7k1J6j5K2j4Kj6J7j6M
7613gpK1JJ1k4nJ2Nqj0kK4j4J0lOj9J2Mjj2Pjj1K1j2jJ0Pj6K1k9oJ1J1j6J7j5
7651hQRj7K0j8KqJ7j0J0Lj8J4j9kNKJ0%%nj1J3nJ2j0J5Kj4J6J4j6rnJ2l%JqKr
$$ plain form
7372 4 -13 -12 -6 4 3 -15 -7 3 1 14 3 -5 4 4 -8 0 9 11 3 10 6 11 11 -8 4 -4 15 2 -8 5 4 7 -1 13 -5 1 -1 -11 6 -11 -12 3
7414 3 1 -12 5 -10 15 -6 1 17 8 -13 2 -10 3 9 12 15 2 10 8 0 14 -3 8 11 2 -1 -10 5 4 -18 -15 -7 -14 4 -2 -6 -11 -13 -8 -17 -21 -11 -17
7457 -17 -4 -15 -20 -1 -6 4 -14 -1 5 13 -3 -18 -7 -8 2 7 8 9 5 6 -11 8 17 4 8 12 -2 -1 12 8 -2 0 4 0 12 3 -7 -7 -13 -3 19
7498 19 -4 -25 -1 -2 -8 11 7 0 12 -8 4 16 2 1 -6 9 13 -7 12 6 11 -3 18 2 5 -8 2 3 -12 -8 -1 7 -3 -17 -7 -4 -27 10
7536 10 10 -7 15 -13 -7 -6 3 -6 0 2 -8 6 -6 5 -7 8 -1 -1 13 -4 -10 6 1 17 6 16 -3 10 10 -10 -2 4 6 -15 9 -11 9 0
7574 0 -5 -10 -15 -12 5 -4 13 -2 -18 5 -2 -1 -18 -8 5 23 2 11 0 -9 0 9 2 9 8 1 11 -3 14 -7 9 -6 16 2 4 -12 5 -11 -7
7613 -7 -14 7 8 19 -5 -10 2 7 -1 -11 -13 11 -3 7 4 10 -9 3 7 6 -6 1 0 -11 10 -2 -3 7 14 -2 19 -10 -16 -5 6 -10 7 -8
7651 -8 0 9 -8 12 -6 -4 -12 5 -5 5 8 -10 4 -15 -17 -12 -10 0 0 0 -5 -16 -3 -8 4 -6 9 11 -3 13 27 11 2 -3 9 6 6 7 -1 1 -8
7692hOqlRL%QRj9%PnjjjpJ2k1K6rrJ0jJ0oj6K0j2kQRMrLLjlOj8MmRmkj2K1JNj3
7741bokJ1k1K1j2OqJ8k1qJ8K0j4lJ3j8J3Mj9lJ3PQk7J4Lj0K2k2J6omKJ3j8Ro%
7780ALJ3j6k5J1NJ0k6K8j5k0K5PJ3nk5%jPnQK0k9L0j5jJ0Pj8NJ5k0MRQrj0ljJ3
7820HrJ2j4JRlrlLMJ0k2JPlJL%nOj0JJ7pMJLNj4LpJ2Kj0jlJ4Rk3Rj5KOJ3k4J5
7866aj4LJ8j1j8J2kNJRk9K1Pj9J1Kj2J1kJ2MpQlNklNnj8K5lQj2pkPMjkkj3lJ1
7910bjJj8PJ2j3LKJ9j1p%JKj8J2jJ2j2JJ6j7J6Rnk1K0Qk5RJ3j1kkj4K3j6pK9p
7950Ej1qK4m1J8NpJ0j7QLjMOPnj0lJ3klJMOOj2J6k5%J8MlLj0j1KLOj6J5%rL1k7
7994cQpJ0j2oJ8rplQnlKJ2j9MM%kkOOOkOOJj4oMnJ4j2QKj4lK6j1Mj6J5rj2J1R
$$ plain form
7692 -8 -2 -10 -13 -4 -1 -1 7 16 -3 -3 4 -1 -2 -3 -4 -11 1 -20 6 -3 -12 -2 -3 7 1 -15 5 -7 -9 -1 8 12 3 6 9 8 5 11 -7 -3 -7 2 -2 -4 -16 5 6 11 -2
7741 -2 -8 -10 1 -20 1 -11 -5 -13 5 -16 -24 -6 14 0 -3 10 -8 5 9 -10 -13 0 7 15 -12 2 5 -5 17 -5 11 5 1 3 16 -2 7 1 1
7780 1 4 17 1 -24 -13 -8 2 -24 4 -11 -31 -6 1 14 9 -16 -16 -17 -10 -15 -7 13 -16 14 -1 -2 8 15 -3 2 17 -3 1 10 18 9 -1 -4 -5 8
7820 8 -1 11 -3 -2 7 4 -5 -8 -5 -1 9 -13 -12 -5 -8 -7 -4 -4 -9 -3 -13 -12 5 -2 2 3 6 11 -3 0 -7 5 7 -3 -4 -7 7 16 -7 2 -13 -11 -5 8 -16 -1
7866 -1 -15 -12 6 -5 -23 -11 -13 -8 -7 2 -27 -6 1 -18 -7 -5 -17 -6 -8 4 8 1 9 6 11 9 6 11 6 -12 13 10 18 6 -1 -3 4 8 7 5 3 -10 -13 -2
7910 -2 -3 -2 -20 -13 -1 -14 -11 -9 10 -1 -8 -8 -7 -5 -23 -11 -12 0 -12 -11 5 -12 4 13 8 -13 7 15 -10 -1 12 1 -1 -3 -17 6 -10 -17 12 5
7950 5 -6 -14 10 -31 -13 -8 -15 -5 -22 -14 -11 -12 -8 -2 5 0 -10 -13 0 -2 -5 -4 0 6 12 0 16 -9 -9 9 13 10 13 3 -8 -6 -3 3 -13 2 2 -7 24 -3
7994 -3 5 -2 8 -4 -10 8 -1 -8 -11 -3 -8 -11 -9 3 -16 -12 -8 -8 -10 -12 -6 0 6 4 10 16 17 3 -3 1 -4 10 -2 6 8 -6 -9 17 6 10 -6 9 0 -12 -1 8
8040Hk3J4j1KlJ3J4k4PM%oNJ5oL%j5J5k1J4J3j7lJMqLNjpJMJ3j8nQmJ1k3J1oK3
8083A0j0k2J8j3J2qJ5j7kJ1Qk1J3jJ5J%Lk8JK3kJ6l0J1kPn%j2K1Kk4J9k1Mk%J8
8122Hk5OJ4p%Noj1J0j7J1J1RpoJ1Lj%oj1J5kJ1j2qOljnQmn%J9kJj1KKj4ojJ0%
8167ij0K8j9nj2J5KLK5noOOk4JJ0Rkj9K6j6Nk3K
$$ plain form
8040 8 -15 -1 -12 -10 -13 0 14 -10 -3 1 1 -5 0 15 9 12 12 -3 12 -9 5 18 1 -2 -1 3 -5 -2 3 2 -5 -4 0 13 -5 -10 -2 -6 5 -18 -7 -13 10
8083 10 0 -22 -4 -17 -5 -13 2 -15 -17 -6 2 -19 -6 -7 8 9 9 12 -16 -15 8 6 22 -8 3 1 8 3 3 -9 12 14 -10 9 -12 -8 -10 -10 8
8122 8 -17 -11 3 -4 -4 1 -5 -16 -6 -23 -12 -1 8 1 -5 6 9 8 8 2 -9 6 4 15 3 -5 1 -2 -3 -8 0 -4 -9 -9 10 8 9 -2 0 2 -12 -18 -19 -9 -9
8167 -9 -19 9 -10 -15 -27 -12 -10 -7 18 13 7 13 19 -5 -4 6 15 13 -6 20 4 9 -14 -12
8191a2
##END NTUPLES=NMR FID
##END=
