##TITLE=1H_NV118
 
 8 sc, 
 9.2.2024
##JCAMPDX= 6.0         $$ Bruker NMR JCAMP-DX V2.0
##DATA TYPE= NMR FID
##DATA CLASS= NTUPLES
##ORIGIN= UXNMR, Bruker Analytische Messtechnik GmbH
##OWNER= root
$$ XWIN-NMR		Version 3.5
$$ Fri Feb  9 14:31:03 2024 Russian Standard Time (UT+4h)  she@DPX200
##.OBSERVE FREQUENCY= 200.1313
##.OBSERVE NUCLEUS= ^1H
##.DELAY= (6, 6)
##.ACQUISITION MODE= SIMULTANEOUS
##.ACQUISITION SCHEME= undefined
##.AVERAGES= 8
##.DIGITISER RES= 18
##SPECTROMETER/DATA SYSTEM= spect
##.PULSE SEQUENCE= zg30
##.SOLVENT NAME= DMSO
##.SHIFT REFERENCE= (INTERNAL, DMSO, 0, 15.7039)
##AUDIT TRAIL= $$ (NUMBER, WHEN, WHO, WHERE, WHAT)
$$ ##TITLE= Audit trail, XWIN-NMR		Version 3.5
$$ ##JCAMPDX= 5.01
$$ ##ORIGIN= Bruker BioSpin GmbH
$$ ##OWNER= she
$$ F:/spectra/data/she/nmr/H-F/1/audita.txt
$$ ##AUDIT TRAIL=  $$ (NUMBER, WHEN, WHO, WHERE, WHAT)
(   1,<2024-02-09 14:29:48.54 +0400>,<she>,<DPX200>,
      <created by zg, POWCHK disabled, PULCHK disabled
       configuration hash MD5:
       00 E9 B6 7A A2 85 ED C7 34 08 36 98 17 FE 4E 26
       data hash MD5: 16K
       55 92 91 B4 BF CB 9A BB 1B CF 08 3C 48 6A 14 33>)
$$ ##END=
$$ 
$$ hash MD5
$$ E9 C0 12 70 DB CD 52 AC 00 8F 06 10 6A 41 7D D9
##$RELAX= 
##$RELAX= 
##$RELAX= 
##$RELAX= 
##$RELAX= 
##$RELAX= 
$$ Bruker specific parameters
$$ --------------------------
##$DU= <F:/spectra>
##$EXPNO= 1
##$NAME= <H-F>
##$PROCNO= 1
##$TYPE= <nmr>
##$USER= <she>
##$AMP= (0..31)
100 100 100 100 100 100 100 100 100 100 100 100 100 100 100 100 100 100 
100 100 100 100 100 100 100 100 100 100 100 100 100 100 
##$AQSEQ= 0
##$AQ_mod= 1
##$AUNM= <au_zg>
##$AUTOPOS= <>
##$BF1= 200.13
##$BF2= 200.13
##$BF3= 200.13
##$BF4= 200.13
##$BF5= 200.13
##$BF6= 200.13
##$BF7= 200.13
##$BF8= 200.13
##$BYTORDA= 1
##$CFDGTYP= 0
##$CFRGTYP= 5
##$CHEMSTR= <none>
##$CNST= (0..31)
1 1 145 1 1 1 1 1 1 1 1 1 1 1 1 1 1 1 1 1 1 1 1 1 1 1 1 1 1 1 1 1 
##$CPDPRG= <>
##$CPDPRG1= <>
##$CPDPRG2= <>
##$CPDPRG3= <>
##$CPDPRG4= <mlev>
##$CPDPRG5= <mlev>
##$CPDPRG6= <mlev>
##$CPDPRG7= <mlev>
##$CPDPRG8= <mlev>
##$CPDPRGB= <>
##$CPDPRGT= <>
##$D= (0..31)
0 1.2 0 0 0 0 0 0 0 0.06 0 0.03 0 0 0 0 0.0002 0 0 0 0 0 0 0 0 0 0 0 0 
0 0 0 
##$DATE= 1707474588
##$DBL= (0..7)
120 120 120 120 120 120 120 120 
##$DBP= (0..7)
150 150 150 150 150 150 150 150 
##$DBP07= 0
##$DBPNAM0= <>
##$DBPNAM1= <>
##$DBPNAM2= <>
##$DBPNAM3= <>
##$DBPNAM4= <>
##$DBPNAM5= <>
##$DBPNAM6= <>
##$DBPNAM7= <>
##$DBPOAL= (0..7)
0.5 0.5 0.5 0.5 0.5 0.5 0.5 0.5 
##$DBPOFFS= (0..7)
0 0 0 0 0 0 0 0 
##$DE= 6
##$DECBNUC= <off>
##$DECIM= 32
##$DECNUC= <off>
##$DECSTAT= 4
##$DIGMOD= 1
##$DIGTYP= 9
##$DL= (0..7)
0 120 120 120 120 120 120 120 
##$DP= (0..7)
150 150 150 150 150 150 150 150 
##$DP07= 0
##$DPNAME0= <>
##$DPNAME1= <>
##$DPNAME2= <>
##$DPNAME3= <>
##$DPNAME4= <>
##$DPNAME5= <>
##$DPNAME6= <>
##$DPNAME7= <>
##$DPOAL= (0..7)
0.5 0.5 0.5 0.5 0.5 0.5 0.5 0.5 
##$DPOFFS= (0..7)
0 0 0 0 0 0 0 0 
##$DQDMODE= 0
##$DR= 18
##$DS= 0
##$DSLIST= <SSSSSSSSSSSSSSS>
##$DSPFIRM= 0
$$ [...]
##$SUBNAM2= <"">
##$SUBNAM3= <"">
##$SUBNAM4= <"">
##$SUBNAM5= <"">
##$SUBNAM6= <"">
##$SUBNAM7= <"">
##$SUBNAM8= <"">
##$SUBNAM9= <"">
##$SW= 18.0517328524113
##$SWIBOX= (0..15)
0 0 2 0 0 0 0 0 0 0 0 0 0 0 0 0 
##$SW_h= 3612.71676300578
##$TD= 16384
##$TD0= 1
##$TE= 0
##$TE2= 300
##$TE3= 300
##$TEG= 300
##$TL= (0..7)
0 120 120 120 120 120 120 120 
##$TP= (0..7)
150 150 150 150 150 150 150 150 
##$TP07= 0
##$TPNAME0= <>
##$TPNAME1= <>
##$TPNAME2= <>
##$TPNAME3= <>
##$TPNAME4= <>
##$TPNAME5= <>
##$TPNAME6= <>
##$TPNAME7= <>
##$TPOAL= (0..7)
0.5 0.5 0.5 0.5 0.5 0.5 0.5 0.5 
##$TPOFFS= (0..7)
0 0 0 0 0 0 0 0 
##$TUNHIN= 0
##$TUNHOUT= 0
##$TUNXOUT= 0
##$USERA1= <user>
##$USERA2= <user>
##$USERA3= <user>
##$USERA4= <user>
##$USERA5= <user>
##$V9= 5
##$VALIST= <valist>
##$VCLIST= <CCCCCCCCCCCCCCC>
##$VD= 0
##$VDLIST= <DDDDDDDDDDDDDDD>
##$VPLIST= <PPPPPPPPPPPPPPP>
##$VTLIST= <TTTTTTTTTTTTTTT>
##$WBST= 1024
##$WBSW= 4
##$XGAIN= (0..3)
0 0 0 0 
##$XL= 0
##$YL= 0
##$YMAX_a= 663247
##$YMIN_a= -726291
##$ZGOPTNS= <>
##$ZL1= 120
##$ZL2= 120
##$ZL3= 120
##$ZL4= 120
##$ABSF1= 10
##$ABSF2= 0
##$ABSG= 5
##$ABSL= 3
##$ALPHA= 0
##$AQORDER= 0
##$ASSFAC= 0
##$ASSFACI= 0
##$ASSFACX= 0
##$ASSWID= 0
##$AUNMP= <proc_1d>
##$AZFE= 0.1
##$AZFW= 0.1
##$BCFW= 1
##$BC_mod= 2
##$BYTORDP= 1
##$COROFFS= 0
##$CY= 11.3945322036743
##$DATMOD= 1
##$DC= 2
##$DFILT= <>
##$DTYPP= 0
##$F1P= 15.7292609196834
##$F2P= 12.9074282941183
##$FCOR= 0.5
##$FTSIZE= 0
##$FT_mod= 4
##$GAMMA= 1
##$GB= 0.15
##$INTBC= 1
##$INTSCL= 1
##$ISEN= 128
##$LB= 0.24
##$LEV0= 0
##$LPBIN= 0
##$MAXI= 10000
##$MC2= 0
##$MEAN= 0
##$ME_mod= 0
##$MI= 1.114404
##$NCOEF= 0
##$NC_proc= 0
##$NLEV= 6
##$NOISF1= 3.799351
##$NOISF2= 2.8
##$NSP= 1
##$NTH_PI= 0
##$NZP= 0
##$OFFSET= 15.70392
##$PC= 1
##$PHC0= -24857.51
##$PHC1= 12.65268
##$PH_mod= 1
##$PKNL= yes
##$PPARMOD= 0
##$PSCAL= 0
##$PSIGN= 0
##$REVERSE= no
##$SF= 200.130013532006
##$SI= 16384
##$SIGF1= 3
##$SIGF2= 2
##$SINO= 400
##$SIOLD= 16384
##$SREGLST= <1H.CDCl3>
##$SSB= 0
##$STSI= 0
##$STSR= 0
##$SW_p= 3612.71676300578
##$SYMM= 0
##$S_DEV= 0
##$TDeff= 0
##$TDoff= 0
##$TI= <>
##$TILT= no
##$TM1= 0
##$TM2= 0
##$TOPLEV= 0
##$USERP1= <user>
##$USERP2= <user>
##$USERP3= <user>
##$USERP4= <user>
##$USERP5= <user>
##$WDW= 1
##$XDIM= 8192
##$YMAX_p= 0
##$YMIN_p= 0
$$ End of Bruker specific parameters
$$ ---------------------------------
##NTUPLES= NMR FID
##VAR_NAME=  TIME,          FID/REAL,        FID/IMAG
##SYMBOL=    X,             R,               I
##VAR_TYPE=  INDEPENDENT,   DEPENDENT,       DEPENDENT
##VAR_FORM=  AFFN,          ASDF,            ASDF
##VAR_DIM=   8192,          8192,            8192
##UNITS=     SECONDS,       ARBITRARY UNITS, ARBITRARY UNITS
##FACTOR=    0.0002768,     1,               1
##FIRST=     0,             0,               0
##LAST=      2.2672688,     0,               0
##MIN=       0,             -726291,         0
##MAX=       2.2672688,     663247,          0
$$ Real data points
##PAGE= N=1
##DATA TABLE= (X++(R..R)), XYDATA
0 0 0 0 0 0 0 0 0 8 -8 8 -8 16 -16 16 -24 32 -40 48 -56 72 -88 99 -120 144 -168 192 -224 262 -302 345
30 345 -394 450 -513 579 -652 736 -827 924 -1034 1155 -1285 1428 -1584 1752 -1940 2144
46 2144 -2363 2605 -2874 3165 -3486 3840 -4235 4672 -5160 5712 -6342 7065 -7901 8888
60 8888 -10077 11529 -13356 15738 -18983 23681 -31112 44666 -77232 317003 23120 -726291
72 -726291 199810 646959 -213688 -652227 291236 537980 -376936 -550005 411430 439018
82 439018 -475774 -400430 535239 342675 -526958 -245833 594842 210593 -561405 -120333
92 -120333 579703 43626 -580174 3378 538743 -116735 -552104 152049 502314 -234312
102 -234312 -474177 293564 453957 -319082 -382696 386866 361768 -399343 -290248 432496
112 432496 225422 -465586 -177930 455939 86641 -488886 -45221 473213 -23430 -469994
122 -469994 84029 468430 -119005 -425819 188343 413140 -216413 -361725 261862 316131
132 316131 -303271 -280150 319248 215599 -362784 -183376 371031 127406 -387073 -76881
142 -76881 398768 40804 -379046 22518 383262 -53212 -353890 106153 335842 -152387
152 -152387 -317841 184498 277081 -237472 -260290 257440 216801 -287777 -181495 308918
162 308918 151257 -308564 -96545 329234 66758 -318793 -12654 319568 -34157 -316771
172 -316771 68737 291721 -122157 -289636 143173 259210 -179264 -237649 206133 214756
182 214756 -217799 -169278 247773 143959 -250437 -97225 263041 57728 -273572 -29544
192 -29544 264496 -18351 -276367 39269 260366 -76714 -250035 108420 237974 -126095
202 -126095 -203273 163433 189461 -175675 -154353 200546 126182 -222778 -104295 227675 63198
213 63198 -248374 -43377 243143 8453 -241400 23336 239347 -43511 -216950 84042
223 84042 213588 -103299 -189646 134287 170287 -161715 -155259 172247 122407 -196512 -108039
234 -108039 198270 78385 -205261 -49999 212163 28735 -202041 11002 207427 -32702
244 -32702 -194799 63439 185392 -91598 -180621 104979 158434 -133259 -151182 142774 127510
255 127510 -157754 -102935 172883 83966 -172851 -48700 186637 29312 -185385 -1823
265 -1823 186446 -25604 -190747 41256 177033 -71044 -174313 84964 156551 -103302
275 -103302 -137073 123463 123909 -130583 -95773 151338 80872 -158788 -57636 166619 33047
286 33047 -176074 -18585 168720 -8792 -170947 23717 161341 -43506 -149982 67667
296 67667 144660 -80666 -124571 105849 115254 -118611 -98467 130419 79384 -144530 -68912
307 -68912 144222 45106 -153199 -29821 152107 8813 -148530 16826 149660 -32426
317 -32426 -137870 57713 134976 -72722 -125939 87012 113170 -104630 -106096 110219 85659
328 85659 -123320 -70949 128212 51941 -130505 -28792 137907 14571 -134678 8447
338 8447 138586 -23984 -136086 39634 128629 -58408 -124528 67370 109007 -82841 -98180
349 -98180 92735 84209 -101425 -66109 114952 54311 -119320 -34556 127832 20056 -130273
360 -130273 -5733 127542 -12016 -127923 22463 118832 -40118 -113648 54133 104640
370 104640 -67841 -91764 84510 83405 -92906 -68634 104079 57829 -110382 -46287 112778
381 112778 30393 -117800 -18718 114712 142 -114216 15525 110347 -30392 -103475 47429
392 47429 100695 -57614 -91805 71139 85385 -80522 -76182 87187 62314 -95457 -51084
403 -51084 97159 34526 -101168 -20294 103439 6801 -103029 9628 105698 -20629 -101545
414 -101545 35027 98390 -45714 -91849 54297 81436 -64724 -73271 70922 60616 -79713
425 -79713 -48961 87381 37423 -91986 -23099 97657 12612 -97848 -484 97295 -10574
436 -10574 -95349 20043 89337 -32821 -84879 42892 76251 -54784 -67817 65010 59169
447 59169 -72590 -49272 79838 40821 -84057 -31280 86753 20435 -88471 -9661 86818
458 86818 -3377 -84824 15369 80983 -27062 -76513 38230 72482 -47445 -67000 56413
469 56413 60994 -63475 -53105 68715 43484 -72546 -33001 74898 21972 -76183 -10336
480 -10336 77872 -409 -78123 11916 78143 -22133 -75988 31557 72095 -39665 -66401
491 -66401 46535 59371 -52582 -51151 58706 42287 -64340 -32339 69569 22158 -73551
502 -73551 -12309 75607 2705 -76230 5651 74800 -13855 -72181 22173 68206 -30488 -62308
514 -62308 39316 55719 -47408 -48349 54349 40387 -60756 -33838 64472 25797 -68635 -19042
526 -19042 69738 10160 -70074 -937 68896 -8060 -65308 18460 62790 -26695 -58583 35409
538 35409 54656 -43641 -51095 49203 44292 -55879 -38743 58651 30255 -60994 -21246 63200
550 63200 13659 -62280 -2491 64767 -4964 -63245 15033 62642 -23628 -61029 29530 55494
562 55494 -37394 -52275 40863 45173 -45910 -38114 51178 31776 -53550 -21275 59188 14607
574 14607 -60170 -5594 61629 -2320 -62759 7310 59386 -16013 -59114 20853 54069 -28334
586 -28334 -48820 35868 44168 -40361 -35895 47699 31232 -51126 -24776 54445 17926 -58437
598 -58437 -13382 57383 4104 -58828 1883 55995 -9844 -52823 18458 51274 -23698 -45949
610 -45949 32436 44129 -37594 -39612 42598 33724 -47954 -29772 48398 21230 -51467 -15516
622 -15516 51432 8224 -51100 718 53075 -6365 -50376 15920 50783 -21349 -47847 26837
634 26837 43684 -32715 -41258 34566 34306 -39878 -29694 42657 22986 -45107 -14540 49329 9473
647 9473 -48750 -911 51015 -3880 -50335 9068 48174 -15943 -47828 19189 42058 -26660
659 -26660 -38952 30944 33431 -35182 -26894 41023 23734 -42401 -16712 46766 12609 -48177
671 -48177 -7473 47512 -174 -48736 3897 44340 -12030 -43228 17174 40281 -22234 -35846
683 -35846 29795 35028 -32299 -28952 38114 25726 -40344 -21171 40644 13960 -43606 -10749
695 -10749 41384 2638 -42849 2966 42671 -8510 -40193 16784 41082 -19483 -36484 25600
707 25600 34731 -28744 -31624 30584 25468 -35688 -22711 36066 14984 -39594 -9423 41357 4346
720 4346 -40730 3062 43219 -5772 -40826 11855 40408 -16133 -38526 19438 33351 -25656
732 -25656 -31010 27594 24589 -32213 -20416 35366 16619 -36707 -10584 40457 7900 -39819
744 -39819 -1918 40303 -2786 -39320 6667 35813 -13125 -35120 16195 31035 -22038 -28920
756 -28920 26557 26425 -29566 -21544 34299 19373 -34607 -13799 36595 9752 -37183 -5549 36101
769 36101 -1266 -37620 5095 35398 -11996 -35012 16844 33537 -20237 -29912 25374 29036
781 29036 -26332 -24085 29920 20716 -31976 -16568 32493 9602 -35674 -6266 34462 -262
793 -262 -35764 4372 35940 -7449 -33745 13150 34402 -14763 -30198 19659 27645 -22939 -24423
806 -24423 24608 18582 -29449 -16753 30113 11358 -33291 -7670 35442 4798 -34452 1416
818 1416 36248 -3578 -33285 8799 31821 -13169 -30554 15829 26224 -22098 -25552 24236
830 24236 21278 -28099 -17886 31076 15666 -30631 -10046 33092 7924 -31794 -2988 31553
842 31553 -2098 -32021 5312 29198 -11708 -29444 14382 26862 -17985 -24614 21471 23573
854 23573 -22210 -19147 25750 17030 -26528 -12466 27799 7394 -29765 -4283 28878 -1380
866 -1380 -30598 4128 29976 -7934 -29193 12010 28868 -14073 -25353 18291 23401 -20184
878 -20184 -19496 22601 15635 -25440 -12987 26452 8413 -29061 -5674 29500 1954 -29462 1893
891 1893 29368 -4256 -26869 8398 25902 -10835 -23324 14378 21047 -17929 -19138 20169 15660
904 15660 -23417 -13722 24321 10430 -25529 -7539 26245 4920 -25586 -551 26228 -2486
916 -2486 -24965 6955 24167 -10876 -23266 13544 20983 -17216 -20230 18645 17483 -21044 -15103
929 -15103 22698 12325 -23151 -7781 24799 4894 -24280 -526 24736 -2873 -24969 5407
941 5407 23773 -9294 -23940 11026 21639 -13915 -19596 16106 17338 -17148 -13484 19787 11459
954 11459 -20547 -7913 22406 4896 -23950 -2515 23742 -1318 -24533 3296 23154 -6251
966 -6251 -21879 9158 20887 -11091 -18132 14841 16847 -16930 -14081 19455 11450 -21684 -9546
979 -9546 22068 6263 -23356 -4336 23034 1369 -22670 2054 22525 -4667 -20727 8631
991 8631 19995 -11166 -18282 13666 16548 -16136 -15498 17178 12881 -19179 -11086 19734 8002
1004 8002 -20390 -4747 20929 1972 -20429 1669 20968 -4016 -20434 7000 20108 -9647
1016 -9647 -19455 11544 17444 -14048 -15933 15151 13086 -16840 -10650 18227 8131 -19138 -4895
1029 -4895 20790 2685 -21010 496 21486 -2903 -21048 4947 19682 -7615 -18970 9106
1041 9106 16772 -11761 -15145 13947 13154 -15705 -10377 18054 8744 -18611 -6017 19793 4137
1054 4137 -20092 -2129 19663 -821 -19872 2898 18475 -6158 -17636 8760 16441 -10882
1066 -10882 -14626 13568 13860 -14763 -11829 16580 10214 -17698 -8168 17984 5055 -18868 -2979
1079 -2979 18198 -317 -18415 2789 18232 -5117 -17496 8037 17468 -9603 -15861 11877
1091 11877 14585 -13294 -12763 14168 10126 -15748 -8448 16194 5454 -17589 -3174 18323 802
1104 802 -18387 2124 18948 -3617 -17749 6068 17202 -7662 -16006 9289 14016 -11778 -12848
1117 -12848 12973 10185 -15144 -8368 16326 6400 -16894 -3989 18034 2796 -17554 -206
1129 -206 17765 -1714 -17185 3800 15833 -6757 -15289 8276 13351 -10746 -12398 12443 11279
1142 11279 -13573 -9274 15493 8288 -15600 -5647 16503 3598 -16544 -1455 15921 -1578
1154 -1578 -16479 3141 15475 -6031 -15465 7990 14788 -9555 -13116 11756 12390 -12106 -9933
1167 -9933 13525 8305 -14221 -6399 14508 3499 -15987 -2090 15547 -876 -16166 2633
1179 2633 15888 -4086 -14706 6431 14724 -6970 -12675 9234 11670 -10619 -10075 11665 7488
1192 7488 -13854 -6562 13928 3914 -15256 -2565 15702 1189 -15229 1506 15955 -2461
1204 -2461 -14374 5269 13821 -7151 -12843 8453 10727 -11182 -10570 11635 8402 -13488 -7178
1217 -7178 14516 5947 -14178 -3049 15371 2130 -14191 608 14184 -2645 -14182 3926
1229 3926 12755 -6997 -13244 7747 11563 -9695 -10529 11155 9793 -11079 -7117 12920 6454 -12720
1243 -12720 -3999 13519 1723 -14578 -460 13752 -2770 -14877 3631 13829 -5649 -13238
1255 -13238 7459 13074 -7955 -10765 10477 10249 -11019 -7947 12354 5857 -13861 -4823 13579
1268 13579 2032 -15048 -1262 14646 -630 -14454 2680 14581 -3543 -12724 6236 12472
1280 12472 -7167 -10829 8788 9398 -10709 -8934 11092 6712 -13066 -6059 13236 4190 -13592
1293 -13592 -2185 14211 1130 -13124 1617 13666 -2896 -12903 4999 12282 -7348 -12250
1305 -12250 8223 10438 -10528 -10061 11038 8403 -11822 -6587 13044 5648 -12640 -2800 13951
1318 13951 1499 -13680 725 13572 -2992 -13991 3734 12552 -6093 -12772 6671 11449
1330 11449 -8004 -10018 9727 9336 -9848 -6633 11777 5791 -11987 -3904 12552 1921 -13777
1343 -13777 -1393 12951 -1223 -13837 2076 12978 -3783 -11926 6015 11843 -6458 -9610
1355 -9610 9020 9395 -9843 -7971 10949 6170 -12793 -5810 12256 3141 -13526 -2270 13092
1368 13092 623 -12468 1788 13115 -2429 -11536 5229 11748 -6414 -10891 7539 9329 -9630
1381 -9630 -9426 9283 7107 -10897 -6413 11167 5004 -11148 -2509 12538 1838 -11532 955
1394 955 12347 -2119 -12128 3293 11207 -5501 -11726 5656 9932 -7695 -9424 8567 8209
1407 8209 -9109 -5917 10956 5470 -10644 -3068 11935 2012 -12343 -908 11899 -1392 -12777
1420 -12777 1776 11295 -3942 -11067 5076 10305 -5927 -8596 8083 8572 -8319 -6657 9983
1433 9983 5832 -10779 -4887 10647 2759 -11832 -2401 10881 304 -11159 1039 11110 -2067
1446 -2067 -9959 4576 10444 -5084 -9024 6882 8478 -7992 -8036 8101 6151 -9780 -5990 9414
1460 9414 3935 -10237 -2457 10802 1477 -10087 1081 11107 -1548 -10224 3341 10152 -4656
1473 -4656 -10141 5031 8503 -7048 -8469 7163 6674 -8237 -5323 9319 4685 -9054 -2420 10564
1487 10564 2062 -10246 -410 10451 -1057 -10802 1483 9430 -3593 -9693 3964 8421 -5275
1500 -5275 -7500 6727 7225 -6996 -5453 8700 5109 -8897 -3804 9250 2403 -9986 -2022 9174
1514 9174 21 -9773 723 9216 -2147 -8683 3960 8834 -4487 -7507 6262 7420 -6797
1527 -6797 -6556 7416 5349 -8515 -4937 8286 3049 -9191 -2090 9150 722 -8994 987 9510
1541 9510 -1557 -8729 3210 8935 -3933 -8402 4746 7430 -5984 -7083 6118 5548 -7183
1554 -7183 -4766 7582 3731 -7882 -2330 8778 1759 -8602 -255 9034 -603 -8871 1489 8258
1568 8258 -2808 -8184 3367 7170 -4704 -6741 5610 5973 -6447 -4874 7581 4312 -7862
1581 -7862 -3092 8443 2220 -8639 -1359 8410 -53 -8677 846 8070 -2321 -7885 3393 7464
1595 7464 -4260 -6684 5397 6420 -5780 -5514 6569 4909 -6954 -4067 7114 2875 -7559
1608 -7559 -2045 7409 757 -7608 207 7627 -1103 -7424 2288 7546 -2878 -6925 3929 6569
1622 6569 -4575 -5867 5158 4898 -5978 -4256 6277 3007 -7073 -2248 7397 1230 -7665 -111
1636 -111 7948 -584 -7530 1686 7433 -2371 -6902 3178 6219 -4167 -5857 4668 4854 -5663
1650 -5663 -4336 6065 3523 -6407 -2694 6839 2236 -6693 -1227 6889 562 -6734 293 6396 -1453
1665 -1453 -6408 2041 5750 -3160 -5627 3775 5200 -4372 -4569 5195 4258 -5367 -3214 5984 2489
1680 2489 -6129 -1560 6176 399 -6529 268 6280 -1397 -6399 2183 6236 -2813 -5645 3757 5470
1695 5470 -3942 -4543 4611 3977 -4979 -3327 5162 2294 -5788 -1876 5725 867 -6071 -266 6074
1710 6074 -262 -5749 1091 5775 -1440 -5254 2199 4882 -2906 -4555 3352 3726 -4295 -3445 4568
1725 4568 2689 -5084 -2085 5476 1616 -5416 -684 5735 135 -5484 798 5293 -1705 -5163 2298
1740 2298 4608 -3201 -4433 3689 3985 -4145 -3426 4674 3085 -4705 -2234 5043 1667 -5006 -973
1755 -973 4926 148 -5072 354 4842 -1146 -4864 1675 4711 -2137 -4293 2782 4125 -2975 -3468
1770 -3468 3472 3017 -3813 -2473 4064 1679 -4560 -1160 4639 360 -4904 241 4901 -800 -4735
1785 -4735 1475 4600 -1944 -4198 2541 3776 -3151 -3344 3541 2652 -4126 -2248 4325 1610 -4601
1800 -4601 -1164 4689 674 -4681 -88 4633 -404 -4378 1044 4168 -1582 -3840 2132 3559 -2593
1815 -2593 -3245 3043 2933 -3391 -2558 3697 2119 -3906 -1588 4048 993 -4076 -336 4118 -248 -4066
1831 -4066 961 4087 -1533 -3910 2107 3712 -2651 -3447 2982 2955 -3395 -2570 3576 1944 -3852 -1399
1847 -1399 4049 817 -4136 -151 4293 -341 -4214 873 4110 -1328 -4001 1624 3627 -2132 -3393
1862 -3393 2423 2944 -2864 -2467 3242 2043 -3471 -1507 3768 1073 -3939 -659 3984 92 -4101
1877 -4101 276 3902 -912 -3808 1411 3520 -1932 -3185 2490 2933 -2889 -2532 3343 2187 -3649
1892 -3649 -1778 3835 1261 -3999 -803 3972 240 -3933 382 3873 -827 -3679 1458 3638 -1881
1907 -1881 -3363 2347 3104 -2711 -2839 2933 2359 -3237 -2036 3306 1491 -3552 -1014 3685 464 -3742
1923 -3742 115 3806 -598 -3774 1057 3640 -1513 -3534 1841 3188 -2335 -2917 2634 2423 -3017
1938 -3017 -1984 3339 1517 -3570 -991 3784 605 -3853 -113 3919 -339 -3855 781 3640 -1279
1953 -1279 -3490 1689 3112 -2174 -2836 2543 2504 -2898 -2124 3238 1807 -3424 -1342 3612 933 -3686
1969 -3686 -500 3622 -52 -3629 466 3454 -1056 -3403 1496 3200 -1957 -2942 2432 2777 -2678
1984 -2678 -2342 3004 2025 -3164 -1616 3315 1069 -3527 -667 3497 23 -3627 412 3576 -891
1999 -891 -3482 1374 3395 -1661 -3113 2088 2875 -2419 -2541 2676 2029 -3055 -1724 3171 1142 -3454
2015 -3454 -742 3567 376 -3577 175 3717 -466 -3498 1001 3396 -1382 -3161 1749 2815 -2228
2030 -2228 -2590 2515 2189 -2886 -1834 3190 1548 -3300 -1038 3514 701 -3511 -236 3482 -268
2045 -268 -3492 602 3224 -1231 -3212 1561 2940 -2052 -2704 2441 2512 -2659 -2096 2953 1797 -3105
2061 -3105 -1379 3203 851 -3407 -494 3331 -112 -3432 517 3368 -946 -3226 1429 3189 -1665
2076 -1665 -2867 2103 2655 -2351 -2323 2591 1855 -2938 -1539 3000 1013 -3282 -682 3337 261 -3408
2092 -3408 189 3419 -508 -3273 978 3166 -1302 -2906 1708 2631 -2079 -2373 2377 2012 -2719 -1737
2108 -1737 2926 1348 -3162 -964 3252 615 -3251 -133 3282 -207 -3166 706 3086 -1105 -2936
2123 -2936 1493 2680 -1957 -2575 2163 2187 -2558 -1996 2691 1623 -2874 -1228 3030 873 -3062 -395
2139 -395 3117 -55 -3146 415 3019 -899 -3056 1169 2852 -1554 -2697 1879 2480 -2054 -2051 2466
2155 2466 1874 -2518 -1364 2784 1022 -2954 -682 2979 213 -3161 50 3072 -472 -2995 859
2170 859 2925 -1074 -2609 1567 2505 -1808 -2193 2101 1855 -2472 -1695 2541 1214 -2872 -1011 2871
2186 2871 648 -2906 -219 3006 -20 -2816 519 2817 -857 -2691 1183 2444 -1649 -2389 1786
2201 1786 2057 -2140 -1888 2305 1622 -2419 -1241 2615 977 -2620 -534 2700 160 -2791 96 2642
2217 2642 -601 -2719 769 2545 -1142 -2437 1418 2295 -1598 -1949 1928 1771 -2046 -1418 2247 1107
2233 1107 -2449 -847 2508 465 -2634 -170 2645 -118 -2536 490 2570 -674 -2311 1078 2222
2248 2222 -1284 -2002 1561 1761 -1859 -1595 1977 1261 -2196 -1081 2258 787 -2327 -533 2363 266
2264 266 -2333 59 2290 -370 -2245 618 2106 -942 -2031 1140 1855 -1403 -1745 1549 1499 -1726
2280 -1726 -1287 1856 1029 -1950 -723 2037 463 -2071 -133 2121 -144 -2089 398 2059 -662
2295 -662 -1963 850 1820 -1074 -1655 1242 1450 -1449 -1232 1564 1025 -1679 -789 1801 580 -1865 -358
2312 -358 1894 167 -1903 37 1846 -220 -1782 431 1674 -605 -1567 836 1470 -1007 -1294 1203
2328 1203 1168 -1327 -994 1430 821 -1523 -633 1567 420 -1585 -191 1551 -64 -1556 272 1477
2344 1477 -516 -1450 676 1304 -855 -1246 971 1086 -1099 -955 1186 793 -1226 -611 1286 440 -1310
2361 -1310 -257 1345 118 -1345 39 1365 -153 -1315 317 1293 -380 -1211 531 1123 -632 -1030
2377 -1030 731 863 -881 -767 957 611 -1069 -471 1119 342 -1127 -183 1158 62 -1096 96
2393 96 1020 -294 -1000 378 842 -569 -800 644 715 -730 -597 845 592 -793 -397 893 363 -861
2411 -861 -266 840 98 -886 -94 804 -73 -873 122 850 -182 -794 305 822 -307 -747 387 659
2429 659 -494 -643 445 433 -622 -439 559 266 -645 -190 693 142 -617 34 679 -25 -571 149 532
2448 532 -243 -504 221 364 -351 -379 355 293 -379 -212 462 268 -385 -154 467 198 -431 -190 383 77 -482
2469 -482 -144 376 4 -455 -22 423 -30 -418 112 471 -76 -392 161 408 -155 -366 163 292 -213 -294
2489 -294 175 169 -200 -148 221 120 -202 -32 267 105 -167 -23 191 52 -152 -79 118 16 -151 -67 93 5
2511 5 -161 -15 177 -17 -210 37 259 -25 -268 84 275 -113 -319 103 266 -184 -310 162 256 -220 -233
2532 -233 275 243 -243 -185 339 235 -287 -171 325 174 -325 -211 291 125 -388 -172 325 78 -385 -74 395
2553 395 47 -404 28 476 -41 -438 122 486 -190 -487 194 393 -324 -433 335 308 -429 -269 521 248
2573 248 -514 -118 672 135 -581 15 681 -25 -660 108 608 -216 -662 225 565 -374 -593 406 555 -475
2593 -475 -519 569 511 -591 -452 669 397 -734 -352 716 198 -837 -204 791 16 -853 48 879 -157
2612 -157 -829 324 873 -354 -785 497 769 -583 -669 656 568 -784 -484 822 349 -897 -225 958
2630 958 179 -948 17 1053 -45 -992 215 1006 -300 -994 375 886 -580 -920 611 772 -773
2647 -773 -728 878 676 -907 -508 1077 510 -1043 -303 1141 198 -1156 -68 1124 -126 -1161 229
2664 229 1086 -412 -1081 577 1045 -647 -898 846 877 -897 -745 1006 589 -1121 -531 1079 264 -1248
2682 -1248 -191 1187 -13 -1253 142 1268 -272 -1204 466 1213 -569 -1116 707 1013 -869 -960
2698 -960 940 762 -1114 -694 1159 537 -1238 -372 1357 274 -1301 -9 1414 -82 -1363 264
2714 264 1283 -494 -1319 568 1126 -801 -1133 883 973 -1051 -832 1202 769 -1222 -526 1349 431
2731 431 -1375 -251 1386 17 -1458 96 1366 -350 -1406 496 1343 -662 -1239 858 1198 -921
2747 -921 -1016 1140 931 -1212 -764 1287 550 -1417 -454 1411 177 -1514 -46 1509 -150 -1487 362
2764 362 1488 -498 -1384 698 1317 -900 -1223 981 1036 -1205 -967 1254 748 -1419 -611 1494 433
2781 433 -1502 -190 1633 66 -1543 189 1583 -353 -1534 547 1415 -800 -1386 897 1238 -1103
2797 -1103 -1101 1240 983 -1337 -772 1484 623 -1514 -406 1576 201 -1639 -37 1558 -267 -1632
2813 -1632 360 1496 -618 -1484 805 1407 -932 -1232 1152 1161 -1246 -979 1405 789 -1516 -629 1557
2830 1557 392 -1671 -218 1682 -12 -1680 228 1682 -392 -1595 629 1546 -809 -1443 979
2845 979 1255 -1197 -1190 1266 923 -1461 -819 1525 579 -1610 -394 1681 186 -1675 20 1668 -239
2862 -239 -1647 452 1583 -674 -1501 829 1394 -1022 -1264 1235 1149 -1345 -946 1483 793 -1561 -563
2879 -563 1659 385 -1704 -171 1708 -86 -1741 259 1674 -505 -1655 682 1533 -904 -1443 1058
2895 1058 1286 -1232 -1144 1361 940 -1487 -755 1560 522 -1656 -322 1685 109 -1708 110 1706
2911 1706 -293 -1632 531 1582 -698 -1477 902 1352 -1093 -1224 1228 1070 -1381 -912 1489 709
2927 709 -1619 -516 1649 302 -1712 -106 1713 -126 -1718 324 1632 -556 -1591 740 1476
2942 1476 -960 -1383 1120 1199 -1280 -1053 1395 869 -1502 -667 1595 469 -1635 -256 1663 28
2958 28 -1655 178 1621 -403 -1582 586 1505 -787 -1410 944 1276 -1130 -1136 1242 951 -1392 -795
2975 -795 1476 573 -1586 -402 1622 161 -1668 16 1639 -257 -1643 458 1575 -644 -1474 836
2991 836 1368 -1024 -1226 1180 1080 -1325 -886 1435 707 -1527 -519 1587 300 -1625 -107 1624
3007 1624 -125 -1598 320 1555 -536 -1491 703 1376 -912 -1280 1051 1112 -1227 -1012 1305 803 -1449
3024 -1449 -648 1511 423 -1599 -223 1598 10 -1607 213 1582 -420 -1503 621 1464 -795
3039 -795 -1341 989 1257 -1145 -1092 1275 913 -1393 -748 1492 517 -1560 -337 1583 124 -1606 89
3056 89 1606 -289 -1562 479 1474 -698 -1425 845 1264 -1051 -1161 1163 974 -1333 -826 1416 629
3073 629 -1511 -447 1560 241 -1607 -43 1594 -168 -1594 375 1537 -586 -1454 786 1352 -964
3089 -964 -1234 1123 1107 -1264 -941 1359 746 -1487 -573 1545 342 -1627 -166 1582 -85 -1635 255
3106 255 1571 -491 -1525 665 1412 -855 -1302 1018 1191 -1191 -1032 1329 873 -1419 -694 1507 490
3123 490 -1577 -285 1611 69 -1621 140 1612 -332 -1559 537 1497 -763 -1400 926 1264 -1105
3139 -1105 -1152 1227 973 -1395 -821 1469 590 -1559 -436 1600 182 -1652 -10 1631 -223 -1639
3155 -1639 406 1550 -621 -1477 822 1369 -999 -1239 1174 1095 -1290 -910 1425 752 -1501 -553 1578
3172 1578 349 -1619 -148 1632 -63 -1636 268 1580 -502 -1535 675 1431 -861 -1328 1032
3187 1032 1194 -1205 -1059 1329 857 -1462 -696 1514 467 -1603 -306 1617 56 -1648 143 1632
3203 1632 -363 -1577 567 1511 -753 -1408 937 1305 -1083 -1132 1231 981 -1367 -818 1468 607 -1558
3220 -1558 -420 1604 215 -1644 4 1621 -214 -1610 405 1539 -607 -1472 785 1354 -990
3235 -990 -1256 1113 1063 -1280 -917 1394 732 -1501 -546 1574 354 -1613 -131 1614 -83 -1616 284
3252 284 1571 -504 -1517 704 1429 -888 -1318 1062 1188 -1196 -1016 1347 847 -1442 -669 1506 457
3269 457 -1609 -282 1576 32 -1643 132 1581 -379 -1557 549 1494 -754 -1391 919 1247 -1095
3285 -1095 -1137 1213 940 -1362 -800 1459 590 -1546 -385 1588 200 -1601 31 1628 -214 -1582
3301 -1582 450 1542 -626 -1436 814 1319 -1004 -1219 1125 1029 -1319 -913 1413 685 -1528 -525 1571
3318 1571 319 -1626 -125 1621 -124 -1627 301 1554 -540 -1531 703 1414 -885 -1304 1065 1180
3334 1180 -1210 -1011 1332 854 -1440 -674 1534 463 -1600 -263 1617 22 -1650 163 1608 -386
3350 -386 -1595 580 1501 -785 -1412 960 1256 -1133 -1148 1247 960 -1405 -811 1472 587 -1597 -409
3367 -409 1617 184 -1673 5 1650 -222 -1632 436 1586 -611 -1487 829 1380 -1000 -1244 1153
3383 1153 1113 -1293 -955 1389 777 -1517 -598 1577 378 -1629 -191 1642 -51 -1666 231 1590
3399 1590 -468 -1584 620 1450 -854 -1372 1008 1219 -1171 -1091 1304 914 -1420 -737 1520 552 -1573
3416 -1573 -348 1608 129 -1618 67 1631 -265 -1602 486 1523 -667 -1443 867 1335 -1010
3431 -1010 -1209 1152 1037 -1282 -895 1379 706 -1519 -529 1518 301 -1594 -139 1602 -100 -1579
3447 -1579 259 1536 -493 -1501 666 1390 -850 -1276 1011 1127 -1149 -980 1287 833 -1379 -632
3463 -632 1465 479 -1514 -276 1552 68 -1546 122 1528 -327 -1482 495 1400 -693 -1336 816
3479 816 1199 -1017 -1099 1117 925 -1247 -794 1314 595 -1418 -441 1439 226 -1495 -59 1482 -154
3496 -154 -1461 336 1411 -505 -1337 670 1261 -829 -1128 989 1013 -1091 -862 1204 705 -1297 -540
3513 -540 1358 357 -1408 -200 1419 -10 -1424 162 1385 -363 -1348 501 1255 -688 -1188 835
3529 835 1039 -975 -954 1065 777 -1189 -653 1252 482 -1319 -304 1346 142 -1353 42 1346 -201
3546 -201 -1288 392 1260 -542 -1162 695 1084 -832 -980 944 848 -1055 -724 1135 547 -1220 -403
3563 -403 1233 230 -1284 -76 1266 -108 -1274 232 1230 -397 -1181 546 1062 -706 -1005 801
3579 801 882 -953 -758 1017 626 -1086 -483 1146 322 -1200 -176 1202 18 -1188 136 1196 -282
3596 -282 -1114 432 1069 -561 -990 692 883 -807 -809 885 645 -996 -552 1017 387 -1092 -293 1091
3614 1091 108 -1129 14 1115 -180 -1082 307 1022 -457 -984 578 892 -684 -797 783 682 -877
3631 -877 -576 952 462 -982 -308 1020 175 -1051 -41 1041 -93 -1031 212 978 -381 -938 445
3648 445 846 -605 -807 655 686 -789 -603 813 466 -908 -379 935 210 -969 -93 946 -9 -962
3666 -962 145 936 -280 -882 385 833 -485 -762 587 696 -671 -591 760 485 -820 -382 852
3683 852 265 -894 -152 892 16 -903 81 868 -203 -860 307 776 -437 -753 512 631 -610 -599
3701 -599 659 468 -750 -394 773 283 -814 -179 825 62 -802 32 830 -154 -777 261 743 -351
3719 -351 -692 448 651 -528 -568 590 494 -655 -399 697 302 -747 -196 744 62 -779 -4 756 -122
3738 -122 -749 191 692 -327 -653 371 571 -466 -524 543 439 -596 -358 648 253 -678 -179 697
3756 697 80 -699 5 712 -101 -673 208 668 -282 -607 376 528 -460 -500 504 411 -576 -361 594 237
3776 237 -650 -186 640 54 -662 5 650 -129 -662 194 606 -275 -588 366 492 -431 -448 490 387 -538
3796 -538 -306 606 222 -618 -151 641 50 -651 46 631 -136 -612 215 573 -292 -547 368 475 -468 -450
3816 -450 502 342 -555 -304 574 184 -636 -132 620 -2 -660 50 622 -170 -629 222 582 -323 -556 398
3836 398 498 -445 -411 531 347 -557 -290 634 177 -653 -117 650 8 -676 81 656 -169 -625 256 592
3856 592 -348 -556 422 490 -511 -440 528 338 -616 -289 625 180 -689 -114 675 0 -709 88 679 -188
3876 -188 -664 290 619 -353 -579 436 536 -519 -463 580 383 -627 -307 692 205 -729 -127 718 16
3895 16 -760 68 725 -198 -724 261 661 -387 -663 443 555 -558 -526 600 418 -678 -359 708 247
3914 247 -774 -133 760 33 -791 56 781 -155 -760 264 755 -361 -675 473 652 -543 -568 629
3932 629 494 -696 -396 752 287 -797 -220 837 83 -854 -10 852 -133 -867 223 788 -345 -790
3950 -790 419 684 -556 -652 627 559 -717 -485 769 380 -817 -272 871 154 -875 -48 906 -66
3968 -66 -878 191 895 -290 -829 423 791 -508 -729 616 634 -695 -578 769 458 -852 -364 880
3986 880 234 -941 -142 925 -22 -977 85 919 -252 -925 359 858 -472 -821 566 739 -670
4003 -670 -666 760 574 -834 -458 902 357 -960 -227 987 111 -991 29 983 -144 -961 272 936
4021 936 -410 -890 503 822 -642 -749 723 643 -830 -563 888 437 -964 -333 978 187 -1049
4038 -1049 -92 1035 -68 -1033 184 1010 -320 -968 445 922 -551 -855 660 770 -768 -663 870
4055 870 577 -922 -433 995 311 -1020 -183 1058 56 -1064 79 1055 -245 -1052 351 964 -495
4072 -495 -938 578 848 -710 -776 800 635 -915 -550 955 424 -1025 -305 1060 158 -1101 -25
4089 -25 1078 -94 -1088 243 1075 -391 -1009 494 945 -630 -865 727 783 -855 -680 929 547 -1003
4107 -1003 -436 1043 292 -1119 -155 1100 4 -1133 112 1091 -270 -1074 375 1017 -542 -967 628
4124 628 843 -771 -775 846 644 -929 -552 1004 440 -1067 -273 1108 147 -1114 -2 1127 -118
4141 -118 -1124 268 1064 -408 -1032 533 969 -647 -879 758 784 -872 -702 960 563 -1063 -445
4158 -445 1052 274 -1151 -167 1131 -3 -1143 120 1104 -272 -1083 422 1032 -537 -944 662 880
4175 880 -783 -777 865 654 -957 -545 1009 435 -1061 -274 1098 163 -1114 -5 1131 -151 -1114
4192 -1114 252 1070 -434 -1036 519 942 -696 -877 751 756 -876 -669 938 551 -1045 -428 1067
4209 1067 279 -1123 -165 1113 -19 -1129 116 1107 -272 -1057 412 1022 -519 -934 656 872 -754
4226 -754 -740 861 651 -934 -536 974 397 -1058 -276 1062 126 -1100 -12 1087 -140 -1069 290
4243 290 1037 -417 -994 506 899 -655 -854 734 724 -858 -658 912 510 -1005 -396 1039 279 -1065
4261 -1065 -110 1081 1 -1065 148 1064 -263 -1002 396 945 -504 -906 632 798 -726 -707 806
4278 806 599 -894 -501 949 370 -997 -251 1020 110 -1031 -25 1011 -153 -1035 253 959 -392
4295 -392 -917 497 842 -607 -779 714 689 -783 -584 864 481 -934 -349 959 221 -988 -107 1006
4313 1006 -6 -999 149 965 -254 -917 384 884 -488 -824 565 732 -682 -663 728 551 -838
4330 -838 -465 849 310 -925 -218 919 91 -945 26 936 -128 -917 250 873 -378 -837 446
4347 446 760 -566 -705 641 609 -707 -506 787 403 -809 -299 863 184 -892 -94 879 -35 -906
4365 -906 131 841 -279 -829 344 756 -459 -718 533 631 -610 -583 666 455 -742 -386 772 260
4383 260 -826 -172 811 71 -820 49 839 -143 -778 248 771 -333 -709 433 629 -516 -584 568
4401 568 492 -647 -426 672 310 -733 -247 736 127 -752 -37 752 -92 -774 158 735 -275 -712 329
4420 329 621 -424 -584 484 507 -565 -434 604 354 -641 -235 692 184 -683 -73 704 -2 -694 86
4439 86 657 -183 -647 247 606 -357 -569 387 502 -479 -445 515 370 -587 -294 571 186 -643 -143 613 13
4460 13 -630 13 597 -150 -620 191 557 -287 -515 344 476 -404 -425 467 341 -496 -292 526 216 -573 -129
4481 -129 555 72 -576 24 563 -109 -540 163 523 -243 -499 287 445 -373 -407 382 314 -462 -285 469 203
4502 203 -513 -129 515 59 -519 7 527 -89 -501 150 466 -216 -459 266 418 -312 -355 378 310 -410 -241
4523 -241 475 190 -472 -132 492 50 -488 10 486 -102 -495 128 438 -211 -425 242 375 -327 -331 326 278
4544 278 -397 -229 407 152 -433 -105 440 39 -473 19 444 -88 -430 154 430 -175 -384 257 357 -272
4564 -272 -300 337 266 -389 -221 405 149 -443 -105 428 31 -452 14 427 -108 -445 152 406 -226 -386 243
4585 243 331 -313 -306 347 227 -381 -208 411 130 -441 -73 438 17 -443 41 454 -103 -393 167 400 -213
4606 -213 -355 281 331 -317 -285 364 221 -393 -178 402 125 -428 -64 427 -13 -439 39 417 -140 -445 169
4627 169 388 -256 -376 262 313 -352 -298 383 225 -416 -161 440 133 -448 -38 461 -23 -454 70 444 -132
4648 -132 -429 195 410 -257 -367 294 323 -347 -287 388 217 -447 -173 449 111 -489 -52 461 -39 -482 74
4669 74 468 -151 -463 196 426 -279 -395 326 359 -372 -307 417 255 -464 -190 489 147 -511 -46 524 -13
4690 -13 -513 77 518 -137 -497 220 479 -293 -423 322 397 -398 -338 434 279 -500 -242 498 128 -545 -103
4711 -103 531 -6 -568 57 526 -158 -536 204 508 -281 -476 349 425 -417 -377 462 324 -518 -273 547 198
4732 198 -577 -109 594 44 -607 35 603 -116 -589 183 568 -262 -535 336 479 -415 -458 456 360 -532 -343
4753 -343 548 248 -606 -176 619 101 -646 -14 639 -68 -655 152 646 -224 -589 313 565 -397 -504 459
4773 459 462 -524 -387 563 315 -610 -249 653 160 -669 -77 696 -34 -680 91 649 -211 -664 268 597 -373
4794 -373 -586 410 511 -531 -476 562 390 -614 -318 663 208 -690 -147 708 38 -718 42 727 -146
4813 -146 -686 234 686 -305 -628 403 587 -469 -530 529 483 -594 -393 647 291 -696 -249 718 139
4832 139 -745 -52 735 -59 -736 145 709 -258 -697 321 647 -424 -621 495 546 -565 -470 620 416
4851 416 -663 -303 737 226 -744 -120 783 25 -780 79 745 -166 -734 280 716 -358 -672 433
4869 433 615 -518 -560 599 453 -657 -400 688 288 -765 -228 743 96 -811 -29 765 -100 -782 181
4888 181 749 -274 -694 364 677 -438 -602 534 543 -602 -465 657 386 -706 -292 752 180 -770
4906 -770 -97 811 13 -784 104 783 -202 -749 283 711 -402 -670 456 585 -547 -550 584 432 -680
4925 -680 -398 715 272 -744 -195 773 107 -764 25 784 -96 -762 206 748 -301 -693 396 636 -472
4944 -472 -601 553 524 -594 -423 679 378 -699 -270 747 147 -769 -94 781 -50 -794 104 735 -237
4963 -237 -750 301 696 -414 -651 491 570 -555 -512 615 413 -680 -338 716 236 -762 -161 745
4981 745 68 -763 43 771 -140 -732 245 730 -323 -682 413 607 -490 -571 540 452 -646 -418 660
5000 660 309 -723 -244 737 148 -751 -32 753 -73 -770 143 722 -257 -690 335 637 -443 -594 503
5019 503 540 -558 -471 639 397 -685 -284 735 215 -741 -124 740 27 -756 59 721 -169 -706 260
5038 260 677 -347 -632 420 565 -510 -523 557 421 -642 -375 653 239 -717 -192 729 73 -759
5056 -759 5 736 -96 -729 199 713 -276 -653 372 624 -428 -554 516 477 -581 -402 623 336 -666
5075 -666 -230 693 158 -705 -65 725 -47 -725 121 693 -212 -671 296 635 -402 -598 438 514 -516
5094 -516 -477 555 373 -619 -299 662 220 -679 -123 714 31 -704 57 710 -126 -657 235 654 -319 -616
5114 -616 402 566 -451 -485 511 430 -568 -346 617 276 -655 -199 679 113 -695 -41 665 -80 -687 149
5134 149 645 -270 -643 309 571 -388 -519 474 464 -515 -386 576 320 -612 -255 649 164 -660 -49 677
5154 677 -16 -648 107 662 -171 -614 260 583 -327 -543 403 491 -476 -433 485 343 -580 -301 591 195 -630
5175 -630 -125 635 41 -645 49 628 -113 -604 210 593 -275 -551 353 492 -405 -430 476 397 -512 -305 574
5196 574 244 -583 -156 619 85 -631 5 613 -80 -612 147 570 -229 -559 297 509 -379 -447 420 392 -486
5217 -486 -338 512 263 -571 -244 562 92 -592 -61 577 -29 -596 116 585 -184 -551 268 507 -317 -453
5237 -453 384 410 -430 -345 498 281 -557 -227 562 133 -573 -72 582 -25 -573 86 559 -177 -560 231 497
5258 497 -317 -496 345 399 -437 -362 459 290 -521 -246 527 179 -559 -97 557 24 -572 53 560 -128 -530
5279 -530 204 524 -262 -467 348 439 -377 -383 449 316 -486 -282 515 181 -571 -133 562 30 -598 18 535
5300 535 -120 -570 177 531 -263 -502 297 439 -391 -409 423 357 -493 -293 508 222 -513 -141 557 88 -560
5321 -560 2 572 -49 -557 143 543 -210 -513 281 486 -353 -427 397 361 -453 -311 496 238 -541 -187 557
5342 557 99 -593 -39 552 -58 -571 113 549 -198 -525 266 486 -338 -450 403 395 -442 -351 488 272 -516
5363 -516 -210 557 163 -588 -73 574 -13 -588 66 568 -150 -560 214 520 -291 -505 327 432 -421 -398
5383 -398 460 305 -528 -279 520 170 -582 -127 559 32 -585 31 586 -130 -568 219 550 -269 -505 338
5403 338 464 -400 -418 451 363 -496 -317 545 221 -553 -140 572 72 -605 -14 575 -84 -599 154 553 -230
5424 -230 -555 275 501 -367 -467 399 385 -480 -346 504 267 -545 -200 578 110 -602 -47 612 -22 -596
5444 -596 110 578 -186 -550 272 538 -333 -479 391 435 -452 -388 510 301 -551 -245 555 167 -597 -109 604
5465 604 -11 -620 37 593 -144 -584 204 542 -291 -519 346 452 -426 -425 447 377 -520 -312 561 228 -586
5486 -586 -156 617 72 -603 19 619 -88 -624 163 592 -251 -552 308 506 -394 -466 447 409 -500 -336 522
5507 522 242 -571 -236 589 112 -636 -63 622 -66 -646 97 589 -210 -598 265 545 -324 -503 399 464
5527 464 -459 -390 509 327 -538 -254 564 190 -603 -109 617 23 -658 59 616 -136 -596 215 564 -301
5547 -301 -555 339 481 -428 -471 457 361 -560 -330 549 228 -613 -180 620 81 -633 11 611 -71 -621 174
5568 174 604 -236 -583 308 513 -382 -478 434 434 -477 -368 519 301 -570 -229 596 149 -638 -81 619 -5
5589 -5 -644 78 586 -182 -608 244 556 -331 -539 368 474 -451 -421 488 345 -539 -306 567 219 -621 -137
5610 -137 617 57 -620 25 626 -83 -603 177 596 -235 -547 312 495 -395 -464 443 393 -501 -364 534 262
5631 262 -579 -215 589 124 -635 -70 616 -27 -623 103 563 -186 -586 259 517 -319 -497 377 426 -454
5651 -454 -399 492 329 -520 -247 554 218 -578 -80 597 42 -597 39 593 -121 -578 174 556 -280 -514
5671 -514 323 462 -377 -440 422 346 -483 -317 510 240 -558 -180 547 84 -583 -40 566 -66 -566 110 542
5692 542 -178 -514 239 498 -308 -446 366 411 -409 -329 470 287 -494 -236 522 145 -539 -86 555 29 -527
5713 -527 69 548 -127 -527 179 491 -256 -462 291 398 -364 -384 373 312 -453 -249 459 193 -496 -131 498
5734 498 72 -510 12 527 -56 -510 119 492 -189 -466 213 435 -290 -371 354 341 -370 -286 412 252 -436
5755 -436 -184 458 105 -487 -68 467 -38 -485 47 454 -147 -457 196 428 -236 -386 292 352 -317 -310 370
5776 370 246 -406 -198 417 146 -444 -90 449 27 -445 38 459 -60 -407 146 414 -182 -385 229 349
5796 349 -285 -323 295 245 -370 -231 359 161 -412 -113 398 58 -415 -9 408 -48 -407 84 367 -161 -385
5817 -385 179 335 -245 -316 272 263 -292 -215 338 184 -329 -126 382 84 -370 -32 393 -18 -393 55 348
5838 348 -122 -366 146 317 -187 -288 230 249 -287 -235 278 152 -320 -157 307 76 -355 -66 336 -2 -363
5859 -363 32 333 -75 -307 137 317 -167 -279 209 255 -221 -208 247 168 -276 -137 305 105 -295 -56 312
5880 312 10 -308 20 295 -65 -298 94 260 -148 -257 171 217 -217 -210 201 174 -265 -144 255 94 -273
5901 -273 -55 283 26 -273 11 280 -34 -255 90 246 -112 -232 160 217 -168 -157 188 135 -229 -124 249
5922 249 70 -255 -66 237 9 -257 20 222 -88 -260 73 207 -140 -218 135 166 -180 -163 180 118 -212
5943 -212 -112 212 52 -245 -47 217 0 -232 38 222 -65 -220 85 198 -114 -171 145 151 -164 -119 175
5964 175 101 -199 -92 192 25 -223 -14 199 -44 -247 48 196 -95 -203 102 185 -143 -174 145 124 -197
5985 -197 -113 193 87 -210 -53 198 25 -217 0 226 -39 -200 62 211 -95 -171 146 179 -147 -147 165 112
6007 112 -207 -110 204 70 -242 -62 223 -2 -253 4 244 -80 -228 69 193 -135 -220 140 173 -181 -160
6028 -160 182 113 -230 -109 223 59 -239 -36 261 -1 -249 45 262 -67 -255 122 233 -149 -204 167 190
6049 190 -216 -170 209 144 -252 -120 249 67 -281 -41 248 -20 -309 24 279 -96 -267 90 257 -160 -232
6070 -232 191 215 -203 -187 236 159 -257 -114 289 95 -293 -56 307 22 -325 22 307 -78 -312 108 305
6091 305 -167 -262 188 236 -246 -237 240 176 -308 -166 293 105 -338 -93 321 8 -363 18 337 -77 -335 88
6113 88 305 -144 -308 183 287 -233 -247 269 224 -293 -181 334 149 -331 -88 364 50 -367 -19 366 -46
6134 -46 -377 83 347 -136 -362 172 312 -225 -315 257 258 -300 -240 320 190 -371 -160 383 90 -407 -52 389
6156 389 -13 -403 61 407 -92 -388 158 367 -197 -329 247 320 -275 -269 335 240 -363 -196 368 141 -414
6177 -414 -102 410 31 -427 -3 404 -82 -435 106 393 -191 -403 206 343 -279 -341 295 282 -341 -249 387
6198 387 181 -406 -166 418 96 -447 -21 449 -20 -441 82 432 -133 -424 201 392 -244 -375 283 337
6218 337 -322 -291 377 238 -403 -202 419 122 -452 -103 438 26 -475 15 448 -89 -457 114 410 -203
6238 -203 -406 243 384 -292 -329 358 302 -378 -245 428 204 -432 -138 468 88 -467 -35 470 -28 -469 96
6259 96 453 -164 -447 205 405 -280 -383 301 321 -348 -324 381 230 -438 -212 420 123 -472 -100 464 0
6280 0 -501 31 461 -82 -459 148 467 -212 -423 269 397 -313 -326 360 301 -401 -236 442 174 -461 -146
6301 -146 466 63 -492 -25 492 -43 -471 84 460 -180 -450 204 413 -284 -430 314 361 -381 -320 374 242
6322 242 -431 -225 446 132 -478 -101 480 35 -504 44 478 -100 -485 142 441 -209 -440 262 392 -313
6342 -313 -343 349 311 -390 -257 424 189 -465 -165 462 70 -492 -44 457 -37 -497 75 449 -154 -457 198
6363 198 422 -272 -393 305 359 -349 -305 374 263 -426 -208 450 143 -463 -95 501 39 -477 39 470 -91
6384 -91 -470 148 454 -202 -425 235 387 -308 -371 321 296 -386 -268 402 198 -435 -172 445 93 -473 -30
6405 -30 453 -11 -472 77 436 -142 -433 188 394 -267 -375 286 343 -326 -290 384 275 -398 -195 430 144
6426 144 -436 -100 440 30 -471 21 431 -74 -426 123 385 -201 -407 210 344 -279 -323 305 268 -365 -246
6447 -246 359 184 -423 -157 397 86 -427 -38 429 -5 -422 81 406 -108 -376 177 392 -215 -330 269
6467 269 330 -285 -275 323 210 -364 -195 358 123 -415 -103 375 28 -415 7 392 -81 -394 84 371 -166
6488 -166 -374 184 302 -238 -304 270 244 -315 -219 325 181 -339 -115 358 86 -365 -22 364 -25 -375 41
6509 41 351 -112 -354 147 326 -190 -312 220 267 -262 -242 260 196 -323 -164 327 112 -335 -83 313 26
6530 26 -359 16 323 -47 -322 92 318 -144 -271 155 287 -197 -230 237 204 -251 -167 249 133 -281 -94
6551 -94 301 62 -313 -14 307 -6 -293 54 288 -88 -302 113 253 -178 -257 169 186 -222 -185 210 160 -250
6573 -250 -129 247 82 -257 -50 262 20 -277 24 259 -62 -250 76 253 -102 -209 158 205 -150 -159 194
6594 194 153 -175 -96 204 70 -244 -61 192 20 -236 -11 214 -50 -235 50 204 -66 -192 85 188 -138
6615 -138 -157 140 128 -168 -125 163 80 -190 -76 181 55 -181 -11 214 11 -179 49 182 -59 -143 91 127
6637 127 -104 -146 99 105 -133 -118 117 38 -156 -65 136 22 -150 -8 146 -20 -157 32 144 -57 -152 48
6659 48 104 -99 -129 89 89 -103 -84 129 65 -128 -25 153 43 -104 -10 123 -18 -131 29 132 -57 -105 61
6682 61 91 -73 -98 64 74 -94 -58 87 46 -107 -36 102 -12 -118 -2 63 -32 -107 37 86 -61 -67 54 74 -63
6707 -63 -64 89 45 -73 -19 75 14 -91 -6 79 -16 -80 26 81 -38 -73 47 53 -52 -47 68 27 -82 -50 77 4 -87
6734 -87 -14 79 -7 -103 9 70 -55 -100 43 57 -63 -73 59 41 -84 -44 89 13 -92 -10 116 3 -97 18
6758 18 106 -41 -86 49 87 -59 -86 70 65 -69 -65 80 34 -116 -40 94 7 -132 -24 102 -21 -145 19 106
6782 106 -60 -121 62 102 -98 -108 87 88 -121 -64 112 41 -127 -20 136 28 -118 16 173 -21 -135 61
6804 61 141 -73 -111 70 105 -103 -98 110 77 -144 -82 149 45 -177 -51 163 -3 -169 0 142 -56 -193 34
6827 34 155 -77 -173 87 124 -126 -116 134 115 -140 -95 153 64 -152 -24 182 27 -201 6 194 -44 -179
6849 -179 34 177 -85 -166 110 160 -145 -169 115 115 -171 -123 166 75 -202 -83 189 31 -207 -3 216 -37
6871 -37 -234 58 212 -68 -198 102 197 -124 -193 146 162 -161 -126 190 132 -198 -93 213 71 -237 -34 240
6893 240 3 -247 11 210 -60 -241 67 199 -134 -217 139 170 -170 -173 192 133 -229 -123 223 73 -256 -60
6915 -60 255 23 -260 -13 275 -27 -264 72 248 -109 -235 134 222 -160 -205 180 185 -202 -145 219 119 -265
6937 -265 -83 249 58 -266 -38 252 -10 -287 35 255 -96 -255 80 245 -156 -252 167 207 -204 -192 221
6958 221 151 -254 -117 258 90 -272 -58 286 29 -280 21 298 -52 -275 79 256 -119 -262 153 241 -197
6979 -197 -218 209 183 -234 -166 242 118 -270 -105 287 54 -310 -52 274 -43 -298 43 287 -106 -278 119
7000 119 241 -160 -245 171 221 -215 -181 238 164 -255 -111 280 94 -287 -25 307 9 -305 11 298 -74
7021 -74 -294 83 259 -149 -286 159 243 -199 -226 204 182 -258 -169 249 105 -277 -101 281 54 -298 -11 300
7043 300 -14 -298 66 277 -98 -273 135 253 -170 -225 205 204 -222 -189 262 161 -256 -101 262 85 -306
7064 -306 -40 276 3 -312 28 271 -77 -297 91 254 -155 -252 168 212 -210 -206 215 161 -256 -141 271 103
7086 103 -283 -63 285 29 -299 10 302 -12 -280 71 279 -106 -257 150 242 -176 -228 193 194 -212 -163 241
7108 241 134 -274 -107 255 56 -307 -47 275 -35 -284 51 269 -76 -274 99 243 -157 -243 181 202 -198
7129 -198 -183 250 158 -230 -114 262 104 -261 -50 277 11 -265 14 267 -56 -268 90 253 -124 -230 157
7150 157 203 -197 -189 191 160 -223 -148 234 94 -274 -67 244 22 -267 -13 273 -40 -270 59 260 -91 -247
7172 -247 135 229 -144 -201 181 183 -205 -150 210 129 -230 -80 251 65 -267 -3 255 -19 -252 57 239 -80
7194 -80 -252 94 219 -147 -212 142 180 -179 -160 196 126 -214 -110 239 80 -251 -45 251 11 -249 27 237
7216 237 -62 -242 109 231 -103 -186 143 181 -155 -142 201 130 -209 -100 232 86 -226 -44 234 11 -236
7237 -236 18 221 -67 -226 68 203 -104 -224 117 168 -165 -167 177 138 -201 -118 201 82 -224 -55 232 35
7259 35 -214 2 222 -31 -216 57 209 -79 -206 107 175 -146 -157 155 130 -184 -134 191 73 -200 -61 206
7281 206 27 -226 -18 199 -30 -230 34 200 -93 -209 88 167 -150 -178 159 126 -177 -115 192 101 -195 -75
7303 -75 216 47 -206 -11 212 -17 -213 44 198 -78 -191 101 173 -143 -164 139 133 -156 -100 181 91 -208
7325 -208 -80 185 33 -227 -20 210 -28 -213 36 186 -68 -192 89 160 -122 -153 141 138 -166 -121 169 100
7347 100 -187 -59 209 57 -214 -7 212 -7 -216 52 206 -62 -213 96 180 -124 -178 134 130 -173 -140 166
7369 166 81 -207 -90 201 50 -216 -41 214 -4 -213 39 213 -78 -217 86 179 -124 -175 143 140 -166 -126
7391 -126 195 118 -191 -72 202 55 -214 -30 225 -16 -256 25 217 -71 -227 93 186 -130 -212 132 150
7412 150 -167 -165 170 117 -233 -101 212 57 -232 -41 231 0 -241 26 223 -63 -234 81 215 -98 -193
7433 -193 150 188 -167 -164 183 135 -211 -111 220 82 -239 -70 241 22 -259 5 250 -36 -242 52 238
7454 238 -129 -237 133 197 -165 -192 195 159 -216 -125 228 110 -242 -69 253 46 -247 15 267 -17 -258
7475 -258 66 250 -89 -239 131 218 -159 -204 184 166 -197 -163 219 123 -256 -107 247 50 -267 -42 261 -11
7497 -11 -285 28 258 -76 -257 101 228 -123 -221 164 196 -203 -178 225 141 -237 -121 250 97 -265 -47 278
7519 278 26 -282 17 277 -45 -278 98 248 -117 -260 130 218 -197 -214 203 172 -245 -161 256 106 -284
7540 -284 -104 273 33 -302 -15 260 -31 -300 62 275 -113 -273 133 264 -152 -243 197 204 -219 -163 238
7561 238 142 -262 -119 266 73 -290 -57 285 -12 -311 26 259 -78 -286 99 265 -159 -271 156 218 -210
7582 -210 -214 220 166 -272 -142 273 86 -297 -74 273 39 -295 19 298 -35 -290 56 294 -123 -273 151
7603 151 255 -186 -230 227 206 -222 -193 258 128 -278 -114 274 68 -305 -36 295 -16 -316 52 276 -88
7624 -88 -294 91 250 -165 -269 172 211 -224 -208 231 157 -249 -136 285 98 -285 -73 314 27 -311 6
7645 6 305 -31 -294 79 282 -139 -270 152 236 -197 -240 194 191 -264 -203 237 114 -303 -118 272 47 -309
7667 -309 -53 296 -8 -308 55 281 -91 -291 96 256 -161 -247 186 214 -228 -194 231 165 -254 -141 267
7688 267 104 -269 -60 297 20 -296 11 288 -57 -296 75 257 -140 -260 140 245 -202 -225 200 176 -229
7709 -229 -163 237 116 -256 -106 281 67 -278 -30 281 -3 -292 32 296 -77 -263 121 254 -138 -230 187
7730 187 204 -186 -175 215 159 -243 -143 250 101 -273 -69 262 14 -291 9 270 -54 -286 66 234 -108
7751 -108 -261 136 213 -194 -208 193 173 -210 -166 223 118 -237 -81 250 59 -250 -26 265 23 -251 19
7772 19 256 -66 -247 114 211 -148 -202 165 202 -168 -158 195 127 -226 -118 215 77 -259 -60 237 0 -248
7794 -248 0 219 -50 -228 49 228 -105 -207 125 195 -142 -175 187 157 -178 -111 221 93 -194 -73 237
7815 237 46 -213 -12 231 -6 -215 35 215 -65 -217 88 182 -130 -192 110 145 -176 -143 149 98 -192 -97
7837 -97 180 45 -208 -24 188 3 -209 1 187 -47 -207 77 184 -85 -181 111 151 -120 -123 144 135 -141
7859 -141 -82 185 85 -163 -44 160 20 -183 -9 168 -31 -188 34 177 -76 -163 66 140 -104 -143 118
7880 118 111 -122 -116 131 70 -148 -65 137 31 -145 -15 167 4 -139 25 159 -41 -122 75 129 -68 -121 94
7903 94 106 -105 -98 113 64 -127 -74 111 40 -144 -24 141 -10 -141 10 109 -46 -139 57 92 -86 -114 86 95
7927 95 -83 -80 103 46 -86 -53 100 43 -94 -10 102 14 -114 16 101 -15 -99 41 95 -48 -83 48 84 -83
7951 -83 -62 83 44 -80 -53 92 8 -109 -18 85 -16 -95 3 80 -36 -90 37 76 -48 -68 69 54 -58 -43 90
7976 90 43 -66 -7 86 26 -78 15 80 -5 -64 45 74 -38 -60 42 56 -45 -43 60 13 -73 -23 81 4 -69 -14 53
8003 53 -23 -109 9 49 -51 -46 52 72 -48 -60 66 45 -58 -27 52 29 -66 -18 72 -11 -57 19 76 -33 -66 26 55 -45
8031 -45 -61 63 51 -71 -49 55 20 -84 -51 98 -7 -83 -16 57 -22 -103 25 58 -53 -75 53 65 -73 -68 79
8056 79 42 -93 -41 88 27 -99 -7 106 -3 -96 25 90 -36 -83 35 97 -53 -81 64 69 -87 -72 86 56 -115
8081 -115 -54 109 4 -107 -25 122 0 -135 -1 110 -45 -130 46 94 -61 -91 89 77 -107 -66 114 63 -114
8104 -114 -63 130 34 -119 -34 139 18 -150 11 152 -22 -122 56 128 -81 -129 71 113 -101 -99 117 74 -120
8127 -120 -74 142 34 -165 -40 141 7 -161 2 170 -36 -162 55 169 -53 -147 105 152 -97 -126 126
8148 126 118 -134 -108 150 67 -175 -30 185 34 -168 -8 184 -10 -184 24 178 -68 -176 88 171 -113 -157
8170 -157 122 138 -158 -126 165 90 -191 -77 186 45 -184 -28 200 -13 -213 28 216 -33 -202 56 190
8191A90
$$ Imaginary data points
##PAGE= N=2
##DATA TABLE= (X++(I..I)), XYDATA
0 0 0 0 0 0 0 0 0 0 0 0 0 0 0 0 8 -8 8 -8 8 -12 9 -16 16 -23 24 -24 32 -36 39 -44 52 -59 63 -70 79 -91 100
37 100 -108 122 -137 150 -164 180 -202 219 -239 264 -294 323 -354 388 -431 475 -526 583 -653 736
57 736 -828 944 -1088 1272 -1509 1831 -2290 2985 -4123 6228 -10879 25213 -152850 -709472
71 -709472 95028 663247 -219631 -671857 240184 582020 -339655 -547112 400419 503084
81 503084 -430778 -406023 523016 385009 -521393 -288336 564565 224697 -586673 -177311
91 -177311 558322 67716 -593828 -31671 552666 -64273 -545613 139422 535968 -184053
101 -184053 -477384 276100 474570 -300123 -414960 354236 370164 -399895 -335089 407200
111 407200 248960 -458559 -208560 457408 130877 -471576 -61034 488351 18286 -464009
121 -464009 62319 477345 -96628 -445265 154846 418895 -206730 -393600 233411 332789
131 332789 -289169 -303211 308491 246510 -340962 -196868 372043 160879 -374018 -96002
141 -96002 399597 63166 -387071 -7799 381266 -40396 -372981 74734 339714 -135010
151 -135010 -332314 164769 295236 -212558 -268300 250786 242637 -268937 -194316 304087 170815
162 170815 -306431 -122748 319337 80119 -327918 -44343 314620 -16202 -323809 47725
172 47725 301859 -97495 -290874 135147 278114 -157581 -244271 197944 231018 -209239
182 -209239 -190740 233620 155789 -252264 -124395 252822 72724 -272968 -46820 267169
192 267169 4492 -270309 31108 272395 -53939 -251268 97518 248901 -114271 -219065
202 -219065 145600 195717 -172062 -175395 184339 136123 -215991 -118629 223600 82924 -238289
213 -238289 -51458 249486 29565 -238867 11547 244432 -30730 -226948 64042 214560
223 214560 -95948 -205101 115319 176265 -152267 -166099 165426 137899 -184852 -113934 200345
234 200345 96523 -198705 -61000 212117 41842 -206226 -8804 204107 -24001 -204252
244 -204252 45059 186872 -81210 -185916 96797 168956 -119201 -153917 140560 142699 -147405
255 -147405 -112454 168465 95802 -172001 -66232 179132 37107 -188731 -18331 183248
265 183248 -14771 -191228 32171 183931 -55914 -174872 80402 168545 -91513 -144289
275 -144289 116044 132473 -126168 -109882 140280 86765 -157635 -71925 160483 42888 -173815
286 -173815 -26912 172602 5338 -168938 18282 168867 -31045 -153514 57584 148975
296 148975 -73532 -134946 92589 118474 -114738 -109311 122567 86814 -139585 -75265 144441
307 144441 57718 -147796 -35918 155102 21742 -148547 5685 150529 -24248 -144154
317 -144154 44456 135141 -67331 -132635 78151 118037 -97408 -110742 107586 96767 -115958
328 -115958 -76998 127897 63478 -127793 -38916 135292 21963 -136684 -3790 135568
338 135568 -17931 -139429 30282 131336 -50271 -127556 63052 117530 -74354 -102534
348 -102534 89313 92790 -95760 -74174 108997 60501 -117669 -45185 122827 25880 -130934
359 -130934 -14223 128073 -4114 -128519 17223 124023 -30444 -115418 48290 110587
369 110587 -59949 -97470 76974 87892 -89154 -76552 98009 62220 -108665 -53259 110912
380 110912 37811 -115919 -24724 116922 10254 -113739 8806 113571 -22061 -106149
390 -106149 39649 102421 -52751 -96736 63962 88003 -76905 -81924 83328 68944 -91910
401 -91910 -56890 96825 43390 -98524 -26482 103294 14373 -102654 1904 104704 -15394
412 -15394 -104342 27342 99493 -41435 -96242 49466 86306 -59951 -77589 68001 67386
423 67386 -74864 -54313 84208 43711 -89554 -30062 95077 17500 -98499 -7040 97141
434 97141 -5758 -97152 14809 92257 -26469 -87234 38053 81071 -48510 -71707 60468
445 60468 63818 -68821 -54093 76440 44967 -82320 -36343 85402 25806 -87999 -15245
456 -15245 87917 3318 -85786 9700 83315 -21015 -78492 32981 74676 -42889 -69819
467 -69819 52049 64135 -60165 -57288 66320 48536 -70740 -38227 73980 27651 -75486
478 -75486 -16070 77115 4998 -78085 6149 78253 -17222 -77412 26888 74166 -35884 -69521
490 -69521 43179 62995 -49634 -55414 55610 46769 -61667 -37507 66941 27138 -71875
501 -71875 -17300 74727 7362 -76163 1568 75706 -9762 -73660 17977 70364 -26344 -65489
513 -65489 34835 58995 -43627 -52268 50806 44117 -57900 -37201 62698 29864 -66612 -22289
525 -22289 69684 15052 -69746 -5260 70015 -3287 -67085 13372 64049 -22822 -60947 30837
537 30837 56322 -39949 -53218 46407 47835 -52586 -41385 57935 35183 -59335 -25142 62788
549 62788 17972 -62459 -7996 63449 -1560 -64605 9433 62409 -20135 -62606 26274 58139
561 58139 -33671 -53868 39561 49350 -42769 -41070 49179 35575 -52077 -26493 56292 17479
573 17479 -60461 -10813 60192 699 -63083 4328 60895 -11725 -59203 18788 57341 -23909
585 -23909 -50877 32794 47055 -37884 -39969 43985 33147 -50106 -28647 52176 20681 -57143
597 -57143 -16094 58001 8977 -57900 -529 58298 -5073 -53722 14852 52564 -20872 -48585
609 -48585 27935 44696 -35677 -42634 39580 36162 -45926 -32149 48284 25785 -49614 -17794
621 -17794 52224 12692 -50505 -3153 52613 -3318 -51856 10917 50208 -19424 -50197 23479
633 23479 45221 -30426 -42922 33590 38004 -36901 -31589 41937 27128 -43242 -18192 47721
645 47721 12142 -49216 -5435 49428 -2290 -51606 5678 48648 -13103 -48557 17424 45219
657 45219 -22566 -40077 29553 36994 -32423 -29534 38646 25506 -41830 -20490 44192 13992
669 13992 -48426 -10923 47303 3110 -48628 1966 46876 -7498 -43126 15462 42665 -18886
681 -18886 -37364 26554 35727 -31170 -32406 34792 26692 -40236 -24332 39884 17055 -42534 -12461
694 -12461 42786 7263 -41417 1016 43756 -4899 -40817 13229 40933 -18370 -39250 22002
706 22002 34902 -28128 -34143 28943 28073 -33476 -24272 36132 19374 -37264 -11414 41371 7590
719 7590 -40531 -175 42214 -4589 -42504 8251 40030 -14775 -40372 17143 35590 -22828
731 -22828 -32267 26903 28257 -29374 -21826 34532 19130 -35594 -13252 38817 9186 -40561 -5395
744 -5395 39628 -1072 -40565 4161 37208 -10135 -35526 14815 33469 -18611 -29401 24994
756 24994 28323 -27652 -23685 32232 20507 -34779 -17007 35170 11221 -37563 -8295 36212
768 36212 1860 -37050 3243 36849 -8121 -34697 15159 35021 -18063 -31347 23163 29576
780 29576 -26097 -27039 27633 21845 -31677 -19395 31723 12723 -34346 -7871 35403 3412 -34521
793 -34521 3109 36656 -5284 -34412 10630 34247 -14156 -32846 16633 28302 -22109 -26785
805 -26785 23215 21094 -27195 -17532 30174 14568 -31081 -8767 35205 6885 -34607 -1448
817 -1448 35479 -2762 -35332 5543 31869 -11738 -31913 13957 28093 -19077 -25752 23634
829 23634 24035 -25592 -18915 30385 17355 -30609 -12758 31807 8680 -33004 -6141 31024 -187
842 -187 -32415 3273 30439 -8527 -29149 13547 28740 -15645 -25148 20344 24586 -21645 -21419
855 -21419 23860 17839 -26636 -15339 26654 9459 -29244 -6104 29242 1471 -29560 3144
867 3144 30791 -5553 -29184 10438 29494 -12862 -27168 16121 24239 -19608 -21881 20990 17160
880 17160 -24352 -14507 25866 10718 -27675 -6815 29702 4171 -29244 317 29806 -2899
892 -2899 -28085 6323 26295 -9827 -24938 12225 21837 -16510 -20393 18905 17306 -21880 -14606
905 -14606 24153 12320 -24707 -8708 26208 6483 -25812 -2741 25926 -1074 -25878 4457
917 4457 24281 -9314 -24065 12000 21947 -15528 -20594 18135 19150 -19581 -16032 22256 14113
930 14113 -22746 -9958 24079 6275 -24753 -2932 24213 -1553 -25198 3899 24212 -7473
942 -7473 -23933 10331 23142 -12191 -20310 15431 18864 -16398 -15269 18528 12379 -20365 -9958
955 -9958 21175 6069 -23552 -3958 23766 537 -24158 2491 24161 -4486 -22236 8000
967 8000 21671 -9939 -19476 12948 17395 -16175 -15784 17931 12447 -20941 -10687 21851 7879
980 7879 -22670 -5136 23467 3156 -22659 526 22829 -3263 -21638 6620 20260 -10146
992 -10146 -19412 12203 17157 -15184 -16218 16590 14222 -18184 -11923 19699 9821 -19872 -6191
1005 -6191 20892 3477 -20618 -136 20686 -2972 -20878 5404 20117 -8543 -20030 10481
1017 10481 18436 -12876 -16726 14755 14688 -15807 -11657 17758 9606 -18530 -6403 20047 3768
1030 3768 -21039 -1224 21163 -1940 -21571 3778 20250 -6400 -19403 8377 17986 -10276
1042 -10276 -15771 13067 14425 -14649 -11623 17023 9575 -18453 -7492 19053 4837 -20233 -3374
1055 -3374 19739 549 -19891 1813 19308 -4394 -17904 7707 17281 -9678 -15373 12358
1067 12358 14291 -14275 -13021 15516 10831 -17430 -9465 17692 6512 -18527 -3982 18643 1472
1080 1472 -18115 1801 18548 -3750 -17734 6709 17585 -8873 -16809 10638 15072 -12853
1092 -12853 -13941 13548 11306 -15052 -9326 16024 7095 -16710 -4100 18225 2199 -18216 829
1105 829 18813 -2897 -18465 4729 17331 -7101 -16879 8270 14863 -10670 -13532 12401 11642
1118 11642 -13934 -9053 16051 7608 -16440 -5019 17592 3418 -17912 -1675 17496 -958
1130 -958 -17792 2498 16353 -5431 -15645 7560 14398 -9387 -12654 11862 12106 -12815 -10147
1143 -10147 14666 8820 -15673 -7167 15878 4376 -16845 -2776 16046 -217 -16277 2385
1155 2385 16111 -4418 -15253 7302 15449 -8566 -13817 10821 12850 -12013 -11343 12582 8865
1168 8865 -14194 -7671 14118 4767 -15386 -2806 15884 769 -15649 2089 16407 -3080
1180 -3080 -15072 5443 14844 -6718 -13860 7864 11936 -10248 -11255 10842 8569 -12930 -7056
1193 -7056 14012 5411 -14339 -2895 15911 2238 -15239 353 15733 -2005 -15378 3599
1205 3599 13792 -6593 -13719 7498 11555 -9982 -10643 11548 9748 -12277 -7455 14442 6939
1218 6939 -14121 -4353 14853 2491 -15052 -1100 13816 -2021 -14558 2974 13278 -5546
1230 -5546 -12952 7581 12730 -8385 -10690 10850 10509 -10891 -8352 11995 6659 -13096 -5612 12727
1244 12727 2449 -14452 -1380 14000 -1214 -14254 3459 14716 -4268 -13167 6967 13492
1256 13492 -7497 -11860 9193 10390 -11025 -9459 11326 6528 -13482 -5588 13624 3385 -14240
1269 -14240 -1435 15184 701 -14214 1997 14856 -2946 -13644 4851 12455 -6933 -11988
1281 -11988 7636 9784 -10051 -9391 10770 7813 -12012 -6227 13460 5451 -13136 -2895 14170
1294 14170 1829 -13612 212 13258 -2486 -13590 3623 12287 -6481 -12523 7693 11347
1306 11347 -9324 -10095 11081 9570 -11135 -7206 12712 6335 -12750 -4264 13204 1922 -14142
1319 -14142 -716 13303 -2202 -14036 3223 13253 -4875 -12524 6688 12489 -6991 -10423
1331 -10423 9178 9923 -9688 -8001 10718 5987 -12224 -5209 11924 2566 -13468 -1878 13313
1344 13313 160 -13273 1949 13832 -2536 -12091 5215 12131 -6124 -10759 7595 9243 -9782
1357 -9782 -9077 10013 6725 -12192 -6171 12541 4584 -12707 -2369 13727 1872 -12406 908
1370 908 13031 -2034 -12368 3648 11364 -6229 -11762 6610 9769 -8875 -9513 9488 8400
1383 8400 -9842 -6416 11472 6145 -10770 -3469 12052 2234 -12134 -621 11668 -1932 -12657
1396 -12657 2320 11329 -4662 -11613 5579 10993 -6414 -9385 8536 9215 -8524 -6801 10191
1409 10191 5746 -10898 -4451 11013 2186 -12544 -1826 11834 -465 -12495 1597 12208
1421 12208 -2622 -10892 4862 11039 -5207 -9237 7154 8608 -8294 -7816 8885 5901 -10795
1434 -10795 -5694 10474 3638 -11356 -2558 11505 1640 -10713 710 11513 -1232 -10333 3451
1447 3451 10243 -4960 -9976 5717 8415 -7839 -8593 7826 6952 -8992 -6002 9802 5273 -9502
1461 -9502 -2857 10894 2255 -10260 -73 10596 -1480 -10921 2124 9854 -4375 -10515 4597
1474 4597 9209 -6086 -8410 7321 7882 -7369 -5649 9107 5267 -9021 -3497 9762 2067 -10693
1488 -10693 -1571 10015 -665 -10981 1072 10026 -2558 -9471 3985 9354 -4308 -7679 6296
1501 6296 7596 -6767 -6313 7788 5122 -9070 -4748 8799 2834 -9853 -2382 9528 1081 -9347
1515 -9347 536 9783 -1159 -8701 3302 8949 -4146 -8182 5332 7325 -6769 -7230 6879 5743
1529 5743 -8124 -5251 8401 4085 -8618 -2384 9422 1636 -8851 319 9388 -1231 -9151
1542 -9151 2299 8700 -3774 -8903 4124 7767 -5509 -7376 6045 6365 -6560 -4999 7562
1555 7562 4425 -7573 -2876 8413 2059 -8759 -1107 8732 -338 -9152 868 8430 -2245 -8304
1569 -8304 3051 7728 -3945 -6843 5299 6502 -5918 -5320 7096 4628 -7782 -3757 8070
1582 8070 2530 -8685 -1899 8458 602 -8589 456 8466 -1481 -7904 2982 7805 -3752 -6986
1596 -6986 4918 6589 -5644 -6031 6126 5127 -6875 -4603 6966 3419 -7382 -2462 7532 1461
1610 1461 -7435 -152 7733 -579 -7437 1757 7533 -2563 -7291 3350 6695 -4371 -6353 4753
1624 4753 5299 -5660 -4601 6125 3672 -6625 -2558 7348 1841 -7473 -599 7861 -206 -7771
1638 -7771 1105 7449 -2119 -7300 2658 6461 -3737 -6099 4385 5368 -5134 -4522 5978 4049
1652 4049 -6140 -3012 6740 2525 -6766 -1753 6751 850 -6916 -225 6511 -938 -6451 1749 6108
1667 6108 -2552 -5603 3586 5520 -3969 -4785 4867 4473 -5291 -3779 5616 2767 -6191 -2156 6056
1682 6056 904 -6400 -70 6450 -785 -6261 1906 6431 -2396 -5887 3342 5600 -3901 -5085 4203
1697 4203 4166 -4959 -3793 4975 2725 -5527 -2097 5809 1437 -5823 -461 6187 90 -5845 713
1712 713 5781 -1299 -5594 1728 4988 -2645 -4819 3061 4116 -3836 -3576 4507 3133 -4758 -2277
1727 -2277 5393 1926 -5422 -1142 5567 368 -5682 277 5327 -1314 -5301 1972 4895 -2749 -4474
1742 -4474 3522 4298 -3835 -3627 4494 3317 -4678 -2681 4855 1909 -5103 -1388 4886 503 -5028
1757 -5028 77 4954 -723 -4818 1466 4867 -1851 -4493 2466 4214 -2885 -3841 3131 3171 -3683 -2825
1773 -2825 3856 2015 -4333 -1430 4620 791 -4756 6 4968 -478 -4798 1152 4675 -1706 -4438
1788 -4438 2212 3952 -2883 -3592 3327 3002 -3862 -2436 4256 1967 -4422 -1337 4719 967 -4652
1803 -4652 -360 4665 -169 -4505 716 4252 -1312 -4019 1830 3677 -2370 -3401 2819 3100 -3216
1818 -3216 -2726 3568 2344 -3806 -1840 3996 1313 -4027 -663 4116 57 -4098 606 4075 -1249
1833 -1249 -4020 1801 3786 -2428 -3623 2777 3177 -3215 -2764 3487 2291 -3682 -1642 3982 1120
1848 1120 -4087 -499 4218 -123 -4316 575 4132 -1145 -4086 1447 3803 -1888 -3499 2298 3189
1863 3189 -2602 -2654 3079 2274 -3342 -1771 3643 1283 -3878 -902 3955 369 -4063 72 4027 -563
1879 -563 -3824 1193 3708 -1645 -3326 2243 3067 -2693 -2739 3101 2338 -3532 -2015 3721 1491 -3938
1895 -3938 -1014 4008 515 -3934 80 3920 -590 -3789 1133 3654 -1704 -3538 2077 3203 -2574
1910 -2574 -3010 2810 2605 -3088 -2207 3292 1797 -3414 -1238 3650 741 -3731 -171 3777 -381 -3828
1926 -3828 801 3680 -1318 -3607 1677 3370 -2090 -3061 2509 2697 -2821 -2187 3200 1793 -3433 -1251
1942 -1251 3695 792 -3836 -374 3877 -140 -3933 512 3749 -1045 -3572 1483 3319 -1915 -2961
1957 -2961 2395 2709 -2704 -2293 3106 1964 -3358 -1594 3521 1130 -3703 -760 3632 205 -3669
1972 -3669 252 3548 -755 -3430 1295 3336 -1701 -3067 2213 2855 -2555 -2589 2822 2161 -3124 -1848
1988 -1848 3220 1309 -3438 -880 3519 363 -3562 215 3657 -623 -3504 1158 3468 -1538 -3292
2003 -3292 1875 2980 -2296 -2759 2523 2279 -2883 -1893 3137 1458 -3283 -911 3558 607 -3535 -68
2019 -68 3660 -336 -3634 692 3428 -1235 -3303 1506 2972 -2015 -2691 2369 2405 -2662 -2004 3083
2035 3083 1724 -3249 -1283 3414 868 -3541 -522 3424 -52 -3506 407 3351 -925 -3211 1429
2050 1429 3118 -1787 -2811 2268 2627 -2540 -2306 2783 1919 -3094 -1621 3127 1094 -3333 -683 3378
2066 3378 190 -3369 361 3454 -691 -3257 1230 3236 -1558 -3036 1876 2746 -2255 -2516 2455
2081 2455 2072 -2774 -1716 2976 1288 -3110 -812 3332 499 -3347 7 3426 -335 -3354 752
2096 752 3210 -1166 -3075 1479 2736 -1919 -2552 2179 2189 -2563 -1887 2833 1528 -3040 -1146 3212
2112 3212 801 -3244 -374 3288 -32 -3234 443 3093 -937 -3034 1281 2803 -1763 -2651 2070
2127 2070 2392 -2353 -2080 2661 1853 -2752 -1394 2981 1076 -3051 -657 3077 153 -3177 202 3074
2143 3074 -675 -3057 1060 2986 -1330 -2732 1766 2655 -1916 -2252 2268 1958 -2513 -1646 2635 1150
2159 1150 -2926 -876 2946 447 -3072 -64 3165 -229 -2997 715 3004 -949 -2790 1321 2533
2174 2533 -1721 -2393 1880 1970 -2344 -1809 2484 1446 -2701 -1097 2904 856 -2866 -402 2966 99
2190 99 -2935 264 2786 -737 -2797 962 2511 -1452 -2441 1725 2266 -1937 -1932 2267 1807 -2312 -1389
2207 -1389 2542 1100 -2648 -783 2641 325 -2780 -43 2694 -363 -2680 719 2694 -925 -2450
2222 -2450 1346 2423 -1478 -2113 1770 1856 -2026 -1635 2110 1231 -2373 -980 2468 644 -2542 -284
2238 -284 2687 59 -2576 325 2584 -584 -2441 871 2245 -1240 -2143 1403 1846 -1741 -1687 1910
2254 1910 1424 -2097 -1152 2260 966 -2286 -645 2351 413 -2342 -122 2295 -234 -2285 475
2269 475 2138 -797 -2089 1047 1951 -1274 -1786 1494 1659 -1615 -1384 1805 1189 -1891 -862 1993
2285 1993 595 -2028 -282 2094 16 -2101 270 2067 -533 -2015 749 1892 -952 -1735 1175
2300 1175 1588 -1322 -1322 1518 1140 -1621 -889 1730 682 -1853 -491 1889 263 -1911 -74 1869
2316 1869 -114 -1818 329 1739 -497 -1626 698 1516 -935 -1399 1093 1241 -1263 -1098 1377 906
2332 906 -1480 -738 1546 538 -1581 -290 1593 63 -1559 159 1499 -390 -1465 609 1390 -763
2348 -763 -1270 917 1175 -1040 -1016 1145 883 -1190 -692 1258 529 -1299 -347 1349 188 -1318 -5
2365 -5 1367 -92 -1332 242 1306 -346 -1243 463 1164 -586 -1066 685 943 -803 -822 941 694
2382 694 -996 -522 1098 411 -1121 -278 1117 109 -1142 15 1044 -194 -1025 335 922 -476
2398 -476 -838 623 781 -685 -650 793 584 -834 -492 842 360 -906 -353 836 174 -892 -114 853
2416 853 24 -806 124 864 -135 -801 253 817 -318 -797 336 656 -479 -691 461 530 -535 -425
2434 -425 617 400 -570 -199 712 182 -639 -48 640 -59 -664 62 516 -216 -551 209 426 -282 -363 402
2454 402 371 -343 -213 459 277 -421 -224 404 161 -471 -217 365 109 -440 -131 431 75 -399 -2 467
2474 467 31 -392 101 451 -78 -455 101 403 -176 -423 140 313 -187 -286 197 233 -195 -144 246 160 -199
2495 -199 -52 232 71 -197 -75 142 33 -209 -81 113 31 -141 -26 136 43 -119 15 189 27 -175 43
2516 43 233 -61 -279 47 275 -110 -315 93 286 -142 -278 180 274 -180 -223 282 240 -252 -211 287 197 -322
2538 -322 -215 304 169 -359 -193 302 156 -358 -154 356 136 -339 -52 411 87 -377 8 436 -60 -471
2558 -471 71 450 -195 -497 178 421 -291 -424 327 381 -384 -282 502 276 -517 -153 598 126 -626 -72
2578 -72 609 -54 -690 30 637 -166 -646 210 605 -268 -571 389 609 -431 -528 526 518 -610 -486 616
2598 616 409 -709 -407 704 294 -795 -221 815 121 -793 40 891 -109 -822 278 872 -345 -824
2616 -824 427 762 -559 -741 608 609 -730 -536 811 438 -840 -284 973 234 -949 -62 1027 -27
2634 -27 -1022 102 981 -285 -1014 338 917 -480 -887 604 867 -664 -733 834 731 -863 -584 995
2652 995 479 -1083 -415 1059 225 -1174 -166 1112 -47 -1151 206 1161 -309 -1061 534 1093 -590
2669 -590 -969 754 898 -887 -852 918 628 -1082 -573 1097 398 -1180 -233 1241 133 -1219 96
2686 96 1299 -180 -1219 362 1191 -535 -1187 611 1033 -822 -1026 875 873 -1036 -720 1167 653 -1181
2704 -1181 -420 1330 328 -1324 -157 1355 -31 -1405 147 1299 -386 -1320 520 1209 -675 -1123
2720 -1123 883 1077 -947 -873 1143 819 -1204 -659 1293 472 -1391 -367 1349 120 -1452 36
2736 36 1418 -218 -1373 431 1393 -553 -1262 780 1228 -903 -1118 1021 944 -1196 -892 1230 637
2753 637 -1377 -521 1434 337 -1459 -97 1533 -24 -1467 299 1508 -413 -1436 596 1330 -812
2769 -812 -1289 898 1116 -1094 -1016 1244 855 -1307 -646 1494 557 -1473 -300 1585 135 -1593 47
2786 47 1554 -288 -1572 427 1446 -667 -1414 839 1320 -986 -1140 1210 1068 -1269 -845 1428 713
2803 713 -1513 -533 1533 276 -1632 -125 1587 -107 -1594 322 1597 -472 -1489 731 1471 -861
2819 -861 -1304 1046 1205 -1205 -1089 1301 863 -1485 -720 1527 508 -1606 -295 1673 130 -1675
2835 -1675 145 1712 -306 -1621 525 1580 -737 -1502 889 1349 -1114 -1240 1238 1056 -1374 -868
2851 -868 1517 712 -1563 -462 1676 310 -1660 -69 1675 -150 -1673 331 1593 -572 -1553 759
2867 759 1453 -962 -1324 1135 1224 -1270 -1031 1419 873 -1527 -691 1603 455 -1688 -283 1701 52
2884 52 -1717 175 1712 -376 -1630 623 1594 -804 -1479 984 1363 -1148 -1223 1291 1034 -1430 -870
2901 -870 1531 629 -1605 -444 1677 228 -1682 6 1711 -196 -1669 418 1607 -613 -1542 797
2917 797 1410 -992 -1300 1148 1148 -1307 -999 1428 803 -1534 -598 1649 420 -1676 -204 1703 -22
2934 -22 -1704 226 1676 -439 -1614 675 1530 -849 -1414 1039 1290 -1190 -1143 1344 960 -1445 -768
2951 -768 1548 577 -1611 -364 1659 147 -1672 77 1637 -290 -1606 504 1543 -689 -1458 888
2967 888 1355 -1036 -1193 1208 1063 -1338 -878 1449 674 -1549 -493 1602 286 -1658 -70 1647
2983 1647 -143 -1642 356 1583 -554 -1531 759 1412 -934 -1305 1077 1140 -1260 -1000 1358 798 -1498
3000 -1498 -612 1572 394 -1613 -208 1634 -12 -1643 194 1578 -418 -1541 620 1422 -820
3015 -820 -1339 992 1196 -1139 -1068 1269 890 -1382 -724 1462 526 -1541 -323 1572 125 -1623 94
3032 94 1610 -292 -1556 493 1505 -698 -1405 891 1286 -1055 -1169 1208 1018 -1322 -827 1462 625
3049 625 -1528 -429 1571 218 -1621 -16 1622 -188 -1585 379 1514 -594 -1460 778 1329 -936
3065 -936 -1221 1100 1077 -1238 -901 1376 728 -1451 -552 1538 331 -1579 -150 1599 -81 -1591 272
3082 272 1557 -490 -1494 680 1401 -852 -1285 1045 1149 -1203 -1019 1324 844 -1435 -676 1518 466
3099 466 -1594 -262 1625 47 -1628 167 1586 -369 -1550 573 1474 -773 -1392 944 1263 -1091
3115 -1091 -1109 1243 947 -1376 -769 1475 592 -1556 -382 1577 175 -1613 31 1623 -227 -1582
3131 -1582 454 1527 -648 -1433 846 1339 -1013 -1210 1166 1065 -1307 -897 1440 714 -1517 -511
3147 -511 1596 291 -1627 -96 1636 -115 -1637 310 1601 -534 -1524 717 1433 -884 -1310 1092
3163 1092 1171 -1215 -1014 1365 839 -1462 -644 1536 444 -1605 -242 1630 41 -1620 169 1615
3179 1615 -370 -1556 589 1495 -772 -1396 956 1288 -1110 -1111 1254 968 -1398 -791 1488 595 -1576
3196 -1576 -385 1612 171 -1635 43 1643 -249 -1592 451 1551 -657 -1470 839 1361 -1020
3211 -1020 -1229 1172 1049 -1298 -892 1427 728 -1509 -516 1597 319 -1617 -87 1629 -102 -1615
3227 -1615 307 1580 -511 -1507 696 1409 -893 -1278 1054 1161 -1192 -988 1335 851 -1453 -661 1533
3244 1533 447 -1575 -250 1620 32 -1626 173 1596 -395 -1539 594 1495 -784 -1353 987
3259 987 1255 -1120 -1100 1271 945 -1384 -778 1473 568 -1571 -387 1609 159 -1617 51 1608 -241
3276 -241 -1572 478 1529 -645 -1434 818 1315 -1026 -1211 1136 1026 -1314 -887 1422 696 -1496 -470
3293 -470 1577 299 -1597 -70 1626 -135 -1599 338 1552 -552 -1501 717 1392 -933 -1294 1095
3309 1095 1138 -1229 -966 1369 811 -1462 -610 1551 422 -1600 -212 1620 -13 -1636 211 1596
3325 1596 -422 -1539 612 1475 -808 -1344 997 1256 -1108 -1096 1290 942 -1387 -757 1484 563 -1569
3342 -1569 -356 1608 139 -1643 75 1661 -267 -1603 486 1558 -702 -1437 852 1329 -1056
3357 -1056 -1219 1188 1043 -1325 -874 1454 701 -1557 -490 1606 291 -1645 -80 1650 -111 -1642
3373 -1642 341 1603 -544 -1533 724 1431 -904 -1342 1072 1178 -1215 -1029 1365 886 -1447 -660 1539
3390 1539 498 -1610 -283 1630 64 -1671 143 1629 -368 -1585 541 1519 -754 -1404 934
3405 934 1307 -1099 -1167 1240 1011 -1368 -844 1472 628 -1537 -437 1598 238 -1638 -39 1626 -169
3422 -169 -1599 375 1554 -564 -1490 756 1379 -921 -1267 1075 1144 -1214 -964 1352 818 -1427 -609
3439 -609 1522 418 -1577 -210 1610 19 -1579 193 1574 -373 -1509 581 1431 -765 -1341 922
3455 922 1207 -1081 -1056 1210 912 -1331 -740 1423 568 -1489 -382 1527 173 -1540 34 1552 -204
3472 -204 -1500 397 1467 -576 -1376 773 1278 -931 -1143 1062 1014 -1187 -850 1295 687 -1378 -520
3489 -520 1430 328 -1461 -141 1481 -49 -1475 242 1443 -413 -1369 614 1297 -761 -1198 915
3505 915 1082 -1043 -933 1154 791 -1246 -613 1326 460 -1394 -279 1429 95 -1427 77 1421
3521 1421 -258 -1364 450 1320 -604 -1211 757 1120 -885 -987 1007 859 -1126 -709 1215 565 -1276
3538 -1276 -385 1333 222 -1353 -51 1352 -117 -1327 317 1296 -477 -1209 628 1134 -761 -1015
3554 -1015 897 926 -1008 -785 1105 618 -1148 -484 1228 338 -1282 -140 1289 12 -1252 176
3570 176 1258 -333 -1190 482 1130 -630 -1035 758 933 -854 -816 985 683 -1072 -569 1122 403
3587 403 -1163 -252 1198 106 -1204 47 1188 -190 -1155 359 1086 -510 -1053 619 945 -752
3603 -752 -836 830 715 -918 -604 1026 471 -1071 -320 1113 190 -1129 -52 1115 -84 -1083 241
3620 241 1054 -380 -1017 508 937 -625 -841 733 754 -812 -615 901 515 -951 -381 995 251 -1021
3638 -1021 -102 1041 -35 -1025 168 1007 -283 -956 425 905 -512 -807 645 750 -724 -619 812
3655 812 521 -882 -424 914 289 -942 -173 972 32 -962 103 951 -209 -907 319 872 -458
3672 -458 -822 526 727 -646 -635 720 550 -766 -434 834 316 -880 -197 913 90 -897 24 895
3690 895 -139 -870 271 812 -373 -775 473 705 -557 -624 638 539 -705 -432 758 324 -799 -218
3708 -218 815 112 -842 -28 820 -96 -830 191 776 -317 -710 397 673 -468 -602 569 515 -635
3726 -635 -431 674 354 -729 -238 755 135 -772 -34 773 -53 -753 183 720 -264 -686 361 629 -437
3745 -437 -571 494 486 -580 -417 636 310 -670 -238 688 141 -704 -29 722 -55 -694 166 661 -241 -635
3765 -635 340 579 -407 -512 484 462 -531 -374 586 301 -629 -216 661 128 -684 -28 657 -61 -661 143
3785 143 620 -245 -595 326 544 -397 -478 471 424 -525 -339 575 272 -601 -181 653 79 -659 3 632 -89
3806 -89 -624 171 618 -248 -559 338 513 -405 -454 474 392 -543 -315 572 229 -613 -162 630 67 -645 23
3827 23 652 -92 -622 194 609 -279 -560 365 522 -422 -472 484 397 -549 -322 591 246 -633 -138 655 55
3848 55 -657 19 666 -127 -630 219 631 -310 -580 377 517 -466 -469 525 405 -570 -311 637 246 -653 -140
3869 -140 681 56 -682 47 682 -130 -698 229 655 -305 -610 409 557 -474 -501 535 426 -612 -326
3888 -326 671 265 -682 -163 719 76 -739 36 738 -128 -711 220 717 -313 -661 417 621 -498 -542
3907 -542 574 469 -644 -385 702 287 -736 -207 752 93 -787 -6 781 -112 -781 211 760 -311
3925 -311 -707 428 660 -490 -609 591 525 -662 -447 723 356 -773 -226 823 149 -820 -34 844
3943 844 -64 -849 168 822 -294 -786 389 738 -485 -680 593 608 -667 -498 735 431 -808 -339
3961 -339 846 203 -882 -110 892 -14 -893 143 883 -249 -848 362 820 -476 -741 563 679
3978 679 -659 -610 739 498 -807 -392 864 291 -921 -173 956 70 -951 63 947 -177 -942
3995 -942 293 885 -420 -853 515 770 -623 -705 708 605 -802 -505 869 402 -934 -285 962
4012 962 162 -975 -40 988 -80 -984 223 960 -344 -919 475 853 -570 -786 687 694 -766 -604
4030 -604 863 508 -912 -385 962 261 -1009 -148 1034 -7 -1028 123 1017 -251 -990 374 934
4047 934 -508 -896 624 812 -731 -710 812 627 -896 -515 969 381 -1032 -245 1044 123 -1071
4064 -1071 26 1047 -155 -1039 297 1012 -415 -942 551 893 -645 -814 757 709 -850 -600 932
4081 932 484 -995 -356 1028 254 -1075 -120 1094 -44 -1100 172 1063 -320 -1044 444 973 -580
4098 -580 -927 707 829 -781 -724 878 634 -959 -493 1018 374 -1068 -229 1105 101 -1129 51
4115 51 1112 -197 -1092 313 1022 -475 -991 582 899 -699 -831 825 719 -881 -611 959 487
4132 487 -1038 -344 1076 209 -1124 -100 1112 -71 -1131 192 1106 -342 -1048 484 1010 -597
4148 -597 -919 710 835 -823 -745 921 616 -1001 -493 1059 370 -1102 -233 1123 79 -1125 90
4165 90 1136 -192 -1098 353 1055 -488 -1011 593 916 -729 -833 806 723 -909 -603 982 499 -1037
4183 -1037 -333 1100 220 -1113 -75 1120 -63 -1137 194 1103 -355 -1073 468 1003 -592 -906
4199 -906 732 857 -794 -711 930 609 -1001 -489 1049 348 -1102 -221 1098 58 -1137 70 1103
4216 1103 -209 -1074 360 1047 -447 -977 589 900 -716 -805 793 698 -896 -608 957 462 -1015
4233 -1015 -332 1074 201 -1067 -56 1097 -53 -1085 198 1068 -335 -1019 465 954 -573 -892
4249 -892 685 798 -780 -699 882 589 -948 -451 1030 335 -1038 -193 1067 53 -1070 82 1048
4266 1048 -209 -1039 346 980 -457 -920 554 861 -651 -764 781 675 -843 -562 921 447 -985
4283 -985 -306 1011 179 -1034 -55 1023 -70 -1014 194 1006 -314 -958 441 882 -563 -812 663
4300 663 744 -741 -634 831 511 -898 -442 935 283 -979 -160 1001 49 -1003 87 976 -188
4317 -188 -954 350 925 -437 -865 539 786 -641 -718 718 616 -795 -486 841 401 -888 -255 918
4335 918 156 -943 -55 939 -88 -927 199 902 -309 -860 413 813 -502 -729 604 657 -693 -575
4353 -575 760 450 -811 -360 861 250 -883 -134 881 32 -886 99 868 -209 -833 316 807 -390
4371 -390 -750 511 679 -576 -609 645 499 -732 -434 759 305 -802 -211 825 119 -814 -5 824
4389 824 -101 -795 208 777 -307 -751 388 678 -475 -606 548 539 -619 -446 683 371 -692 -269
4407 -269 752 185 -746 -86 765 -25 -769 117 744 -227 -701 310 675 -393 -614 461 530 -519 -470
4426 -470 573 394 -618 -308 679 227 -686 -121 704 36 -712 48 689 -137 -668 217 630 -283 -574
4445 -574 377 547 -440 -472 498 394 -541 -321 581 236 -619 -158 610 80 -634 -1 630 -83 -615 169
4465 169 588 -225 -543 299 504 -379 -454 429 384 -505 -317 510 262 -550 -157 576 104 -576 -6 590 -58
4486 -58 -554 147 552 -200 -491 283 470 -321 -417 378 360 -418 -300 473 253 -487 -161 512 99 -519 -34
4507 -34 515 -57 -521 94 478 -190 -464 257 430 -293 -379 351 334 -382 -282 431 224 -467 -158 476 87
4528 87 -483 -10 487 -25 -471 120 446 -173 -442 230 377 -264 -363 324 309 -383 -273 408 196 -430 -136
4549 -136 455 79 -460 -23 461 -56 -460 122 418 -149 -410 233 376 -286 -321 324 301 -348 -247 399 197
4570 197 -416 -123 434 65 -437 8 457 -60 -409 126 417 -174 -393 232 356 -294 -314 327 271 -369 -210
4591 -210 400 170 -421 -102 432 52 -434 13 427 -80 -440 117 400 -189 -379 249 353 -283 -313 349
4611 349 278 -373 -194 425 172 -410 -66 440 34 -421 29 433 -89 -425 152 411 -235 -387 260 334 -306
4632 -306 -293 369 273 -391 -213 424 131 -450 -82 461 9 -463 49 455 -103 -432 172 411 -243 -406 292
4653 292 339 -317 -312 387 267 -408 -217 452 157 -458 -74 477 22 -480 76 473 -123 -473 186 451 -235
4674 -235 -414 289 369 -350 -330 394 272 -445 -206 474 174 -512 -81 521 16 -505 49 524 -121 -485 183
4695 183 489 -260 -457 324 433 -374 -379 419 318 -438 -246 518 196 -535 -108 536 42 -564 28 538 -126
4716 -126 -542 172 540 -256 -500 313 450 -376 -416 424 360 -484 -296 529 220 -558 -171 591 79 -592 20
4737 20 610 -63 -588 166 581 -229 -546 303 517 -370 -457 448 420 -488 -350 549 277 -566 -202 627 144
4758 144 -642 -40 651 -28 -634 110 614 -216 -628 285 590 -359 -529 442 496 -481 -414 532 357 -573 -272
4779 -272 628 202 -662 -116 674 32 -689 46 683 -152 -666 238 651 -327 -594 383 552 -470 -496 539
4799 539 410 -589 -349 638 274 -675 -192 693 87 -725 4 721 -79 -720 180 691 -272 -662 357 619
4819 619 -439 -574 498 504 -568 -426 622 342 -662 -250 706 186 -725 -71 744 -9 -734 109 736
4838 736 -193 -733 275 673 -387 -628 446 567 -539 -510 588 436 -647 -334 701 256 -741 -175
4856 -175 756 51 -783 11 762 -130 -761 207 733 -312 -684 395 646 -481 -567 560 512 -608 -441
4875 -441 665 323 -726 -270 746 164 -765 -62 782 -33 -778 133 763 -224 -731 317 688 -420
4893 -420 -633 482 555 -559 -521 618 416 -677 -334 736 257 -748 -130 807 61 -778 55 783 -152
4912 -152 -765 254 722 -354 -679 437 640 -503 -560 591 496 -639 -418 700 333 -750 -226 755
4930 755 142 -772 -47 774 -66 -769 138 759 -247 -720 355 668 -425 -610 520 571 -573 -462 643
4949 643 399 -705 -313 740 229 -779 -120 782 2 -762 98 796 -172 -730 281 709 -365 -661
4967 -661 451 615 -529 -541 578 453 -661 -388 697 270 -735 -203 774 120 -753 -3 786 -81
4985 -81 -747 201 736 -286 -709 352 638 -454 -591 535 535 -581 -429 661 381 -688 -253 751
5003 751 186 -757 -75 772 -15 -765 91 738 -227 -735 293 680 -395 -635 462 568 -528 -518 592
5022 592 428 -637 -337 684 266 -736 -169 712 52 -765 25 738 -111 -718 227 713 -291 -655 385
5041 385 622 -476 -538 530 479 -605 -413 662 324 -682 -229 717 132 -737 -42 754 -59 -741 147
5060 147 710 -248 -684 326 633 -412 -579 475 528 -551 -438 592 385 -651 -264 703 215 -689
5078 -689 -92 718 15 -712 68 721 -173 -696 245 659 -341 -597 410 549 -467 -479 540 430 -588
5097 -588 -349 648 260 -681 -175 697 84 -721 5 709 -113 -692 186 669 -263 -623 356 588 -418 -528
5117 -528 478 464 -539 -370 603 297 -639 -239 657 157 -682 -56 676 -13 -671 107 658 -185 -633 291
5137 291 612 -349 -548 427 492 -503 -423 537 350 -603 -288 616 200 -650 -116 662 48 -663 68 659 -125
5158 -125 -628 232 605 -308 -561 376 504 -443 -465 510 385 -516 -313 576 240 -591 -165 629 70 -651
5178 -651 -22 627 -92 -645 162 593 -252 -563 307 532 -399 -476 441 411 -481 -341 540 289 -576 -212 606
5199 606 121 -613 -27 617 -43 -607 130 594 -197 -562 275 549 -323 -477 410 444 -459 -373 490 319 -532
5220 -532 -251 555 156 -581 -86 602 4 -577 88 589 -151 -561 236 508 -289 -498 349 434 -427 -374 494
5241 494 329 -510 -247 553 172 -570 -95 586 27 -585 54 587 -143 -551 197 535 -272 -511 332 448
5261 448 -384 -380 437 339 -490 -271 532 208 -552 -142 544 46 -582 5 561 -103 -568 169 530 -246 -495
5282 -495 318 469 -369 -434 414 349 -479 -290 510 215 -571 -151 557 73 -589 -8 565 -78 -556 136 544
5303 544 -227 -511 277 472 -356 -435 380 384 -455 -326 488 255 -540 -190 548 110 -571 -48 561 -43 -574
5324 -574 117 548 -181 -540 249 482 -324 -443 376 388 -439 -332 479 278 -518 -208 552 159 -567 -71
5344 -71 580 -22 -571 68 556 -155 -544 224 505 -302 -480 366 446 -430 -381 467 297 -524 -268 531 174
5365 174 -570 -106 573 27 -590 39 577 -115 -563 194 542 -255 -506 324 457 -373 -406 435 366 -480 -296
5386 -296 533 235 -541 -161 581 70 -586 2 593 -99 -590 157 561 -242 -541 309 480 -378 -441 412
5406 412 383 -469 -310 513 257 -552 -187 595 110 -585 -33 579 -51 -595 103 572 -179 -539 261 522
5426 522 -313 -475 389 432 -424 -365 489 303 -541 -255 570 146 -592 -102 582 9 -613 61 588 -146 -556
5447 -556 230 544 -301 -504 356 475 -427 -406 494 355 -513 -270 560 201 -588 -135 599 46 -607 29
5467 29 608 -96 -596 188 573 -275 -525 333 483 -388 -435 444 389 -516 -326 530 250 -552 -193 596 92
5488 92 -601 -37 608 -73 -621 113 600 -212 -575 277 527 -343 -477 427 431 -468 -371 528 312 -567 -240
5509 -240 576 160 -616 -94 613 -5 -630 83 620 -150 -600 243 558 -321 -526 364 477 -441 -430 460
5529 460 350 -541 -295 573 212 -594 -157 608 71 -614 39 633 -91 -592 176 590 -243 -549 337 524
5549 524 -382 -475 439 420 -503 -359 563 291 -584 -202 606 124 -634 -37 644 -46 -642 108 610 -203 -600
5570 -600 261 551 -337 -504 418 470 -460 -404 521 339 -551 -266 600 202 -612 -113 604 30 -628 47 608
5591 608 -120 -587 199 596 -291 -537 340 510 -431 -456 474 381 -524 -318 564 238 -610 -173 604 91 -630
5612 -630 10 623 -58 -605 142 618 -227 -571 268 517 -350 -492 411 426 -467 -377 536 314 -541 -236 580
5633 580 173 -598 -77 613 7 -618 64 598 -145 -587 207 536 -305 -517 342 476 -424 -432 457 361 -523
5654 -523 -287 551 227 -563 -160 586 84 -607 -13 590 -82 -598 127 574 -235 -520 289 508 -345 -456
5674 -456 407 407 -449 -338 500 280 -529 -224 550 125 -568 -88 581 -11 -579 86 558 -142 -536 222 504
5695 504 -272 -494 330 433 -407 -383 441 322 -467 -255 511 195 -514 -132 546 73 -529 8 538 -79
5715 -79 -542 166 497 -228 -497 281 453 -345 -398 385 348 -428 -282 481 250 -464 -157 516 106 -521 -45
5736 -45 510 -45 -518 85 495 -160 -478 212 432 -266 -406 330 383 -366 -311 410 286 -435 -208 473 159
5757 159 -478 -88 485 21 -480 42 478 -95 -450 163 444 -202 -400 272 350 -329 -319 350 275 -400 -232
5778 -232 412 169 -443 -122 444 66 -437 11 464 -76 -435 101 416 -160 -394 213 366 -265 -336 273
5798 273 291 -347 -239 366 206 -374 -138 405 85 -411 -47 397 -23 -420 48 394 -138 -392 152 352
5818 352 -206 -326 262 280 -300 -246 309 205 -342 -157 349 99 -378 -58 379 -1 -378 42 378 -84 -344
5839 -344 138 348 -168 -310 214 289 -261 -248 288 203 -304 -177 316 115 -351 -66 340 24 -362 12 350
5860 350 -57 -315 121 314 -149 -303 173 263 -215 -232 242 199 -256 -146 287 119 -297 -66 324 53 -318
5881 -318 12 308 -50 -298 99 279 -107 -254 153 243 -192 -209 221 189 -233 -142 246 132 -263 -90 269
5902 269 47 -278 -4 270 -41 -263 54 260 -100 -235 144 220 -159 -191 203 167 -200 -126 256 123 -234
5923 -234 -60 256 42 -245 22 259 -43 -242 75 230 -93 -201 140 196 -161 -179 178 133 -208 -110 211
5944 211 90 -248 -49 239 3 -223 22 220 -62 -207 86 210 -122 -199 141 168 -160 -139 186 132 -189
5965 -189 -83 200 55 -220 -25 214 5 -219 31 231 -55 -206 103 210 -104 -173 146 155 -184 -144 191
5986 191 98 -212 -77 214 44 -204 12 216 0 -215 74 232 -79 -211 114 190 -139 -146 188 144 -183 -93
6008 -93 218 97 -198 -37 225 41 -213 28 238 -46 -229 76 216 -118 -211 155 192 -178 -162 196 138 -205
6030 -205 -98 214 82 -229 -40 250 11 -256 16 250 -52 -248 84 242 -127 -213 176 214 -181 -183 236
6051 236 151 -232 -134 265 100 -281 -72 264 9 -288 9 281 -59 -263 100 262 -140 -257 172 225 -198
6072 -198 -216 236 162 -266 -149 274 119 -283 -70 304 33 -309 17 320 -34 -321 103 314 -143 -272 192
6093 192 266 -217 -233 258 214 -256 -183 305 125 -323 -89 335 40 -335 9 358 -33 -350 87 338 -136
6114 -136 -307 162 300 -200 -275 253 242 -276 -206 325 162 -327 -109 357 72 -367 -45 361 8 -379 58
6135 58 366 -113 -340 176 348 -186 -308 240 292 -278 -253 330 206 -355 -172 355 123 -390 -96 388 24
6156 24 -397 45 403 -69 -393 123 391 -171 -331 217 332 -258 -306 288 261 -335 -198 376 182 -387 -120
6177 -120 414 72 -413 -33 430 -36 -403 103 400 -149 -378 204 366 -241 -318 299 325 -315 -266 357 219
6198 219 -386 -157 416 121 -426 -66 439 13 -444 67 451 -103 -413 161 423 -201 -363 280 351 -294
6218 -294 -307 368 274 -381 -221 427 182 -435 -113 455 71 -452 -2 458 -47 -450 109 458 -143 -416 217
6239 217 404 -274 -348 310 326 -371 -273 399 231 -430 -156 449 124 -455 -51 490 2 -461 68 464 -119
6260 -119 -438 194 448 -238 -384 313 375 -335 -316 357 274 -396 -232 429 161 -476 -120 468 50 -489 -16
6281 -16 474 -63 -467 132 444 -173 -418 242 411 -273 -370 346 320 -384 -279 422 242 -441 -182 490 121
6302 121 -475 -39 491 -6 -483 73 492 -120 -463 195 429 -262 -411 300 370 -337 -324 386 274 -408 -230
6323 -230 461 165 -448 -99 486 44 -498 7 475 -78 -487 127 484 -188 -451 248 421 -283 -351 354
6343 354 335 -364 -267 424 230 -445 -182 462 119 -489 -44 504 3 -469 56 487 -125 -464 191 440 -220
6364 -220 -398 291 373 -320 -346 361 282 -411 -221 431 172 -461 -129 475 62 -484 25 498 -66 -454 134
6385 134 450 -176 -423 221 402 -280 -376 311 325 -374 -267 409 238 -412 -164 456 135 -452 -64 467 4
6406 4 -453 52 467 -109 -439 163 406 -219 -387 270 368 -299 -316 367 292 -383 -199 420 183 -431 -110 446
6428 446 71 -450 4 449 -36 -412 119 438 -143 -391 227 369 -249 -337 304 307 -330 -275 368 209 -403
6449 -403 -164 418 120 -423 -51 436 26 -412 50 445 -93 -412 167 391 -196 -361 227 323 -274 -291 331
6470 331 268 -326 -193 394 194 -362 -118 404 71 -395 -1 411 -22 -389 83 368 -146 -358 173 333
6490 333 -222 -307 280 270 -275 -226 322 206 -344 -155 356 95 -363 -50 383 14 -366 38 389 -73 -335
6511 -335 139 348 -132 -298 221 295 -228 -233 270 243 -294 -185 305 146 -321 -95 351 64 -347 -3 347
6532 347 -27 -330 72 334 -121 -300 150 267 -188 -251 212 225 -237 -190 268 160 -253 -96 305 88 -297
6553 -297 -48 312 14 -280 40 299 -95 -276 102 267 -135 -246 174 242 -180 -190 237 168 -230 -127 244
6574 244 106 -275 -85 264 14 -279 -10 259 -30 -256 70 249 -79 -216 137 210 -145 -174 173 172 -199
6595 -199 -142 211 107 -211 -73 238 50 -219 2 229 0 -212 38 223 -55 -197 100 180 -111 -188 131
6616 131 145 -141 -114 162 110 -176 -90 192 67 -178 -25 203 20 -174 18 199 -54 -186 58 165 -72
6637 -72 -141 111 144 -103 -110 147 104 -117 -61 158 59 -157 -28 160 5 -168 19 160 -30 -142 61 135 -79
6660 -79 -104 74 93 -99 -79 107 62 -126 -47 117 48 -122 -24 137 -1 -128 8 124 -22 -100 58 104 -51
6683 -51 -78 77 96 -63 -58 101 68 -95 -34 91 13 -108 11 97 -20 -84 41 86 -41 -80 69 74 -49 -80 61
6708 61 36 -92 -42 86 15 -89 -3 108 4 -78 42 112 -23 -87 51 71 -57 -55 86 54 -71 -30 83 40 -68
6733 -68 -4 97 -10 -85 28 94 -26 -85 52 87 -54 -73 77 40 -74 -43 82 19 -81 -9 91 20 -80 10
6757 10 117 -17 -84 65 96 -33 -79 85 80 -76 -63 100 49 -89 3 118 35 -113 9 118 -9 -117 31
6780 31 101 -32 -121 62 97 -81 -74 99 84 -93 -52 123 68 -129 -28 137 24 -129 4 142 2 -126 52
6803 52 149 -69 -129 95 126 -99 -121 124 103 -115 -80 137 74 -155 -49 161 36 -166 17 177 -24 -148 43
6826 43 162 -72 -138 89 165 -115 -127 121 114 -144 -108 168 86 -164 -46 165 31 -182 -6 196 -27 -173 55
6849 55 202 -46 -167 86 177 -114 -158 131 149 -141 -133 187 101 -198 -84 200 62 -209 -26 218 -10 -223
6871 -223 30 226 -58 -213 75 183 -107 -204 137 172 -152 -152 184 137 -190 -103 212 82 -211 -37 231 26
6893 26 -235 9 252 -28 -219 79 229 -89 -211 132 218 -139 -181 184 171 -207 -132 207 110 -250 -86 240
6915 240 57 -247 -16 270 -4 -249 62 253 -90 -240 119 221 -134 -188 167 199 -195 -160 224 164 -226
6936 -226 -99 256 74 -251 -21 287 10 -285 30 269 -52 -258 93 253 -123 -227 162 217 -179 -188 209
6957 209 180 -270 -159 256 104 -266 -94 271 28 -292 -10 291 -19 -279 79 280 -105 -274 141 253
6977 253 -153 -217 199 194 -212 -172 243 155 -255 -107 286 93 -279 -31 301 12 -290 19 287 -76 -291 92
6999 92 268 -154 -269 199 227 -214 -203 238 171 -247 -132 268 122 -296 -63 308 44 -292 -5 316 -35
7020 -35 -291 102 293 -110 -272 152 249 -170 -230 222 200 -222 -171 264 143 -266 -112 286 49 -291 -29 288
7042 288 0 -308 47 285 -67 -269 113 270 -136 -247 182 233 -209 -199 243 190 -263 -133 291 106 -302
7063 -302 -53 304 40 -284 45 311 -43 -284 89 284 -122 -261 158 238 -167 -220 232 190 -242 -157 251
7084 251 127 -266 -94 291 58 -284 -17 288 7 -296 59 294 -99 -268 115 250 -170 -221 199 207 -191
7105 -191 -166 236 160 -238 -109 268 79 -254 -38 295 23 -289 21 293 -52 -283 93 258 -145 -243 161
7126 161 219 -211 -185 217 163 -226 -133 251 109 -273 -66 272 57 -268 10 271 -40 -252 89 279 -98
7147 -98 -222 143 243 -157 -196 202 181 -211 -157 230 118 -236 -85 267 59 -262 -16 285 -16 -278 43
7168 43 259 -98 -255 115 227 -140 -217 171 176 -183 -156 225 148 -226 -109 257 73 -235 -28 258 6 -262
7190 -262 33 264 -52 -240 90 228 -117 -209 149 197 -174 -169 194 167 -214 -92 236 89 -232 -57 239 2
7212 2 -236 0 235 -39 -235 83 226 -92 -216 139 195 -158 -168 185 149 -206 -123 212 100 -226 -46 251
7234 251 43 -215 13 237 -14 -206 79 215 -89 -208 108 204 -145 -176 159 147 -174 -130 201 100 -205
7255 -205 -64 219 41 -220 -24 235 -16 -230 70 214 -70 -185 109 194 -105 -153 163 174 -162 -121 204
7276 204 114 -186 -76 195 60 -223 -21 226 -4 -206 45 199 -70 -206 103 194 -114 -169 145 154 -171 -118
7298 -118 165 97 -191 -86 206 47 -210 -10 214 -17 -209 46 213 -69 -200 99 198 -100 -153 160 145
7319 145 -157 -118 181 119 -194 -88 201 61 -206 -13 224 10 -205 44 206 -45 -199 99 202 -106 -170
7340 -170 128 161 -149 -143 177 119 -185 -78 213 60 -197 -10 205 6 -192 46 195 -60 -192 97 203
7361 203 -103 -162 136 173 -139 -132 187 132 -174 -70 189 58 -193 -44 208 -3 -215 12 215 -69 -196 85
7383 85 190 -122 -176 144 164 -154 -146 192 126 -187 -98 228 72 -200 -35 224 3 -211 23 228 -48 -194
7405 -194 83 208 -87 -188 147 201 -150 -149 178 141 -192 -126 208 75 -221 -61 239 12 -231 -1 234 -33
7427 -33 -228 66 235 -118 -207 138 194 -153 -172 176 148 -190 -122 218 117 -217 -70 237 38 -242 10 267
7449 267 -22 -242 64 239 -90 -229 129 205 -149 -196 176 163 -201 -135 219 122 -230 -97 241 56 -248 -25
7471 -25 258 -14 -265 54 250 -75 -243 125 230 -125 -208 177 177 -181 -158 216 143 -234 -104 251 73 -258
7493 -258 -38 260 21 -275 27 270 -63 -250 98 256 -130 -236 154 211 -181 -197 206 157 -240 -137 268
7514 268 98 -256 -57 282 35 -264 4 287 -19 -259 92 277 -96 -251 134 234 -160 -208 205 202 -215
7535 -215 -149 239 143 -253 -112 262 63 -262 -48 260 -13 -306 40 272 -94 -268 109 279 -162 -245 187
7556 187 227 -211 -172 218 157 -244 -137 273 98 -269 -58 292 15 -289 15 294 -44 -293 101 295 -120
7577 -120 -258 161 251 -176 -214 226 205 -224 -150 261 116 -293 -99 280 65 -299 -17 306 -8 -288 74
7598 74 288 -83 -276 130 266 -153 -229 203 230 -207 -182 257 176 -273 -115 296 107 -282 -46 314 16 -283
7620 -283 35 299 -73 -291 117 290 -135 -267 174 241 -204 -205 232 182 -266 -145 253 123 -286 -81 284
7641 284 49 -306 -9 307 -32 -287 65 301 -98 -287 153 277 -165 -218 214 218 -226 -178 262 162 -268
7662 -268 -112 272 96 -303 -27 311 16 -295 44 292 -68 -286 96 264 -139 -244 163 229 -204 -211 231
7683 231 177 -248 -128 271 114 -273 -85 303 48 -295 16 309 -24 -280 80 283 -101 -284 148 247 -172
7704 -172 -225 198 218 -210 -180 242 149 -273 -117 269 70 -291 -61 300 14 -279 39 275 -70 -271 98
7725 98 270 -125 -240 173 207 -197 -206 212 172 -224 -137 259 103 -249 -38 273 53 -273 16 274 -33 -275
7747 -275 51 272 -99 -237 109 229 -141 -220 188 180 -219 -159 230 142 -251 -110 245 64 -269 -43 265 1
7769 1 -250 35 247 -58 -247 104 256 -110 -220 163 206 -161 -167 209 175 -201 -113 225 83 -235 -62 243
7791 243 38 -247 2 252 -20 -237 52 231 -84 -219 98 208 -143 -174 161 154 -194 -153 206 123 -210 -64
7813 -64 224 81 -219 -22 238 4 -214 39 229 -43 -204 86 191 -107 -179 130 163 -162 -128 165 119 -181
7835 -181 -82 198 89 -172 -63 196 29 -208 1 203 -22 -218 41 182 -96 -171 102 187 -120 -121 133 148
7857 148 -133 -85 170 83 -172 -49 176 47 -176 -4 174 12 -171 46 184 -36 -155 85 161 -93 -141
7878 -141 105 130 -133 -101 127 96 -152 -56 155 48 -154 -19 151 -2 -142 13 159 -29 -149 53 128 -80
7900 -80 -139 75 105 -95 -86 115 95 -129 -57 155 60 -116 -12 157 14 -131 16 124 -22 -123 27 105 -66
7923 -66 -105 74 78 -79 -84 82 78 -87 -48 102 46 -102 -14 118 9 -109 11 94 -25 -82 30 110 -44 -73 56
7948 56 86 -58 -60 92 66 -78 -37 94 29 -75 -7 89 15 -77 15 105 -20 -78 28 79 -39 -59 69 60 -53 -39
7974 -39 64 38 -70 -32 83 17 -73 -3 91 0 -63 36 67 -27 -49 56 72 -48 -53 56 52 -72 -28 74 26 -67 -1
8001 -1 71 -3 -63 17 60 -31 -62 34 60 -48 -48 45 49 -58 -50 76 22 -81 -15 77 3 -82 14 85 -13 -67 55 81 -39
8030 -39 -51 41 64 -58 -40 51 48 -73 -30 89 29 -65 -1 103 7 -88 21 81 -18 -86 41 71 -52 -70 67 65 -81
8057 -81 -47 92 26 -85 -8 102 1 -104 10 85 -8 -114 44 92 -48 -86 67 84 -73 -69 94 53 -96 -44
8081 -44 102 48 -87 -31 118 9 -117 12 104 -29 -122 44 110 -71 -120 61 92 -105 -90 103 75 -112 -67 117
8105 117 32 -132 -48 131 0 -150 3 147 -30 -138 40 124 -55 -133 93 136 -83 -101 116 95 -136 -81 147
8128 147 80 -124 -36 161 32 -161 -17 175 -19 -178 46 150 -69 -165 76 139 -104 -144 121 118 -132 -113 148
8151 148 96 -164 -56 169 37 -163 -26 203 21 -181 37 186 -40 -181 66 175 -87 -182 104 146 -147
8172 -147 -123 165 108 -169 -90 175 49 -206 -61 212 19 -229 7 210 -45 -218 57 210 -107
8191a07
##END NTUPLES=NMR FID
##END=
