##TITLE=1H_NV104
 aceton d6
 8 sc, 
 27.12.2023
##JCAMPDX= 6.0         $$ Bruker NMR JCAMP-DX V2.0
##DATA TYPE= NMR FID
##DATA CLASS= NTUPLES
##ORIGIN= UXNMR, Bruker Analytische Messtechnik GmbH
##OWNER= root
$$ XWIN-NMR		Version 3.5
$$ Wed Dec 27 13:58:35 2023 Russian Standard Time (UT+4h)  she@DPX200
##.OBSERVE FREQUENCY= 200.1313
##.OBSERVE NUCLEUS= ^1H
##.DELAY= (6, 6)
##.ACQUISITION MODE= SIMULTANEOUS
##.ACQUISITION SCHEME= undefined
##.AVERAGES= 8
##.DIGITISER RES= 18
##SPECTROMETER/DATA SYSTEM= spect
##.PULSE SEQUENCE= zg30
##.SOLVENT NAME= Acetone
##.SHIFT REFERENCE= (INTERNAL, Acetone, 0, 15.7039)
##AUDIT TRAIL= $$ (NUMBER, WHEN, WHO, WHERE, WHAT)
$$ ##TITLE= Audit trail, XWIN-NMR		Version 3.5
$$ ##JCAMPDX= 5.01
$$ ##ORIGIN= Bruker BioSpin GmbH
$$ ##OWNER= she
$$ F:/spectra/data/she/nmr/H-F/1/audita.txt
$$ ##AUDIT TRAIL=  $$ (NUMBER, WHEN, WHO, WHERE, WHAT)
(   1,<2023-12-27 13:57:45.81 +0400>,<she>,<DPX200>,
      <created by zg, POWCHK disabled, PULCHK disabled
       configuration hash MD5:
       00 E9 B6 7A A2 85 ED C7 34 08 36 98 17 FE 4E 26
       data hash MD5: 16K
       98 68 7D 84 DB 21 4F B6 05 44 BF 25 4E EB D8 97>)
$$ ##END=
$$ 
$$ hash MD5
$$ 0E 9D FD A7 18 09 CA 66 C3 72 3E D6 AD F0 C3 28
##$RELAX= 
##$RELAX= 
##$RELAX= 
##$RELAX= 
##$RELAX= 
##$RELAX= 
$$ Bruker specific parameters
$$ --------------------------
##$DU= <F:/spectra>
##$EXPNO= 1
##$NAME= <H-F>
##$PROCNO= 1
##$TYPE= <nmr>
##$USER= <she>
##$AMP= (0..31)
100 100 100 100 100 100 100 100 100 100 100 100 100 100 100 100 100 100 
100 100 100 100 100 100 100 100 100 100 100 100 100 100 
##$AQSEQ= 0
##$AQ_mod= 1
##$AUNM= <au_zg>
##$AUTOPOS= <>
##$BF1= 200.13
##$BF2= 200.13
##$BF3= 200.13
##$BF4= 200.13
##$BF5= 200.13
##$BF6= 200.13
##$BF7= 200.13
##$BF8= 200.13
##$BYTORDA= 1
##$CFDGTYP= 0
##$CFRGTYP= 5
##$CHEMSTR= <none>
##$CNST= (0..31)
1 1 145 1 1 1 1 1 1 1 1 1 1 1 1 1 1 1 1 1 1 1 1 1 1 1 1 1 1 1 1 1 
##$CPDPRG= <>
##$CPDPRG1= <>
##$CPDPRG2= <>
##$CPDPRG3= <>
##$CPDPRG4= <mlev>
##$CPDPRG5= <mlev>
##$CPDPRG6= <mlev>
##$CPDPRG7= <mlev>
##$CPDPRG8= <mlev>
##$CPDPRGB= <>
##$CPDPRGT= <>
##$D= (0..31)
0 1.2 0 0 0 0 0 0 0 0.06 0 0.03 0 0 0 0 0.0002 0 0 0 0 0 0 0 0 0 0 0 0 
0 0 0 
##$DATE= 1703671065
##$DBL= (0..7)
120 120 120 120 120 120 120 120 
##$DBP= (0..7)
150 150 150 150 150 150 150 150 
##$DBP07= 0
##$DBPNAM0= <>
##$DBPNAM1= <>
##$DBPNAM2= <>
##$DBPNAM3= <>
##$DBPNAM4= <>
##$DBPNAM5= <>
##$DBPNAM6= <>
##$DBPNAM7= <>
##$DBPOAL= (0..7)
0.5 0.5 0.5 0.5 0.5 0.5 0.5 0.5 
##$DBPOFFS= (0..7)
0 0 0 0 0 0 0 0 
##$DE= 6
##$DECBNUC= <off>
##$DECIM= 32
##$DECNUC= <off>
##$DECSTAT= 4
##$DIGMOD= 1
##$DIGTYP= 9
##$DL= (0..7)
0 120 120 120 120 120 120 120 
##$DP= (0..7)
150 150 150 150 150 150 150 150 
##$DP07= 0
##$DPNAME0= <>
##$DPNAME1= <>
##$DPNAME2= <>
##$DPNAME3= <>
##$DPNAME4= <>
##$DPNAME5= <>
##$DPNAME6= <>
##$DPNAME7= <>
##$DPOAL= (0..7)
0.5 0.5 0.5 0.5 0.5 0.5 0.5 0.5 
##$DPOFFS= (0..7)
0 0 0 0 0 0 0 0 
##$DQDMODE= 0
##$DR= 18
##$DS= 0
##$DSLIST= <SSSSSSSSSSSSSSS>
$$ [...]
##$SUBNAM2= <"">
##$SUBNAM3= <"">
##$SUBNAM4= <"">
##$SUBNAM5= <"">
##$SUBNAM6= <"">
##$SUBNAM7= <"">
##$SUBNAM8= <"">
##$SUBNAM9= <"">
##$SW= 18.0517328524113
##$SWIBOX= (0..15)
0 0 2 0 0 0 0 0 0 0 0 0 0 0 0 0 
##$SW_h= 3612.71676300578
##$TD= 16384
##$TD0= 1
##$TE= 0
##$TE2= 300
##$TE3= 300
##$TEG= 300
##$TL= (0..7)
0 120 120 120 120 120 120 120 
##$TP= (0..7)
150 150 150 150 150 150 150 150 
##$TP07= 0
##$TPNAME0= <>
##$TPNAME1= <>
##$TPNAME2= <>
##$TPNAME3= <>
##$TPNAME4= <>
##$TPNAME5= <>
##$TPNAME6= <>
##$TPNAME7= <>
##$TPOAL= (0..7)
0.5 0.5 0.5 0.5 0.5 0.5 0.5 0.5 
##$TPOFFS= (0..7)
0 0 0 0 0 0 0 0 
##$TUNHIN= 0
##$TUNHOUT= 0
##$TUNXOUT= 0
##$USERA1= <user>
##$USERA2= <user>
##$USERA3= <user>
##$USERA4= <user>
##$USERA5= <user>
##$V9= 5
##$VALIST= <valist>
##$VCLIST= <CCCCCCCCCCCCCCC>
##$VD= 0
##$VDLIST= <DDDDDDDDDDDDDDD>
##$VPLIST= <PPPPPPPPPPPPPPP>
##$VTLIST= <TTTTTTTTTTTTTTT>
##$WBST= 1024
##$WBSW= 4
##$XGAIN= (0..3)
0 0 0 0 
##$XL= 0
##$YL= 0
##$YMAX_a= 360320
##$YMIN_a= -361440
##$ZGOPTNS= <>
##$ZL1= 120
##$ZL2= 120
##$ZL3= 120
##$ZL4= 120
##$ABSF1= 10
##$ABSF2= 0
##$ABSG= 5
##$ABSL= 3
##$ALPHA= 0
##$AQORDER= 0
##$ASSFAC= 0
##$ASSFACI= 0
##$ASSFACX= 0
##$ASSWID= 0
##$AUNMP= <proc_1d>
##$AZFE= 0.1
##$AZFW= 0.1
##$BCFW= 1
##$BC_mod= 2
##$BYTORDP= 1
##$COROFFS= 0
##$CY= 11.3945322036743
##$DATMOD= 1
##$DC= 2
##$DFILT= <>
##$DTYPP= 0
##$F1P= 15.7292609196834
##$F2P= 12.9074282941183
##$FCOR= 0.5
##$FTSIZE= 0
##$FT_mod= 4
##$GAMMA= 1
##$GB= 0.15
##$INTBC= 1
##$INTSCL= 1
##$ISEN= 128
##$LB= 0.24
##$LEV0= 0
##$LPBIN= 0
##$MAXI= 10000
##$MC2= 0
##$MEAN= 0
##$ME_mod= 0
##$MI= 1.114404
##$NCOEF= 0
##$NC_proc= 0
##$NLEV= 6
##$NOISF1= 3.799351
##$NOISF2= 2.8
##$NSP= 1
##$NTH_PI= 0
##$NZP= 0
##$OFFSET= 15.70392
##$PC= 1
##$PHC0= -24750.53
##$PHC1= 9.052731
##$PH_mod= 1
##$PKNL= yes
##$PPARMOD= 0
##$PSCAL= 0
##$PSIGN= 0
##$REVERSE= no
##$SF= 200.130013532006
##$SI= 16384
##$SIGF1= 3
##$SIGF2= 2
##$SINO= 400
##$SIOLD= 16384
##$SREGLST= <1H.CDCl3>
##$SSB= 0
##$STSI= 0
##$STSR= 0
##$SW_p= 3612.71676300578
##$SYMM= 0
##$S_DEV= 0
##$TDeff= 0
##$TDoff= 0
##$TI= <>
##$TILT= no
##$TM1= 0
##$TM2= 0
##$TOPLEV= 0
##$USERP1= <user>
##$USERP2= <user>
##$USERP3= <user>
##$USERP4= <user>
##$USERP5= <user>
##$WDW= 1
##$XDIM= 8192
##$YMAX_p= 0
##$YMIN_p= 0
$$ End of Bruker specific parameters
$$ ---------------------------------
##NTUPLES= NMR FID
##VAR_NAME=  TIME,          FID/REAL,        FID/IMAG
##SYMBOL=    X,             R,               I
##VAR_TYPE=  INDEPENDENT,   DEPENDENT,       DEPENDENT
##VAR_FORM=  AFFN,          ASDF,            ASDF
##VAR_DIM=   8192,          8192,            8192
##UNITS=     SECONDS,       ARBITRARY UNITS, ARBITRARY UNITS
##FACTOR=    0.0002768,     1,               1
##FIRST=     0,             0,               0
##LAST=      2.2672688,     0,               0
##MIN=       0,             -361440,         0
##MAX=       2.2672688,     360320,          0
$$ Real data points
##PAGE= N=1
##DATA TABLE= (X++(R..R)), XYDATA
$$ [...]
374A8934r385j9480j947J6522J0417r204j3747n43P652M31o240J846J2105M840
388A2201j2074j2416O103J6887L243j5281j3177N190J4491M815p421n963L622
401B20L799n496o752M378J0220j183j2780n098J2501J5298j136j4664q586O128
415c151Q546k793q713o19O883J400n695m3J0109O833p649j3179j913J0884Q291
430I191n161j0728j184R135N872m396n025K031K578m835o268L092J0231M248p020
445A761q160L127J1126L583r446r888J193O229L01l895J097N776J585m927l381
460c919M750P247j294j0409o381O123R811K55p331l006M176K994k978l384J484
475a862L212j453n093p9Q136P449l305r352k467O140L738m553o214l05L785J878
$$ plain form
374 18934 9549 -9931 -11878 4644 15061 5857 -7890 -8433 -781 -350 -6590 -4744 7361 12201
388 12201 127 -12289 -6186 10701 13944 -1337 -14514 -9324 5167 9982 2561 -3402 220
401 220 4019 -1477 -8229 -3851 6369 5186 -7594 -12692 -191 15107 13971 -693 -9279 -3151
415 -3151 5395 2602 -6111 -6730 153 1553 -4142 -4185 5924 12757 5108 -8071 -9984 900 9191
430 9191 4030 -6698 -7882 1253 7125 2729 -2296 -265 2313 -2522 -8790 -5698 4533 8781 1761
445 1761 -6399 -3272 7854 11437 1991 -7897 -6704 -475 -174 -4069 -2972 2804 4389 -538 -3919
460 -3919 831 8078 6784 -3625 -10006 -3883 5928 6183 -1148 -4154 22 3016 38 -3346 -1862
475 -1862 1350 -103 -5196 -5275 2861 10310 7005 -2347 -4814 1326 5064 511 -5703 -6008 -2223 -345
491c45j043O30M270K828l841o167O64O758K267o290o291J918O392K311l249l330
507b518P94K165r76k676J458N100J264m957l055M389N717j300p021m515J753L729
523f49L85k599j53L617K519j657j120L037K743l281o371j638L887L595j675m236
539c596r34L816L439j134k517R06K189r50k801R11L974J226l577m104J19L502
555D69J499l295l826Q98L949J830j039M52K449O60k508k252Q46J955r59m032k622
572e526K195M489J043k813j340K207K022r93j538O75J233o83k250n96K339K448
588B912j422m011j250K855K594j123k241M39K172Q72p46l70P46M11j773k686j93
605b814K651J720j876k332J045L214J171j514j560J55P34m10j252J02J568N87
$$ plain form
491 -345 -1388 -758 3512 6340 2499 -3668 -3004 3754 6021 -269 -6560 -4642 1750 4061 812 -2518
507 -2518 -1724 441 -535 -3211 -1753 3347 4611 -346 -3401 988 6705 5405 -1616 -6131 -4378 -649
523 -649 -264 -2863 -3016 601 3120 1463 343 3380 6123 2842 -3529 -5167 -1280 2315 640 -3596
539 -3596 -4530 -714 2725 1591 -926 -20 2169 1219 -1582 -671 3303 4529 952 -3152 -3033 469
555 469 1968 -1327 -5153 -4255 -306 1524 485 937 3386 4046 1538 -714 132 2087 1128 -2904 -5526
572 -5526 -3331 1158 2201 -612 -1952 255 2277 1284 -254 421 1654 971 -1279 -1875 464 2912
588 2912 1490 -2521 -3771 -916 1678 555 -1686 -1247 925 1797 1051 681 1427 1838 65 -2621 -2814
605 -2814 -163 1557 -319 -2651 -1606 1608 2779 1265 -295 -140 594 184 -1068 -966 602 1189
621A189j824j562J484K686q3k698j535J296K032K36j045n35Q35P02j008j036P63
638a03J188q03k246m18K215J955m94j781n82J239J260n19j479j27Q95j4j158P5
656h97J661R34j376j715K09J625Q95j088j491P8J453P72p41n54O51L46r54q99
674a091N69J194R7j234r52P26J677M65j311j058M95J067l28q06J41P55k3r06k71
693g94R20R75l33j451o65J066J276k91j109j22P64L05m06l41L24L27m54p95K8
712g76R97P07n31j080K2J043N85o43p67J47M41qm29J4M70K68n88o87L83J078J92
733H38r85o63M94Q16K5n45k63K26K63k46l47K52N14j7p95k91O98P97k18q70k42
754e59M96N60j97n28o4L79N5l85j31N33M24m66o51N9P38L26m08n88JM83K20k86
$$ plain form
621 1189 -635 -2197 -713 1973 1890 -808 -2343 -1047 985 1221 176 -359 476 1178 170 -866 -103
638 -103 1085 282 -1964 -2382 -167 1788 1294 -487 -1069 170 1430 911 -568 -695 200 186 -972 -897
656 -897 764 1698 322 -1393 -1184 441 1336 248 -1243 -1165 288 1060 319 -235 416 762 -192 -1091
674 -1091 -522 672 769 -465 -1417 -691 986 1451 140 -918 -423 644 316 -490 -349 406 383 -523 -794
693 -794 126 1101 768 -683 -1348 -282 994 703 -406 -528 236 541 135 -206 118 445 -9 -804 -776
712 -776 221 928 397 -683 -661 382 967 324 -443 -296 145 137 -292 -278 192 460 -128 -815 -432 646 838
733 838 -147 -810 -316 500 525 -20 -283 -57 206 -40 -387 -135 379 362 -433 -724 -26 771 553 -317 -559
754 -559 -63 497 300 -228 -292 87 142 -243 -374 159 583 117 -534 -475 263 589 181 -407 -406 77 297 11
776A1k28J57K31j63k99J37M79J40n26m03K16N58J78m46m16J64M01J6l40J9K82
797A68kl07j94L52L85j10n30j83M01L76j57l61j62L11K13k14j11J66J65j08k74
818a76m7L42J98k14m26n2M40K11j98k31J06J44qj53%J68R9k64k08J31L61J2k79
841d4j90J03K98J2k55r6J75Q8o7j15J13J09n8k04o9J53K36q0k90lK27J68j57r5
865d1l2J04M7j70p5K13R0j68j79Q0L45qj91j55Q5J25J1p3r4O2J22j12r8OK10R
891A13j16k11K03J64n2r1k09K04J02m7j13j7Q9J7q0p8J08J31j01pj07J58R6j21
915C5j08m2J00Q0r2mN1M3pj66P7M8O1j13j10N7J29J44j57j00O0Q8j25j4K5O1O0
942H1j14m7M8O3L0p1o6Q4O0j3j27QQ8L2p5K2jN6o5%lM4J0k9k7k8P8m4Ll2J0NM3
$$ plain form
776 11 -217 -60 171 8 -291 -154 325 465 -61 -464 -248 310 488 42 -374 -210 191 207 -133 -114 168
797 168 166 -141 -335 17 402 292 -238 -421 -20 356 199 -162 -324 -13 200 -14 -125 41 206 98 -176
818 -176 -223 119 317 103 -323 -375 65 276 78 -153 -47 97 89 -64 -64 104 203 -61 -269 -138 223 235 -44
841 -44 -234 -131 167 179 -76 -172 3 91 24 -91 22 131 73 -131 -200 -47 189 109 -181 -184 43 211 54 -41
865 -41 -73 31 78 -92 -167 46 136 -32 -211 -131 214 206 15 -140 -55 70 81 8 -86 -24 98 -14 -112 -106 104 113
891 113 -3 -214 -11 153 101 10 -199 5 107 60 -53 -70 19 36 -44 -122 -14 117 16 9 -98 60 156 35
915 35 -73 -115 -15 65 -27 -31 20 63 56 -110 -33 15 76 -37 -147 -90 39 183 26 -74 -14 74 -51 -65 -40 21 81
942 81 -33 -80 -32 31 61 -10 -76 8 68 55 -72 -64 24 56 -19 3 2 58 -7 -7 -10 34 44 15 -12 -40 38 -6 -3 -35 -25 -20 23
975B3n0Oj8O9j8qm5L2J1K7j3Lm4M9p3Q2p7K3RPk6J2J7j4M5k6J6k5mLO1j7q4j9
1009f6R2L7m9n1M2m2L6q2R5j2Q3j44p4O4J10M7j28l9O7KoK3kK9kk3m0Q0K0or5
1040c4l8j9Q2P4q6l5K2O4k8o7J02k8K0j04jJ31Lj4j07j2O6N6rr2K0L8K0n1J3K7
1070A3P0j52L4L2L4N5n0r8O4P8ln5o0N5JMo2O4K1j3m4p2N9N6K9o3l7k2P8L7q2
1101b9JMO8l0l7O6K3p2j31R7N9P0q1n4j8K8R7n1j4JK7j7o1Q7K7K5o6p6J2J07l0
1132C2n7k3RM0M6p2P7k3L0j28l6P8M7M7p9l6j6J29qo5o6N3rk5J8L2O5Jj14LL6
1163a4J08K4j48mK9O9np2J9M2l8j2lO7Rm1q6k9J22M1q4n2J5K1O6rr3J9M3j1K7
1194B0Ok5N6n8l8m4Q1O3k7r5nN9O9l2m8L7N7q3m8Q2j4kk2n3K2N4J5k2m6j9L8j8
$$ plain form
975 23 -27 -21 -39 30 12 4 -41 -9 2 29 16 19 -25 24 -49 33 -44 -21 -12 -5 -31 -19 -2 -16 29 3 19 -6 -10 -7 54 37 -47 -66
1009 -66 26 63 14 -37 5 -37 -1 -83 12 0 83 -61 -135 -71 39 86 -42 -81 -14 -12 -18 5 3 32 30 7 -33 47 67 61 -34
1040 -34 -72 -91 -9 65 -21 -56 -34 30 2 -65 37 9 29 -75 -76 55 58 44 -63 -75 -9 47 38 -54 -34 4 24 -27 -14 13
1070 13 83 -69 -35 -3 31 86 36 -62 2 80 77 22 -38 17 18 22 -40 24 45 32 -12 -84 -25 31 60 -3 -40 -62 16 53 -29
1101 -29 -28 -24 44 14 -23 43 66 -6 -137 -40 19 89 8 -46 -64 -36 61 10 -4 -3 24 7 -54 33 60 85 19 -57 -45 62 32
1132 32 -25 -48 -39 1 47 -25 52 29 59 -69 -105 -27 20 67 -12 -48 -64 65 57 -8 -74 -21 -30 -55 -37 -5 60 61 -53 -50 -14
1163 -14 94 118 -30 -34 -5 64 59 -13 6 48 10 -2 -5 62 71 30 -56 -85 37 78 -6 -58 -43 -22 44 35 -58 -39 4 -7 20
1194 20 26 1 57 -1 -39 -83 -2 61 34 -61 -66 -7 62 30 -18 19 76 -7 -55 27 13 11 -11 -64 -42 12 27 5 -41 -60 -22 -40
1226d0nk7O4k7j5l2J04K4j4j5p5M4Q3k0p1K2l3M0m9N9N1o9P6r3J2M9K9l6m6j5
1256b5N1ol2J2nk1M9j4%Qn5J7o5J11J1kq1j6K4R0Rn9%J3Km4J2L8M6r1ko9J32J1
1290D9m7m1K2MR3l6m3k0N3Mr1R5kL2r0m5j8J24k6Jp5j6N1N7n0O%rkm3L6J36q6
1323B3n2m3N6jR7p1k0mJ9Q7r8M3Kk9J9m4j4J01k9o9m3M4Q5K2p2j15Q0M4j4QLJ0
1355B5kq7J4rJ04J2o3j5M3N6m0k9k4M7jk1j8K7N1k1q6j3L6R2p5l2JR7n7J1q0O2
1387Em6j0J0N4Ml7N0p1kK9%K0o4J3O1K2k9k6MQ8o3l3J5j6L0l2L7mM2po3L3J0L3
1421E7p0mj7M2Qm5P9j6J5lr7LJ16K8o8jj04J00Pl3PJ1j8J4l1J6L5km3LJ5K2Nl6
1455ej10J10j1P2q0j7O8no8L6L6j8K3o2p9R2P7n9k4m4J03l4km7QM6k2L9m6J5P1
$$ plain form
1226 -40 -45 -72 -8 -35 -50 -82 22 46 32 17 -58 -14 69 49 -22 0 -33 7 -42 17 68 -1 75 -18 -6 43 72 36 -10 -25
1256 -25 26 20 -12 0 -5 -26 23 9 9 17 -38 -21 -86 25 36 34 -47 -63 -39 51 60 1 1 14 16 -28 -16 22 68 -23 -25 -94 38 49
1290 49 2 -39 -17 -13 80 44 1 -19 34 38 -53 42 40 72 -18 -63 -81 43 17 18 -57 -73 -22 35 -15 -9 -9 -18 -20 -63 -27 109 23
1323 23 -29 -72 -16 -17 80 9 -11 -15 4 91 -7 36 38 9 28 -16 -30 71 42 -27 -70 -26 59 81 9 -106 -26 18 4 12 15 25
1355 25 23 -64 -50 -59 45 57 -6 -21 22 78 38 9 -15 32 31 10 -8 19 70 49 -37 -50 -14 78 3 -29 -28 69 12 23 -57 5
1387 5 -41 -51 -41 13 17 -20 30 -41 -43 -14 -14 6 -58 -45 16 38 9 -17 -13 75 12 -21 -6 -22 8 -24 13 9 51 44 -19 14 24 57
1421 57 -13 -17 -34 8 16 -29 50 34 49 46 -51 -48 68 96 28 27 -77 23 30 -3 4 15 -3 11 -20 -4 31 29 -14 -11 4 26 31 -5
1455 -5 -115 -5 -16 56 -24 -41 27 22 -46 -10 26 8 31 -31 -110 -18 59 0 -24 -68 35 1 -1 -48 -40 6 -16 23 -23 -8 63
1486F3q4k4j2Q8k2M9j06J9N7Om2jM1%k4k0p9J44J0l3r1J7N9Pl0M0q3P7jr2N2K3
1518Hj6o8L9QK2ol1k9L1L4J9m3M1N7j01K0k5L7P4j3m6%J5J5k3j7J4k3mK8j8o1
1550f2J9R4m6pj5O8p5m3N4K7J5K3l3k3J5J6p9K6m5P9l1l8P4J9J0j25j8P0Q4l7
1580A6pj8Pk6Q2m6k1O7j9r2NN8K7O7j70k9M7K1J10j11lK1K2k9K7Nk2M8q3j9J52
1611H7o0m7k4j0M3L4pm1L7J7J%n7M8J9l7ll8R4J6j5o2r1O2Q6n6m8N4Kn3M2lK0
1644A0J3r6l0O7R1j03J8n2N9N5rj7m5O9J6j6o8R3k4K6m9n2pQ3nk4q3L4M8j5rK0
1676bMlK1m6M9l1p0J6k0R8N1Pr0%M8r2j3K4J12l9mp3L9P1J7r1J2j7P3K3j5p4J3
1709bK6qK5jL2m9k9JJ3Pl7j4J5j3R1j8m8m2J20m7n8M6K0l0Rol8L2N7l1o1m3R8
$$ plain form
1486 63 -21 -45 -57 31 9 58 -48 -29 28 34 -8 -9 32 32 8 -12 -91 53 63 30 -61 -44 15 22 -8 32 -51 26 25 -67 -15 8
1518 8 -8 -76 -37 -29 -7 -13 -44 -73 -42 -8 11 -32 9 66 -35 -15 -40 -3 71 58 12 12 27 42 19 2 16 -7 -11 17 -1 -62
1550 -62 -43 51 5 -2 -17 51 -24 -67 -13 14 29 52 19 -4 11 27 -52 -26 -71 8 -23 -61 13 32 42 -83 -101 -31 53 16
1580 16 9 -9 -2 -28 54 8 -13 54 35 -57 -52 6 33 100 -70 -99 -52 -31 79 -32 -35 -14 8 -21 6 11 -11 37 -46 -65 87
1611 87 27 -20 -44 -54 -11 23 16 -25 12 29 30 30 -27 21 40 3 0 -38 56 72 57 -5 -96 -34 52 -4 -52 2 4 -49 -7 -10 10
1644 10 23 -73 -103 -36 55 -48 -30 -82 -23 32 23 6 -39 30 46 30 -38 55 31 57 8 -44 -51 32 27 3 -80 -46 2 -13 -22 -2
1676 -2 2 -1 20 -26 23 -8 -78 -62 -82 16 67 74 -16 -16 32 -60 -73 -49 63 24 20 -53 -14 57 74 -17 -5 -22 51 74 59 -15 -2
1709 -2 24 16 41 40 72 23 -6 -5 8 15 -22 -36 -21 -34 57 39 -9 -51 69 22 -36 10 30 0 9 3 -35 -3 54 23 -38 -81 17
1742A7Kpm6rO1Qk3l2K7K5l0p1Q1N4L0j16J6j7J00ll9j7n7N3j3k0K9OJ2o5m7O3
1774b8P3Opr3K5P3l6mPk0j8M9p2N1M8m6lKJ2OOk5k0L6J1l6j2k2O4m9N1r3J5K0
1808b9N8l6OpN8j6n2JkL1l7Pj7M6j5l6m1J48K7m5p1N4k0M6m0m9K3k2Qk4k1J21
1840E4l0o0j2J6J28n0r9MQL4O5p2l4N7m2k4JK9L2m0M0n5N0J2R1j57M1K6k1J3j8
1871a3M1jq4N8L1LK7mr5M0K9ONr9K4M8N8r1K9n4M5J0o3J5J14m2m7n9J7Q4lj7m1
1904b9j9K4L6m0j5N3l1K8M0m0mJk9j0J3M5Pn7J8KO9l3m4R4l2p8l1j4J19j6N7r1
1936gk0LO1k5m9L8l9P4o8J4Q0Mm4n5J4O4l1M2r7k4R7K1q1K3l5K8Nm9M8P3p8Jj7
1969b9m2Q5O8o5n0K1l3R2n9J9M2p9M5l5MO3L8j15j3N1L9m2j9J7QK0MK0rrk3k7
$$ plain form
1742 17 19 12 -34 -43 18 26 3 -29 -2 23 -7 -78 3 57 87 -29 -13 -30 70 67 28 11 -46 7 -6 -26 3 9 21 -44 -91 -28
1774 -28 45 51 44 -49 -24 49 13 9 16 -4 -22 27 -45 6 54 8 5 7 19 25 31 6 -14 22 33 -3 -15 -37 27 -22 29 -64 -49 -29
1808 -29 29 -7 -1 -8 50 34 -18 -17 -19 12 -25 -18 -35 11 -4 -40 -81 67 94 49 -22 32 12 58 18 -31 -8 -30 -22 -46 -67 54
1840 54 24 -36 -48 -32 96 46 -53 -49 -41 -7 58 -14 -48 9 -33 -57 -56 -27 5 -35 5 -50 0 12 103 -54 -13 13 -8 5 -13
1871 -13 28 27 -57 1 32 35 62 58 -37 3 32 38 43 -56 -32 16 74 -17 12 -42 3 13 -50 -35 79 37 -10 -69 -52 32 29 12 -29
1904 -29 -48 -24 12 -28 -43 10 -21 7 47 7 3 4 -25 -35 -22 23 30 -27 -9 -7 62 29 -15 79 47 -31 -62 -76 43 27 84 -7
1936 -7 -27 -24 37 12 -37 1 -38 36 -32 -18 62 66 22 -33 -19 45 14 56 -41 -65 32 53 -28 -5 -40 -12 -7 -56 -8 65 -13 -12 -29
1969 -29 -71 14 82 17 -33 -12 -45 47 -12 7 49 -30 15 -20 -16 47 85 -30 -43 8 47 5 -14 3 11 31 35 55 46 37 14 -13
2001a3j0J6O9k3k5n3M4J1Kk2n5M7N1n4L3l8K8nn5M5K9J5l1n7L1O7p8K4oP0p2%
2033a5J4M1k5l5K1n0O5%nK8m8pO6k4J4j09N6rP4o7J1L7Kk3o5O2Q9p6n4J1K8L0
2065C7K6r0J8l0NNj6K7M5j5m1l1J25K4q7L7q8L4L3K5j4Ln2N1j5K9n8K9m2kK8K1
2097B1Ll0j0K0J4M8o2l0J4k1L8o1P8j4M4j29MN0Q5L2j12p2R1j6k3O2K2j9Mm5m2
2128e6j0Q0oj8J4j1M7J1q1L4%OL4n4J1k3K1l1JQ0pj4Qo1N3l1L6n4j9O4L6r1L8
2161GL6J5l4m5J3L5j5%rj9M6m2L9l8Nn2L9K7k3N8m6J5r1P1O6k2n8j4kM2M2p6j8
2194d8K5O1m9RkJ8p0O0n6R2j9k2n5L5O4j9L4q4N9oN0j16J2J8RK9o1PQ7mk8j7n3
2227d0L8J6L7m3k9kNk3M1J2N0j0o8j4M4Ll0k3M8j8P2o9M3J0Pr5J5P9N0n4q0J6
$$ plain form
2001 -13 -23 -7 62 39 14 -39 5 16 18 -4 -59 -12 39 -15 18 -20 8 3 -52 -7 22 37 6 -51 -20 47 -31 -7 -13 57 -15 -15
2033 -15 -1 40 15 -20 1 -49 16 16 11 39 -9 -16 50 26 40 -69 -13 -22 52 -15 -4 33 35 12 -53 9 98 22 -32 -21 7 37
2065 37 63 -27 -9 -39 -34 -29 -45 -18 27 12 -29 -60 65 89 2 39 -49 -15 18 43 29 32 -20 31 16 45 -13 16 -26 -28 0 21
2097 21 24 -6 -16 4 18 66 4 -26 -12 -33 5 -56 22 8 52 -77 -73 -23 62 94 -18 -90 1 -15 -38 24 46 27 31 -14 -56
2128 -56 -66 14 8 -10 4 -7 40 51 -30 4 4 10 44 -10 1 -22 -1 -32 -31 49 42 28 36 -25 28 -3 33 -21 -40 24 60 -31 7
2161 7 43 58 24 -21 -8 27 12 12 3 -16 30 -12 27 -11 -6 -58 -19 8 -15 43 -3 12 -79 -8 58 36 -22 -36 -38 4 46 -30 -48
2194 -48 -23 38 -11 -2 -4 14 -56 4 -52 40 21 -1 -56 -21 43 24 58 -26 33 27 77 -39 -27 -9 0 29 -32 -25 62 58 30 13 -40
2227 -40 -2 14 51 8 -21 -23 -18 -41 0 12 62 52 -16 -30 14 17 -13 -36 12 -6 66 -3 40 50 57 -38 -23 56 106 52 -28 -12
2259a2L0lJ7l0M4l1K1Lj1k7l0N1o8K0l5J14j0k9m5mK5J0k1pj3Q7n2lJ0O0k2o4
2291b5N7RK6n7k9M7Pn9J6j0%k6k6M8L6lN6m8k7mR1m1q4J0K4J9J0m1L1Mm0L0L6
2324C7l8M2L9j03J1nL0o0O4n3P3j0l2NM2K9o1J1m1N0pm6KJ5O2n1LM3n5j7O2r3
2356e2K4N7m8N2o5l1Q7m5RjJ8L8n8L1k5m8Q4P5r6P0o9POnK0jm2M2o7O3l1J4J7
2389C0j12J04j8RJ7k8J5n2k2P8Qj8K6n7pP0J2K3r2k1P6n9n7J40p9K8m6K4L8pM4
2420F7q7J3oJ9L1j7k8k0J3j7Pj0J06m2m3%j9M8j8n5L5pN7k5j3LJ8k8m7O5O5n4
2452A1Npk0J5P0p8L2l7M7k3k9L1p7J22o4m8K0M8QK5j02LM6Q3q2Kl1J7k7jJ0RJ4
2485hJ3k0n8J11PL3j21K9K7Qql3N4n2j1L6NN7n7k3l8N8M6Pq4K6J1j9pj2j5ON2
$$ plain form
2259 -12 18 15 32 2 46 15 36 39 28 1 -29 22 -46 -26 -61 53 43 14 -31 -35 -10 0 -21 -28 -41 46 -6 -9 1 61 39 -25
2291 -25 32 41 67 10 -19 28 35 -24 -8 -18 -18 -44 -70 -22 14 11 67 19 -8 -12 79 38 -46 -36 -12 7 17 -24 7 11 -29 1 37
2324 37 -1 41 80 -23 -12 -17 13 -47 17 -36 37 27 -5 0 42 71 10 21 -20 30 23 -23 -21 -6 56 5 8 51 -4 -21 41 -52
2356 -52 -28 29 -19 33 -32 -63 24 -21 -12 -13 5 43 -15 16 -9 -57 27 102 6 76 7 14 20 15 35 34 -8 34 -33 30 -1 13 30
2389 30 -82 22 4 13 30 2 17 -35 -57 21 29 11 37 -20 -27 43 55 78 -14 -35 41 -18 -75 65 -14 14 -32 -8 30 23 67
2420 67 -20 -7 -13 6 37 20 -8 -28 -15 -32 -25 -35 71 29 -14 -14 -33 15 -3 -58 -23 -30 27 2 -11 -8 10 -18 -65 0 65 11
2452 11 16 9 -11 4 74 -4 28 -9 38 15 -14 17 -60 62 -2 -50 -30 18 26 51 -51 -48 -2 81 -1 1 -30 -13 -40 -41 -31 -22 -8
2485 -8 5 -15 -73 38 45 78 -43 -14 13 21 13 -20 34 -18 -29 7 12 69 12 -11 -49 9 55 62 -22 4 15 -4 -11 -23 -38 -32 20
2518B0j0J1l7Qj1o7L8N0M4q0M6j14P4j3L8K6l8M6p0L4N1k7M3m6o2N1oL8k2l3q
2549b6M4J9J9q4O8q7N6j0qN0pm2j2mN5No1m6L7L0k7M8j7P7q5M2q8N5Ok7j3L5K1
2582B3qMl6M3m6M3q7nL4jL4K7l6kj8J04p1J5l3P7k5r1nL4MPo0LM2JK5m8P4Nl4
2617gJ8p5K8M3J4qkl1QL0m9K6M9p1k0Q6k3M6m4l6qM0kj0JKl0O0j04P7Ol5k0l4
2651g5P1L3k1J5l0k1L8LK0m4k8O6p3K0K0L5l3ro6R8Jk6m9O1K5l0O1j05M1L7l4
2682Aj1l9R0pm5m8oJ01j0k6L7j8J5l7j0M7m9mK2L0k4L2j4l3k2K0N0k7Oq5M6N5
2714C7j9l2L6k3k9L1o1O2orOk6M1O9l7Ql9o7K6L1J1Rj1j6k4j8K7M4Jm2n8L9J16
2747G7o1k8L0o9L0P4k0j7l4L3j1k1L6J1j8l8jK7O9l6o6J7Pj0M6l3l8L0l4K0k0
$$ plain form
2518 20 10 21 -16 -8 -19 -86 -48 2 46 -34 12 -102 -28 -41 -3 23 -15 31 -39 -5 46 19 62 16 -46 5 -1 37 15 -18 -26
2549 -26 18 37 56 -28 40 -47 9 -1 -9 41 34 -8 -20 -24 31 36 -25 -71 -34 -4 -31 17 0 77 -8 34 -54 1 7 -20 -33 2 23
2582 23 15 19 -17 26 -20 23 -64 -69 -35 -36 -2 25 -11 -13 -31 73 2 17 -16 61 36 -55 -60 -26 -22 -15 -75 -72 -30 -29 -4 -52 22 27 -7
2617 -7 11 -64 -36 7 21 13 11 -20 -12 18 -31 -5 44 -27 -47 39 16 62 18 -18 -26 14 12 2 3 5 -25 35 -69 8 14 -21 -41 -75
2651 -75 -4 29 8 23 -7 -28 10 13 33 -11 -39 27 -46 -26 -6 29 -4 -13 -79 19 20 -6 -55 6 31 1 62 -43 -2 35 1
2682 1 -10 -49 41 34 -11 -59 -65 36 26 0 37 19 34 -3 -13 34 -15 -19 3 33 9 41 27 -6 -28 -8 42 15 21 -64 -18 37
2714 37 18 -14 22 -1 -30 1 -60 2 -4 -13 -7 -33 8 77 40 48 9 -58 -32 -1 10 19 8 -8 -32 -50 -23 21 22 -20 -78 -39 77
2747 77 16 -12 18 -51 -21 53 33 16 -18 15 4 -17 19 30 12 -26 -27 0 69 33 -33 -16 -9 -19 27 -6 -44 -14 -48 -28 -48
2778d8K2P0m4k9K8k9M2l3J5RO6o5JlQL3l6n4NQ1j6m7M9m0L6kL7q5L9pn5L8K2j9
2812a1l2K0J2J6K1jK2q8nN5rl8Q7p8K9j1j9O4olk9Ml5Q5m9K7pl9J8k0L%J5k6J3
2847a5kLK1Rj3J9M1o9j5N6q5M5L5k2l7l8O6m4p6J10Q0n2l7k4N4J4j9LK6o4J5N7
2879D2n4MO8q1j4l7Q3L8k5k1l9Q8k3o7O0j3j1p3J22p8poK3kll5Q9l3Ql3N6pJ5
2912C4rKl4L6m4L4j7L0rr0Q6Rj1K5k6o9P3pl6M0m4L2j0J2K2J8o8j4J3j4N6n7j0
2945d7O3k9J3k3j2JoL8K5p7R6Mqj8o5K4NL5k6j4K1Lk9pO3j3L2n5m4M3ok3J3K4
2979AM1o7k1N4k1K7L0l1J6l4O0q2M7k1K9K9l4q1P2j9k4Q9q4M2M6pp0L1L9l2Pr5
3011f3Q1j7Lk4j8L1K0Qkm9j3J1N4l2J2Kl2OnL0M0l6l1M1m0M3j1mk3K9l5mL8M2
$$ plain form
2778 -48 -26 44 0 -29 -1 -30 12 -21 -6 3 69 4 5 2 10 43 7 -47 -42 39 23 -24 25 -15 21 19 56 -29 10 3 -52 -14 8 -11
2812 -11 -43 -23 -11 5 26 25 47 -41 -46 9 0 -38 49 -29 0 -11 -30 34 28 25 -4 0 -35 50 1 28 21 -18 0 -20 -17 -17 -2 -28 -15
2847 -15 -17 -14 7 16 3 22 63 -6 -21 35 -50 -5 30 8 -29 -67 -1 -45 -121 -11 69 17 -20 -44 10 24 5 8 34 -30 -15 42
2879 42 -12 -8 60 -21 -35 -72 11 49 24 3 -36 52 29 -38 22 9 -2 -75 47 -31 -38 -44 -21 -23 -26 -61 28 -5 3 -30 26 19 34
2912 34 25 27 -7 29 -15 19 2 32 23 -67 19 28 17 42 16 -53 20 13 -23 17 -27 5 -5 7 29 47 -21 -35 -22 -36 20 -37 -47
2945 -47 16 -13 0 -23 -35 -34 -40 -2 23 -54 42 46 38 20 -45 -21 -16 19 -7 -21 0 3 -26 -33 30 17 49 -6 -50 -7 -13 -36 -23 1
2979 1 42 -25 -46 8 -13 14 44 13 29 -5 55 -27 20 -1 28 57 23 -58 14 -5 -29 60 -24 18 64 57 -13 18 57 25 32 -63
3011 -63 18 1 4 -20 -38 -7 13 21 19 -30 -43 -32 22 -10 2 4 -28 -22 -27 3 43 7 -24 17 -23 20 9 5 -18 11 -24 -28 10 52
3045E2k5Mj9k7N3J0j04N5m3RR2k3nRj0n9KK1j4M3m4K3j1OMPJ6n1M0n0N5m2J8R
3079Ak1K9j5O4k6k7l9L0j8K8J7l2oP5p3J3j0k5Kk1O0kPj0rk5M6%rj3j7M8p2O1
3113A1k8M8j6%k0K7ok5K3k0L3l5K1l1J2P6o0j3k4M2m1L7Nk0k6M9K4p4P2o7K7p
3145fl6L1k9N0m5n4R8j6K8j1k5M2oj8JpM6lJ2k4m3L8k9K2k4N4ql5l8O1K3m8QK1
3179C0o7P2l0m2L2j0L3j8j1pO2Qm1pn1K5K8Lk7K7M7o2k5L6mN6l1o9L5J2k4J1o
3212a5J5L2j04L2N6n3O3Pl9K3lj2o6O5MJ3mOL7p1L9pl9J4k7RL8pJ1k1l5J8O6k9
3246A6K6ql0J3Mj4QoM5m9kJ0m5O0l6q0R3n0Q7Jn0k3l5L9L7%j7J6K%jj1K9j3pm1
3282c2nM9L6p3j1k6M2J1j3Q9j00L0%OL8mJ9m0m9L7N8p0l3O7K5n6jK3l4mj6j6L7
$$ plain form
3045 52 27 31 12 -15 38 48 -56 -1 -44 -35 57 34 29 38 28 -31 -29 -8 -22 21 -23 0 -11 -5 -1 6 22 -29 11 -39 16 -26 -8 1
3079 1 -20 9 -6 58 32 5 -34 -4 -22 6 23 -9 -15 60 -13 0 -10 -35 -33 -54 6 4 11 1 -8 -33 13 13 4 -9 -26 22 -50 11
3113 11 -17 31 15 15 -5 22 16 -9 14 -6 27 -8 13 -18 -6 70 10 -3 -27 15 -26 11 16 -4 -30 19 43 -31 41 -26 1 -6
3145 -6 -42 -11 -40 10 -35 -89 9 -7 21 10 -15 27 21 3 4 -3 43 40 52 28 -15 23 -6 16 -8 46 38 3 -35 26 49 1 9 30
3179 30 -37 35 5 -37 -5 -15 18 0 -11 -18 44 52 11 4 -47 -22 6 9 -18 9 56 -6 -31 5 1 57 26 -43 -8 4 -20 -9 -15
3212 -15 0 32 -72 -40 16 -37 26 33 -6 17 14 2 -64 1 5 18 14 20 57 -14 25 18 -21 -7 -34 -25 13 6 17 -4 -39 -21 45 16
3246 16 42 34 4 17 21 7 15 9 54 5 3 13 -32 28 -8 -88 5 -45 42 43 -7 -30 -65 -26 11 11 -6 10 12 12 11 0 29 16 9 -32
3282 -32 -37 12 48 -25 -36 -62 -20 -9 -22 67 -33 -3 -3 3 41 37 56 16 -33 4 62 -8 -41 26 51 -5 -6 17 -17 -21 -37 -53 -16
3315a6L4Rn3k0PL3J7l4k8M9lk3pN3jol8JJ1M2K5m7OOk7O9n7l1J2K2m1K2J0K0j0
3350FKn2J16n9l1j4n0P5M6or0O1k3kjj8K8O7l7m0Q1J2j12K7K5oK1j1J7j8ql5Q0
3383E1q0J09q0M5n4L1l7L5rK7l5m7M9m0J1l8Q5p2K4K5m2K8l2K3J0oK8l8M0k1J9
3414IJ2kl0K6Pr4N2M9j1K1o3J9J7j4Q2m5o3K5lK3J7m6j3M0j5l6m7J17n0j3RL6
3446A6m4O7J9j26O2L6K9q0l2J46q4l9J9j8P0m3k9MJ3%K2j9qL0OJ8k1j9mnk8L2
3478a0Qj9OkO1rmp5K5pJ1K2J2j9RM9p2oK5L1j4Kj6J0J7k5kL4m2R8q7Pl4K3oO6
3514F7m9q1R1J1k7jj2o6M5Lj7j9J06n0o2O4L5r2j2N0N1K7l4q1O8k7lJ8kN8q9M0
3546A0ql4J5PN5Nl6L1j7k2k7K1j8mll7J28j07L9nk9O5o8Q4j5o1rK2lK8J1l8N2
$$ plain form
3315 -16 18 27 -26 -46 -39 -6 11 -23 -51 -2 -5 -28 -35 18 17 11 -27 -26 -15 27 52 5 11 17 -10 59 2 -29 -17 5 -36 -14 -4 16 6
3350 6 8 -44 72 13 -18 -32 -82 -7 39 33 -57 4 -19 -21 -22 -40 -12 55 18 -22 59 71 -41 -14 11 5 26 15 32 14 6 -29 51
3383 51 -29 80 0 45 -9 22 -15 20 11 38 3 -44 5 -35 -24 -62 23 -49 -25 0 -42 -14 -46 -23 -13 -19 9 -29 11 -10 9
3414 9 21 19 -11 15 22 -72 -20 29 18 39 -24 -5 12 -2 80 35 -28 -3 -6 17 34 -12 -25 15 0 -36 -83 34 -16 -29 -20 16
3446 16 -28 39 58 -68 -6 30 59 -21 -53 93 9 -30 -11 -29 41 -2 -31 -27 -14 -14 8 -11 -19 11 17 35 14 -5 -9 -14 -42 -10
3478 -10 -2 -21 -15 -17 44 35 31 -44 -19 -26 -15 7 19 0 9 58 -14 -20 5 36 22 24 8 18 35 10 8 42 0 98 11 18 -16 7 1 67
3514 67 18 -63 28 39 12 11 -1 -67 -22 -19 -36 -55 51 1 -61 3 38 -54 -66 -16 35 62 28 -53 15 -12 -15 3 1 59 -30 10
3546 10 2 -32 -17 -10 45 50 14 45 28 6 -21 0 -18 -22 -25 -62 66 -41 -2 -7 -36 29 -39 45 30 -31 -40 -18 -21 7 18 -20 32
3579C2k4K4m4L2n5K5J0M7j0pl4L5q0N4K9k3PJ9ll3j7j0L6j1moM3l6J9qQk9j1L7
3613A2K0n8J8M4k9J0l6NJ9k1L2l5K7joM9l3m3K5M1l2Nk6J5N3l5j9Kl0K5O5r1Q3
3646E5n1j5J1l0oM7l5J9j1LJ6K8qm7K9n4O6rm1M5L0p1L2j3L0L7n4m3R2m2J5jJ0
3679C4l3K4j8j5J2J9k4l4O6m8K5k2M8n9J9Ml8M3nj3M6j0ok2k3JL4j8N5k7k3L2
3711B4K4l1N2j08O2l7Q2r3K7k5K7J1m9N6m2M4l2j2K3Nj9LK1L0r8N6K2l0j1P0m1
3742A1k6K4m4L4L7l7l0N1j9j4l7M7J8L5m1k6k1L2K6j2p5J16jm6L8l2o6R5n8K2
3772AoL1p5N2pL4ro2M9N0p3M9o5N3m4M6Oj2jL0p0j6M9Qj9k7J5J1K4M8%q1K8j7
3806@L2m8K2J8o7L9K2L1m2J4pl5J0k2J9J7k1kJ6k1J20o1n2k6K6K2%j4K7rn1M2
$$ plain form
3579 32 8 32 -12 20 -35 -10 0 47 37 30 -4 31 -49 5 34 11 18 37 34 1 -16 -26 10 -1 -5 -11 32 -4 15 7 15 -14 -25 12
3613 12 32 -26 -8 36 7 17 -19 -14 5 -16 16 -19 8 7 1 50 17 -26 -1 40 8 13 -13 2 55 20 1 3 -27 -2 63 -28 55
3646 55 4 -11 0 -30 -36 11 -24 -5 -16 -13 3 31 23 -24 5 -49 17 8 -33 12 42 -29 3 -10 20 57 3 -40 52 10 25 24 34
3679 34 1 25 7 -8 4 23 -1 -35 31 -17 8 -14 34 -25 -6 -2 -40 3 -2 -15 31 21 15 -7 -30 -29 5 -13 42 15 -8 24
3711 24 48 17 69 -39 23 -14 68 -25 2 -23 4 15 -34 22 -20 24 -8 -20 3 8 -11 -8 13 43 -55 1 23 -7 -18 52 11
3742 11 -15 9 -35 -1 36 -1 -31 20 1 -13 -50 -3 15 50 9 -17 -38 -6 20 8 -67 49 48 2 40 8 -58 37 -21 1
3772 1 -5 26 -49 3 -4 30 21 -41 8 58 -15 34 -31 22 -22 24 30 18 17 47 -23 -39 10 18 -1 -28 -13 -2 22 70 70 -11 17 0
3806 0 32 -16 6 24 -43 -4 18 49 7 21 14 -21 -11 -33 -14 3 -18 -20 -4 -25 95 34 -18 -44 -18 4 4 -10 17 8 -43 -1
3838aoO0o8L3K1l2p6L8%N1pK5jk4j1l6K1mK7Pp7N1J4mj8JKJ9J9j2k0m6P2L7j00
3873d5M9jL0N1o8Nj6L5j18J02J3J4o0RMj7M8J7k7m5KK7K6p0K4J8qk2J3P%K9p9
3906e3L1kM6m1N0nj7Pl0J5Qn1M2J8p1Q0Qk7j4k9K2P2l5J0n5MM9l8RK1m3ONO5m6
3941A1J5j1k4J8Jk1JJ5J1m7l1O5m9M1Lk3M0Jn6j9N4L4JL2o6nJ8nl9L9J5j9J3n
3975HpK0n1R2q1Q4o5k7J8Rj6K9J7m1L8p8O9kN0j05R5p8M0lr4J01pL9l7o1O9n0
4007b5N1l2L9Pm4P3o5Pmk8k8J1M4j0l4K7j6J7Rj2k2P2lNoo3L5K0l8L8Qj3j8J2
4041A4M9o0K4J1l4O9r6N2m6J7k7M4m0M1j4N0p0K7k1NL4m2RN1l2rK1k8m3L7J3o
4073@mpJ9RL6n4J1L6p0M2Nk3pO2j14Q0jl0M5j9J0p1O5m0l6N7nl4N0k1NK2jJ8o3
$$ plain form
3838 -1 -7 53 -15 18 39 7 -69 -31 -31 20 13 38 37 13 2 -34 -13 -17 10 17 -60 -9 5 1 -17 -16 -14 5 24 12 -8 -54 18 55 -45
3873 -45 4 3 33 84 16 21 5 40 -78 24 37 51 -9 0 4 -13 35 52 25 -20 -18 9 35 -35 -11 7 -1 -23 -10 -3 -3 26 -53
3906 -53 -22 -24 22 -19 31 26 9 16 -14 1 9 -42 0 18 -53 27 35 8 -6 -35 -13 59 24 34 -21 -17 32 -6 3 24 -19 -13 -8 57 11
3941 11 26 15 -9 9 10 -11 -10 5 16 -31 -62 3 -46 -5 -2 -25 15 16 -40 -59 -5 29 30 62 -4 -9 9 4 -35 4 19 0 13 8
3975 8 1 21 -30 62 -19 65 0 -27 -9 0 -16 13 30 -11 27 -51 18 16 66 -39 56 -22 18 15 -79 22 15 54 17 -44 25 -25
4007 -25 26 -6 33 40 -4 69 4 11 7 -21 -49 -38 6 -4 -38 -11 -27 -10 -1 -13 -35 37 34 39 33 -30 5 25 -13 25 33 20 2 14
4041 14 63 3 27 38 4 73 -23 29 -17 0 -27 17 -23 18 4 54 -16 11 -10 -5 29 -13 -4 47 15 6 27 -1 -44 -7 6 0
4073 0 -4 -11 8 17 53 -1 10 46 -24 18 23 0 -7 55 -59 21 20 -10 35 16 26 -45 20 -20 -56 1 -4 -38 12 -9 -4 18 17 35 -28
4108b8j2L9m8P1K6q4O1n7L1K6j3l3O0o6M8j2lL7l1mO5nl2j5M0m6Mk1M3j07P4j1
4140ck8j3J21q0K2J8o5L3LN9j00L6m3P9m5N4j6k7m1O1qJ9m3rJ6J2OJk2J8lK6n6
4173a8N5Qk0j3k4J2L5l2LK0k7m2rJ06p5K0m5J2L1qN1k6k5J9j3j0qK2o2Q6k8LL
4206An1L7L3o3N1n2rM6j6M1N1p0k3N5l5QqJ5j4K7j3kL2p6K8J2P7q2k4M6L2o2J8
4239A0n0N0k3O6o3N3l1m4P3n6J7J1j6J1j1kJ5j8l7nP1K7q1K6K7n7M6m3M8pj5J2
4271Dj3K2J4k4K7k3K7k1m8L8l5J5K6L3l7l5N3nj26J49o0j6O3k0K5j8k9M0K0m4
4301BN2j01J5N9l7L1l5j6PN4q1Q3m4K6PKn8KP8k8n3Rl1O5OJ5j0j2j3J3Kk7M3j9
4335Fk6L5Jj6O1l3k2M%oj0M5n6L7n1L7mJ9m5oK1PM1l6J3m3L1K7m1K6m0K3K8Rp3
$$ plain form
4108 -28 -40 -1 -49 22 48 -36 25 -32 -1 25 12 -21 39 -27 21 9 6 43 12 8 73 68 36 21 61 15 19 -2 41 -66 8 -3
4140 -3 -31 -44 77 -3 19 37 -28 5 8 67 -33 3 -40 39 -6 48 32 5 -36 25 17 36 -7 -16 0 12 18 19 -3 15 12 38 -18
4173 -18 37 45 25 12 -12 0 35 3 6 26 -1 -43 -52 54 -21 -1 -46 -34 -3 -11 40 14 -11 8 -5 -15 -23 -1 -63 23 -5 -2 1
4206 1 -50 -13 20 -43 8 -44 -53 -7 -23 18 69 -1 -24 31 -4 4 -4 11 -3 24 11 9 41 -35 -7 5 82 0 -24 22 54 -8 10
4239 10 -40 10 -13 53 -10 43 12 -32 41 -15 2 13 -3 8 -3 -5 10 -8 -45 -50 21 48 -33 -7 20 -37 9 -34 14 7 -8 4
4271 4 -9 13 27 3 30 7 34 13 -35 3 -32 -17 9 42 5 -30 23 18 -108 41 -19 -35 28 8 33 15 -14 26 46 2
4301 2 54 -47 -32 27 -10 21 -14 -30 -23 31 -50 33 -11 15 22 24 -34 -32 46 18 -35 -26 -57 8 14 29 19 7 -6 7 9 -18 25 6
4335 6 -20 15 16 0 61 28 6 10 10 4 -6 39 -17 20 -31 6 2 21 -24 -30 -9 -2 39 3 16 -27 4 31 -10 16 -24 -1 27 36 -37
4370c7qN4m0J5J5Mj1K5l1q0J16j4k7M3l9K7Ol1l6O3L1m4k0J4LJ7L1r4N1l3L1J0
4402A1n2K4J2L2j5OJ4j6l3M3m8J6j9J6k4LL8mmnl6LL1k1K9O4p1j3qO0m3%k1K4
4436gQ3j28N8J1m3K8Pl9K4L4k8m3K5L1rOJ1j2K8q0L7PMJ0J7j8l0P1m9K4m6J0q
4469a4k3O2p4K2M6k7L9l2N1J4p8nM6L8o4j0L3o1k0P3m6M9L7n2n3L3RJ3Kj3j0M0
4501B5n3O1Jk4k2L5J8r0N2nK8Mm4pN0Kjn4K1L2K0r1M3j3k4K3J6k3j4MRO5Kn0j3
4536a7KK3%nJ6n7L0N3m8L2jj4Jk0j7K7qM0m9o1N5MJ0Jl1N7k7N7r5N0j5M1n4LM6
4571B9j1Nl7K3J2n9O0%k5K2m7L2K3k3j5K9l9K2L2Jmrmk4J3M4Jn8M5k9J3K5n7J6
4605Fk2N4m9K8RJ2n1o0J9L5qO1j9l1Mk5K2Nm0J15k9n2O6p3O1l9K0j1JL6k6k6M8
$$ plain form
4370 -37 -45 9 -31 -16 -1 3 -8 17 -14 -94 22 8 -19 24 -15 12 18 -13 -49 14 45 1 -19 -5 -2 15 46 -48 3 -30 1 11
4402 11 -41 -17 -5 27 12 18 32 16 -17 26 -22 -6 -25 -9 -33 -30 8 4 0 -5 -41 -38 -7 -28 1 65 -6 -19 -27 33 -10 -10 -31 -7
4436 -7 76 -52 6 17 -26 2 9 -30 -6 28 0 -43 -18 13 4 10 21 9 37 -43 -6 1 5 15 32 14 -16 55 6 30 -16 -6 -14
4469 -14 -37 25 -49 -27 19 -8 31 -1 50 64 -14 -19 27 65 1 -9 24 -37 -57 16 -30 19 56 4 -49 -16 -7 6 8 -5 -15 25
4501 25 -28 33 34 10 -12 23 41 -49 3 -2 26 30 -14 -21 29 31 30 -24 -3 29 49 -42 1 -12 -36 -13 3 -20 -34 -30 -21 44 46 -4 -17
4536 -17 -15 8 8 3 19 -38 -8 45 -3 29 28 14 15 -5 -22 5 -3 37 -12 -73 -18 -14 -4 -3 -34 23 -4 53 -42 8 -7 34 -20 -17 29
4571 29 18 23 -14 9 21 -38 22 22 -3 19 -28 4 27 4 -11 18 -21 1 33 34 30 21 17 -7 6 50 51 -7 38 9 22 47 -10 6
4605 6 -16 38 -11 17 26 38 -13 -73 -54 -19 -27 34 15 -16 -12 -37 -15 -10 -50 65 36 -16 50 -23 38 -1 19 8 9 45 19 -7 41
4638D1nm3%p7N1O6m9k7K3P4j2j03L6P2k8RJ6k4j8l6M0J17j57M9NRn5R7p9L9k1
4669A0m8O4Qk1j9O1p1K5j9L9j5L0j0k2m1P3n2j6K9n1M5KKl1N0onKOj0l1N4k4j0
4703bM7k9k1L8q0L5L9qQnN6r6m3N1N2k9rM8k3l3qJ8k7NPJJ7Lkm7j4N8L1j0m5L
4739a4Qn3N7mJ4l3O3k6LJl0M3m1N0m7QJ0Lnl1M8L5p0K9j9%nj4K9L2l7j2k2K8Q1
4774G9q8J9j2L1n8OL0J8j4l0J9j0MN4n5RJ3qK6n4L1jj3L1J4j1k5kL2m0J3j8O0
4807E0n8kKpK3l4L8OpmQk5M9p1P8m8kM1k7j5%J1Mk9J1M1k2p0R9k3lN9r1N1Pqk6
4844Fpn4N2O7l0J9mn9N2q5Q0j9Lm1J4J5J3l2L8K2r8NL7J7j3K3j3m2K8rJ2j2L9
4877B4Jj0k6P0l3L3j1o6L3Lm6J8L0ol1J5L9p8j3K8N8j5L0k9n7M9k1J4p4M3O9p9
$$ plain form
4638 41 36 -7 -7 -84 -33 33 -16 -43 -20 54 42 -61 -25 47 19 28 44 20 2 -34 6 123 -34 15 20 29 -26 71 -8 31 10
4669 10 -38 26 34 13 -6 55 -16 9 -10 29 14 44 34 12 -29 44 -8 -24 5 -46 -1 1 3 -28 22 16 11 13 19 9 -22 32 8 -2
4703 -2 45 16 -5 33 -47 -12 27 19 27 22 78 -18 -61 -10 42 13 4 52 29 -4 -12 6 -21 -16 -9 -8 9 12 10 -37 -51 7 38 28 -17 -14
4739 -14 -6 -59 -2 -6 8 -25 38 12 15 16 -14 29 -12 38 -9 -1 9 12 7 -24 24 59 -11 18 -1 -1 -6 -20 9 41 4 -8 -30 -2 79
4774 79 -9 10 -2 29 -29 -23 7 25 11 -19 0 -10 -6 48 -7 2 15 7 33 -21 10 9 -4 27 41 30 5 3 35 -5 8 -10 50
4807 50 -8 -10 -8 -15 8 -26 12 18 11 7 15 -10 39 -32 46 -2 -4 37 10 -5 -5 6 10 -19 -8 33 11 -59 40 17 14 73 -18 33 40 32 6
4844 6 -1 -55 -3 64 34 53 49 -10 42 -43 37 18 21 -20 -6 9 22 -10 28 50 -48 -43 -6 11 -2 21 8 -34 -6 -15 -3 -15 24
4877 24 25 15 -11 59 26 59 48 -18 15 18 -28 -10 20 14 -17 -2 37 -41 -54 -26 32 17 47 18 -39 10 -11 3 -71 -28 41 -38
4909c8L7l2K3J4MM3j6m0l9N6L8p4J9k7pJ9K1O9l5Kn2K9l4J4P8n0l7P4J1p3J9k9
4941a3m0L4L9m2l4Q0j5J4n5O8l8Jj2J1L4j14J32r3O9K2j0o7L0J9j8PK3j7O5l1
4971D9o9O9k8rm4M0K4rl4Pl1N7Kl9O1n4l7K0%K2m9j9Q5%K5n3J9j4K0K5kk2RK6
5005D7o1M4no8N7J3k8N2r3R2j2o7M6l2N6m4J8J8n1jL8j5k4k5R0l7m3L9k7nQJ2
5037hK0l3N6l4N5m3LL9r0N8n6Q2kk8Ql0LL3j1k4M0Qm3j4j8L5K7q3L0O2J7o0oL
5071dN3k4k4o4J9L8k4K4N2n5Ok7j2K8mjl5P2olJ3l6K5l7K8Q2r2j3mJ9PL3mrl1
5106a0K2o2L0K0LK8K7k7m1l1Kj5K9L3l5M1m8L7%J7J3n5M7n2KN3k9M3l4k%OL3J0
5140E5o3J5L9r6P2J9j5q3O0j6O6k0q2N1n0L5m6M9mk2J8K6n9RQ7n3k9J4j6O1K9
$$ plain form
4909 -38 -1 -33 -10 4 8 51 35 -5 -44 12 50 -24 -5 -32 -39 -20 1 70 35 37 -15 14 -20 -6 72 22 -15 59 70 -3 16 -13
4941 -13 -53 -19 20 -22 -56 24 9 23 -32 36 -2 -1 -13 -2 32 -82 50 -43 26 48 38 -29 1 20 2 9 32 15 80 49
4971 49 -20 49 21 12 -32 8 32 23 -11 -4 -35 22 24 -15 46 -8 -45 -25 -25 -3 -52 -71 14 14 39 -14 5 -9 11 36 34 12 21 47
5005 47 -14 30 25 -43 14 27 -1 51 -42 50 38 -29 17 -15 41 -3 15 33 -18 -19 19 4 -20 -45 45 8 -35 4 -23 -28 -20 -8
5037 -8 12 -21 35 1 56 13 16 55 -35 23 -33 49 47 19 27 -3 0 33 22 -2 38 46 3 -11 -29 6 33 -50 -20 42 59 -1 -7 -4
5071 -4 49 25 1 -63 -44 -6 -30 -6 46 -9 -3 -30 -42 -14 -18 -19 -54 18 12 9 22 -14 11 -26 2 84 -8 -21 -25 -6 1 34 30 21 -10
5106 -10 12 -50 -20 0 3 31 58 31 -10 -41 -39 -54 -25 8 -27 14 -34 3 3 20 33 -22 25 -27 -25 28 -1 42 8 6 6 12 45 55
5140 55 -8 7 46 -50 22 41 26 -57 3 -13 53 33 -49 2 -48 -13 -59 -10 -14 -36 -18 8 -51 -42 45 -8 -37 -23 -39 22 51
5171E1q3L3jj3l5Q7j1M8o3l0M6rJ2ql1JQJ5k0j8J1j9j3QK6nJ4J5k4j6l6L4K3%
5205cJ8o4N2ooM9k0ll4L3J9Jl5J0k7N2J1Lj2n0l6R2m5qJ0L6l3j8k3M7Ol1LL0J5
5240C3m0PN1p0N9jl9M6q7L7K9j0o6L9K9k7J9j7K5j9J2J5K5m0rN5j6p4P5n3L8o4
5272c8J5Q5m2j1K1m7Pk4N5l4RL0n5MO2J7j06Q5L4m0l8PJ1ll0NK1O6n5J0l1j1J5
5305fJ5Jknl3O9m9N5l5L9l6l6M2j3k4j8L5j7O4j38P9k2M8k7L7k6J8q8N3O8p7K1
5337hpL9K7k1J3n4j1L7l6L0P2j13rK0J7ML7o1kJ0j5jOK5l9QM6n2L6%rK5k2KO2
5372E6n5J4QqOm8M9j4k7ML7m4O1K6k7J3n2o0J16o6O5j5j09Q0k9O3l2j6l6M8M0
5403D8j0%jm9K6m9L6m4K1Q4n1l8M5l4J2J2K7k3LMK6n5K0l0M4j2K6l0k3k2O0l7
$$ plain form
5171 51 -32 1 0 -13 -48 39 28 76 13 -17 29 20 32 24 -7 -6 2 17 -3 -21 -10 -29 -42 -34 -8 -13 1 16 -8 -24 -60 -26 -3 -3
5205 -3 15 -49 3 -3 -9 40 20 17 -17 16 35 36 1 11 -16 36 47 50 38 -12 -48 44 -1 -9 1 37 4 -14 -37 10 16 -15 -12 18 33
5240 33 -7 0 51 -19 40 39 0 46 -41 -4 25 15 -51 -12 17 -10 9 -8 17 -2 10 25 50 10 1 56 40 -34 41 -12 26 -38
5272 -38 -23 62 20 9 30 -17 -10 -34 21 -13 -4 26 -29 -25 37 54 -52 33 67 27 -11 -4 7 4 -26 -21 0 66 11 21 -10 -21 -6
5305 -6 9 10 8 3 -30 39 -10 45 10 49 13 -23 19 6 -18 -36 -1 -18 46 -92 -13 -35 13 -14 23 -3 15 -73 -20 48 -29 -8
5337 -8 -15 24 51 30 43 -11 -22 15 -21 9 81 -32 -41 -21 -4 0 37 -24 -26 -16 -31 -32 -26 -1 -40 -32 14 -38 -2 -2 -11 14 -8 -6 56
5372 56 1 15 23 15 21 -27 22 8 -19 -15 22 -22 39 65 38 51 -1 -61 55 -11 54 39 -70 10 -19 44 12 -4 -40 8 48
5403 48 38 38 37 -12 14 -35 1 -43 -22 62 11 -27 18 -16 -4 8 35 12 15 19 45 -10 10 -20 24 12 38 8 -15 -37 23 -14
5435a4N1k7j6k7J7K8J0%j8Jl7P0l3n3O4j7k8J9j8M1Ll0N5p1%N9l3O9r3M9J3o8
5467c4M0K4l8J8l8M7L2p5K3M0n5K0m2Q7k8Pk6j8k5K2OLn1N4j8K0K8%M3m5J0l9
5499hj1j5MN9p9J1J06m6l2K7j1K4l0ljm4N8k5M2k4j8KPL3n3j7K1L3p5Q6Km3l9
5532e9O6j6K5No6P5op0K3K4J2n1R7m0l1L3jj8L6j8pK9%k4l3M4J6m9M6l8j1L5j2
5565A6k0qPk4N0K1J0l2o9J6J5lM4n8L0J0lj8J0K3k3J8L2km8k6L4Qk6N4m0LJ6l0
5599a3J3M0m2PJ6KJ6k4k5j2OOJ7k7M4Lj6m0M5OK6p3L2j2K2m9M2J0M6j15L1m2L0
5632c0P6n4Jj5L0K3J0pm5P0Lo1j7J0NK2J2o2K8Qj3L8o4R2l2l0K3l9%J1j0N6Lp8
5666c6L6l4N8l2J8J3n0J4jK7K6l3p1Q0J3n3MM8Qm2J2k8L2L1p3J9K5PJm0KJ0PK2
$$ plain form
5435 -14 37 10 -6 -33 -16 12 22 22 4 5 -32 38 5 -48 16 -1 -29 -10 -28 13 16 -14 41 -30 -30 29 -4 65 -28 21 34 -34
5467 -34 6 30 -8 10 -28 19 51 -24 -1 39 -16 4 -38 49 21 28 2 -16 -41 -19 -13 -10 -61 -7 -25 -5 23 23 66 21 31 -8
5499 -8 -19 -34 -30 29 -50 -39 67 21 -11 16 5 29 -1 -4 -5 -49 9 -16 26 2 -16 -14 -7 26 -27 -44 -23 10 -65 21 23 -20 -59
5532 -59 7 -9 16 21 -45 30 24 -46 -23 1 13 -38 59 19 -12 21 20 2 38 20 13 42 42 18 -15 29 45 -4 42 4 -7 28 16
5565 16 -4 -12 -5 -29 21 42 52 20 -49 -33 -18 -21 23 -35 -5 5 2 -16 -6 17 -6 12 44 42 -6 -32 2 10 -16 38 -2 1 17 -13
5599 -13 0 40 -2 5 21 23 39 15 -10 -22 -16 -10 7 -20 24 27 11 -29 16 22 48 -25 7 -5 17 -32 10 20 66 -49 -18 -60 -30
5632 -30 46 -8 -7 -22 8 31 41 34 -11 59 62 1 -16 -6 -1 21 33 -29 -1 7 -6 32 -32 60 28 -2 21 -18 -18 -7 -17 39 42 -36
5666 -36 0 -34 24 -8 10 23 -27 -13 -14 13 39 6 -65 15 28 -25 -21 27 35 -7 5 -23 9 40 -33 -14 11 18 19 -21 -19 -9 -2 20
5700B0k2J6l2k7N6J2j3j4jj3L5k6Q6n4m4j2N2Mk7L9j1K0l0l1R3o1M%J7l9J3K7
5732C7k1k6qN5j2lk8m7L4PM2NNk9j5p7P0M1J3n1J4jJ7k0k3LQ0l0k2M2l2L6m4k2
5766a0Qlk2O1l5l1O7o0J8mJ1l1O0j8l7M9m2M1Pj2m1j2M2l9M8j0N8l0l1lK4m0l
5799b0M3j7j2j4J9J3k7M0j3N4kn2J0rPk9J9ML2o1J0k4J4J0O4l9Jp3K6R2oo3K6
5832B3j8O8q1%rJ7M0lK4l8J6j9l6L6k1M0l9K1n5RjL4n6P0L2o9J7QM4q4M7L2o1
5865a2qL5l6JOj4O1o2J2J6J7j9K5JJ3m2M3k7j1oK6Pn2M0J1k8j6O4n1J5m2N1j5
5898Cj7P3p6nK2K1M3n2%m0L6K2j8k2k9L8JJ9KQm8KL6M0p0j4K6M3o1L6OqJ5m4M7
5933C5m7n6O8M7K1q1K7NM1j9M5n3q3K7m5J05rj3Jl1j4O9j7k2Kj5M2m5N9k7jl1
$$ plain form
5700 20 -2 14 -18 -45 11 23 10 -4 -5 -18 17 -9 77 23 -21 -33 19 23 -4 35 24 44 14 -17 76 15 19 19 36 -3 10 37
5732 37 16 -10 -18 37 25 22 -6 -53 -19 -12 30 35 40 11 -4 -81 -11 30 43 -8 6 5 22 2 -21 -18 62 32 10 52 20 56 12 -10
5766 -10 -2 -5 -27 34 -1 -32 35 -25 -7 -11 0 -31 29 11 -26 23 -19 22 29 17 -24 -36 6 -33 15 5 63 33 2 -1 23 -17 -20
5799 -20 23 6 -6 -20 -1 12 -15 25 12 66 64 12 22 13 20 -9 10 14 46 -15 -5 -29 -15 -5 59 20 21 -52 -26 66 60 -3 23
5832 23 5 73 -8 -8 -17 0 40 37 61 23 39 20 -16 20 -1 39 0 21 -34 -25 -26 8 -48 22 54 -15 2 10 54 -30 17 49 -12
5865 -12 -20 15 -21 -20 -14 -28 33 -29 -17 -1 16 -3 22 23 36 -6 37 10 -1 -7 19 26 -26 14 25 -3 -19 45 -6 9 -33 18 3
5898 3 -14 59 -17 -22 0 21 64 12 12 -28 8 30 12 -10 -39 -1 0 19 21 29 -19 -17 19 59 -11 -25 1 44 -17 19 25 17 32 -12 35
5933 35 -12 -68 0 47 68 -13 14 19 60 41 86 33 -50 -23 -68 37 28 15 16 -15 -29 40 23 1 3 -12 30 -15 44 17 16 -15
5965a5NNmJ6NP1p8M6k9qj2oM9m5K5M8o7lq5J41o5R7j30N3Nk3K3k8j7L8qLK6j0
5999B3J1kk8l6J6LL6k6k7P6o5J12lo4l4j6L3O0o2J2Ll1N5o5J5L6J2m6n7j0N4O
6031iJ4l8K5MJ5J8nnj7NoJ5Lm3O7k3Ml3N4m8n9Q4J6J7j5K8l7l5L0Pm1J5PoNK6
6067C9j8j4J7k5LQn6L4J5l4L4rJ4l6j7O9K7l6J2k8j1kQL3j2L2q0N2Mj02N7L6k
6100A2k5O0r3K1L2Nj5J4j6k5N2n4J2jJ5l2Q7m1K8l6oNK0j2J1n5Q4n3N1m2J6j2
6132GJ4k4k6M5n9M3L5Ml5j0k2L8q1J29p1Onj7O3p7N7NLq1P0LJ1k3Pm9K8pMJ6k5
6167b4K0k2K0N8m2k3k0N5q6P2jqK1j8J8MK3%j5m7J02r1j1QK0m2RK4j1J5J6qLK9
6201D8n4l0N3k1K9n2K9j5N8q1m6J08m0K0J3j9j4J3j8N7J3m8m6M0N7o0l7J0M9n1
$$ plain form
5965 -15 -10 -5 -9 7 12 83 5 51 22 14 2 -4 45 0 25 73 6 3 -82 59 -6 91 -39 14 19 -4 19 -9 -26 12 4 7 33 23
5999 23 34 32 4 -32 -16 -13 23 -3 -30 46 -19 93 90 26 -8 -24 9 69 7 19 22 -9 46 -19 -4 32 44 -2 -59 -69 -15 -9
6031 -9 5 -33 -8 -4 11 29 24 19 2 7 1 16 19 -24 43 20 24 -9 45 -3 -62 22 38 55 40 68 31 -4 26 33 -8 7 14 8 13 39
6067 39 21 7 24 -1 2 10 -46 -12 3 -31 3 -6 8 -28 -45 24 51 15 27 -1 -12 -14 -6 27 15 47 -33 19 23 -79 -22 14 12
6100 12 -13 47 -46 -25 7 12 -3 11 -5 -30 22 -32 -20 -21 -6 -38 49 8 36 0 -6 -1 19 7 18 -37 47 -6 45 3 19 7
6132 7 21 -3 -29 16 -43 0 35 39 4 -6 -28 10 -71 58 -13 -7 -12 -29 34 -43 14 19 22 -59 11 14 25 2 9 -40 -12 -19 -15 1 -24
6167 -24 -4 -26 -6 52 10 -13 -33 22 -64 8 7 -1 20 2 20 24 47 47 32 -15 87 -4 -15 -7 13 -29 -20 4 -7 8 24 16 19 48
6201 48 -6 -36 17 -4 25 -27 2 -13 45 -36 -82 26 -14 6 19 0 -14 -1 -19 38 51 3 -43 -3 54 -6 -43 -33 16 -35
6231c5O0l5P8n9jkjk7j1M4j5%l2J4OnkK6j0J0m3M0j8k6J9Q1pk9j5l9N0K3K1m8
6265A2jJ5L2l3n3OL5k8O1n9J3mm8L5pJK6l6K5jl4K2N7Mm1K4N8j24P7K9q6L7j6
6298bJ9k1L9l5L0o6P1L3p5L2ML3j02k3P5J1M7m7m4l2L9m0O9j2m5K4j8l1O6J0p
6329Bj1lK1k1J06r3J9jl3k6J4N1Lk1J1N4k6p2L3jp7J15r6J05n6M0m7pL6Ol6pM
6362a4j7LQN1n7K0QJ0J0rn3N1K2m6rO7p4jlN2m8O2j2QlK1p9RM8n2J8L5q8N7L6
6397C1Nq9P8o5N0Jn7J12l8r1O4N1n3m2J08q3QK7r2Q4kn9J02m3k4M2J5n2j6O5m4
6428gM5r5N0K7o1K0N1k9%l2N3m1K9mK3k8J8kk3K8k5j1oQ5o3m4L7K2K0l2P%o3N7
6462Fkj6l5J6K3K2J1J7k3k8N2m4Q0r4l0J05o4J2m4M0l2K8KMJ8K3k5m9K1n5J12
$$ plain form
6231 -35 25 -10 68 9 8 6 5 -22 -33 11 -4 -4 -36 -22 -16 -21 -23 3 -7 3 -40 0 -18 -44 -25 56 49 20 5 -34 16 39 60 12
6265 12 11 26 58 25 -28 -22 13 -15 46 -13 0 -4 -52 -17 -24 -23 3 -33 -8 -9 -43 -21 36 40 -1 23 81 -43 34 63 -23 14 -2
6298 -2 17 -4 35 0 30 -36 35 68 -7 25 29 62 -40 -63 12 23 70 23 -21 -53 -14 -54 15 3 -42 -18 -36 -67 -1 9 2
6329 2 -9 -12 9 -12 94 1 20 19 -14 -40 -26 25 28 7 18 72 46 -26 7 6 -71 44 -52 53 -3 37 -10 -17 19 25 -11 -18 -14
6362 -14 -31 -28 -20 31 -26 -6 2 12 22 13 -40 11 33 -13 -22 45 -29 -30 -33 19 -29 33 21 29 26 47 -32 -23 25 -27 -9 26 -62 -5 31
6397 31 36 -53 25 -40 10 11 -46 66 28 -63 1 52 -1 -43 65 -18 -10 17 -75 9 7 -52 50 7 -17 25 40 -12 -28 37 -7
6428 -7 38 -57 -7 20 -41 -21 30 1 1 -31 22 -19 10 6 29 1 19 17 -6 22 -3 -14 -20 65 2 -42 -5 17 37 5 12 12 -51 6
6462 6 4 -12 -47 -31 -8 14 25 42 19 -9 43 -1 79 -15 -45 60 -4 8 -36 4 -28 0 2 6 24 47 22 -27 -6 -61 51
6493E1l5KqL3j1q2J00j6Ro2j%L4n2N4k5J7qqM8j5n9M7k5K0o4Q0K7j9l5M2m9K7
6526A7l2l4J09p6M6N4n8k1k4N3m2J4k7n0J27r0J8QM8l8J8Pj9nK2j5l1L6J7k6j6
6557a0K8l3K7ll6L3KMl9K5l3M8K9Qo4LO0l6l5Nj5JM9j4l3K5J7p9P9N9p3Qm3J5
6591b1K4k3J0M5k0M8o8J08j72Q2Pj8L6l5KL5m8L9Kk0j0%Pp0NO3K2l3l3L9k0J0
6623gkL5m0qL4r0Q3J4JjL3o5JK1L0j3J4l0O7l9M1r9j0N9J3l9lkkL0l9J8Jm5P0
6658C1j07N4M5p5N0q6Q9Rm0L2J2JK2j5N3k9j2m9j6Q4l1J4Lpoj8J4m9N2j9k2JQ
6691gL3rN2p3K3o2N5k0L7k4K9Qm8K9Oj5m8R1n1N4m4Kl2k2N9k5M2k8K1l4J1P9j03
6724a4L9OJ2J7q4l7J02n0l5J06o6l6MK7j5J14o7m4k3O8L2o4J2K6oJ2o5P2Qp3L1
$$ plain form
6493 51 16 18 10 43 32 -50 50 34 43 -19 -20 -20 14 -38 16 -9 8 0 -8 40 25 -34 13 -12 8 -56 24 51 32 -3 39 -10 17
6526 17 -15 -49 60 -16 30 84 26 5 -19 34 -8 6 -21 -71 56 -34 -16 -8 40 2 20 27 8 3 25 10 -21 15 32 6 -10
6557 -10 18 -15 12 9 -27 6 8 12 -27 -2 -35 13 42 50 -14 -11 49 13 -22 -17 -32 -31 18 4 -29 -4 13 -66 13 72 -1 7 -36 -21
6591 -21 3 -20 -10 35 15 63 -5 103 -69 13 20 2 38 3 5 40 -8 31 33 13 3 3 10 -60 -55 8 30 -3 -36 3 -17 -7
6623 -7 -9 26 -14 -22 12 -78 5 19 20 19 52 -13 -12 9 39 26 40 10 77 38 79 -20 -30 29 42 3 0 -2 -4 26 -13 5 6 -39 31
6658 31 -76 -22 23 -52 -2 -88 1 10 -30 2 14 15 37 22 75 46 34 -15 -31 53 22 36 39 32 26 8 22 -27 25 6 -16 -15 -7
6691 -7 26 17 69 -4 19 -43 12 -8 29 5 34 42 -6 23 29 14 -34 57 6 60 16 18 -14 -36 23 -2 40 12 33 -1 10 89 -14
6724 -14 25 31 43 60 -24 -61 41 -9 -44 62 -4 -40 -36 -9 -24 90 23 -21 -44 24 56 -8 4 30 24 36 -29 43 51 -22 9
6755IN4qo4K0J1K3qQqK7o9K6Rr2N2lqP3%j7k5rKJ7n4N3M5o7j1O4j3o4R3k2j5K2
6791E1p9J9K7kOl5k0N9K4l5k4LJ4l1OK1L6l9l0M9jJk8L6n4OL4l4J6L6o5K4l2l
6825d4N9o6M0j0O2k5j2l9J7L3n7M6Pj1m6N9J2l2J5P7l5o4l6P5J9j2Op3qK6M2J4
6857C9o%Ml9m2K5jjP2o3NK4L6p0J2j3Q0n3lk0N6m3j6M2nl8j4O9qj06J26l8ok5
6891b0K6K4m3%J0J4l2N5K6l4l4NK1n1P1k1l9L1l2j3L7M4j5L0m9k5p%J4J2K7j7
6923A5l3M7m3N1p9O9MQn7N6pj0OK8j1j0l9mlJ1O3j1o1j1N2j7lk1jm2P7m1M2k6
6957an0Q2n9Rj5mrL3K5K1p9L0M1L0p0O6p6M3l0j7P3l7l3N4Pl7N0o5k9J8rQ4n8
6990a2rM3l4L0K2On0j8J0J3J7o5O3L8r1rM0K8j4j0J3L2Pnj2k8J5j0P3q8M0m8P2
$$ plain form
6755 9 63 55 -9 11 22 45 37 45 37 64 -5 21 30 -62 -10 -13 -21 52 52 35 10 1 3 20 -34 19 64 -3 -14 50 37 -27 66 44 29 51
6791 51 -28 -9 18 16 22 -13 -33 26 50 15 -9 -6 8 -23 -17 4 40 1 -29 20 19 20 -8 28 -26 -20 14 -20 -4 32 -33 -9 -41 -44
6825 -44 15 -51 -11 -21 41 16 4 -35 -18 15 -42 4 11 0 -46 13 25 -7 8 85 50 -14 -50 25 44 32 38 -35 -43 -17 25 39
6857 39 33 33 37 -2 -44 -19 -20 -21 51 -12 -7 17 53 -17 -5 -18 62 9 6 -14 42 -1 -17 25 20 -18 -32 37 29 -77 49 11 5 -20
6891 -20 6 30 -13 -13 -3 11 -21 34 60 26 -8 -3 18 -33 38 17 -22 9 -23 -36 1 45 30 60 11 -14 -21 -21 -7 5 32 15
6923 15 -18 29 -14 37 -42 27 31 39 -18 38 31 21 27 55 44 34 -5 -9 -12 -1 62 51 -10 -21 31 14 11 -10 -11 -53 24 -17 25 -1
6957 -1 -51 31 -28 -19 -34 -38 -47 -14 11 32 -47 -17 24 54 -16 50 -26 17 -13 -30 43 6 -27 27 34 -3 47 -18 -47 -29 -38 46 -12
6990 -12 -21 22 -12 18 40 46 -4 -22 -12 1 18 -47 16 54 -37 -46 -6 22 8 -2 11 43 50 45 33 5 20 10 83 -5 35 -13 59
7023E9m6L8l5RK6l3oMo9L2J8L9k8j2nL3l1K2k2L0J4nLM0r3K6l8M2kM7n3j4L6n1
7057b5P2k8k5J5QL0K5p9RM9o4Jj1K4k7O6qk0N4m2J4Lp1M3m1OJ4N2m3M1j23N6M9
7090B4m7O1m3N0l6J6m0K5Oj2L8p0JP6Qn7k1PJ5L2k3j4j8J6M3n0M3m5pN0kj01Q8
7123A3qJ2oKJ0n3N9K1p2N3LrkJ7n7K9rNml6j0J7J8J5L1n3L9m5L9J4K0o4J6L6k0
7158B1l4K9k7k7jK6N1m6L8m5L9m4J7L0k6L8o8P6n9j1J23o5m7K6kk5K9l2QO2p5
7189b1M0k2j2lK5Rj3n2O0m7P6k6p9K6O3k1j7K9l5M4Om9M8o5K5J3J4l7J6J1l4Q
7221b0M5O0j67Q9j7K2j1m4P7p0N2m2O0l9K3nk5K0M5o3j2K8m0KO5k4Rnk0l2J1L6
7253Hro6J17p0LJ3K5m0O9o5L2L3j18Q6n2J0O5q6O2kk3NJ4L7l6j3J8mj6m9K3j2
$$ plain form
7023 59 13 51 16 25 51 18 12 16 -53 -21 -3 36 8 -4 -9 24 -7 15 -7 23 37 32 35 75 -18 8 -30 12 10 57 4 -10 26 -25
7057 -25 47 19 -6 9 17 47 72 -7 2 51 -13 -12 -23 1 -26 40 32 12 66 24 38 41 -30 13 -28 -22 -8 44 1 42 -81 -25 24
7090 24 -23 38 -5 45 9 25 -15 10 16 4 42 -28 -27 49 57 0 -21 -14 1 33 10 -4 -22 -6 37 -13 30 -15 -22 28 26 -75 13
7123 13 5 17 11 13 23 -30 29 50 -22 31 34 25 23 40 -17 12 3 8 4 -32 -42 -25 -7 8 39 -14 25 -20 19 33 53 -11 5 41 21
7158 21 -13 16 -11 -38 -39 -13 38 -8 30 -15 24 -20 -3 27 1 39 -29 47 -12 -23 100 35 -12 14 12 -13 16 -16 -8 54 -21
7189 -21 19 -3 -15 -18 7 16 3 -49 11 -36 40 14 -65 -39 24 3 -14 15 -20 24 30 -19 29 -36 -11 2 16 -21 -5 6 -28 -20
7221 -20 25 85 -82 7 -10 12 1 -43 34 -36 16 -26 34 -5 18 13 -12 8 53 -10 -22 6 -34 -32 33 9 18 13 -7 -39 -28 8
7253 8 -1 -67 50 -20 -17 -4 21 -19 50 -15 17 50 -68 18 -34 -24 41 -45 17 15 -8 -3 11 48 12 -1 17 13 -3 -52 -29 -41
7285d1K7j7J6M4l5O3p0oj6J8Rj2M7L5p0L4m6OL6J2n9N0j0PK0n2j0P8k8m3kN0M
7318C9o4L2PL7o0j4N2Jm6NKj7M8J0j5M0n3j6m2L6P5n3M7o4J8M6l8N1o3L5j6on
7351Il1ON1o3O2l1M2%o0M2n2J4m0R2Jk8n4L0nK0LPK9o2k3J17m4n6J0J9L4K0n2
7384Gkl4L8j7K8J9L2o6N5n0jl9j5P4Ll8rN3j3K1pp8rM1KN2p3P5l9m7Pk8P5oJ2
7419B3l5kQ3q5K5m4J5O8l9M1l1o2P9l6K5nJ0Oo1O7m4L1k2r4J06jj8rl0M6OPl4
7452a4k9P5m8k9P6rk7j4O2j7J6m8N9p1P9n7N5K3o4j4k1j0Q7m8L4l5J3N4q4Q3k4
7483E3l2j0o3R0j7l0l2R8p5K3l3L1K6J8n0L1rj4J9mJ4Nj2RJn9O5q2P0J8k7k4L9
7516C7n6M6l8mL9O0j13N3J1J7k2k5rK2J0o4n0J20Mm6R6j13nKJ4pL4k0K8k2L6n3
$$ plain form
7285 -41 -14 -31 -15 29 -6 57 -13 -19 -35 -17 -8 -20 27 62 -8 26 -20 -14 22 34 -25 25 15 22 42 -10 -20 58 30 -13 -15 35 39
7318 39 -25 7 14 51 -9 -23 29 30 -16 -11 -9 -26 22 32 17 57 4 -12 -54 -18 57 4 51 -13 5 51 13 64 1 36 20 14 9
7351 9 -22 -16 35 -28 34 3 45 45 -15 27 -25 -11 -51 41 42 14 -40 -10 -15 5 8 15 44 -18 -41 76 32 -24 -14 5 39 59 7
7384 7 5 -29 9 -8 20 39 71 5 60 10 9 -30 -45 29 32 -6 -15 38 25 46 39 -39 -48 -7 -5 47 -26 49 10 -37 -30 -58 17 11 23
7419 23 -12 -14 69 -16 9 -35 -20 48 9 50 19 -43 36 0 25 20 30 36 -25 42 -2 29 7 -87 19 18 0 -9 -39 7 13 20 -14
7452 -14 -43 32 -16 -45 31 22 -5 -19 43 26 42 -6 53 -18 61 4 59 82 18 4 -17 -27 60 12 46 11 24 78 -6 77 53
7483 53 21 11 -52 38 21 -9 -41 57 -18 5 -28 3 29 47 -3 28 19 5 24 20 34 39 27 36 37 -22 43 -39 31 49 22 -2 37
7516 37 -19 27 -11 -15 24 84 -29 24 35 52 30 5 -4 18 28 -36 -86 34 38 -8 88 -25 -30 -28 -14 -21 13 -7 21 -1 35 -18
7548a8K7J2%k6PQLNk5RJ6JKj4K0m5P8o4M2j4m2j9M7k1MLk5N8j9oJ4m8P8o3OK1
7584A2J1k6qM9n5L3l8k0O3j5l5L1j4L7m7L8J9l7Ml3M7Rk8K7%n2L3J4J7k5J5n2
7616b6M6l0J9l2K2L7l5qLj3J8j0J9j0l3L7L7Lm3rnj2P0k7Lljj5L6kJl8L2J1l6
7651FnK3o2N0K3r3K2J6O7k8j8M4l5k2Kj5J02r4m2M0K1Mm4L3k0LN8ll5k5L9J3k1
7684DN0l6k2KjK0K1Lo0j0L0kM1j9m3O1o9MO2%j9K3k4lm2OK8O4l8m5L9j3l3N9n9
7719b1O8l4RM9l0l2l1L9j1k1K6j3k2M3q3M2J1Nj0K3qO2n9k6Q8m5J5ll9L2K8l2
7751B0o2M6K9n5K2lJk6M8K3p3K8J4k8JM9k5nm9J08n9n4qM9O1m2L8qp8O1n1L8%
7784A0K3k0J5j1m8N3p0K6K6K0k6qO3p5O4l4K9k4qL0m6L6k6M1Kj6j2jr0J19oj1
$$ plain form
7548 -18 9 21 21 -5 2 10 13 18 -7 2 18 19 21 7 27 -18 60 -4 38 24 -18 -37 10 -11 -7 -4 -29 29 10 4 18 -30 48 -15 -9 12
7584 12 23 -3 -11 38 -17 16 -22 -42 21 6 -29 2 -12 25 -22 16 35 -2 2 -31 16 25 -3 24 24 -28 5 19 36 11 26 -26
7616 -26 20 -10 9 -23 -1 36 1 -7 -4 -17 1 -9 10 0 -33 4 41 44 1 -8 -13 -25 45 18 21 18 17 2 38 36 37 -1 31 42 6
7651 6 1 24 -38 12 35 -58 -36 -20 47 19 1 45 10 -12 -10 -25 77 -17 -59 -19 2 6 -38 -5 -25 -22 36 33 -2 -27 12 25 4
7684 4 54 18 -4 -2 -3 17 38 41 -19 -29 1 -1 40 21 -22 39 -30 -26 36 36 17 40 16 13 -29 -23 5 69 31 -14 25 12 -21 38 -21
7719 -21 47 13 22 71 41 9 -22 17 6 -15 11 -2 -24 19 -64 -22 -11 -6 -16 7 -1 61 2 -24 64 19 34 31 -8 24 52 20
7751 20 -42 4 33 -22 0 -3 -2 -28 20 43 -30 -2 12 -16 -15 34 9 4 -45 63 4 -50 -58 -9 52 10 48 40 -38 23 -28 10 10
7784 10 33 13 28 17 -31 22 -48 -22 4 24 -2 -10 53 -22 42 8 37 13 5 35 -11 25 -1 40 42 26 14 13 -77 42 36 25
7816B5PqL2k7Nk9N1k6K1m7N3q8K0L1n1M6O5m7o2L8Q%l9J5JN7l0N6m1o2K2K8k2
7849Br%L6l2j9L9M2j7p0%M6j1Jln2O4m5R5l3J9o3K5PJ3n9O8p8K2K5m0O9k5O6p3
7883A0p3P8m9O9j3n6%K1K0L6p8K7m5M4j5O5n5L4n5Q6l9J9Kk8L8k4l1qO0l0J8K
7915C0Oj4nk7K0nO1p6o2L4J3L6N1n6P2m4k0j4K1K3l6J5n0j4Q3l8PK4m4kJ4J6L1
7948E0n1pk0L2M2n5m5J03n6J2j5K7K2j6q9J13o4K0j0L4rKk4l2J2K7M6l8K7l8m
7979dJ9L1o1M9m4K4J9o8J1J4L5J6l9m8P7m8pM2mM3n8k0l2J2O0jL5n9J2j3k1M0
8011A2n3pM8j3RKoK4L5p1N3k9qj2rJ4J9J4n0J8J4L6m1J5n2L9m6J18n1l3j2MJ5
8044dpj5K4m1P0Lk8k4nL9K4j4J5po8J3J9J7pj0qP1o0k7K9NQ0j19P7Lp0JLJ1K0
$$ plain form
7816 25 32 24 56 29 34 5 56 30 51 4 57 -31 -11 20 -31 15 80 33 -29 9 17 17 -22 -7 -6 51 21 77 36 -26 -4 24 2
7849 2 -7 -7 29 -3 -22 17 59 42 -28 -28 18 7 8 5 -47 17 -28 67 34 53 -10 15 22 35 -24 44 -34 -12 13 -27 42 17 83 10
7883 10 -63 15 -34 35 22 -34 -34 -13 7 43 -35 -8 -53 -9 -24 41 -14 20 -35 51 12 31 33 5 43 19 -12 -20 40 10 28 30
7915 30 36 22 17 -10 10 5 66 -10 -72 -38 -25 11 62 6 78 34 14 0 21 44 8 23 -27 -41 42 4 11 35 -9 -11 3 19 50
7948 50 -1 -8 -28 4 46 -9 -54 49 -7 5 -10 17 39 23 -66 47 -17 3 -7 27 18 20 -4 -36 -24 3 49 11 38 0 -4
7979 -4 15 46 -15 34 -10 14 33 -35 -24 -10 25 41 2 -46 31 -17 -24 18 14 57 -1 -21 -53 -41 19 18 53 -6 6 -7 -28 12
8011 12 -41 -48 0 -13 -4 -2 -8 16 51 -20 33 4 -4 -16 -25 -11 8 22 -28 -10 4 40 -1 14 -38 1 -45 73 22 -11 -23 -19 -4
8044 -4 -11 -26 -2 -43 27 30 2 -22 -27 12 36 22 37 30 -38 -25 -6 11 4 -6 -14 57 -3 -30 -1 4 84 -35 42 45 -25 -24 -21 -10 10
8079A0M0q5NL5K5kn7K6LL9r0M7N4o9K4L9l1%kJ0pl3j5%N5j8qJ2Rk2k9J6K3mJ5
8114A5J3p0K4LJ1K0k2Ql9M6J7J3j9k3K2m4N1J3l6M9m4k7M3K6l5kOl1M5Rnj2k6
8147aJ1j4L9j8l7pK5j3M9k7K0J7m8k3J6P4r7PP6JlNl2j5J2l0PNk8K4L9Jk6K6j1
8182B4j4J6mk1J9j0j3K0K1
$$ plain form
8079 10 50 -35 -30 5 30 28 -29 -3 0 39 -51 -4 50 -19 5 44 13 13 11 21 14 -19 -34 -34 21 3 -5 7 16 -6 -35 -19 4 0 15
8114 15 28 -42 -18 -15 -4 16 -6 2 -37 9 26 39 20 -3 19 -25 26 39 3 52 8 -19 24 50 15 13 19 -12 33 42 37 25 -1
8147 -1 10 -4 35 17 -20 -27 -2 -15 34 7 27 44 -4 -27 -11 63 -34 -27 49 50 47 52 20 5 17 -13 -6 -1 -29 -5 34 35 9 35 24
8182 24 10 26 22 1 20 10 -3 17 38
8191C8
$$ Imaginary data points
##PAGE= N=2
##DATA TABLE= (X++(I..I)), XYDATA
0@%%%%%%%%%%qJ6j6J6k4L2m0M8n6P2q8J04j21J42j67J95k27K67l08L50m01M58
32B44n21N93o72P57q50R52j066J191j326J476j641J816k008K221k451K703k980
49a562L285l618L984m393M847n353N924o569P306q163R166j0360J1816j3636J5980
64H654j9135K3643l0646M3124p2149K66384J40445m16237p0328P7207N2127j40190
76a37101p4877K6600R9837K1910P880O7833J61850M3097j56213j85183N0449J91637
88A17719P7024j30534j47781j6018J04528O2827o7201j17381n291O5419j5388
99g2077n7759J06769K20490M8735j83769j28457R4626J34453n7772k03189j29288
110b27238N1825J19056L9353j5263N3196R5352p318j02078k4771R3025M8454j00433
$$ plain form
0 0 0 0 0 0 0 0 0 0 0 0 -8 8 -8 8 -16 16 -24 24 -32 40 -48 56 -65 77 -90 105 -122 145 -163 187 -214 244
32 244 -277 316 -356 401 -449 503 -563 628 -698 778 -863 953 -1055 1166 -1285 1418 -1562
49 -1562 1723 -1895 2089 -2304 2543 -2810 3114 -3455 3851 -4312 4854 -5506 6310 -7326 8654
64 8654 -10481 13162 -17484 25640 -46509 219875 360320 -55917 -126245 -49038 3089 -137101
76 -137101 -211978 -185378 -85541 -63631 -55751 12082 173932 217029 60816 -124367 -73918 117719
88 117719 194743 64209 -83572 -99590 4938 67765 564 -116817 -122108 -56689 -72077
99 -72077 -129836 -23067 197423 246158 62389 -66068 28558 163011 105239 -97950 -227238
110 -227238 -175413 -56357 -17004 -32267 20929 116281 108963 6885 -17886 75139 123593 23160
122B3160j46418l5466J08102J35520J3047j14508p5166O3038P5002m1750o5148
133f0587M1816P0754l4458p6151L8276J35683N4684j15015j58029k1406J09859
144a4574N9970p6282p8700M5238R1183J6711k0500K9694M2325l3094r2868n6953
156h7850L3995Q2287K7476p3473p7866M2360J18944L5743q0565o8781J6541L0978
168b11j9605k4150L6631O5323P09p5724l9573P3892Q7174m4445j31410m4946P7442
181c8893O7953j5683l1235J5805L1260r01k3633m119K7596J4443m6731p0850J861
194g3127Q6741O1466l9381p4389p322N5582L3461k9538m3795K068L1239j410k8599
207b7004J7806O7840J7496p5262o6131L2982P0739J6o5190l9221K8391N0540J6561
$$ plain form
122 23160 -123258 -158724 -50622 84898 97945 -16563 -91729 -28691 46311 4561 -60587
133 -60587 -18771 51983 17525 -58626 -20350 115333 170017 55002 -103027 -124433 -14574
144 -14574 45396 -30886 -109586 -64348 26835 43546 23046 52740 95065 61971 -30897 -87850
156 -87850 -53855 28432 55908 -17565 -95431 -53071 65873 101616 21051 -47730 -31189 -211
168 -211 -19816 -43966 -7335 57988 58697 -17027 -56600 17292 104466 60021 -71389 -116335 -38893
181 -38893 29060 13377 -17858 -2053 29207 28306 4673 554 28150 42593 -4138 -74988 -73127
194 -73127 13614 75080 35699 -38690 -46012 9570 43031 13493 -30302 -28234 3005 1595 -27004
207 -27004 -9198 58642 76138 876 -65255 -32273 38466 38482 -26708 -65929 -37538 13002 29563
220B9563j5462n214J6103q54l4929k1950K9773L8447j7121n6707k0008M6529N7872
233D6042M77n2467l4296K4729L6982q795k9099R539L1503q958l9586M35M9869
246B6375K5462m2260n8274k221M9839L3558k0477l5268L366L1488J0886j5789
258F685n093J4841P14k8509k4316J5153L9440J3825l2815l7650J0600M6969J8654
271C8498l1663l0695J0417K2726m651j5900R171K3760l392l3088j6359K8315L6160
284C3299q321m3837j9653K8032L2780l568k3442n688J2793M591j0446m755J3490
297E275J2770j2838k7877l556L1906K6751j5699l6235o367K8143J9919j2524j9746
310a0078J965J2867k995j4189L174K2485P929k3692k3412J2368L2486Q081k5262
$$ plain form
220 29563 14101 8887 24990 24136 -10793 -32743 -2970 35477 18356 -38351 -58359 -11830 46042
233 46042 46519 -5948 -40244 -15515 21467 12672 -16427 -6888 24615 15657 -23929 -23494 26375
246 26375 51837 9577 -48697 -50918 -1079 32479 12002 -23266 -19900 11588 22474 6685
258 6685 1592 16433 17147 -11362 -35678 -20525 18915 32740 -75 -37725 -27125 19844 38498
271 38498 6835 -23860 -13443 9283 4632 -11268 -2097 21663 18271 -14817 -31176 -2861 33299
284 33299 24978 -18859 -38512 -10480 22300 18732 -4710 -10398 2395 6986 -3460 -8215 5275
297 5275 18045 5207 -22670 -26226 5680 32431 16732 -19503 -25870 2273 22192 9668 -10078
310 -10078 -8113 4754 1759 -12430 -9256 13229 21158 -2534 -25946 -13578 18908 26989 1727
323A727k2764O705K0685N328j1648o724P012N117q570q029J0482J7768k990k4928
337a0829j4064J7604K6269J17k3526j2942J3183J6429l555j3069r4R215k697j4288
351a2247j834J8997J5210j1208k2942k509K0824J4913j0366j9496l182J2534P612
364F306m902l985O326N574q005j2637K492J6458O404j5915j7541N667K1692R443
378A7377j1367j2385K943R028j131q668p18Q121J036j1481o591J1945J6925j238
392A3796j7781j0249R122J3515j78j1081n154O572O597k725m443M577O486n796
406C258j4204l235J3187J1595n438j3404j698J2826J0377m475j0521j976M826
419A118j061o997j01R343M984p571q643M160J2828M492r930j2018N72J0265M839
$$ plain form
323 1727 -21037 -14332 6353 11681 33 -6691 321 5438 -3132 -11161 -679 17089 14099 -10829
337 -10829 -24893 -7289 18980 19097 -4429 -17371 -4188 12241 8686 -4383 -4477 4738 2041 -12247
351 -12247 -14081 4916 20126 8918 -14024 -16533 4291 19204 8838 -10658 -13840 -1306 6306
364 6306 1404 -2581 3745 9319 1314 -11323 -8831 7627 14031 -1884 -19425 -13758 7934 17377
378 17377 6010 -6375 -3432 5596 4465 -4203 -4921 3200 4236 -7245 -13836 -1891 15034 13796
392 13796 -3985 -14234 -5112 8403 8225 -2856 -8010 -1438 5159 2434 -2009 2568 9054 3258
406 3258 -10946 -14181 -994 10601 5163 -8241 -9939 2887 13264 8789 -1732 -3708 1118
419 1118 57 -6940 -7041 2302 7286 -285 -8928 -4768 8060 12552 2622 -9396 -8824 1441 6280
434F280n232m227M035M008l846n301K598O470j267r954n949P263J2646K808q907
449A425o417M989P162k212p200j765L229l49m497m75P160O992k608r203l243P661
465F49P491l836r355j694O759M553k188k646J712J828l378n817l90O551M223m783
481c21o855K788J0139M570n525o540q4K830o56l549j091L015K052k568k808L920
497f83P417N99p684n534L451O237L50m657k744K312K963r13k890K78K859r67n225
514d831j349O318O233j325n601j380M111L220k404n418k268J756J258j777q3M331
530G91L641k025l962J002M857J611m248n465n10L884K503k143k775J089K435q71
546a86k300J159L708N89l364k014K741M443N09m280m117N71K717m32k988n83K465
$$ plain form
434 6280 1048 -3179 856 4864 1018 -4283 -1685 4785 3518 -6436 -12385 -5122 7524 10332 1425
449 1425 -4992 -3 7159 4947 -2253 -4018 -789 -1138 -5635 -6110 1050 8042 5434 -3769 -7012 649
465 649 8140 4304 -5051 -6745 14 4567 2379 -267 1445 3273 -105 -5922 -6312 239 4462 -321
481 -321 -7176 -4388 5751 10321 4796 -1744 -1828 1002 346 -3203 -4294 -1279 773 -1795 -4603 -683
497 -683 6734 7333 -351 -5885 -2434 3803 4153 -504 -3248 -936 2027 1114 -1776 -1498 1361 394 -4831
514 -4831 -6180 138 6371 5046 -555 -1935 2176 5396 2992 -2426 -4694 -2938 -1680 -3457 -3540 791
530 791 4432 2407 -1555 -553 4304 5915 1667 -3798 -4308 -424 2079 -64 -2839 -1750 685 -186
546 -186 -2486 -1327 2381 2970 -394 -2408 333 4776 5285 1005 -3112 -2541 176 -256 -3244 -3827 -1362
563a362J489q87K20L014K581j182l978k123K136K752j397m226j272L003K363q80
579B51j365J021J418p72j800J76K595J711j858l312mL339J627k698l166J86K106
596e45N29p10O7J541J028r24j458O34K159Q3l291k706J247L043N40j845r47J202
614c53J548l7j025o1J002j49j831j147J896K400p87k766q64J879J669o20j738
631i84m13J084J010m59m79J003J101j043k130j97K050J017j546j963R6J945J376
648A468o65j331J68J005j09j156r3J364M51j563j092R49J899L12j539j530L81
665a081J516L26r77o17Q92N44n81n56P91R83m93j544o29R89J447j13j423p52J027
684b51J197l31q60j3P24k25q07j07R94P36o28j321j74J263R60p70j252l3J014
$$ plain form
563 -1362 127 -760 -540 2474 5055 3873 -105 -2228 -92 2660 1263 -2963 -4235 -1232 1131 251
579 251 -1114 -93 1325 553 -1247 -1071 1524 3235 1377 -1935 -1939 1400 3027 329 -2837 -2651 -545
596 -545 -16 -726 -659 882 1910 986 -472 162 2321 2404 -887 -3593 -2346 697 1237 -608 -1555 -353
614 -353 1195 1158 133 72 1074 925 -906 -2053 -157 2243 1456 -1310 -2174 -295 1374 754 -984
631 -984 -1397 -313 697 238 -241 762 1863 820 -1310 -1507 543 1560 14 -1949 -1853 92 1468
648 1468 803 -528 -360 645 536 -620 -713 651 1102 -461 -1553 -604 1295 1607 68 -1462 -1081
665 -1081 435 761 -216 -833 59 603 22 -534 257 1240 747 -797 -1426 -437 1010 897 -526 -1278 -251
684 -251 946 615 -245 -258 466 241 -566 -673 321 1057 429 -892 -1066 197 1157 387 -865 -898 116
703A16M20m44k48M06L07m71n49J32P86L22r37r79L30J272M51q59o46L96N56Km88
724a25K0L30J44o31m77N76R29j61j012n21P63Q26j51p04k47M54K70k36j93J90
744D4L45j85p73p9P45N82m20q60%P23N05l10n60k9L47M9l11r6M19K86m95o05L23
767c55Q57Q2o57m47K45N91Q8l67k41J50K17j64k97K58L47pn13k53M07M82n4n12
789a43l36L27M75j39l00o9K94k7l00J4L06K90k58m92m6N05L64k74m04j09L96J17
811A91k41p6J09J27j25k22R7L72J06l39l24R1M00J17k98l63K46K11M9j51o3K35
833A49m8j81j70J67L60r7l40j29K55K52q5k47m8K05O5o1j32J22O1k9j25n9J86
856G1J56k14k43N1K10J51j38j44J6J87Kj60p1K29kj75j27J39J40Q6k35j00J33
$$ plain form
703 116 536 92 -156 250 557 86 -463 -331 455 777 -160 -1139 -809 463 914 55 -591 -195 361 363 -125
724 -125 -105 225 369 -262 -739 -163 766 605 -407 -928 -165 661 510 -194 -441 13 283 47 -146 44
744 44 389 204 -569 -648 97 679 259 -601 -601 122 627 317 -243 -272 75 124 -187 -283 136 422 -73 -678 -355
767 -355 502 584 -73 -520 -275 316 404 37 -204 -54 163 -1 -298 -40 307 300 -213 -466 -59 423 369 -143
789 -143 -479 -152 323 184 -116 -185 109 82 -218 -204 102 392 134 -358 -404 101 465 191 -213 -322 74 191
811 191 -50 -126 -17 110 -15 -237 -140 232 338 -1 -325 -234 166 283 -15 -378 -132 79 128 -23 -86 149
833 149 101 -80 -250 -83 277 180 -160 -289 -34 218 133 -114 -162 43 108 47 -85 37 98 69 -56 -115 71
856 71 227 13 -230 -179 31 182 44 -100 -84 103 105 -55 -126 103 101 -74 -201 -62 78 164 -71 -171 -38
879c8J99l2k06OO8Q2j40m9P6R3J9j83mP3J39o8j67M2J12J35p1j51M5J22p0q8P
906d9J0P5Ok16P3J46R7j10o7j8J37K6o6m9JO4m1r4N0N6L7r3q4lJ69Qj50mN3J28
936I2n3n7nN9n2jp4M7J15p6m7j2N7J12o9m4l6M0J5K4p6R2mOj22L5O9mm4j7j4N1
968Gk4MK8o2R4Ln5l0k7M9nLj7M8l1M2n6M4K4l5QjL4o8j2JPj1M9m9O8l6nj6L0q
1004eK6l6J8n8J25n0j7oL4rk5Nj8oK6n3mM8M7K6r1k9M5L4q0l0P8jK2j7m1Q0N1
1037H9q1n4j8R8j4J4l3oj1J0n1L3k2N7n8k8N5P6J6n3p9K4R2j5k7o2RM3J9l1J9
1068A1j8J4m9L2j6Q0m2m6j9M2J9J4lp6M8J5j3m7Q7on5k1RR5N3q9q4k0O8P1n2k8
1100b6j9J12k7k5m1N3L6o7l4j6R8k4k1l2KQ8m2n5rP2j8l9K2rR2J8j36J6j1R7K1
$$ plain form
879 -38 161 129 -77 -71 -3 79 -61 -110 -34 59 78 -105 -109 -36 103 35 -132 -90 22 157 86 -65 -20 102 32 -56 -49
906 -49 -39 36 42 -174 -101 45 142 32 -35 -53 84 110 44 -5 -4 60 19 -75 -25 31 68 -25 -109 -112 57 65 -85 -89 -36 92
936 92 39 -18 -23 36 -16 -17 -91 -44 71 -5 -52 -64 -7 105 36 -8 -44 -4 11 35 -41 51 47 53 -69 -34 35 31 -13 -30 -44 7
968 7 -17 -13 15 -47 47 50 -5 -35 -62 -13 -18 -15 -32 16 -15 27 -29 15 39 4 12 11 45 -23 -35 -34 -27 -38 11 -38 30 -6 -11 -27 3 -5
1004 -5 21 -15 3 -55 70 20 3 -3 31 22 -3 2 -16 -22 4 -49 -53 -5 42 68 -23 -52 -7 27 -53 -83 -5 -6 16 -1 -42 38 89
1037 89 8 -46 -64 34 20 34 1 -5 -16 -6 -57 -24 -46 11 -47 -75 -20 56 72 19 -60 -36 56 41 14 -48 -39 4 23 -8 11
1068 11 -7 7 -42 -10 -26 54 12 -34 -53 -11 8 22 19 -57 -9 6 -7 -54 33 27 -28 -49 -40 55 108 19 -65 -85 -17 54 2 -26
1100 -26 -45 67 40 15 -26 27 63 -4 -38 -54 44 20 -1 -33 -31 57 15 -40 -49 23 5 -34 -12 -21 71 89 -47 -31 -42 55 76
1131G6j00k8L2R5o5m9K1J9M0m6m8M3O3l3p7m8J08P8K8j48J6OM8n9j4N2K2J2j01
1160e7j1J19L5k3j47%P8J14m9o9Kj2K3k0l0P2O6j23Jj9J25Lnj03j6NJ17j2l4l3
1190cm0N5j3p4Q2J4p9r1O7J12k9j0o0J0R9nJm1M7Pq2lJ3M4J8n5p4P7N2Nm4m6M2
1223dmOkl8N1M9j03n6J21J4k6p4O7K6N2n2l1l3K7K9J3n4J6%K7n7K1L5N3r4n9N2
1255b8R2pn2kl5P1j14P5lK3Ll8l9J1J09l3m2l1N9J9qk2l8k7J13n3K3m7J79j32
1285B6r8L9P4kJ8p4o8Q8K4J6p2m5K4J14o5j4K8K8m3p2Q7M9L2j30j4k9Q8N0o6k4
1315c1RO0p1K0o3J00K6o6o9M8P9Rj16K0JP5j7mk1J0K0p5L3K6Q2m2j01k4N8N5L3
1346F4p0l4K4L3m3pL1L0Jj8o7N9K4j1m5k9P6K7m9p5K5M8M9m0J8o3O2kq3L6P4j7
$$ plain form
1131 76 -24 -52 -20 75 10 -39 -18 1 41 -5 -53 -10 53 20 -57 -105 3 81 109 -39 -23 -17 31 -28 -42 10 32 44 -57
1160 -57 -68 51 86 63 -84 -84 -6 108 59 -10 -8 -20 3 -17 -47 25 91 -32 -31 -50 75 78 73 -30 -46 -41 76 64 30 -3
1190 -3 -43 12 -1 -75 7 21 -58 -149 -82 30 1 -9 -69 -59 40 35 36 -5 42 49 -33 -36 -23 21 39 -16 -90 -13 39 44 0 -46 -4
1223 -4 -8 -2 -4 -42 9 58 -45 -101 20 34 8 -66 1 27 79 27 -4 -37 -10 19 32 -22 -6 -6 21 -36 -15 20 73 -21 -80 -28
1255 -28 64 57 5 3 -32 39 -75 0 -3 20 23 -15 -54 -43 66 33 -9 -40 19 38 30 8 -30 -57 56 3 26 -21 158 26
1285 26 -72 -33 41 39 57 -17 -85 3 27 43 -29 -74 -50 64 -1 -15 13 41 -2 -74 13 62 94 -36 -50 -79 9 59 -7 -31
1315 -31 -22 38 -33 -13 -76 24 50 -16 -85 -37 42 51 -65 -45 -44 31 14 10 -11 -1 19 -56 -23 3 85 43 -58 -82 -24 31 64
1346 64 -6 -40 -16 17 -26 -33 -2 28 29 11 -56 3 27 16 -29 -58 18 45 -4 -79 -54 -6 43 3 21 -42 20 18 -65 -29 45 28
1378B8j4r3P0N6L9j01rJ8Pj8K5L5l0N4j42K6N7L6j9J5r0M5P1l2n5J9m4P1Mo8M0
1409Ak2J6l5K7rO3j8r6KL8P1k6k4J9O0l4mm9M8j3l9n7R0O6j0m5l1P9m7nJ2n3K8
1442CL1l2p4M2O1k2l0l8O1N2K1p3o2N0J7K7q0M1pPl6l2N8N3o8j4J7J3P9l6q8L1
1474b8QP5r0K0K2L4l2r9J18pM7p8j2M6N8n4j3k5n8M8P7l1k9k7RJ8o7M5O5J4n1
1505Cm1N5l5O4m7l9j1J09o2Qm5N0j6o8L5R4o3N2p2n2L7R8p8M6l8j6J5qK4K2nk6
1537a0RL8k0M1m1l7l5N4nj5K7l1K5K7l5KL4k2Mr5R6QLn6j7L8O0o8moOJ3P5m7P3
1572H9p4K6qq4L0M8n1j2LK5M5l4j9l4Q2l4n7M7qJ04p1j6m0O6M2l9r3l9J15kK0
1603B7p1M7L3n1jK3M0j5l5m4l0J06K2m6m5L0L9j1o3O4J5l6k0j9l4Q4O2r8m9J0
$$ plain form
1378 28 14 -79 -9 47 86 -15 -24 -6 1 -17 8 43 13 67 -75 -49 8 44 25 40 -50 -5 66 34 -21 -2 -46 25 29 -39 1
1409 1 -21 -5 -40 -13 -22 41 23 -73 -71 -33 38 12 -12 7 67 33 29 -20 28 15 -24 -81 9 75 65 20 -11 68 21 16 28 -25 3
1442 3 34 2 -72 -30 31 9 -21 -59 2 54 75 2 -60 -10 7 34 -46 -5 -12 -5 -41 -73 -15 38 -30 -44 -27 -14 65 29 -59 -28
1474 -28 -20 55 -35 -15 7 41 9 -90 28 21 68 -10 -22 24 82 28 15 -10 -68 -20 57 26 -3 -30 -21 -3 -70 -25 40 54 3
1505 3 -38 17 -18 46 -1 -40 -51 58 -4 4 -41 9 -7 -75 -40 54 -9 43 -29 -81 -44 54 -24 22 -16 -32 -17 -25 -1 21 16 -10
1537 -10 -1 37 17 58 17 -20 -55 -1 -6 -21 6 -25 0 27 -8 -6 28 6 10 -85 11 19 22 -34 -51 -13 47 -21 -25 -31 -25 -12 63 16 89
1572 89 15 41 33 -51 -21 27 -24 -36 -33 -8 37 3 -16 -50 32 -2 -59 -12 -20 84 13 -3 -43 23 65 26 -67 -106 9 7 27
1603 27 -44 3 36 -15 -16 7 47 32 -3 -47 -77 29 51 5 -40 -10 29 18 -45 19 34 -2 -22 -41 -75 9 71 -27 -76 -66
1633f6J07pk9o6Q7k4k7K5M7oJ2q4J2N5l%n9j3J9L9j2k4K8Rk5j8j4M9lO7r7k3N4
1666A0K3J1n4j7J6K5m6krN3l5RJ03r6M6o1nl0N1J2O4j07rL8M6Pj1K9n4lk5lKP8
1700E6Kr6rP1n5M7p5O3J6j7m0N0J5rn4N5ML2o4l7R6o1L6k5r8M6R5n7mJ0O0k8j9
1733Fo5N7K6j1j4n1N0L3kKp3j7N9N0l9o3J07k1j1m2NJ6L2p7RnO2K8n6j0N2n8P7
1766E6r6K8L6k8l1j7N0M9np8k7Q0L9n0j7K0qjk0pJ34n1p4Jl8J07p8J9n2J7L2O3
1798E3Rj5p0K0om8J0J08l3k5p1K9J14m3n7l1M9K1Nk4j5L4K2r8QJ6O2l1j02Q1K7
1829aO9K2o2m1k7Q8j2m0M9m4ll9K0PJ7J4m6L8m5P9k4m3L5Np3M9oN6n6K7o6M1L4
1862B2J0n4j9J2N2L6m6JnJ5j1j1o2J03j1o4J6j9J0P2l0m2o7P5J7roM4q1N7oj1
$$ plain form
1633 -66 41 34 5 -61 26 2 -25 0 47 41 53 -31 -19 36 33 33 -26 -39 -20 19 7 -17 11 20 -5 -23 -37 12 9 76 -21 -44 10
1666 10 33 44 -10 -27 -11 14 -32 -34 -43 10 -25 -16 87 -9 37 -24 -29 -59 -8 4 68 -39 -48 -10 36 43 32 61 7 4 -21 -24 -22 56
1700 56 58 -38 -47 24 -31 16 -59 4 20 3 -37 13 28 19 -35 20 24 56 -8 -45 51 -10 26 1 -97 -51 44 -13 -17 -7 53 25 6
1733 6 -59 -2 24 13 -1 -52 -2 31 29 31 -42 -59 0 50 11 -52 55 34 23 -19 -14 2 34 -43 -34 -39 23 51 -5 -15 37 -21 56
1766 56 -40 -12 24 -4 -35 -52 -2 47 42 -36 -63 17 56 6 -11 9 1 0 -20 -27 107 56 -18 -17 -55 52 -26 -7 -59 -42 -10 53
1798 53 62 47 -23 -3 -9 -57 -47 61 28 3 -68 -39 75 32 -25 -56 -7 14 19 -5 -20 14 36 -62 -54 -38 24 -7 -109 -28 -1
1829 -1 68 90 28 -13 -40 48 36 -4 45 1 -2 -41 -21 -14 3 17 -29 9 -36 43 19 -24 11 16 -57 -8 -14 42 -14 13 -53 -12 22
1862 22 32 -22 -41 -29 23 59 13 14 9 24 13 2 -60 43 32 -32 -16 -35 -25 47 17 -25 -92 -17 0 -9 -15 29 -52 5 -1 -12
1894a2N1n0p0O4k3J01Jn7p0N2M4on9j9N4J2m5k6N1O3l5o7o1J09K9pp2M1qN0p7
1925d2K1P7p2K4Qk7K1%N4j31j9J37on2J8n5J8N8k5K9j2m6j7L2m1P4L7o0l3lO6
1956C3K8k9q0M1j5K4k1rj0O4k2m2K9J6K3J1o2M8mkn2NL2K0j8J1l3L7n4L5j2k3
1988c1M5ln6j6K7K2K1MK1o2O0m9JL8Qnq0rJ46q3k1k1N6o5P9o0J7k5L9m6K9%K8
2021IL7o3M4o7O8Rl7n1QL1j5j0J3k3K1J5o2R7pj3j7m3j1J32m6Nn4M5Jj7J9J7j
2054C4l9p6O3N0J2m4o7N6j6J34m8j12M3j9O6o4pL6M2o2k2J6K1L7j4p5P9J0k9J3
2084A8m9MlnP7o6OK7n3j1L3R0m2m2rK1rM9j7l6J1J5M0m9n8L3P1r8K6M4j3Q7r6
2117dm9P8K3Oo8k1N1m2N0o5O2M3m5q1J7L0R6k9q6M4jJ2l4j0K3qk1J6r0O6O0k1
$$ plain form
1894 -12 39 -11 -81 -17 -40 61 62 5 -65 -13 31 25 -34 -53 1 13 -32 -58 -7 56 21 -46 -107 2 31 24 -48 -7 -15 35 -42
1925 -42 -21 56 -16 8 16 -11 10 10 64 -67 -86 51 45 -7 11 -44 -26 32 7 36 24 -22 -39 -7 -48 26 63 3 -30 -33 33
1956 33 61 32 -48 -7 -22 2 -19 -28 -38 26 4 -38 -9 7 30 41 -21 27 23 21 -31 -26 6 26 8 19 -14 23 -31 4 -8 -31
1988 -31 14 11 -45 -61 -34 -12 9 13 34 -28 32 -17 -16 22 30 25 -55 -64 82 -1 -22 -43 13 -52 27 -33 -16 -41 -2 -48 -19 -19 9
2021 9 46 -17 27 -40 28 37 0 -51 -43 -12 -27 -37 -24 -47 -26 -11 -73 24 17 4 -13 -56 -67 65 19 24 -30 15 16 -1 18 35 34
2054 34 -5 -81 -18 32 44 0 -67 -11 -27 107 59 -53 -10 -29 37 -27 -34 2 44 -18 -40 -24 -3 34 20 -55 24 34 5 18
2084 18 -31 -27 -30 -35 42 -24 -18 9 -44 -55 -22 68 26 -16 -25 -4 -13 36 19 -17 -6 9 49 0 -58 -25 46 -52 -26 18 5 92 -4
2117 -4 -53 25 48 54 -14 -35 16 -26 24 -41 21 64 19 -62 -45 -15 81 52 -34 10 9 21 -13 -23 0 -8 -29 -13 -103 -37 23 2
2149Bl7n7Q7O8q6J1j7k8L9rM0m9L7L0rm1N4k9Rl9J5K5Pn2l4O8k8M8Qq2M8n0m0
2182i1P6M0J3Mp0m4J28rj8q1J1K9N6o4N1nLj5o9P1L5m8N9j19L2J2M5l0p5M7P2
2213D6o0QL1k1j4k3M6KJ2j0j8l8J0Q9r5K6p7P4N9o9L3j2L5rj8p8Q3kj6j3nM7m6
2246b3K0L6o4P6n1Ol5P6rl7Om2N2M7l6q9K3L6k7N0j4K5n0L3n9L6J1nl1J5l9Q5
2278B2O6j50M2Mm0M2P7o7On0M7l4RJ23o2ol8l3R7j26L8O2m4K2%p1M3j3N1k2%J3
2310HO0p7l1QN0KJ0qj5%OK3Ml4kK9l0L0j9Q5o5n4L6k2K3mJ2j8K0Qj09O0N9K5p3
2345co6N2K4Rn2kK8j7K0j0j2O3Qr6J5J8L8LK5j15J8M3qM8m6j7M6k8J2oj3K8k2
2378a5pm7J28j00mJ12j06R7m8j0k2L9K5j3N%k2j3J9o9N5L8n6oJN9o1M5k8Oj2m
$$ plain form
2149 2 -35 -92 -5 63 -23 -12 -29 -57 -18 -27 13 -36 1 31 22 -19 35 6 15 -24 -9 16 23 -29 -63 5 -23 25 33 -49 -1 -51 -91
2182 -91 -15 25 38 42 -28 -72 56 47 29 -52 -41 -12 44 -20 31 26 29 14 -55 16 51 3 62 -57 -25 -13 32 2 -73 -26 46
2213 46 -14 -6 25 4 -10 -33 13 15 27 17 -1 -39 -29 60 -35 -9 -86 -12 47 -22 11 -1 34 25 7 -71 12 10 -6 -19 -24 23 -23
2246 -23 -3 33 -31 45 -6 0 -35 41 32 -5 1 -41 11 58 22 -67 -44 -8 -35 15 1 26 -24 9 -50 -14 -3 -8 -39 -24 -63 22
2278 22 88 -62 -20 -16 -56 -14 63 -4 2 -48 -1 -35 -26 97 35 29 -9 -42 55 -71 -33 29 -15 7 7 -64 -21 -34 17 -5 -5 8
2310 8 68 -9 -40 -32 18 20 30 22 7 7 13 36 40 6 4 33 3 33 14 99 34 -20 16 -6 17 13 25 7 27 35 -74 -14 45 70 -3
2345 -3 -69 -17 7 16 -36 -38 -10 -27 -7 -17 -29 34 42 -54 -39 -21 17 20 45 -70 -52 -9 -17 31 -15 -32 14 -14 -2 -8 -21 7 -15
2378 -15 -22 -69 59 -41 -45 67 -39 58 10 0 -22 17 42 29 34 34 12 -1 18 -51 4 42 -14 -20 -19 40 -21 24 -4 2 -10 -14
2410a4j8N7NM3j20N5RL5o3J8Rp3J43q8l1j7L2O3m8k7N8jj7k6n7O1ON2n1k1PJ0
2442iK0n1L1OK1m0L2pK2j3k8k0O1Rl8J3n0L6K5J8n8%N2j21O7ML2K1m8j3P%L2L
2476A6L5r6M1O3m7J6j3L3q9N8k6J3K9q3N9l3K7Jm5N6m0J04j12JO3j4m1J7NO1j7
2507D2J3r2M0L5oj2k3K6pj9n3M4M6n4N6n8j4M6N2p6k7j7O9K4l2j0k6O0l1k3j3
2538d0M2J6l6J6rJ1J0n2m5K2N2O3k5p3M4J8j9N4k3Nn0M6n9P0Qk6k2qK7K4l2J2
2570B1l1O7n6rjJ7K2k0q5O9k8J21n0o7L3pJk1m0P6L1J5m1J5Nm5l1NON1J8m4L3
2603C0mj4k2P3j27L5K5Jl4lO3l2N1o4k5J02Kj4p1L5n1L7N9j4Om1m5QM7M2n8J2
2635Im8L1L3k9K3l8j2J5j3O3o7M3k2J1k5J9O0j8p3K3j0L4j3kJM2l4K6p0kN3K2
$$ plain form
2410 -14 -32 25 30 73 -47 8 17 52 -11 7 16 -57 86 -2 -33 -50 -18 45 -3 -30 28 27 10 -16 -73 -12 -6 46 -5 -26 -19 -9
2442 -9 11 -40 -9 -3 18 -22 10 3 25 12 -16 -36 25 34 -4 9 -41 -5 20 38 -20 -20 32 -89 -22 -18 14 35 -13 -26 -19 -19 13 16
2476 16 51 -45 -4 59 12 28 15 48 -41 17 -9 4 33 -50 9 -24 3 4 -41 15 -25 79 -33 -32 31 17 -24 -7 -2 59 42
2507 42 55 -37 3 38 32 20 -3 23 16 -3 -56 -12 34 -20 36 -22 -36 10 62 -14 -41 -58 11 35 3 -7 -33 27 -4 -27 -40
2538 -40 2 18 -18 -2 -11 0 10 -42 -87 -65 -13 50 25 -48 -4 14 -5 49 26 31 -19 27 -32 38 46 20 -2 -10 17 41 9 21
2570 21 -10 57 1 -8 -9 8 30 10 -75 -6 -34 87 37 -30 3 -4 -3 -24 -64 12 43 58 17 32 37 -8 -39 -34 -28 23 41 -3 30
2603 30 26 12 -10 63 -64 -29 -4 -3 -37 -40 23 -9 42 -22 -47 55 57 43 -28 7 -44 -7 52 38 44 3 -42 -34 13 55 -3 9
2635 9 -39 -8 25 -4 19 -19 -31 -16 -29 34 -33 10 -12 -1 -26 -7 53 35 -38 -15 -25 9 -4 -6 -5 37 3 29 -41 -43 10 32
2667C2n0pJ10o7pl2J4k0Q8l5j4K2j0l5QLK0j8nq1O8K2j8Km2J5L0K0L6n6M3j9j5
2700Bm9OR0n8Rm9KJ00jl4n3J9O8k4p3M6Jk0J8oL7qj5J6m4MM6K3jK3r9k0N2k9O8
2735D7n9J3j5KL1K7nLq9L6L0K1k7j8k6K4J3l7K5j2O9m2p5P0J3L3m0l6L4nk5nJ5
2768a0rj0J1L0k0J8q4N6OL0K4n9J1j7P1m3k4j8N2J1l8j4KP2k6o3j0Q6j2J3j9J1
2800B8k4oO0q8K5n8O8Jk6O1k0ql2L4n4J8P5j4p0L8L2mo1P5J2j09OR2m4J8Kj09
2832h2O2k9K3J9oJ7rJN9j61Q8O9p1J8k3M4L2j22L7O8o9K4L3l3J7l3N4l9O0o4j7
2863c3J6L7m4J2rK7k3m7Q5pk1j9M4J8k6k4N1m4N6r4k8M4O1Pk6J5kKJ7p0k4lnJ0
2897d7K2K7K7l6l1L7M3l3j2o1M1N3l1j4Kk8N6k7l3J00m7m2K5j6j6L3N9o4K4o7
$$ plain form
2667 32 -18 -25 85 18 11 -21 -7 -27 61 26 12 34 24 -11 -3 0 20 2 -3 -84 -16 6 -12 -10 -52 -37 -7 13 49 -7 36 17 2
2700 2 -47 -41 49 -9 0 -49 -47 53 52 18 -35 -16 52 28 -45 1 2 -18 0 -6 31 23 8 24 -20 -16 30 53 52 75 -24 -44 8 -21 47
2735 47 -12 1 -14 -12 19 46 41 44 -45 -9 21 42 15 -3 -29 -5 8 -29 -4 -16 53 11 -64 6 19 52 12 -24 10 5 -20 -25 -10
2768 -10 -19 -29 -18 12 -8 10 -74 -18 -12 18 42 -17 -6 -23 48 5 -19 -37 15 26 -12 -26 -24 48 22 -41 -51 35 23 36 17 28
2800 28 4 -2 58 -30 -5 -63 5 6 -20 41 21 13 -19 15 -39 -21 54 40 -30 8 40 36 -25 50 62 -47 -41 51 7 25 27 -82
2832 -82 -20 -49 -26 -7 -13 4 -5 -4 55 -106 -18 51 -20 -2 -25 19 51 -71 -34 34 -35 -11 22 -11 6 -27 27 -12 48 -16 -33
2863 -33 -17 20 -24 -12 -21 6 -17 -64 21 14 -7 -26 18 36 10 -14 37 -7 49 -45 -73 -29 32 39 13 28 26 28 45 -25 -49 -52 -57 -47
2897 -47 -25 2 29 -7 -38 -1 42 9 -3 -64 -23 30 -1 -15 -13 -41 15 -12 -45 55 8 -34 -9 -25 -41 -8 51 -13 11 -56
2927e6N4M5l0p3M7Rn4P8%j6M0n3K2m7J00l8n2NK4L7n8K6J0k7OJ9L3m4NlK6l9J0
2960FJ3m9P7q5lL9k9P9o7m4P0J3oJj4n8M6nJ6%k1KL7K2l0k7L0m4oP1l1k4N8j8
2994A9n2k1M7Ql5L7j7K7j6Oj5%L0l9J9l1Q8k6m4M5n1PN0l1j7kK2L3l1j3N0j4j03
3027g0j3L6K7M6m8j3K1j4L9k1K9%l6j2L7j9M1l2Lo9J9R8k7n0pL7J8j4K9k8L0n3
3059a6J9QnRl8j0J5PK2N2k8o9K3nOj7L1K7p1L1m3L8K9Jk7lQ3p9lL0m9M2%k2K4
3094A2k9J3l4Q2n4pK7l2K6k7M8l3O4k4o1J1J9P4q5L7nqm7J4K3k4pj0R5n0k1k9
3126d2L7J8o1P9l4L5n3O2q1J5J6QM0p1N3K6m7N8o0K7q7R6r5N4J2pl0LN0J0K4p4
3158a9l3NM1LL6o5N7J8o0N9n1J1J5k9k4L8mP1j14L4J2J8J5l3MM5k3l1j6J0OJ4
$$ plain form
2927 -56 -2 43 13 -60 -13 -4 -58 20 20 4 44 -9 13 -34 66 28 -24 -19 5 42 -16 10 20 -7 -1 18 51 7 12 9 35 -4 6
2960 6 19 -30 47 -38 -41 -2 -31 48 -19 -63 7 20 14 15 1 -57 -11 -16 0 0 -21 -19 18 40 10 -17 13 -31 -37 34 3 -21 37 19
2994 19 -33 -54 -7 1 -34 3 -14 13 -3 3 -12 -12 18 -21 -2 -33 55 29 -15 30 -21 -14 36 5 -12 -14 8 41 10 -3 47 33 -70
3027 -70 -83 -47 -20 26 -22 -35 -14 -28 11 -10 19 19 -17 -29 8 -11 30 -2 1 -68 -49 49 22 -28 -35 2 20 6 35 7 37 -16
3059 -16 3 11 6 15 -23 -33 -18 -11 11 63 35 -34 -11 -16 -10 -27 4 31 -40 -9 -52 -14 15 16 -11 -14 69 -10 -13 17 -32 10 10 -12 12
3094 12 -17 -4 -38 44 -10 -17 10 -22 4 -23 25 -8 56 32 -29 -18 1 75 -10 27 22 14 -33 -19 4 -20 -27 -37 58 8 -13 -42
3126 -42 -5 13 -48 31 -3 32 -21 41 -40 -25 -9 -1 39 -32 21 47 0 58 -2 25 -62 34 -61 -7 5 -2 -32 -29 21 31 55 -19
3158 -19 -52 -47 -6 -3 33 -32 25 43 -17 42 -9 2 17 -12 -36 2 -2 69 -45 -11 1 19 34 1 5 50 27 -4 -20 -10 -4 10
3190A0l1k1j7N5K4l0K6j3k2K7m2K4j8O8m3NM8p2mKJ3K9k6%n4Q8K1n1N3p1LQ6l6
3223C1m7N8Rm1m6L8%ol9k8M7J2K8J3j0o8J04o0l0L6n0JkJ4N5k8%M7k9j1j3K0j9
3256a4O1l2pKm1lj6rN4p4N4l0J9J5K4k1O1k1K8m0L0Rk5k7lqK1L7j33J28k5l9O5
3289D0m7m4O4m9k2P1J7k5n0mP5j3J8n3l7K9M2O3l8O2q1k3MK5j8J5k0L9p7K6lJ7
3321Cj5L3m9O2K2j26K9L7M2nr3L3J7L3l7o3O4Lk9k3N2l0P5m8nQ3n4Ml4M8l6P7
3353G0j00nM7L7m7M5n9j9O4j7j3l9Q3l4l4J7jj7O8j6m6KLL2j9J3Qn4P3J9m7m5
3385c1P6o7M1l0L0lo4J9L1LKk2K3Lo8M5J8l3N2m1J5l9J3M2l2LJ0J0k6l2O0l1Q
3418a5rPN5n7K4j8K3LPL3k2j02R4l3J7K9J2l5m5j0J3L0Jj7j4K1j2Q4j00J7l2O9
$$ plain form
3190 10 -21 -42 -59 -4 20 -10 16 3 -19 8 -34 -10 -28 40 -3 2 50 -22 -26 -24 -11 18 -8 -8 -62 26 47 -4 49 -22 -19 67 31
3223 31 -16 42 51 10 -36 2 2 -4 -43 -71 -24 -12 16 29 19 -49 55 -5 -35 1 -49 -48 -50 -36 19 -9 -9 38 9 -2 -15 5 -14
3256 -14 47 15 8 10 -31 -34 -50 -59 -5 -79 -25 -55 -36 -21 3 -18 43 22 50 10 40 49 24 -3 -6 -14 7 44 -89 39 14 -25 40
3289 40 -7 -51 13 -36 -58 13 30 5 -45 -49 26 13 31 -22 -59 -30 12 75 37 99 18 -5 -1 24 6 21 1 40 -37 -11 -14 3
3321 3 -12 21 -28 34 56 -70 -41 -4 38 33 -60 -27 -10 23 -14 -77 -13 -10 -39 -62 -10 -40 35 -13 -18 65 11 15 -19 29 -7 70
3353 70 -30 -35 12 49 2 47 -12 -31 33 16 3 -36 47 13 -21 -4 -5 -22 46 30 -16 -14 -11 21 2 15 23 -31 42 61 14 -31
3385 -31 45 -22 19 -11 19 16 -48 -29 2 5 7 -15 8 11 -57 -12 6 -27 25 -16 -1 -40 -27 15 -17 -14 -4 6 -20 -52 8 -23 -15
3418 -15 -24 -17 38 -19 5 -13 10 13 20 53 31 -71 23 -10 7 36 48 13 -32 -42 -29 1 2 -15 -29 -8 -20 64 -36 -19 -51 18
3450A8p3N5j9J5pO9l7n1K5M9o3mJK2PJkj4k9L2K6Mk1NL8m4lOM1Jo4L0JK6%n9j5
3487c3J1mk7L6K0L6q4M4j7L1rj1Pl1R0k9k1p6M2L7k4n0L2L3J0m7m0N9L4k4pPq
3520a3L7qk4J5n7N0m8P7n2Jj4ON1kk4nj7qN3oJ4M5r5K5j6k6lL7O8o2K6k6l9Q2
3554D2m5MOk2K2j%K1m4J6j3NK2k0J5n9l0L6Q1rl1q0Q2l3j3L0k1J8P4m5o6J05q5
3587c8M7l7O1j1l9L9o0P3o0K8k0L7pPl9K8Rm6L1K5r8Q2l9M8j9k2JK5j4j6O0m5
3619ij3L4JpJ3n0K3K1k5kj5k5R6l5O3o7mJ3L5p9m5J01j0j2kl6NN9m8NM3k6j6K0
3653FrM1o2Q8o4k2kK5N4n0k3Q1o5jJ3n5M4n0L8PK3o1O7k1n3M1K4k6mJ9k4M0k8
3686iK4j8OM0m6m4J08j9o1j1m1J18j8l9pk9j4L5l1N0J9j5K1l8N7Rm7J0l1m5R4
$$ plain form
3450 18 -55 0 -19 -4 -11 58 21 -30 -5 44 -19 -23 -22 0 7 8 6 -8 -37 -5 21 25 4 9 47 3 0 6 47 48 -16 14 15 41 41 -18 -33
3487 -33 -22 -26 -53 -17 3 39 -45 -1 -18 13 4 -7 0 -31 59 30 9 -67 -25 12 -12 -62 -30 3 13 -34 -74 -15 19 -5 -12 -5 -13
3520 -13 24 16 -8 7 -50 0 -48 29 -23 -22 -36 -30 21 19 -5 -10 -27 -35 18 12 26 71 -24 1 -15 -41 -44 -7 61 -1 25 -1 -40 42
3554 42 -3 1 7 -15 7 6 6 27 -17 -1 -14 -9 13 -7 8 -51 -81 -45 36 27 -4 -84 -2 -35 -48 -18 -39 -21 53 8 -58 47 -38
3587 -38 9 -28 33 22 -17 22 -38 35 -25 3 -17 20 13 20 -19 9 18 -28 3 28 -70 12 -27 21 2 -20 -19 6 -8 -24 36 -9
3619 -9 -22 12 13 6 19 -31 -8 13 -12 -14 -29 -54 42 7 70 3 -1 12 47 -32 -77 24 14 2 0 -36 -31 28 -20 -15 28 2 -14 6
3653 6 -3 38 -24 64 0 -22 -24 1 55 5 -18 63 -2 -3 10 -45 -1 -51 -13 -6 17 -44 23 2 -51 -10 14 -12 -16 3 -21 19 -9
3686 -9 15 -3 3 43 -3 -47 61 42 -19 -30 -71 47 29 -10 -17 -46 -60 -25 -56 -6 13 -2 19 -19 38 47 0 10 -21 -66 28
3717B8o8L8Kjj9JKN6n8M0J1m5J9k7L1l1l0K0K4RK5k5Np8K2N1k0k0K3l%KJ3nJ2
3752Dj7J6pll4L5L6m7L5M7m6K0n4k8O2p5P0PLk4N2m7j6ll7ON0m3L5L5o6J4M3l7
3786a4oj6J2J4PJ0K4Nn2L9kq1M7K4%No8M0K8k6M8J7p6j5R9j02M1KMK0kq1O7L0
3820D2k9L6p4M7ok8J5l9O5Kj9Jrl7K9k5j8N8lop5QN0j1N7l7J1Km1L3lk4j2L8m6
3855d8N6j0rn2K9j8P1Rk7k6Nj2N1k6nK8l7k2K1k2P1k5m8M7M5p6L2J7K7n8M3k8
3887Ckj0j5L1o6M3J0j6L9j4K9n4K8K7l0M2r3O8kl1P1l0m0rN7J3o8j9J4J9PMJ1
3920A7J6l2Oj4J7k8K9N2q1P5p8K9m0M5k0j8K7K5QN1m8q5M6m4M9n8R3n3L2k2M7
3951D3ook7lL1p2RN0K3m2n1K4MO2J0m0l4K5K5m5OjN2n6N3K5%n8l2L4Qn0J7k7K1
$$ plain form
3717 28 -40 -2 0 -1 -20 -19 -17 39 -19 21 32 -13 6 -21 10 -21 -51 -31 -7 2 27 2 7 -71 -49 2 -18 -38 -15 -18 -18 -16 -3 -8 4
3752 4 -13 3 -4 -7 -41 -6 30 -17 18 65 19 39 -15 -43 19 -56 14 21 24 0 52 5 -11 -14 -51 -45 5 -38 -3 32 -34 -20 23 -14
3786 -14 -20 -36 -24 -10 -3 7 31 36 -16 23 21 -60 -13 11 11 16 -52 -12 16 -10 38 55 -21 -36 63 -39 2 4 8 28 26 -55 12 42
3820 42 13 49 -25 22 16 -12 3 -36 29 31 12 13 4 -33 -4 -29 -47 11 8 2 -73 -65 -15 -26 31 -6 5 7 -34 -1 -4 -28 -40 -2 -48
3855 -48 8 -2 -11 -63 -34 -52 19 28 1 -25 -20 -32 19 -7 -12 16 -21 -43 -22 -44 27 2 -46 1 46 -30 2 19 46 -12 31 3
3887 3 1 -9 -24 7 -59 -16 -6 -22 17 3 32 -22 6 33 3 45 -48 20 18 -13 58 28 -12 -21 36 49 -19 -38 -24 -5 2 6 17
3920 17 33 1 7 -7 10 -18 11 63 -18 57 -21 8 -32 13 -7 -25 2 27 35 86 38 -47 -1 -45 4 -54 39 -14 18 -4 43
3951 43 37 31 4 1 32 -40 -31 19 42 0 -51 -27 -23 39 49 9 -25 0 25 -20 -14 -15 37 -19 34 59 59 1 -31 3 11 -39 -22 -49 -28
3986b8%k2N9rlM2m6n1N7J7K4j04P5j9MNJ4j8J2l4O9nn0K4m8P5n3J7j2M9J3r1k3
4019f0O9Qn9K5K9j5J6o5N2lJ4NJ7n1j3J2K0Nj0L7o2j7N6m2L3MQK7ln4K7j2M4q5
4053d3N1qjl5J2O7p1O4k1k3k6N5k6O%J6Ll5OJ3PJ8l5l4N1K7m1K4l2K8l4O1l4m3
4087c3PO0n0K6l5P3l8p4P5kl6J9O1k8j2m8K8j4J0m0J0N0pl0O2j6m1J5pL7l3K8
4119A7o0R7p5j2J0K8j1J4M5r3K7J5j4j0j0l1R0o2J2j9P0KQn2K7m3N5J4q5P5j6
4150A3l9MM0K3o1j0R4j06J7K9oNk4OL1m8M3L9q2nL5J9lk6qk1L3L7j2k5L1Ml1N2
4184D8l0l5K0j4K6Kn4K6J4M9p5K2oQ7p4j2pK5L9o5p3N8OK2k7jM4k6j3M7Ml6M5
4217C6j5M9n2n3N3n0pK3%rL6J0J9l2k5M9J8p5LN5M6r0j2M0n2N6l9j3Rl7O3j2L2
$$ plain form
3986 -28 -28 -50 9 0 -3 39 -7 -58 -1 16 40 -64 11 -8 -4 1 15 -3 9 -25 44 39 -11 13 -35 40 -13 4 -8 41 54 -37 -60
4019 -60 9 17 -42 -17 12 -3 13 -52 0 -3 11 16 33 -18 -31 -19 1 6 -4 33 -29 -46 10 -32 1 5 13 40 37 -17 10 -2 42 -43
4053 -43 8 0 -1 -36 -24 43 -28 36 15 -8 -34 21 -5 1 1 17 20 -15 -9 4 11 29 -6 -40 11 38 -3 21 -11 17 -17 44 10 -33
4087 -33 -26 34 -16 10 -25 48 10 -64 11 9 -27 -8 53 25 13 -35 -7 -21 -11 -51 -41 9 2 -28 34 18 -23 -8 -15 22 -11 17
4119 17 -43 54 -21 -33 -23 5 -6 8 53 -40 -13 2 -12 -22 -32 -63 27 -35 -23 -42 28 30 38 -14 13 -30 25 39 -46 29 13
4150 13 -26 -22 18 41 -20 -30 64 -42 -25 4 -2 3 -21 -15 16 -32 11 50 -32 -37 -2 17 14 -12 -20 -41 -8 29 17 -8 23 27 -4 48
4184 48 18 -17 3 -11 15 17 -37 -11 3 52 -23 -1 -7 80 6 -6 -13 12 51 -14 -87 -29 -23 -1 -28 -29 15 -11 -24 23 27 -9 36
4217 36 21 70 18 -35 18 -32 -39 -16 -16 -25 11 21 40 8 -17 32 50 -25 -22 33 79 -11 -23 17 -35 21 -18 -31 -22 -59 4 -8 24
4250B4j4J7o0O0K4p4K9j8M4n0J7K0n6P6p0NM8N2o2n6pM0O1n3M3k8n0M4j8K7j5
4281@J4m6pQ1p7Q4L0j27M1O0%k0j4%k1l0J9L0j9k1J6K0l5M6mJ7o1kM4l7O0mk6
4314A1Ro6J2L8N3r7N6j8K3O4j12LJ9K9k9K1qJ6M0o6L6j07R4l8M3q4O3nN8ko6K8
4346A8l3oJ4mJ5l8N2Pj0J5Jm4m9Q4k1P3n6k8l7J06k4K6p1K2l8J2m8Q6J4n0Ok9
4378c5l7P1K8o3L8pK0oj6K5jn0kk9K3L0P0r0N6J6l6npRj8J3%K6n0j2j9Q4ln4M
4413b7K1Lo3O8k4K5k0j5L0LmJ8j2rl1M7jO1o6mJ6j7K9p4L4J0Jk7lkJ3L4l8K5K6
4448B7q0M1K4L2k6J1o2N3j6l8P8k3J4n9M5j7m2j0LP2L3m8K5k0p3J06k2l9NM1m
4479C1n6Q7n4J2j1M3p5NK6k4N2Pj4m6m0Q4k7nK4m3k7N8Rlk1L2l8M9n8K0j6j8N7
$$ plain form
4250 24 10 27 -33 27 51 -23 6 -12 32 -18 -1 19 -37 39 -31 -26 22 74 12 -44 -51 -11 50 -3 40 12 -38 6 -12 15 0
4281 0 14 -32 -39 42 -35 49 79 -48 -7 53 53 33 19 19 -2 -32 -13 17 -2 -23 -7 13 -22 24 20 37 -24 -26 18 -19 41 37 11
4314 11 20 -46 -34 4 57 -40 16 -2 21 85 -27 -24 -5 24 -5 16 8 24 64 -2 34 -73 21 -17 26 -58 5 0 58 56 -10 18
4346 18 -15 -21 -7 -11 4 -34 18 25 15 30 31 -13 -62 22 1 74 18 -10 -47 59 35 61 -10 12 -26 -14 -62 24 38 -12 -6 -35
4378 -35 -72 -1 27 -36 2 -5 15 9 -7 18 17 -33 -35 -64 -41 -11 59 -31 25 41 5 0 -7 2 -16 -3 -3 23 -27 -39 -58 26 23 -31 -27
4413 -27 -6 -3 -66 2 -22 3 -17 -32 -2 1 -3 15 3 -6 -37 10 9 70 4 0 16 -1 28 -46 -12 -2 -1 -28 -31 -33 -20 14 -24 1 27
4448 27 -53 -12 12 44 18 29 -33 20 4 -34 44 21 35 -24 21 4 -38 -48 -45 27 60 12 37 17 -56 50 28 -11 -6 35 31
4479 31 -25 62 8 20 9 52 -23 -18 8 -16 36 43 29 -17 -57 27 0 -5 19 -24 -51 7 16 13 -8 24 -14 35 -23 -3 -19 -37 20
4512B0J3l8L4j5l5qK2kjl4L0RMj%%Qom4N7k9J0M1m1kojM1%rMqo5P5j8J4k9M0N0
4551H0m7k3jj3j6rR5j6n9qroJ1M4m9N0m5L1l0J0n0N3nk3J9OJ5L3n0M0m7M0l0L5
4585B6lrm0p2J29n4K7lrjk2J3L9l7k1Q1p3NO3J4m1l2M4lm1N3m5M4j9k8k1L0%L0
4619B4k7M4j1m4j5K3jj1J5k4J7J0J6J2o6MM1L4l6J3m7L2QL4j3j4L0n5jM4r3J22
4651F5o5j2M1l7k5N9K2l1j2J5m5J8J0k5oQk1K2M0n2O7K0m7lJ6m2Q9p0MJ2np0P3
4684A3k7l1K4KP9j04P7l8j6J5Kj5JJ7nqLm4O3j6r1J05m7K8M3o0N0l2L6n3lL4N4
4717E6o9qj8M3pk3l1N5L3Ok5j8l9L5qK1K6L2l4l5%l6P4j4o2j4K9K1NLL7j7k0J6
4751A4mj6j4PMl6N9j1k0mpM1o7N0k6N3JJ2nl2N9j22Q5%m4K9kJ3l5J2Mj2ML2l0
$$ plain form
4512 20 33 -5 29 14 -21 -29 -7 -9 -10 -44 -14 -5 -1 -2 -2 -2 6 0 -44 13 -16 -6 35 -6 -8 -14 -15 26 26 17 21 13 -52 23 5 19 -10 30 80
4551 80 33 10 9 -4 -20 -29 66 50 -9 -17 -26 -32 -21 23 -26 24 -21 10 -20 -10 -60 -7 -12 -35 -16 -10 5 38 -12 28 -19 21 -9 26
4585 26 23 14 -26 -98 31 -23 4 1 -8 -9 -31 -18 21 -16 -37 44 -29 -24 39 53 12 -20 24 21 -20 33 -12 32 13 -15 -36 -6 -6 24
4619 24 -3 41 30 -14 -29 -6 -7 -18 -3 -27 -10 0 16 28 -38 -34 7 41 5 18 -29 3 11 45 32 18 48 -7 -8 36 -57 65
4651 65 0 -12 29 -8 -33 26 48 17 5 20 -25 -7 3 -22 -28 -20 -41 -19 21 -31 36 56 9 6 22 -20 69 -1 3 15 10 -60 13
4684 13 -14 -45 -21 -19 60 -44 33 -5 -21 -6 -4 -19 -18 -1 -6 -14 -11 -55 8 -8 -99 6 -41 -13 30 -30 20 -12 24 -29 -32 2 56
4717 56 -13 -21 -39 4 -3 -26 -57 -2 31 37 12 -6 -45 -10 -18 3 29 61 27 -8 -8 -44 30 16 -46 -60 -31 -10 -5 -2 35 18 -2 14
4751 14 10 -6 -20 -13 -9 -45 14 3 -17 -21 -28 13 -54 -4 -30 23 24 36 31 -1 58 -64 21 21 -23 6 4 17 -18 -6 -2 -14 -10 22 -8
4786hK1j8l1Jl2R8j6k5j0O3k7o9K5J4M4q4K2K0nK3L5n5N9r0M3lj5nRN9Nj3n5L7
4820A7k2Pm0R7o1rJ6k2nJ6l5QRl2R1p9J0N4l1L7kJ0l0pK8l1N1m8K3j0j3k2K3o0
4854f2K4J17j00L0Ml0k1L6J8l7m7N2k7L9j0L9J7k5m0Q%Ol8K8K1JK1k5k9j5L2M2
4886B9qMn8QL0j5O2n8L1l3oj6R9r3N1k8K7m2M5J9n9J7qn9O8M8n3Rl1QRk5O0k7
4920Ej9K3k7nlN6m9Ll2opM7k7J9j5L8N6l3q7O0j6RJ4OqJ3l5K3j3p7J04j00Q5j0
4954hK0jk4K0no1P1J1j7J9l9Q1q1P2Pn1k8Rm5RK6kKkn6O9k1J9O2r5K1J4j2pK8
4989Em5M5l2qQ4j04L3nL3k9K0J5K4n2k7N3J2k7j9J8j9M6l6M6j8l4L7nl2Nqj8J4
5022b8NL1mrk4N1j7l3N6l1k1J6L1o7PK5K2m2LL4J5j6lkJ0j9Pl0Q5j04M1nLK5n8
$$ plain form
4786 -8 13 -5 -36 -35 -67 31 15 -10 -20 43 16 -53 -28 -14 30 -54 -32 -12 -17 6 41 -14 45 -45 -2 -5 -20 -25 -16 43 48 35 -20 17
4820 17 -5 2 -38 59 -2 -11 5 -17 -22 -6 -41 -33 -24 -56 35 -44 -34 20 -11 26 24 34 4 -3 25 -6 45 -3 20 10 -3 -25 -2 -62
4854 -62 -38 79 -21 9 13 -17 -38 -2 16 -21 -68 -16 -43 -4 -14 25 42 17 -23 -15 -15 -9 -47 -19 2 3 24 -1 -30 -45 -13 29
4886 29 21 25 -33 -25 5 -10 52 -6 25 -8 -14 -30 69 -24 27 -1 26 -16 29 48 -11 6 -2 -61 7 55 2 11 -20 -12 -3 -28 32 5
4920 5 -14 9 -18 -23 -26 30 -19 -16 -48 -54 -61 -14 -41 -22 -37 1 57 24 -63 -3 -19 -10 4 10 2 15 -20 3 -10 -87 17 -83 2 -8
4954 -8 12 11 -13 7 2 -59 12 23 6 25 -14 67 -14 58 65 14 -14 -5 -50 -41 -15 -17 -15 -17 -73 -4 -25 -6 56 -39 -18 -4 -16 -23 5
4989 5 -40 5 -27 -35 49 -55 -22 -27 6 -23 -3 12 36 -16 -43 10 22 -5 -24 -6 -25 21 -15 31 13 -21 16 11 -21 -16 -24 -42 -28
5022 -28 -23 8 4 -5 -29 22 5 -28 28 -3 -24 -8 23 -44 -37 -12 10 -32 -29 5 20 4 1 -1 9 -10 -3 -33 52 -52 -11 -16 -13 12 -46
5057d6N4JL6k8j9m3M2qN1j00N0j8L0L3lq8M2J1J4k9Qn9O5K4k8l9J07p3M4j2m8
5088b9O5k6kk2N2l2k1J8J4rk4K3J3k7M7Km1Kk1MJ4l7O2m6k3K6KJ8m7N3M2q8M1
5121CL5n4JkmK5K0q5Q5q7L8ON3k2n6M9nLK7n0MK8m1K3J1q2N2J2O6p8M4M3n1m3
5155c2L5j4j4J3K6Oo7N2n6O1k9Km2K1K8mM9p5j1M9K9m8K4j4k2K3l2P9l2kK2j4
5187A1o5K3O2rRn2J7rJ0jK5m7J00q2jL0l8j0J3L6p5O7plK5k0l3l0Q6rk5K2n%N
5222B0l8PPj5K5r5P7K6l2N1m8L1l5L7l1k2kl4Q8m7k1K0j1K7J9m1L7j3kj0O3k5
5254A3k0%l7M4J2pJ5j9j9Kk6m4N4m%j7L8k9L8qJ9J0k3kl0J5K7K9m2L2j0q1R0l
5288A7n5N3k0J6n2N5k2J4rmj0lj1MN0J5p4O3l3L1n4P4p0k3K9K9k6MJ5k8ON6j1
$$ plain form
5057 -46 8 9 45 17 -2 -45 -3 -11 40 -60 -10 -28 2 35 32 -56 -14 -3 11 -18 -10 -69 -4 20 -8 -47 60 -13 31 19 -29
5088 -29 36 10 8 -14 38 6 -15 3 17 8 -16 7 20 -7 40 42 1 3 -18 -14 0 -37 25 -21 -44 -18 -16 2 -45 8 50 -38 3
5121 3 38 -16 -15 -17 -21 4 24 -61 24 -63 -25 -19 34 12 -44 5 0 3 30 -20 -16 12 -29 -6 5 -77 -25 -13 53 -25 19 62 11 -32
5155 -32 3 -11 -25 -12 14 20 -47 5 -51 10 -19 -17 -59 -38 -10 -14 35 -40 -51 -2 27 -21 3 -11 -33 -10 -42 37 5 3 25 11
5187 11 -54 -31 31 22 31 -21 -4 -13 -3 -4 21 -26 74 -8 -9 21 -17 -27 -14 22 -53 14 7 4 29 9 -24 -54 32 23 -2 20 15 15 20
5222 20 -18 -11 -4 -19 6 -89 -12 14 -18 33 -15 16 -19 18 -13 -35 -37 -71 17 -30 -51 -31 -42 -15 4 -37 0 -13 -15 -25 38 13
5254 13 -7 -7 -44 0 12 5 20 1 -18 -16 -42 -86 -32 -36 -36 -53 -15 -44 -6 -14 5 15 -8 -10 -40 -25 2 31 -11 21 11 -70 20 17
5288 17 -38 15 -5 11 -41 14 -8 6 -3 -7 -17 -20 -31 -27 23 38 -36 27 -6 25 -29 45 -25 -48 -19 10 -16 -12 3 -25 -19 37 26
5321B6p3k9j3J46j10N4N4n5k6M3o0pL7k5j9Q7m1J3N0kn4lM3r0Q4Om7k2O1k5J2
5352A5po1P6l1k0J7k3O0Nk1k5K4J0k3Lm1N0rj7K3L0j9nn5K9K0l6j4O2rl7J5JO
5386gJ1k4kLL8Ol6O2l1n2O6j04Q7qrk3L9k2ok7M4K3o0M0mNj4l0N1r9M3N6Mk9K1
5421A2M3m7o2O4q3M9M4m3L1J5o4j7N7KMKk2K7k5K0o3R5k3Rn2J7K5l8J9l4J6l2
5453e4N8qL8o9K1k2L1pN0j14Q7Qm6K9j5om0J9L4Jm6L4j7N3j3j2M2p7J21q5l9J6
5485b8J5OJk8K1k8M6k9k1L3qj5K9mLpm0M7j4L6j4j6l8J2P2J3q4L1J8k0L7m0LL9
5519B8q9J2J2L8j4j3L0m6K4l6J01m5n0O1l6J3k1J5J1L8m6j9L7K4oj4l2M6p3L4
5549a6M9Qo6j9MN1k8L9k7Kl6L4N1p4j7N6JP9j56N0nL5k2j0J2M2k8l9J9K6l6L3
$$ plain form
5321 26 -47 -76 -89 57 -53 1 55 0 -26 17 -43 -50 -13 -38 -57 30 -11 2 52 50 -4 -7 36 -54 30 36 -11 -33 28 3 15
5352 15 8 -53 23 -8 -28 -11 -34 26 31 10 -15 9 19 -4 -1 -42 8 -1 -18 5 35 16 11 -44 -15 5 -31 -45 17 8 -29 -14 -13 -7
5386 -7 4 -20 -22 -19 19 25 -11 51 20 -32 34 -70 17 9 0 -23 16 -6 -12 -39 5 28 -32 8 4 9 -5 -35 16 -83 -40 16 20 -9 12
5421 12 55 8 -54 10 -73 -24 20 -23 8 23 -41 -58 -1 1 5 7 -15 12 -13 7 -56 39 16 25 -27 -10 15 -23 -4 -38 -22 -54
5453 -54 4 -4 34 -35 -14 -36 -5 -12 38 -76 11 19 -27 2 -13 -19 -59 -40 -6 -5 -51 -17 -34 19 6 -6 36 -41 80 -5 -44 -28
5485 -28 -13 -7 -6 -34 -13 -41 5 -24 -45 -12 -20 -35 -6 -10 -7 -14 -54 -7 -21 15 1 -15 -53 -41 31 44 -40 -9 9 -11 26 -14 -11 28
5519 28 -61 -49 -37 1 -13 -26 4 -42 -18 -54 47 2 -48 13 -23 -10 -31 -16 -5 33 -13 -32 5 29 23 9 -23 23 -50 -16
5549 -16 33 41 -25 -44 -40 11 -17 22 -5 -3 -39 -5 46 -28 -45 11 12 91 -65 -15 -20 15 -7 -17 -5 37 9 -30 -11 15 -21 12
5581A2j1k8LL1Kjjn7J15p3L2j7j4J1k8K2L6kp6O5k6j7K6l6L7L8l0k1m1L6M4n7
5613b6j5J2O7o4J8j4LL5o9M3K9p6N1m3N9o0L4J9L0q7K5M9l8j8O8n7J8KNk7J1P
5645ij5Pj1N7l8pQrM6lk0K2n5J1Mk8Q3j5j2m2K1k9L4K3m4k3M0o0P2P1p6k6LM3
5679B3k4J0Pk5O4m5n5N4K3r2N1L6l5k8M2Ln6M0J0l8O1Nn5j7K8MJ0J4k6M8Lm1k2
5712b3q%M5p7O1m4N4Lk4J9l9%M1p0M4l5J08l8j1k8P2n6O7k8m9JRJ0k0jK3l4Ol
5746b5j0O0l8J3m5O1pj3m0MM0L6j4lm6M0l7Q9n7mJ3m0pL6J8l5L5k1K4n2j1M5n5
5779d6L2K6J8l1m6R7l1k8M0k5n2L3J6k2PNpL1oj6m9NJ7K6k5M2J7m2k0R5l2k0n5
5812d6qJ13j19M1L6j3K3n0M9k5L9n4J4J3n5N7l7J4M6p4N7m9M1o1N3J9k4JL7o7
$$ plain form
5581 12 1 -27 -24 7 9 8 7 -50 65 -8 24 7 -7 4 -24 -2 34 32 -44 21 -5 -22 4 -32 5 43 13 -8 -49 -13 31 -26
5613 -26 -41 -29 38 -26 -8 -22 -19 16 -53 -10 19 -57 -6 -49 10 -50 -16 3 33 -54 -29 20 -18 -36 32 -25 -7 -5 0 -27 -16 -9
5645 -9 -24 -17 -28 29 -9 -16 -8 -17 29 26 6 28 -27 -16 -12 -40 43 28 16 -26 -5 -34 0 23 -21 -44 -4 -64 8 79 3 -23 -20 23
5679 23 -1 9 16 -9 55 10 -45 9 32 -60 -9 27 -8 -36 6 9 -47 -7 3 -35 26 31 -24 -41 -13 -9 1 15 -11 37 40 -1 -23
5712 -23 -31 -31 14 -63 -2 -46 8 11 -13 6 -33 -33 8 -62 -18 -53 55 17 6 -22 50 -6 61 33 -16 -15 -6 4 -16 -17 6 -28 -22 -25
5746 -25 -35 25 -13 0 -45 16 9 -4 -44 -40 0 36 22 19 -27 13 -24 65 8 4 17 -23 -30 6 24 -11 24 3 27 -25 -36 9 -46
5779 -46 -14 12 30 -1 -47 50 19 -9 31 6 -46 -13 3 -19 -12 -7 -14 17 11 -5 -54 -49 -32 -6 -31 11 28 -14 -34 61 29 9 -46
5812 -46 -54 59 -60 -19 17 4 27 -23 26 1 40 -14 0 13 -42 15 -22 -8 38 -36 21 -28 13 -48 5 24 0 1 38 -29
5842b9M6q2O8omJl9M8m7M1J6j4n5K3N6r7J38n4l6N8q9N0K8n1K2n8N5K2j8k9RK6
5874aRl1jl7P0j9MMm1P7j3k9J6JJ2K9o2MqkJ9o1L3Ok6J28q8K1oK4l7j1L0Pl9K6
5910Hp1L9N2n6KM4j5l5J3j5k2O3K2rjn4L2rk0J9N1q4O2qK5k3j2Qj6NOkk9L1K7
5945B8o4mM7m8L0L4k7J3nl7OK6J3j9lM6m3JM5j5n2L2p5N0L0p8L3M7m9mJ4j1M8
5978Ik6K9Jol1LJ08m3p3mK2nQ4n8m8J2N0o8K8k2jO3n0NJJ0lL3J4n0L7j7m7L4q
6013a7K0rK6k3rQJ0M2l7j4jjK3K3n9KP1j6n9O3l9o2N6j7J9M1n2mL7L9o2%m5K8
6047a8J8n2JM1j3Rk9O4l3Rn1L6LO1J0l4J7On5j9R6p7j2K3J0j3NJK0o0J5K2M3j6
6081B8m8lM6k2J1J6n8RM5q9J14nq2K9L4J8RkJq1J5K3j8P5j11K3j7N9nk3J5%Ro7
$$ plain form
5842 -29 17 -65 3 -3 -7 -6 -45 3 -44 -3 13 -1 -56 -33 23 -74 64 10 -26 32 -57 -7 21 -30 -8 -66 -11 11 -7 -36 -27 -1
5874 -1 8 -23 -24 -61 9 -10 -6 -2 -43 34 21 -8 8 9 21 50 -12 -8 -16 -18 1 -60 -27 -21 -47 81 -7 14 8 32 -5 -16 14 21 -18 8
5910 8 -63 -24 28 -28 -26 18 3 -32 -19 -34 -56 7 29 20 19 -35 -3 -12 -32 -13 38 -46 16 8 33 10 -2 6 -10 -5 1 -1 -30 1 28
5945 28 -36 -40 7 -41 -11 23 -4 9 4 -33 -27 -1 12 -7 -10 36 -7 -6 39 24 -28 4 -71 -21 9 -69 -36 11 -38 -42 -28 -39 9
5978 9 -17 12 13 7 -24 -21 87 44 -29 -33 -11 -16 68 10 -38 -26 24 -44 -16 -38 -39 24 -26 -21 -20 -10 -13 20 34 -16 21 4 -43 -9 -17
6013 -17 3 -6 20 -3 -12 -4 6 48 11 -3 -4 -5 18 41 -18 -16 55 39 -20 43 4 -58 -2 -19 0 41 -11 -15 22 61 -1 -1 -46 -18
6047 -18 0 -52 -51 -10 -23 -14 -43 21 -12 -3 -54 -18 -15 46 56 22 39 45 -10 -29 67 -10 -22 1 11 -2 3 4 24 -36 -21 1 44 28
6081 28 -20 -23 23 1 12 28 -30 -21 24 -65 49 44 -38 -9 25 43 52 50 51 -30 -15 8 -10 65 -46 -23 -40 19 14 -9 6 6 15 -52
6115e2N6k0l5J5J1j4M1%J6M8j08L5j3N1o7j9J7K2j2j9M3j6j2J0k3M4J6l1K0L0
6145C4k5j9kN6k7K3p8L7l6L3L4n8k7M6j6P7p4M2p5Q6o4L1mj7J1K8k9J5No8N1j1
6177b1N8n0K7RJ6p1L1Jm7P9K9k5k8Qk9n3N6Oql1R4j2q8L5k8OJ4J1kM3l7M6j7m0
6211a8J4J1J7j4j4oJ5m3L5J5m9N3Kl8L4m0L8K5n0Lk3Olk2N7L1o1j2k4N2K5j3l2
6244b9RK1k6N6Qk3Ml8oNK7l6k5M7rk0L3M4m8K8k8k1O6j5j3J4k7RL4m3M8l5PNJ4
6279C7k8kMn5J2O8rn1m5K5N0k3KJ9o2O0nJ9J7l1mN3j1q4L3L2q5R2kk1n1L6J00
6312I0r3J1l8P0j3k4J0p5L9K2pl1N1l4L0k6PL8n3N2n4M2k7N4o5L7J0pNk9j5j7
6344d0M0j2jL7Kqj0M1m3m0NRK8NL1o9J0P0m9j9J1K3m2M7m3K6k9L8l1J6j5lM8o5
$$ plain form
6115 -52 4 -16 -51 -36 -25 -39 2 2 18 66 -42 -7 -20 31 -36 -55 -38 -16 -28 -47 -4 -20 -32 -22 -45 -1 15 -16 4 34
6145 34 9 -10 -12 44 17 40 -38 -1 -37 -4 30 -28 -55 -9 -25 52 -22 20 -55 31 -33 -2 -6 -23 -12 16 -13 2 7 -61 -10 -21
6177 -21 37 -13 14 23 39 -32 -1 0 -47 32 61 36 8 16 -13 -66 -10 -4 -12 -43 51 39 -49 -14 -42 -36 -22 -11 -13 30 -7 39 22 -18
6211 -18 -4 7 24 10 -4 -10 5 -38 -3 12 -37 16 18 -20 14 -26 12 37 -13 -10 -33 -27 -30 -52 5 36 -25 -37 -61 -9 16 3 -29
6244 -29 -20 1 -25 31 39 16 20 -18 -24 -19 8 -28 -53 -6 -15 -35 -2 42 -6 22 -6 -27 39 24 11 25 -2 7 41 -2 46 11 18 23 37
6279 37 9 7 11 -44 -32 36 27 -24 -69 -44 6 -17 -15 4 -58 2 -3 16 33 2 -2 51 40 -44 -11 21 -64 28 26 5 -46 -10 90
6312 90 -3 8 -30 40 27 3 13 -62 -23 -1 -8 -39 12 -22 8 -18 -11 27 -26 26 -28 14 -13 41 -24 13 23 16 21 -8 -23 -40
6344 -40 0 -12 -13 24 26 18 8 49 6 -34 -29 -20 8 13 44 -25 -15 55 6 -13 -2 21 -21 26 -17 9 -20 18 -13 3 -12 -15 33 -32
6378c2P7p8N5l0J3lm9Q5qm6N4m1Ol5K6K7q4Q7l8JPl0PK4mM4k4j5K4J0o2M8Po8
6412d5O1j1j7j8k1JM5K4l2L3pr1Q6j8K9J0j3m0P4o6N8j6j06M0R5j5rk2Mm9N1l6
6444b1j7OP8l1o6N3j2j5J7n5Q0m8RN5n0M2lo2J8K3M8l2l9L8p3K0mQ4k7k3K3j1
6476Ej1K9Kl7j8O7m3k5P8m1K5l5j7l1N6l2Ok7LO8J3o2K6N2m0pm5L7Pm3j3N0j1
6509a4L1k2N3m7nj3n4Q1%n7O3JJ8om0M8o5L4l9mR2k9J8l6jn9L7J0k8N1k9J7J6
6542B2l0k0P3r4L3K2l3L2n1Q2k0j3K5o1Kj6O4mm4M2k0J6k0Kk2M2l4K6k2J8Pln5
6575e4J1O7q2Q6K6l6n5oP2l4k6l7M9L5l8J5N9j23M0j4Q5q1J4L9j4j9J0j1kP2j03
6606e5P9o0M1n2O9mmMrm7P2o3J6KQMmJ6j0n9JN7j8R6n8K2o7lM1r8J19k0Op6O9
$$ plain form
6378 -32 45 -33 22 -8 5 2 -47 38 30 -16 38 -3 3 -32 -6 21 -63 24 -14 -13 -6 -36 -29 -5 -9 35 11 -4 20 30 -32 16 23 -45
6412 -45 16 5 -12 -30 -51 -50 -5 19 -13 20 13 -78 8 -10 19 29 16 -24 50 -16 42 26 -80 -40 55 40 31 9 13 -36 15 -21
6444 -21 -38 -32 46 15 -51 2 -10 -25 -8 -63 17 -31 -22 33 -17 25 22 -40 -22 1 49 17 -22 16 -57 -37 -41 43 16 -7 16 5
6476 5 -6 23 25 -12 -30 37 -6 -31 47 6 31 -4 -21 -52 4 -28 -22 -49 -46 22 35 -27 -1 51 11 4 -41 -4 3 -40 -53 -3 -14
6509 -14 17 -5 48 1 -4 -17 -71 10 10 -47 16 17 35 29 -11 37 -28 6 -33 -37 55 26 44 8 7 -52 -15 -5 -33 18 -11 6 22
6542 22 -8 -28 45 -49 -16 6 -27 5 -46 36 16 3 28 -33 -31 -47 17 13 -31 11 -9 7 -13 -11 -33 9 -25 1 -21 -3 4 1 -54
6575 -54 -43 24 -58 28 54 18 -37 -43 29 -5 -31 -68 -19 16 -22 -7 52 -71 -31 -45 40 -41 -27 12 -2 -21 -11 -22 -24 48 -55
6606 -55 24 -36 5 -47 22 18 14 18 9 -38 34 -29 -13 -11 -3 1 -3 13 3 -56 -55 2 -16 80 22 44 -23 -26 15 -83 36 16 22 -54 15
6641A5lL1l8K2nno5M9L7r4O0K0k7J5l8MJ3j8j5N4J0oK6k8L7m6jj6J4k5L7n0M8
6674A2j1m1J3K6J2m3pkQ2k9k8K4J2oL0l7K2l2j8N8P2j39J6n2M4J1L8m6J6L5n8
6705b6K9N0l7o7K3L7n0N2m2pN2m3P0o4J8M7n3Pj8M3K5m1k3J0J4K3j1k8lK2m5O1
6737B5K3q7O7n4KL5Mk2m1Q6n5L3k7q1J32j5l1j7N7p7N4J4k0Jj5Jo3J15k3K2m7
6768dl9N1j1J0n0Q5p5J7j3oO2l3JK1o5L9L8k1m7K5lL8qn3O6l8O1q0ML7pl9P5o9
6802c1M5Lm4L4jn3M2L3o5P4Ro0l9M4lM5Jo3M9k1mj5K6Lj9j6K0n5L0K7j3J0QJ4
6836A5L3j2m2N0p2L3n0K9M0mrpm7N5qk4Oj1J2m0R6j7j4M0l4m4l1O6j1K4j1NoJ6
6870B6l9q4J10J4ql5M3Rl3J3Nl4JK6J4k6LN4p0L0Lko7N3l4k6P7k3k8k4N6RJ5n6
$$ plain form
6641 15 12 43 5 27 22 17 -48 1 38 -56 4 24 -3 12 -26 -22 -9 -27 -42 12 22 16 42 14 51 5 4 -12 2 -23 14 -36 12
6674 12 1 -40 -27 -1 11 -32 -39 -41 41 12 -16 8 20 14 44 7 29 -3 -21 37 109 -30 -14 -66 -22 -11 27 -19 -3 32 -26
6705 -26 3 53 16 -51 -28 9 -41 11 -31 -38 14 -29 41 -23 -5 42 -11 -4 -22 21 46 5 -18 -8 6 29 18 -10 -13 9 -36 25
6737 25 48 -39 28 -26 -24 11 15 -7 -48 38 -17 16 -11 -92 40 25 -6 -23 34 -43 11 25 5 6 -9 -8 -71 44 21 43 -4
6768 -4 -43 8 -3 7 -43 42 -33 -16 -29 -35 27 -6 -5 16 -49 -10 28 7 -40 -15 -18 20 12 -41 25 -13 48 -32 -28 9 2 -37 38 -31
6802 -31 14 17 -27 7 6 -47 -5 28 -37 37 46 -14 -53 -9 -12 33 34 -29 20 -1 -5 -20 6 9 -10 -26 -6 -61 -31 -4 -17 -7 1 15
6836 15 48 36 -6 44 -28 5 -45 -16 24 20 11 4 -43 12 4 -20 -14 -25 -13 -53 43 26 12 52 18 -26 -57 9 -2 22 11 16 10 26
6870 26 -13 -97 13 27 19 -16 27 36 3 16 21 -13 -12 14 28 2 5 59 -11 19 22 20 -47 6 -28 -54 23 0 -28 -52 4 13 28 -28
6904b8k4P7k8m1j3M2J7j2K7J7ok2J9Pm3L9m1QK3Qq0K3O7l7K9rj1J6qm3O8Jr6K4
6938c0M9L6k1J0o8P8k6j9k5JoO1op0Q6k2p4%L3L5l9m2L4N6kk0LJ4m2K6mprJ4j4
6973a0K0Jk4K3j7m0k4R3mj8Pj4OK6No0K8%l2P5l2m5M7LJ4Rn8j3K4j4M3k1K2Nj1
7008A4n8O2Qj07O5m0M8J0j5O6m7k2K1m2M1OKL4m8j3M3j1l9j5N1OOm0M8o4Kk7M7
7041hL1l0OJK0k1k3N0p4P6K0l2%n0M6k9J9l4L4K9m2jj4P5n3n6Q9Nj7Ol5Nl1K5
7075a3qlQ6j6m7J7j5q4O7j7MO5l9kj3J7kk4M3K9o8K5j2n6R2k9j9mN0k8m3N8N7
7108F8J1j48J9R3q8J5M6Pm2M1j3m2N6m5OnL0k2K1j2L9Kl3m1N1j3J7m2K8PK4K6
7140F1k8p4P3MJ8m2lj6J3k5M8j1K6No2QN6m9k0J1J9l4L7o3K5O9o8k1k8P3j4M3
$$ plain form
6904 -28 -52 25 -3 -44 -57 -15 2 -10 17 34 28 6 25 32 -11 28 -13 -5 18 26 -54 -31 36 -1 28 19 8 24 16 -27 41 42 -54 -30
6938 -30 19 55 34 44 -24 54 28 9 -16 -15 -21 40 34 -36 50 28 -46 -46 -13 22 -17 -59 -25 31 29 9 12 26 -16 10 6 -1 -10 4 -10
6973 -10 10 11 -13 10 -7 -47 -71 22 18 0 7 -7 -1 25 30 -30 -2 -2 -34 41 9 -36 11 14 28 37 -21 -34 -10 -24 19 -2 20 25 14
7008 14 -44 18 26 -81 -16 -56 -8 2 -13 53 6 -16 5 -37 4 10 12 46 -2 -15 28 17 -22 -37 14 20 26 -14 34 -30 -28 -55 -8
7041 -8 23 -7 -1 0 20 -1 -24 26 -48 28 48 16 16 -34 12 -17 2 -32 2 31 -11 -12 -26 49 -4 -60 29 34 17 23 -12 -7 -38 -13
7075 -13 -21 -24 62 46 -1 16 1 -83 -16 -33 -29 36 -3 -5 -18 -1 -3 -27 16 45 -23 2 -10 -66 26 -3 -22 -26 24 -4 -47 11 68
7108 68 79 -69 -50 43 -45 -30 16 23 -19 22 9 -33 23 -22 -16 -21 9 -13 8 -4 35 37 4 -37 14 1 18 -24 4 11 35 61
7140 61 33 -41 32 36 54 12 9 -7 6 -19 29 18 44 49 -13 -5 51 2 -18 -7 12 -22 15 -48 -23 46 -22 -43 -71 2 -12 31
7172C1l3n8Q3q0J27j06K7k5O0ln0l1M8L0j3k3NNk7J4j5O2j8rk7O9p4M2m2P5m9
7203ek7L3nL0l9n1L8PJ9l9L9L1j2k0L0l7l8P0m7Rk1N0k3MM2m5M6q9Q0n7k7M8K5
7236A9l9jK7K1qm8J5qJ1M0m5L0Ol1n%Nj3K8m3K5J5K6N6p0j2k1Pl8P5j0k0l7N1
7270Hj4L7ok8J9j5M3p6M5K8l8ooK2k6o4Q3M9o3kN6j1k2q1J22r5M1O2k0n4L7m3
7302a8J8K5k7K6m5Kj8l2P4m9L0l2M8j2J5M3o0J8k5j2N3m0Opj3O9p3J0J3k7RK8
7334cL8m3LJ4o1j0L7m2O4K2J6k3l0PLJ2K2q3M6N7j24L7k1L7O0m3j6M5l1n5RN0
7366fL4o5M0ok2Q0p3pk8N3l1N6k1K6k2lJ3mj7l1j3j9P7Lk5%J1OrK2kj2M2q0K1
7401a2K8j6K0m1L5k1Jk1mK6L1qj1M6r1K7J1l8L2Pn4L2M3K6j08NJ06q4OK5Nn2N8
$$ plain form
7172 31 -2 -60 23 -57 70 -36 -9 -34 26 23 -27 -58 -10 20 7 -16 -11 -6 -33 -19 -34 28 10 1 -26 43 -31 11 -31 44 -5
7203 -5 -32 1 -4 26 -13 -64 -26 -19 0 -39 0 31 19 -1 29 -8 -46 24 -23 -14 -35 15 -8 -4 38 -7 39 -50 30 -27 -54 -6 19
7236 19 -20 -21 6 27 19 -29 -14 -22 -11 29 -16 14 20 -11 -16 -16 -11 -24 4 -39 -14 1 27 83 13 1 -20 -13 -51 24 14 -6 -43 8
7270 8 -6 31 25 -3 16 1 44 -32 13 41 3 -3 -9 13 -13 -77 6 55 -8 -10 46 35 13 -68 54 -41 0 62 42 -12 25 -18
7302 -18 0 25 -2 24 -21 -19 -37 -69 5 -44 -14 -46 2 -10 5 48 -12 6 -19 -31 22 -18 -12 -19 -32 37 -36 -26 -13 -40 -31 -3
7334 -3 35 -8 -5 9 -52 -62 -25 -67 -3 19 35 12 -18 -11 -8 4 26 -57 -11 46 -78 -41 -62 -25 35 -8 -24 21 -10 -65 -56 -6
7366 -6 28 -37 3 -3 -25 55 -18 -25 -53 0 -31 25 4 30 8 5 18 14 -3 -34 -47 -66 11 14 -11 -11 0 6 -3 19 17 5 47 -33 -12
7401 -12 16 0 20 -21 14 -7 -6 -27 -31 -5 26 18 7 53 -38 -11 0 -38 -6 1 -53 -21 22 48 -60 -55 51 -33 -27 -2 3 -49 9
7434Il6O2j7j0k2j4MO0o9L8K6J6m1K0k9m3P3Kk7Kj1n0O2M2m8m5L2j3Ok2J3K1l8
7467d7lN7jj9k6L0Rj1J6l5J5k5O0l7j3L4n9L4J6n0L2N7Pj9K8k4k2pj6J5l1OnK4
7501a0j4j3jk7L2PL3nJ1o7O9qJ3n6P0m5j9M0k7N7o7N2l1N3j7p3N0k0J4J0mk5L1
7534A3n7N4M4Kp4j1JL8Nn1M1Mk8L1l5K6L6k4Nl8OKl4K6L0l6J6kM4J9p7N8J1o9
7568b4nK3k8K1K9mm1J5J9mp2N9m7N0J4k9JJ2o0K2O3n7KM6K2l5k8K9Mkn5P6l5J4
7602elJ6Qm9M0L1o8L3J8l2L3rl6K8K4n4L1m4mQ6q2MK9J6n3qL1M4l2K2J2o0Q7o7
7636a3J6qL7p1N6n8L7no0N9N8n2QL4q1O3o2Q2p4M0L0l1pj5NnM0nn6nP5l4J6Jl6
7671b1P3o7m8J02m8L1n9P9k1o1N4l2L7rJ3M1n4n1L6l0P9m6k9J5LM0q0P1j6N6n4
$$ plain form
7434 9 -27 35 18 8 -14 -28 -24 36 -33 5 31 47 6 26 -3 -46 27 29 2 4 -7 -57 5 47 -1 -46 -14 -27 -21 -43 -30 -9 -47
7467 -47 -50 7 6 -13 -39 -9 0 -11 5 -30 -15 -40 20 -17 -30 4 -55 -21 -5 -55 -23 34 41 22 50 26 4 -3 -19 -4 -35 -29 -34 -10
7501 -10 -24 -37 -38 -65 -33 -26 7 2 13 -54 15 7 20 -36 34 -11 -30 10 -17 40 -27 25 -6 47 30 -43 7 -13 1 11 7 -18 13
7534 13 -44 10 54 56 -18 -29 -28 10 15 -36 5 9 -19 12 -23 3 39 15 20 -18 -12 -10 -44 -18 12 -24 -8 -10 34 53 -24 34 45 -24
7568 -24 -29 -6 -34 -13 16 12 -29 -14 5 1 -71 -12 -59 -9 5 -24 -23 -11 -71 -49 14 -43 -41 5 27 -8 -36 -7 -3 -5 -60 16 -19 -5
7602 -5 -8 8 16 -33 7 38 -30 3 21 -11 22 13 -23 5 29 -25 6 -38 -42 44 -38 -34 -5 11 -42 -50 -19 25 -7 15 27 -33 54 -13
7636 -13 3 -5 32 -39 17 -41 -4 -9 -69 -10 48 -4 4 38 -43 20 -42 40 -34 6 36 5 -2 -17 -12 -17 23 18 -38 -43 32 -2 14 15 -21
7671 -21 52 -15 -63 39 -9 22 -37 42 21 -40 14 -18 19 10 23 64 10 -41 -5 -35 44 -2 -31 -16 -13 27 -53 18 2 58 4
7702Dj7qk4J5N6k0J2o3M0j4K0%k3j7j3K0oL9j5J4QJ8k8Lnj1M5%n8O0j05M5N2K
7736B6jl6j4J5j7K6j0nK9m2Q1j01P1j9JpJ1m6M7j7L1j0m2K4J7JJ8m2L9qo3L1j6
7769b8J0kK2K3l2J1nN7n6L2j1n3L8j6L1l5L2j0j8J3j0k9O6j00Q6l5l9K1L6M9k1
7800B7l5OK4l3Oj2M8q9Q5mj3l8J0L1j3n5M1J7m1OL4k6jk8O0k3PM4m4j8O4o2%M1
7834A6%k3K3q2Q6l1j7N4j8nN7j09J6L0qJ2j7k1M2Jj6J2J2k8J0J8L2p0kJ9j5K2
7866@k6O2m1K6k1j4Q%K5l5J8k1k6l0O9l2mN7Jj00N3pk9J8K9NK3l8N6j4J1kj5R
7900A5m1M6l6LKj6L2k6L1n0O8J5p7J2j1N7o6l2j7J06j9nN5j14O3P4n8j5J6Rk4
7931ck0P1L1l0l9J2m9P2J6m2l8J1RM1m0mJ9k2L0k5m5O3M6n6K3rm1oP1n2K3k5l2
$$ plain form
7702 4 -13 -21 -45 -30 26 6 18 -45 -5 -19 1 1 -22 -39 -52 -32 -38 1 -14 0 8 26 -2 1 -4 -15 30 30 -28 32 -73 -28 24 26
7736 26 25 -11 -25 -10 -27 -1 -11 -16 13 -29 52 -49 22 3 4 -3 8 -38 9 -8 23 13 -29 -5 12 13 31 -11 28 20 -43 -12 -28
7769 -28 -18 -20 2 25 -7 4 -1 56 0 32 21 -32 6 -10 21 -14 18 8 -10 3 -7 -36 30 -70 16 -19 -58 -37 -1 48 27
7800 27 -8 -2 22 -11 -5 -17 31 -58 27 23 10 -28 -18 13 0 -55 -14 3 -38 -32 2 -24 -25 -53 7 -16 -9 35 -9 -27 37 -25 -25 16
7834 16 16 -7 16 -66 20 -11 -28 26 8 3 60 -49 -33 -3 -11 1 -16 -37 5 6 -10 2 14 -14 -4 14 46 -24 -26 -7 -22 0
7866 0 -26 36 -5 21 0 -14 -6 -6 19 -16 2 -19 -45 -75 -6 -38 -42 15 16 -84 -31 -38 -67 -49 -20 -15 8 -30 26 12 23 21 6 15
7900 15 -26 20 -16 -13 -11 -27 5 -21 10 -40 28 43 -34 -22 -33 24 -42 -74 -91 15 -4 -9 46 -68 -5 69 11 -4 12 21 -3
7931 -3 -23 48 79 49 10 22 -27 45 61 19 -19 -8 1 42 2 -2 17 -5 25 0 -45 18 64 8 31 22 -19 -25 46 -6 17 -8 -40
$$ [...]
8191A7
##END NTUPLES=NMR FID
##END=
