##TITLE=1H_NV100
 CDCl3
 8 sc, 
 19.12.2023
##JCAMPDX= 6.0         $$ Bruker NMR JCAMP-DX V2.0
##DATA TYPE= NMR FID
##DATA CLASS= NTUPLES
##ORIGIN= UXNMR, Bruker Analytische Messtechnik GmbH
##OWNER= root
$$ XWIN-NMR		Version 3.5
$$ Tue Dec 19 14:03:13 2023 Russian Standard Time (UT+4h)  she@DPX200
##.OBSERVE FREQUENCY= 200.1313
##.OBSERVE NUCLEUS= ^1H
##.DELAY= (6, 6)
##.ACQUISITION MODE= SIMULTANEOUS
##.ACQUISITION SCHEME= undefined
##.AVERAGES= 8
##.DIGITISER RES= 18
##SPECTROMETER/DATA SYSTEM= spect
##.PULSE SEQUENCE= zg30
##.SOLVENT NAME= CDCl3
##.SHIFT REFERENCE= (INTERNAL, CDCl3, 0, 15.7039)
##AUDIT TRAIL= $$ (NUMBER, WHEN, WHO, WHERE, WHAT)
$$ ##TITLE= Audit trail, XWIN-NMR		Version 3.5
$$ ##JCAMPDX= 5.01
$$ ##ORIGIN= Bruker BioSpin GmbH
$$ ##OWNER= she
$$ F:/spectra/data/she/nmr/H-F/1/audita.txt
$$ ##AUDIT TRAIL=  $$ (NUMBER, WHEN, WHO, WHERE, WHAT)
(   1,<2023-12-19 14:01:38.46 +0400>,<she>,<DPX200>,
      <created by zg, POWCHK disabled, PULCHK disabled
       configuration hash MD5:
       00 E9 B6 7A A2 85 ED C7 34 08 36 98 17 FE 4E 26
       data hash MD5: 16K
       D3 75 94 1C 56 5F 57 74 CA 0E 1B 70 62 8B 33 23>)
$$ ##END=
$$ 
$$ hash MD5
$$ AA 81 D8 3A 62 E7 2C 90 CE AA CB D8 CC C3 90 80
##$RELAX= 
##$RELAX= 
##$RELAX= 
##$RELAX= 
##$RELAX= 
##$RELAX= 
$$ Bruker specific parameters
$$ --------------------------
##$DU= <F:/spectra>
##$EXPNO= 1
##$NAME= <H-F>
##$PROCNO= 1
##$TYPE= <nmr>
##$USER= <she>
##$AMP= (0..31)
100 100 100 100 100 100 100 100 100 100 100 100 100 100 100 100 100 100 
100 100 100 100 100 100 100 100 100 100 100 100 100 100 
##$AQSEQ= 0
##$AQ_mod= 1
##$AUNM= <au_zg>
##$AUTOPOS= <>
##$BF1= 200.13
##$BF2= 200.13
##$BF3= 200.13
##$BF4= 200.13
##$BF5= 200.13
##$BF6= 200.13
##$BF7= 200.13
##$BF8= 200.13
##$BYTORDA= 1
##$CFDGTYP= 0
##$CFRGTYP= 5
##$CHEMSTR= <none>
##$CNST= (0..31)
1 1 145 1 1 1 1 1 1 1 1 1 1 1 1 1 1 1 1 1 1 1 1 1 1 1 1 1 1 1 1 1 
##$CPDPRG= <>
##$CPDPRG1= <>
##$CPDPRG2= <>
##$CPDPRG3= <>
##$CPDPRG4= <mlev>
##$CPDPRG5= <mlev>
##$CPDPRG6= <mlev>
##$CPDPRG7= <mlev>
##$CPDPRG8= <mlev>
##$CPDPRGB= <>
##$CPDPRGT= <>
##$D= (0..31)
0 1.2 0 0 0 0 0 0 0 0.06 0 0.03 0 0 0 0 0.0002 0 0 0 0 0 0 0 0 0 0 0 0 
0 0 0 
##$DATE= 1702980097
##$DBL= (0..7)
120 120 120 120 120 120 120 120 
##$DBP= (0..7)
150 150 150 150 150 150 150 150 
##$DBP07= 0
##$DBPNAM0= <>
##$DBPNAM1= <>
##$DBPNAM2= <>
##$DBPNAM3= <>
##$DBPNAM4= <>
##$DBPNAM5= <>
##$DBPNAM6= <>
##$DBPNAM7= <>
##$DBPOAL= (0..7)
0.5 0.5 0.5 0.5 0.5 0.5 0.5 0.5 
##$DBPOFFS= (0..7)
0 0 0 0 0 0 0 0 
##$DE= 6
##$DECBNUC= <off>
##$DECIM= 32
##$DECNUC= <off>
##$DECSTAT= 4
##$DIGMOD= 1
##$DIGTYP= 9
##$DL= (0..7)
0 120 120 120 120 120 120 120 
##$DP= (0..7)
150 150 150 150 150 150 150 150 
##$DP07= 0
##$DPNAME0= <>
##$DPNAME1= <>
##$DPNAME2= <>
##$DPNAME3= <>
##$DPNAME4= <>
##$DPNAME5= <>
##$DPNAME6= <>
##$DPNAME7= <>
##$DPOAL= (0..7)
0.5 0.5 0.5 0.5 0.5 0.5 0.5 0.5 
##$DPOFFS= (0..7)
0 0 0 0 0 0 0 0 
##$DQDMODE= 0
##$DR= 18
##$DS= 0
##$DSLIST= <SSSSSSSSSSSSSSS>
$$ [...]
##$SUBNAM2= <"">
##$SUBNAM3= <"">
##$SUBNAM4= <"">
##$SUBNAM5= <"">
##$SUBNAM6= <"">
##$SUBNAM7= <"">
##$SUBNAM8= <"">
##$SUBNAM9= <"">
##$SW= 18.0517328524113
##$SWIBOX= (0..15)
0 0 2 0 0 0 0 0 0 0 0 0 0 0 0 0 
##$SW_h= 3612.71676300578
##$TD= 16384
##$TD0= 1
##$TE= 0
##$TE2= 300
##$TE3= 300
##$TEG= 300
##$TL= (0..7)
0 120 120 120 120 120 120 120 
##$TP= (0..7)
150 150 150 150 150 150 150 150 
##$TP07= 0
##$TPNAME0= <>
##$TPNAME1= <>
##$TPNAME2= <>
##$TPNAME3= <>
##$TPNAME4= <>
##$TPNAME5= <>
##$TPNAME6= <>
##$TPNAME7= <>
##$TPOAL= (0..7)
0.5 0.5 0.5 0.5 0.5 0.5 0.5 0.5 
##$TPOFFS= (0..7)
0 0 0 0 0 0 0 0 
##$TUNHIN= 0
##$TUNHOUT= 0
##$TUNXOUT= 0
##$USERA1= <user>
##$USERA2= <user>
##$USERA3= <user>
##$USERA4= <user>
##$USERA5= <user>
##$V9= 5
##$VALIST= <valist>
##$VCLIST= <CCCCCCCCCCCCCCC>
##$VD= 0
##$VDLIST= <DDDDDDDDDDDDDDD>
##$VPLIST= <PPPPPPPPPPPPPPP>
##$VTLIST= <TTTTTTTTTTTTTTT>
##$WBST= 1024
##$WBSW= 4
##$XGAIN= (0..3)
0 0 0 0 
##$XL= 0
##$YL= 0
##$YMAX_a= 360533
##$YMIN_a= -392048
##$ZGOPTNS= <>
##$ZL1= 120
##$ZL2= 120
##$ZL3= 120
##$ZL4= 120
##$ABSF1= 10
##$ABSF2= 0
##$ABSG= 5
##$ABSL= 3
##$ALPHA= 0
##$AQORDER= 0
##$ASSFAC= 0
##$ASSFACI= 0
##$ASSFACX= 0
##$ASSWID= 0
##$AUNMP= <proc_1d>
##$AZFE= 0.1
##$AZFW= 0.1
##$BCFW= 1
##$BC_mod= 2
##$BYTORDP= 1
##$COROFFS= 0
##$CY= 11.3945322036743
##$DATMOD= 1
##$DC= 2
##$DFILT= <>
##$DTYPP= 0
##$F1P= 15.7292609196834
##$F2P= 12.9074282941183
##$FCOR= 0.5
##$FTSIZE= 0
##$FT_mod= 4
##$GAMMA= 1
##$GB= 0.15
##$INTBC= 1
##$INTSCL= 1
##$ISEN= 128
##$LB= 0.24
##$LEV0= 0
##$LPBIN= 0
##$MAXI= 10000
##$MC2= 0
##$MEAN= 0
##$ME_mod= 0
##$MI= 1.114404
##$NCOEF= 0
##$NC_proc= 0
##$NLEV= 6
##$NOISF1= 3.799351
##$NOISF2= 2.8
##$NSP= 1
##$NTH_PI= 0
##$NZP= 0
##$OFFSET= 15.70392
##$PC= 1
##$PHC0= -24749.89
##$PHC1= 10.85272
##$PH_mod= 1
##$PKNL= yes
##$PPARMOD= 0
##$PSCAL= 0
##$PSIGN= 0
##$REVERSE= no
##$SF= 200.130013532006
##$SI= 16384
##$SIGF1= 3
##$SIGF2= 2
##$SINO= 400
##$SIOLD= 16384
##$SREGLST= <1H.CDCl3>
##$SSB= 0
##$STSI= 0
##$STSR= 0
##$SW_p= 3612.71676300578
##$SYMM= 0
##$S_DEV= 0
##$TDeff= 0
##$TDoff= 0
##$TI= <>
##$TILT= no
##$TM1= 0
##$TM2= 0
##$TOPLEV= 0
##$USERP1= <user>
##$USERP2= <user>
##$USERP3= <user>
##$USERP4= <user>
##$USERP5= <user>
##$WDW= 1
##$XDIM= 8192
##$YMAX_p= 0
##$YMIN_p= 0
$$ End of Bruker specific parameters
$$ ---------------------------------
##NTUPLES= NMR FID
##VAR_NAME=  TIME,          FID/REAL,        FID/IMAG
##SYMBOL=    X,             R,               I
##VAR_TYPE=  INDEPENDENT,   DEPENDENT,       DEPENDENT
##VAR_FORM=  AFFN,          ASDF,            ASDF
##VAR_DIM=   8192,          8192,            8192
##UNITS=     SECONDS,       ARBITRARY UNITS, ARBITRARY UNITS
##FACTOR=    0.0002768,     1,               1
##FIRST=     0,             0,               0
##LAST=      2.2672688,     0,               0
##MIN=       0,             -392048,         0
##MAX=       2.2672688,     360533,          0
$$ Real data points
##PAGE= N=1
##DATA TABLE= (X++(R..R)), XYDATA
0@%%%%%%%%%%%%%%%%%jOj1J4j6J6j7K2k9L3l8M5n3O1p1Q2r0J02j18J35j52J72
39I2j93K17k42K67k97L31l69M09m53N00n51O06o67P34q08Q89r76J076j185J305
59F85j442J594j765J957k166K385k584K645k130j208L5435L27127l39891l78850
73c58208M28671K18681m19482q4857L85108n8339k88845J65948J75630k49334
83h5027m2095K84248p8202k83036J86517K41558k62094j79045L07698J00250l15318
94a24546k4497K90220m7396k36841J04686J71459j44236j00860J59872L4139j57678
105g5678K2748J42066o0436j16859Q0412Q6712q3022n7969P1747L1225n2276r477
117b0807K9062p887m887K2606j7280l6428L6513N0442n1823o3784O3504P5672
$$ plain form
0 0 0 0 0 0 0 0 0 0 0 0 0 0 0 0 0 0 0 -1 5 -6 8 -8 8 -9 13 -16 17 -21 24 -29 32 -39 43 -47 55 -63 72 -80 92
39 92 -101 116 -126 141 -156 175 -194 215 -238 262 -289 317 -350 384 -424 465 -511 565 -620 685
59 685 -757 837 -928 1029 -1137 1248 -1336 1309 -821 -2029 33406 360533 20642 -358208
73 -358208 70463 289144 -130338 -215195 169913 111574 -177271 -11323 164307 -85027
83 -85027 -127122 157126 78924 -204112 -17595 223963 -38131 -217176 90522 190772 -124546
94 -124546 -149043 141177 93781 -143060 -38374 133085 -11151 -112011 47861 82000 -75678
105 -75678 -52930 89136 28700 -88159 -7747 78965 -4057 -62026 9721 40946 -11330 -20807
117 -20807 8255 368 -4519 18087 807 -35621 892 51334 -489 -64273 -769 74903
129G4903p1779q4470P7187Q9956p8089r0977P3169Q5838o3784p6733M8538O3775
141D7534k8422m8635O125L4170J7672k2402m1182J4191O2683q879p8345P435Q6411
154D8356r421q6658J3973Q0201j8549o8993J9420N1865j7762l2029J3971J3276
166G650q031J829Q60j1102P105J5450j3587j4644J7655R988j7759j720J5335q549
180D80j3121J7050J0077k3616p309K7915N770l0920p161L2248J1807l1710j7784
193b6274L1205K5333l0469l2683K9832L8789k9035m2737K7294M3484k3668m0906
205b9835J7387L4829r205k7349j794J9425J4965j1885k8545O629M1327l575n1807
218b9433L552N8927n543o1547Q845N9126j2935n2749J5838M2609j7227k9893J6365
$$ plain form
129 74903 3124 -81346 -4159 85797 7708 -83269 -10100 75738 11954 -64779 -16241 47534
141 47534 19112 -29523 -23398 10772 28444 6042 -35140 -20949 41734 32855 -45490 -38055 48356
154 48356 38935 -47723 -33750 46451 27902 -41091 -21671 30194 12432 -19597 -5626 7650
166 7650 -381 1448 2308 -8794 -1689 13761 174 -14470 3185 13173 -4586 -6306 9029 480
180 480 -12641 4409 14486 -9130 -16439 11476 17246 -13674 -20835 11413 23220 -8490 -26274
193 -26274 4931 30264 -205 -32888 -3056 35733 6698 -36039 -8745 34739 11071 -29835
205 -29835 -12448 22381 13176 -14173 -15967 3458 18423 6538 -22007 -15378 25949 22374 -29433
218 -29433 -25881 33046 27503 -34044 -25199 33927 20992 -31757 -15919 26690 9463 -20430 -4065
231d065J5962j3232k978Q075p943q59J6064o610j9544J5038J9353k2636j5784
244a9159K7630Q397l0610J287L1643j1549l0414K0280K6220k8056k0688L3704
256H685J4731l5990q747L5333L567l1109J206K4395m272j5451N460N120m613N966
270D281J119j7520L570K7828r295l5639J5864L9849k3028m1104K9419L9391l3005
283A730l4106L4521K6102l2914j6886K8406P414k1111R02J1411p302p73J0796
296H190j0368j1766K0291J0066k7881n614L2736l65l4451P254L3368j3103k9275
309b0918J8137K2874k1441j5792K2489Q328k1590j996J8524l200j4165O345Q741
322F336p494l458P329r26n181N135K051q263J331J0459m263j1384P138J1774j0004
$$ plain form
231 -4065 11897 -1335 -4313 3762 -4181 -5040 11024 4414 -15130 -92 19261 -3375 -19159
244 -19159 8471 16868 -13742 -12455 19188 7639 -22775 -2495 23725 -4331 -25019 8685
256 8685 23416 -12574 -21321 14012 17579 -13530 -12324 12071 7799 -7652 -2192 2928 -1685 4281
270 4281 5400 -12120 -8550 19278 9983 -25656 -9792 30057 7029 -34075 -4656 34735 1730
283 1730 -32376 2145 28247 -4667 -21553 6853 14267 -6844 -5942 5469 -1833 -2606 8190
296 8190 -2178 -13944 6347 16413 -11468 -17082 15654 15289 -19162 -11908 21460 8357 -20918
309 -20918 -2781 20093 -1348 -17140 5349 13677 -7913 -9909 8615 5415 -8750 -2405 6336
322 6336 -1158 -4616 2713 1787 -3394 1741 3792 -4471 -3140 7319 3056 -8328 -1190 10584 580
337E80j2235J1402J2060j2329j1825J2657J1109j2495j0353J2307R469j1441q310
350i404J0345P215q412n435O274L825m164k693J667J962J005j738m066J231O344
365C956j422p972K080R547k481j0572K982J1152l097j1410L339J1658l097j1674
379g011K941J1486l371j1699L524J1303m165j0348M977Q767n879o287O548L046
393C832o353J170N568n161l365Q959j25j1939M607J3365r569j3119J4126J0342
407A2338j8428n920K1052J08k1398O233J9625j2176j5177J7001R038j9889j489
420i082K0426n629j7787J1880J2519j6982n909J8955j795j7876R364J4083j6120
433c953q220K0461J135k1894O312K0700j2552j6567J7289J0990j9369m764J8525
$$ plain form
337 580 -11655 -253 11807 -522 -12347 310 11419 -1076 -11429 878 10347 -1094 -9404
350 -9404 941 8156 -256 -5691 583 4408 244 -2449 -782 1180 2185 447 -3619 -2388 3956
365 3956 2534 -5438 -3358 6189 3708 -6864 -3882 7270 4173 -7237 -3898 7760 4663 -7011
379 -7011 -4070 7416 4045 -7654 -4130 7173 3008 -7340 -2363 6404 525 -5762 786 3832
393 3832 -2521 -1351 4217 -944 -4309 4650 4525 -7414 -2807 10558 989 -12130 1996 12338
407 12338 -6090 -12010 9042 9150 -12248 -6015 13610 1434 -13743 3258 12296 -7593 -9082
420 -9082 11344 5715 -12072 -192 12327 -4655 -10564 8391 6596 -11280 -1916 12167 -3953
433 -3953 -12173 8288 9423 -12471 -6159 14541 1989 -14578 2711 13701 -5668 -10432 8093
446H093j366j5065O511R687r941m110J0655j939r176P516O484j1442l161J3111
460E857l86j2719L808J1112n889q237O743M928o142k096M262o71k080K314J06
475I10k491J620J428l167k09L676m30k793J430J421j701J15J340j452k93K055
491A459j082k235K266J367l164m09K895r94j990K730P21l909Q19M034k123l164
507b779L960K218m678p81M338r43l469K411J949l556l22L802j621l407L302J914
523B338m919k61N972j067n610K775M602m242k944N068J143m731Q08L573k797k172
539b464M048M10m554J075M099k656k899L708J642m147l81L916j33k898J034K062
555A862j662j721J266J445p84q70N01L55r31m72J267N98j752m29K300J2k227Q52
$$ plain form
446 8093 6727 -8338 -1827 7860 -2081 -6191 4464 2525 -6651 865 7349 -4093 -7254 5857
460 5857 5471 -7248 -3440 7672 1783 -6454 289 5217 -925 -3021 1241 570 -1510 804 910
475 910 -1581 39 1467 -1700 -1909 1767 1337 -1456 -26 1395 -306 -191 1149 -303 -596 1459
491 1459 377 -1858 408 1775 -1389 -1798 1097 103 -1887 843 1564 -2345 -1526 2508 385 -2779
507 -2779 1181 3399 -1279 -2060 2278 1335 -2134 277 2226 -1330 -1652 2150 529 -2878 424 2338
523 2338 -2581 -2842 3130 2063 -3547 -772 3830 -412 -3356 1712 2855 -1876 -1068 2505 -292 -2464
539 -2464 1584 1994 -2560 -1485 2614 -42 -2941 767 2409 -1738 -2119 1797 1664 -1234 -200 1862
555 1862 200 -1521 -255 1190 406 -464 37 392 -539 -1011 256 854 -898 -1327 973 985 -1242 -390
573c90K411j768k332K613J803l138p51L676p96m119J911L635k890k603L542J094
589A898m135O80M088k100l257L495K126m125l77M521j459m175K667K873l813q79
605a972M419j108m401K420K923l571j062M354p84m076K751K994l898j351M728
620B366n37m389K289L302l537j534M143q51m495K778L779m279k254N249K1n699
636c648K088N429l578l896N070J832n902M00N852k362m959M356L080n829r27O440
652C446j650o592L550N638m951l567O121J461o626O84O081k406m488M074K797
667C572n227r34N469r05n285K379M270l771l041M668J695n147n12M893p24l856
683b456K208K964l133j835L584M02l452J255L166k514k760L115J826l600r27L411
$$ plain form
573 -390 2021 253 -2079 534 2337 -801 -1552 2124 1328 -2791 -880 2755 -135 -2738 804 1898
589 1898 -2237 -1557 2531 431 -2826 669 2795 -1330 -1707 2814 1355 -2820 -153 2720 -1093 -1972
605 -1972 2447 1339 -3062 -642 2281 -1290 -2352 2002 1218 -2858 -107 2887 -1011 -2362 2366
620 2366 1829 -2560 -271 3031 -506 -2040 2103 1252 -3243 -465 3314 -965 -3219 2030 2051 -3648
636 -3648 -1560 3869 291 -3605 1465 3297 -2605 -2205 3647 1285 -3674 682 3762 -2067 -2994 3446
652 3446 1796 -4796 -1246 4392 -559 -4126 1995 3456 -3170 -2486 3595 1189 -3299 775 3572
667 3572 -1655 -2589 2880 1975 -3310 -931 3339 -432 -3473 1195 2890 -2257 -2769 2124 1400 -2456
683 -2456 -248 2716 -417 -2252 1332 1734 -1718 -463 2703 189 -2571 544 2370 -1230 -2157 1254
699A254r7l011J002K494j310j708J501N32j527N35J739p96j311J041N59j630k59
716i92J958M6j866n4J265j44q55M19N92m52m94L96L69P3R3J1l62l51L69O58j88
737D91p79K9N78l43q79O49J090q60j107R51Q22p88l52Q53k02o26P38N22r59M4
757a28J115p80j258J058J154j408q61J180M28r83N7O57k85k90L41j37nO84L3r03
777c31J80Q38m88n35O11J82q52Q5O27m70l51Q94o5j292K90J354n25r32R84O44
797H48j072k48J082o6p36M81K30j090R1J320m76j201O11P38q92o22R70N72k91
816B49m10l25L62P96l54q53Q82R74j480j096J821M03j843L55J509j286r99K100
834H05J42k698P31K881j824k417L279J915l959r81M064k08m020J541L553k706
$$ plain form
699 1254 1157 -1854 -852 1642 332 -1376 125 657 -870 -335 1404 608 -703 338 897 -733 -992
716 -992 966 1012 -854 -908 357 213 -642 -223 369 -83 -577 -181 188 261 354 365 3 -348 21 679 491
737 491 -288 -259 319 -24 -903 -254 836 -24 -1131 -180 642 -146 -498 355 153 -473 265 787 -172 -128
757 -128 987 207 -1051 7 1161 -247 -1108 72 500 -483 -426 231 -54 -344 -3 -140 -145 539 572 -331
777 -331 -151 687 199 -336 275 457 -395 -310 317 -153 -504 390 325 -967 -677 677 152 -780 204 848
797 848 -224 -472 610 544 -192 289 519 -571 -480 840 364 -837 -226 512 -380 -1002 -32 540 249
816 249 -161 -486 -124 672 318 -535 347 1321 -159 -1255 566 969 -874 -519 990 -296 -1295 805
834 805 947 -1751 -1020 1861 37 -2380 899 2814 -1145 -2126 1938 1730 -2290 -749 2804 98
850I8k519L505J066m330L93M134j886l693L490K911m221j901M570O32m472R87
866a236L992j852l071K521J634l024l30L029r40k883J994K265k686j688L035P95
882A555l037NL165l71k533O55J795j040j089J258N32j127n5Q88q11o49J149M40
900G30j510r5J549j38j496N53J332o27r50P48M61o74J37O34p51m13J001L0j304
919g83L38J463q97j574J096J406j361q11J767K97j792M22J590j177r53J968M29
936A428k618L33K712j302k812K019K347k666j739L190P94l340K80K981j182k342
952a917K386J463k937m44L370p11l444J817L127k693k497L365J397l898n68L699
968A515l53l167J539K410k295j483K826M58k954P44K914j636k520K454J836l027
$$ plain form
850 98 -2421 1084 2150 -2180 -1787 2347 461 -3232 258 3169 -1052 -2953 1617 2249 -2223 -1236
866 -1236 2756 904 -2167 354 1988 -1036 -1366 1663 723 -2160 -166 2099 -587 -2275 760 1555
882 1555 -1482 -1477 1688 1317 -1216 -561 1234 194 -895 363 895 -232 -287 601 -210 -859 290 730
900 730 -780 -875 674 536 -960 -407 925 298 -652 96 557 -117 20 654 -97 -510 491 521 -783
919 -783 -445 1018 121 -1453 -357 1049 -312 -1123 644 941 -851 -429 1161 -16 -969 999 1428
936 1428 -1190 -857 1855 553 -2259 -240 2107 -559 -2298 892 1686 -1654 -1374 1607 425 -1917
952 -1917 469 1932 -1005 -1449 1921 1210 -2234 -417 2710 17 -2480 885 2282 -1616 -2184 1515
968 1515 1162 -2005 -466 1944 -351 -1834 992 1450 -1504 -760 2154 518 -2002 452 2288 -739
984g39j271K913M21k704M54K325j091j831J482J002j657L9J745p08j534J406J121
1001A373j733q08J886L19j699R7J364l80j133L67M25k83P2L33l97j23O23m7p23
1020d67K74P81l87m44M30K91m25q5J13l69Q9O63o08o93J027O30j429o49J694M62
1040H98j663K76J630o50j291Q72P81j178j01J348o00j515J171J303j837j002K136
1057E78N60k313R3K334m33k242R15J725j082r36J359M26j421MJ189n40j128J119
1075B07P40j400o05J466M05j541k62J308K11r87k1J078K3q80j59P51Q8n47J08
1094a7M89m71n14O29K72r16q9J186l01j376P79J480j124j310J332J226j522o56
1112i03J721K32j642L7J273n47q49R33N33j313k13J160j28j190O14J142q36r23
$$ plain form
984 -739 -2010 903 1324 -1380 -926 1399 308 -1523 -41 961 -696 -657 1088 380 -1154 252 1373
1001 1373 -360 -1168 718 1037 -662 -565 799 419 -714 -347 78 -205 -133 200 -197 -320 303 256 -467
1020 -467 -193 588 201 -243 187 478 53 -32 81 -288 -199 464 -144 -837 190 820 -609 -1258 436 898
1040 898 -765 -489 1141 491 -800 72 853 -325 -426 922 322 -1193 -22 1281 -556 -1558 578
1057 578 1138 -1175 -1082 1252 819 -1423 -508 1217 135 -801 558 984 -437 -433 756 216 -912 207
1075 207 947 -453 -1058 408 813 -728 -990 318 529 -458 -479 599 622 -258 -417 334 422 -125 -17
1094 -17 472 1 -513 116 388 -528 -617 569 268 -1108 -329 1151 27 -1283 49 1275 -247 -903
1112 -903 818 1050 -592 -555 718 171 -678 255 788 -525 -738 422 294 -896 -282 860 24 -899
1130h99J006P80r44n27Q52K94p41m4N87l5m69M2kpQ3j9n2P5r2j62K72K04m10N6
1154a52N90k05o62N70P30r22o39R84M18j159r8J201k77j354N19J210p63p86J015
1173B20N57j231k05J408j46j322O09J113r99r47J466N04j673k30J592l51j440
1190a075Q91J146j153r11J222M54j074J71J106m69r05O27N50o13k10O48m6q61
1208e02K77P10l85o31L30L28l78j28M87K15l20j72J21J5J41jo7K10K0k94j86L60
1230A50n7l83K18K27m43J0N48j62p65M68O15n24l23Q72J96r87j16R29j20p10L67
1251A0O22p39m81O95J71p45P5P68m43o23P01Q30j014n93J007M94j132l5J253k45
1271E76j189K93R74p66n07R70J60j217J84J189o61j015J108Q93j485n02J773J90
$$ plain form
1130 -899 107 887 -57 -584 268 562 -179 -223 364 329 -140 -98 -100 -107 -24 -43 -95 -20 -112 -274 -2 202 -208 -152
1154 -152 438 233 -429 141 871 -51 -690 294 712 -447 -545 656 379 -975 -456 754 -9 -795 220
1173 220 777 -454 -659 749 603 -719 -110 1003 4 -943 523 1027 -646 -876 716 365 -1075
1190 -1075 -184 962 -191 -1102 120 574 -500 -329 777 308 -597 30 580 -33 -243 405 359 -502
1208 -502 -225 485 100 -531 -201 127 -251 -379 108 323 3 -169 -48 -33 108 107 40 250 270 -24 -210 150
1230 150 93 -290 -72 155 -288 -278 270 108 -657 -189 426 -98 -421 451 647 -340 -456 473 353 -357 10
1251 10 632 -107 -588 107 278 -467 -392 376 -67 -690 11 841 -173 -766 241 735 -397 -432 821 576
1271 576 -613 -320 654 -112 -619 351 511 -706 -522 667 6 -1009 99 992 -493 -995 778 968
1289I68j671J07J585m56j540J027J096j137q01J180J07j258L56J307p40j135J020
1306A5P97j328k99J459R8j289J60J110l61q56N01N05o35k81N18J42m10j11L28
1325F3j20k48J54M55j14o44J15Q07m8r26L16R99m85j079O72J050q80r49Q54O40
1345F32j002k98J114n8j181M78J040q88o78J408M51j789KJ933l33k053R10J802
1363A490j486j467J722J024j863n73J862k27j636Q55J430j220j011J618L69j726
1379h39K59J886o35j784R61J259j230r23J431M15j457J0J240n12q65Q61M27j085
1397e81k4J299k47j108O38Q46r16n81R02L35o50q8L05k29k1K70l13k51N13J81
1417B80q15J91R03l03p50M25N79m30k60O26j01o41K25L17m25k03P45p9q87K44
$$ plain form
1289 968 -703 -596 989 533 -1007 20 1116 -21 -822 358 465 -793 -437 870 130 -1005 15
1306 15 812 -516 -815 644 742 -547 -387 723 362 -494 7 512 -123 -404 114 256 -154 -265 63
1325 63 -57 -305 -151 304 190 -454 -339 468 420 -506 -190 809 324 -755 -83 967 87 -862 -8 632
1345 632 -370 -668 446 388 -793 -315 725 -163 -841 567 1018 -771 -769 1164 831 -1222 -312 1490
1363 1490 4 -1463 259 1283 -580 -1153 709 482 -1154 -299 1131 -89 -1100 518 887 -839
1379 -839 -580 1306 671 -1113 -152 1107 -123 -1046 385 800 -657 -647 593 81 -784 77 504 -581
1397 -581 -605 694 447 -661 -23 823 -93 -674 228 563 -87 -175 130 -99 -120 150 -163 -414 99 280
1417 280 -535 -344 559 256 -494 -69 510 80 -180 446 345 -296 -71 246 -179 -382 363 284 -603 -359
1437c59Q70n58p02P60N33p36k57R12j4p91K82N41n76k93P69J18r54J36P78m41
1457A8o43M98N68m57l48M46J06m20J55K52j55m7M32k66l85M51K01o13k41P17Q3
1478C52p20J60N70l76n17M72J86m02K28N07m98l07O68N8q87K78J029n77r85Q32
1498G1P08j131m57J234J37j292L71J166o65j043R96P80j260k84J416p8j464O14
1516a81J181r74q54J182M63j416%J389n79j276R80R56j312n31J635J96j758K91
1534f08J700o44j545J146J216j416q46J437K93j413J87J239o52r20R16M73j093
1551e30nJ131l84r63P82Q36j023m31J174Qj193K43J055n15q63P23N03q92k48P44
1571A52l9m57L50K64n43J02M61l86j94P16Oq78L53Q50p36p57J103L25j336K4J323
$$ plain form
1437 -359 511 -47 -749 11 544 -192 -449 463 449 -342 -60 481 -95 -388 381 499 -455 -319 459 18
1457 18 -625 -127 441 -16 -364 82 188 -232 -77 175 20 -27 405 139 -246 205 406 -207 -448 269 352
1478 352 -368 -208 362 -14 -531 -59 127 -275 -47 460 -38 -345 323 381 -506 -228 801 224 -761 71
1498 71 779 -352 -809 425 562 -730 -359 807 142 -901 95 875 -385 -669 747 669 -795 -181
1516 -181 1000 26 -828 354 817 -599 -599 790 211 -1065 -85 871 -441 -972 663 859 -899 -608
1534 -608 1092 448 -1097 49 1265 -151 -997 440 733 -680 -493 746 94 -826 90 563 -530
1551 -530 -535 596 212 -751 31 867 -156 -587 587 595 -598 -355 700 185 -678 45 548 -344 -592 152
1571 152 113 -344 6 270 -273 -171 290 -96 -290 426 432 -446 -93 757 21 -736 367 692 -644 -620 703
1592G03m58j089Q82N78j203p2J394l99j108R79Q59j579l86J840k76j852R44J703
1610A460j555j430K022Q41k335j70K310n24k038J252J595j712r65K021J61k009
1626a076P48J761j402j279J846M90k231M13K171j110j930J665J383k166o18K308
1642I73m2k211P85J905j269j205J468N52j723K46J515q16j009J185L17j482K51
1659e60J512q26j309J407Q42j677k33J725l53j532P73J432j149p97J260J67j309
1676f27K85R57o82n28R16Mj070N02R52q68o78J278L29j419J88J314n67j131Q26
1695a9Q89j053l80J035l6r42K66O36n47l12P73j67o80M56O53q87k84J155L0j180
1715e94L14J192q04q88J028N19j171j41J093k27r53M91N91q31o3Q95k01p94N73
$$ plain form
1592 703 245 -844 38 616 -587 -659 735 336 -772 207 1066 -513 -899 941 665 -1187 -243 1460
1610 1460 -95 -1525 497 1338 -997 -1167 1143 619 -1419 -167 1428 -284 -1249 772 933 -1076
1626 -1076 -328 1433 31 -1248 598 1088 -1143 -730 1441 331 -1599 66 1449 -717 -1335 973
1642 973 931 -1280 -495 1410 141 -1064 404 956 -767 -521 994 178 -831 354 671 -811 -560
1659 -560 952 126 -1183 224 1066 -611 -844 881 528 -1004 -231 1201 52 -745 515 682 -627
1676 -627 -342 615 -67 -595 321 325 -745 -243 709 -159 -837 441 770 -649 -461 853 286 -845 -19
1695 -19 870 -183 -563 472 436 -506 -240 396 -151 -463 310 143 -537 -81 572 -315 -599 556 586 -594
1715 -594 -280 912 108 -780 248 767 -404 -545 548 321 -632 -141 450 -381 -444 451 250 -544 29
1734B9O28r57l06J233p5j203M22J104p11j040J065N83j231k76J207k4j044K80
1752c16Q41o74m61R13J71p55K11O43o41m92R84J38r71R1R21m84q18P91N49r43
1772c02k78Q17L7o58L01N34m45l55M56K1l22L68J69m92m8M54k09l92L79M10p33
1793b88j96P30J9o71K19N88n18l10O38J48n87J78M35m26l14P23J01q11J05P37
1813E00m78o44P05M54q73l40J025O2r24K70Q70m84p28O46N36p43k36P57j08q14
1833e47L26P01m62n21N98K74q87J8R78j54q99M47P31o01n63Q21M02r69j17Q33
1853D09n8p39K67O75o79m57O45K52n82k0P00l37o39N25M29m79k25O33mo47J88
1874a43O79m27n23N29J79n23J7N07j73m20K06K12k83M0L66j73k26K99M3m06J75
$$ plain form
1734 29 657 -300 -606 627 552 -651 -229 875 164 -876 189 772 -459 -735 472 448 -596 -316
1752 -316 525 -149 -610 303 474 -281 -70 573 -68 -560 424 562 -409 -318 603 119 -699 92 641 -302
1772 -302 -580 237 274 -384 -83 451 6 -349 107 128 -194 174 343 -149 -197 257 48 -344 35 445 -288
1793 -288 -484 246 265 -406 -187 401 -117 -427 211 359 -228 -50 385 -41 -355 368 469 -342 -237 500
1813 500 22 -622 83 537 -336 -676 349 411 -513 -243 627 143 -585 61 597 -146 -382 375 267 -547
1833 -547 -221 480 18 -503 95 369 -518 -500 478 324 -575 -128 603 2 -561 260 662 -307 -424 409
1853 409 351 -388 -121 554 -125 -582 63 315 -267 -287 413 76 -563 -38 391 -88 -313 320 316 -331 -143
1874 -143 536 109 -414 115 294 -229 -212 295 122 -298 -92 120 -163 -123 243 70 -156 143 186 -220 -45
1895d5L70k74k79L45J16m15P0L70k51l53M01J33l86K6M18k20m19M80L18n54q3
1916b32O20j37o50L56N13m43l99N42J79o69J2O10k43m44L98K28m57M8N01j88m10
1937b65L80J67m17J02M24k84m16L56K88n75MM94k21m12L16L03m84l9N91j38n50
1958c76M60L73o80j58Q89k24q65M72Q91q78o06J065K95j345L2J461n29j209R01
1977c1R66j245o16J606K9j565O16J331j028j102J500N68j864j5J985o67j817J275
1995g4J368j724q60J993L03k071L35K034r78j604J396J131j779m67J920j51j776
2012a004P18J469j394j011J677M71j825K60J683p68j495J395R26j586l62J703
2028H57j26j621O84J217r82r78J174M97j186k8J212n24r52P30N70q78j76R80k07
$$ plain form
1895 -45 325 51 -228 117 233 -182 -112 258 7 -346 55 188 -198 -172 246 26 -393 87 405 -149 -232
1916 -232 388 251 -399 -43 470 27 -372 170 349 -320 -308 302 59 -385 13 241 -216 -168 333 145 -265
1937 -265 115 282 -135 -33 391 107 -309 47 335 -240 -236 258 37 -375 -59 244 -240 -279 312 174 -376
1958 -376 84 457 -223 -381 508 284 -581 -109 782 -96 -702 363 658 -687 -655 806 277 -932 -31
1977 -31 935 -310 -926 680 709 -856 -240 1091 63 -1039 461 1029 -835 -850 1135 468 -1349 -74
1995 -74 1294 -430 -1290 703 1006 -1065 -730 1304 326 -1278 118 1249 -530 -997 923 772 -1004
2012 -1004 -286 1183 -211 -1222 455 926 -899 -639 1044 276 -1219 176 1102 -484 -846 857
2028 857 731 -890 -206 1011 29 -949 225 722 -464 -492 720 196 -756 -26 544 -334 -510 470 263
2047B63p61M92O24p56l14Q16Q5q68K88P27n09n65N40K64o00o5O17j44m57L48K20
2068B45l98nL52n8k96K70J76m39nL82j28l94L32K36l85j36M06m5l68J82K78k29
2090b7o8K18r5n1J02j6j99J99K27l72j36M22n5m38J10M90l47l21M30K27n65oN54
2113B83j88m17M77K56o28P3N44l17o06O55M94r30j83R73j64j078N33R29q04p18
2133h16J183K88j238J32J171m30j027Q39O95j015l55J137j61j038N07Q29r15n29
2151g43J219O0j284L37J282q21j042J116Q33j273m07J320j6j216L24J037o05p46
2169f25P41L16p34n6P24k95n58N13L98o52m5O48j67o73M29N97n01l98N23K20o10
2190b05n2M62K6m87P3L49j55j76N6J35m7Mm8L2J70j3k45jM12j25l82J42L72j82
$$ plain form
2047 263 -498 -6 618 -138 -452 364 449 -419 -131 596 87 -478 62 326 -274 -339 278 134 -323 25 245
2068 245 -153 -158 194 136 -160 110 286 -153 -158 224 96 -298 34 270 -115 -251 155 110 -258 -76 202 -27
2090 -27 -95 123 28 -23 79 63 -136 63 290 -82 -218 204 149 -289 -179 311 -36 -357 73 300 -265 -271 283
2113 283 95 -322 155 411 -217 -144 400 83 -523 132 626 -304 -487 486 322 -756 -223 706 -98 -816
2133 -816 367 655 -583 -451 720 290 -737 102 797 -218 -573 564 403 -635 -128 701 -214 -743
2151 -743 476 536 -748 -411 871 50 -992 124 957 -316 -723 597 581 -635 -311 726 121 -625
2169 -625 116 432 -302 -358 366 71 -487 26 424 -228 -273 375 208 -465 -36 561 60 -338 185 405 -205
2190 -205 -257 205 231 -256 -183 166 11 -165 -109 26 -21 -17 -65 -33 137 124 -121 -122 290 165 -217 -75 297 115
2214A15l83J82K63k58j32J96J01j03J1%m5J25J01k70j4L51M3m77k2N18r3n29J19
2237b01N32k30m36K22L81l69k57L75K02k63j53J64J10o1J7K5r1J23Nk59N7L17
2259B10j58l52J56M21k74l00L03L45l88k75L93K24l17j74K91R3j55j62J04J46
2279A31m3j13j01J00J53j58j77J66L00k66k59K20M17k63m32K79M35l49l56L00
2299a6M16l68l64L41K38k26k37K12J28k16lM4O3mk2m1k2K09N8l19ML84j38l75
2323b54J84L95k14m83K74L51l26k11K47K97l22k24L63J02j87j32J38J19K2j58
2343a9m8K07Q2l85j11L50J81l97k9K32O6l06N6K11K2j21m8J0J22J64j70k78L04
2366I5K42m45j66M90J36o33r3N86j4n63K22M86l09l62L23K13l39K0L19j80j98
$$ plain form
2214 115 -268 -86 177 -81 -213 -17 84 -19 -8 -8 -53 72 173 -97 -111 240 283 -194 -216 302 209 -320 -201
2237 -201 331 101 -335 -113 268 -101 -358 17 219 -44 -197 -33 77 16 33 58 -33 90 95 -164 -107 210
2259 210 52 -300 -144 277 3 -297 6 351 -37 -312 81 305 -12 -186 105 198 43 -119 -15 131
2279 131 88 -25 -126 -26 127 -31 -208 -42 258 -8 -267 -47 370 107 -325 -46 389 40 -316 -16
2299 -16 400 32 -332 9 247 21 -216 -4 124 -92 -95 -51 12 8 -14 -55 -77 132 190 -129 -125 259 121 -254
2323 -254 -70 325 111 -372 -98 253 -73 -284 -37 260 -62 -286 77 179 -8 -140 -2 117 139 -19
2343 -19 -67 140 222 -163 -274 76 257 -140 -169 63 129 -177 -121 90 112 -9 -57 -47 75 239 69 -209 95
2366 95 337 -108 -274 216 352 -281 -374 212 198 -365 -143 343 34 -328 -5 208 -131 -111 208 28 -170
2387a70L92k3m50K31L76m50l55O32J82o43r5O77r0o80K73O72l85m95M38L35m74
2408a02j48M47m9k92J07K69l05o8K86j31l13K78K89m25j46M30K11o52N7N91j02
2429B32n39J84M70k14l93K50K77k07k72J54J83j07q4N9Ok4j1lM8R6m7j16L9J14
2453I5Mo8kQ5n1j23l4O4J13l2k50J07K80k12k06K27K91l36l12M67K65m48j87N43
2477B80k5n20J21M80k59m08L06K62m20n6M54k15k98L08L12n07p8N63m7o04K62
2498h9N36m25l46M32K66n68j13N43l8n29J64M54l38k49L10J77l23KL23k03q9K17
2520A14N8k71P2K22k38j41L16L8k90J6J54n5j52J55J11j67N1N8j49L5J72r5j97
2543a83K59J53l82j6M33j07m91K31L55k45l18M34P3m46M5M57k22l07L67K21m68
$$ plain form
2387 -170 222 199 -251 -20 356 -94 -449 183 365 -278 -373 304 214 -466 -193 479 94 -401 37 372 -102
2408 -102 -250 197 148 -144 -37 232 -73 -141 145 14 -299 -21 268 -157 -303 127 338 -314 -257 334 232
2429 232 -307 -123 347 133 -260 -10 267 60 -212 -58 125 18 -66 -7 -1 -25 -36 -39 9 105 58 -58 -19 95
2453 95 99 31 29 114 63 -60 -94 -30 83 51 -199 -92 188 -24 -230 -3 288 -48 -360 107 372 -76 -263 280
2477 280 255 -265 -144 336 77 -331 -25 237 -183 -239 215 0 -298 10 322 -185 -263 300 253 -351 -89
2498 -89 447 22 -324 108 374 -194 -307 236 198 -331 -167 287 -51 -300 10 187 -136 -134 189 -14 -103 114
2520 114 172 -99 -27 195 -43 -184 132 170 -120 -104 50 -5 -157 -2 109 -58 -7 51 -98 -63 109 14 -183
2543 -183 76 229 -153 -169 264 157 -334 -103 252 7 -311 123 196 -250 -205 252 30 -277 90 311 -157
2564a57p6N90k07n10L37M45m71l67O26R2o41J28N40k23m91M15L37n11j95N36L0
2585B27m75J31M65k79m56N28J79n81QN89k31n05L17M61m45l55N68J60o06Q5O33
2606D18k35n40L56L41l84k00M44P2n39R0L96k11l34K74K55l41j16M35o8l06J09
2627h4L31k48k52K96J48k39q7K31j7k05L2K04p2j29J08P3j25r3K34n4j71J65j6
2650C0m0l3J24L0j19m5J06Qr2L7Q9l6n9l8R0p9j5K8P0j15m9J10J7l2J9Q7p7n8
2678d2R7%p6K1J28j22l5Q2k7j26R1Rl6L3O5jj18K4J36p4o4J01k8k7l4R7l3q8Q5
2707C8K0j17l7J82q0j02L1K52k15j45K68M0j87k6J99p3j19P4J05j27n6J48j3j37
2731g7M4J01j02l5L9N0j4r5J24j8o2M8N6k8l9K4K8o0j2j1O8m3o1qJ78j21o7R7
$$ plain form
2564 -157 -233 357 150 -360 -23 422 -49 -416 210 302 -339 -211 329 106 -385 30 367 -144 -339 197 227
2585 227 -248 -117 348 69 -387 141 320 -261 -253 336 105 -400 -83 378 -67 -422 146 306 -300 -215 418
2606 418 183 -357 -1 340 -44 -244 200 272 -267 -177 219 8 -326 -52 203 -138 -254 181 113 -193 -84
2627 -84 247 -1 -253 43 191 -48 -135 96 79 -126 -94 110 38 -91 17 90 -35 -128 106 52 -119 46 30
2650 30 -10 -43 81 111 -8 -53 53 61 -31 6 95 59 0 -38 52 -27 -42 -14 56 -59 -108 2 19 -13 6 93 16 -42
2678 -42 55 55 -21 0 128 6 -29 53 26 -100 -9 0 -36 -3 62 61 -57 -33 103 29 -35 66 38 11 -23 74 41 -47 38
2707 38 58 -59 -96 86 6 -96 -65 187 -28 -173 95 135 -52 -78 121 48 -71 3 108 -19 -75 73 60 -77
2731 -77 -33 68 -34 -69 -30 20 6 -89 35 17 -45 3 59 31 -8 16 44 -16 -28 -39 29 -14 -75 -83 95 -26 -93 4
2759DP7p7l5J03l3j17P6J14j20m3J06P1j40l1J43j26j46J49J16j71o7K10J9j95
2783a13j5K74j01j45J10J75j69n9J34J3j36j9P3j4r8L7J65j26j60J91P6j32p0
2806a09K16m9j13N4J92j74r6J53N7k11L9J57p3j44Q1J18j21q8J44J0p8k4R7M3
2830H1r8L5N8J2j52P5J10p2j19P8M2m1j08P1R3j36%J01J7p5J8J06oj63J19Q2j49
2857b1q0K12pk37Q7J24m9k18J80J51k46o4K85k3k26Q8K62j77j76K67M5k55l2K34
2881A24n4k21J60Q2q0j26J86m3j85J29J76j60j04J61O8j77l4K14p6r3R5P0j27
2904a5KP4r9l4R4M8q5m7R4k6k8J6LJ8j3M9m3j7P3K3r9j5J26r8K5Klj16P1K5kL6
2936C9Mo1m8Q9O4n7q2R9J15j14m8L5Q0j62n0R5l4qK6O4n9j6JJ9j2l2M9Pk8O4l2
$$ plain form
2759 4 81 4 -31 72 39 -78 -2 112 -8 -51 55 126 -14 -45 98 -28 -174 -25 91 -80 -147 63 82 -113
2783 -113 -128 146 45 -100 10 185 16 -43 91 104 -32 -51 22 8 -90 -53 112 -14 -174 17 93 -39 -109
2806 -109 107 58 -55 -1 191 17 -79 74 131 -80 -41 116 43 -101 -20 98 -23 -111 33 43 -35 -59 38 81
2830 81 -17 18 76 88 -64 11 121 49 -70 8 50 9 -99 -28 65 -71 -71 30 47 -28 -10 96 90 -73 46 128 -21
2857 -21 -101 111 104 -133 -46 78 29 -189 -9 142 -104 -168 117 94 -132 -44 218 41 -135 132 177 -78 -110 124
2881 124 70 -151 9 91 11 -115 71 28 -157 -28 148 -12 -116 45 113 -64 -98 116 40 -53 42 112 -15
2904 -15 -13 61 -38 -72 22 70 -15 -62 32 6 -22 -6 -3 15 2 51 8 -9 64 87 -12 -27 99 1 26 28 25 -91 -20 5 3 39
2936 39 43 -18 -66 23 87 30 -52 47 162 48 0 35 115 -47 -97 -2 -36 -44 -18 46 -13 -29 -28 -9 -21 -53 -4 3 -25 39 7
2967GQj2O6k2m2k9M3N9j63L6Q9l7j36R0J47j08q3Q3J08j32k0J86o0j23n3K32j75
2994d1n5J35Rj02MP1m4p1J06Qq9K4Q5K6j07m3J73m4j24J17L5j12n5P5R2j59k6
3021a12J83o2j06R4O5p6q4J27K9j33N9Q5q6K6O4Kj23m0J57o5p4N7O7j12n8J50
3047C4k0j06M0P8m2j8M7M9mj20R5L9q0P2j4j27JR9nr8R5L4j32q8K63r1q5O8J05
3076H9r0n8N0J77j60j7J80j77o7J04N4j01m9J43j7k02J00J98j56j07J96M4k45
3099a11M5K35o3k29J20J59k49m0K45L8k78P0J80j20j04J45R5k18K2J94p3j61J33
3122C5J11k05j03K61P5k46J1J64o2j89R0J71j96m2J31N1j93J31J02q9j19J13J06
3145A08j86L1J76j02q4J1J44j22q1J54L7j73N4J08o1j50J74P2k08Q5J52j12j07
$$ plain form
2967 7 15 3 69 47 5 -24 19 78 -85 -49 40 3 -133 -43 104 -4 -87 -4 104 -28 -48 138 78 -45 -98 134 -41
2994 -41 -96 39 48 -54 -50 21 -23 -94 12 20 -69 -45 40 66 -41 -84 89 45 -79 38 73 -39 -94 -19 73 -86 -112
3021 -112 71 9 -97 -3 62 -14 -98 29 58 -75 -16 69 -17 9 73 75 -48 -88 69 4 -70 -13 54 -58 -116 34
3047 34 14 -92 -52 26 -16 -34 13 62 58 -62 33 72 -8 64 50 -77 -76 23 18 -80 15 49 -83 -171 92 1 -84 -16 89
3076 89 -1 -59 -9 168 8 -9 171 -6 -73 31 85 -16 -65 78 61 -141 -41 157 1 -106 90 134 -111
3099 -111 -66 169 106 -123 -3 156 -93 -133 112 150 -128 -58 122 2 -102 43 138 -80 -58 136 63 -98 35
3122 35 146 -59 -162 99 174 -72 -61 103 41 -148 -58 113 -83 -125 6 57 -136 -5 97 8 -111 2 108
3145 108 -78 -47 129 27 -57 -46 98 -24 -105 49 86 -87 -33 75 14 -136 38 110 -98 -13 139 27 -80
3168h0J09P6k09L7K06j30j34J36O9j69J2J36j9j50Q6J45j71p8K17L3k45K3K38
3191A38j07j31J72O2k13K3J49J7k42J14J44k28o6K36K5k32RK37r0j91K03J19j81
3214c3j32L02m2k12M9K20j76q7J67j0j61KK12p9j20J28Q2j32n6J96Qk18O6J92
3238A66j72j31J71L0j25pK26k09l3J18J2j12pJ29j7j43J10P5j18j9R4O2j86N3
3262c3P8k0j07M8Q0l3q6J25n6j16R4O9q0j6Q4mp4K5P0o1m5N1O8k9o4Q0l5k0l8
3291d5J22q9J0o1J17n6nN6r2rM4Q6p9K2J9n1l5J6O0l2m8M1k0mjP4n7j8K6M1k3
3322ImJ6Qp6K7J4K5m9R2k8q0L6Pm4l9J14l4p7L2J18r0k7Q1J8m0k5Q7j2j32J11
3352C8j1m7k2O3j1j23J03N2p1L5L8m8o5O8O9j17L1P9j5j29Q7N0j02KP4L4j18P0
$$ plain form
3168 -80 29 105 -104 -67 139 9 -125 11 80 -89 -77 59 40 -110 -24 121 -50 -128 89 122 -123 -100 138
3191 138 31 -100 72 134 -79 -56 93 110 -132 -18 126 -102 -168 68 93 -139 -130 107 17 -174 29 148 -33
3214 -33 -165 137 95 -117 -68 152 -24 -111 56 46 -115 -113 99 20 -100 28 110 -22 -78 118 126 -92 -26 166
3238 166 -6 -137 34 64 -61 -68 158 -51 -84 34 46 -66 -73 56 39 -104 6 81 -37 -56 38 100 -86 -33
3262 -33 45 25 -82 -34 46 13 -73 52 -4 -120 -26 43 -37 -53 31 27 -47 -22 48 -13 -58 -7 61 32 -32 48 13 -7 -45
3291 -45 77 -12 -2 -63 54 -2 -7 49 -43 -52 -8 78 -1 21 40 -11 -46 -30 30 -2 -50 -9 -29 -33 -34 40 -17 -35 -9 32 9
3322 9 5 21 29 -47 -20 -6 19 -30 62 34 -46 -10 -3 -47 -86 28 -6 -83 -51 67 -23 -50 31 49 9 -16 71 59 -73 38
3352 38 27 -20 -42 21 10 -113 -10 42 -29 6 44 -4 -69 -1 68 -49 -18 61 46 -83 4 54 -48 -46 28 62 -56 14
3380A4P2j17l6J05l5j19R0Q6n4l6M6M7j16O8P9l5j35M4J50j79KJ05k3j29N4R9
3406D7q0j0P6L7j31J1J45l6j21Q7O9j04p3R9Nn8JJ04l9p9L2R4j16j3R1j13L6L7
3434bR2q3k1Q9j6j24J02MNm2P4p3j9p0J13K5p8L7jj7r0J04K3k5m2J07l3k9N3j5
3464D8j15N9QM3j26Q6J6m5J6QJ3l6OM8Nk1J5Ll5M6m9lJ4K4j0n0k0R8j01l0P2J5
3496BJ1n4N9m7P1l6o3J9P8j8j3o0M1K1j9n0N4Kl3P4j5o1JM6L1n2L4J3m3j0P2k8
3528B7j3K1K3o3m0R3k1q7O5N5q0mOQ6j28JJ06n5m4Q1M7o4r2J06J4o5M8%j3o2M9
3559cP5r0m8J02o5m4J36j3m5OL8M9j54Q3N7p5o7R2M0j51j3Q9M3j09N5Q9p9q6J50
3588F2oj19J4J37n0j14P0Q0j09KM6L6r5N3N5p5r0Q7R7j43M7Q0n9r8P8J18j04m5
$$ plain form
3380 14 86 -31 -67 38 3 -116 -26 60 6 -30 16 63 -53 15 94 59 -76 -32 118 -61 -59 46 23 -106 -52 47
3406 47 -33 -43 33 70 -61 -50 95 59 -62 25 94 -10 -83 16 21 -37 -36 68 29 -50 -18 76 -40 -53 38 -75 -39 -2
3434 -2 90 7 -14 75 59 -65 37 41 46 4 78 5 -14 -84 29 54 -24 13 12 -5 -95 9 32 7 -35 72 39 10 63 48
3464 48 -67 -8 0 43 -83 3 19 -26 -10 -2 11 -25 -19 29 34 13 28 31 -4 42 -7 -10 4 28 18 -32 -52 46 -55 -85 -13 2
3496 2 13 -41 18 -29 42 6 -57 -38 40 22 9 -51 -10 11 -8 -58 -4 -2 -35 39 24 -37 -36 10 41 -11 23 36 -7 -17 55 27
3528 27 14 35 58 -5 -45 48 27 -60 5 60 -20 -24 -18 68 -60 -59 47 -8 -52 29 76 12 -80 26 40 -25 23 23 10 -52 -3
3559 -3 72 -18 -66 36 -29 -73 63 50 5 11 49 98 -56 27 84 9 -58 34 74 -77 -90 -1 42 -67 -12 77 -2 -88 62
3588 62 56 -63 -49 88 38 -76 -6 74 -35 -33 13 49 -46 7 62 -13 -103 -16 81 -62 -15 65 6 -92 -14 104 0 -45
3616d5J16n4k6J8J23j27m5R9Pr8OP4m0j16J21M9m4m0N5L4j41O0R5m8j05J02J7
3643D7j03kJ01M6j57L8R2j06l3J02L0j37RR8Po3P1M2j20%J11j7j15PO5k3o2O6
3671fL9p1J1M1k4p1O1Q2r0N2L9m5j9lL7l6n7Q0Pk0ML6rrl0M1n5k5M8NnKjL4K5
3706F8n4j6j3L2j9n1O5m6k2NK2O1p1Q4n5k1j6K2M1l8M7k4N5o6M6l0J0k1K2rk8
3737b0L7j7J8j3M2q8M9lK1k4OJ8l3J9M8k0l1K2J1K0j06N1Ml4m3Q7n9J13j01P3
3767D7p7J9O8lj6j6j0K2m6J5k5L5o3K5J6M8n5qK2kK6Pok9J1j2J6m7P3O8j39Q5
3799D9k9k9k1KM1o8qN8M6r1L7J8M1o6M5qk4k6P2Jq5Q0L8p9l2R4p4k1NP4o9K2j3
3832b0Q0r6QK6l4QK5O2o6n1Q1j1n3Q6l0n4j9P1M7j03P8l9m5J0L2J8l2j0N5j4L8
$$ plain form
3616 -45 71 17 -9 9 132 5 -40 59 66 -32 -26 48 8 -108 13 62 18 -22 33 67 -74 -14 81 33 -72 30 47
3643 47 -56 -58 43 89 -68 -30 62 -44 -77 25 55 -82 -73 25 32 -31 40 82 -38 -38 73 56 -59 -52 13 -10 -72 -6
3671 -6 33 -38 -27 14 -10 -81 -20 62 -28 24 63 18 -1 -4 33 -3 -60 20 27 7 11 47 38 29 -1 40 -15 -40 8 13 8 10 9 43 68
3706 68 14 -2 -15 17 -2 -53 12 -34 -56 -51 -29 32 -39 45 -10 -31 -47 -25 16 -22 25 1 56 -10 36 6 16 -5 17 8 -20
3737 -20 17 0 18 5 47 -41 8 5 26 2 8 26 -7 12 60 40 9 31 42 62 -44 7 11 -23 -66 21 -38 75 -26 47
3767 47 -30 -11 57 54 38 22 12 34 -12 3 -22 13 -50 -25 -9 39 -16 -24 -2 -4 22 29 23 -6 5 -7 9 -38 35 103 -36 49
3799 49 20 -9 -30 -28 13 -55 -63 -5 41 -50 -13 5 46 -20 25 17 -7 -33 39 40 -45 35 73 -6 -38 56 -18 -39 -34 40 -29 -7 -20
3832 -20 60 -36 -28 -2 -36 -28 -3 59 -7 -58 23 12 -41 45 15 -39 -58 13 60 -43 35 -4 -49 -39 -7 11 -21 -31 24 10 48
3863D8m3J7l8oj6N6M8p7K5m2J0O1o6Nj3J05l4q8N7K9j4m7pQ8l4PK7n1j7J9L2l1
3895A0l0K2LK1l8K1L2q0O8KJ2j6%m2J5K0l4moL4pkMK6m0k0K6j8K3m4K2PM2j01
3929g2P8Rm3P6o6jj3qN8q3M3M9j4o4R1o0L5mk0oN0j3n1K2q3J14Ll5%kL9Ql2k4
3963a9l4O8m5K0l6K2N4p9M5k1k3O3m3OJ0J7L0k9l1M3l5m3rJ02p8NRQ7p3PrO5K8
3996G4p4J8kl2L6km2L9k6k5N5k2jn2O7N3p0k6K9k7nL0K8%n8J02q0R4j00N0l8O
4028aN8o4k1k0P8l4m0N8k6K0n9N2M9p7J4O8n2j2k7P6p4m3R3p1Q1j8k1M7r7M9M6
4059C2k9n4J04nq2qO4J5n0M8L3r0M9OJk8qM2l4j7M0j7l3M8J9n3L7j5J3o3K6N7
4091D8n3l4M8ql7o4J90r4m0QP0m5k6O7m4n2R8K1q0NQ5j5q2L4N3l2o5P9j5m8j3
$$ plain form
3863 48 5 22 -16 -22 -38 18 66 -11 14 -28 -18 43 -23 -18 -31 74 40 -48 9 38 24 -23 -30 58 24 31 58 7 -10 9 41 10
3895 10 -20 2 5 26 -12 9 41 -39 29 31 43 27 27 -15 0 20 -14 -18 -24 10 3 1 5 31 -9 -29 -3 -21 2 -42 -20 -13 29 -72
3929 -72 6 15 -28 48 -18 -19 -32 -40 18 -65 -22 27 13 -51 40 -20 15 11 -9 -15 35 22 -29 -7 -90 24 27 -8 -8 -10 29 37 5 -19
3963 -19 -53 15 -30 -10 -46 -24 30 -49 -4 -25 -48 15 -28 -22 -12 5 35 6 -25 18 -17 -60 -69 33 -45 -40 -31 56 -17 -10 -19 46 74
3996 74 0 18 16 -16 20 18 -24 15 -11 -36 19 -3 -4 -56 11 64 -6 -32 -3 -30 -35 -5 23 23 -35 67 -13 81 -19 31 -7 -1
4028 -1 57 -7 -28 -48 30 -4 -44 14 -12 8 -51 1 50 -27 -13 55 3 -9 -36 40 -34 -77 16 -55 26 8 -13 34 -63 -14 32
4059 32 3 -51 53 48 -34 -42 22 37 -13 35 68 -22 27 33 34 6 -2 40 6 -11 29 12 -21 27 46 -7 30 15 28 -35 -9 48
4091 48 -5 -39 9 1 -36 -100 90 -4 -44 -36 34 -11 -37 30 -14 -66 32 53 -27 -22 63 48 -34 0 53 21 -44 35 20 -28 -41
4122d1P8jj00J10k9o5M0j1K8j6N4l6l6k8Q3j7j4RN0k0j6Pl0l3OO7n1nM1l0KL7
4154C3j8k2MK8j2J3k1L4l6j2Jm3Q9k3J9q4J2K2k0Q6J8n5o1R7q9j9P5k5lPKj6L3
4187A4k7M5m6L6k0j1QnM2m8KK2J7j1p6J4L7J3K1rK0n9L9k8J7N4m3k1K9m5J3j5
4219b1N1j4o9Q3k2J0lK5jq4M3j1K2l7K5j0L5Po9L0L4qPJ1rP2j58M0O5k9o7P7n9
4252c4L2M2j06N2K4Lj1j3M6j6l5J0K0k8kM4m6jK7nj5L6j6k4L6m1K3l2M2Pj5k3
4284a9O1j1q0M2J1k1lMJ3L1k5k6j1K3o4RJ05koK0n2L4qm7L2l6M4l2l1m9O5K8J1
4317A0q4P6Mo0L9J4l7J7M0L2o1kO3p0j9M9J0l1j3M0k3ML0k6K8q8R1J0n5%K8j7
4349aqm4P5n5kR7n1k4M5k8k3M1lJ5kk6mJk6J3K8k1p2R5j3qQK1l5lO5k6n5LK4J3
$$ plain form
4122 -41 37 36 -64 46 17 -48 -8 -19 9 -7 47 11 -25 -53 30 13 -1 8 58 38 22 29 -1 -34 -28 39 -12 -17 24 -6 -4 33
4154 33 15 -7 -3 25 13 26 5 39 3 -9 -8 -51 38 15 34 -50 -38 -16 -36 50 68 13 -48 49 -40 -59 16 -9 -12 -5 -3 -19 14
4187 14 -13 32 -14 22 2 -9 -1 -6 36 -12 -10 12 29 18 -58 -44 -7 6 27 18 38 -21 18 -10 7 61 18 -3 26 -19 -6 -21
4219 -21 30 16 -53 30 8 18 15 40 39 -45 -2 -13 9 -28 -3 -13 22 29 -40 -10 24 16 23 34 25 97 -61 -21 44 15 -52 25 -34
4252 -34 -2 40 -66 -14 10 13 2 -11 35 19 -16 -6 14 -14 -16 28 -18 -19 8 3 -12 24 8 -16 20 -21 2 -30 12 19 4 -19
4284 -19 42 31 -49 -7 4 -17 -20 -16 -3 28 3 -23 -34 -11 -75 -66 39 37 31 51 -1 33 25 -22 10 -26 18 -14 -45 -94 -29 -1 10
4317 10 -74 2 6 -54 -15 -1 -38 -21 19 51 -10 -12 51 -19 -38 11 21 -10 -23 17 -6 -2 28 2 30 -58 33 43 -12 -12 16 -1
4349 -1 -9 -53 22 -33 -35 62 11 -13 32 4 -19 22 19 34 32 6 2 3 -23 -10 18 -3 -75 20 7 -1 7 28 -7 -10 55 29 -26 -23 1 14
4385A4l6OK5Rn0J1L6ql1L7J1Lk4%K2m1J3RLk6J1qn2O4K6k7o0L2j9M1p4J50j42
4418g5M0M5Ql5N8k8K7n0NM6p4JM6K1j14O0J7j9ln%L4J0m9P8j24M3P9n6KP6Ko1
4451EQ0p6j3Qk6j4N5k8K1n8M3L0o3N9jl5pL6J1mo8jP3j3L0om3j3J3L2l0Qm2MP3
4486D0k5k8NK0j8lJ5l1mO1j2l3K5pk2L6J0m8L3j5p1J32o6Qk9J03j00N4kq5J12
4517E5k0n0O1n7k5J6oJ5nJ0j8j9K0J6jL8k7L4o7O1k7L1j1mJ5oj6Lj7mk2N9km6
4551a6QnK4n1O5o8N3n7J03qm3j3l4%J9MJ3JqM1N3j07OPM4j8p7M8L6K8n8k3K0m
4585a7O6j8Rl6J5n0N0j3m1J7K1K8l6lJ4l2LJ7J8k1k4K6j8NO8n7MK7m0Q0k5j2J0
4618C5Pn7j0M8m9M5J1o3L0L1K6o0PM6q6j1N5P0q8L5K3m3n7O5m2M6m3M9%m5n7M4
$$ plain form
4385 14 -22 -16 9 18 -32 -21 15 7 -24 13 24 27 3 3 25 -16 -3 6 9 -17 -6 -14 -66 -2 24 -3 -63 -31 -50 -9 -83 67 -75
4418 -75 -35 10 18 -17 41 13 40 -10 -5 41 -33 -32 14 35 -79 -19 -2 -21 -24 -29 -29 5 15 -34 44 -80 -37 42 -14 -12 64 66 5
4451 5 85 9 -4 4 -22 -36 19 -9 12 -46 -3 27 -36 23 22 -13 -20 16 27 23 -45 -46 27 14 44 38 -5 -18 -5 27 -3 5 -37 -33 40
4486 40 15 -13 -8 12 -6 -9 6 -25 -29 32 20 -13 12 5 -17 19 29 -19 14 -1 -72 60 -6 2 -27 76 -24 30 28 -57 55
4517 55 35 -15 46 -11 -36 -20 -26 -11 -16 -6 -24 -43 -23 -7 -8 30 3 37 -30 31 4 35 24 20 35 29 13 16 -1 -5 -27 32 30 -16
4551 -16 -8 -13 11 -40 25 -43 10 -47 56 48 5 -8 -42 -42 -23 -19 -6 -5 -13 28 81 -26 -20 -13 31 13 -64 -16 20 48 -10 -33 -13 -17
4585 -17 49 31 40 4 19 -31 19 6 -35 -18 3 31 -5 -8 6 -26 -23 -6 12 -9 -33 -7 -25 -20 48 -9 -5 22 -18 62 37 25 35
4618 35 42 -15 -25 23 -26 19 30 -33 -3 28 54 -6 1 47 -39 -50 5 75 -13 22 45 2 -55 10 -32 14 -29 20 20 -25 -82 -38
4650c8L6m1Q5m8K4l8nj6M8n4O1MJnJ9j7l3MP3n2j2L8l4P2o6Onj7J7nnLj9N9m3
4685ck5K5J8J6j9j1J9n3J6J2%j8J9L6l0J6m8k0NL1lJJ4n6M1L9qk3M5q0J9M6NJ
4719B7pj9l4J8MN7kOk6J9n5j0k5L2qM2nj3n5M1L6j8KmN7m0l4O8m1k9L1n5j3Q0
4753B7jj6Oj6Jk7m9P4Lk4R6o3l7L3nLl9mM6Jq4L9K7k5L9nMkk0N7m7j1M5k0pJ2
4789A1j9L9j00P9j9m5L9k8O3j4k5L0P3j30N5l1O9p2j9K6K7Jk5k6K9mqN9l7M7j00
4820e5M0k7O1j5j2M8p2L2k7O6m2M9k7j7J6K7j8j3Mk7N0%m5L6j0o5L2J8J4l2M3
4851C2n4N8j09O3j6lPl8L7l6LJ2L2j0QJ3l0K0m7M1K5rL5no3K7L1nm6j1K3J3k1
4884b3J8L6Jm2L7O9j16M8n5M7J1k2jJ4m0J0jj1L0k4j7j7R0j6n8L4K1j9l3L4j0
$$ plain form
4650 -38 -2 -43 42 -6 18 -20 -25 -41 7 -47 14 18 19 14 33 16 -17 -13 60 8 -4 34 0 72 6 12 7 -10 7 2 -3 0 -19 40 -3
4685 -3 -28 -3 15 31 12 1 20 -33 -17 -5 -5 -23 -4 32 2 18 -30 -50 -45 -14 -17 -16 -2 -58 -17 22 14 -9 36 -44 -25 21 26 27
4719 27 20 1 -33 -15 -11 46 44 50 24 43 -12 -22 -47 -15 -23 19 14 1 -54 -13 23 5 7 3 60 20 -14 54 13 -16 15 -40 -53 27
4753 27 26 10 16 0 1 -26 -75 -1 2 -22 74 11 -26 7 2 5 -34 -38 8 9 -75 -36 -9 -34 5 0 4 2 -18 39 -8 -19 26 6 -1 11
4789 11 -8 31 -69 10 -9 -54 -15 -43 20 6 -19 11 84 -46 9 -22 47 -25 -44 -18 9 10 -15 -41 -12 -16 -24 35 -2 45 -55
4820 -55 -15 -42 19 4 -8 40 -32 0 -27 39 -3 46 19 2 18 45 27 14 18 -9 41 41 -4 32 22 -43 -11 7 21 -11 32
4851 32 -22 36 -73 -10 -26 -29 -22 -60 -23 -59 -56 -44 -12 -22 -14 -1 -31 -11 -58 -17 8 -1 34 29 -34 -7 24 19 -27 -38 -15 -2 -23
4884 -23 -5 31 32 -10 27 96 -20 28 -27 20 31 9 8 22 -18 -8 -9 -20 10 -14 -31 -48 42 26 -32 2 23 4 -29 5 -5
4915ek0l6Q2j1p1P5J9op7O6l0K9l8L1l2l7L5L7K2l5k0N1o0j3P4l0l3J5K7qK5k3
4947Cl1mk4N7M2p2j1J04n3k1n6N9J1l9L6j1m3N1l7P8p5M3Lo2K9l7N1J6p0P0Km1
4979c2L1k4J0K6pl4OL4m0P3o4Rj4k9M3J2j1Jj0K8j5l6R0n6nL5L2r4M9n5N4l8j9
5012e0R1o9K1PK0mJ6r5L9Rl0L4j2J4j2pO7n2J1M6r2N4m3K5K8J2kl3rK9n4PL1K8
5046B5M8p9j1M2o2N5k4nKM3j4rl6P2Jo9L1k8k0Q2q3L8M3p1K0J1Kj7J4LJJ4m5P
5080a9L5l1J03o4L4n2J9l1j1N8l6k4lO1k0K4n9l4P5pn2K9K7k8J9km7%L8%l0lK6
5113ej6j8O1k3J8l3K5J4l3M3m9K0K7o7Q2k5l5qL1l7M1l0R6n5l9O2m1j0K9kl8K7
5145A2pKJ5k3l0M1m7J9K5j9Jk0O9j8j7j0L4k6j7LN7oq7P8m5k3J9L6pj4K6k2pp
$$ plain form
4915 -5 -25 -61 21 10 -61 14 33 27 -50 16 -14 15 -23 8 -24 -61 -26 11 33 -2 -22 29 -31 -44 30 0 -33 -18 9 1 26 3
4947 3 -28 -32 -56 1 43 -29 -40 64 11 -10 -66 -7 4 -35 1 -10 -53 -2 -39 39 -36 7 10 -52 -23 -60 -9 7 -63 7 9 -32
4979 -32 -1 -25 -15 11 4 -30 -24 10 -30 43 -21 -12 -26 -55 -12 0 -11 -10 -20 8 -7 -43 47 -9 -14 21 53 -41 8 -47 7 -31 -50
5012 -50 41 -28 -7 0 20 16 32 -63 -24 -15 -45 -11 -23 -9 -21 -28 39 -13 -2 44 -48 6 -37 -12 16 28 26 -7 -16 13 -41 -34 -3 25
5046 25 73 -6 -17 25 -37 18 -6 -11 -9 34 20 11 -25 47 48 -21 10 -18 -38 44 -39 -1 42 -29 -9 2 4 -13 1 4 5 19 -26 -19
5080 -19 16 -15 88 24 58 6 25 -6 -17 41 5 -19 -22 39 19 43 -16 -50 25 18 -34 -5 22 -6 13 11 -36 -36 2 2 -28 -31 -5
5113 -5 -21 -39 22 -1 17 -16 9 23 -10 33 -16 4 31 -36 46 21 -14 -22 9 -28 13 -17 79 24 -15 47 6 -4 25 23 -15 12
5145 12 5 7 22 -1 -31 10 -37 -18 7 -12 -11 -31 38 20 3 -7 27 1 -16 -13 44 38 -49 29 -16 -39 -20 16 9 -5 21 -1 -8 -15
5179a5O8l5n1K0rm9O3M7m3N7j3k7l3J8K5Mp3QL9K3l8L7Pl1n5M1O1m6JO7l7m5K
5212a2OljRm8K4P6n7n4L2K5pM2m7K9Kq7R3okm7J7K6j2l3L9L9o5NK7m7N3l8L3p7
5247f6R8k4j5j9k7O3nn5O3L2l5J8o7J08q8K4o2OR3j9j3o3j1L8K4j7k9m6J28p1
5277c7N8J0po5N2j2%j9M9o8P3j4j2KK7n7L4J7nj4qOnL6Jl3Ljoj0J5j0kQl8P8p6
5314c0mP8o2M3J5k5ol8P5o6N8p9M8k3k3J7L4n5K7K9m2j4RQ2l7o4N1L2k2p5M2L0
5346EK3K3om9%l3M7l0J8o0M8L0j0Ok4%L5lJ6n0K9l1n1N9Lj3L8Mn8P3n6K3ml3K9
5381bK8l5j0K0J8kn6j6O6K8p3k9O1J1L3Jo7J4k6M8j8mJ6mm6J19n7k7Q9q3k0j5
5413c8L8k7K1l2K4K4on3J8N0m2Jk7M2N5j7n0j2P8m2l8OkL4k4pK0qj8M8n2J4k4
$$ plain form
5179 -15 53 18 -33 -13 -22 -71 -8 39 -4 53 40 13 -20 -2 23 27 -46 -38 1 24 -14 23 30 -1 -56 -15 46 0 1 68 31 -14 -12
5212 -12 -6 -9 -10 -1 -49 -25 51 -6 -60 -28 -3 -10 32 -15 14 16 -71 22 16 14 -33 -16 10 -2 -35 4 43 -22 -17 10 -37 16 -22 11 -66
5247 -66 32 8 -7 -26 -53 10 5 -50 13 45 10 28 -39 69 -19 5 -57 -51 42 23 10 -53 -64 -26 -2 -19 -48 -94 34 -37
5277 -37 21 31 24 -41 11 -1 -1 -20 29 -39 34 20 8 10 37 -20 14 31 26 12 4 10 5 41 42 9 12 11 5 -5 10 0 -2 6 -32 46 -30
5314 -30 -34 44 -18 25 40 15 9 -29 46 -20 38 -41 7 -16 -39 -22 12 -43 -16 13 -29 -43 -34 48 11 -53 -2 30 8 -67 -25 5
5346 5 28 51 45 -4 -4 -37 10 -20 -2 -62 -14 16 6 12 -12 -12 23 20 36 -14 15 -16 -67 -8 -5 -18 20 24 -34 39 -17 6 2 -31 -2
5381 -2 26 -9 -19 1 19 17 -39 -55 11 39 -34 -63 -2 9 42 43 -24 -10 -36 12 -6 -10 6 2 -44 75 18 -9 80 -3 -23 -38
5413 -38 0 -27 -6 -38 -14 10 4 -49 -31 19 -23 -22 -49 -7 48 31 -19 -31 47 5 -33 -27 -29 5 -19 -26 -6 -14 -32 16 -36 -22 -46
5446d6P6nn2j4N8o9N4o%j2N7pk1J3j6l4JL5q8O3mrn3N2O3j3m0L9k3N6o6L1L1l7
5480A4M4j05K5L9k6K1p0N5Mj9JM1l1o7J00j9Qo8N2LJ2J4l5Ll%M4o9L0K6oK8k9
5513A7k0L1L0k5l8j1K7n5N4Qj4j6k2O5k4K9n6P3r1M2Qn2K1K2j1Om1N7j5j9Q6p2
5545fL8p4N7L1o6MP2q9k6N7PJ0o9Q8m0L5qj4Pj03J13p3P1K8k5m8K8j5%K4Jj5M
5578DJ2o4N3m4J3N1m1PM5J1n0O1m6n3Q5%k2k9J4j4kK7n4N2kk8jK4Nl1kM1o0K1
5612a7J4M2m5PK1lj6j8J8k8j1K4M7N2j03J0K7j9l0j3K6L3l7J8k0J7K8l6oj3J4
5643a7n6N4O9q4L1l8J7O1q1j1QjP2km0K9m3L1n5P1m5K5j2M4p2MK5JO4j05M2JK1
5676HM7p1L7J1K0j7o8N5J0l9nN3p0K4k2l5M7K0%J2JL8q3N0k8J1l8N3o9Q1J4n5
$$ plain form
5446 -46 30 25 -27 -41 17 -52 2 -4 -4 -16 41 34 13 26 10 -24 -23 12 -76 -13 -17 -26 -79 -27 36 23 -17 22 -1 55 -11 20 51 14
5480 14 58 -47 -22 17 -9 12 -58 -3 1 -18 -17 24 -7 -74 26 7 15 -53 -1 2 14 28 -7 -4 -7 -7 37 -32 -2 24 18 46 17
5513 17 -3 28 58 33 -5 -16 11 -44 10 18 4 -12 -34 31 7 36 -20 53 -38 4 12 -40 -19 3 -8 -2 -43 14 -1 -20 66 -6
5545 -6 32 -42 15 46 -20 -16 56 -33 -59 -2 5 15 -54 34 -6 29 21 7 14 -89 24 -49 22 50 25 -23 5 -10 -10 14 15 0 4
5578 4 16 -48 5 -39 -26 25 -16 -9 36 47 -3 58 12 -41 44 44 22 -7 7 -7 -9 18 -36 16 14 -14 -15 9 14 -17 -19 22 -38 -17
5612 -17 -3 39 -6 1 22 19 3 -15 3 -25 -36 -12 35 87 -16 -6 21 2 -28 -41 -15 18 -19 -1 -21 -4 24 -12 -18 -31 -17
5643 -17 -73 -19 50 -34 -3 -41 -24 37 -44 -55 -47 -48 24 22 -18 11 -32 -1 -56 15 -30 -5 -17 27 -45 -41 -16 -15 49 -56 -14 -13 8
5676 8 55 -16 21 32 52 35 -33 22 32 -7 -12 41 -29 -5 -27 -62 -15 5 5 17 18 56 -27 23 -5 6 -32 21 -48 33 47 -8
5708hq%M5m6J5L1k1k3k9N5J7j5J7r4M5j5O5k1N2j00N9m9PL1n0l8P4Kpm2K1P2n4
5741a2k0K8k1PM6J7l8L5k3m9J2RN3q6L3l2N9m6J6j0kM4K1q1N0j2k6M4j8n4J3M6
5773CJNm1O9q5K1J1K3m3O8l6l2L0LooQKL6j3Jl2M3n2K9n1J7O8n5l5J3L6J8Jk5
5808fl8J6pK6j4j1L1nQL1mq7N2nJ9l0J8j5k4M5K2qJ4r4J0J2M7m8K2PJ8J0rj5J
5843a1K4k0L2Kl6l0L6K4j9MPj4J7lo3ON3k8k3P4k6j3K0m0m7M6j2N3Mm0N4n6J0
5876a5L0J7o4J4K9nLm8K1J0Nok5N8K8j2m8K6%m4Rj1L6m9L1OL2o2M9j1L9l2L8N
5910E4n3j9M9j9l8Rm6J1M0OO1n8k7Q6k3n4k0N1jKj9O3m4k0L8p4NL6m5J13p8O2
5942D8n5K4l6k1K4M1oqRk5k9L5K5k7j2J0o3N7Pm2O5qn0LJ3L8J2n4M1J7k4m5J5
$$ plain form
5708 -8 -16 -16 29 -17 -2 29 8 -15 -44 11 28 13 30 -64 -19 -34 31 10 62 -38 21 -28 -21 10 -40 -78 -4 -2 -9 -51 -30 42 -12
5741 -12 -32 -4 -25 -18 28 45 7 42 19 -30 -18 -9 44 -42 -9 -41 18 -28 -12 -22 -24 20 41 -40 10 -2 -28 16 -2 -56 -43 3
5773 3 4 9 -32 37 -48 -27 -16 7 -36 32 -4 -36 -6 -3 -9 -15 -7 -5 31 18 19 -13 30 -22 7 -44 -27 41 -14 -49 -36 0 18 19 -6
5808 -6 -44 -28 -35 -9 -23 -34 -3 -8 0 31 27 -60 -8 -13 6 -24 -6 -21 -45 0 22 14 28 -66 -56 -44 3 -45 -23 -16 2 12 3 -12 -11
5843 -11 13 -7 25 27 -9 -39 -3 21 2 6 13 -1 16 13 -50 -44 9 -19 -42 32 6 -7 13 -27 -74 -28 -40 13 17 -23 31 -25 -15
5876 -15 15 32 -32 -18 11 6 9 -39 -18 -8 -3 -9 -34 24 52 40 -8 18 18 -26 -17 -28 8 -41 -10 -4 28 -34 15 4 43 11 49 54
5910 54 1 -18 31 12 -26 -17 -63 -52 -12 -6 55 -3 -30 56 33 -21 -41 10 9 11 -8 55 11 -9 29 -45 -40 -4 -49 64 -14 48
5942 48 -7 17 -19 -40 -16 25 19 11 20 -5 -34 1 26 -1 -13 -3 -66 -9 -2 -44 21 13 -37 -34 -21 17 29 -25 16 33 9 -36 -21
5975b1J9K8j6On3n8O6nP5o2k5RKQJM7k3m3M7p5P6q9L6J9Nj4N6m6o0P4M9n7L8o9
6009e5J3N9j4K0k0j0N6n3lJ9l4rK1K9n7JR3m4J6m6J6mk0RN2lj6J7k5j2J3k0J2
6042Aj9J0J9m1jJ3j7L1L3j15O2L3pJ4J3l6n4J18k1k0nm5K4N6l4k3k7M1rPN1m2
6074A0l7l0M6K8J4l7oJ0m6O8k8NJ0J8p9M9oJ4k5L8Oj4PK9qk3k0lL6j8Kj5j2N1
6108C4l0k3ln7Q0KK2m0K5J5r1O7NlM2o5P5j0o2RL1om0J6K7M0k6K2m8l7K8%K0K4
6142D3q0K7J2nQj0m2k3O5JOJk4rJ8k4L3K1J1mj3l0NO%O2n4O1j4k8J%m2L2%j4J
6179bJ5p6J6pN3L5j5NLl5j4O7o4M5j8n0J9O7o6m5J9L9k1n7P4Rj3qJ8J5k6k7O8
6212B3l4kRkO8p2j1N0n4LpL3n3N6j5M1On9J0N5n7KlJ6k1Rj2L7m3M8m1J6j9rO6
$$ plain form
5975 -21 -2 26 10 16 -37 -95 -29 -34 41 -21 -46 -37 -35 -27 -26 21 -2 -45 2 -73 3 -86 -50 -31 -26 -40 16 -30 -90 -16 33 -24 14 -55
6009 -55 -42 17 3 23 3 -7 49 -4 -7 12 -22 -31 -10 19 -38 -37 56 12 28 -18 -2 -6 -26 -17 35 32 16 33 8 -4 9 -11 1
6042 1 -18 -8 11 -30 -31 -18 -35 -4 29 -86 -24 9 2 16 29 -7 -61 57 36 16 11 -34 -10 46 12 -11 -38 3 -6 1 52 10
6074 10 -27 -57 -11 17 31 -6 -12 -2 -48 20 -8 -3 7 25 -54 -5 -11 3 -22 16 22 8 15 44 36 13 -7 -10 26 8 10 -5 -17 34
6108 34 4 -19 -22 -79 1 3 25 -15 10 25 -66 1 6 3 45 -20 55 45 -17 -8 23 17 -23 -7 20 60 34 56 8 -29 -1 -1 19 43
6142 43 -37 -10 2 -3 5 -5 -47 -70 -5 -4 2 3 -21 -30 -12 -36 -3 18 29 25 12 -18 -13 -7 -7 55 1 62 48 20 21 21 -21 11 11 -3 -2
6179 -2 13 -63 -47 -54 -1 34 19 24 27 -8 -22 45 -19 26 8 -42 -23 44 -22 -67 -48 -9 -30 -87 -13 -4 -17 -25 -7 8 -18 -45 23
6212 23 -11 -13 -4 -6 62 -10 -21 29 -25 -22 -29 4 -49 7 -8 33 39 -20 -10 45 -12 -10 -13 3 -18 -9 -21 16 -27 21 -20 -4 -23 -32 34
6247C4j0k6l8M2n9L8J0K7j0j8l3M6N6p3M4Rj9k3N1n6L7j1J3j7l2K7L3p8lJ7O4
6278D2p9J7J1J2l5K0M3n5l0N0KK2L6r6K0k3P0j6k4L0l1M3n1JK1L8j7n1j7O3r5
6309g9O4J4mK1Ql4M5n0nJ1n2Q5m0Q6j7j5l2nm7NL8jM0n9Pk7J3K8l0QK9K9k9Rk
6344A2K7qk1RK0M9j04L8K5k5l0L9k8l3O0n3N4m9N0k4L0k1k1L0n6KQ2m4qJ8j9k1
6376b0Q7j25P0l8L2j7oK1m1Q4ln9K8Rl7L2j7j7J3%pJ4j8R0j20K8L1l7M5nMj9l2
6409c0rQ2l6l2j4LP1%l6L0j7m4M9n9Q0q9J9kL9k8J5J1k6K4Oj8mK3J1M3o2LJ3k0
6443dLJ0Jj8J9K1l8J1p0N1OL5Qo4L7n6P8o0kK2O1o6j2R2n8k4J5K2j03P6j7M4r7
6476g7L7K5K5L6l8nk4J4N0m0J3pl4j7RO3mk8l8J5M9j8j0n8K8M3l1j2J1rJ5K9j7
$$ plain form
6247 34 24 -2 -40 2 -57 -19 -9 18 8 -10 -43 3 59 -14 30 39 20 -3 48 -8 29 18 31 14 -18 9 42 -36 -39 -22 42
6278 42 -37 -20 -9 3 -32 -12 31 -24 -54 -4 -2 20 56 -40 -20 -43 27 11 -13 17 -14 29 -22 -21 0 38 21 -30 -47 16 -79
6309 -79 -15 -1 -5 16 24 -10 35 -15 -20 -9 -61 24 -16 70 53 38 6 1 -46 -41 -3 -4 36 -23 -16 -43 -30 -2 -32 -24 5 34 5 14 12
6344 12 39 31 10 19 39 88 -16 22 47 22 -8 31 3 -30 30 -23 31 -18 32 8 38 17 -4 26 -30 -28 54 10 2 20 1 -20
6376 -20 67 -58 12 -26 6 -11 -17 4 -37 47 44 -15 13 22 -15 17 0 -17 -4 -4 -11 3 -15 75 -45 -17 14 -23 22 17 21 2 -30
6409 -30 -39 43 7 -25 -39 -36 35 35 -1 29 12 -32 17 -42 38 -51 -32 -34 5 -23 -8 3 -23 1 7 -11 -15 8 19 62 0 3 16 -4
6443 -4 -1 9 10 -8 11 32 -6 5 -65 -14 -8 27 35 -29 8 -48 30 -30 -32 -10 51 -15 -27 65 7 -17 -2 20 -83 -7 -24 20 -77
6476 -77 -40 -15 10 46 8 3 -21 -7 43 3 16 9 -25 -42 -33 30 26 -2 -40 -25 24 6 -4 -62 -34 9 -22 -34 -23 -32 -17 12 -5
6509ej7J0RL3p7M4N0k6m3J0M3k9L6J2o9NJ1M3n4m7O8Nl6j5L2k7J5j5M9qJ0l1m7
6542f1O3O1q8O8m0L1Pn6K7k6L9m6N0nl4M4J0n8P7m2Km0MJ5K5jo7J6L5l3Rl2O2
6575A6m8lQL6j10J02K3q4M7%mL4j0ok0j7k8O3l5J3P5n3l3M1l4N1Mk7Nl9L9kk6
6608b2M2L1m3o1N9m3P2r4O0L4m8J2oM6r9k9O0OL4om0M3j2l4L0JJ7%L1p3O4n6O1
6641C7j8mL4j7Mqp2JL3mO4o2Lk9mOpP0J1o0L6j6K1n8Jm5N3L5m3K2L7m7K4N8o7
6676a1N2nn4J0J5l5N8m8J6J4J1j8j7J2J6p2L2K3pJ5pj1j4O3l5MKm2M0J4l9m9K0
6709d7K7L3k0jj5M1m4M1l8L9PMn3L9m4O9k4m7PL3K7k5j9j6J8L8Km9K7j6J1o7L4
6742b8mM2pk4KJ9o2Q2kj9j7%j7J1K1Qn3N9k1m4L7L3m2K2K2Qo9N0l0K4P8j11Q2
$$ plain form
6509 -5 -22 -12 -3 30 -47 -3 47 21 -22 -12 31 2 38 50 -19 -14 -3 40 -14 -61 7 12 -24 -39 -7 -34 -19 -34 15 7 17 -14 -61
6542 -61 2 63 -25 43 3 34 41 -15 12 -14 25 -21 29 24 -10 34 44 -14 63 21 23 -17 -13 2 27 26 -41 -25 10 -23 -14 -46 16
6575 16 -32 -35 -27 9 -101 1 24 -60 -13 -13 -17 17 7 1 -19 -36 -64 -1 -36 -23 52 -1 -34 7 -27 24 28 1 6 -33 6 4 -22
6608 -22 20 51 8 -53 6 -37 35 -59 1 35 -13 -1 -7 39 -60 -89 -29 -23 11 5 -35 8 -4 -38 -8 -7 10 10 41 -32 32 -24 37
6641 37 19 15 49 32 36 28 -44 -43 -10 -14 50 -12 -9 -38 -42 -36 -43 27 38 -22 14 -2 19 -39 -38 -83 -30 5 -38 -16 21 -26 -2 56 -11
6676 -11 41 36 -18 -8 7 -28 30 -18 -2 12 23 5 -12 0 16 -56 -24 -1 -8 7 0 -11 -25 38 3 7 9 -33 7 21 -18 -67 -47
6709 -47 -20 13 -7 -8 -23 18 -26 15 -23 16 23 27 -26 13 -31 38 14 -33 -26 7 34 9 -10 -26 -8 30 32 -17 10 -6 5 -62 -28
6742 -28 -32 10 3 -21 -19 0 -62 20 18 -1 -18 -18 -35 -24 -3 5 -48 11 -10 -54 -17 16 -26 -4 18 26 -43 7 -23 1 79 -32 50
6775E0m7N2m8l0O2m7L7o0J6J5L3j4l4rK8MJ2jn3J7L6m1M4k5k0L5k6J3Ko2Q2l2
6807a1J9n9O3k4l1J6N1jk5lJ6K2m5L1k7q5R5m6L7RL2J4mn3k6J4N0k5l1KK7j4O
6840fl0L4l4K2k1Jk7J7M5k3L7Jq7P9j7K7m5Q1n7J2J4o0M9k3Moo2M4mP1o0M9qJ2
6874B9o4P0n9J4j0K7%J0J6k1K5l2k7K9K8j7l6N1k5K5Qo5O9k1m3M3n2J4P2n0J1
6905A9l0ol2K3L5m7P2q9O0m5J9N2q9j5O9J0l2LJ1M0l7M0j01J12k9J7Ml6n8N6Q
6936DRl3L8K1K3p3J9l9L3P2j04J9J9J1l0l9N4K6j3k4J5l9k0M7l1K4ll0oJ2j3Q5
6968C4p9P7j3lmj9Lp3Q2j0J0Nj4N5r1j1J12n1Nj2j8K5n5O1K7n7OJ0N8j16M6L2
7000B2K4r2J1K6n9P4m9N4j7J6n7J4nQ8o8M8on2kJ0l7N9N3l1j3o0P5n2K5k6L0K4
$$ plain form
6775 50 3 55 7 -23 39 -8 29 -31 -15 0 33 19 -15 -24 4 8 20 19 -34 -17 19 -22 22 -3 -23 12 -14 -1 1 -61 21 -11
6807 -11 8 -51 12 -12 -43 -27 24 23 -2 -5 11 33 -12 19 -8 -93 2 -44 -7 2 34 48 44 -9 -35 -21 29 4 -27 -25 2 -12 -6
6840 -6 -36 -2 -36 -14 -35 -34 -61 -44 1 -22 15 16 -71 8 -9 18 -27 54 -3 9 23 -37 12 -11 -7 -13 -75 -31 -35 36 -24 25 17 29
6874 29 -35 35 -24 -10 -20 7 7 17 33 12 37 5 -22 7 35 18 -18 33 8 33 41 -24 45 24 -19 24 -28 -14 58 8 19
6905 19 -11 -17 -49 -26 9 -38 34 -55 5 -40 -21 31 -58 -73 -4 6 -26 -23 -12 28 -9 31 -70 42 13 30 34 -2 -60 -4 4
6936 4 13 -20 18 39 62 -11 8 -31 2 74 -30 -11 8 19 -11 -50 4 30 17 -7 8 -31 -51 -4 -35 -11 -14 -44 -50 -38 -51 34
6968 34 -45 32 19 16 12 -7 -4 -77 5 -5 5 10 -4 51 -40 -51 61 10 15 3 -15 10 -45 16 43 -14 -8 2 60 -56 -10 22
7000 22 46 -46 -35 -9 -68 6 -43 11 -6 10 -47 -33 -38 50 -18 30 24 -28 -30 -20 -57 2 55 24 11 -49 26 -26 -1 -27 3 27
7032B7k7k0N9n1l9L4lK9pM0m9j5l1jK1ML9n7O7n8N4k5R3o8LMk1JJ0l4K0J1mL6
7066D2m2J6l3O2l1k2J4J6k1mj4Kj4N1n6mK6QO3l4k8j9Rl2L8n9LO7mK3k2K6k5j0
7100hj2M0m8KjJ3J2pn5K3J5J7OK1L2n2L2k5KL3l3k4K5l2J6lM3lOl0k5K4O8r6N0
7135B6l1K0o4N8oK1J8k8j6K6k4Rk0J3M3m9rJ8J7l1M9m5K0l1K1Jl5PJR8q5qMJ4
7169Bl3M2j8J9Pn6M0K6o1M1k9nrlL5P4j04N1K3j3l8J0m1%L4M1j10R6j7j3Ll0L3
7202cK1n1M0l2j6L1l6pL8K1k8L5j2LK7p0QL7K8lm4l3J8K1K5r3J04j4j2m9N9N4
7234F7l2n6O4o1NL8n2k2K7nL6Pk9K9n4lM3MoJ4k3L4j4PK7j8k5K6l0j1j2K4K8m5
7268a8L6LJ2m5K1K1j2k4j4K0j1L4j0j3K3L0o1J4j1K4j9j9JJ6j3L9j6l0L9k4L2
$$ plain form
7032 27 0 -20 39 -12 -51 -17 -20 9 2 42 -7 -22 -53 -54 -33 -29 10 -47 20 -38 16 -9 84 16 19 23 2 3 13 -21 -1 10 6 42
7066 42 0 16 -17 45 14 -8 6 22 1 -3 -17 -15 -29 22 -34 -38 -12 -4 59 25 -3 -22 -13 -45 -7 -66 -63 4 0 23 1 27 2 -8
7100 -8 -20 20 -28 -26 -27 -14 -2 -9 -64 -41 -26 -9 -3 18 50 -2 30 5 7 40 7 -17 8 -24 -8 -11 32 29 35 5 -20 4 72 -24 26
7135 26 -5 15 -49 9 3 24 42 14 -2 24 0 9 -11 2 45 -4 -13 5 22 -9 40 -5 15 -16 5 6 -29 -22 -21 77 -8 -16 -12 2
7169 2 -31 11 -7 12 19 -37 3 29 -32 9 -20 -25 -34 -37 -2 72 -32 19 42 29 -9 1 -40 -40 -6 35 -75 21 4 -9 -6 -36 -3
7202 -3 18 -33 7 -25 -41 -10 -46 -53 -15 6 -22 13 1 4 31 -39 -31 6 34 31 -13 -46 -28 -7 18 -75 29 15 3 -46 13 67
7234 67 35 -21 43 -18 -13 25 -27 -49 -22 -27 9 16 -13 16 -38 -41 2 6 0 14 -9 25 11 18 45 27 2 28 -2 -13 -25 -1 27 -18
7268 -18 18 21 33 -12 9 30 18 -6 -20 0 -11 23 13 0 23 53 -8 6 -5 19 0 -19 -18 -2 -15 24 8 -22 17 -7 25
7299B5Nl5l7N3L4n8j2M9l7J1K4nk4l9M3P7p0K8n1J1M3K2q1M6m1J7K0n6P9q8N2
7330EM1l0jj2j9J1pM7m5M8n2NK8l5j0N6n1M1K6p1L8L1j5oJ3l5KM5l9lK5q3K1K0
7364a1J6J1j5P0o4J3km1j5j8O9j0L1o4M3%k7o2J07j9nl0l9Q9jk1K4k6j6k3K5R
7396bJ5k7lO2m9L6j1l3mM3p4L6J4Nk4jK2L3n3K8m1P4r6N0J8L4j5m9K5l7kO2m4
7429hJ1OM2j02K0O5ll8mM2KJ7m4P4p7k1L2j2K3k2ll8L8j1N0ok7KJ3m5Lk9N5j7
7463a2o0J07n7JM1l6qj4L6Jpm7nPP0K9q0jRJ1jM6jmppkmP0n1o2j0O9pk0L2Jn4
7501b7mO0n8L0j2l6L0MK0k7M4j6rj2lj9P5l3qll2Q7o9L1Jpn0J15j14M8k7KJ2L9
7535C2o7L5JMJ0L6p7P8n8l3M8K5n6Lk0O7p7K1N6k7m0N7k3j9L9n0J0j7rL7KJ4J8
$$ plain form
7299 25 30 -5 -42 11 45 -13 -25 24 -13 -2 22 17 -7 -46 -3 74 4 32 -19 -8 35 57 -24 22 -19 -2 18 -38 41 -47 5
7330 5 46 16 15 3 -16 -5 -12 35 -10 38 -14 -9 19 -16 -26 30 -21 20 46 -25 13 44 29 23 36 1 3 48 9 6 31 -52 -31 -11
7364 -11 5 16 1 71 7 20 18 -23 -38 -56 13 3 34 -30 13 13 -14 -76 31 12 7 -23 -62 27 26 5 29 3 -13 -36 -11 -2
7396 -2 13 -14 -17 45 -4 32 21 -12 -16 27 -47 -11 3 8 -16 -17 5 38 -15 13 -28 46 -50 0 18 52 37 -12 13 -24 -26 36 -8
7429 -8 3 9 51 -51 -31 34 31 -7 -11 31 33 50 6 80 3 -18 14 2 25 3 0 -38 0 -11 39 33 6 8 21 -24 -21 -50 5 -12
7463 -12 -72 35 -22 -21 20 -16 -24 -38 -2 -1 -8 -55 -60 -53 17 46 -34 -35 -26 -15 -16 30 29 25 18 11 9 5 75 24 -38 -48 21 14 -6 26 27 -27
7501 -27 -31 29 -29 1 -11 -47 -17 -13 7 -20 24 8 -1 -13 -16 -35 40 7 -1 -4 -36 51 -18 13 14 7 -43 72 -42 6 -21 -19 -7 32
7535 32 -35 0 1 5 15 51 -26 52 -6 -39 9 34 -22 -19 -39 28 -49 -28 28 1 -39 18 -5 -24 15 -35 -25 -42 -51 -14 -12 2 20
7568B0M0l4r5N4L2J7o8K9k3M0m1J8j5L2m1J8j9M9Jlk0j7K0lN1l6q2M4P3q2N0Q
7600A7K2k3l2m0P4l7L8j0kk5kJ3M8m8l7P1m8k4N0n3P5n6P5o0Nk0RJ4J2Jj3N0l9
7633Em5N1J2rk7NJ5j9J3M1m9l7N9k2L5l4KK3o1P3j7qn4ML2M8p2JM2j0j7M1p7O7
7667A1j0K3jm0J7j7k4M1m9M5pL0p0L0K2j7J7k7O2o3L5k1O0k7k0N6q6M2pk9J9J1
7699FK0o8lK8J2J6N0j8o5N6oKl2l2K1N7p1J0M8r0Q6kj6m8LK0J4l1K6J9k4K7K4
7732C9p8N2Nj1JJ9j9J2o2K4j7J8J7L0pK4k1ml1Kk2Ol2nl1J0L6O5j5rjql0M7k8
7767b4JrK9k9k8R8n1k2J9N7o3K8Pk4oK2K4Lk7L5k3m9LO8on9K7j7Pj1L1k1m6P7
7801B1o4L0k3K3j2NM6j3j3o1M9J0l2O5o7J5l9R6k7m7L8j9K4L1k5M9k3j20N2L8
$$ plain form
7568 20 60 26 -69 -15 17 34 -34 -5 -28 12 -29 -11 -26 6 -35 -17 -36 13 14 11 -9 -26 -6 -9 42 6 -76 -32 41 -41 9 17
7600 17 39 16 -16 -56 18 -19 19 9 7 -18 -20 -7 41 -7 -44 27 -21 -45 5 -48 27 -29 46 -14 -9 -29 -20 -6 6 7 -6 44 5
7633 5 -40 11 23 14 -13 -8 7 -12 1 42 -7 -44 15 -7 28 -6 -4 19 -42 31 14 6 -48 -44 -12 36 -36 -35 7 -3 -20 21 -56 11
7667 11 1 24 23 -17 0 -17 -41 0 -49 -4 -11 19 -51 -21 1 -16 1 -26 36 -27 8 -13 47 20 0 56 -30 12 5 -24 -5 6
7699 6 26 -42 -45 -17 -5 11 61 43 -22 34 28 30 -2 -34 -13 44 -27 -17 31 -59 27 25 9 -39 -36 -16 -2 -33 -7 12 -12 15 39
7732 39 -39 13 18 7 8 27 8 20 -42 -18 -35 -17 0 30 23 47 26 22 -9 -7 -29 -23 -55 -60 -91 -81 -45 20 5 -4 -5 -13 -43 4 -24
7767 -24 -23 -32 -3 -32 -60 38 -13 -35 -16 41 -22 6 13 -11 -17 5 29 32 5 40 17 -32 -29 39 33 -26 1 -16 -9 -20 11 -10 -56 21
7801 21 -43 -13 -36 -13 -25 -20 26 13 0 -61 -12 -2 -34 31 -36 -21 -60 36 9 -38 0 -19 5 36 11 60 37 -83 -31 7
7831GK4J8p1J2O3r6K2K7J2n1j3P1k0L0jk0l5mMkk1J8L5ln1M3LJ9QJn4%j8P6rj8
7867FMkm0M9Km0N5Nm6N1n7kj0N4j2rkj8N3q4J4LK0J6k4kJ2L8k0l3L6k5o0N7m1
7902e2K0K5K9rn1N0J0J5m6K5k0Qm5K7koL6m7MK4J7Jno0L0K4k4K3K7o3j6K8P8o8
7936a3M1p2M6M5k7k9rJK0k6K6K4lo9K7M8k3%r%l9J2m4Q1K1m7L2m3L5K4n9M5l0
7969a4J2o0J16m9Pn4K6K6J9l8J2jl3M0m4P2l4nmk1j6Q4l4Pk9M6rK8n7r8J15K0
8001C0l6k2k1J1M9l1J3qM0m9j9O1n5k7L0K9n7K9M8Ok9pL4Rm1k9O0k4L7m6lj1O1
8034C2l6j7K3J8K4l2k2K3l0K5nnj3jL5J1p5P4l5K3o2M7L1l1m4J5Rm2K0L1L5l2
8066fOJ0Lp4M3L1RMm2pO9n4lK9K6p1P0j2l7k6L4j6J8j7J6J3j2KJ1J5j2k3pK5k8
$$ plain form
7831 7 31 49 -22 -10 53 -43 -21 6 18 -33 -46 25 5 35 34 14 -21 -25 -21 -23 -44 -26 9 6 -45 -2 1 20 28 29 -25 -25 -43 33 24 6
7867 6 10 8 -32 17 19 -21 34 39 -7 44 -13 -15 -25 29 17 8 6 -12 41 -43 -29 -26 -6 10 -14 -16 -4 34 14 -19 17 -8 -68 -11 -52
7902 -52 -32 -7 22 13 -38 12 22 37 -9 16 -4 4 -41 -14 -16 -22 14 -33 -29 -5 12 13 8 -52 -22 2 -22 1 28 -35 -51 -23 55 -13
7936 -13 28 -44 2 47 20 -9 -18 -17 3 -23 3 27 24 -45 -18 30 7 7 -2 -2 -41 -29 -73 8 29 -18 14 -29 6 30 -29 16 -14
7969 -14 -2 -62 54 5 12 -42 -16 10 29 -9 3 2 -31 9 -35 37 3 -2 -6 -27 -43 41 7 14 -15 31 22 50 -7 -105 10 30
8001 30 -6 -28 -49 -38 11 -20 -7 -15 25 -24 -43 18 -37 -64 -34 -5 -62 -33 15 21 -8 -15 19 28 -13 -42 18 -6 31 -15 -18 -29 32
8034 32 -4 -21 2 20 44 12 -10 13 -17 8 3 -2 -15 -16 19 30 -45 29 -6 17 -45 2 33 2 -42 -27 -18 -60 -40 -9 26 -6
8066 -6 0 10 13 -61 -18 13 22 26 -16 -23 46 -8 -11 18 44 -27 43 31 -6 -32 2 -14 4 -13 3 16 4 6 17 32 20 -3 -10 15 -13
8101a3L1J8r6Q5j5LJ9l5J6j6l1K6j9j1J7K4K0k6m2N4l2k6R1J8p2L5K0l6qjk2L3
8133Io2Q8l3j0J1p1K8J2L5NK2q7L7kJ9K4nJj3n5P9n5O7o5KM3n6M8Ojl9J2mrN1
8168C2p8L5J3K8m9l7qN8K3k8M2k3M7nm7L8k3m8J9K7qk0R
$$ plain form
8101 -13 18 36 -60 25 10 13 32 -3 13 -3 -34 -8 -27 -38 -21 3 23 -3 -45 9 -23 -49 42 60 -12 23 43 7 -1 -2 -24 9
8133 9 -53 35 2 -8 3 -68 -40 -28 7 12 34 -53 -16 -18 1 25 20 21 8 -47 32 -23 44 -21 -19 24 -32 16 22 21 -18 -6 -10 -19 32
8168 32 -46 -11 2 30 -19 -56 -64 -6 17 -11 31 8 55 50 3 41 18 -30 -11 16 8 -12 -3
8191c
$$ Imaginary data points
##PAGE= N=2
##DATA TABLE= (X++(I..I)), XYDATA
0@%%%%%%%%%%qJ6j6J6k4L2m0M8n6P2q8J04j21J40j64J94k26K60l01L49l99M55
32B43n18N87o64P49q43R44j055J179j314J460j621J797j985K194k424K673k946
49a544L246l576L940m344M790n289N853o489P216q060R051j0233J1668j3458J5763
64H534j8858K3255l0020M1858o8333K27685r3900m82269M36995K68498m06335
75i2890j71247M24518k573l30071J05338K43850k20835j01949K65549j3585k93652
86a87547J40650K62236k23758k15837K92804J37512l13432o4590L08619j4897
96A21760k64510P6282K06491j28560j34999J53671O7540j61680l110J50546m3481
107C9950j30741P3362J01829q3031p2141P9241M3942o2776k0144M0838q6j6911
$$ plain form
0 0 0 0 0 0 0 0 0 0 0 0 -8 8 -8 8 -16 16 -24 24 -32 40 -48 56 -65 75 -89 105 -121 139 -162 187 -212 243
32 243 -275 312 -352 397 -446 498 -557 622 -692 768 -853 944 -1041 1153 -1271 1402 -1544
49 -1544 1702 -1874 2066 -2278 2512 -2777 3076 -3413 3803 -4257 4794 -5439 6229 -7229 8534
64 8534 -10324 12931 -17089 24769 -43564 184121 90221 -392048 44947 313445 -92890
75 -92890 -264137 160381 157808 -172263 -66925 176925 -43910 -145859 119690 106105 -187547
86 -187547 -46897 215339 -8419 -224256 68548 206060 -107372 -171962 136657 121760
96 121760 -142750 -66468 140023 11463 -123536 30135 97675 -64005 -67115 83431 39950
107 39950 -90791 -17429 84400 1369 -70772 8469 52411 -10365 -30509 10329 10243 -6668
119f668J5254o442k9548K7484M3321m4730n7343N8071O9968o7843q0202P5173
131c505Q8089p8074r0915P6371Q8946o9281q2024N6541P0477l9078n6504J7559
143b1398M1068N624k7853k9699J7741N2417j1060p1221P957Q3772p645q7171J1573
156c5895Q4182j6631p5559J9267O0823j9046m2036J5997K2372j1321n295M396
168A254p278K968J3902j0572j5450J6360J3199j7867o015J6909l466j4239J3077
181B782J1420k0717q647K5813O229k9654o152L1677R051l2374j4812L1373K1465
194B7454l0668k8915L0404L6244k9268m0916K8471M3458k5821m2801K0800L8170
206B6612j3609l1245L987K3293Q070j5763k1904Q820L5085m715m6757L463N6040
$$ plain form
119 -6668 8586 2144 -27404 80 43401 -1329 -58672 -601 69367 1524 -78678 -3505
131 -3505 84584 6510 -84405 -8034 80912 11631 -70393 -13852 56625 17547 -38957 -21398
143 -21398 19670 25294 -2559 -32258 -14517 37900 26840 -44381 -36424 47348 39703 -47468 -35895
156 -35895 48287 31656 -43903 -24636 36187 17141 -24895 -8898 13474 2153 -3142 1254
168 1254 -6024 -3056 10846 274 -15176 1184 14383 -3484 -9499 7410 3944 -10295 2782
181 2782 14202 -6515 -15162 10651 16880 -12774 -18926 12751 21802 -10572 -25384 5989 27454
194 27454 -3214 -32129 -1725 34519 5251 -35665 -7194 36264 10443 -32358 -11558 26612
206 26612 13003 -18242 -14255 9038 17108 1345 -20559 -11739 23346 18631 -28126 -24663 31377
219C1377m183o0587P126O0857j0878n6433J4466M8062j6812l6558J6954K2902
231A6293j5254r424J0787k967m739J2537k785j8203J1032J9994j8877j7768K5620
244F246J2514k9353l634L1387o579l1386J5993K8498k4392k3751L1000J7609l5511
257a1359j1837L6113O101l3506q86K8238k869j9972N049J0531n194M22L160j1761
271g770J093K2957o449l2246J2395L7920j9629m0998K6419M0697l1507l7042L4211
284E1L0410l4016k1553L1207J2124k5107k948J6549m388o197R333m925j1756J5475
298D259J1074k4603q248L0650K811l3865L841L4418j0214l1636J5924K6387j9965
311H33j9382K2423J2072k2301m958K0165q75j6570M765J1349p324o086P530J169
$$ plain form
219 31377 27194 -33393 -26267 34590 23712 -32721 -18255 29807 12995 -23563 -6609 16293
231 16293 1039 -8385 2402 -565 -5304 7233 4448 -13755 -2723 17271 -1606 -19374 6246
244 6246 18760 -10593 -14227 17160 10581 -20805 -4812 23686 -706 -24457 6543 24152 -11359
257 -11359 -23196 12917 19018 -14488 -15374 12864 9995 -9977 -4928 5603 409 831 3991 -7770
271 -7770 -6677 16280 9831 -22415 -10020 27900 8271 -32727 -6308 34389 2882 -34160 51
284 51 30461 -3555 -25108 6099 18223 -6884 -9832 6717 2329 -3868 5465 540 -11216 4259
298 4259 15333 -9270 -17518 13132 15943 -17922 -14081 20337 10123 -21513 -5589 20798 833
311 833 -18549 3874 15946 -6355 -11313 8852 7977 -8593 -3828 7521 197 -5889 1641 2810
325B810o455L251L707o728k81R615k706j0938N823J1679q592j1865J0772J2168
339A2260j1979j2143J2377J1326j2634j0945J2421R951j1939q983J1031P915r506
352h48o314P469M666n118l034L065K358l51j853k693J373N155j358p346J665Q839
368E675k391j0165K801J0921l081j1345L384J1673l142j1551L159J1572l049j1541
382g080L337J1582m020j1112M504R549n519p647O252M758o476j106O116l142m633
397d637P175J945j0403K395J2986o990j3511J1856J1821j6435q420J9828L118
410A0728k1569L033K0742r407j7742J4776J2271j8702n252K0599j948j9346Q930
423b887J5656j4703r277J8260K025j8833N576J6143j3035j1386J8650M696k1634
$$ plain form
325 2810 -3645 -394 3313 -3415 -3696 5919 3213 -7725 -1902 9777 1185 -10680 92 12260
339 12260 281 -11862 515 11841 -793 -11738 683 10634 -1305 -10288 743 8658 -848
352 -848 -7162 307 4973 -145 -3179 -114 2244 1893 40 -2653 -1280 3875 2517 -4829 -3164 5675
368 5675 3284 -6881 -4080 6841 3760 -7585 -4201 7472 4330 -7221 -4062 7510 4461 -7080
382 -7080 -3743 7839 3819 -7293 -2789 6760 1241 -6406 -154 4604 -1872 -2978 3138 -4 -4637
397 -4637 2538 4483 -5920 -3525 9461 2471 -11040 816 12637 -3798 -12218 7610 10728
410 10728 -10841 -7808 12934 3527 -14215 561 12832 -5870 -11122 9477 7529 -11817 -2887
423 -2887 12769 -1934 -11211 7049 9074 -9759 -4183 11960 -1075 -12461 6189 10885 -10749
436a0749K586K1612r761j8945J5289J4034j8559p689J9475J706j7014M077J2456
449H518q559o972J0598J085j0201M859P895r836m951J2428J369j3209K215J2072
463G311m902r522O539O609o525l380N215O01l164J608R66k618P80J927k442q62
479a859L504k30l402R12K171j603m16J786o85p63J833l65k170J658J765k792j009
496a665L145l11k603J771J252l539j13M049j480l610L229K827m386j447M735J10
512A964l948J747K851l200j098L789o98l764K460K607m251j169N416m86o015J959
528a836N213l433l739M913K122m995j77M262j808k924L591J337m413L27M383j957
544H66l699L001K139l948r82M208K07l458O57K544j394j802J597J671j078j160
$$ plain form
436 -10749 -8163 13449 3688 -15257 32 14066 -4493 -12182 7293 8999 -8015 -3938 8518
449 8518 -41 -7013 3585 4670 -5531 -672 7223 -2613 -7564 4864 6233 -6976 -4761 7311
463 7311 2409 -7113 -574 6035 -490 -3870 1345 1946 -1218 390 1356 -1262 -482 1445 -997 -1859
479 -1859 1645 1415 -1987 -1075 1096 -507 -923 863 178 -585 1248 883 -1287 371 2136 -656 -1665
496 -1665 1480 1169 -1434 337 1589 -1950 -2063 1986 506 -3104 125 2952 -1434 -2881 1854 1964
512 1964 -1984 -237 2614 -586 -1684 2105 1407 -2357 103 2710 -1541 -2710 2706 2220 -3795 -1836
528 -1836 3377 -56 -3795 1118 3240 -1755 -1932 2330 522 -2402 1189 2526 -1887 -1560 2823 866
544 866 -2833 168 2307 -1641 -2623 1585 1792 -1666 -1009 1535 141 -1661 -64 1607 529 -631
560f31O59N87p23m15J032M73j594o56J901K81k301L74K434j306k299K311K263
577B390k915j295L489r6l949J536L973k420l256L172J738m019k89M087j356l877
593c087K903K877l927j205M476m76m424K144L725l263j898M273p0m549J663L734
609B896l071k137L919Om426J777L654l346k191M480M19m540J509L952k919k482
625b500L972N16m391J870M169l638l120M604J061n641J084N658k905m775M373
640C37K947n528p11O059j319n449L440M191n065k113O285m33o661K602O166m411
656C37m827N617K466o521l94O615j535n403L313L776m688j801N512J25n434J657
672a185M848l124l791M163K348n119j145N041j09m334J397L382k791k373L440
$$ plain form
560 -631 28 615 -108 -523 509 982 -612 -1268 633 914 -1387 -1013 1421 115 -2184 127 2390
577 2390 -525 -1820 1669 1573 -2376 -840 3133 713 -2543 629 2367 -1652 -1941 2146 790 -3087
593 -3087 -184 2693 -1234 -2439 2037 1561 -2863 -719 3006 -257 -2155 2118 2048 -2501 -838 2896
609 2896 -175 -2312 1607 1613 -2813 -1036 2618 -728 -2919 1561 1980 -2560 -1051 2901 -18 -2500
625 -2500 1472 1988 -2403 -533 3636 -2 -3122 1482 2543 -3098 -2014 3644 739 -4036 337
640 337 3284 -2244 -2955 3104 1785 -3664 -224 3967 -1098 -3211 3074 2641 -4020 -1418 4748 337
656 337 -4490 1127 3593 -2928 -3322 3293 1758 -3645 -332 3444 -1244 -3045 2467 2592 -2842 -1185
672 -1185 3663 539 -3252 911 3259 -1860 -3005 2036 1927 -2407 -1010 2372 -419 -2792 648
687F48J215l406M89L475j868k960K807K387l476j407L417L63l216N30K763j321
703D40k140J394J104j468O1J655o95j459R64J019j237k96J831J21k058p6J522
720F82r3j100K98O51n80m95M58L68j83j93J5k36n8N79N74j93p49J14O09j74p45
741d51N26R15q41j107Q10R89r40o42P42L3o81M85O75p35k07J047l07j150R91J220
761A372j328j036J283N96j110j32O69k47n70L39M8k03M17Q9q54J79R60j49p01
780c78N60L82p08k5O99k72n31P00N4j165J58J357m68j242O02Q39j015m28J251
799C70J61q87L40N29p96j7J257l55j294M60J030q47o16Q76M62p36o82O4L97O77
819C93k50q24O59R73j118j013J685P84j826r6J805q04j358J605N16k434J65K815
$$ plain form
687 648 1863 -1543 -1054 2421 553 -2407 400 2787 -689 -2096 1321 1684 -1532 -1002 1761 440
703 440 -1700 -306 798 -670 -609 1046 351 -1108 -144 875 -362 -658 1173 1294 -764 -840 682
720 682 589 -511 -213 438 -142 -637 -179 189 6 -187 -172 -408 -466 113 687 494 -255 -141 468 294 -451
741 -451 75 990 149 -958 -148 841 -99 -741 1 34 -647 -162 513 -222 -429 618 311 -839 152 1372
761 1372 44 -992 291 887 -223 -355 314 67 -503 -164 -116 -319 98 187 -667 -488 472 323 -378
780 -378 182 564 -144 -169 530 258 -273 427 481 -684 -526 831 363 -879 -277 562 -453 -881 370
799 370 531 -356 -16 513 -283 -300 957 602 -692 -232 798 -49 -665 211 673 -63 -745 -681 -284 393
819 393 143 -681 -22 951 -167 -1180 505 1289 -537 -633 1172 368 -990 615 1131 -1303 -1138 1677
837A677j389k664K632K196l679j483M111N55m089R32L928k114l072L144J803l914
853a426m23M269j143m071K555L361l971k554M460J338m534K22M432j417l621K309
869b14K432k839r33L092k22l002J418K567k419k045K809J176l186l84L213k26
885A237k840M77K209p71j421J217R28j239k82J021l97p17J029M98j394l52J462
902F65j04j560L76J362n36j152P47P51p08r0O51m13m55R49K48j185J62J501p57
921D52j628Q70J485j313j091J552M75j829Q0J807o75j321J570Q03k206n2K680
938A659p59k769J686K664k455k180K925J205l359l15L170p33k645J826J909k708
954h79j009L299j28l463J399L441k283k726K996J935l715j064L832Q4l511Q70
$$ plain form
837 1677 288 -2376 256 2452 -1227 -2710 1401 1956 -2133 -1201 2727 613 -2459 685 2488 -1426
853 -1426 -1849 2420 1277 -2794 -239 3122 -849 -3403 1057 2395 -2139 -1917 2515 1098 -2523 -214
869 -214 2218 -621 -1554 1538 1316 -1686 -268 2299 -120 -2165 644 1820 -1366 -1750 1463 1237
885 1237 -1603 -1126 1083 312 -1109 108 1036 -203 -485 536 139 -578 451 949 -445 -797 665
902 665 561 -999 -623 739 203 -949 -202 549 -159 -249 402 -11 -466 483 731 -454 -292 1209 452
921 452 -1176 -306 1179 -134 -1225 327 802 -1027 -947 860 185 -1136 434 1237 -969 -1021 1659
938 1659 900 -1869 -183 2481 26 -2154 771 1976 -1383 -1698 1472 739 -1906 -80 1829 -879
954 -879 -1888 1411 1283 -2180 -781 2660 377 -2349 647 2582 -1133 -2197 1635 1719 -1792 -922
970i22K790j978k007K648R20k890K56K992j241k676K122K286k758j592L057Q94
986A901k960M7K563r29k158J311J312j528n03J720l56j670J108J323j601q40J850
1003E90O06j728p7J603k60j390L10Q61l95k26K95l08k83M96L3p23J79Q51k97o07
1023d70M79M11m48j54L62j81M8M83l44p43P10O79j284p03J598N12j743p0J668
1042H10m44j478Q38J170r96m64J392k84j410R21J309j500j253K070O80k245k90
1059a174K259k62k336O11K069r27j369J214P67j389j21J431l60j054Q50Q96j282
1076a77o59J373M12j532l13J249K52j060j41R08J9r22k9R04J82n98K5N85l61n06
1096c89N26M73p86k35R61n0j314L94J423r61j475J219J343j424q52J672M36j702
$$ plain form
970 -922 1868 -110 -2117 531 1451 -1439 -1183 1809 568 -2108 14 2300 -458 -2050 1007 1901
986 1901 -1059 -1012 1551 622 -1536 -225 1087 -441 -944 776 420 -1250 -142 1181 -420 -1260 590
1003 590 1196 -532 -609 994 734 -656 -346 515 120 -106 189 -119 -402 94 127 -596 -417 434 137 -470
1023 -470 9 420 -28 -182 180 -1 47 530 186 -557 153 832 -452 -1155 443 955 -788 -858 810
1042 810 366 -1112 -274 896 -100 -564 828 544 -866 55 1364 -136 -1389 681 1361 -884 -1174
1059 -1174 1085 823 -1513 -902 1167 240 -1129 85 852 -537 -658 773 413 -641 209 1105 -177
1076 -177 -836 537 949 -583 -896 353 605 -455 -596 312 331 -591 -620 284 466 -132 -107 478 117 -389
1096 -389 137 610 -176 -411 550 500 -814 -420 1003 42 -1433 -214 1129 -295 -1147 525 961 -741
1114g41J2J471k37j074P87O99j173m25J313q9j188K58J141p07j012Q81P57q85
1132b12o25R72L63p08p9O46M7n37M0K61l7J9N2k34O2q4j42J18J70l54r8N10o9
1155H1n25L54P65p48p00J022O22j066k23J155j79j303M22J208p00j037Q67O66
1173F81j160l37J311M2j353L89J338p86j013J276P48j608l51J622k7j583O24J329
1191A142j200j097J235O54j210q0J054l70r51N99Q18o05l82P65O9p32J67P15k36
1210C55p04K55M22l51k73M38J43n02k13K04J77Q3k6n2L9R3j92j7L66Q5m43P1K73
1233B31k26j60M03q4p28L06O82m49n33P47K88r98k14J119J34q47L22O35n29n54
1253d55O65L31p75J0O78k61p70N49P02q54p53J003N69j109j42J219r0j265K96
$$ plain form
1114 -741 -729 742 505 -569 218 917 -256 -681 632 543 -645 -387 754 47 -965 -84 673 -212
1132 -212 -837 135 498 -210 -289 357 404 -133 -93 168 131 150 202 -32 30 -54 -196 -78 92 -262 -360 150 81
1155 81 -444 -90 675 -73 -773 249 871 -195 -418 737 558 -745 -323 885 185 -852 15 681
1173 681 -479 -816 495 537 -816 -427 911 125 -888 388 1136 -472 -823 799 772 -811 -187 1142
1191 1142 -58 -1155 80 734 -476 -556 498 128 -823 -224 594 -11 -393 372 441 -291 -124 591 355
1210 355 -349 -94 328 -23 -296 142 285 -217 -430 -226 -49 34 8 -44 -5 88 -104 -121 245 330 -113 -42 231
1233 231 5 -155 248 164 -564 -258 424 -25 -558 189 477 -521 -735 384 518 -329 -7 628 99 -455
1253 -455 210 541 -234 -224 454 193 -577 -28 674 -180 -933 70 639 -470 -612 607 517 -748 -452
1272d52J191n31o65Q92L43j233l4J217m64j233R55R37j332o66J585M29j736j10
1290i07J682k23j444P18J388j064r85J173M51j196M1J288o49j215Q78Q54j158
1307c68n61J374K02j395M2J314k83r51M73O79m54l52N86J43n06j19L08m2l26J71
1327f5L70j45o25Q5O63m4q26K89R51l49j050O62J007o74j064Q96Q19q87n97J017
1347D33R6j204K46J042o36q78J190N12j577k69J972j95j943O85K025j219j642
1364a362J612J258j920p64J910J11j770N36J559j143j239J349P34j687k5J923
1380A082l93j920Q82J555j062j139J369P07j487k10J321l37j044O57O46j109k08
1397f90J269k50j123M68R75p12o68R26N13p90j49M70j11k00K71j48l27M00K24
$$ plain form
1272 -452 739 208 -457 435 778 -455 -489 728 264 -969 -14 923 -409 -1075 510 939 -797 -907
1290 -907 775 552 -892 -174 1214 150 -835 338 789 -407 -366 922 273 -942 -64 790 -368
1307 -368 -929 445 647 -748 -706 608 325 -626 -153 526 72 -280 306 449 -57 -176 132 90 -236 -65
1327 -65 305 160 -465 -380 283 239 -587 -298 653 304 -746 -84 923 249 -815 81 900 13 -584 433
1347 433 529 -675 -429 613 -23 -901 289 801 -776 -1045 927 732 -1211 -526 1499 280 -1362
1364 -1362 250 1508 -412 -1176 734 845 -925 -389 1170 27 -1212 137 871 -816 -841 1082
1380 1082 689 -1231 -349 1206 144 -995 374 1081 -406 -616 705 368 -676 -19 627 -482 -690
1397 -690 579 329 -794 -326 649 -63 -731 195 708 -82 -231 239 128 -72 199 51 -276 124 348
1416C48o85k1P60k34q88M69P57m57l98N13K05p45K28N67l12k78O01M7j010J72
1436c61R48m49p95P15N89r01l88Q37J30q11J71P08m18l15O98J93q25p3Q43k26
1456B70p82M67P10o13n49M97J98m63K5L67j59j28L01j02l45L57K75n09j49P14
1476C82J26o65p2O03k48n74L37L09k76r2L80l43m50O51K42o96Q0J034m14r89O60
1497a5Q68j006o03J243K57j300L6J325n58j191Q33R08j196m75J419O9j421L27
1515d80J353p15j071J155O76j269k41J383l06j379O85J212j218q11J489L50j714
1532i01L8J717m38j569R80J352j206j054J432N91j369m9J252m20j064P20P05j042
1550c25l05J150j86j100N79R57j014n83J193K62j222J94J139l59j044P02O23p69
$$ plain form
1416 348 -337 -358 402 168 -720 -251 506 49 -349 164 369 -376 -148 419 107 -171 430 477 -533 -361
1436 -361 587 138 -657 58 647 -254 -642 195 325 -486 -315 393 -25 -340 358 551 -274 -347 496 270
1456 270 -512 -45 665 52 -497 0 198 -265 -240 127 -32 -160 141 39 -306 51 326 -183 -332 382
1476 382 508 -157 -229 374 126 -448 -111 198 -78 -170 210 -133 -583 68 310 -386 -306 728 314 -675 -15
1497 -15 853 -153 -756 487 744 -556 -520 805 247 -944 -111 797 -399 -874 545 614 -807 -480
1515 -480 873 158 -913 242 918 -351 -592 791 485 -894 -209 1003 -215 -1026 463 813 -901
1532 -901 -863 854 416 -1153 -173 1179 -27 -1081 351 942 -427 -476 776 356 -708 12 717 -325
1550 -325 -630 520 334 -766 -187 770 -244 -827 366 628 -594 -400 739 380 -664 38 661 -108
1568a08l77Q08j1m85J00K82m58j06N38j95l69O08J41q84K36R84n65q16R46N60
1588H29j225j49J298k10j296N84Q49j027l58J327j28j342P06J006j307n97J799
1605G59J02j851N00J951j227j696J783J205k221n61K387k24k281R43J815j545
1621a61j341J894O57j997L67J929j138j596J691R49k029J9K255q65k133J462J619
1638A582k034r96K329J84k361M87K058r58j611J396Q90j620m2J664n46j239R17
1655A00P58j355j25J591n70j396J058J050j597n89J694K4j709N49J628r73j055
1672i17J160N20j250J02J122n09p31P79K66j026J55J049p81q45J143M80j345p5
1690g03J425m35j236P95J059r12o34J001K62j073K14P92m57m88O72k9q11L62P16
$$ plain form
1568 -108 -485 323 312 -173 -73 209 -249 -355 183 -12 -381 227 368 -516 -280 704 139 -677 269 829
1588 829 -396 -545 753 543 -753 -169 680 -347 -705 622 494 -848 -142 864 -443 -1040 759
1605 759 861 -990 -490 1461 234 -1462 321 1526 -695 -1256 1131 907 -1374 -431 1384 -161
1621 -161 -1502 392 1049 -948 -581 1348 210 -1386 305 1254 -775 -756 1499 634 -1499 -37 1582
1638 1582 -452 -1448 881 1065 -1296 -809 1249 291 -1320 76 966 -654 -696 968 422 -817 100
1655 100 858 -497 -622 969 399 -997 61 1111 -486 -1075 619 643 -1066 -517 1111 138 -917
1672 -917 243 763 -487 -385 737 228 -503 276 542 -484 -329 720 -61 -906 237 717 -628 -703
1690 -703 722 287 -949 -154 905 -7 -641 360 622 -451 -237 555 98 -390 282 253 -558 -196 520
1709E20o60n29J001J93j166J91J230n32r98Q12Q01j036m21J220j11j074K96Q45
1727E82o73l67Q32k0r54L16P41o72m38J070J92j243J77J260n92j016R18P89j129
1746b27m32J209J20j232J99Q62m99o65Q38L19q67mP75m25n17Q08L26r69n1J023
1766E91k91q91N56P17q64m25Q64J69q51J60N67l95l74N15J83m18J90K34l61n8
1786a82N12r4m72M18L18n41l29O43J24p40J18N86l87m65O27K87p09K0N70l03l87
1807c86O62K04p75k1Q40l49p09O04N86r31l97R61J60j002J57Q50l98o96N53O16
1827E29n97l57P49J1p18K09Q02m39o29N96L11p32j96Q75n8r29K56Q59n70o58Q02
1848A16M13q23k57R80Pp69J53P25n33n39O62L98p20j74O41j07p20L90O06n48l20
$$ plain form
1709 520 -140 -669 332 525 -641 -450 780 248 -750 62 863 -173 -594 626 515 -559 -263 582
1727 582 -91 -458 374 354 -600 -284 457 -215 -653 417 609 -634 -457 803 211 -805 113 902 -227
1746 -227 -659 550 670 -562 -363 499 0 -665 173 492 -375 -379 396 -29 -546 262 588 -381 -432 591
1766 591 300 -591 -35 682 -182 -607 257 426 -425 -265 302 -93 -467 48 231 -187 3 237 -124 -182
1786 -182 330 236 -236 182 500 -41 -370 273 397 -343 -225 361 -26 -491 136 423 -286 -266 304 1 -386
1807 -386 276 480 -295 -316 524 175 -534 70 656 -275 -672 289 449 -553 -396 454 56 -640 -87 529
1827 529 -68 -425 324 335 -383 -174 628 189 -440 156 467 -265 -461 414 356 -573 -317 542 -28 -686 116
1848 116 529 -294 -551 429 436 -333 -180 545 12 -527 135 533 -187 -361 280 173 -547 -157 449 -99 -419
1869d19N86R9o71J45P19l19n69M46M49n40r0M58j09m48J69K49k40l5L09j43l48
1890c02K98J9k65Q9M65l72k22L77K21m12n9M30j77l28K96J94l98o4L82k02l71
1911d01M15K66m38j93N47L6o72L29O52m75m18N74J69n64n5O15k04n32L05K95l62
1932a11j10M23j65m56L42L09m03m2N58k13n01M01L31m20j37N33j18n91K44M44
1952C18m54j63N19p1o08L75M96n87k83Q01k0r06L84R98p25q31J015N09j239j08
1972e80J366l33j353P16J179j234p82J413L29j558L32J488q55j238J296R06j719
1989f27k46J910l50j841R11J572j512j193J879O15k068P3K046p04j808J227J405
2006A289j679p45J913J87j857M43J632j096j263J601O55j745j46J765n53j605
$$ plain form
1869 -419 167 266 -405 -260 459 140 -429 17 466 -74 -164 294 185 -263 -94 155 -85 -120 189 46 -302
1890 -302 -4 15 -250 -161 304 -68 -290 87 308 -104 -163 267 90 -238 58 252 -146 -210 172 -30 -401
1911 -401 14 280 -158 -351 196 232 -440 -111 541 66 -352 222 391 -173 -228 387 183 -349 -44 251 -111
1932 -111 -221 202 37 -419 -77 232 -171 -213 345 132 -369 32 363 -57 -194 339 221 -370 -126 318
1952 318 -136 -299 220 149 -459 -84 412 -175 -458 343 323 -583 -199 799 74 -757 258 767 -472 -580
1972 -580 786 453 -900 -184 995 -239 -1021 392 721 -837 -505 983 128 -1110 186 1092 -627
1989 -627 -873 1037 687 -1154 -243 1329 -183 -1376 503 1118 -950 -877 1169 465 -1343 -116 1289
2006 1289 -390 -1135 778 965 -892 -449 1183 87 -1176 425 1080 -665 -811 954 401 -1204
2022a204J057J204j378p55J674K03j676L81J544q91j115J131P33j260j75J183
2038F56l19j038N26Q56r24l82R74l1r22L82P56o47m49R01J36q58J25P95l40p25
2058e28O18M17o38k39O19M3o37K42K71l15j57M55k4l92K62K21k90j28L97l5l70
2079b08K69K87l61k13L93Ol26J09J98j51j57J70J1j37L8R3j01J01K53k83j70M09
2101B30Lm48J21M90l11l75L73K33n94m1M93j14m03L17K92n14o5O60j61o20N34
2122A00M89p98k68R21j0j016L14J001o94q68J097M53j231j55J285k63j152O08
2140a87R95r38n55J143L9j082M19R36q02o38J043L14j309R1J224m65j195R63R29
2159I25j190n93J289K13j220J85J179n10r06P14M91p09k42P15j23o62M10M90n86
$$ plain form
2022 -1204 -147 1057 -321 -1076 598 801 -875 -494 1050 159 -956 175 908 -352 -527 656
2038 656 337 -701 -175 681 -243 -625 349 318 -604 -222 534 -113 -562 339 475 -383 -258 537 197 -528
2058 -528 90 507 -131 -370 249 292 -345 -103 168 -147 -304 151 127 -265 -3 218 -72 -200 197 162 -208
2079 -208 61 348 -13 -226 167 173 -153 -44 154 3 -154 16 27 -110 -72 21 -80 21 274 -9 -179 230
2101 230 233 -215 -94 396 85 -290 83 316 -278 -319 174 60 -343 -26 266 -248 -313 347 186 -434 100
2122 100 589 -209 -477 444 434 -582 -268 733 39 -829 268 721 -510 -665 620 357 -795 -187
2140 -187 808 -130 -685 458 497 -585 -166 770 -32 -670 373 687 -622 -531 693 228 -967 -4 925
2159 925 -265 -858 431 644 -576 -391 788 278 -628 86 577 -132 -374 341 218 -444 -34 456 -130
2178a30k42O22l3o65K61O23l24n31N54K12n27r6N50M8m41k0L60j37k55Q5J23o2
2200b5k4m0Q1K8L0k46N6L20k7l71J48L80j92l51J49L14j46k47J69J31k16K1j1
2223f9M8L6k9j11k5K81M9l81K7M07m0n34J63N78j82m96J68L97k49m18L92K20l29
2246i7j47K16J16j74L0K8q7J27J34j48j8K34j7l89J26M19k48m01K54L21l50k97
2268c68L72L64m42j96K99J38k10j44K65M1p0p7J6O9J66j09k56Q6K72j77l46K37
2290g0L54k73m51L88L54k27m30L93L88l71l61L42L48k60k73K25J17j92r2R8N0
2311E7q2k0k9K4J35Qk22l7L64o0l46J30M02j85m85K42M63l39l21L36K26l46j47
2334b32K57J63k13j64J38J29L9j58k3O2J42k04j06L12J44l52j31L00J15l43j6
$$ plain form
2178 -130 -372 250 217 -448 -187 436 112 -419 135 347 -180 -276 274 322 -119 -139 221 84 -171 -86 37 -25
2200 -25 -49 -89 -8 20 50 -196 -140 180 153 -218 -70 310 118 -233 -84 230 84 -163 6 137 -79 -58 -69
2223 -69 -21 15 -14 -125 -150 131 180 -201 -174 233 193 -341 -178 400 218 -278 -110 287 38 -380 12 232 -97
2246 -97 -244 -28 88 -86 -56 -28 -115 12 146 -2 -20 214 197 -192 -66 353 105 -296 -42 279 -71 -368
2268 -368 4 368 -74 -270 29 167 -43 -187 78 119 49 -28 -12 57 223 114 -142 -56 216 39 -307 -70
2290 -70 284 11 -440 -52 302 75 -355 38 426 55 -306 36 384 124 -149 76 193 1 -91 7 57
2311 57 -25 -45 -74 -50 85 93 -129 -166 198 138 -208 -78 324 139 -346 -104 359 20 -301 35 261 -85 -232
2334 -232 25 188 -25 -189 -51 78 117 -41 -64 -2 140 -64 -170 142 286 -66 -197 103 218 -125 -141
2355a41K73n6j56m3%J47O1j84j09K44K07l12j84M59J94o13j18O03M6o19J78M98
2377C75l22m63K95M15m39n6L62j60j84K85Q2m14J91K96k56l19M91L20p08j84P09
2398C16k6p48K48O47l36n70M23L36m83r2M20J15m03P1L24k65j53L54j13l27K87
2419B5L15l87k43M38P3n24oN66p7m95J61N02k52l60K32L27k41k42K04J56q8j45
2441f1K9P2m9k5Mj4M0o7o3L3J23op8N9L8P2j12k7O3J16r1j70R7J53j05k53J88
2468c4L36l25l34M17K57m77j89N85O1n25L0N37j20n07K83K95l82j34M20q0l05
2489a91J50K94m04j86M80M8n78K54N26l48m21M15L74n46k34O67on40J17M31k56
2510D6l69L38J78l02p8L43r3k79J98J35k40qL58k65q1K11J24k95k4K41j00j47
$$ plain form
2355 -141 132 76 -80 -123 -123 24 85 -99 -208 36 243 -69 -253 206 400 -213 -331 272 318 -301 -123 375
2377 375 53 -410 -115 300 -139 -195 167 7 -177 108 190 -224 -33 263 7 -312 179 499 -209 -393 316
2398 316 290 -458 -210 437 101 -469 -46 290 -193 -285 135 250 -153 -82 242 -23 -176 178 65 -262 25
2419 25 340 -47 -290 148 221 -303 -309 257 180 -315 -154 348 96 -264 -32 295 54 -188 16 172 84 -61
2441 -61 -32 40 -9 -34 -30 -44 -4 -71 -134 -101 22 16 -62 -3 35 107 -5 -32 31 147 56 -114 -17 136 31 -222 -34
2468 -34 302 -23 -357 60 317 -160 -349 236 297 -228 -198 339 219 -288 -5 290 -92 -226 194 114 -191
2489 -191 -41 253 -151 -337 143 191 -387 -133 393 45 -376 39 413 -133 -367 300 294 -246 -129 302 46
2510 46 -323 15 193 -109 -187 156 63 -216 -18 117 -123 -131 227 -38 -119 92 216 -79 -103 138 38 -109
2532a09J21Q3j46l1R3q0k6J27J6k17K04K30l49o0L74p5l69J38M01j85m44L58K06
2555B60m14q6M30j29l58K72L14m71j03N05Kn51K46N52m46l71N59J48o51J8N78
2576C04j33n73L54M07m69l39N83J48n78Q5N50k62m07L43L68m82j49N33j3n52K15
2597f7M51l72l73M70J82n65K5N31j40n47L29L75l70k12M71J59n35j1M66j70l46
2618b49K60K36l36j31L86l6m13R1L50j48k91L16K29l22j35L42k4k33L0K42j22
2639D2j11J48J9j31jJ02j4j03L3R4j12o4K6J18p8l2R3Q0j13J1N6m8j12J01O7o2
2665Ip9L7Pl7RO0Pn4L0R0n6j13J31M6j22O1L4M6j11P6L1j86P6P9p4r9J53k8j43
2694a20P5R0l2j06P0J10j79L5J16Kr7K7R3j56k7J90o8j30O2J31q2r1J61L9j35
$$ plain form
2532 -109 12 95 -51 -82 11 -69 -95 32 48 -169 35 265 -84 -144 230 155 -214 -76 325 140 -304 54 260
2555 260 -154 -240 190 61 -297 -25 289 -182 -285 220 222 -329 -83 469 23 -348 211 359 -292 -274 304
2576 304 171 -402 -48 359 -110 -449 134 282 -296 -211 339 77 -330 13 381 -101 -250 283 270 -282 -67
2597 -67 384 12 -361 109 291 -274 -249 282 142 -405 -76 299 -71 -283 188 347 -188 -199 267 97 -249
2618 -249 11 247 -89 -220 166 130 -283 -192 158 10 -281 35 264 -58 -193 149 125 -108 -78 164 42
2639 42 -69 79 98 -33 -34 68 54 -49 -16 78 -34 -98 -72 46 -32 -64 29 109 -4 7 63 15 -97 4 71 9
2665 9 -70 -33 -26 -63 -54 6 13 -41 -11 79 23 -90 41 87 -35 26 60 106 -5 71 102 -84 -8 71 -3 -102 51 23 -120
2694 -120 -45 45 13 -93 -23 87 -92 -57 59 61 -36 -9 84 -72 -99 91 23 -107 -45 86 4 -87 74 113 -22
2719b2rJ06L8k23Q9J29j42JR8n5o6N5J02j24l4Q8j7q8j4J35l5r4QN0P5q5l4N7
2747a1J3m4k9J39m1k9l6P4k8j19J39K5j05k8J32rj12M0J38j01j16J46J39k09J8
2772a4Q7k6j77J56J17j23j51J19J37k70J3K50K0k72R4J77j15j34J68P3k03j7K00
2795A09m5q7K0J62j39j32J49N5j53o9J91lj61O3J42j01n2P9R9j47lQ6N6j41j6
2820c8J59j07j32N1R6j02n3J11J9n7j2R4j8p1L6J31m1j51P8J23o9j46J33K5j02
2845d3k9J21L2j13n3J56j9k04J25J75j69p4J42J7r9k0K02r4j74J32J68k11j29
2868a61K15l5k40O1K78j37k02K50J38k39m3K35m4j83J14J33j94l2J82k8j41J00
2890B7P7r6q2O7J03k09PJ50l0j05M0J50r6p6N8J03j19N6M3o4Rnk2k5NRk2L8J8
$$ plain form
2719 -22 -31 75 113 -110 -21 108 -34 -33 65 10 -56 -1 101 -23 -57 31 14 -74 -88 47 12 -82 -74 -24 51 -34 -68 -11
2747 -11 2 -42 -71 68 27 -2 -38 36 8 -111 28 53 -52 -80 52 43 -69 -29 109 8 -108 38 177 -32 -14
2772 -14 73 47 -130 26 143 20 -131 -12 125 -145 -132 118 138 -134 -40 137 22 -112 56 129 -74 -91 109
2795 109 64 -23 -3 159 20 -112 37 92 -61 -130 61 58 -103 -40 102 1 -51 28 127 -20 -23 63 119 -22 -38
2820 -38 121 14 -118 -67 29 -73 -126 -15 4 -53 -65 29 11 -60 -24 107 66 -85 -7 116 47 -99 34 59 -43
2845 -43 -72 49 81 -32 -85 71 52 -152 -27 148 -21 -95 47 64 -35 -55 147 53 -121 11 179 -32 -161
2868 -161 54 19 -221 -160 118 -19 -221 29 167 -72 -115 120 76 -107 7 140 -54 -86 96 68 -73 27
2890 27 104 8 -74 -7 96 -113 -106 44 14 -91 -51 99 3 -73 -15 88 -31 25 68 4 13 8 -14 -39 -34 -25 -47 -9 9
2919Il8Oj5P8k0k9j4N4k3R1m0n4K8JJ5j18J25n3m4j3J21n6j29J17op2J5Q1K7k3
2949B1r6J24m1p9N1L4l4l6KO3n0M7nl1po1Q6L2KJ9M6j08l2J32mr4lJ42r3o0J6
2980a7O5m4p8P7N5q5j7N6R0k13N5J21p4q5J50oj33M9J10m6j33R5Q5j25k1J11l8
3007Dr3j2J11L4q1L8J49j29r0J23J9j39M0J44o7j04N2O3o6j11J40O8j67lP3nk4
3034c3J1Q2o5j5M0nq3P0J28j11j63J55L0r0l2J49k9p2l3R8j0q4R5M0j60J80m3
3061E0q2J2J26n0j23J05N7j16r7J55L7j71P7M7l8l9N9K8j12rJ12jj18Q0J37j44
3087a8n1J29Mj55N0J96j78m8J32j0j06j1K12o8k48J72J82j87q5J85N6k29O7J45
3111A36j01j32J21J24k47J2J60m7j09N1R8p2j32J81Q1j96k0K50r4j77O5J78j26
$$ plain form
2919 9 -29 -23 -38 40 20 -9 -23 31 8 99 59 5 33 34 49 -69 56 3 -41 -54 67 11 -118 -1 -7 -79 -64 17 44 21
2949 21 -75 49 8 -71 -20 14 -20 -56 -54 9 -41 6 1 -30 -37 -98 -12 20 22 41 87 -21 -53 79 75 -19 -22 120 27 -33 -17
2980 -17 48 4 -74 3 58 -27 -44 12 102 -111 -56 65 -9 -94 56 50 -83 -34 76 30 -103 -8 77 -48 -69 42 4
3007 4 -89 -101 10 44 -37 1 150 21 -69 54 73 -66 -26 118 51 -53 -1 62 -4 -115 25 93 -74 -77 -4 -9 -33
3034 -33 -22 60 -5 -20 20 15 -68 2 130 19 -144 11 41 -49 -81 68 39 -33 -66 32 22 -62 33 73 -87 93 50
3061 50 -32 -20 106 56 -67 38 95 -21 -118 37 74 -97 -20 27 -11 -50 9 37 -75 -84 28 27 -91 -11 126 -18
3087 -18 -69 60 64 -91 -41 155 -23 -71 61 51 -55 -66 146 78 -170 2 184 -3 -88 97 153 -76 -9 136
3111 136 35 -97 24 148 -99 -87 73 26 -83 -32 66 -6 -138 43 124 -72 -92 158 64 -113 -48 130 4
3134Dj68K29L8j79l3J85q8j03J71Rj63Q0J58j02j70J23J70j71p1J85m0j15K8J21
3158I8j33o0J00N6j75K7J28j14l3N2Q5q2M1J35n1j05L7R3j34m5J24L4j71L1J76
3183A14j39r3Q2J40k09J8J77j5k49J59J23j90L7J69n6j83R0J38j00j31J93l2j37
3206i4k1K21m5k64J16J73j38j07K56l1k12P2K10j16j77J83R2j48m1J73q2j59J33
3229fJ46j69n3J94j0k38P4J54n7j32J88J01k21m9J82j05r9J07J28k40nJ63n7p1
3253g5rJ06K3j55J64j2j05%J10l7o8Q4J10j37l1J30l2j26L1J14r8l3J27m6p4o9
3279a08J05K4l0L5M1o6rN8Lr6Q5n3j7J2L0j8j1m4k0O5j1N5Jn0J1J6n5L6K1N6o5
3310AJ4j1Pl6J5mL0j1Lrl0L6J0M0n6k2J3n2N0Q8m0m6oO3m8o9Q3Jn6MN8r9RQ3R
$$ plain form
3134 4 -164 65 103 -76 -109 76 -12 -115 56 65 -98 -18 140 38 -132 -9 161 -10 -81 104 64 -51 -23 98
3158 98 -35 -95 5 61 -114 -87 41 -73 -106 -54 31 -51 -10 125 74 -31 6 99 -35 -80 44 78 -93 -62 114
3183 114 -25 -118 -36 104 -105 -87 90 75 -174 -15 108 -82 -45 124 68 -115 -25 113 13 -118 75 43 -94
3206 -94 -115 106 61 -203 -87 86 -52 -159 97 66 -146 -74 136 20 -157 26 118 -30 -71 102 20 -139 -6
3229 -6 140 -29 -82 112 102 -136 -62 92 35 -97 91 192 -29 -78 104 -1 -100 7 135 -105 -110 53 -4 -75
3253 -75 -84 22 45 -110 54 42 -63 -63 47 10 -58 26 136 -1 -32 98 66 -60 -29 85 -13 -46 81 35 -39 -108
3279 -108 -3 21 -9 26 67 1 -8 50 53 -43 42 -11 -28 -16 14 -4 -15 -59 -79 -14 -25 30 31 -19 -8 8 -47 -11 10 66 1
3310 1 15 4 11 -25 -10 -14 16 5 8 -1 -31 5 15 55 -1 -23 -10 -62 -12 76 36 -10 -16 47 -1 -70 13 14 -42 -38 20 -79 -70 13 22
3345B2j01P8J1M9j09P5K7o3KO9Oj20Q5Mm2k9M0N2r9L5Q4p4k2K4J5r0M2Q7j02j8
3375f2J20o9m7O8N0m3r0J63r0q0O8L9l4q2J45jj03N9M6l7p2R7J9n9p2J50k2q1
3403b0J5J29r3n2M9O9k24JJ98l0j47J08R1j24p6J24L3p4LM6k3n9R0M0j13N3nj0
3431ak3k3M0Qm3N2J8p0N7O0n7pJ3j5m2j3O7%o7pO3l0Mj0O5q8Ok5O6No9P3p8O2
3465iP3p3n1R4Pj04J8O2k3K1m3J01p5j1%R6r3OL6o3L1Q0j5j27R1J2k9l9R8l3j07
3496f9N0l6M8j8J9l6PnO0o0L2NJ9m8K9Q8n5o7O9j7p6P8J9j6p2P5m2j9MR4j6j01
3528e7M5O9k8o7O8O9j73K8Q0k4p0K3J00j38k5J32n4l8J1J30j17k5J15J0r4J1J06
3555H7l5j27J29J2r7m9J32l9p2N2P0p6o6Q5J6j00N0J43o6j13K1J25j53l5J57p8
$$ plain form
3345 22 -79 -1 10 59 -50 25 52 -11 -9 60 66 -54 31 35 -7 -36 4 56 -43 -8 76 2 -20 4 19 -71 -29 58 -44 -62
3375 -62 58 -11 -58 10 60 17 -73 90 0 -80 -12 27 -7 -89 56 55 -48 11 57 20 -52 45 64 5 -67 83 61 -20
3403 -20 -5 124 31 -21 28 97 -127 -126 72 42 -105 3 94 -30 -106 18 51 -23 -20 26 3 -56 34 74 -39 14 9 -1
3431 -1 -24 -47 -7 1 -42 10 28 -42 15 75 18 11 24 9 -33 -46 21 21 -46 -53 10 -20 -16 -26 39 -49 -43 -68 -2 3 -66 7 -71 -9
3465 -9 64 -9 -60 34 41 -63 -45 17 -6 15 -28 73 -2 -13 -13 83 -10 -4 32 -31 0 80 65 -62 29 41 12 -27 71 38 -69
3496 -69 -19 -55 -7 -25 -6 -42 -35 -40 20 -40 -8 -3 16 -32 -3 85 30 -37 32 15 -61 17 36 20 -52 23 -19 -38 -34 60 44 -57
3528 -57 -12 57 29 -38 30 99 -74 -46 34 10 -60 -37 63 -75 -100 32 -22 -60 -49 81 -36 -61 54 64 -30 -19 87
3555 87 52 -75 54 66 -31 -80 52 13 -59 -7 63 -13 -79 6 22 -78 -28 115 49 -64 -43 82 -71 -106 51 -27
3581b7n1P4Ql9m1M6O3j32Q4P7o3j25J12O3r9j5J00K6j27J4J33o7r1J39kj27L4
3608c3R7n2r3P3J33j55m8J42jj46L8J60q7q2P8L1q2l6P0M5j29O2O8n6r8J10O8
3635G7j77N0J48o5j00R9O4n7o5J42k9j35O2K7nq1N7K0p7K3L0l2m5P6L0J7j10J14
3663E8K0j31M0P1k2j22J15l7m0M5k5J1klj9M1N1p8J2J6m3R1J0o3N6n5OLM9l1O
3694C0j8j0jj5M5n2l8O2pJ1j3L0l3jJ9k3P4j7J2r6nP5j03Q2j8j1L4j8K9Po1O0
3726C0Mm7n6J32m3o4M9O2r2N1QJ3k9J3j9pm9L3j0m4N9J4k0k9K2P0p3J4l1Q1n6
3757a4j2K9o0pO4L5Jo7P1n2j0k2L7L0l2N2k9Km6O2l5k9K3M9o4L8j6L0m1k6Q1o1
3789a9M3q2J7L5plKm7L8O0k2o5L1O4n2o4J13N5j21N1K5o6l1L5M3m9KN2o2j0L2
$$ plain form
3581 -27 -78 -4 4 -35 -76 -30 33 -99 -15 62 -1 -126 -14 49 -50 -65 35 61 -66 -52 81 14 -77 62 60 -67 -33
3608 -33 64 12 -81 -8 125 -30 -78 64 63 -83 -45 115 28 -54 24 55 -27 -63 7 52 -77 -15 53 -3 -101 9 77
3635 77 -100 -50 98 33 -67 32 96 39 -26 116 87 -48 14 41 36 -45 12 32 -45 -22 8 -24 -69 7 37 54 -56 58
3663 58 78 -53 -13 58 36 -86 29 -8 -48 -3 -28 -17 -19 -22 -41 0 51 -27 -15 1 -42 49 59 -4 52 -3 3 6 55 24 30
3694 30 12 2 1 -14 31 -21 -59 3 -4 7 -6 24 -9 -10 9 -14 60 43 55 -41 -46 29 -74 8 -10 -21 13 -5 24 31 -30 30
3726 30 34 -13 -69 63 20 -44 5 67 -25 26 34 47 18 31 12 5 -44 -11 -21 -65 -6 8 -12 -41 -19 51 -22 -8 -39 42 -14
3757 -14 -26 3 -57 -64 0 35 36 -31 40 -12 -22 -44 -7 23 -9 43 14 16 -30 32 -3 -32 -9 40 -24 14 -2 28 -13 -39 42 -19
3789 -19 24 -58 -41 -6 -13 -16 -14 -61 -23 37 15 -50 -19 45 -7 -71 42 97 -24 27 52 -14 -45 -10 33 -16 -14 38 -24 -34 -2
3820bP7n3k8N1L7j24L9Km1m0P9J1o6M0L2M1p9K2k5L3LN7k9j18N8L6nm6L9M5r0
3851d4K3K7J2o0K5N8o6lN8MJj9Kp4O7N1K7j05K8J2m5n8O7K7l4M3qK2j33Q4J4K3
3883B6p5O9pn3l4L6N6K7k2K4m2l6O5o4j8L0N8oqJ0n8L3k7P1k4l6l0L7O7j52R1
3914H%k0nm3N4nL4qm5l9L4l1L8K8j3J9m0J4QK0L2l8kl8O8k6O9q3J8Q5r1K4l0J1
3948Gn5O4j3n2K1O2J2m4nnl5M8nK1l3M4n9K5rJ5L0o9M6K9p5L3J1k1k0K8n6Q1K8
3981D9L4r6K8j4N7k9m6N3n2j8L1L1k7j8Q0m0q0J2R6Kq1qM2n9J9M0l6K0K2qm6l4
4013g6J27l1m8J0PP3q9K9K2m5K6qj8J6MK8l7K3O3n4pl3J7Nlql5Q5p6J6Nl3N6k
4047IMn6L0O5o3J4K9q0N0K7J5j7o1K7K6n7Q2k1K6k8j2Q7j27pN1J8p5L4J5mj1R
$$ plain form
3820 -2 75 22 -6 45 82 -42 -3 -1 -42 -82 -3 8 -58 -18 14 55 -24 -2 -27 6 9 66 37 -81 -23 13 8 -38 1 46 -44
3851 -44 -21 6 18 -42 -17 41 -25 -28 30 34 35 16 18 -56 11 62 89 -16 12 24 -21 -79 -12 15 -19 24 16 38 -95 -11 3 26
3883 26 -49 20 13 -40 -74 -38 18 45 23 47 5 -31 34 -30 -48 -18 40 34 26 36 -22 11 -16 55 31 -5 -35 2 69 -83 8
3914 8 8 -12 -17 -60 -6 -11 23 15 -30 -69 -35 -66 -28 0 -13 6 -34 -20 -12 8 40 2 0 -38 30 4 73 -10 8 93 2 26 -4 7
3948 7 -48 16 3 -49 -28 34 46 2 -3 -8 -43 5 0 21 -12 32 -27 -2 -11 4 34 -35 11 40 -35 -2 9 -12 -32 -4 -60 21 49
3981 49 83 -13 15 1 58 29 -17 36 -16 -34 -3 28 1 -17 63 23 -57 -45 51 53 -28 -36 6 -53 -34 6 -30 -10 12 4 -42 -76
4013 -76 51 20 -28 -18 -11 62 -27 2 24 -21 5 -3 -21 -5 -1 27 -10 13 76 22 15 -18 -1 4 1 -7 -42 43 -33 -17 -12 -45 11 9
4047 9 13 -43 -13 52 -11 3 32 -48 2 29 44 27 -34 -7 19 -38 44 23 49 21 9 96 -31 -38 13 31 -44 -10 5 1 -10 -1
4079aO3o6k0K4j0n0O7m2J5k9Q5k3p8Q8Jq5MO0l0L8J1L0r9ON7Qm6K4N6l2m9Q8l5
4112C0j2M4Kn7m9K9P3o0l1M2m9n7Q3K9p0J3J6L8q5M2K4J3n1L0rM2n5Q1j7n9M9
4143A9k9l1J9K3K2Rk3P6o1L9l1nj8K1j0j2j0K5l8jk6N1j2Mml7L3k4jK3jm1N9j5
4177gk9M0n3O2L8l1L4j8n9MJ4Kk7K9j2k6P1l7N9j1l5qK1l6pNP4m3qJ5m9L4o8R3
4211C1q1j3N6K7p1K2K1J1mJ2j0j0k6J7K1k6jK1k2L6j1k0k3O7J5q4N2K4k4J7m2
4242a8P9j3k8J8m8K2p2MN7nj1K2kNo0P9m9n5O8k5N%k4O1p2M5N5nn4RQ0o8J3m7
4276c4rPL1k2mK6JpL2k9k9%J4Q0n4l9J1O8l7J4j7k0l5K3kJ1j0O2k1k5Ro1L9k8
4310e5K1PN3nL6p6j4P4o8J5K4j0m4M1OP6p3M1k1qk8L2J1m3K4Ll2l7K4%J0J5J8
$$ plain form
4079 -1 62 -4 -24 0 -10 -60 7 -35 -20 -49 36 13 -65 23 24 -61 -57 3 -27 11 22 52 -47 -41 16 24 -22 2 58 26 -23 65 30
4112 30 18 62 64 7 -42 -13 60 0 -31 11 -38 -95 -12 17 -53 -40 -24 14 -71 -29 -5 8 -43 -13 -22 20 -35 46 29 -30 19
4143 19 -10 -41 -22 1 23 32 9 85 24 63 32 27 9 30 20 8 -2 23 -15 -16 -42 9 -3 1 -3 -40 -7 -31 -32 -9 -10 -51 8 -7
4177 -7 -36 4 -49 13 51 20 54 36 -23 -19 -5 -3 -30 -1 -13 -39 32 -5 54 43 8 0 21 -15 -22 -17 57 14 6 21 -28 6 -62 31
4211 31 -50 -63 -7 20 -51 -29 -8 3 -1 11 1 -9 -35 -18 3 -23 -24 -3 -25 11 0 -20 -43 24 39 -45 7 31 7 24 -18
4242 -18 61 48 20 38 -10 12 -60 -56 1 -4 -15 7 5 10 -50 29 -20 -75 -7 -32 -27 -27 -51 10 -62 -17 38 33 -21 -12 68 0 13 -34
4276 -34 -43 -36 -5 -27 -31 -5 -4 -11 21 -8 -37 -37 -23 57 3 -36 -25 43 6 20 3 -17 -52 -29 -31 -20 -30 32 11 -14 -5 -66 -27 -55
4310 -55 -34 -27 26 21 57 -19 -33 41 -27 -12 12 2 -42 -1 5 81 8 49 28 20 -8 24 35 -8 16 19 -13 -50 -26 -26 -16 -1 17
4343A7k1j9oL6Pl5K0Mkk8L1N2l7n1K9O0q2L3N3m3m9M6l3J5N3j5p9L1L4j9Pn8P9
4376C0l0K8m9K3J4l4K4M8p4k3Q6l2k5kj5K0k0K5j5k7R5j9oj2pO9j46O3N2K5l3
4407C3kj4l8J2K9K2l9j8N3r0M4K8q4j1N6lMl1K4L9m4K6k4%L6j5J5o5R5m1j7N2
4439C2l8M8o5L9k1Pr%L2l6lM2rK2j0km3n3P8Mq4NN0qK9k8JK0J3p8Q8J6Jj6m0j3
4475b9J1J0kK0l0O1l0k7L1k9J1lK6J2l1L2n0N1ok9M4l3rL9k1l6m3R8n5OMl2K0
4508a9j3NMM5j17Q2M5qk1l2J4%k8O0j2lpK5mj4jO0o2J6n0m3M8O8k7rj8k0R7o8
4542gM7n0L8l3Qkk6M2rl9K1ql9R0NJ1o4K5L2n8RN2o7K5L7J9m9m7R1n8kk4P8p7
4576b9O2o8K3k1RO0j3n2PJ4M3p3O4j19N9K0K3P1j02L3n0M1mJ3Km5M7j4n8M0Q1
$$ plain form
4343 17 -4 -23 -29 7 14 -21 -1 3 1 -27 4 56 19 -32 -3 57 -25 8 61 18 -31 15 -18 -3 50 35 -44 -13 21 2 9 -49 30
4376 30 0 28 -21 2 16 -18 6 54 -20 -43 43 11 -14 -16 -31 -11 -31 -6 -21 -48 47 28 22 10 3 72 -74 -11 41 66 33
4407 33 31 17 -21 -9 20 42 3 -15 38 -52 -8 20 -64 -75 -19 -22 -18 -49 -25 14 -30 -4 -28 -28 8 -7 8 -57 38 -3 -20 32
4439 32 -6 42 -23 16 -5 2 -7 -7 25 -11 -14 28 19 41 31 29 -14 -67 11 15 -69 -64 -14 -22 7 -21 -20 0 13 -65 23 39 40 24 -16 -29
4475 -29 -18 -8 -10 10 -20 41 11 -16 15 -14 -3 -6 20 32 1 33 -17 34 28 -1 43 10 1 40 19 -17 -60 38 -17 -11 -7 -39 -19
4508 -19 -32 -27 -23 22 -95 -13 32 24 3 -29 -15 -15 -43 17 5 2 -5 20 16 2 1 61 -1 15 -35 -78 -30 38 11 2 -16 -36 61 -7
4542 -7 40 -10 28 -5 3 1 -25 17 8 -31 -10 -18 -57 33 38 49 -15 10 42 -16 -7 45 -22 3 40 59 10 -37 54 -4 -6 -30 48 -29
4576 -29 33 -35 -12 -33 -24 36 23 -29 -22 -8 35 -38 26 -93 -34 -14 9 80 -22 11 -39 2 -2 11 13 -32 15 1 -57 -17 64
4607F4o0j2M3l8K6m0K3j6K1Qn1Kk4M3M2k9k1N2k2k3L1r7P5J8J7j01M2lP4n5k3
4638c4N1n3MO6k3j8MO0o3m5J15m2J3K0J0n4%%K6Op4R1p3rK0NK8p1L7Lo0O2l2N3
4672B3K0p6M6n3l0J05l3rn3K2J00j04MK6j0N8l5ppnM2j9p2Q7O4m7j7Lm1K6o7Q7
4704B8L8o6j5Q7o6mj0K2Rl9N4q0J6K1l0O9o5rj8P9p6N6L6k1n2M2m0L7J8J1j8l8
4736b4J8M1Mj2L9l0m5k6N9%q7P6O0o3k5m7J18j10M4L1m7pNK2mj8RK0n2L4M5k4
4768DqJ2J4j1k4N6n9lJ9%Rj2lL8k7j2J4O9r0P5%m9k1L8l0RK0k6O3r1kRmJ1J0M3
4804D1n2m3m0O0P1l9J1k2jK4Ln6K4N2K7p5k1M4K6o5K8N0n0nN8j7m7KJ9k5M3K2
4836D7m0m1J2M4kk2%j6j6M2l0L0j8mm1P2l8K3K9o8OM5mqJ7j7j9M0K9l5%k0O7o5
$$ plain form
4607 64 4 -8 35 -3 23 -17 6 -10 11 19 -32 -30 -54 -11 31 2 -19 33 11 -12 19 -78 -3 15 32 -69 -27 -30 44 -11 -34
4638 -34 17 -36 -32 34 11 -7 -3 57 -6 -51 64 22 35 55 65 11 11 11 37 43 -31 60 -13 -22 -2 3 31 -40 -3 0 -60 2 -30 23
4672 23 43 -33 13 -40 -70 35 2 -7 -60 -38 62 -42 -38 -12 -22 36 1 -6 -13 -18 24 5 -67 20 84 37 20 23 -18 8 -59 28
4704 28 66 0 -15 72 6 2 -8 14 23 -16 38 -42 -26 -5 -35 34 -31 -40 -58 21 -55 1 37 16 -36 6 -34 3 21 32 14 -24
4736 -24 -6 35 39 27 66 36 -9 -35 24 24 -63 13 73 10 -15 -62 56 -54 -10 21 -26 -33 -28 -6 -10 -28 -19 1 -51 -17 28 4
4768 4 -4 8 22 11 -13 43 -16 -19 0 0 9 -3 -6 32 5 -7 7 76 -14 61 61 12 -9 29 -1 8 28 2 65 -26 -28 -19 -23 -12 -2 41
4804 41 -11 -54 -94 -34 37 -2 9 -13 -14 10 13 -43 -19 33 60 -15 -36 8 34 -31 -3 47 -3 -8 50 33 -14 -12 7 -18 25 47
4836 47 7 -34 -22 22 20 -2 -2 -18 -34 8 -22 8 -10 -14 -55 17 -21 2 31 -37 -31 14 10 2 19 2 -17 23 52 17 17 -3 64 -1
4870aLL7jpq6O4M3r1mM5J1%j3Lj1L5l9P9n9%qlM3q2M3M2n2L1j8j8qJ6LM6n9O2
4906D6M4j01JLK3knpjm7K9J0j3JN4n5J3L0k6J1l3pj1l2R2k4k9Pl0L4l2mJ08n3
4940fk3NK4pK5k2j2JJ7M2jo7N0k3ml9N5J8ql4M4m7j2K8mjl4O3o6P8m5K8m3oQo
4976b4J6J1ML0q0K5L1n9OQ2Nm9l7Q0k3j9kpJ2J5K9m4O1m4k6kkn6M6PN2o4L9n5
5010d2J4Q7j8p3M1p2L1K8m2M0o1K7K0oJ8nK6j4j2K4K8L0j1m2k5nL9N6r2Q5j36
5041f2J46j02J3J1JK2l7jjrj7k2N9k0J9m6k8R9op8M7k6KK7l1L7J4n4N6m0O7jn1
$$ plain form
4870 -1 2 39 38 31 -55 9 52 -39 -43 2 13 13 0 3 -8 27 -12 67 8 8 0 -3 40 -42 1 43 -9 22 4 -14 -22 -6 -3 43 -16 46
4906 46 90 -11 -10 -7 16 14 9 2 1 -46 -17 -7 -20 -19 35 -20 -7 23 -3 8 -25 -32 -43 -75 17 -7 -36 -29 -59 -25 -57 -61 47 -6
4940 -6 -29 -24 0 -7 18 -4 -16 -15 2 44 43 -24 26 3 -1 -40 15 33 25 -9 35 -12 -24 4 0 -1 -35 28 -38 40 -5 23 -20 -26 -18 -24
4976 -24 -8 3 7 37 -43 -18 13 -46 -40 42 47 -2 -39 41 18 -1 -3 -10 2 17 46 2 63 19 -7 -9 -11 -67 -21 -14 38 -26 13 -42
5010 -42 -28 59 41 -32 9 -63 -32 -4 -46 -6 -67 -40 -20 -26 -8 -13 13 -1 -13 11 39 69 58 16 -9 -14 25 81 -11 74 -62
5041 -62 84 -18 -5 6 7 29 -8 -9 -10 -19 -36 -58 1 -19 0 -46 -74 25 19 -59 -12 -38 -36 -9 -40 -3 11 -43 13 -27 40 39 -12
$$ [...]
8191A6
##END NTUPLES=NMR FID
##END=
