##TITLE=1H_Ly-801.60
 CCl4, 8 sc, 
 15.3.2019
##JCAMPDX= 6.0         $$ Bruker NMR JCAMP-DX V2.0
##DATA TYPE= NMR FID
##DATA CLASS= NTUPLES
##ORIGIN= UXNMR, Bruker Analytische Messtechnik GmbH
##OWNER= root
$$ XWIN-NMR		Version 3.5
$$ Fri Mar 15 14:12:53 2019 Russian Standard Time (UT+4h)  she@DPX200
##.OBSERVE FREQUENCY= 200.1315
##.OBSERVE NUCLEUS= ^1H
##.DELAY= (6, 6)
##.ACQUISITION MODE= SIMULTANEOUS
##.ACQUISITION SCHEME= undefined
##.AVERAGES= 8
##.DIGITISER RES= 18
##SPECTROMETER/DATA SYSTEM= spect
##.PULSE SEQUENCE= zg30
##.SOLVENT NAME= CDCl3
##.SHIFT REFERENCE= (INTERNAL, CDCl3, 0, 15.7039)
##AUDIT TRAIL= $$ (NUMBER, WHEN, WHO, WHERE, WHAT)
$$ ##TITLE= Audit trail, XWIN-NMR		Version 3.5
$$ ##JCAMPDX= 5.01
$$ ##ORIGIN= Bruker BioSpin GmbH
$$ ##OWNER= she
$$ F:/spectra/data/she/nmr/H-F/1/audita.txt
$$ ##AUDIT TRAIL=  $$ (NUMBER, WHEN, WHO, WHERE, WHAT)
(   1,<2019-03-15 14:11:20.09 +0400>,<she>,<DPX200>,
      <created by zg, POWCHK disabled, PULCHK disabled
       configuration hash MD5:
       00 E9 B6 7A A2 85 ED C7 34 08 36 98 17 FE 4E 26
       data hash MD5: 16K
       DF D3 F9 56 DB 5D 71 73 6A 20 CB 31 5B AE 78 B4>)
$$ ##END=
$$ 
$$ hash MD5
$$ F1 6C 1C E1 21 01 90 C6 FA 76 9F F3 AB FB 60 B7
##$RELAX= 
##$RELAX= 
##$RELAX= 
##$RELAX= 
##$RELAX= 
##$RELAX= 
$$ Bruker specific parameters
$$ --------------------------
##$DU= <F:/spectra>
##$EXPNO= 1
##$NAME= <H-F>
##$PROCNO= 1
##$TYPE= <nmr>
##$USER= <she>
##$AMP= (0..31)
100 100 100 100 100 100 100 100 100 100 100 100 100 100 100 100 100 100 
100 100 100 100 100 100 100 100 100 100 100 100 100 100 
##$AQSEQ= 0
##$AQ_mod= 1
##$AUNM= <au_zg>
##$AUTOPOS= <>
##$BF1= 200.13
##$BF2= 200.13
##$BF3= 200.13
##$BF4= 200.13
##$BF5= 200.13
##$BF6= 200.13
##$BF7= 200.13
##$BF8= 200.13
##$BYTORDA= 1
##$CFDGTYP= 0
##$CFRGTYP= 5
##$CHEMSTR= <none>
##$CNST= (0..31)
1 1 145 1 1 1 1 1 1 1 1 1 1 1 1 1 1 1 1 1 1 1 1 1 1 1 1 1 1 1 1 1 
##$CPDPRG= <>
##$CPDPRG1= <>
##$CPDPRG2= <>
##$CPDPRG3= <>
##$CPDPRG4= <mlev>
##$CPDPRG5= <mlev>
##$CPDPRG6= <mlev>
##$CPDPRG7= <mlev>
##$CPDPRG8= <mlev>
##$CPDPRGB= <>
##$CPDPRGT= <>
##$D= (0..31)
0 1.2 0 0 0 0 0 0 0 0 0 0.03 0 0 0 0 0 0 0 0 0 0 0 0 0 0 0 0 0 0 0 0 
##$DATE= 1552644679
##$DBL= (0..7)
120 120 120 120 120 120 120 120 
##$DBP= (0..7)
150 150 150 150 150 150 150 150 
##$DBP07= 0
##$DBPNAM0= <>
##$DBPNAM1= <>
##$DBPNAM2= <>
##$DBPNAM3= <>
##$DBPNAM4= <>
##$DBPNAM5= <>
##$DBPNAM6= <>
##$DBPNAM7= <>
##$DBPOAL= (0..7)
0.5 0.5 0.5 0.5 0.5 0.5 0.5 0.5 
##$DBPOFFS= (0..7)
0 0 0 0 0 0 0 0 
##$DE= 6
##$DECBNUC= <off>
##$DECIM= 24
##$DECNUC= <off>
##$DECSTAT= 4
##$DIGMOD= 1
##$DIGTYP= 9
##$DL= (0..7)
0 120 120 120 120 120 120 120 
##$DP= (0..7)
150 150 150 150 150 150 150 150 
##$DP07= 0
##$DPNAME0= <>
##$DPNAME1= <>
##$DPNAME2= <>
##$DPNAME3= <>
##$DPNAME4= <>
##$DPNAME5= <>
##$DPNAME6= <>
##$DPNAME7= <>
##$DPOAL= (0..7)
0.5 0.5 0.5 0.5 0.5 0.5 0.5 0.5 
##$DPOFFS= (0..7)
0 0 0 0 0 0 0 0 
##$DQDMODE= 0
##$DR= 18
##$DS= 0
##$DSLIST= <SSSSSSSSSSSSSSS>
##$DSPFIRM= 0
$$ [...]
##$SUBNAM2= <"">
##$SUBNAM3= <"">
##$SUBNAM4= <"">
##$SUBNAM5= <"">
##$SUBNAM6= <"">
##$SUBNAM7= <"">
##$SUBNAM8= <"">
##$SUBNAM9= <"">
##$SW= 24.9337058887773
##$SWIBOX= (0..15)
0 0 2 0 0 0 0 0 0 0 0 0 0 0 0 0 
##$SW_h= 4990.01996007984
##$TD= 16384
##$TD0= 1
##$TE= 0
##$TE2= 300
##$TE3= 300
##$TEG= 300
##$TL= (0..7)
0 120 120 120 120 120 120 120 
##$TP= (0..7)
150 150 150 150 150 150 150 150 
##$TP07= 0
##$TPNAME0= <>
##$TPNAME1= <>
##$TPNAME2= <>
##$TPNAME3= <>
##$TPNAME4= <>
##$TPNAME5= <>
##$TPNAME6= <>
##$TPNAME7= <>
##$TPOAL= (0..7)
0.5 0.5 0.5 0.5 0.5 0.5 0.5 0.5 
##$TPOFFS= (0..7)
0 0 0 0 0 0 0 0 
##$TUNHIN= 0
##$TUNHOUT= 0
##$TUNXOUT= 0
##$USERA1= <user>
##$USERA2= <user>
##$USERA3= <user>
##$USERA4= <user>
##$USERA5= <user>
##$V9= 5
##$VALIST= <valist>
##$VCLIST= <CCCCCCCCCCCCCCC>
##$VD= 0
##$VDLIST= <DDDDDDDDDDDDDDD>
##$VPLIST= <PPPPPPPPPPPPPPP>
##$VTLIST= <TTTTTTTTTTTTTTT>
##$WBST= 1024
##$WBSW= 4
##$XGAIN= (0..3)
0 0 0 0 
##$XL= 0
##$YL= 0
##$YMAX_a= 78020
##$YMIN_a= -91422
##$ZGOPTNS= <>
##$ZL1= 120
##$ZL2= 120
##$ZL3= 120
##$ZL4= 120
##$ABSF1= 10
##$ABSF2= 0
##$ABSG= 5
##$ABSL= 3
##$ALPHA= 0
##$AQORDER= 0
##$ASSFAC= 0
##$ASSFACI= 0
##$ASSFACX= 0
##$ASSWID= 0
##$AUNMP= <proc_1d>
##$AZFE= 0.1
##$AZFW= 0.1
##$BCFW= 1
##$BC_mod= 2
##$BYTORDP= 1
##$COROFFS= 0
##$CY= 11.3945322036743
##$DATMOD= 1
##$DC= 2
##$DFILT= <>
##$DTYPP= 0
##$F1P= 18.9103706918063
##$F2P= -1.10871071338519
##$FCOR= 0.5
##$FTSIZE= 0
##$FT_mod= 4
##$GAMMA= 1
##$GB= 0.15
##$INTBC= 1
##$INTSCL= 1
##$ISEN= 128
##$LB= 0.24
##$LEV0= 0
##$LPBIN= 0
##$MAXI= 10000
##$MC2= 0
##$MEAN= 0
##$ME_mod= 0
##$MI= 1.114404
##$NCOEF= 0
##$NC_proc= 0
##$NLEV= 6
##$NOISF1= 3.799351
##$NOISF2= 2.8
##$NSP= 1
##$NTH_PI= 0
##$NZP= 0
##$OFFSET= 15.70392
##$PC= 1
##$PHC0= -9303.279
##$PHC1= 18.00026
##$PH_mod= 1
##$PKNL= yes
##$PPARMOD= 0
##$PSCAL= 0
##$PSIGN= 0
##$REVERSE= no
##$SF= 200.130013532006
##$SI= 16384
##$SIGF1= 3
##$SIGF2= 2
##$SINO= 400
##$SIOLD= 16384
##$SREGLST= <1H.CDCl3>
##$SSB= 0
##$STSI= 0
##$STSR= 0
##$SW_p= 3612.71676300578
##$SYMM= 0
##$S_DEV= 0
##$TDeff= 0
##$TDoff= 0
##$TI= <>
##$TILT= no
##$TM1= 0
##$TM2= 0
##$TOPLEV= 0
##$USERP1= <user>
##$USERP2= <user>
##$USERP3= <user>
##$USERP4= <user>
##$USERP5= <user>
##$WDW= 1
##$XDIM= 8192
##$YMAX_p= 0
##$YMIN_p= 0
$$ End of Bruker specific parameters
$$ ---------------------------------
##NTUPLES= NMR FID
##VAR_NAME=  TIME,          FID/REAL,        FID/IMAG
##SYMBOL=    X,             R,               I
##VAR_TYPE=  INDEPENDENT,   DEPENDENT,       DEPENDENT
##VAR_FORM=  AFFN,          ASDF,            ASDF
##VAR_DIM=   8192,          8192,            8192
##UNITS=     SECONDS,       ARBITRARY UNITS, ARBITRARY UNITS
##FACTOR=    0.0002004,     1,               1
##FIRST=     0,             0,               0
##LAST=      1.6414764,     0,               0
##MIN=       0,             -91422,          0
##MAX=       1.6414764,     78020,           0
$$ Real data points
##PAGE= N=1
##DATA TABLE= (X++(R..R)), XYDATA
0@%%%%%%%%%%%%%Pj5J6j6J6j6J6k4L2l2L3m1M8n3O1o9P7q7J00j09J20j35J50j66
37h7J84k06K26k50K80l07L40l77M17m65N20n82O53p42Q51r87J161j394J726k224
57a263L048m642Q707l5494o1778J33532o784j00491Q5261N7924j18077q416Q6233
70C7760m0302l3468O8039p191n1372K5487R933k6631K4492J0101l3011J1915J9935
83A5687k5796L840K6095j9750j8281J7177O556l603n5j938P508p020k4345K4470
97E45L0394m2258j2319N3036k4184m8030O0179K4602p4859J0888N7306m6928j8745
110c0373O6568j6009n1406L3763M832l7283L8327K4110m5537J2454K1475n5262
122c4341Q812O7002l6297l4295O1630j4672p0610M8139M6407o0380p03N7327l5175
$$ plain form
0 0 0 0 0 0 0 0 0 0 0 0 0 0 0 7 -8 8 -8 8 -8 8 -16 16 -16 17 -24 24 -29 32 -37 40 -47 53 -56 64 -71 79 -87
37 -87 97 -109 117 -133 147 -160 180 -197 220 -245 275 -307 346 -396 455 -532 629 -765 961 -1263
57 -1263 1785 -2857 5850 -29644 -91422 42110 35326 -65165 20096 78020 -40057 -48473 37760
70 37760 -2542 -36010 32029 24838 -26534 -1047 8886 -17745 6747 16848 -16163 -4248 15687
83 15687 -10109 -6269 19826 76 -18205 -1028 5528 1925 1870 -68 7440 420 -23925 545
97 545 30939 -11319 -23638 29398 5214 -42816 17363 41965 -32894 -22006 35300 -11628 -30373
110 -30373 36195 20186 -31220 2543 7375 -29908 8419 32529 -13008 -554 20921 -34341
122 -34341 -25529 41473 5176 -29119 32511 17839 -52771 -4632 41775 -18605 -19308 38019 2844
135B844l9022M5082J0372l5822J1895J9037j6461l367Q930k296n40m833l006J4778
149G591q84j4837J2025L717k2151J0085J8725j8980J165J9440k5017r264L5485
162A7100j1524k4838L5588k04m8331K6468L7146m4613m609N0490l0092m0327M7725
175I979J3089m4684K0028K9764l9301j0166L4652r657j5519K1508k074j7462J0645
188H02J611j0396J1939K437j3863R534O131j6657M709J2722j3556j641J5403p382
202A793p111R891o456o760J3887j040q877J1459l039j7323J2393J0748j5768N725
216d78J4535j8989p831J8838n005q266J7184l261j7717J0911M341j4069J2339
229B532J0526k0499J622J7303j6870o856K5029o382k0838J7850P952k2373O347
$$ plain form
135 2844 -36178 8904 19276 -16546 -4651 14386 -2075 -5442 3488 1192 652 -4181 -7187 7591
149 7591 6707 -8130 3895 7612 -14539 -4454 14271 -4709 -3544 15896 -9121 -18385 17100
162 17100 5576 -19262 16326 16122 -32209 -5741 31405 -13208 -17817 32673 2581 -37746 9979
175 9979 23068 -21616 -1588 28176 -11125 -21291 13361 3704 -11815 9693 7619 -9843 802
188 802 2413 -7983 3956 6393 -7470 2064 8195 -8462 -3753 8969 -4587 -6228 9175 1793
202 1793 -5318 4573 -1883 -8643 5244 4204 -4673 6786 3747 -13576 -1183 9565 -6203 -478
216 -478 14057 -4932 -12763 6075 1070 -7196 9988 6727 -10990 -79 4262 -9807 2532
229 2532 13058 -7441 -5819 11484 -5386 -12242 12787 6405 -14433 3417 11369 -11004 -4657
242d657J7717j6026p533J7526k275j1030Q202J896r092L051N023k122J531q56
256A355m740K166P43k112O687J828r353M17L905n856M306J0094q415o268Q043
271B800n282o503J4968L245j4575M733O501j4857J534J8328o630j0787J0648j432
285B691j3048R101R948r761j344O910o448l468P883l23l533L555j918m088M762
300I19J412m053K498Q17n156K483N041l525j874K418k495j199M266P33j431L87
316A241k943k083L630J423k53K912k582o557K324M215j826K536L428o583l990
331e108M654k64r32O527l43p836O72K552l327L677O330n445m965L888j083k820
347c823O339K608o330p25K715l298K42N845o98m262N05J83j386K583K313k102
$$ plain form
242 -4657 13060 -2966 -10499 7027 4752 -6278 1924 3820 -5272 -2221 2802 680 2211 1355
256 1355 -3385 -1219 -476 -2588 4099 5927 -3426 -3009 896 -4960 -654 9440 1025 -5243 2800
271 2800 -2482 -8985 5983 9228 -5347 -614 5887 -8970 -7436 10892 4262 -6525 4123 2691
285 2691 -10357 -1256 8692 -1069 -2413 4497 -1951 -5419 2464 2141 -1392 2163 245 -3843 919
300 919 2331 -1722 776 1593 -3563 -1080 3961 436 -1438 980 -1515 -2714 1552 2285 854 1241
316 1241 -1702 -3785 -155 1268 1015 3927 1345 -5212 -2888 1327 -499 2037 5465 -1118 -5108
331 -5108 -454 -718 -1650 4877 4534 -3302 -2630 -78 -3405 272 6602 1157 -3808 80 -1003 -3823
347 -3823 2516 5124 -1206 -1931 784 -2514 -2272 3573 2875 -1387 -882 -699 -2085 498 2811 709
363G09j706J03k87R25J708j45j168j076p00R60J710N85k07j638k477P25K942P42
381A705L8n4l378k277L281K416o67J375m52n136q37M226R44J80K377k921n442
398d622J730L850j77J299J401m545l274L105K006l03K136K5m634j610K847J575
414H09N27J129j488l514l77K859J870k62o39j003k005k43L025J851j558j005l11
431c35k061L12M224R80k999r24l03j601K209M014j290l061p4p92o50L355K386
448C390k058j886q02j301J368L489O22j751j837j862L24K990J500n35p09k162
464a220j702K012K270j07K59o49l047l78K874J077j46J52k076j948J795J861k2
481A005L26r82k254N67J722k3Q11M83k715j165K091N01J42J671j719l146J517
$$ plain form
363 709 -997 -894 -1181 -256 1452 1307 139 -937 -1637 -677 1033 1618 1411 -227 -2704 -1979 963 1705
381 1705 1743 1689 -1689 -3966 -685 1731 1064 2439 1987 -3149 -3986 240 1184 1364 3741 820 -4622
398 -4622 -2892 958 781 2080 3481 -1064 -4338 -1233 773 470 2606 2631 -2003 -3613 -766 809
414 809 1336 2465 977 -2537 -2914 -55 1815 1553 914 -89 -2094 -2337 688 2539 981 -24 -335
431 -335 -2396 -2084 2140 3120 121 -803 -1106 -2707 -498 3516 2226 -835 -909 -1701 -2351 1004 3390
448 3390 1332 -554 -1356 -2657 -1289 2200 2822 1071 -766 -2628 -2304 686 2186 1651 942 -1220
464 -1220 -2922 -910 1360 1253 1512 863 -2184 -2562 312 1389 1243 1395 -681 -2629 -834 1027 1005
481 1005 1331 349 -1905 -1338 384 361 1172 1655 -1060 -2225 -134 367 509 2180 461 -2685 -1168
498a168J994p19J157O55l427q44K817j81l69K319j358l338J346J670q82J531R95
515B198l328j111K241J62K42J533j736k064J408L73m23K091j60k801O23J025j543
532a270J555K260k883j534K426o53r15K819p64l337J866J719k107J241J700l461
548a338q03L105r78p06L307j339m023J731J706j624K011J756l735j277K534n58
564b31j15K385j513k375J766K50j064K541K08l677K97J817j194J607K691l217
580A76k776J771n7Q5L438m30l315O69j77j980L182K373l573p1K307l400l20N289
598C191j853m606L192J414l290K919K967m991j993K982j004K79M277j149l499
613a164O14j386j396N011K066l988L61Q08m319J265N563k258l056K961q32k889
$$ plain form
498 -1168 826 107 1264 1919 -1508 -2352 465 284 -85 2234 876 -2462 -1116 554 -328 1203 2198
515 2198 -1130 -2241 0 162 404 1937 201 -1863 -455 -82 -505 1586 1426 -1375 -752 273 -1270
532 -1270 285 2545 -338 -1872 554 -99 -1014 1805 1041 -2296 -430 1289 -818 423 2123 -1338
548 -1338 -2141 964 -14 -720 2587 1248 -2775 -1044 662 -962 1049 2805 -930 -2207 327 -231
564 -231 -346 2039 526 -1849 -83 167 -897 1644 1852 -1825 -1528 289 -905 702 3393 176
580 176 -2600 -829 -886 -801 2637 2207 -1108 -439 -616 -2596 586 2959 -614 -685 1622 -1778 -2098 3191
598 3191 1338 -3268 -76 1338 -1952 967 3934 -1057 -3050 -68 -1072 -793 3484 2335 -1164
613 -1164 -550 -1936 -3332 1679 3745 -243 118 926 -3393 -2128 3435 1177 -1879 1082 250 -2639
629b639L547J923l461k81N33k044K260L530k022j311K79l634k13N798O84k831
645A18J468j049m443J767L782q47J03P30k650m25J773r45R35J774l980r04N745
662B952j068m253M180J98p536K869P576m031k538N586l309o916M821M594l223
677i8J183K200m862j681L455l01J39K471k463k198L004l37k182L023M65m299Q71
694a610L120j137J92J280k537j406J183k5K141K267l771j744L397k493k804O520
710B573J637o948J505M615n437j486O975j374n404L252K143l205J078J590k378
725h64J43O43j390K660J661m422L70L584m464j556P322o45o322L436K496n833
741c181J106N641k993k530L345j096k196K591j04j509K322j016k901L337J306
$$ plain form
629 -2639 908 2831 -630 -911 -378 -2422 -162 3368 1346 35 314 -3320 -3533 2265 2949 118
645 118 1586 537 -3906 -2139 1643 796 899 1629 -1021 -1446 327 -618 317 2091 -1889 -2793 2952
662 2952 1884 -2369 1811 2009 -5527 -2658 4918 887 -1651 3935 626 -6290 -1469 3125 -98
677 -98 1085 3285 -1577 -3258 197 -104 35 2506 43 -2155 849 512 -1670 1353 1818 -2481 -1610
694 -1610 1510 373 565 1845 -692 -2098 -915 -940 1201 3468 -303 -2047 1350 -1143 -3947 2573
710 2573 4210 -2738 -1233 3382 -2055 -3541 3434 2060 -3344 -92 2051 -1154 -76 1514 -864
725 -864 -721 -78 -1468 1192 2853 -1569 -1199 2385 -2079 -3635 3687 3042 -3280 156 2652 -3181
741 -3181 -2075 3566 573 -1957 1388 292 -1904 687 583 -926 1396 380 -2521 816 2122
756B122m091J567K949l999o99M397j437k542K385k3j633J407n82o82K776j775
772A40l010M607N67o145L544N144p325j633Q831k982p191O718L095p948J494O268
788D174m553k720N044p09l195K162M47j279J494r07j367K758o35l035L042J373
804B094m142J418L289l662r95L802j490j677K743j248j846L170j006k931M095
819A614N58n370K950L815n958j60O792l640m891N822J060n605K726L385m322m12
835a636L080j922l71K250j751m1K154l182q36M904j886l857M848Q43o020K618
851h05M384n219j066N604k029l330L736Q8l394J972Q87k271K067J249k903R62
867f8J223l370R84L716k504j244L413j772k874K913K44k338K685Q01l232J661
$$ plain form
756 2122 -1969 -402 2547 -1452 -2151 2246 809 -1733 652 629 -1004 403 -179 -861 1915 140
772 140 -2870 1737 2304 -3841 -297 4847 -2478 -4111 4720 1738 -5453 1265 4360 -3588 -2094 4174
788 4174 -379 -3099 1945 1236 -1959 203 650 -629 865 -42 -1409 1349 714 -2321 721 2094
804 2094 -2048 -630 2659 -1003 -1998 1804 314 -1363 1380 132 -1714 1456 450 -2481 1614
819 1614 2172 -3198 -248 3567 -2391 -2551 4241 601 -4290 1532 2592 -3013 -287 3098 -1224 -1636
835 -1636 1444 -478 -849 1401 -350 -391 1763 -1419 -2255 2649 763 -3094 1754 2597 -3423 -805
851 -805 3579 -1640 -2706 2898 869 -2461 1275 1363 -2031 -59 828 -1443 624 1873 -1030 -68
867 -68 1155 -2215 -1231 2485 -19 -1263 2150 378 -2496 417 661 -1677 1008 1809 -1423 238
883B38J272l791J404L326l903k65N451k941m334M853L88n516L424M309m830p20
899a635M503k989l231L815O99k295K100O46k556O63N39j767J364J278j801J151
915D84J501l038m15K638j833j069L368n13k298K367j46l463J806J938k607J165
931a15K798l026j101L078k067k477L737R24k856J923J354l594k15K283j461j22
947i37K707n98j319P07j438j083K236K19r80K099j49l014J067J231k664R15L401
964B400j829j617K484j081k755K177J250k147J352K036k377j060J507j022o02
979a284K199J08j304P59r9j375N35O48m61P08K11j120M37O10j082L58Q58j575
997h69k6K198p84j351J783l15k529J289J765j698L77K234j880k071J780L89j325
$$ plain form
883 238 1510 -2281 -877 2449 -1454 -1719 3732 791 -3543 1310 1698 -3818 -394 3915 -915 -1635
899 -1635 2868 -121 -3352 463 1162 -1133 967 1613 -943 -280 259 -1508 -144 1134 -667 484
915 484 1985 -1053 -1468 1170 -663 -1732 1636 1123 -1175 1192 1046 -2417 -611 1327 -1280 -115
931 -115 2683 -343 -1444 1634 -433 -2910 827 1751 -1105 818 2172 -1422 -1637 646 -815 -937
947 -937 1770 1172 -147 560 -878 -1961 275 494 -486 1613 1464 -1550 -483 748 -1916 -1001 2400
964 2400 571 -1046 1438 357 -2398 -221 1029 -1118 234 2270 -107 -1167 340 -682 -1284
979 -1284 915 1023 -281 478 379 -996 -461 187 -274 434 645 -475 -38 572 -510 -152 706 -869
997 -869 -895 1303 519 -832 951 636 -1893 -604 1161 -537 -160 2074 194 -1877 -97 292 -1033
1014a033J454J155j728l94R54q56n76J174L83l31J66j96m12j2k15J72O19j21k5
1033A78O43q30j234R26P51p65P01R21j596p93J382l18q56J626O00j843j98R77
1051B72p16n5J508k60j359K64M24m44K80O72j96m12k01j91K04K90J24L37k56r07
1071f22K11P69m61k20R10k45r23O05L62j020K74J137o12o92Q23J8r18L52O13m39
1091g8l0O56k66q43M7N98J64j60J78R5o79m12P85K91n80N61O43j409p58J418J64
1112C85q76J084N19j914j94J655o67q45J669K80j851J95J069r24k10J515j75j361
1130f46L65P12o83k81Q61K00o80m5N34m24o50Q25P15r95k92J094m57j108J032
1149G7O09j221M26J170j337q45J512L4j039R94M24j411J54Q93p84n2J142l90o78
$$ plain form
1014 -1033 421 1576 -152 -546 408 -448 -1024 150 533 202 368 172 -240 -252 -467 -295 324 203 178
1033 178 821 -9 -1243 -317 434 -331 370 1291 -305 -1098 284 -34 -890 736 1336 -507 -705 272
1051 272 -444 -499 1009 749 -610 -346 78 -366 -86 586 390 -22 -223 -414 -210 80 204 541 285 -622
1071 -622 -411 358 -103 -323 587 342 -581 24 386 -634 -360 777 165 -527 296 314 -604 -252 361 -78
1091 -78 -108 548 282 -561 -514 84 248 88 266 361 -318 -730 55 346 -234 327 970 -439 -1197 221 385
1112 385 -491 593 1112 -802 -996 659 -8 -853 816 1096 -755 -560 509 -415 -625 890 715 -646
1130 -646 -281 431 -252 -533 328 528 -152 -197 337 -87 -737 88 803 -192 -484 610 153 -955 77
1149 77 686 -535 -109 1061 -276 -1121 391 425 -614 380 804 -607 -453 440 -344 -396 746 356 -322
1168c22L75l13l15R39J05o31M07j19q01N94M93p63M60P76j184m51J065l09m85
1187d79J098q1j144N05M71p97J69O88l28q9J45m29P8K81k79M37K87j043K61J032
1207G83j267m98K011n04j697J736M72k631J038K372k271q48K872j086k422K361
1223D21Q73k661J152K068k408q52K333o47j326J693K32j638N51P15r55J29P90
1240D70k30j33j33m13M53J01m74Q20J75j418O39J049j725J0K230j254j401K204
1258I70m11k386K108J312k849P28K378k472q52K858j254j784K861o7k863J815
1274I2J237k757R86K275k529m06K763j784j749K934j00k426J982Q34k847Q39K137
1291A481j952l83K114j058j266J455j77r81J178J89q96M21k38m63J083k95r32
$$ plain form
1168 -322 53 -260 -575 364 469 -162 245 126 -675 -81 412 -351 109 885 -299 -750 315 6 -479
1187 -479 619 538 -606 -101 370 -427 -258 430 102 13 158 -271 -193 88 -191 246 533 -510 -249 783
1207 783 -484 -982 1029 525 -1172 564 1036 -1595 -557 1815 -456 -1304 1568 482 -1940 421
1223 421 1294 -1367 -215 1853 -555 -1407 926 279 -1047 646 878 -760 -209 506 -449 -320 470
1240 470 240 107 -26 -439 14 115 -359 461 636 -782 -143 906 -819 -809 1421 167 -1234 970
1258 970 559 -1827 281 1593 -1256 -528 1850 -622 -1474 1384 130 -1654 1207 1140 -1723 92
1274 92 1329 -1428 -442 1833 -696 -1102 1661 -123 -1872 1062 962 -1464 518 1352 -1495 -656 1481
1291 1481 -471 -854 1260 202 -1064 391 214 -767 411 600 -296 125 -113 -576 507 212 -720
1308g20J483j38j994J571J000k629J094K582l080r64L779j710k778L978L76m482
1324b632K582K807m704J23M759l009k485M628q49m242L502J904m375J202L378
1339B589l308j094L417j457j960K931R7k491J305P46j757Q17J017j202M51N81
1355F82j351L95P70j169P77J204j976p0J909j683p15K743j122k044K806j38l295
1372b277K462J896l687R56L203l619j077M539j994l213M433L66m765K764K674
1387B661m798O00M651l455k195M689j158l866L577J285m086J758K820l528n43
1402a588L265j667j616K701l00k093J532O54j595N14O57p50L64Mn45J069j75j392
1420i61J438K37k462J652K244l117k03L543k588k600M280j3m072L344K361n145
$$ plain form
1308 -720 763 625 -1369 202 1202 -1427 -333 2249 -831 -1795 1984 274 -2504 1474 1850 -2632
1324 -2632 -50 2757 -1947 -1824 2935 -74 -2559 2069 1220 -3022 480 2384 -1991 -789 2589
1339 2589 -719 -1813 1604 147 -1813 1118 1215 -1276 29 775 -982 -165 852 -350 101 682
1355 682 -669 -274 496 -673 104 1308 -668 -738 1171 -512 -1227 1516 394 -1650 1156 1018 -2277
1372 -2277 185 2081 -1606 -650 2553 -1066 -2143 2396 402 -2811 1622 1988 -2777 -13 2661
1387 2661 -2137 -1537 3114 -341 -2536 2153 995 -2871 706 1991 -2095 -337 2483 -1045 -1588
1402 -1588 1677 10 -1606 1095 795 -1298 234 888 -707 -193 464 -286 78 82 -463 606 431 -961
1420 -961 477 714 -1748 -96 2148 -969 -1172 2371 -217 -2817 1463 1450 -2622 722 3083 -2062
1436b062L99M285l526j726N107j170l853L779Q09m926J892L386l564m3M056k543
1452C00k619L339m40l029K717J801k705M72J540k279m82J940n85l39J357n72o34
1469b18N90r97l96J544m78n59J806n69j827J456L2k312J719J921k206M82K048
1486B036k886j183L166j253j922L837L53l921J844J696m204O65M315k507j686
1501a650M128j122m117K582J411l406J667L374k690j227K418j691k056K473P75
1516H69j364J509N61k269k34P82p81N72J287m19m4K02j244k37O61o29O18J635
1534A475j103p35J452j277j864K126P21j914J849J696l187o58K469j814j302L451
1550A385J81k587J773P16l335M82K558j663k56K685j182j970J703l30k127J747
$$ plain form
1436 -2062 -1663 2622 -904 -2630 2477 1307 -2546 1233 2042 -2884 -992 2394 -1170 -1213 2843 300
1452 300 -2319 1020 580 -2449 268 2069 -636 -164 1376 -903 -1385 555 -30 -369 988 416 -218
1469 -218 372 -625 -1021 523 45 -514 1292 723 -1104 352 384 -1928 -209 1712 -494 -12 2036
1486 2036 -850 -2033 1133 -120 -2042 1795 2148 -1773 71 1767 -2437 -1772 2543 36 -1650
1501 -1650 2478 1356 -2761 -179 1232 -2174 -507 2867 177 -1050 1368 -323 -2379 94 869
1516 869 -495 1014 1575 -694 -928 -146 -927 -355 932 513 469 671 -573 -810 -149 -778 -160 1475
1534 1475 372 -363 1089 -188 -2052 74 795 -1119 730 2426 -761 -1419 1050 -764 -2066 1385
1550 1385 1566 -1021 752 1468 -1867 -1385 1173 -490 -746 1939 757 -1213 490 160 -1967 -220
1566b20J532j529N41J146k040p63J516n81m18J887M4j305L91l03j176Q76Q91n36
1584d7N36M10j180r2M69r22K87J377o02l71J062q83j112J217l6j169J508R08j758
1603c98K40J016j779k25K152p36j120J928j70k194J077R98j805N55J916j472q08
1620h25J736o56j470J344M05j271Q91Q97j375j47Q94p95k20J029k54l38O59m59
1638D5o68O56ll81P98n3r15O18L33j064M44Q76j000k7J146q99p20J349j56j211
1658h32J022M99j293M95Q71j246p9J306o74o22J064l33r08R84J97j024O73O03
1676G03j128R3Q25q22m9J128o41p23R74j15r24Q13L44r77M92O66j002q8Q94n56
1696i3l54Q49k51n75P36j9p89M22L11n36L85L46o92J55M99o90o7P70m51k62Q72
$$ plain form
1566 -220 1312 -217 324 1470 -570 -1333 183 -398 -816 1071 1115 -190 201 -102 -1278 -402 489 -47
1584 -47 489 899 -281 -373 96 -826 -539 838 236 -135 927 44 -1068 149 113 -1056 452 1360 -398
1603 -398 -158 858 -921 -1146 1006 270 -850 1078 908 -1286 -209 789 -1016 -461 1455 -17 -825
1620 -825 911 255 -1215 129 534 -737 154 1051 -324 -471 423 -372 -592 437 183 -155 504 45
1638 45 -623 33 30 -351 447 394 -521 97 430 -634 -190 686 -314 -341 805 -94 -814 535 379 -832
1658 -832 190 689 -604 -109 762 -484 -563 743 69 -553 511 178 -730 254 451 -573 100 703
1676 703 -425 -332 493 -329 -378 750 109 -614 360 245 -679 134 478 -499 -7 659 -343 -431 463 -93
1696 -93 -447 402 151 -424 312 293 -496 -74 237 -299 86 432 -260 -105 394 -296 -363 407 -44 -306 566
1717E66m16q04Q91J40j013O10O82r86J36R10r28n10J159k22p60Q95J60j009M56
1736d3M74r15J63Q95n22l06O42m21m76P04k7n30N49J63o29K70J83n72L09N48o18
1757a59o9N97m68k87P13k57n18P24O5p82L73M11o03J70N18o15j02O18l44k77N72
1778B80j93l92N64j37o13O18L00p61L06M80q19M2Q86o12m52R69j71q65O64K74
1798C68q47M51O29q34j46P70m11l74O96j28m94M90M6o05L16L32l52J52J61m49
1818b29Q2L11l32R6M23m15q6M49n17k80Q89j06o71O43J23j010M73P34q76m5J070
1839G26o07p52Q48j9p42P46L88r11J74N35o33m6O36l58j51N76m22m38O12o0m10
1860c08N90k1o78M59K87p32K68O31o28o3O26o53k84R49k66o42P76j6r10O29M53
$$ plain form
1717 566 150 -654 237 377 -636 -26 656 -330 -194 716 -212 -722 437 215 -545 350 510 -499 -43
1736 -43 431 -484 -321 574 52 -254 388 -33 -509 195 168 -362 187 350 -279 -9 174 -398 -89 459 -159
1757 -159 -228 369 -99 -386 327 70 -448 276 341 -441 -68 343 -260 -90 428 -187 -289 329 -15 -292 280
1778 280 87 -305 259 122 -491 127 427 -334 -28 452 -367 -325 561 -51 -503 466 295 -570 94 368
1798 368 -479 -28 601 -233 -379 391 -20 -394 302 174 -320 170 216 -389 -73 259 -93 59 220 -229
1818 -229 -147 164 -168 -72 351 -64 -150 299 -218 -498 391 285 -386 257 380 -630 -157 577 -299 -344 726
1839 726 119 -633 215 196 -546 200 588 -323 -149 386 -247 -293 343 -15 -166 410 -12 -450 162 102 -308
1860 -308 282 261 -417 42 329 -403 -135 496 -132 -195 431 -222 -506 443 177 -465 311 295 -615 14 467
1881D67r53L67Q59r38l36R47m97m77J046j30q99O81K33r48M69O00p64K19O74r24
1901c04k10R56m59m15R84k79q74Q04J47r87O15O79q85Q2O20q37p9R85n39l81R35
1922E58m76p28R75j09r67J077M68j458M34R71j309k3J566r56q57J546l33j468
1940a089J252N71j449O88J006j544j23J463r08n92J459l83j120J063R8j246Q63
1957IP73j116K09O72j004K3J006o88j82R83p08n92J054m57p29J409l1j475R78
1976A34N47j629O98J423j584k40J770j216j157J952j41j590J539M67k113Q04J416
1993A080j746P0J845j340q99J820o75j428J797L82j797R57Q41j788L62J474j288
2010c33k38J593r27r89J353l41r89J400J80j404Q06M95j449O09J065j247J88J249
$$ plain form
1881 467 -486 -119 740 -198 -534 413 -84 -561 485 355 -544 137 370 -578 -109 491 -273 -54 620 -304
1901 -304 -514 442 -17 -432 552 273 -601 203 350 -637 -22 657 -228 -146 474 -363 -442 543 4 -377 558
1922 558 82 -646 329 220 -747 330 798 -660 -226 745 -564 -587 979 23 -834 712 379 -1089
1940 -1089 163 734 -715 -27 979 -565 -688 775 -133 -725 734 351 -769 294 392 -854 9
1957 9 782 -334 -125 547 -457 -434 572 -116 -298 685 -23 -615 439 -18 -747 662 631 -844 134
1976 134 681 -948 -250 1173 -411 -651 1119 -97 -1254 698 557 -1033 506 973 -1140 -336 1080
1993 1080 -666 -596 1249 -91 -990 830 155 -1273 524 906 -891 66 907 -881 -519 955 -333
2010 -333 -571 1022 95 -894 459 118 -871 529 709 -695 111 606 -843 -234 831 -416 -228 1021
2028A021j368n22J592p07q18J692m20j611J484M16j876J151J264k077J54J867
2044A242j749o34K487q76j839J994J12k249J582J368k284L70J869j950p15K240
2060I68p67j237J942j52j942J210O70j662P80J242j367P0J141j339m65J435n71
2077d4m51J424n67j165J152k25j289J447P10j572P54Q07k032K43J920j359n53
2094h00K126j041j688K018P2k095J659J146k459N02J998j923m74K337j324j614
2110a560K322K2k003J649Q60k370N45J553j750m4K111j094j108J554n71j341J511
2127B86L61j334J004N61j496L51P12j201M29J267j058j12J164j246p27J570n58
2144b7q59J952j26k021J157N99k052J066J895j969l00K081j641j399K509j52k013
$$ plain form
2028 1021 -347 -869 723 16 -802 890 470 -1141 343 759 -1117 34 1298 -779 -625 1242
2044 1242 -507 -1141 1346 470 -1369 625 737 -1512 70 1438 -846 -476 1393 -557 -1272 968
2060 968 201 -1036 906 754 -1188 22 692 -970 -190 1052 -315 -245 896 -443 -908 527 -44
2077 -44 -495 929 362 -803 349 124 -1165 282 992 -580 174 981 -1051 -808 1112 -247 -800
2094 -800 1326 285 -1403 615 687 -1408 251 1397 -1062 -560 1438 -485 -959 1378 54 -1560
2110 -1560 762 784 -1219 430 1290 -1080 -535 1018 -732 -776 1335 241 -867 687 116 -1225 286
2127 286 647 -687 317 878 -618 -267 445 -756 -327 940 -118 -230 934 -312 -1039 531 -27
2144 -27 -886 1066 940 -1081 76 675 -1377 -311 1584 -385 -685 1396 -245 -1644 865 713 -1300
2161a300J886O64k582R11J855k097k38K216j378j199K193l21j787J548N18j973
2177a084P84J262j444J76J330j267n52J312n79n84J253l04q74R94j57j128J002
2194A40L48j159Q72O71j519L50J165j495j63J822r29r09J769n98j789J681O61
2211I18j943J054J423k157j30J969j452q63K336m75j918J587M66k011J037J422
2227A263j799l1J626j264p79J686m01j067J291k8j364Q69N90j155N15P76j122
2244c94N9R29r12j94J164n82n79J009m24q53J137P9j114Q68M81j374M69J004j271
2263d98J4J468j028q20J503l60j242J368L60j628P99J026j594Q4J470j079n89
2280g46J576n67j212J342J84j447Q82Q47j346J83J097j132l73J350m20p68R58
$$ plain form
2161 -1300 586 1250 -1332 -421 1434 -663 -901 1315 -63 -1262 931 610 -1177 371 889 -1084
2177 -1084 -300 962 -482 -306 1024 -243 -795 517 -62 -646 607 303 -571 423 266 -862 140
2194 140 488 -671 201 872 -647 -297 868 -627 -790 1032 103 -806 963 365 -1424 257 918
2211 918 -1025 29 1452 -705 -835 1134 -318 -1181 1155 680 -1238 349 815 -1196 -159 1263
2227 1263 -536 -567 1059 -205 -984 702 301 -766 525 497 -867 2 592 -563 -48 728 -394
2244 -394 -335 594 -318 -512 652 70 -509 500 76 -777 360 439 -675 193 674 -700 -231 773 -498
2263 -498 -484 984 -44 -864 639 279 -963 405 765 -863 -64 962 -632 -548 922 -157 -746
2280 -746 830 263 -949 393 577 -870 12 859 -487 -304 793 -339 -712 638 218 -550 408
2297D08j28r57P19L68q00M55M69r13J00O10o03J25Q08p39m59Q17l59m51J067o7
2317D70j026O19K64j083N56J017r34j66R34q95n86J310j15r68R33K81j239N01
2335a27P68j080j4J089o48m45J058l05r03O76Q1p76P61O16q59j5M03p98j0J003
2355D75k85l56O34l81p44O23K49n20M70K78p95J47N74m89o3M92n53k21Q31j17
2375B49m13N49k68q53N09M72m42M86N07j027l44O41l42o2R90j97q01M83N1p90
2395f02M68N90o56P4O79n47l17O64l56o28O09K90l25M28J44q47j43L83j81K93
2415B0O11l29m04J20l83k01P35J68l33K58j03o06L16L96m79N6M74l70j20N71k70
2436A27m90L62l2m14N64M51n04l5P0o05M1P55o9j73L64l33n59L50J97k59L56K48
$$ plain form
2297 408 280 -677 42 410 -390 65 534 -379 -279 331 -272 -147 661 -78 -537 280 -79 -530 537 470
2317 470 -556 63 327 -756 -200 817 -117 -283 651 -244 -830 480 365 -603 330 611 -628 -127
2335 -127 641 -439 -453 636 -12 -457 601 296 -607 69 150 -626 135 751 -108 -123 280 -518 -528 475
2355 475 190 -166 468 87 -657 -34 215 -305 165 443 -352 -205 369 -120 -183 309 -244 -465 366 249
2375 249 -164 385 117 -736 -227 245 -197 289 796 -231 -575 66 -276 -338 652 455 -346 137 188 -602
2395 -602 -134 456 -200 -126 553 6 -311 353 -3 -631 -22 268 -57 371 515 -332 -475 -92 -273 20
2415 20 631 302 -102 18 -365 -566 169 337 4 262 159 -447 -131 265 -214 -158 316 -54 -174 397 127
2436 127 -363 -1 -33 -447 117 568 64 29 99 -506 -465 290 221 48 412 79 -480 -130 67 -192 164 412
2458D12n00m6K91k76m8L38k31j54M57j4k91J77j15l88K89K97k17J75J97m91j87
2479c25L20j31M9M84j98m24K46nl40L44K43m02Q9L33l83j40M36j75k82L58L3l10
2501a80K64J75m22rK67j73J2K91j53j81J66q3j44K06P2j17J32n4k33J39Q1j37
2523h1J45Q9k30M9J71k80pL64j65j91K80j21k87L49J39l69J08K45l53l5L82j76
2545B6j73L41j38l39K87J71l01J47J61l84RL79j62j42K45p7k76J93J47j30P0P0
2567A24j93r8J25R0J02m9j49Rj3q0K40J09k98KK16k65m6M50j11m11K70L5l51L60
2591F8L96n30k00L83k39j53O23Jn65J54J46m30K02N67k39l13J70j71k02M24K19
2612C11k59r5j3j37J19J88j0J0j28k17J25J65m0J41M3m03p8L49kn3K52k12l97
$$ plain form
2458 412 -88 -134 157 -119 -167 171 -60 -214 243 229 -62 115 0 -388 -99 198 -19 156 353 -138 -325
2479 -325 -5 -136 -87 397 199 -225 21 16 -324 20 263 -139 -50 283 -100 -240 196 21 -261 97 130 -180
2501 -180 84 259 -163 -172 95 -78 -66 225 72 -109 57 -26 -170 36 108 -9 123 69 -164 -25 56 -81
2523 -81 64 153 -77 -28 143 -137 -144 220 55 -136 144 23 -264 85 224 -145 -37 208 -145 -180 202 26
2545 26 -147 194 56 -283 4 175 -126 21 182 -202 -193 186 24 -118 127 50 -226 -33 114 -16 54 124
2567 124 -69 -167 -42 48 150 101 -48 -39 -52 -132 108 217 -81 -79 137 -128 -174 276 165 -246 24 59 -292 68
2591 68 464 -66 -266 117 -122 -275 348 349 -216 -62 84 -346 -144 423 184 -129 41 -130 -332 92 311
2612 311 52 -43 -56 -193 -74 114 104 114 -14 -231 -106 59 19 160 203 -200 -278 71 69 16 268 56 -341
2635c41K89J93k08K09J63m98o4L74j56PM32l03m99L40J77k37L38J83o49q6M56
2656A20j69m3N25k42n77K63J47k28L65L17n41k41K58q0M7M20r8l89L0pm5K70J32
2679B34j73p3j20j50K95K14j62J7n6l67J64M82k14j65L16l21l68N69K17m62K06
2700H3K06o55LP33j84l23M09k19n60M89M18m39O4K53n38j07N66o6j63L05k32m80
2722d37L53K47j61K06J4n06J3L69j21N5L00l33l16K94J1j09L66k0m42P7J43j38
2744a35K44K22m08j19K58k04M0M41k40l33L12r4l09N15K01n87R2K98m90J10O96
2765E10l85m51M88j15m78N83L09o60J02L83n75j3P01k19m19L98j03m87M74L18
2785C61m54J8K55l61l1M06j29j40J89j52j48K59l4r6K12j42k84L38R8l49K39J94
$$ plain form
2635 -341 -52 141 -67 142 305 -193 -257 117 -39 -32 400 97 -402 -62 115 -122 216 399 -250 -336 120
2656 120 -49 -92 433 191 -386 -123 24 -204 161 478 -63 -304 -46 -126 -79 341 243 -146 -116 -123 -168 102 234
2679 234 61 -12 -132 -282 13 227 65 82 26 -341 -177 305 91 -74 242 -79 -447 122 339 -123 83
2700 83 289 -366 -363 370 186 -137 272 53 -507 -18 400 -39 25 278 -260 -367 199 133 -30 275 43 -437
2722 -437 -84 163 2 208 222 -284 -271 98 -23 32 332 -1 -317 -23 -12 -121 245 225 -217 -140 3 -135
2744 -135 109 331 -77 -196 62 -142 -102 339 99 -234 78 -16 -325 190 391 -196 -104 194 -296 -186 510
2765 510 125 -326 162 47 -431 152 461 -199 -97 286 -289 -302 399 180 -239 159 56 -431 43 361
2785 361 -93 -75 180 -181 -212 194 65 -75 114 -38 -186 73 39 -57 155 13 -271 67 165 -184 55 249
2807B49n04R2M80l58j97N22k07m45M68J20m66L22K34n92R9N16m13j32N88l31m51
2828d06O21L8o25M04L62o19L2N44m18k29N82j50m19L96N6l91K17J57l25J85K25
2849B37l85J1K92k74OM05k52k98L22o0k21L57P7l23J32Nl66L46L17m00N3L02n64
2872b81j38Q02j88n00N81J9q06L47N89n56m9O02m36l78O21k2m37L26K8m44L45
2893B5L67m44K7K42m93q3O47r4k62L38j87n40K93L44j50J46L7m24L1K29j41J77
2915H5K22n08q4M77k17j17N24k39o95L79L39l01L56L47p50l02M26j31R3O99k74
2936C29o07K61p8m43O41M81o56m3M12n03j62P24j78n57L62K21l12K91J76n09j47
2957b97J55n7L20M02l03k98k2l60M2P32J01l36J14k24m75L35M08k44R4J34m31
$$ plain form
2807 249 -255 -163 317 -41 -238 284 77 -368 100 220 -246 76 310 -282 -183 333 -80 -212 376 45 -406
2828 -406 215 253 -372 32 394 -225 -193 351 -67 -296 286 136 -283 113 169 -222 -5 152 -173 12 237
2849 237 -148 -137 155 -119 -113 292 40 -258 64 4 -217 140 217 -106 26 31 -335 11 328 -72 -19 283 -281
2872 -281 -419 383 195 -305 276 295 -511 -164 425 -131 -180 422 -14 -392 229 207 -230 96 124 -320 25
2893 25 392 -52 -25 217 -276 -359 288 194 -68 270 83 -457 -164 180 30 176 213 -211 -180 49 -92 85
2915 85 307 -201 -285 192 -25 -142 382 143 -552 -173 166 -135 221 568 -182 -484 -58 -189 -96 603 329
2936 329 -278 -17 -95 -538 103 584 -72 -115 297 -206 -368 356 178 -379 -17 204 -108 183 359 -150 -297
2957 -297 -142 -199 121 523 220 -78 -100 -460 -418 314 415 79 193 -31 -506 -171 237 -7 87 221 -210
2978b10K4M39k50j76L31l23k79P04K48n57J07L7p16J75Q44p1j99K67m57n80M11
2999b31L32r3L73L0o02pK55k55J28L95l45j99M88o9l54K21l8m26K60M09j12Q7
3021B47J7n04j66K67O0K56L63l87m22J98j19j60N63J65m77J02J83m39P2M27k94
3042d8j97L92j08j58M27j34n50K35J90k86L56M13n32k49L22k81j76O30J13m19
3062f0J25K0l96J73L17k08J8J97k33l1K43k25j37K95p9j75L77J1l79J12O9k99
3084b65J97L57k33q0J60k90r7M15j16j96L62q7m31L26J88m46J79L59m15j06M79
3105B60j90l30L60ol34K97J67l57O8K19k89M2L09k40j14K96j59k01L47Kk94J83
3127C6Q1k88J55K34k52l0J72j92QK77j67j58K37j18k03L41N9l29J60J21m01J25
$$ plain form
2978 -210 -186 253 3 -173 158 -165 -444 260 508 -49 58 95 -621 -446 398 327 128 395 -62 -642 -231
2999 -231 101 8 381 411 -191 -198 57 -198 -70 325 -20 -219 269 200 -154 67 29 -397 -137 272 160 247
3021 247 264 -240 -406 -139 -79 177 540 153 -269 -71 -190 -350 213 378 -99 3 186 -253 -181 246 -48
3042 -48 -245 147 39 -119 308 174 -376 -141 49 -237 119 532 0 -249 73 -208 -384 246 359 -60
3062 -60 65 85 -311 -138 179 -29 -11 186 -47 -78 165 -60 -197 98 19 -156 221 232 -147 -35 34 -265
3084 -265 -68 289 56 -24 136 -154 -251 164 48 -148 214 127 -304 22 210 -236 -57 302 -113 -219 260
3105 260 70 -260 100 94 -240 57 224 -133 -65 154 -135 -93 216 -24 -138 158 -1 -202 145 147 -147 36
3127 36 117 -171 -16 218 -34 -64 108 -84 -76 201 34 -124 113 -5 -208 133 192 -137 23 144 -257 -132
3149a32L90k34r2K20k41j76L69Lk23K53j8l83K24K44l55Q4L27l67j62M97j05l42
3171b19L20km06K48L37k75k7J64k88q8L18po6J93j53k71J77O3p0K16J2l00O9J37
3195H2j83J28J83k83l9K45j76n4L63j84l64L02P9l07L23K63n31r9L77k07j11M69
3217B76q4l99J82O1k44K12K49k93k7J23k21P1L31j98j74K20j24j98L80N1l36J31
3239a1J05l10J18L47k15r4J70k26j07L65j9j83J68n6l11K39K20k67P4J71l09m3
3261a74L06j06o3K13j79k27K83K5j89K51K1m24J68L05l30K1M10l20l13M07M0l19
3283a94K83J58m37lL07j47j2K26j83j69J90n5o0K63p2k30J75k7k19K77J64l47
3305a12N1K08k78NL88k00k47K88o5k71L41J42l95J12K14l72K7M41j92k30K76j03
$$ plain form
3149 -132 258 24 -68 152 -89 -265 104 107 -116 137 119 -264 -40 204 -151 -67 260 -107 -269 228 123 -219
3171 -219 101 99 -307 -59 278 3 -24 140 -148 -236 82 75 9 202 49 -222 -45 18 -52 164 176 -124 -55 82
3195 82 -101 27 210 -73 -112 133 -43 -97 266 82 -282 20 99 -208 115 378 -153 -252 125 -82 -193 276
3217 276 192 -207 -25 36 -208 4 253 -40 -67 56 -165 -94 237 39 -135 85 -39 -237 143 194 -142 -11
3239 -11 94 -216 -98 249 34 -60 110 -116 -223 142 123 -60 108 52 -259 -20 200 -67 7 178 -131 -174
3261 -174 132 26 -37 176 -3 -230 53 78 -111 140 161 -263 -95 210 -120 -99 311 -9 -322 85 125 -194
3283 -194 89 247 -190 -193 114 -33 -45 181 -2 -171 19 -36 -96 167 95 -135 40 13 -206 71 235 -112
3305 -112 -61 147 -131 -126 262 62 -185 103 38 -233 108 250 -145 -33 181 -191 -164 277 85 -145 131 28
3327B8k78K87J49k40P4P9k33P3J59j52N0J57k62l4K96j68j20L00j00l24K88J48
3349A77l26J24K22l31m2L28j46j21K71j01k59K19O6j77J66Q1l19R2K04j86K1K40
3371B03k36j32K73q7j65L13j4l33J78J21k79J52K83l23j21L10j48k01L48K4l29
3392a63J62J25k62O9K29j65n3J48j43l3J76q5o9J44r3j08K16l0k05J89O1k61J34
3415a7K00k68j9K61k00j45L43l7k99K24Q6k95J43K32k54m6K50j76j38K70m1j69
3437i5J84qk19J29J25j86P9J39k20k0K15j40p9K17p2j66J65%j79J55J05k27N3
3460d5J47j71lJ84j25q6J95p1j42J59Nj43J26M3j77J03Q7j81N8J54j67j5K24j78
3484a9j59K79j4k36J93J24l00O6K25k13p2K74p9j62J46rj52J26O8j39N8Q5j54
$$ plain form
3327 28 -250 37 186 -54 20 99 -134 -61 98 -54 -4 153 -109 -143 153 -15 -135 165 65 -259 29 177
3349 177 -149 -25 197 -134 -176 152 6 -115 156 55 -204 15 81 -96 70 151 -168 -76 128 -58 -37 203
3371 203 -33 -165 108 21 -144 169 155 -178 0 121 -158 -6 277 -46 -167 143 -5 -206 142 166 -163
3392 -163 -1 124 -138 -69 160 -5 -58 90 -53 -86 90 5 -64 80 -13 -121 95 65 -140 49 110 -151 -17
3415 -17 183 -85 -104 157 -43 -188 155 118 -181 43 129 -166 -23 209 -45 -91 159 -17 -155 115 74 -95
3437 -95 89 81 -138 -9 116 -70 9 148 -72 -92 123 -17 -96 121 49 -117 48 48 -131 24 129 -98 -45
3460 -45 102 -69 -72 112 -13 -99 96 25 -117 42 47 -96 30 73 -104 -1 86 -95 -37 117 -50 -65 159 -19
3484 -19 -178 101 87 -149 44 168 -132 -66 159 -54 -126 148 69 -93 53 44 -108 18 86 -53 5 90 -64
3507f4J1J09j07J9J50r6q7J19n8q3J28j3r8J01L1j55R6O3j55O7J50j95m5K43r5
3532C6j77J98J7k17J34J28k16N0J64j48n1J49r6n6J94o4j37J47Lk16J42J24j75
3555f7M4K07j91j31J75j2j20J68L7j36M5Jj09N3R4o4O5M5j59k4J27r3l7J92o5
3580D5j21J32l1j66J37P5j66R8J14j87KJ83j66j03K39k2k10K03P8k45O4J68j87
3603f6n2K18m5j15J34k9j50J04L4r7J07P2j34K3O2j85K7J82o4m3J33o5j51Q6K4
3628A0q9J26P6j34RL6j48O8J36j19rJ75j30j58J88mj73J80Q8k26L0J49j34k9J68
3653H6j06p2J69n9j41J69K9j90J03J05j93L2K05j35j05J70m2j37J27M7r8M9N1
3676F4j04J3M3o3O3Q5j32RJ14j44o4K01m5j12J57jj85P0R7j33M4J30j32m0J39
$$ plain form
3507 -64 -53 56 -51 -32 118 22 -65 54 -4 -87 41 28 -70 31 62 -93 3 66 -89 -22 128 -67 -112 131 36
3532 36 -141 57 74 -143 -9 119 -97 -47 117 -31 -82 67 -29 -85 109 45 -92 55 58 -158 -16 108 -67
3555 -67 -23 184 -7 -138 37 25 -95 73 110 -26 19 20 -89 -36 58 -6 59 104 -55 -79 48 -45 -82 110 45
3580 45 -76 56 25 -141 -4 71 -95 3 117 -70 -68 115 -51 -154 85 63 -147 56 134 -111 -47 121 -66
3603 -66 -118 100 55 -60 74 45 -105 -1 33 -64 43 115 -19 4 66 -119 -92 90 26 -17 116 51 -100 -14 10
3628 10 -79 47 123 -11 -2 34 -114 -46 90 -29 -38 137 7 -151 37 33 -140 40 128 -98 -68 81 -53 -82 86
3653 86 -20 -92 77 18 -123 46 75 -115 -12 93 -100 -68 137 2 -103 67 25 -112 15 62 -36 13 64
3676 64 -40 -27 16 -47 16 101 -31 -22 92 -52 -116 85 40 -72 85 84 -101 -31 66 -67 -23 107 -25 -65 74
3701G4j14q3K07jj68J29L7k18P7J83j51n7J92p9j67J35L3j04J11M6j35QN0p9O1
3726a3R2r6k4J02r5n6J51j9q5R7rj23P3N9q5M1N4j02L7Q2j31j1J50r2q6J65j6
3753F0j79J30P3j74L7J84j24j03J32n5q4J49J9j16O5Rj22N0J23j09K0J15j32r6
3777a28J41K0r4J01K7j42OR1n8L0O1o3j8M5o1L3J13j09o0J04m0r3J60M5j74M2
3803b1Q4j28J9J35r6m0J22o9p8J35j4j36R0P0j35P8J28j94j04J79m1o4J91L1j90
3828d8k6N5r3N9J55jp7l6r6rJ33MJ3O7j00j01R0K9p9Q2L8j06J1R6n8k2O0q9m3
3857i2J32K1o1P7l9j91R2J27q8M4J30j49j16J07J6m9J12kj28M1P6o3K4J9j32J9
3883g3J20j8j0J05j24j65Q8O7j7J38O4k03j12P1mM9J41j3j21pl5k0R0M0m9K0j7
$$ plain form
3701 74 -40 -123 84 83 -85 44 81 -137 -60 123 -28 -85 107 28 -139 -4 29 -75 36 82 -53 -45 5 -74 -13
3726 -13 79 -17 -41 61 -34 -90 61 42 -43 54 45 -78 -5 54 -31 10 64 -38 -1 81 -50 -61 89 -3 -89 76 60
3753 60 -119 11 84 -90 -53 131 7 -96 36 -19 -103 46 65 -51 14 23 -99 -49 74 -35 -15 100 -32 -128
3777 -128 13 33 -61 40 67 -75 -69 22 -36 -6 55 -8 -26 19 -42 -9 104 -5 -65 39 -1 -94 66 111 -63 -21
3803 -21 63 -65 -46 89 -7 -47 75 6 -72 63 49 -87 3 73 -62 16 144 -50 -154 25 -16 -80 111 142 -48
3828 -48 -74 -19 -112 -53 102 101 24 -12 -108 -117 16 20 33 100 0 -101 -11 18 -61 21 59 -47 -36 60 2 -20 40 -49 -92
3857 -92 40 61 0 77 38 -153 -61 66 -22 22 152 3 -113 -6 10 -39 73 71 -57 -16 60 -3 21 40 -92 -73
3883 -73 47 29 19 124 0 -165 -77 -10 -27 111 175 -28 -140 -69 -73 -24 117 104 -17 -24 -59 -79 11 51 2 22 5
3910En4N7O3q2l1L0l1M2J26o4j13K2j8m8J51P5j11j4K3j41K5J87j2j10N9j7j24
3937a05J01J08j03n3P3n5oJ21j1r3kk4m6J14P0m0l8n6p8L5J31lj4No9m3N1M4J1
3966B5K7o1m7K8L9j8N5pj11J6J10k8j8M9p3r0R6P0n0K7J5j15PR2k3J5O1j03p9
3995i1R7N0o0M9J8j25kJ13k3l2O5m6r2M3O3qljn6k0L5M1L1k1q5J4M1j6M3M5q3
4026a6n9O1qNQ4k3r9K2K5l4O9N4j10m3Q8j7k2J15m3j17M1N4o3P3P3j10q4O7QJ3
4056DQ3j2j13j1K8PL8M9n8n0PMK8L5j1l7l0k6O1N9k6n3jn4NJ32K0j10J2K9j12
4087a03N3J55p4o5N6n6q1J26J20j12m1M8r9K1J54k9r4J9j5n4R1P7n1l9k4o1M5
4114c3R7pj1l0r3K0Q4J3k4L1o4p6Q8N2m6L5Rj24nR9J3qM6j00p4Q3M4nM4l7j06
$$ plain form
3910 5 -49 8 71 -11 -42 -12 -43 -1 125 61 -52 -30 -48 -96 55 130 19 5 28 -113 -88 99 87 -23 36 19 -105
3937 -105 -4 104 1 -52 21 -34 -40 81 70 -23 -25 -49 -95 19 89 49 11 -45 -123 -88 43 40 26 31 -38 -81 -30 14 25
3966 25 52 -9 -56 -28 11 -7 48 41 -70 -54 56 28 10 59 -14 -104 -8 62 12 39 54 -61 -54 38 15 30 91 -12 -91
3995 -91 6 56 -4 45 63 -62 -64 49 26 -6 59 13 -79 -36 27 19 16 15 -41 -61 -26 15 46 25 -60 -46 -5 -21 22 67 -16
4026 -16 -75 -14 -22 -17 67 44 -55 -33 -8 -42 27 81 -29 -72 16 -1 -23 92 49 -68 -27 27 -36 37 110 0 -84 -17 -9 4
4056 4 87 75 -38 -49 -21 -14 24 73 15 -35 -28 -24 4 39 28 -9 -39 -65 -4 55 29 -24 -25 -79 -74 58 78 -32 -20 9 -103
4087 -103 -50 105 31 -34 22 -34 -115 11 131 19 -22 26 -73 -52 102 73 -21 -2 -17 -71 20 97 46 7 -17 -78 -33
4114 -33 64 57 46 16 -77 -57 27 40 16 47 -17 -93 -5 47 1 36 45 -79 -84 15 28 20 66 -34 -108 -25 19 14 58 21 -85
4145h5K9O3m3O5O1j30o1J18k5k7J35n1j58N7J01q2O1P9j38p0J40kq9J15J8j33
4171e2qR4l5J9N8o4p5K6L5L6M5p4k2J3n7L5R3k4q8P1l4r8J03J14j21m2J02r3n3
4200i6J65Pj53N3P6j43M4J34q6n2R3m9o4R8K9q8K8Rn8N5N1o9J0L6p2L0O3o0j7
4229b6R2o3p9J04L3q6L7M4j01oJ25n9l7N8k4l8L7ml0M6Np1L8Mn5P0L0r7L0N9p4
4260c8j4J07n0p5J08lj39R7R9j40nJ21j00o6J44Mj33Q6N8j15LR7l5m2O7l4l2L0
4288@J7jJ4n1PM6k3j7N3k3p1P1K5r3M6Q6j19k1J03m0m1P6pj23P2P1q0RO0p1l3
4319e8R0k8m8P7kq3K8K0k9N7K7p9pM7l2RP1n6m9P1j5p8Q0N6r2MN4m5k0Q4l2o7
4351d5M1K2LmMm0J7lnM9J5m8Koo2N0Q5p0l8O1m3l8R0lj03N2P3q5lQ8n7n4P0k1
$$ plain form
4145 -85 -56 7 -36 29 90 -40 -101 17 -8 -35 100 49 -109 -52 49 -33 28 107 -31 -101 39 37 -52 63 81 -52
4171 -52 -60 34 -1 18 76 12 -63 -37 -2 34 79 5 -17 -4 -61 -26 67 43 -45 26 -8 -106 -3 111 -10 -52 50 -43 -96
4200 -96 69 76 -77 -24 52 -91 -47 87 1 -51 42 -7 -71 27 56 -32 -4 5 -53 2 53 -16 -6 30 -42 -12 51 -9 -26
4229 -26 66 3 -76 28 61 -25 12 56 -45 -51 74 15 -22 36 12 -26 11 7 -23 23 28 -43 -5 -1 -56 14 44 -53 -23 36 -38
4260 -38 -52 55 5 -70 38 35 -104 -7 92 -48 -53 68 -32 -98 46 50 -83 3 61 -54 -51 46 11 -31 36 2 -30 0
4288 0 17 16 30 -21 -14 32 9 -8 45 22 -49 22 47 -46 0 86 -33 -54 49 9 -32 44 37 -86 -14 57 -23 -14 46 -25 -58
4319 -58 32 4 -44 33 31 -52 -24 -4 -33 24 51 -28 -35 12 -20 -11 60 4 -45 26 11 -67 13 69 -23 -19 35 -10 -30 54 22 -45
4351 -45 -4 18 21 17 21 -19 -2 -5 -10 39 54 6 8 2 -60 -10 75 5 -33 28 -15 -53 37 34 -69 -17 56 -29 -32 56 -1 -55 15 -6
4385fn6Q1N4q6k7J8j4K0O6k3m5J3mrJ8J9j5L1k3l8M1K0m8J7Jm6L7R3n6n1K0m1
4417c9j1Q3K1k4mj9p1K1O8jJ5J1q2k3Q3j6l1K1lm0N7M0p4qK2k9k0Q4J2m4L2n8
4449b7p1M3P6J4Kj3o1l0M4K5KqJpmQLK7l7j9M1J2J2L4m3r2%O2K4J8M5n1p0PK4
4484iqO4L9o4m7PL%O2m4m2K4L3j7J4Jo2mL8KM6K2m1n7qkN4N9j0m8l5Rj1L9J6j6
4520G%j8k3K5K0Oj8nk0J2N5Pl1k0k0j6O2M9m3k2J0n2JM2L7l6J8j1n9QO5Pl9j2
4554a4qoM8J7n0j1Mj2K4K8Klj8m6%N6J0Rk6l6j5M8K3j3Rj2m2QM1lkK0k4m9M0K2
4590A9MRj6l9J4K7Jjqk5J3J6j4QK8j4n7J9L0PK2mo8lM2pmJ9j6k1RK5l7K4J2nj3
4627dk3L2LQl0pKJ7J8K0l1k4K2nqK7K0l8lJ0l2J5M4rm0K1Jk4L6Ql5j4N1j1nJ5
$$ plain form
4385 -6 -62 19 73 -13 -40 -22 -36 -16 50 27 -18 -5 -9 -18 0 19 4 35 12 -26 15 35 -13 4 5 -41 -4 89 33 -18 2 -39
4417 -39 -50 33 54 30 26 7 -64 -43 25 24 39 50 -32 -55 28 12 -19 2 -1 -41 16 56 -18 -26 -4 -33 -53 31 43 -1 31 -27
4449 -27 -98 -55 21 35 37 24 -37 -67 -23 2 4 -4 -3 -10 -14 -6 -3 24 -13 -32 9 21 33 67 24 -68 -68 -6 18 36 81 30 -40 -33 -9
4484 -9 -17 47 86 22 -25 -18 -15 -15 47 3 -39 -15 18 1 15 16 -46 -50 -12 -10 36 58 17 -40 -48 -50 4 63 53 5 -30 -21 -32 7 23 7
4520 7 7 -11 -34 -9 11 17 -1 -6 -26 -14 41 48 17 -3 -23 -39 23 72 29 7 17 -35 -34 8 45 9 27 16 -43 -35 30 37 -2 -14
4554 -14 -22 -28 20 37 -13 -24 -20 -32 -8 20 22 19 1 -45 -45 11 21 30 4 -32 -47 1 24 11 20 8 -34 -26 15 12 10 30 6 -43 -3 19
4590 19 23 32 16 -23 -9 18 19 18 10 -15 -2 14 0 8 36 22 -35 -16 14 21 43 39 -29 -32 10 3 -1 18 2 -19 -10 15 -22 2 14 9 -4
4627 -4 -27 5 8 16 -14 -21 -19 -2 16 36 5 -19 3 -2 -10 17 37 -1 -4 6 -26 -11 33 24 -16 5 6 -18 18 26 -9 -23 28 17 12 27
4663B7pj7oOMJ5Nj9j4Nj8K3J9l6rL5k5lL8l1j5J6J2k9J6L3m3%J7k0kN0j2k6Pn
4699ijJ4kj5RJ8l2oK9pJ3Qj8k6L6J3m0J9Qj7K0Pk9LK5Rl9K8%k0J7Nl0J5K0qk6
4736iNmrL7k6j1J0J3j4Okj8K3Nl4KJ7JlPorK7ll6J7J6JjJ3l7JM7j1k9K1Ok8M0
4775B5k4mOJ6j1j9PJ2NJ3k9k2K1J6j3RrnJ5Pl0nM5k6JKj7nK8Kl4PL7k0lJ1m1%
4813c2M2rk8K7lmj0Mj0M0J2l3j6lJ3PJ8j8NJ1nj3K0JlJ0j1l1J8L6j7j2onkL6j0
4850A9k8QK0j9nK1k0JMmk0L2Oj1pk2RL0Ml3oJ8k2RK4qjK2l0k4K3K0j8QMm1J9L2
4888A4J5k7j0PrJ9kj3K2jj0j8JK2J7j5k3J4J7qkPj9j6L2Pk5K3Jk8j8M3j1KK7k9
4924Fl7K2J6J2j0oj2qJ4lmQj0Pj2qK4L2k3k2j0J3PJ5jl4J8J4qj5K3Nk5MRrJ0L4
$$ plain form
4663 27 20 3 -3 3 7 22 27 8 -6 -1 -19 4 23 -13 -22 13 -12 -15 23 -8 -23 -7 5 -24 -8 25 -18 -18 -1 -21 -23 27 15 -11 -4 -9
4699 -9 -10 4 2 -13 -4 14 -18 -24 5 -2 11 19 1 -25 11 24 -16 3 11 -6 14 21 -8 -5 20 29 -10 18 18 -2 15 20 -10 5 25 17 -9
4736 -9 -4 -8 -17 20 -6 -17 -7 6 -8 -2 -4 -22 1 6 -28 -26 -9 -8 -11 -4 -10 -19 8 5 -31 -14 2 3 2 15 -22 -21 26 15 -14 7 13 -15 25
4775 25 1 -3 3 19 8 -11 -4 8 13 26 -3 -25 -4 12 -1 8 -1 -6 9 16 -14 -19 26 0 1 3 -14 -19 9 11 -23 -16 21 1 -2 9 -32 -32
4813 -32 10 1 -27 0 -3 -7 -17 -13 -23 17 29 -4 -20 -23 -10 -3 15 -3 2 13 8 -5 15 16 13 23 12 -19 -1 35 18 6 0 -5 -7 29 19
4850 19 -9 -1 19 0 -5 16 -4 -3 1 -3 -23 9 15 4 -3 -25 -16 14 18 -15 -21 -3 -25 -16 8 0 -1 21 -9 -33 -10 10 -8 0 4 -37 -18 14
4888 14 29 2 -8 -1 -10 9 7 -6 16 15 5 -13 -12 10 27 12 -11 3 20 12 10 17 -2 -18 14 21 -4 19 20 -8 -26 17 6 8 35 6
4924 6 -31 -9 7 19 9 3 -9 -17 -3 -6 -10 -2 -12 -5 -17 -25 -1 31 8 -14 -24 -11 -4 11 10 -24 -6 8 0 -15 8 13 -12 -8 1 -8 2 36
4962C6k5k2jRK2Mj0j6MkK5j9rjJ7k1j5K3L0j9oj6j8J5M7qm8J8Jj5QJ0qoK1k3r
4999b7J2K6ok6lRRJ1Rqj8nL3mk8K2loj3K4pJL5j9o0N2K6m1J1J1k3rL7J4m2J6J1
5036B1l6KJ8jJ7mk5j3K1MKkk3jK8jk8J2J7k0LLl3L9L2l5k1J9OoJ8j1l0J6J9Pl8
5073b4K0NKJ7k5JJ0J0mk0j1K0L0k4k1jK3pJ6J7l3PJ5j0l4K6L1l3KQj7kL7j4m9
5108c2K3M0m4OJ1kj2J0oqOMj2Nj5J4K5j2j4Mj1kM3j3l6J5L1l1jL2j7pJ6j8j5K9
5144FK3j5k9K6rlK3j5qQJ0j5oRpJ0Nj9OJ9pj5Kj4NM2l5j9J3J4j5RQk7RK4k9j5
5182c1K5Oj1J5j0j9L1Nj1j4J2RPk3JLK0Kk2PoPK2pj5LK4l4jL4l0%K6j2l1K1K0
5219B3k4NJ3j4j5L2j6k8K4J3j2j3J0j6J3Lj1P%Jj0J2k1OL0k8k2M3k1%L0k2k6L0
$$ plain form
4962 36 11 -11 -12 -3 19 23 13 -3 1 -1 24 5 -4 -5 12 -9 -24 -1 29 10 4 -12 -30 -15 32 24 -24 -6 -5 -20 -12 -2 -10 -16 5 -18 -27
4999 -27 -15 11 5 -21 -24 -15 -6 5 14 6 -12 -17 16 12 -16 6 3 -3 -16 8 1 2 37 18 -42 10 36 -5 6 17 -6 -15 22 36 -6 10 21
5036 21 -15 -13 5 4 21 17 -8 -21 0 4 6 4 -19 -20 8 7 -21 -9 8 -12 -9 -6 -39 0 32 -3 -24 -5 1 -5 13 2 -28 -12 7 14 -24
5073 -24 -4 1 3 20 -5 -4 6 16 12 -8 -19 1 31 7 -14 -15 8 1 17 34 1 8 23 13 -21 5 36 3 5 13 -4 -6 31 17 -32
5108 -32 -9 31 -13 -7 4 2 -10 0 -6 -14 -8 -4 -16 -11 -26 -12 13 1 -13 -9 -20 -22 21 8 -28 -13 18 -13 -14 18 1 -6 10 -8 -23 6
5144 6 29 14 -15 11 2 -1 22 7 -1 7 17 2 -4 5 -2 8 13 -6 0 19 12 -3 -1 -15 -10 32 -3 -22 -9 5 -10 -1 7 -20 -11 13 -16 -31
5182 -31 -6 0 -11 4 -6 -25 6 11 0 -14 -2 7 14 -9 -8 -5 15 17 -5 2 -4 3 25 18 3 6 30 -4 -5 29 -1 -1 25 13 -18 3 23
5219 23 -1 4 17 3 -12 20 4 -24 0 13 1 -12 -2 -18 -5 -2 -13 -6 -6 -5 -15 -3 -24 -18 12 -16 -38 5 -16 -16 14 -8 -34 -4
5253dL6m9j0L5Mk6K6j1l0L4J3k1mJ8lnLo%PLL%k0RK0ml5J9J8l5K2J3k9kM4k7m3
5291c7M2J0k6kMk4J4L5k1k5K5J9k1kJ0j3QJk3J8OnJ4l2qJ3K8j3j1L0k5j2M5k0
5325Bl8N2L7o6J0L4k8j4N1k3m9L6L4m6%K3j7jL7l7mK6mj1j5j2QK7j4k3K5j4LJ3
5359Bj3l6K7M0m1j2M5k0j2K1j6j9L0L1n5nM2k5J2J5j8j1K4j1nJ8j0lK2Pm7K5K0
5392B2l3MK7l1QL7k5m4L9L4n3J2K1k4QK5m3qL1MqrkJ6oj8oJ4j0JL9j4n3N6Rm0
5428b0lM1k1k7N4l3l9M7L9o3kL8k7JL5k6l5L9L4n6JN1k1j0J4k0oK8nOk5LK3Kl0
5463a3pK7j3mL4k9k9M6Nl9pM6k5rK9k5l5N6Rm8PK1j8J5J3l5nL2j8k1L8kk3M8j3
5498Hl6K4L5l6MQk0QK9k3k2L7J2l9J2lnK3kk8KK3jLok4J4K4k9%L7l0rL3l4l6O0
$$ plain form
5253 -4 32 -17 -27 8 12 -14 12 1 -29 5 18 -3 -7 11 8 3 6 0 0 7 10 13 13 -7 2 22 18 -17 2 20 -15 7 20 -9 -11 33 6 -37
5291 -37 5 15 -11 -13 -9 -33 -19 16 -5 -30 -5 14 -7 -9 1 -12 -4 -3 -26 -8 -2 -7 7 -25 -33 -20 8 -5 -16 14 -11 -23 22 2
5325 2 -36 16 53 -13 -3 31 3 -11 40 17 -32 4 38 -8 -8 15 -2 -3 34 -3 -7 19 15 4 -11 -23 -15 12 -2 -25 0 -14 -11 2
5359 2 -11 -47 -20 20 -21 -33 12 -8 -20 1 -15 -34 -4 27 -28 -33 9 -16 -4 11 -7 -18 6 -5 -10 8 -2 -5 17 24 -23 2 22
5392 22 -11 -7 20 -11 -3 34 9 -35 4 38 -15 -3 18 -6 2 27 -16 -24 7 11 3 -6 -8 8 2 -16 -22 -8 -18 -17 22 8 -45 11 20 -20
5428 -20 -23 18 -3 -30 24 -9 -48 -1 38 -25 -27 11 -16 -15 20 -6 -41 -2 32 -24 -23 28 7 -3 11 -9 -15 13 8 14 -11 -8 15 17 -13
5463 -13 -20 7 -6 -10 24 -5 -34 12 17 -22 -29 17 -8 -17 12 -13 -48 8 17 -31 -24 -3 -21 -6 7 -28 -33 -1 -19 -40 -2 -4 -27 21 8
5498 8 -28 -4 31 -5 -1 7 -13 -5 24 1 -21 16 28 -11 1 -2 -7 16 14 -14 -12 11 10 13 7 -17 -3 21 -8 -8 29 -1 -10 23 -11 -47 13
5535A3J0n1JL9m0LM1k2n0N3L0n6J0K7l5KN2m2k3N0Kl9J3J2j0J0Klj7K5j1nJ1k0
5569a8K5Qk7lJ7oLK6k1k7L6Rm0J6K6k1PJ3j5l5O9l1l8L3J1l6K4J7n4QL8k0k4M6
5603A6j2k1J7Mm7M3K6n1nL2j9J0J8l5JK1Qk0LJ9j1%J5l0J3J3nKkk3L3K0l7j3K5
5638Hmj9L8j4k8M5pm4LM1k8oL8l0l1O1Mo5L4J5k9nM2m7rN2j2l4K2J2l3K5Ol1J2
5673a8K5ql3L1j6MJ1k1mK2J4j5J0j7OL1Jl9J5J3j3J2Rl3MM2k6k0L7rl2L5%m4K7
5708AM0m4j6K9Pl6L9rm2L8J9m4rL9j3oJ0j0j2K1Ql0LJ2qPMj2lK6rpj2J2mJ4j3
5745a0j9K9NpQnj6K8jk2KK9k2lK5l7j1M9j6j7J1J9k1J4J1k7j3L6j5j8K3mqLJ6
5780A6n6K0L4k9nK6k5JJ5j3rJ9J9k6LJ0kjK3l2qK0nkJ0rJ2J8k0j8J5K0k3Rkl3
$$ plain form
5535 13 23 -28 -27 12 -28 -25 16 -6 -56 -3 27 -29 -19 8 -27 -25 27 -15 -38 12 14 -25 -12 0 -10 0 2 -1 -18 7 -4 -9 2 -18
5569 -18 7 15 -12 -15 2 -4 -1 25 4 -23 13 22 -18 -2 24 3 10 23 8 -27 42 11 -27 6 17 -19 5 22 -32 -24 14 -6 -30 16
5603 16 4 -17 0 4 -43 0 26 -25 -30 2 -17 -7 11 -24 -23 -2 6 -14 -11 8 -3 -3 12 -18 -5 8 3 5 3 -20 13 33 -4 -17 8
5638 8 4 -15 23 9 -19 26 19 -25 -22 19 -9 -15 23 -7 -38 23 27 -38 -4 11 -18 -23 19 -28 -37 15 3 -31 -9 3 -30 -5 1 -30 -18
5673 -18 7 -1 -34 -3 -19 -15 -4 -25 -29 -7 7 -8 2 -15 -9 22 23 -16 -1 12 -1 11 20 -13 -9 33 7 -13 24 15 -17 18 18 -26 1
5708 1 41 -3 -19 10 17 -19 20 11 -31 7 26 -18 -27 12 -1 -7 3 -7 -19 2 10 -20 -17 -5 -13 -6 -2 -14 -17 9 0 -7 -19 -7 -11 3 -10
5745 -10 -29 0 5 -2 6 1 -15 13 12 -10 -8 21 -1 -4 21 -16 -27 22 6 -11 0 19 -2 12 23 -4 -17 19 4 -14 9 5 -3 0 16
5780 16 -40 -20 14 -15 -20 6 -19 -18 -3 -16 -25 -6 13 -13 -10 0 -2 -3 20 -12 -20 0 -5 -7 3 -6 6 24 4 -14 1 21 -2 7 5 -28
5816b8L0K8l9j7M7k1lK3om8N4Ol8%K1qJJ8k8j9L6J1l1OJ0l0K4J2m4L5J1j6j4Q
5850ijnK6j6j8J2J5j3JJ1j8oM4k5l2M1J2l1MPk0L1Mj2j3K1kLj4rML6j8j9K7j7
5886Aj2L2k0j1J9L5n0j3L0k0rL6jn4N3J6m9j3M2k7LL4k9j1J6Mk1qJ6lJ8Lk6PR
5921cj6K5j8j5L0J4k3k1L4qrL1j6l2L6K0n4PL5jpJ6l0j4K3J2k4qL0mjnk9J4J1
5956@Qj2J0j2%J7ol6M6Qn6K2J1k0%M3k8m7O3mk8RJ2l0J9K2l2JK9j6onKJ5Rj7R
5993@%lkJ6j0k8N1Nm4J4L5m5JM1k7n3O4K8o8mP0n1rM5k5k6L1J9l5nJ7Mmlj0nK3
6030Gj7J4j5k6J7K4l3JM4l3jK0Jm3K9M6o6jO7l5l5N0rl9L6J6m8mM8mk2J5KLKN
6066A6j1J0k9K6%k1j0L9Ql9%K0l4K0M5n7l3O6Oo2L0J8m4K0L8m2j9L9Om2K2J2j7
$$ plain form
5816 -28 2 30 -9 -26 21 0 -3 20 14 -34 20 26 -12 -12 9 1 2 20 -8 -27 9 20 -11 -5 5 -25 -1 11 -33 2 13 -3 -17 -9
5850 -9 -10 -15 11 -5 -23 -11 4 -9 -8 3 -15 -21 23 -2 -34 7 19 -12 -8 -1 -21 10 14 2 -11 10 8 11 -3 -12 -8 28 10 -9 18 1
5886 1 -11 21 1 -10 9 44 -6 -19 11 -9 -18 18 17 -37 16 32 -17 -30 12 -15 -12 22 -7 -18 -2 2 -19 -27 -11 -14 4 7 -19 -12 -3
5921 -3 -19 6 -12 -27 3 17 -6 -27 7 -1 -10 21 5 -27 9 29 -25 -18 17 16 9 25 -5 -19 4 16 -8 -16 14 10 9 4 -25 -11 0
5956 0 8 -4 6 -6 -6 11 5 -31 15 23 -33 -11 0 -20 -20 23 -5 -52 11 7 -21 -12 0 -30 -11 11 -21 -20 9 -7 -13 -18 -16 -1 8 -9 0
5993 0 0 -3 -5 11 1 -27 24 29 -15 -1 34 -11 -10 31 4 -49 15 43 -25 -29 41 -10 -19 26 1 -25 6 25 -10 -15 2 6 2 -1 -11 -16 7
6030 7 -10 4 -11 -37 -20 4 -29 -28 16 -17 -18 2 3 -40 -11 35 -31 -32 35 0 -35 15 6 -33 3 19 -29 -33 15 11 -11 4 6 9 11 16
6066 16 5 15 -14 12 12 -9 -19 20 28 -11 -11 9 -25 -5 40 -17 -50 16 22 -40 -10 8 -36 -16 22 -20 -39 0 6 -36 -14 -2 -19
6099a9K2j0k1PJ7rJ8Lk6J1J1l5J1L8k4mM3l7k9M8K0n6%M8l2lK9pl3J4K4k9NL2
6133B7j4Kj8k0J8OJ4j8oj8K6J9l3rM0j8m4N6Mn7M3L3p9lO2j0m7N6rn5M1L0l6p
6167b4M3l8j2K3J6rK2j0l8OjM2ok6j6M1j4j3K4Ql0MM2n4j2Q1k4n2L7Pl4J4M6m7
6201dk4L5j0j3J1J5k9J5rj7L2Qk0mk1%L3K0k6mJ6k8ML9k1l1N1lo6L7M3k2j1K4
6235B0l2j5L7J7l1LQj1%%J7j9J8k6J1j7NL9lm5RL3l5NL8k8l6N9J1o4K5M7l3m9
6269d2M0pk3N1J3o9lM5j4pJ6j1k6K7J0ooK4kl5j8L6J9j6mPk7%M4Km6J5M7l8j8
6304b2L5Lk8K4j5k5K0K8j8j4J7j0LJ8j2k2K6%mj1%rL6j6k4J6J7k5LJ8l4lL6ol2
6339c0K1Nj6OJ8l2jL8Km2J2K4rroJ5NoJ4pk7K2J9j1k2J1J0j6J1L1m2j0L9j7l2
$$ plain form
6099 -19 3 -7 -28 -21 -4 -13 5 8 -18 -7 4 -31 -20 18 -6 -10 33 -4 -33 15 35 -21 -21 27 -5 -8 21 14 -19 -5 19 -10 -5 27
6133 27 13 15 -3 -23 -5 1 15 -3 -9 -27 -1 18 -15 -24 16 -2 -46 10 14 -43 0 33 -46 -49 13 3 -44 12 3 -52 -11 19 -17 -24
6167 -24 19 -19 -31 -8 8 -1 21 11 -27 -21 -22 20 14 -12 -28 13 -1 -14 10 18 -12 -8 34 -20 -32 49 25 -27 10 17 -17 -3 43 -4
6201 -4 -28 7 -3 -16 -5 10 -19 -4 -13 -30 2 10 -10 -14 -35 -35 -2 18 -8 -12 4 -24 -20 19 -2 -33 18 15 -51 -14 29 7 -4 20
6235 20 -12 -27 10 27 -4 -1 7 -4 -4 -4 13 -6 12 -14 -3 -20 -15 24 21 -24 -15 18 -17 -12 26 -2 -38 21 32 -32 -7 40 7 -42
6269 -42 -2 -9 -32 19 32 -37 -40 5 -9 -16 0 -11 -37 -10 0 -6 -12 12 10 -25 -43 -7 12 -4 -8 -1 -28 -28 16 18 -28 -13 34 -4 -22
6304 -22 13 16 -12 12 -3 -28 -8 20 2 -12 5 -5 -2 16 4 -18 8 8 4 -7 -7 -16 20 4 -20 -4 13 -12 -9 9 -25 -28 8 2 -30
6339 -30 -9 -4 -20 -14 4 -28 -29 9 11 -31 -19 5 -4 -13 -19 -4 1 -5 9 2 -25 -3 16 5 -17 -6 4 -12 -1 30 -12 -22 17 0 -32
6374c2L3L6l2k6L1j7j3M6ll5qL5k7J2LMk0MOj6K1J3%l1j4K1J3%pjk9J8J7j1j1
6409b0K8Nl4KK1KpJ8j9l5K1L6rj2J0k2RK2Nj0J1Kn1PJ7J3K4j5k5k7K6J9MJ0k4
6444Bk9QJ1lL4J3m0j2%KJ1K3j3m7J6J1mJ5J3k8jQ%kJ9Mk9m%ML9ok3j6%MK3K3k8
6483bj7K6k6mO2j2l5J5om6L8N5j8l7K2l1j3O3J2n1J2Kk1pN0j8jkl1j4L2K7oqk5
6518a5j9L3JjNkl5K4J3k1J8L4o6k0N1Jk6M5oo9K5N6l0mL3l7j7L5Jj8M0j4m1J1
6552a5RKK8J1m6j3L3qKL1l2j6K7j7k9M3K0m4J4Lm6L1N4l2m2M1j7l2M8j2k9K5K0
6585A2n9J9M3k9kL4m1KL8j5k8L2Kl7M2J3n4J6N6n4j5N0k8nM2k7m0N6Pm5L0kk3
6618a0LL6l6j0L9rk5J5kj5M0j2k9K6Mm4J5K9m3J9L8l8l3M9pk8L7qn0L1K7m0J3
$$ plain form
6374 -32 1 37 5 -21 10 -7 -20 26 23 -12 -20 15 -12 0 3 7 -13 -9 -3 -19 2 15 15 -16 -30 -9 4 4 -3 -4 -33 -15 2 -9 -20
6409 -20 8 13 -21 -19 2 4 -3 15 -4 -39 -18 18 9 -3 7 -15 -6 16 21 11 22 24 -27 -20 -3 10 34 19 -6 -33 -7 12 16 26 2
6444 2 -27 -19 -8 -11 23 36 -4 -16 -16 -14 -3 20 7 -40 -24 -13 -17 -2 11 -17 -18 -10 -10 -12 7 11 -18 -22 -22 -18 21 15 -8 -24 -24 -20 3 26 -2
6483 -2 -19 7 -19 -23 39 27 -8 7 1 -45 -7 48 30 -7 15 -16 -29 34 46 -5 7 9 -12 -19 31 13 12 10 -21 -35 -3 24 18 10 -15
6518 -15 -34 -1 0 -1 4 2 -33 -9 4 -17 1 35 -31 -51 0 1 -25 20 14 -55 -30 26 -4 -8 25 -12 -29 6 7 -11 29 15 -26 -15
6552 -15 -6 -4 24 35 -11 -24 9 1 3 34 2 -14 13 -4 -33 10 30 -14 0 3 -43 -12 42 10 -32 9 -8 -40 8 -4 -33 -8 12
6585 12 -47 -28 15 -14 -16 18 -23 -21 17 2 -26 6 8 -29 13 26 -28 -12 44 -10 -25 25 -3 -8 34 7 -33 23 30 -15 15 13 -10
6618 -10 -7 29 -7 -17 22 13 -12 3 1 -14 26 14 -15 11 15 -29 -14 15 -28 -9 29 -9 -42 7 0 -28 9 1 -49 -18 9 -31 -18
6651a8L6l4JJ5k4j0N4rm4L0J1m4L9K0m9OL9k4j8M2qk3L1l0k7N5J0k8J0jm1K4O1
6684E2m3j4K2k8j3M6j7j3K5j5n5N2K8l3K5j1o3J5O3k1j7M9m8l1M5jk1M0J3o9j6
6715e4M4j4K3M4m1n8M9Pk2L6J4n0PK4k3J9L7k7m1J8PlM6rm9kJ1PK1Ml2%j0rK2
6750dL2j0k6Ql8oP2J3m8J3k1m7N1O0n2MK8n9k3N0J5k0K7l7n4K5N1Pj5lk3qL3J8
6784A3oJ6k0l6J8J4K1K0k0n1LK3kL3J6m7j1L5l2J9K4%n3QlpM5K2n8j6J5jK8K9
6818C9k9m6K4pmL9Ql7nqk4L8N6l2l6Lj7j9O4K1l4pKl0J6K8Mj7Mj8%J3L3Nj9m2
6854c4J8K5OpNj0l5L7J7l1K1L5o4j8N8j8k1N0k2n6OQ1m4kL3l7k7M5kqJ5Rm6j2
6888c3K2J3Olj7j8J1MK3jj4KJ6k4nK6oj7K8Qm4K9J6m2%L5j3j2L3j8l6L9K7l2J
$$ plain form
6651 -18 18 -16 -15 0 -24 -34 20 11 -33 -3 8 -36 3 23 -26 -20 19 -5 -23 19 11 -12 19 -11 -38 17 27 -1 9 8 -33 -9 52
6684 52 9 -5 17 -11 -24 22 5 -8 17 2 -53 -1 27 -6 19 8 -55 -40 23 2 -15 34 -14 -45 0 -1 -22 18 31 -38 -54
6715 -54 -10 -24 -1 43 2 -56 -7 0 -22 14 28 -22 -15 9 -14 5 42 15 -26 -8 -1 -4 42 33 -16 -18 -7 0 21 25 -7 -7 -17 -26 -4
6750 -4 28 18 -8 0 -38 -44 28 41 -7 6 -15 -62 -11 49 -3 1 29 -30 -53 -3 12 -8 19 -18 -72 -47 4 11 -4 -7 -30 -38 -5 13
6784 13 7 23 3 -33 -15 -1 20 40 20 -31 -28 -5 -7 26 42 -5 -16 19 -13 6 30 30 -23 -15 -18 -25 20 42 -16 -32 -17 -18 10 39
6818 39 10 -36 -12 -19 -23 16 24 -13 -18 -26 -50 -12 44 12 -24 -21 -38 -57 7 28 -6 -13 -11 -41 -25 3 7 -10 -6 -24 -24 -11 22 27 8 -34
6854 -34 -16 9 15 8 13 3 -32 5 22 -9 12 47 -17 -35 23 5 -16 34 12 -44 -38 43 -1 -3 30 -7 -34 11 9 1 16 25 -21 -33
6888 -33 -11 2 8 5 -12 -30 -19 -15 8 7 -7 -5 11 -13 -18 8 2 -15 13 21 -23 6 22 -20 -20 15 2 -10 23 5 -31 8 35 3 4
6923DJ9l5nL2j0kRJk0%J1j8L2Jm5J9J4j4NJ5l7j4N1j7j6J6Jk2qK2jLJ7k1k6K4
6959a5J1J3jk2j4K2LlK4j4k4J1Jj4L1M2m5l6L0j4NN7j3p5K2K3k5K8N0l5m0K7r
6992Am3O1L2n8r%qJ9M2k7k6jQnK0Jj7kl1J9K8J5Jk3k9k7N3L6qj6j1m0kP4j9QM
7029B0j3n7J9M8Omln7j5O8L8k6nj8l3K2L0pJ5J1o1j7M6nMM5m7m3J0N4l0J6K0n5
7063b4j2M3Mj8L2j7n5PM0J6pJ3l6l3L1NK7Pj6j9k4oN5K7l0k4mklN6K9p3qK4k5
7098b0K4L6Kn1OJ6k8K2L6j6l5J6nl3M3L5n1j1QLPJ9ok9NK%J3J1j5%k7mK7J1j0
7134AmKk7jN6k1k6K7k6j4K7Rj1NJ6l3k5N3%oLk0rK3jpK7qpQprK8J6l2j7L9l6r
7173a6M1pm7L0K3l9qM4k2k2L7j1m0K6K7j6l0J2K2j3J7j4j0mK3Ok7QQOk7mL0j0
$$ plain form
6923 4 23 -12 -17 15 5 3 12 13 -7 -7 4 -14 18 19 -26 -7 7 -7 -2 13 -24 -38 13 -4 -20 -4 -3 -25 -33 -11 -12 -9 8 -13 -39 -15
6959 -15 -4 9 8 -14 -28 -6 -3 -6 18 4 -20 -9 -8 -22 9 51 6 -30 0 -14 -9 48 35 -40 -18 5 -20 8 58 23 -17 10 1
6992 1 -42 19 51 -7 -16 -16 -24 -5 37 10 -16 -17 -9 -14 6 7 -10 -12 -43 -24 4 19 20 -3 -32 -59 -6 30 22 6 -5 -45 -47 27 8 16 20
7029 20 7 -50 -31 17 23 19 16 -41 -56 12 50 24 19 1 -32 -10 20 13 28 39 -22 -39 7 2 6 51 4 -39 -29 25 -5 11 31 -24
7063 -24 -36 7 11 -7 25 8 -47 -40 0 16 9 22 -14 -47 -16 -11 16 23 7 -12 -36 -42 13 40 10 -14 -18 -20 -23 33 62 -11 -19 5 -20
7098 -20 4 40 42 -9 -3 13 -15 7 43 27 -8 8 3 -30 13 48 -3 -14 -6 -3 4 23 17 -12 -7 -5 -5 8 19 4 4 -23 -27 0 11 1
7134 1 -3 -1 -28 -29 27 6 -20 7 -19 -33 -6 3 -8 -3 13 -20 -45 8 8 2 5 -15 -24 -1 -2 -9 18 10 3 11 4 -5 23 39 7 -10 29 -7 -16
7173 -16 25 18 -29 1 24 -15 -23 21 -1 -23 14 3 -37 -11 16 0 -30 -18 4 -9 8 -6 -16 -20 3 9 -18 -10 -2 4 -23 -27 3 -7
7207gj0K3j4l0L7J8j9j0L7j0l8L0J2l8K7L2m1k1L8Mk8K4J6l5J0jpmJ3QJ2l1k3
7240b6J6J9k1J3Qk0lK7j7k2K8J2m3J3L1l4OL7j1m6K4K2l3QJ3%j0jQJo%J3lk4K9
7276HK1l8JK5k9oN3j4l9L2J6m4%N4k8k8M0k6j8L6K1k8k2J9rj0L6nj4pJ2k0pMM2
7311B8j1m7PK1Pk1L4Mn8J5L1k6pN0j7n1K6J5k8K4L1n0%K6rJ2J0l3QJ4j1J2J9k1
7345DkPj5j5M7K0m5j2K0k7LN5ko4K4J8l5J5M4k9k9J5npK6J4k2k2k2L1J2J1j4J1
7379A0m9mL6J2j9K8Mo8J0N7k1k5O3m5m0N0M3n1jK6k5j5N0Rk0%j3l3K1L3K3j5k2
7412Im4K1J6jL3rm3J2J1k2J1N0l2l7K0Rj6K8K5o9mK9j2RK6k5j3j1%ML3J0l4Kq
7447b2rL4K6l8j5K1k1J6M5j9m7J6K4l1J8M4m5oJ3k4J0N7j9k9Kk2J2K9Qk2Mj0k5
$$ plain form
7207 -7 -17 6 -8 -38 -1 17 -2 -12 25 15 -23 7 19 -19 8 40 -1 -22 16 20 -8 16 32 -3 7 6 -1 -5 8 16 28 -3 -26
7240 -26 -10 9 -12 1 9 -11 -14 13 -4 -26 2 14 -29 -16 15 -19 -13 24 13 -33 -9 13 -20 -12 1 1 -9 -10 -2 -1 -7 -7 6 3 -21 8
7276 8 29 -9 -8 17 -12 -18 35 21 -18 14 30 -14 -14 40 12 -16 24 -2 -20 16 37 9 -13 6 -3 -13 23 18 4 -3 9 -11 -18 -14 28
7311 28 17 -30 -23 -2 5 -16 18 22 -36 -21 10 -16 -23 27 10 -41 -15 0 -28 -4 27 -23 -23 3 -6 6 16 -17 -9 5 -6 6 25 4
7345 4 2 9 -6 -21 26 46 1 -11 9 -18 -15 40 38 -26 -2 16 -19 -4 40 11 -18 -3 -8 -15 11 25 3 -19 -41 -10 2 13 -1 10
7379 10 -39 -43 -7 5 -14 14 18 -50 -40 17 -4 -29 34 -11 -51 -1 42 -9 -10 16 -9 -24 26 35 15 15 2 -31 -10 23 46 31 9
7412 9 -35 -14 2 1 34 25 -18 -6 5 -17 -6 44 12 -25 -5 4 -12 16 41 -28 -32 -3 -15 -6 20 -5 -18 -29 -29 -25 8 18 -16 -14 -22
7447 -22 -31 3 29 -9 -24 -3 -24 -8 37 18 -29 -13 11 -20 -2 42 -3 -9 4 -20 -10 47 28 -1 1 -21 -9 20 28 6 10 0 -25
7480b5K4K3k4J8J5n9lN9om1M6j2o3L8N6o5KL1j4l2L3J4l0J0Pk4NK7Jjk8pJ1J2
7514bmJ8j2k4RK7j5nK9k3k2L0J7l0K6J2n5pO1ok1K4j9l2J6M0k1KOk3j5J9j7J1
7548fL1l5j1K3kj0K8rm7K7K3m3J1L8m1k0K9Rj7J8J6l7nJ7J6Qmk1JmK5J3ok5jK2
7584A1m0K2L2j4k7J4J7l5M2K7o2mL9k3j0M9ql6LJ2k0oM6nm0RJ3k5K8J3k1j4%K5
7618A2Lmj0lj6JJ9J1j8MJ2l8JL6Ok4J0j1mOK1j0kNj4QOj3J0J5j5qJ5nrK4j8j4
7656a1RL3l2lK8j9j9K7Qk9J1J6k2j9L3Pj6pPk3nM7k3j6NJ4k3jJ8J1k6mK5k0kK5
7692DJ0k7j4M8j8j4K1j0j7J8J7l4oN0ol8L2lk9K5K0m0nM0nl6L4j1qJ0J9k6JJ4
7726A6oOpj1oK3ok0J6j3oJ8rj0JJ4Nk5J9nOlj5qJ5kPJj2MPoj8L4Rk2J7jk6J8L5
$$ plain form
7480 -25 -1 22 -2 16 31 -28 -31 28 22 -19 27 15 -48 -10 46 -19 -17 14 0 -32 1 15 -15 -5 2 -22 -17 10 11 10 -18 -25 -14 -2
7514 -2 -6 12 0 -24 -15 12 -3 -8 21 -2 -24 6 23 -7 19 31 -24 -31 30 24 3 27 8 -24 -8 32 11 13 19 -4 -19 0 -17 -6
7548 -6 25 -10 -21 2 0 -10 18 9 -38 -11 12 -31 -20 18 -23 -43 -14 -5 -22 -4 12 -25 -30 -13 3 11 7 -14 -13 -17 8 21 15 -10 -11 11
7584 11 -29 -7 25 11 -16 -2 15 -20 22 49 -13 -17 22 -1 -11 38 30 -6 -3 9 -11 -17 29 24 -16 -7 6 -19 9 22 1 -13 -13 12
7618 12 15 11 1 -2 -18 -17 2 13 -5 -1 11 -27 -26 10 16 -8 2 -9 -13 -7 14 4 2 7 -7 1 7 -6 4 19 4 -4 11 6 -3 21 3 -11
7656 -11 -2 31 -1 -4 24 5 -14 13 21 -8 3 19 -3 -22 11 18 2 -5 2 -21 -26 21 -2 -18 -13 1 -22 -23 -5 6 -20 -24 1 -19 -21 4
7692 4 14 -13 -27 21 3 -11 10 0 -17 1 18 -16 -22 28 22 -16 16 13 -16 9 29 -11 -16 24 19 -17 17 6 -2 8 27 1 2 16
7726 16 10 16 9 -2 -8 15 9 -11 5 -8 -14 4 -5 -15 -14 0 5 -20 -1 -6 0 -3 -18 -26 -11 -13 -6 -5 -17 -13 -6 -12 -30 4 13 -9 8 7 -19 -1 34
7767C4k5l1L2Rl1K4J2k2lL2l3j9N0nl1RRj9J4L5j2l0J6j6pK1qn%JpJ8j0pJ0ql2
7804c5L2J4k7KJ3k6OM6l5rK4j7k0K4K2k6J4Ll0QM5l7pM0k8k6O0jm6K3K2n4K2K1
7838A7j4J0J8l2l0N2J1l6RJ8m1J3J9j5PKk0JPMoJ8j8j5K8j5j2M0rm3J0L5k3mK5
7873A1l6j2M8j9j0L4Nn9K5L6n0L0L3m2j5L1pk6M0pk6J9nj3K1L4n5K0Rk1MK9j2
7906A4k6L0j0j6K1Om0J0K3l2MM6l8j9M9l2j9N3j2k9J6j7j3J8L2m7ML7l3j1M6j9
7938dj5L8l1k8L8K1k7j2K4k6J0L8k5j6L0j7k2M7k0j3M4mn6K7J9k1jJ9l9jM7j1
7970A3k7L1ql6L3J7l3nL3m3J6L2l2MK8m2j2M2lk9K5lm7L8K2l5J0L5l7j1M0k7j7
8003b8M4lm3J9K6k7NL8m6j0N2k0j3K5oj4K8rj9QK3k4kJ7k0lK4k0j6M5k3j7K6p
$$ plain form
7767 34 9 -22 10 19 -12 12 24 2 -1 31 -2 -21 29 24 -7 2 11 -8 6 41 29 -1 15 -1 -8 13 5 0 0 1 -6 12 2 -5 5 -3 -35
7804 -35 -3 11 -16 -14 -1 -27 -21 25 -10 -19 5 -12 -32 -8 14 -12 2 5 -25 -17 28 -9 -16 24 -4 -30 30 29 -17 6 28 -26 -4 17
7838 17 3 13 31 -1 -31 21 32 -4 5 23 -18 -5 14 -1 6 8 -12 -11 -4 0 -6 12 -6 -21 7 -8 -20 20 11 -32 -22 13 -10 -14 11
7873 11 -25 -37 11 -8 -18 16 21 -38 -13 23 -27 3 36 -6 -21 10 3 -23 17 10 -16 3 -2 -15 6 40 -15 5 14 -7 -3 26 14
7906 14 -12 18 8 -8 13 19 -21 -11 12 -20 -16 30 -8 -27 22 -10 -29 24 12 -17 -1 -18 -31 -13 19 -28 -24 13 -20 -31 15 -4
7938 -4 -19 19 -12 -40 -2 19 -8 -20 4 -22 -12 26 1 -15 15 -2 -24 23 3 -10 34 30 -26 1 20 -1 -2 17 -22 -23 24 13
7970 13 -14 17 9 -27 6 23 -10 -15 18 -25 -9 23 -9 -5 23 -19 -31 11 8 -21 4 1 -46 -8 14 -21 -11 24 -13 -24 16 -11 -28
8003 -28 16 13 -30 -11 15 -12 -7 31 -15 -25 27 7 -6 19 13 -1 27 18 -1 7 30 6 4 21 1 -2 22 2 -14 31 8 -9 17 10
8037A0l2L3kk7%M1k9j0J7j8OPOk8J2Nj1K0Ok7J7kopK8ok3L3j3k9L0Pl1K5Rk4P
8074fJ3Ok4K5Kk8J4K2k0J0Ml1K5J4k3j1K1j6QKlj2K6j1qNJ7k4kK0l5oK1J3k1N
8110hJpJ1Jlj1R%j8J9nPJ0lk0J5j0RK1j7j8K1kj2K1rqLJ5k1kJ4J0k1OJ2rpK1j9
8150dlJ6Qj6Rkj7Q%rJ5jpkOj4J2Kk0oJ0J0Jjqj4J7Rj3mJ2lJ6j7KJLj3J4Kn
$$ plain form
8037 10 -22 11 9 -18 -18 23 -6 -16 1 -17 -11 -4 2 -26 -14 -9 -20 0 6 -21 -4 -6 -12 -19 9 3 -20 13 0 -29 1 8 -23 2 11 -13 -6
8074 -6 7 13 -11 14 16 -12 2 24 4 14 18 -13 12 26 3 -8 13 -3 5 7 4 -8 18 7 -1 4 21 -3 -5 15 -20 -26 -5 8 -13 -8
8110 -8 -7 -14 -3 -2 -5 -16 -7 -7 -25 -6 -11 -4 6 3 -17 -2 -12 -3 18 1 -17 4 2 -10 11 2 -6 -3 12 -9 -11 3 13 -8 -2 10 1 -6 15 -4
8150 -4 -7 9 17 1 10 8 -9 -1 -1 -10 5 4 -3 -5 1 -13 -1 1 -19 -25 -15 -5 -4 -5 -13 -27 -10 -1 -14 -18 -6 -9 7 -10 -8 -7 -4 -17 -3 -1 -6
8191f
$$ Imaginary data points
##PAGE= N=2
##DATA TABLE= (X++(I..I)), XYDATA
0@%%%%%%%%%Qj6J6j6J6k4L2l3M1m9N7p2Q2r1J06j23J46j69J91k15K42k74L08l46
33a83L90m37M86n40O00o68P41q21R07j006J117j234J366j516J687j881K103k364
51a253K675l051L514m101M883n975P617j0396J6266m7762N9284N2771j32010N7040
65d98P3253j05114l8156J11750j9892n7027N6579J2498o6787K0448L0110k6935
77i771Q696K1207l3021K098K7804j9798q962K7957j4334k2463K0374J2885j0891
90A781j670j247K099j166j5681J5085L0100l3864k4350M9014m576n2966M3679
103F238L8323p1235p749O9997k9752l9112O0099m35o3967K7018L0397l7123J9850
116B549L3416m7087q471L5774l5376n995O6947k2720n5132M9667R363o9611L4313
$$ plain form
0 0 0 0 0 0 0 0 0 0 0 8 -8 8 -8 8 -16 16 -17 24 -25 32 -40 42 -49 57 -66 80 -89 102 -113 129 -145 163 -183
33 -183 207 -230 256 -284 316 -352 389 -432 475 -531 586 -648 718 -798 889 -992 1111 -1253
51 -1253 1422 -1629 1885 -2216 2667 -3308 4309 -6087 10179 -37583 21701 74472 -57538 -498
65 -498 72755 -32359 -70515 41235 21343 -35684 20895 33393 -33394 -12946 17164 -9771
77 -9771 -1075 20132 -12889 -10791 17013 -2785 -11747 16210 1876 -20587 -213 12672 1781
90 1781 111 -1136 963 -203 -15884 -799 29301 -4563 -28913 20101 15525 -37441 6238
103 6238 44561 -26674 -34423 35574 5822 -33290 26809 26374 -37593 -10575 19822 -17301 2549
116 2549 35965 -11122 -19593 16181 -19195 -25190 41757 19037 -36095 13572 22935 -46676 -12363
129a2363O2756n6448k4325O0655k0145n0116M3320K5102m2034K635K7822j6384
141D75j0534J3446j157m355k3k004J0412K096j6470N848J0225j8041L438K2681
155A6037j5444j0337K0408j3760j5798L2777m3l2668K3940J3290m4370J3929M6041
168C4002l6878k2614M9282j3911m7670M1709K8496m8342L939L8112l2473k0297
180b6645L9785j12k5825J7230N804k1575P547J0218j1553O287P286j4464L536
193b481J0794j4282p48J6072r683p490J5679l597j2465R468L18q928J1590L396
207G643j2844O243L151j5574Q439J5765j4780l046J5694j3662j2006K0719J960
220G702j4250J1911K154j9393P633J2296j3108M487J3346j7920n374K0137r503
$$ plain form
129 -12363 50393 -6055 -30380 30275 10130 -39986 3334 28436 -13598 -10963 16859 475
141 475 -10059 3387 2230 -2125 -2148 -4152 6260 8356 -8114 -2266 7959 -10082 -6644 16037
155 16037 593 -9744 10664 -3096 -18894 13883 13840 -18828 5112 18402 -25968 -12039 34002
168 34002 -2876 -25490 23792 9881 -37789 3920 32416 -15926 -11987 26125 -6348 -26645
180 -26645 13140 13028 -12797 4433 10237 -11338 -3791 6427 -5126 1161 8447 -6017 -2481
193 -2481 8313 -5969 -6717 9355 -328 -7818 7861 4264 -8201 1267 1585 -7343 4247 7643
207 7643 -5201 1042 4193 -11381 -2942 12823 -1957 -5003 10691 -2971 -14977 5742 7702
220 7702 -6548 5363 7517 -11876 -4243 8053 -5055 -568 12778 -5142 -10516 9621 118
233A18j2683K2397L23k4420J2668J5023k1246n29K1078j2062j2924J7917K275
246G935j5045N810O312r286J362P622l153j746N75l906J771L603k199L063K025
261D743r037j138P505k885L71Q626p062r458Q573J001p309J1067N315j6151R9
276e740J1007j0022k116J7935m353j5770Q687M595j2282O214J2355j0146o043
289e679Q521l108n236Q080J598o146K137O50m262L782L060m816N51K622m107J022
305a331N460l332l781L107l62j692L924R27l351l37r12j298L925K255k229M66
321A439j534n263K762O274j871r73K450n324m156O225K515k675L588p0q103L68
337d348N783j703R08N088n193o353M792K273l187M225K746p024j990M703j213
$$ plain form
233 118 -12565 9832 10155 -14265 -1597 13426 -7820 -8349 12729 667 -12257 5660 7935
246 7935 -7110 -1300 5012 -4274 -2912 4710 1557 -189 386 -3520 -1749 1854 -345 2718 4743
261 4743 -4294 -5432 2073 -812 -441 8185 1123 -8335 238 1239 -6070 4997 10312 -5839 -5740
276 -5740 5267 -4755 -6871 11064 6711 -9059 -372 4223 -8059 -1845 10510 364 -5679
289 -5679 2842 -266 -5502 2578 4176 -1970 167 817 -3445 337 3397 -1419 -868 1754 -2353 -1331
305 -1331 4129 797 -2984 123 -239 -1931 1993 2920 -431 -768 -1680 -2978 947 3202 973 1439
321 1439 -95 -5358 -2596 3678 1807 834 3284 -2040 -6196 29 2544 -131 3457 3387 -4716 -4348
337 -4348 1435 -268 640 5728 535 -5818 -1026 1247 -1940 2285 5031 -1993 -3983 720 -493
352d93r11M971p00n560N00K309q22J583J961k707k253J129P67O42J192p05j710
369h07n37K80J257J470k77j273j319j190J407L180J10j763p38j958j125L823K858
386C398k036q70k75l629o0N367J312k170M14k067m259K652N331p00j402M56l501
403b039k505M299L169j594k9k24l891q08M212J983j076m17j465k590P48L588J402
420B763j621j589p03o87O17K841J198k479j834M95m16N86L477L30m059j260J397
437i44j38J647L046k016m056M58J281J0K464J625l145k571N53M62J499K792m95
454B472l118j564q2J333K952P86k085j475j043n11K465K411j080j279n62j858
470b238K47L403R40j666o76j210j163K243K226r29r34o54j525Q90K350j89n70
$$ plain form
352 -493 -1404 3567 2867 -2693 -2193 116 -706 877 2838 131 -2122 -993 -226 416 1608 903 -807
369 -807 -1344 -1064 193 1663 1386 113 -1206 -2396 -989 2191 2301 538 -200 -2158 -3283 540 3398
386 3398 1362 492 217 -3412 -3472 1895 3207 1037 1451 -616 -4875 -2223 3108 2408 1006 1462 -2039
403 -2039 -4544 -245 2924 1330 1301 1077 -2814 -3622 590 2573 1497 1080 -385 -2975 -2227 1361 2763
420 2763 1142 -447 -1150 -1837 -1220 1621 2819 340 -1494 -999 -1415 -829 2648 2978 -1081 -2341 -944
437 -944 -1082 565 3611 1595 -2461 -2003 -722 -712 1752 3377 232 -2339 -1786 -1324 175 2967 2472
454 2472 -646 -2210 -2292 -959 1993 2779 694 -781 -1824 -2335 130 2541 1461 182 -380 -2238
470 -2238 -1991 1412 2352 686 10 -1200 -2363 -120 2106 1177 243 -411 -1936 -1046 1304 1115 545
487E45J29k021r00K733J061j032M92j132k666J814K940j091n07N76k600q04L479
504A016N35j645J209p02l121J508K854j079p0Q54k751j145L100Q12j011P00j234
521a70k045J746J476r15R24P4k774L55K165j041L19K017k457k124K850N69j760
538g91J848M2l346J426K782k084l01J961k601j310L630M5k029K177n02m007J697
555a363L216j644K02J680l259j696L437M88j314J608q80k659J787J529j496J198
571H34O12l447M9L122o45q5J936k818l066K765J696p12J966m25l931M21J774j272
589a226J987K468l698j517L045j710j378M644p81n271K682L289l368P85L163m454
605a340k652M401P54j211K892j072m565Q36J293q47L742J961n005j283K403k451
$$ plain form
487 545 674 -1347 -2247 486 1547 515 1007 -125 -2791 -977 1963 872 365 941 -1659 -2463 1016
504 1016 1551 -94 1115 413 -2708 -1200 1654 575 505 1359 -1392 -2537 563 1375 364 1064 -170
521 -170 -2215 -469 1007 92 1016 1090 -1684 -1329 836 -205 114 2131 -326 -2450 400 969 -791
538 -791 1057 1099 -2247 -821 1961 -123 -424 1537 -1064 -2374 1256 1301 -728 1449 947 -3060 -1363
555 -1363 1853 209 411 2091 -1168 -2864 573 1061 -253 1355 475 -2184 -397 1132 -364 834
571 834 1446 -2001 -1952 1170 525 440 2376 -442 -3508 -743 953 241 2207 1782 -2149 -1728 46 -1226
589 -1226 761 3229 -469 -1986 1059 -651 -2029 2615 1834 -3437 -755 2534 -834 -49 3114 -1340
605 -1340 -3992 409 1163 -48 2844 1772 -2793 -1957 -664 -1511 2231 4192 -813 -2096 307 -2144
621b144M49N461j833m651K642J113l057K466K485l911j184K230q35J139L094k564
637I00k974J093j113KN388O35m794K8O25l167J819M730j296j983O97j776p33K569
655F50j89n33J559k493j516N151L6n473K476K335n996J642Q193l549n577M677
671A393o88o511M690O359m126j827K535l630k011M681Q77j651J577j564k709K912
687C07J101k770J784J383l927L57M051j105j583J146j725j440K333R50M91J232
703B585l299k516L706q7l071M838K398p206l26N978l591l052O633j5o493K497
719a021L862l494m02K508k090o81J883q42J009J733l886r90M267k328k615O298
735C211M92p306J949M564m827n17O172k279m337L359N93k972K180J145k342J352
$$ plain form
621 -2144 -1695 3766 1933 -2718 -76 1037 -2020 446 2931 -980 -2164 66 -769 370 3464 900
637 900 -2074 -981 -2094 -2092 3296 3931 -863 -835 -210 -3377 -1558 3172 1876 -107 590 -1186 -1919 650
655 650 461 -72 1487 -1006 -2522 2629 2665 -2808 -332 2003 -3993 -2351 5842 2293 -3284 1393
671 1393 705 -5806 -1116 5243 1117 -710 1825 -1805 -3816 865 1742 91 1668 104 -2605 307
687 307 1408 -1362 422 1805 -2122 -1765 2286 1181 -402 744 -981 -2421 -88 862 1353 2585
703 2585 -714 -3230 476 389 -2682 2156 4554 -2652 -2978 3000 -591 -3643 2990 2975 -3518 -1021
719 -1021 2841 -653 -1055 1453 -637 -1318 565 -277 732 2465 -1421 -2411 1856 -472 -3087 3211
735 3211 3703 -3603 -1654 2910 -1917 -2434 3738 1459 -2878 481 1074 -1898 282 1427 -915 437
751D37L32k894K293K364l968O7L727k935j909M500m45l688K111J221k247R62O30
768E58j310J826m02l225L244K086n634J404N991n606l638Q457o72q394N068N352
784E105p704p09P436l318m613N135Q55m327J718J837j973P18K57j724J969N36
800A198l142J894K436l840k5L961k734k238M034k91k971K348J90k599K444N90
816A255l334K652J967n064J136M945m630k138O700j834o161N000L121o025J006
831a404M672l888j920M020r33j756K398q85j396K175j587j705M363m02m711L463
847E04K494n770R05N528m113k803N758n96m747L100J684l867J175K358k325P22
863GJ906k849k80K270k254q9L938j823k758L057l96l399K612J787k786J395J672
$$ plain form
751 437 769 -2125 168 2532 -1436 -1369 2358 -577 -2486 2014 1569 -2119 -8 1213 -1034 -72 558
768 558 -752 1074 672 -2553 691 2777 -2857 -1453 4538 -1068 -4706 3751 3079 -5315 -247 5105
784 5105 -2599 -3308 4128 810 -3803 1332 2187 -2140 -422 1415 -558 160 417 -1307 662 1198
800 1198 -1944 -50 2386 -1454 -1479 2482 -252 -2490 1544 1253 -1718 630 820 -1779 665 1255
816 1255 -2079 573 2540 -2524 -1388 3557 -1073 -3211 3489 1655 -4506 494 3615 -2410 -1404
831 -1404 3268 -620 -2540 1480 547 -1209 1189 304 -1092 1083 -504 -2209 2154 1752 -2959 504
847 504 2998 -2772 -1867 3661 -452 -3255 2503 1907 -2840 260 1944 -1923 -748 1610 -715 7
863 7 1913 -936 -1216 1054 -1200 -1289 2649 826 -1932 1125 729 -2670 -58 1729 -1057 338 2010
880B010l336L37K443k902P2L953k700j956M897j480n328M062K591n371J743N238
896D273m435k743M804j367l979L816K129l209Q54J399k734K1J707j306N77J827
912A634j717j85J697k346j132L099o23j880K863K90l165J438J052l153J131L047
928B050k248l93K855k386k239L190m66k822L250J895l511M37K031l095q10L276
944A014n49j090K327m68k370O29j26r28K207Q97j695Q97K98k878N30K354j805
961g56l8L315j493k816K137J93k769J862K262k200J05K099k167j719K060O8r65
978h22J862L75j972K60N43j199M39J190n30O6L77j072N4R64q27j88J090r45m81
997h16K037l61j985J261M97k259R33K397j509p53J963j334k311J948J402j505
$$ plain form
880 2010 -1326 -989 1454 -1448 -1376 2577 -123 -2079 2818 1338 -3990 72 2663 -2708 -965 4273
896 4273 -162 -2905 1899 532 -3447 369 2498 -711 143 1542 -1192 -1171 536 -770 -193 1634
912 1634 -83 -268 1429 -917 -2049 1050 427 -1453 1410 1700 -1465 -27 1025 -2128 -997 2050
928 2050 -198 -591 2264 -122 -2361 829 363 -2459 791 2686 -825 -388 1643 -1452 -2262 1014
944 1014 465 -625 1702 1234 -1136 -507 -633 -1561 646 1543 -152 745 1043 -1835 -1305 1049 -756
961 -756 -794 2521 1028 -1788 349 542 -2227 -365 1897 -303 -198 1901 -266 -1985 75 143 -822
978 -822 1040 1415 -557 -297 246 -953 -514 676 146 212 589 -483 -429 535 -292 -480 610 -335 -816
997 -816 1221 860 -1125 136 633 -1626 -693 1704 195 -558 1405 71 -2240 -292 1110 -395
1013c95O49J245j818q84J367k47o98J200N12q03j37n6l99J43J81J36N34j00m51
1032b1K88m57j011R77J162q12n3Q07j304r53J606L40j092J031P08j902m55J487
1050C46k26m57J208j88j587K80R16l30K2O10l30o27k2J09K79L30m1l5k33o93K22
1071d47R34k82n17P05j5j037M46O89q27k0J148m60j001P26L59r06K15Q14l76l41
1091a93N24j94p77K06P82R6l63n1N8m56k53P99M61o68M9N62j063p36J525N75j149
1112b66M24O62j622l95J909j68j252J195N39j903o3J544n44n98J295l6j537K56
1130e60J048n12m23Q07K25p98j74N71j64n60O57P28r46n66J055p6j158Q09R53
1149I16j174j42J221r50j063J537N02j340N14P30j331j41J258m65m61J041k41
$$ plain form
1013 -395 254 1499 -319 -1203 164 -83 -781 419 931 128 -9 -65 -464 -321 -140 -4 530 430 -21
1032 -21 267 -190 -1201 -224 938 126 73 880 -424 -1377 229 569 -523 508 1216 -686 -1141 346
1050 346 120 -337 871 683 -904 -624 292 -38 -16 594 264 -363 -385 -276 3 333 292 257 24 -669 -447
1071 -447 487 205 -312 393 378 -659 -213 476 -351 -371 777 317 -684 42 401 -505 -290 524 148 -193
1091 -193 331 137 -640 -434 348 444 81 30 88 -368 -621 178 639 -29 20 582 -481 -1217 308 883 -266
1112 -266 158 820 -802 -1197 712 544 -708 487 1026 -877 -940 604 60 -538 757 721 -816 -560
1130 -560 488 -24 -447 360 585 -213 -387 184 20 -540 117 845 -101 -667 388 312 -846 -37 916
1149 916 -258 -400 821 -129 -1192 345 847 -493 21 751 -580 -721 537 72 -389 652 411
1166D11j029M05K10l29P15K41q88J20K56o59M08P57p04n0P85r01o68J222R9p82
1186c81P41J74j222L23Q41o67j25Q28l09m36K48k18k5M36j74O4L14q06q3J114
1206F37p39q27J737N6k015J118J172k276K83K677j715j731K658j25k783J826J788
1223A741k641J46K459j929j547K536J13j907J285P78j830K09J217q12k13R55k89
1240B71m80P4k21L22L71m91L34L74j214J68J346j187n82K134o31k016J792N69
1258I33k433J331K006k625l30K746j703j727K849j86k446K189Q91l085R96K213
1274A619k425j22K706j891j458K800p52k388K562R04k872J087J704k617P6K666
1290A599j497j310K168m42j816J409N45j282P91N99j189J51L64n42P84J71j153
$$ plain form
1166 411 -618 -213 -3 -332 383 624 -264 -144 112 -547 -139 618 -86 -136 649 -252 -920 302 401 -381
1186 -381 360 534 -688 -365 476 -191 -316 512 203 -233 15 -203 -228 208 34 98 412 -394 -477 637
1206 637 -102 -929 808 864 -1151 -33 1139 -1137 -854 1823 108 -1623 1035 910 -1873 -47 1741
1223 1741 -900 -754 1705 -224 -1771 765 878 -1029 256 1034 -796 -587 630 -182 -395 560 271
1240 271 -209 -135 -356 -34 337 -154 180 554 -660 -492 854 -333 -915 1219 588 -1428 364 933
1258 933 -1500 -169 1837 -788 -1118 1628 -75 -1802 1047 861 -1585 604 1495 -1590 -594 1619
1274 1619 -806 -928 1778 -113 -1571 1229 477 -1911 651 1555 -1317 -230 1474 -1143 -1067 1599
1290 1599 102 -1208 960 518 -1298 111 656 -626 165 764 -425 -274 90 -452 332 503 -650
1307f50R07M78j884Q45J679k183k7K791k175j975L641l28l495L007J734m535J127
1324a043L880l851j419N041j672l840M044Q38m705K360L253m187l20M074k499
1339d6k316L613k31k822K419J002k953O98J712j683J33J539j168k93R75j042j25
1356e88J248q31l5J313j518p65K112p98j432K391j71k642K040J081l250J367K839
1373B361l263n73L678k434k301M356m36m121L402J888m909J261L960m002j078
1388b211N051k188l636M289N20m551K586K749m086L03L626k886j758L642o39k546
1404a735K376O26k580J063J395j717K6J200p73q6M87o10N73L00j422P87R68k020
1422a142O94K578k485j455L498j220l278L660J494m397J721L359m548j098N014
$$ plain form
1307 -650 257 735 -1149 -304 1375 -808 -835 1956 -219 -2194 1447 1119 -2376 631 2365 -2170 -1043
1324 -1043 2837 -1014 -2433 2608 936 -2904 1140 1978 -2727 -367 2886 -1301 -1621 2453 -46
1339 -46 -2362 1251 1020 -1802 617 1619 -1334 -636 1076 -607 -474 1065 -103 -396 579 -463 -588
1356 -588 660 -171 -206 1107 -411 -1176 936 138 -1294 1097 926 -1716 324 1405 -1845 -478 2361
1373 2361 -902 -1475 2203 -231 -2532 1824 1388 -2733 669 2557 -2352 -1091 2869 -1133 -2211
1388 -2211 2840 652 -2984 1305 1825 -2726 -140 2609 -1477 -1174 2452 -434 -2192 1450 811 -1735
1404 -1735 641 1267 -1313 -250 1145 -572 -546 654 -119 -205 282 -328 245 545 -877 -90 878 -1142
1422 -1142 -448 2130 -355 -1810 1688 468 -2810 850 2344 -2053 -332 3027 -1521 -2619 2395
1437B395k005l116M627K81m821K557K404m635O53M520k845j800L998j468l610
1452b865L149J160l285J828K572k974p43K146j583r69K386l7j153J078k51j224
1468g65O33j81n26J488P1j145J168n8k078J023J068j940R66K394k098r02K177
1485A295j879j776L312J44k623K710J173m258O30K941l137m17M653j606l219L406
1501A349J23m460J997L020l026K98L607k458k580K581l25k253K435J610k018L78
1517B78Q30k206m45J671j75R0J225o39q38K39p81k71J187q3O9J258r66j465J239
1536B17k87j762J905J580k050N27J808k817j371K981m67j849K911Q01l296P06
1552d63J619k775k9L261j017j416K272o26k620J487Q72j944J263K037j751n98
$$ plain form
1437 2395 390 -2726 1901 2182 -2639 -82 2322 -2313 -1660 2860 15 -1785 2213 745 -2865
1452 -2865 284 1444 -1841 -13 2559 -415 -1158 988 -595 -1564 822 785 -368 710 459 -765
1468 -765 -132 -313 -839 649 720 -425 743 685 -1393 -370 698 -1242 -276 2118 20 -882 1295
1485 1295 -584 -2360 952 1096 -1527 1183 2356 -1902 -1272 1669 -1468 -1885 2768 1162 -2057 1349
1501 1349 1472 -2988 -991 2029 -997 -699 2908 450 -2130 451 126 -2127 308 1918 -100 278
1517 278 1108 -1098 -1543 128 -47 43 1268 629 -209 30 -751 -1022 165 82 151 1409 443 -1022 217
1536 217 -70 -1832 73 1653 -397 130 1938 -879 -2250 731 264 -1585 1326 2127 -1169 -463
1552 -463 1156 -1619 -1648 1613 596 -820 1452 826 -1794 -307 565 -1379 -116 1921 170 -428
1568d28J293j516j039J991K10r02J397J53j859Q4M83q04P72J238p30k17M32j062
1586e04l36R04l66rJ318m57j009Q03l30j202J147O64j193Q67J083j812m37J425
1604E56j067o12K175j94j754J365M38k240O34J749j461j95J991j101j481J658
1620D61L5j699J124J036j371L10J104j295n54J207l61n45J059k2p95M77r2p70
1638f91O46M14n32M28J70r54L21O87r06P6J081p69n17J141m64j006J207L06j366
1657g28O46R24j270kJ148r32m89J366l20j035R26J36j064P28O04j074K57Q67r95
1676c07k65J076n12m67J066l29j009Q64L19j022N30O91r66Q1Q63q00m03J009k47
1695A72o62P79N9p89N21K88q32K52O07n06L8M98n96j46O37m26l03Q03k04n58P08
$$ plain form
1568 -428 865 -651 -1690 301 511 -391 1006 1159 -700 -616 -133 -937 -165 1073 343 126 558 -504
1586 -504 -840 64 -302 -311 1007 550 -459 344 14 -1188 -41 623 -570 297 1380 -432 -869 556
1604 556 -511 -1123 1052 858 -896 469 907 -1333 -699 1050 -411 -606 1385 284 -1197 461
1620 461 496 -1203 -79 957 -414 -104 1000 -295 -849 358 -3 -548 511 489 -306 171 79 -691
1638 -691 -45 369 -163 265 435 -519 -198 489 -417 -341 740 -29 -546 595 131 -875 332 638 -728
1657 -728 -82 842 -428 -430 718 -214 -703 663 343 -692 234 370 -694 34 638 -436 -179 688 -307
1676 -307 -572 504 -8 -475 591 262 -747 117 436 -586 -56 635 -331 -250 613 -187 -590 419 172
1695 172 -490 289 348 -441 80 368 -464 -212 395 -111 -73 425 -171 -317 320 -106 -409 394 190 -368 340
1716C40j01r13O80N29r82K57R10q56l20R96n82p55J136J64r98N87M82j052J47
1735c31P92p18j37J004l90o67O12j01n69O31K50o58L26L71o83N5M58m57O5O35
1755D88n01l52O42k19m68O37K0o42N10L01q08J67O54n27j29O01m37l34O70j31
1775A42m77N08K9n36M18J47o49M10N14p58j4O79o02k50R35l48p18Q40J41r76M58
1796a07N97p95J02P78o93m10Q52j56n79O03J05o41L35K80n85J54N24l51j24K93
1816A82l64m6M43k16j17M10k82k99M58k19l77P79J14q63L67M08q54J70R67o97
1836c6m19J023l35r77P82L97q33M34N88r00j23P57m43k93P27j89m16N05j95n43
1856d89N82K09n29L38K16p24K51N33o37J4P38m97l86O57k87m97Q68M0q81N47L26
$$ plain form
1716 340 239 -674 6 535 -447 -190 720 -136 -456 540 -42 -797 339 503 -495 92 574 -478 -331
1735 -331 461 -257 -394 610 220 -447 165 64 -505 126 376 -282 44 415 -268 -213 245 -212 -147 488
1755 488 -13 -365 277 58 -410 227 247 -395 115 416 -392 -225 429 -98 -227 374 -63 -397 273 142
1775 142 -335 173 202 -334 84 231 -418 -8 506 -252 -266 413 -189 -439 496 148 -570 270 411 -565 -107
1796 -107 490 -305 -203 575 -118 -528 324 168 -411 192 297 -344 -9 271 -314 -160 364 13 -111 182
1816 182 -182 -228 215 -1 -118 292 10 -289 169 -50 -427 352 466 -397 -30 378 -476 -306 661 -36
1836 -36 -455 568 233 -744 38 435 -398 36 624 -276 -399 358 -85 -378 349 160 -256 249 54 -489
1856 -489 93 302 -227 111 327 -397 -146 387 -250 -236 502 5 -381 276 -11 -508 360 400 -481 66 392
1877C92r07L61P44q42n2R65p15o40J021q8p51Q44J83j069M32N96q81J64Q56o70
1897e7k37P73o38m80J040r8p58P73P8j030N55N56r23K72R07q44l41Q15n17l51
1917e05J018k52p42P83n9r21P82L62j037O30P72j359m3J304r30n08J553n02j293
1936i47J302K66j594Q48J128j444O4J300j230o03J619l99j083J283Q3j429P98
1953c8O59j255M61J086j093l08R58o96l19J129l96o52R12l06q91R70J21r67R96
1972C71L98j584M86J133j383O9J656j206r22J764n19j550J713N67j897Q72J099
1989A067j972J79J919j362p09J924p84j491J682J40j721J362R68j948K87J402
2005I43j490k23J779q89r08J538m18j388J247L51j254R78O23j560L29J009j232
$$ plain form
1877 392 -515 -154 590 -252 -304 661 -54 -694 327 239 -512 332 515 -554 -122 474 -407 -243 613 -57
1897 -57 -294 479 -159 -639 401 303 -455 318 396 -634 -79 477 -446 -174 733 -111 -452 363 -154 -505
1917 -505 513 261 -481 302 243 -678 104 466 -571 59 831 -528 -571 733 -197 -705 848 346 -947
1936 -947 355 621 -973 -125 1003 -441 -377 923 -307 -910 709 310 -773 510 593 -836 -38
1953 -38 621 -634 -173 913 -180 -488 470 -226 -545 584 188 -464 448 142 -749 221 342 -625 371
1972 371 769 -815 -329 804 -579 -510 1146 -60 -982 782 263 -1287 426 993 -904 -32 1067
1989 1067 -905 -726 1193 -169 -878 1046 262 -1229 453 593 -1128 234 1202 -746 -459 943
2005 943 -547 -770 1009 120 -788 750 332 -1056 191 542 -712 266 889 -671 -342 667 -565
2022e65J09J403r88n07J323q70r74J644p6j290J282K00j805J017J100j772L86
2039c83J675j721o11K099r99j310K250j18k339J506J049k242Q27J937k082n63
2055a025K193j263j365K297%j856J427N30k112P30J420j514J12J582j188o73J342
2072F37q16q39J555k6j007J079j09j465R03N46j287R54J123j665m4J257j487l29
2090a020K181q07j322J844l06k080J629R85k176Q55J734k197l67K375j298j332
2106a302K285m60k105J962R06k309Q58J507k198j68K137j216q05K096o16j763
2122a191J391K59j528J189R31j522L54R70j418r5J205q24r2J373q28p97J174o57
2140a06j033J564J85j276J308L63k208O49J442j673K89K153j624j246K131p35
$$ plain form
2022 -565 -456 947 -41 -548 775 -95 -1069 575 499 -791 491 691 -1114 -97 1003 -769 -383
2039 -383 1292 -429 -1040 1059 60 -1250 1000 882 -1457 49 1098 -1144 -317 1620 -462 -1025
2055 -1025 1168 -95 -1460 837 837 -1019 408 938 -1174 -444 976 -538 -426 1156 -32 -705 637
2072 637 -179 -1018 537 511 -496 583 474 -991 -88 458 -829 125 1248 -417 -461 796 -691 -1020
2090 -1020 1161 354 -968 876 570 -1510 119 1104 -1072 -217 1517 -680 -1047 1328 30 -1302
2106 -1302 983 523 -1582 380 1286 -1023 -165 1342 -856 -1024 1113 -103 -908 1188 572 -1191
2122 -1191 200 459 -1069 120 1051 -471 -117 853 -565 -660 545 -279 -371 1002 174 -623 551 -106
2140 -106 -1139 425 610 -666 642 1005 -1203 -554 888 -785 -496 1657 33 -1213 918 183
2156A83j872K266P08k399J091J397k432J15K396j592j098K306o21j803J896M60
2172A001k147J012J209j895K00J748j202n73J476q36j023J448j7j016J015J55
2188E55j205O89L92j182O64Q49j172K77R86j309k31J466r67p03J823m07j497J405
2206D33J69j914J225J366j927K10J773j749q55K214o60j503K049J87k305J092
2222a95J263j918L50J841j532p84J822o96j258J614J85j468R14N40j464N11J062
2239G87j082k1J026q98m00J101n13n88J137k19r50Q58O8j035Q88N32j224M07Q63
2258G37j225j7J289r23n21J458n53j251J373K38j470R35Q78j625K25J421j290
2275c21m83J630o13j107J442nj517J024P64j479L66J249j215l67J307p05p68J334
$$ plain form
2156 183 -1689 577 1285 -1114 -23 1374 -1058 -943 1453 -139 -1237 1069 448 -1355 541 1001
2172 1001 -1146 -134 1075 -820 -620 1128 -74 -647 829 -7 -1030 418 401 -615 400 555
2188 555 -650 39 431 -751 -87 762 -410 -133 853 -456 -687 779 -188 -891 932 525 -972 433
2206 433 602 -1312 -87 1279 -648 -438 1335 -414 -1269 945 285 -1218 831 1018 -1287 -195
2222 -195 1068 -850 -500 1341 -191 -975 847 151 -1107 507 692 -776 138 678 -786 -275 787
2239 787 -295 -316 710 -188 -588 513 0 -588 549 330 -620 238 306 -729 159 691 -533 -126 737
2258 737 -488 -505 784 -139 -660 798 245 -1006 367 605 -865 70 948 -677 -452 969 -321
2275 -321 -804 826 213 -894 548 543 -974 50 814 -665 -299 950 -265 -632 675 -30 -798 536
2293E36k0j136P30L18j053M92P42q26M8O73p75j90Q44l50k76P70m98p10Q53P9
2313B51o45P56K08j167L46P01r04K07J136q23o53R88m24q02J209K82j219N74O36
2332F57j176R6J072q38l88J189l55q15Q97N3j088N46N42p33L89P58r28l96O74
2351A56m20j83J033j31p58M63n9p66N71N60n94J36M33p24q6P57l62l43N43k49
2371b3l66P71N9p09L00O0p39M51P70m86j6M47q44m88R09P7l34P42j01j028L31
2392b17M34o71K70P85n93k86P08l60n53O21k6o56N71N21n13N0J99p40j48P01L0
2413A27MM41l84o20K05K0j11O38K44n81oR8n00K34N42l90j56N09k27l28M89j08
2435A40n90L35K68l68L60M51o19k93K79l06K1P95k0n19J57j19m99L69M56k96Q2
$$ plain form
2293 536 516 -620 110 428 -625 -133 609 -217 -169 504 -271 -461 383 33 -243 527 29 -681 172 251
2313 251 -394 362 570 -597 -251 450 -454 -247 889 66 -587 401 -23 -825 384 666 -553 21 657
2332 657 -519 -423 649 -189 -577 612 257 -558 339 392 -696 -150 392 -341 48 806 -122 -518 156
2351 156 -264 -447 586 455 -303 160 101 -665 -94 466 -128 8 441 -283 -369 388 26 -317 226 -23
2371 -23 -389 382 441 -268 32 92 -647 -196 574 88 72 519 -325 -813 96 173 -161 581 480 -548 -217
2392 -217 217 -454 -184 601 8 -278 430 70 -483 138 112 -544 27 548 35 85 284 -456 -604 97 127
2413 127 131 572 188 -432 -227 -207 -318 320 564 -17 -23 75 -425 -191 351 -39 -195 314 87 -241 248 140
2435 140 -450 -115 153 -215 145 596 -23 -316 -37 -343 -322 473 453 -66 91 -28 -527 -158 298 2 84
2456H4K71m83j84M23j42j77L71p8k63L67O6m34R1J00l12K54L93k43j04J88l90
2477b02k04M62L5r6L32j30n28J98K37l07K17L24m01r8L99k70k51M30j1l82L05
2498E9J77l67J14K50l98r4L93p6j13K55j18k68J69M1j45J58J32j84K5J3j80J05
2520e2J78j53K9J27k11j6K05j59q9L35r4k87K30N0l24K64K55m04l7L38k58j27
2542b00L97q6k91K85ol63K38K78l11mK16k76q2M21j05k65K14Ok62J60K33j87k9
2565a9Q5j45p6J79R0Kq3j58L3R8m6J27J09k87q4K67j23j18L74m1m75J93K50k99
2589a47J51L98m77l42M91%k71M82O8o66N2L96k87O1N46k49n04K05O4j75L58K13
2611C67l69j78R7k8J24J85o6j18q3j38J45K49q5m9N7l09o8M29M4k16J30j06l62
$$ plain form
2456 84 355 -128 -312 111 -31 -208 163 85 -178 189 255 -179 -88 12 -300 -46 347 104 0 188 -202
2477 -202 -406 56 91 -5 327 197 -331 -133 104 -203 14 338 -63 -161 238 -32 -283 147 136 -246 59
2498 59 236 -131 -17 233 -165 -259 134 58 -55 200 82 -186 -17 24 -121 37 169 -15 10 23 -157 -52
2520 -52 126 -27 2 129 -82 -98 107 -52 -141 194 100 -187 43 93 -231 33 288 -116 -153 185 -73 -200
2542 -200 197 111 -180 105 99 -264 -26 252 -59 -63 153 -123 -205 216 111 -154 60 66 -196 -36 197 10 -19
2565 -19 66 -79 -155 24 114 116 33 -125 -92 6 -40 87 196 -91 -175 92 -31 -149 225 184 -291 -98 152 -147
2589 -147 4 402 -75 -417 74 74 -197 285 353 -313 -261 135 -152 -91 455 206 -298 -93 -29 -204 154 367
2611 367 -2 -180 -83 -111 13 198 132 14 -69 -207 -62 187 102 53 110 -199 -267 162 206 -10 120 14 -348
2634c48K68L50k55OJ81m10j00M65j6j91K85j90m93L55L80l01R1K15n65j47O05
2655A85j7k54L57j26o13K60M07k11J31K58n18l12M34J08o8K65j09m56N7K19j6
2676a9J80R7k76j43M6m0K60K00k60j40O9k06J15M74j89l62K53q4l69N00L32n53
2698a15k6L51m62j06P68r3n70K88M3n06M09N29n04j80L23l33j53O00L4l98J71
2719G0o8l91L30M10k64m9R3m15qN08n2j47J94k38l43L56J87j96J90L4m59L0L53
2742A25j21O9K18l83j93L37k0p1L18j56m46K94J39k99L17K72n98p7M57k95r1O61
2764D57k57o41M43J80m95L81M33o90j27N51l34k06O98j16o26L33J51m53L23M36
2784D41n09j55L67k22j21M11o4k85J61qj91K28P9k03J39k6k73K46K32l67N1L00
$$ plain form
2634 -348 -80 270 15 21 202 -208 -308 157 141 -50 235 45 -448 -93 287 -14 77 292 -273 -420 185
2655 185 168 -86 271 145 -468 -208 199 -12 119 377 -141 -453 -19 89 21 286 177 -279 -222 -3 -19
2676 -19 161 258 -18 -161 -115 -155 105 305 45 -95 -26 -232 -117 357 168 -194 59 -25 -394 106 438 -115
2698 -115 -141 210 -252 -358 410 317 -253 35 78 -428 -19 510 6 -174 149 -184 -337 263 297 -101 70
2719 70 2 -389 -59 351 87 38 131 -284 -292 216 164 17 211 -27 -370 -14 173 -23 167 201 -258 -228 125
2742 125 4 73 291 -92 -285 52 32 -39 279 123 -323 -29 110 -189 128 400 -198 -275 182 -113 -204 457
2764 457 200 -441 2 182 -313 68 501 -189 -316 235 -99 -305 393 277 -349 -16 135 -318 5 441
2784 441 -68 -223 144 -78 -199 212 148 -137 24 16 -175 53 132 -71 68 42 -231 15 247 -120 -69 231
2806B31l90p9N62k38l69M53ln10L62L08n14J05L88m98p3O00k60l49N10j07n48
2827d19N07K66o65K07N16n64j78O36k48m06N53J7n21K80K47m15J01K95l00K7K94
2848B30l33j15L84j37j63L52j26l84K99J29k73K39J68m13K8J87k53J75M11m13
2868hj89L77l30k29P48lo95L80K61p33J68P54m80l24O05k22n12N79J80n68J71
2889g0K49m07J95M55m58k15L73k81j49O42Mn13K24j2m64K97M99k32j02Q5l60Q
2911b32L77q0l1J73l52j66N25l1l43L71o5o62L44N97l33j3K92o29l51O54J52j54
2933D3M39k23p52K40L01l41M34N00p13k82N39k54l08O69no69L03M11l60K6K23
2954B21m52j70M18P8J08K40l85m39J40j0Q7O41N2o12n3K2l31L69N04k98j75J97
$$ plain form
2806 231 -159 -238 324 86 -283 170 167 -343 19 327 -187 -82 306 -192 -265 335 75 -274 236 129 -419
2827 -419 88 354 -311 -104 412 -152 -330 306 58 -348 205 222 -299 -19 228 -187 -86 209 -91 -64 230
2848 230 -103 -218 166 29 -134 218 92 -292 7 136 -137 102 270 -143 -115 72 -181 -6 405 -8
2868 -8 -197 180 -150 -379 369 366 -329 51 312 -421 -253 501 21 -303 302 80 -432 147 327 -241 -70
2889 -70 179 -228 -33 422 -36 -251 122 -159 -308 334 338 -175 49 37 -427 -130 369 137 35 120 -240 -232
2911 -232 145 65 34 207 -145 -311 214 183 -160 211 146 -516 -172 425 92 79 371 -258 -609 45 197 43
2933 43 482 259 -493 -253 48 -293 141 641 -72 -354 185 -69 -377 292 287 -382 -79 332 -28 -2 221
2954 221 -231 -401 17 95 203 443 58 -381 -241 -251 -164 477 529 -83 -136 -114 -445 -76 428 130 -45 152
2976A52l13o9M75j55l23K98l9k98N47K78p21r9K71m08J43Q85j37n88J21j92m61
2997f33N33N31k38K7J8n77m6M88j05m6L60k50l35M38M1m67J62J78l46K07M63j97
3019B06k07J7l49q8M76J75MJ49l73m83K94J82j30L88J90n78q9L47k78m3M73k04
3041G9l10L61O1l07K63j2n11J82M34k43Q8L71n11m02M48J2k21N14J52n90j7K14
3063E5k97J02M12j86j55K19j62j48K55r6k08K97O3k55K16R8m33L5K71k02Q4L68
3085C33k50k46K05j37j26L90Rl20K43M5m31K14L40m01MM11k91k65M75n2m33L17
3107C4J59l60J61K78l80m6K99j86r2L29j56k20K91k9k66K62J06l43J14J85k39
3128i9L4K72k19j44K36j02q6K66q9k45K23J4k35K52J50l73M7K32k78QM29j84k72
$$ plain form
2976 152 -161 -230 245 90 -233 65 26 -272 275 553 -168 -267 4 -404 -261 624 487 -101 20 -172 -633
2997 -633 -100 431 193 220 238 -339 -385 103 -2 -48 312 62 -273 165 206 -261 -99 79 -267 -60 403 206
3019 206 -1 16 -333 -421 55 230 234 383 10 -473 -179 3 -127 261 451 -127 -216 131 -147 -190 283 79
3041 79 -231 130 191 -116 147 135 -376 -194 240 -3 85 456 -55 -457 -9 3 -218 296 448 -142 -159 55
3063 55 -242 -140 272 86 -69 150 -12 -160 95 -1 -209 88 151 -104 112 210 -223 -188 83 -119 -35 333
3085 333 83 -163 42 -95 -221 169 178 -142 101 146 -285 -71 269 -132 -128 283 -8 -273 202 150 -283 34
3107 34 193 -167 -6 272 -108 -154 145 -41 -133 196 40 -180 111 82 -184 78 184 -159 -45 140 -99
3128 -99 -65 207 -12 -156 80 -22 -108 158 69 -176 47 61 -174 78 228 -145 -98 134 -144 -136 293 109 -163
3151a63K30q7k30L58J19l34J25J26l62J35L35l06o7L64k61k53M55J5m24K07J70
3172A52l59J52L97l05k01K27j40j30L42N5j91P2p5k39J85J84j18R3L3k96K0K37
3194I5j06nJ89k22j25K81n0j71K86q1l80K45K46k99J27L03m73k09M91m6k33L49
3216B12J1m82J34K50k12Q4K86l02j45K09q3l4L03j53k79K30K6k14K75J42l96J2
3238a26K37k12J0L70j77k65J86o0j38L23O1l03P2Q2k69J82K81k61p9K17k24j03
3260a96L35k0k03J58n8k41K58J37k32Q8J30l80Q5M04k57j67L84j85l85L88J94
3281B37l70J29K41l94o9M05j00j55K11j18k16K01O2j25J84k7k57J30J19k13J63
3302C8K10l49p6L10j74r6L63j37l32K63J04l00K37J99m04j5L20k49p9M36j28l69
$$ plain form
3151 -163 67 -20 -250 108 227 -107 18 144 -218 -83 252 -54 -121 243 -18 -271 184 199 -225 -18 152
3172 152 -207 -55 342 37 -164 63 -77 -207 135 190 -1 71 -4 -243 -58 126 8 101 134 -162 -142 95
3194 95 -11 -16 173 -49 -174 107 57 -114 172 91 -289 -44 202 -97 30 333 -140 -349 142 96 -137 212
3216 212 223 -259 -125 125 -87 -3 283 -19 -164 45 -38 -72 231 78 -201 29 55 -159 116 258 -138 -126
3238 -126 111 -101 -91 279 102 -163 23 -37 -175 148 209 -94 -22 60 -209 -27 254 -7 -86 131 -93 -196
3260 -196 139 119 -84 74 16 -225 33 170 -62 26 156 -224 -139 265 8 -159 225 40 -345 43 237
3281 237 -133 -4 237 -157 -226 179 79 -76 135 17 -199 2 64 -61 123 96 -161 -31 88 -125 38
3302 38 248 -101 -177 133 -41 -137 226 89 -243 20 124 -176 61 260 -144 -159 161 -88 -167 269 141 -228
3324b28K41N9k64K18K11k75m5J59j74RK28j23o5J63j75j06K91m0k12K34pl23K16
3347hK43l35JK88k50j33L55o1k52K32J4k88J82J83k31N4J61k73j1K95j54r5K18
3370A35j19k26K80L6k30J93J02l64R2K59k34KL11k40k46L35qk50K56J13l54P1
3392h6K26k21l3K94j39j45J54m4j04J77j1j49J29j2j23J53M2k32J25J39k45L6
3414f9K73k44j17L04j07k20K89O1l37J44J93k72J4L01k21j54K70o7k11K41N4k23
3436i8J00R4k28Q1J93j71j3J64j71p4K32p0j36J79%k17J39R6j96Q0J67k01l6J97
3460A11j30q2K07o5j40J72Pj85J21P9j53O3R8j70K8J44j45k9J95j21r8K15r6k07
3484a81K40Q2k76J24J86k86j5K75j24j77K55kk34J35Q6j90Q3J48j49j1J11j38
$$ plain form
3324 -228 13 72 -192 26 237 -38 -83 76 -98 -89 139 16 -49 114 -61 -167 124 84 -128 106 99 -224 -8
3347 -8 235 -100 -99 189 -61 -194 161 100 -152 80 94 -194 -12 171 -60 -6 155 -118 -129 166 12 -83 135
3370 135 16 -210 70 106 -124 69 171 -193 -101 158 -76 -74 237 -3 -249 86 78 -172 84 197 -157 -86
3392 -86 140 -81 -114 180 41 -104 50 6 -98 79 68 -81 48 36 -87 66 108 -124 1 140 -105 -69
3414 -69 204 -40 -157 147 40 -180 109 170 -167 -23 170 -102 -88 213 -8 -162 108 41 -170 71 125 -98
3436 -98 2 96 -132 -51 142 -29 -42 122 -49 -123 109 39 -97 82 82 -135 4 100 -96 -16 151 -50 -86 111
3460 111 -19 -101 106 41 -99 73 80 -105 16 95 -58 5 103 -67 -39 105 -40 -69 126 5 -93 122 26 -181
3484 -181 59 141 -135 -11 175 -111 -126 149 25 -152 103 101 -133 2 88 -102 -19 129 -20 -31 80 -58
3506e8j6J31n9l6J34n7j28J07J3j01R4N6j32N5P2j39M1J18j32j7J82j30j07K20
3530A11l8k04J69O9k19Q0J84j75m9J87j00j33J72k0j12J62Nk01J19P0j93P2J90
3553A46j63m8K02j44j75J90N1j39J34P0j72j7Q2q8K8J19n0j8N5j26n1J51k2p6
3577f1J56j5j68R7M2j59Q7J43j59J3J40j51n9J99j02j52K27L5k26J35J29k48N
3600i2K21j41j15K26Oj96J08L5j51O6J10j07N5Q3j45k1R7j17nK10m2j40J01oj85
3625a45J05J04r3P4P5j56l8R0q4K7J73r8r1J52p7j84J84Q3j89J06J28k14k6J91
3649I7r1q2J71m7j39J51J0j60J24Q0k02M4J55j62k4K12r0j69J53L1j65R3R5j03
3673a8nQ0j02rQ4m3K3O6j07l1J12o8p6J50J2j49J02M8j69K3J63j04l6J50r8r7
$$ plain form
3506 -58 -74 57 -2 -38 96 39 -89 18 31 -70 24 80 -52 3 75 -64 -23 95 -37 -54 128 -2 -109 111
3530 111 73 -131 38 107 -112 -32 152 -23 -72 115 15 -118 54 34 -78 84 89 -112 7 77 -116 -44 146
3553 146 -17 -65 137 -7 -182 8 59 -80 54 124 -48 -65 17 -71 -43 76 26 8 63 -63 -114 37 15 -61
3577 -61 95 80 -88 9 51 -108 -21 122 -37 -24 116 -35 -94 105 3 -149 78 113 -113 22 151 -97 -92
3600 -92 129 -12 -127 99 105 -91 17 52 -99 -33 77 -30 25 108 -37 -58 39 -78 -83 127 85 -55 46 40 -145
3625 -145 -40 64 -29 45 120 -36 -74 16 -68 -41 132 34 -57 95 18 -166 18 101 -88 18 146 -68 -94 97
3649 97 6 -76 95 48 -91 60 70 -90 34 114 -88 -44 111 -51 -75 137 47 -122 31 62 -103 -10 85 -18
3673 -18 -23 57 -45 -54 30 -13 10 76 -31 -62 50 -18 -94 56 68 -81 21 69 -100 -77 86 -18 -54 96 -2 -99
3699i9J44n2r4J62M4j88O8R6j87K7K32j22j36J83k5j94J49P9j27L8Q7j28k8J07
3723C6n0J8Q2r8m7R4m1p8J36J2j17N7L7j11N5Q1q8j1P5o9j7J05q9n1J57n1j20
3750i3J52J1j80P0J47j54j8J86q9j46J16L6j17J19O7j52PP4j06K5J49q4n0J05
3774G5q6j07J46N8j19N0N0j37J0J18m5l1O0m6l1M9k6MQ8p0j00R6L1j04J07N2j68
3801g6OJ37q6l4J31n5q8R9j0j07J01M1j46P3J11j32NJ49j60j14J93L7j10J06M7
3826A18k17l0J31l3M0J42o2j29j9k8J9J39L2p0K3o2j15J11Q2r6L0P3j06l2J16
3851E7l2p9P3m5n0J50L8j24K1j1j34P3J74o7m2R7j14j33J38P8p5M6L4j32J6R9
3877E6n3l7M1p4OJ43j4n9M2q0j42J14J61m0K8L4k02j12J46Q1MJ00o2j50NL8mQ1
$$ plain form
3699 -99 45 -7 -101 61 105 -83 -15 81 -106 -79 153 31 -105 78 53 -141 8 87 -40 -2 85 -43 -71 36
3723 36 -14 4 86 -12 -59 35 -6 -84 52 64 -53 4 41 -70 -15 66 -22 -33 42 -27 -44 61 -28 -79 78 27 -93
3750 -93 59 70 -110 -40 107 -47 -65 121 32 -114 2 38 -79 40 107 -45 -38 36 -70 -45 104 20 -30 75
3774 75 -11 -118 28 86 -33 17 67 -70 -60 58 13 -18 42 -4 -35 14 -12 -8 80 10 -90 6 37 -67 40 92 -76
3801 -76 -70 67 -19 -53 78 23 -65 34 24 -83 18 59 -87 -14 97 -35 -30 119 -41 -155 38 75 -35 71 118
3826 118 -99 -129 2 -31 9 151 89 -40 -59 -87 -68 71 103 33 56 -6 -121 -10 72 -24 6 79 -27 -59 57
3851 57 25 -54 19 -26 -76 74 112 -12 9 -2 -136 -63 111 44 2 99 -15 -148 -10 68 -7 39 73 -59 -43 56
3877 56 3 -34 7 -67 -61 82 68 9 51 -29 -171 -57 104 64 92 126 -76 -188 -42 39 43 143 81 -69 -64 -26 -30 51
3905E1L1p9k6L3m1M1N6q0o1P6K0nQ7o6j34M7M8l5J09Q2j55o2M8n8JJ97j0j75K9
3934c1N7r3O5J25j26q1R9Jl2P2jj08rM3k2J03O1j04p2jl2N3J37k3p5mm4k1P2O8
3964G7m2j4m1m4N7N0l1QKj06L9J23l1o4L1l0p4R0R0q2k1L0q3MJ21k7l0L1o2q2
3994a11J14P7q2%L4j15%J47jq2K6no7L7Q2j7j7k2l6J0L9K5Ql3o1K5N5loK4n0n5
4026f0O3K9k0M6k6q6J1P1l6L5M2j09k6R6Jl7O4k9j25N9J00n7MO5j01r7J03O0k2
4055A8N1l1j12PQ4JkL7p6l6M9K5mK0k5l8kL0L9M4n2p3J2RPJ04Qj38nM6m5L4J40
4088A26p2j18N2J5q8J18R7j36o8P0l1KJ27l7j21J5L5k9N8R4q9o7RpL2Q0po9k7
4117c6m0K8J21j0p0kk4n4Q5Q9o7k1J4p0rJ28J0m6j0o8m6J05O7n1J8l5q3M3J10
$$ plain form
3905 51 82 3 -23 10 -31 10 66 -14 -75 1 21 16 103 37 -97 -50 -2 -37 72 154 -1 -63 -15 -73 -72 125 115 -60 -31
3934 -31 26 -67 -2 123 -3 -84 15 16 -16 56 55 -53 -62 -19 -41 62 123 19 -53 -54 -86 -33 104 81 6 2 -42 -63 9 77
3964 77 35 21 -20 -64 -7 43 12 20 22 -84 -45 78 47 -17 14 -16 -90 0 90 8 -13 17 -66 -62 59 32 2 33 -29 -111
3994 -111 3 80 -2 -2 32 -83 -83 64 63 -19 7 2 -65 -28 54 37 20 -2 -38 -28 11 36 44 11 -50 -25 30 27 21 45 -5 -60
4026 -60 3 32 12 58 32 -54 -43 28 -8 27 69 -40 -66 30 31 -6 58 29 -96 -37 63 6 10 75 -26 -123 -20 40 18
4055 18 69 38 -74 -67 17 18 16 53 -23 -59 -10 15 11 31 6 -32 -34 -4 35 79 27 -46 -34 -25 -18 86 94 -44 -49 -3 -48 -14 126
4088 126 54 -64 -12 3 -85 33 130 -6 -74 -4 -35 -33 94 57 -64 -49 -14 -43 15 109 20 -47 -38 -45 -13 67 60 -9 -36
4117 -36 -76 -48 73 63 -7 -9 -33 -87 -2 87 20 -1 13 -57 -66 62 72 26 16 -52 -98 7 74 23 41 6 -77 -34 76
4146G6o2mP7j29p5J35L3o6Q3k1j55N1J59r0k3Q7q7j04J42M9j03M7L6j31oJ31j5
4173C5m0M4m8p6L2Q0JJm2k9K2oJ8O5j9j13P1K2q5Q0J08j19r4J22k0q6J47K7j82
4202h4L9J18j23KJ56p5r7R5nr4J04L9j07J5L7m7L9M6o7qM6n0kP7k4p1O9rr9R7
4232A7N5j16K0O9q4j1J11l1p2O2ln2M6K2m1J5K6o9J5M7l4J5N8r2j2Q6m3n3J01
4261E2pj07R2L4j19M1J25j27m4J12l7j02J28L5j44M7R2j00k3R7j1p6O4j0n5L7
4287fL6k4qj9j0N7j5l7M0po9P0M6q7J5R0q5o5J02J6p7N2K0j05K9J05p3k3Q0o1
4317a3m2Q3J2o4M6J6p7K6N3l2J2L0p9j5Q0k1j7N6l3p0P7J4p9N2N7r4j0O4l1l2
4347c1O5j4n4J8N9m1nRk9MJ8kK4J3n4mL2l7K9P8n7p2O0mm6P9K9j03J3Q7o9j6Q1
$$ plain form
4146 76 14 10 87 -42 -117 18 51 -15 68 47 -108 -57 102 12 -11 76 -11 -115 27 76 -27 20 56 -75 -81 50 35
4173 35 -5 39 -9 -85 -53 27 28 29 -13 -42 -20 -26 -8 57 38 -75 -4 18 -67 13 121 2 -92 30 10 -76 71 98 -84
4202 -84 -45 73 -50 -48 108 33 -64 31 26 -68 36 75 -32 -17 20 -27 12 58 -9 -17 29 -21 -23 54 30 -41 28 19 -80 17
4232 17 72 -44 -24 45 -39 -50 61 30 -42 20 17 -35 11 33 -8 7 33 -36 -21 26 -8 7 65 -27 -39 47 4 -49 52
4261 52 45 -62 30 64 -55 -14 111 -16 -60 52 15 -87 41 76 -68 -21 71 -29 -52 45 34 -42 22 12 -43 -6
4287 -6 30 6 -2 -21 -31 26 11 -26 14 7 -62 8 54 -33 -18 72 -13 -78 24 40 -37 15 35 -70 -41 64 -9 -32 48 -13
4317 -13 -55 28 40 -24 22 38 -39 -13 40 8 20 50 -29 -44 36 15 -2 54 21 -49 28 42 -37 15 72 -22 -32 32 1 -31
4347 -31 34 20 -34 -16 43 2 -3 6 -23 -19 -1 -3 21 34 -20 -24 8 -29 0 78 21 -51 9 5 -41 38 67 -36 -23 64 -5 -21 60
4380F0l8p0O9J9p1N4O5j10m5O0RJ2N2l6o1RJ4MK2Jj4Rj1j8J1L1m8J5J7k3K8O2
4412G8o3p3L1J9j2P0J8o3k1Jl1L3O4j6l3J3l6m0P8K0m0JK5m1M2K7n7l0N1k6j3
4443b4Q3Ln8rj1n2N5Q8Lo9rl9qO5K2k3OnrkRj2Lj9k7M2L5p%m2n6NQ8K7j8Mn6n5
4481g2L1N9pL1J9p2l9K8L1kK7k0n2L6L8l2qOk8kN6PlLm4n0QN9K1L8k3o7l0M0K3
$$ plain form
4380 60 22 -48 21 40 -31 23 88 -22 -67 -7 2 14 66 30 -31 -22 -8 -4 18 19 5 14 3 -15 -4 27 -21 -6 11 -12 16 78
4412 78 15 -58 -27 -8 -20 50 68 5 -16 -15 -46 -13 51 35 2 15 -21 -61 17 37 -3 -2 23 -18 24 51 -6 -36 15 -11 -24
4443 -24 59 62 4 -5 -16 -68 -13 75 78 9 0 -39 -47 18 40 17 23 18 9 7 16 4 7 -12 -39 3 38 31 31 -11 -67 -62 26 53 35 39 -17 -72
4481 -72 -41 18 11 42 61 -11 -50 -22 9 7 34 14 -38 -2 36 4 -4 2 -26 -28 28 35 32 35 -9 -59 -51 8 29 67 44 -23 -53 -13 10
$$ [...]
8191A
##END NTUPLES=NMR FID
##END=
