##TITLE=1H_Ly-801.40
 CDCl3, 8 sc, 
 15.3.2019
##JCAMPDX= 6.0         $$ Bruker NMR JCAMP-DX V2.0
##DATA TYPE= NMR FID
##DATA CLASS= NTUPLES
##ORIGIN= UXNMR, Bruker Analytische Messtechnik GmbH
##OWNER= root
$$ XWIN-NMR		Version 3.5
$$ Fri Mar 15 14:25:15 2019 Russian Standard Time (UT+4h)  she@DPX200
##.OBSERVE FREQUENCY= 200.131
##.OBSERVE NUCLEUS= ^1H
##.DELAY= (6, 6)
##.ACQUISITION MODE= SIMULTANEOUS
##.ACQUISITION SCHEME= undefined
##.AVERAGES= 8
##.DIGITISER RES= 18
##SPECTROMETER/DATA SYSTEM= spect
##.PULSE SEQUENCE= zg30
##.SOLVENT NAME= CDCl3
##.SHIFT REFERENCE= (INTERNAL, CDCl3, 0, 15.7039)
##AUDIT TRAIL= $$ (NUMBER, WHEN, WHO, WHERE, WHAT)
$$ ##TITLE= Audit trail, XWIN-NMR		Version 3.5
$$ ##JCAMPDX= 5.01
$$ ##ORIGIN= Bruker BioSpin GmbH
$$ ##OWNER= she
$$ F:/spectra/data/she/nmr/H-F/1/audita.txt
$$ ##AUDIT TRAIL=  $$ (NUMBER, WHEN, WHO, WHERE, WHAT)
(   1,<2019-03-15 14:19:48.15 +0400>,<she>,<DPX200>,
      <created by zg, POWCHK disabled, PULCHK disabled
       configuration hash MD5:
       00 E9 B6 7A A2 85 ED C7 34 08 36 98 17 FE 4E 26
       data hash MD5: 16K
       23 80 0F 3F 4C 05 EF 9A 91 29 AB 31 0B 3F 02 06>)
$$ ##END=
$$ 
$$ hash MD5
$$ 2A 96 E9 C5 4E 27 B2 6D C6 49 1E 79 04 E5 09 3C
##$RELAX= 
##$RELAX= 
##$RELAX= 
##$RELAX= 
##$RELAX= 
##$RELAX= 
$$ Bruker specific parameters
$$ --------------------------
##$DU= <F:/spectra>
##$EXPNO= 1
##$NAME= <H-F>
##$PROCNO= 1
##$TYPE= <nmr>
##$USER= <she>
##$AMP= (0..31)
100 100 100 100 100 100 100 100 100 100 100 100 100 100 100 100 100 100 
100 100 100 100 100 100 100 100 100 100 100 100 100 100 
##$AQSEQ= 0
##$AQ_mod= 1
##$AUNM= <au_zg>
##$AUTOPOS= <>
##$BF1= 200.13
##$BF2= 200.13
##$BF3= 200.13
##$BF4= 200.13
##$BF5= 200.13
##$BF6= 200.13
##$BF7= 200.13
##$BF8= 200.13
##$BYTORDA= 1
##$CFDGTYP= 0
##$CFRGTYP= 5
##$CHEMSTR= <none>
##$CNST= (0..31)
1 1 145 1 1 1 1 1 1 1 1 1 1 1 1 1 1 1 1 1 1 1 1 1 1 1 1 1 1 1 1 1 
##$CPDPRG= <>
##$CPDPRG1= <>
##$CPDPRG2= <>
##$CPDPRG3= <>
##$CPDPRG4= <mlev>
##$CPDPRG5= <mlev>
##$CPDPRG6= <mlev>
##$CPDPRG7= <mlev>
##$CPDPRG8= <mlev>
##$CPDPRGB= <>
##$CPDPRGT= <>
##$D= (0..31)
0 1.2 0 0 0 0 0 0 0 0 0 0.03 0 0 0 0 0 0 0 0 0 0 0 0 0 0 0 0 0 0 0 0 
##$DATE= 1552645187
##$DBL= (0..7)
120 120 120 120 120 120 120 120 
##$DBP= (0..7)
150 150 150 150 150 150 150 150 
##$DBP07= 0
##$DBPNAM0= <>
##$DBPNAM1= <>
##$DBPNAM2= <>
##$DBPNAM3= <>
##$DBPNAM4= <>
##$DBPNAM5= <>
##$DBPNAM6= <>
##$DBPNAM7= <>
##$DBPOAL= (0..7)
0.5 0.5 0.5 0.5 0.5 0.5 0.5 0.5 
##$DBPOFFS= (0..7)
0 0 0 0 0 0 0 0 
##$DE= 6
##$DECBNUC= <off>
##$DECIM= 24
##$DECNUC= <off>
##$DECSTAT= 4
##$DIGMOD= 1
##$DIGTYP= 9
##$DL= (0..7)
0 120 120 120 120 120 120 120 
##$DP= (0..7)
150 150 150 150 150 150 150 150 
##$DP07= 0
##$DPNAME0= <>
##$DPNAME1= <>
##$DPNAME2= <>
##$DPNAME3= <>
##$DPNAME4= <>
##$DPNAME5= <>
##$DPNAME6= <>
##$DPNAME7= <>
##$DPOAL= (0..7)
0.5 0.5 0.5 0.5 0.5 0.5 0.5 0.5 
##$DPOFFS= (0..7)
0 0 0 0 0 0 0 0 
##$DQDMODE= 0
##$DR= 18
##$DS= 0
##$DSLIST= <SSSSSSSSSSSSSSS>
##$DSPFIRM= 0
$$ [...]
##$SUBNAM2= <"">
##$SUBNAM3= <"">
##$SUBNAM4= <"">
##$SUBNAM5= <"">
##$SUBNAM6= <"">
##$SUBNAM7= <"">
##$SUBNAM8= <"">
##$SUBNAM9= <"">
##$SW= 24.9337681822398
##$SWIBOX= (0..15)
0 0 2 0 0 0 0 0 0 0 0 0 0 0 0 0 
##$SW_h= 4990.01996007984
##$TD= 16384
##$TD0= 1
##$TE= 0
##$TE2= 300
##$TE3= 300
##$TEG= 300
##$TL= (0..7)
0 120 120 120 120 120 120 120 
##$TP= (0..7)
150 150 150 150 150 150 150 150 
##$TP07= 0
##$TPNAME0= <>
##$TPNAME1= <>
##$TPNAME2= <>
##$TPNAME3= <>
##$TPNAME4= <>
##$TPNAME5= <>
##$TPNAME6= <>
##$TPNAME7= <>
##$TPOAL= (0..7)
0.5 0.5 0.5 0.5 0.5 0.5 0.5 0.5 
##$TPOFFS= (0..7)
0 0 0 0 0 0 0 0 
##$TUNHIN= 0
##$TUNHOUT= 0
##$TUNXOUT= 0
##$USERA1= <user>
##$USERA2= <user>
##$USERA3= <user>
##$USERA4= <user>
##$USERA5= <user>
##$V9= 5
##$VALIST= <valist>
##$VCLIST= <CCCCCCCCCCCCCCC>
##$VD= 0
##$VDLIST= <DDDDDDDDDDDDDDD>
##$VPLIST= <PPPPPPPPPPPPPPP>
##$VTLIST= <TTTTTTTTTTTTTTT>
##$WBST= 1024
##$WBSW= 4
##$XGAIN= (0..3)
0 0 0 0 
##$XL= 0
##$YL= 0
##$YMAX_a= 70443
##$YMIN_a= -80513
##$ZGOPTNS= <>
##$ZL1= 120
##$ZL2= 120
##$ZL3= 120
##$ZL4= 120
##$ABSF1= 10
##$ABSF2= 0
##$ABSG= 5
##$ABSL= 3
##$ALPHA= 0
##$AQORDER= 0
##$ASSFAC= 0
##$ASSFACI= 0
##$ASSFACX= 0
##$ASSWID= 0
##$AUNMP= <proc_1d>
##$AZFE= 0.1
##$AZFW= 0.1
##$BCFW= 1
##$BC_mod= 2
##$BYTORDP= 1
##$COROFFS= 0
##$CY= 11.3945322036743
##$DATMOD= 1
##$DC= 2
##$DFILT= <>
##$DTYPP= 0
##$F1P= 18.9103706918063
##$F2P= -1.10871071338519
##$FCOR= 0.5
##$FTSIZE= 0
##$FT_mod= 4
##$GAMMA= 1
##$GB= 0.15
##$INTBC= 1
##$INTSCL= 1
##$ISEN= 128
##$LB= 0.24
##$LEV0= 0
##$LPBIN= 0
##$MAXI= 10000
##$MC2= 0
##$MEAN= 0
##$ME_mod= 0
##$MI= 1.114404
##$NCOEF= 0
##$NC_proc= 0
##$NLEV= 6
##$NOISF1= 3.799351
##$NOISF2= 2.8
##$NSP= 1
##$NTH_PI= 0
##$NZP= 0
##$OFFSET= 15.70392
##$PC= 1
##$PHC0= -9298.314
##$PHC1= 12.20026
##$PH_mod= 1
##$PKNL= yes
##$PPARMOD= 0
##$PSCAL= 0
##$PSIGN= 0
##$REVERSE= no
##$SF= 200.130013532006
##$SI= 16384
##$SIGF1= 3
##$SIGF2= 2
##$SINO= 400
##$SIOLD= 16384
##$SREGLST= <1H.CDCl3>
##$SSB= 0
##$STSI= 0
##$STSR= 0
##$SW_p= 3612.71676300578
##$SYMM= 0
##$S_DEV= 0
##$TDeff= 0
##$TDoff= 0
##$TI= <>
##$TILT= no
##$TM1= 0
##$TM2= 0
##$TOPLEV= 0
##$USERP1= <user>
##$USERP2= <user>
##$USERP3= <user>
##$USERP4= <user>
##$USERP5= <user>
##$WDW= 1
##$XDIM= 8192
##$YMAX_p= 0
##$YMIN_p= 0
$$ End of Bruker specific parameters
$$ ---------------------------------
##NTUPLES= NMR FID
##VAR_NAME=  TIME,          FID/REAL,        FID/IMAG
##SYMBOL=    X,             R,               I
##VAR_TYPE=  INDEPENDENT,   DEPENDENT,       DEPENDENT
##VAR_FORM=  AFFN,          ASDF,            ASDF
##VAR_DIM=   8192,          8192,            8192
##UNITS=     SECONDS,       ARBITRARY UNITS, ARBITRARY UNITS
##FACTOR=    0.0002004,     1,               1
##FIRST=     0,             0,               0
##LAST=      1.6414764,     0,               0
##MIN=       0,             -80513,          0
##MAX=       1.6414764,     70443,           0
$$ Real data points
##PAGE= N=1
##DATA TABLE= (X++(R..R)), XYDATA
$$ [...]
1674g25J854j544l88J753j405K22J384j984L29J478j594N72R57j735Q21O73j597
$$ -725 1129 -415 -803 950 -455 -233 1151 -833 -504 974 -620 -48 909 -826 -5 668 -929
1691i29J156N60j551J002J09j193J299j29r55J288n49r15J207m52j60J042j210
$$ -929 227 787 -764 238 347 -846 453 324 -631 657 108 -807 400 -52 -212 830 -380
1708c80j07J097j115M07R57j379M96N37j488J191O81j701J072K87j623J404K01
$$ -380 -487 610 -505 -98 859 -520 -24 513 -975 216 897 -804 268 555 -1068 336 537
1725E37j441J641k44j710J609o4j106J613o38j140J560p06o96J723q06p76J173
$$ 537 -904 737 493 -1217 392 328 -778 835 197 -943 617 -89 -785 938 132 -644 529
1742E29r43l3J359j162j01R94j144K35Q50r98N74L48j253Q17L97r88Q43o8q60
$$ 529 -414 -447 912 -250 -351 643 -501 -266 584 -414 160 508 -745 72 469 -519 324 256 -604
1761f04J023l17p44J245m84o99J053n88k42J013r61n9J036r99J05P85j058N21
$$ -604 419 102 -642 603 119 -580 473 -115 -357 656 -305 -364 672 -327 -222 563 -495 26
1779B6N56j283Q61M79j447R81L48j271J212p5j370J517q8j399J491j91j202J428
$$ 26 582 -701 160 639 -808 173 521 -750 462 387 -983 534 446 -953 538 347 -855 573
1797E73m20r44J519o23r37J432n26n93J085p31k81J033q19o4Q53q05M1M41n75
$$ 573 153 -791 728 105 -832 600 74 -519 566 -165 -446 587 -232 -296 557 -248 -207 234 -341
1816c41N72J17q25O06n3m55Q54m53m13R28q83j96J400r76k73J057j283K15J437
$$ -341 231 348 -477 129 76 -379 475 22 -391 537 -346 -542 858 -118 -391 666 -617 -402 1035
1835A035j488J02J272j605K56J334j367M08Q32j608O47R71j345O17M95j199P80
$$ 1035 -453 -351 921 -684 -428 906 -461 -53 779 -829 -182 789 -556 61 556 -643 137
1852A37J82r26J048j49r49R73k54m44R75p57k99J094r08o9R99j018J94P10j162
$$ 137 319 -607 441 292 -657 316 62 -382 593 -164 -463 631 -277 -346 653 -365 -171 539 -623
1871f23O86O66j463P65M99j248J096J15j407J369o6j358J600j95j304J435n28
$$ -623 63 729 -734 31 530 -718 378 493 -914 455 389 -969 631 436 -868 567 39
1888C9q85J766q01r66J551q31n11J484j037k25J168j340K06J301j305K46P30j355
$$ 39 -846 920 119 -847 704 -127 -638 846 -191 -416 752 -588 -382 919 -386 -140 590 -765
1906g65Q39O28j382R20K20j299J128M6q78J184o93p56J519p60m36J333j333j1
$$ -765 74 702 -680 240 460 -839 289 335 -543 641 -52 -808 711 -49 -485 848 -485 -496
1924d96J479j664M16J509k166N36J508k114J014J232k558J261J249k475J451R95
$$ -496 983 -681 -265 1244 -922 -386 1122 -992 22 1254 -1304 -43 1206 -1269 182 1177
1940A177k456J526N91k180J955L25k290J789J36j703J890l26j471J764o60j013
$$ 1177 -1279 247 838 -1342 613 938 -1352 437 573 -1130 760 434 -1037 727 67 -946
1956i46J855p85p26J213j055J32J205j338L42O35j341J072K87j366J475m17j558
$$ -946 909 124 -602 611 -444 -312 893 -445 -103 532 -809 263 550 -816 659 242 -1316
1973a316K181m74j459K165j243j215K819j530j152K784k012q67K974k125m51K669
$$ -1316 865 391 -1068 1097 -146 -1361 1458 -72 -1224 1560 -452 -1319 1655 -470 -921 1748
1989A748k741n7K907k676J57K341k912O94K192k894J111J744l066J245J483k510
$$ 1748 -993 -1050 1857 -819 -662 1679 -1233 -539 1653 -1241 -130 1614 -1452 -207 1276 -1234
2005a234J580P58k529J755M24k003J940m9j681J645o69q49K034j119o97J512j469
$$ -1234 346 1104 -1425 330 754 -1249 691 642 -1039 606 -63 -912 1122 3 -694 818 -651
2022f51K39J538j805O90R28k268J448R53k210J738L8k318K619j73k458K833p28
$$ -651 -412 1126 -679 11 939 -1329 119 1072 -1138 600 638 -1680 939 766 -1692 1141 413
2039D13k186L313j272k104L494j763j663L900k201j749L513k295p30L727k968
$$ 413 -1773 1540 268 -1836 1658 -105 -1768 2132 -69 -1818 1695 -600 -1330 2397 -571
2054e71r34L276k748KL151k941j7K230k851R62K247k697P86J113k404J469P89
$$ -571 -1505 1771 -977 -975 2176 -765 -782 1448 -1403 -441 1806 -891 -105 1008 -1396 73 862
2071H62j780J751k52j870J660m39n29K030j564p15J654j848O56K156k435M77J111
$$ 862 -918 833 581 -1289 371 -68 -597 1433 -131 -846 808 -1040 -384 1772 -663 -186 925
2088I25k822K046J714l220J738P06l305K853P83l333L024j4l497L488j29l184
$$ 925 -1897 149 1863 -1357 381 1087 -2218 635 1418 -1915 1109 1095 -2402 1086 957 -2227
2104b227L668o26k845L689j420k710M125j082k079L366k216j747L708j642q86
$$ -2227 1441 815 -2030 1659 239 -2471 1654 572 -1507 1859 -357 -2104 1604 -38 -924
2119i24K925k650r06K723j714L77J876k629K84J399j788J273Q11j780J234m68
$$ -924 2001 -649 -1555 1168 -546 -169 1707 -922 -638 761 -1027 246 1057 -723 511 43
2135D3j447K173m73q39J949j940p56K353j823N50K446l344L8K329k788J709K271
$$ 43 -1404 769 296 -543 1406 -534 -1290 1063 -760 -210 2236 -1108 -1070 1259 -1529 180 2451
2152B451m167J251J983l669K504J947m236K126J249l847L121J109m028K947O65
$$ 2451 -1716 -465 1518 -2151 353 2300 -1936 190 1439 -2408 713 1822 -2206 741 1406
2167A406l601L046J28l082L378k00k946K858o67k090L073p50j658K208j538q53
$$ 1406 -2195 851 979 -2103 1275 1075 -1871 987 320 -1770 1303 553 -1105 1103 -435 -1288
2183a288K535j183m48J266j740M85J198j520J079L63j819J456j61j322K250q73
$$ -1288 1247 64 -384 882 -858 -373 825 -695 384 747 -1072 384 223 -1099 1151 278
2199B78j477K430j523j118K951j756o90K742k829m00L362k673l1K791l459L91
$$ 278 -1199 1231 -292 -1410 1541 -215 -905 1837 -992 -1392 1970 -703 -734 2057 -1402 -1011
2215a011L040l299R07K542l913J044K613l367J420J804l617J727J735l151J765
$$ -1011 2029 -1270 -363 2179 -1734 -690 1923 -1444 -24 1780 -1837 -110 1625 -1526 239
2230B39J066k882J862O87k262J973l5k019J996j97j322J718q91p46J710j167k35
$$ 239 1305 -1577 285 972 -1290 683 648 -1371 625 428 -894 824 -67 -813 897 -270 -505
2247e05J449j463K06J070j522R45O62j906J302M21j741J778k02j791K199n89j722
$$ -505 944 -519 -313 757 -765 180 842 -1064 238 659 -1082 696 494 -1297 902 313 -1409
2264a409K619r45j694K669j256j279K822j746j153K948j868q92K722k070m04K548
$$ -1409 1210 265 -1429 1240 -16 -1295 1527 -219 -1372 1576 -292 -1184 1538 -532 -936 1612
2280A612k378j09K451k390K09K126k459M46J722k251R35J387k413Q56J192j762
$$ 1612 -766 -875 1576 -814 -605 1521 -938 -492 1230 -1021 -86 1301 -1112 -256 936 -826
2296h26J120L95j746J292K75j190J228m29r10J323n37k86J113j436k4J526j133
$$ -826 294 689 -1057 235 510 -680 548 119 -791 532 -5 -291 822 -614 -638 888 -245
2313b45K88O65j873R78J265j677R31L41k108J553Q04j698J512k81k069K131K31
$$ -245 43 708 -1165 -187 1078 -599 332 673 -1435 118 922 -776 736 455 -1614 517 748
2330G48j762J852n28j623K182o15j498K206o63j200J871j162r85K039p92l86J473
$$ 748 -1014 838 310 -1313 869 254 -1244 962 299 -901 970 -192 -1177 862 70 -316 1157
2347A157j788n40J844o90K78P59k017K27J375q84P39L27j721O80N66q09J088j72
$$ 1157 -631 -1171 673 -17 261 1020 -997 -770 605 -279 460 787 -934 -254 312 -497 591 419
2365D19j203J125j48p57R50n97j46J437j098p18R20q24O67J404j643l20O11j186
$$ 419 -784 341 193 -564 386 -211 -357 1080 -18 -736 184 -640 27 1431 -212 -532 79 -1107
2383a107J361J372j894n1K53j184J734Q51j890O13J35j320J509K79j313J243k15
$$ -1107 254 1626 -268 -319 -66 -1250 484 1335 -555 58 193 -1127 382 661 -652 591 376
2400C76j331J280k89q88J665j88j045O06r12j53J917l13p73Q8j083M30J504m70
$$ 376 -955 325 36 -852 813 625 -420 186 -726 -879 1038 725 -48 40 -1043 -613 891 421
2418D21q5j75j316P76J000n34M37l98j071J087J66q21R47j87o56R52p03p35J298
$$ 421 336 161 -1155 -379 621 87 524 126 -945 142 308 -513 434 247 -409 543 -160 -895 403
2437D03j81k42Q83j254o33J220j81L96O70j740l44J193k97O02L89j530J28P14
$$ 403 222 -20 863 -391 -1024 196 15 411 1081 -659 -1003 190 -107 495 884 -646 -518 196
2455A96n99P84L21j181L83K42o23P48n3o14Q53k29p69N43k25J00R85p85n87N30
$$ 196 -403 381 702 -479 -96 146 -477 271 218 -396 457 228 -541 2 -223 -123 862 77 -510 20
2475B0m74M05R20q73k24K23o99Q15P37j042J17J55p24Q60K73r47O96M8r06Q28
$$ 20 -454 -49 871 -2 -226 -3 -702 113 850 -192 -75 80 -644 216 489 -458 238 286 -620 208
2495B08L4p13Q48j41o82P83l44n81R79j19m77M50m93j36Q04l41j73L44m95N6L79
$$ 208 242 -471 377 236 -446 337 -7 -588 391 272 -205 245 -248 -384 420 79 -94 250 -245 -189 190
2516A90k73K69K3n84L46J50k56M21k94l14N76l62j54P21n37k28O08n56J55O89
$$ 190 -83 186 209 -375 -29 121 -135 286 -8 -322 254 -108 -262 459 -78 -306 302 -254 -99 590
2536E90r44L8Q05p58K11N69r74L09O36q61M21M71j048M35N38p30M71P6q80P50
$$ 590 -354 -316 489 -269 -58 511 -463 -154 482 -379 42 513 -535 -100 438 -292 179 255 -625 125
2556A25L97q38L66M9n27O91J08o37K70n1k41N70L2m11j00m7L36K55k89j22k09
$$ 125 522 -316 50 99 -428 263 371 -266 4 -47 -288 282 314 -97 -197 -244 92 347 58 -64 -273
2577b73P9O23l11l87M22l56k5Q38o28m42O93m57J52Q83j146l86J145m43O4O45
$$ -273 -194 429 118 -269 153 -203 -228 610 -18 -460 233 -224 -72 811 -335 -721 424 -19 45 690
2597F90j332l1J326o49JN53j254J12J258n70o4K48j030M52J060o37k57N7m09O12
$$ 690 -642 -673 653 4 5 558 -696 -584 674 104 40 288 -742 -290 770 133 -124 -67 -476 136
2617A36M27o09j23l9J4N55p6l70j13k08N23N04o08k61k2m0Q35k2r47K68J00j47
$$ 136 563 -46 -169 -208 -194 361 285 -85 -198 -406 117 621 13 -248 -270 -310 525 503 -444 -176 -76 -223
2639b23Q88l96r27O61l9j31J007q59r21J142m0j84P47j174m73J535l25m50O61
$$ -223 665 269 -658 3 -36 -167 840 -19 -940 202 162 -22 725 -449 -922 613 288 -162 499
2658D99j062j53J523n44m55M96j000K07J441o97n98L07n26N63Q93q91m37K83r5
$$ 499 -563 -716 807 263 -192 304 -696 -489 952 255 -343 -36 -562 1 894 3 -434 -151 -246
2677b46N41K25o54j83kL16O00m27m42K1j28P61L34j145N5M84m18Q26O9j415O33
$$ -246 295 520 -134 -317 -319 -3 597 170 -272 -251 -379 382 716 -429 -374 110 -308 518 587 -828 -195
2698a95N56p34R55r4j578J020O57q83Q31l94j349J496M80j166O82l66q77J531
$$ -195 361 -373 582 488 -1090 -70 587 -296 535 141 -1208 288 768 -398 284 -82 -959 572
2716E72O2j092O74m56m66J459k40r82M46l27J08J120p33p16N14j60L77N01q57
$$ 572 634 -458 216 -240 -706 753 513 -469 -23 -350 -242 878 145 -571 -57 -217 160 661 -196
2735a96j81L59j62N73L1q37J91J45P9O37o76n79P06j06J49M64j105J5J001o85
$$ -196 -377 -18 -180 393 424 -413 -222 -77 2 639 -37 -616 90 -16 133 597 -508 -493 508 -177
2755a77K87N29j458M62J145j108M59M34j664R49J213j517L82M95j401J147Q22
$$ -177 110 639 -819 -357 788 -320 139 573 -1091 -142 1071 -446 -64 431 -970 177 999
2772I99j646N77M34j191J157M72j464O33K14p89J177l3j290P26K23m84P53l49
$$ 999 -647 -70 364 -827 330 802 -662 -29 185 -604 573 540 -750 -24 199 -285 468 119
2790A19o97P02j4j83L59m19o3K71j90M53j99o73P03Km73P97n47o66J290l84p86
$$ 119 -578 124 110 -73 286 -133 -196 75 -115 338 139 -534 169 171 -302 495 -52 -718 572 188 -598
2811e98J153o01o26J339o29n60J193r22l25J418j002l39J194j145J09J303j482
$$ -598 555 -46 -672 667 38 -522 671 -251 -576 842 -160 -499 695 -450 -341 962 -520
2828e20N9J364j411J38J259j413J98J130j339K57J033j160J89P17q73L33L54o51
$$ -520 -461 903 -508 -370 889 -524 -326 804 -535 -278 755 -405 -216 501 -372 -39 315 -336
2846c36N25l4n99O63p8l44N56n80j67R09m95k14M62o49K75O10o82K88J2q66J022
$$ -336 189 155 -444 219 141 -203 353 -227 -394 515 20 -194 268 -381 -106 504 -178 110 122 -744 278
2867B78K91r88P79m44r45J811j16j520J292l49j129J887k98j479J385l15r52J560
$$ 278 569 -419 360 -84 -1029 782 666 -854 438 89 -1040 847 549 -930 455 140 -812 748
2885G48m92j097J241l08l81R63j114k72J419o19j36N67j359L12J421q15m3K83
$$ 748 256 -841 400 92 -289 674 -440 -712 707 88 -48 519 -840 -528 893 78 35 318
2903C18j232N22J163n29j03l16n25Q82K17l73K09p31K13J103r88k68Q62r24M92
$$ 318 -914 -392 771 242 139 -177 -702 180 397 24 233 -498 -285 818 -170 -438 424 -500 -8
2922hJ211j645l82J067o27R11P42k064j19R67k71J217p8k038O67N25n41J566l93
$$ -8 1203 -442 -824 243 -384 527 1269 -795 -914 53 -218 999 921 -1117 -450 75 -466 1100 707
2941G07j936J216K74q85J422m42j428J515J33j189O59k22j67J255m75r45R2k86
$$ 707 -1229 -13 261 -624 798 356 -1072 443 576 -613 46 -176 -343 912 437 -508 -416 -702
2959g02R26J025j066n17k26n40J650Q76j486k78j39l84J520K28j203L11k49j94
$$ -702 224 1249 183 -334 -560 -1100 550 1426 -60 -338 -477 -861 659 887 -316 -5 -254 -448
2977d48J065o47m40R96o03K2P82j622J9J884o72j33L58k004M39K229o39k81j6
$$ -448 617 -30 -470 526 -77 -55 727 -895 -876 1008 336 203 561 -1443 -1004 1225 586 305 289
2996B89j701O96J619m78J54m69j390J096P56o52O25m82q87J296k67j019J124m
$$ 289 -1412 -716 903 425 579 110 -1280 -184 572 -80 545 63 -824 472 205 -814 310 306
3014C06m54Q39q58q76J027K55K63L31j358m32P08K39J040j87j790L61N42k59J234
$$ 306 -148 691 -167 -1043 -16 239 502 833 -525 -957 -249 -10 1030 843 -947 -586 -44 -303 931
3033I31k75j559Q34J92o72J160k75r56J047k58p01Q00n57k3J366r55p32P17p33
$$ 931 656 -903 -69 123 -549 611 336 -620 427 169 -532 268 -289 -312 1054 99 -633 84 -649
3052f49N92J411j419n51P75r04O70J309j270l66M56p23P37P02r79J58J52n48O45
$$ -649 -57 1354 -65 -616 159 -745 -75 1234 -36 -402 54 -669 68 770 -209 -51 101 -447 198
3071A98j08m87Q89l20n97P05n61k09J154m99l78N20q65J30J110n73j08J73q80
$$ 198 90 -397 492 172 -425 280 -281 -490 664 165 -213 307 -558 -428 682 109 1 174 -706
3090g06O70N91q80N51N3j022R70J76j018J033p2j110J141n0j080J117m0q38R35
$$ -706 -36 555 -325 226 279 -743 227 403 -615 418 346 -764 377 327 -753 364 324 -514 421
3109D21m04o71J128l00n09O92n87p8Q74p32n6O61q16K26P21q70J70M45p09N00
$$ 421 17 -654 474 174 -335 357 -230 -308 566 -166 -222 439 -377 -151 570 -300 -130 315 -394 106
3129A06L45q63L56K51m08N22k86m74P54k27k91O34o79j60R71o24q1O44j028J47
$$ 106 451 -412 -56 195 -213 309 23 -451 303 76 -215 419 -260 -420 551 -73 -154 490 -538 -391
3149c91J097p41m4L56r38O05P58r47K85J71q61Q81K43r71P52o4q64J151j06j114
$$ -391 706 -35 -79 277 -661 -56 702 -245 40 211 -650 231 474 -497 255 191 -673 478 372 -742
3169g42R81L2o78R52m79q96J094R3m70N07o30l64Q72j10j3J99q25J05O50k52K81
$$ -742 239 271 -407 545 66 -830 264 357 -113 394 -236 -600 272 162 149 348 -477 -372 278 26 307
3190C07j46q20O58L59n15L73k57l97Q21k29m67N79n04q2J009p06l94O79p32L22
$$ 307 161 -659 -1 358 -157 216 -41 -438 383 154 -313 266 -238 -320 689 -17 -411 268 -464 -142
3210a42J133j206l85R01o53L84Q42j260q8P97o10M27M77j059J86M77m27N82j59
$$ -142 991 -215 -600 301 -352 32 874 -386 -474 323 -287 140 617 -442 -256 221 -206 376 217
3229B17q63P31K10m88N52m68n33J064j47n37N52n25k44R55k99k90K68o21L03P66
$$ 217 -646 85 295 -193 359 -109 -642 422 275 -262 290 -235 -479 476 177 -113 155 -466 -163 603
3249F03o11n7Q6n28P33L07q79L48N0n22Q35J1q04M97j49k30Q77m55o25O73k95
$$ 603 -8 -65 21 -507 226 533 -346 2 52 -470 365 376 -428 69 -80 -310 567 112 -513 160 -135
3270a35M1P43r69j68R55o47P9P53j104K7R87p30J16N59j061K39Q87n96L2J06o31
$$ -135 -94 649 -320 -488 467 -180 -101 652 -452 -425 562 -168 -52 507 -554 -315 572 -24 8 114 -517
3291e17N86L46n23K20k21k96P33j67l25M63n90p1R21n13k97M98o05K77P07r04
$$ -517 69 415 -108 112 -109 -405 328 161 -164 299 -291 -362 559 46 -251 247 -358 -81 626 -278
3311b78K2N65o56M71M02j025L95M40p71P28K12j147N45L84n74O48j19q76O87J89
$$ -278 -256 309 -347 124 526 -499 -104 336 -435 293 505 -642 -97 287 -287 361 242 -634 53 242
3331B42m28M70l05l60O00k33n0M41o68L9O43n27J49K88q06M68N77q11K07K93o47
$$ 242 -186 284 -21 -381 219 -14 -64 377 -291 -252 391 -136 13 301 -505 -37 540 -271 -64 229 -418
3352d18N72K36p30M14K3n10P36p0o04N12k44k01Q09n25m52P29l68n7O51p51p0
$$ -418 154 390 -340 74 97 -413 323 253 -351 161 -83 -284 525 0 -452 277 -91 -148 503 -248 -318
3373c18P14o06J67N25q65J71N97o66M12K79j015N55N28p98M36J58q37O64K69o99
$$ -318 396 -210 -43 482 -383 -212 385 -281 131 410 -605 -50 478 -320 116 274 -563 101 370 -329
3393c29M88Qn84N55O4l70L35k79j10N34l22j04K69m01K95K66o26L49K17o21N25
$$ -329 159 167 -417 138 202 -168 167 -112 -222 312 -10 -114 155 -246 49 315 -311 38 255 -366 159
3414A59J16o75N77lo09P81j46p43P99q0n41P69l81n40R48l32m87P86m63l43Q12
$$ 159 275 -400 177 174 -435 346 200 -543 256 176 -365 404 23 -517 431 99 -388 398 -65 -408 404
3435D04m47j68O17o46m5P35n64mM17o26K80M45o62K34L10o05L83J87n02L94k5
$$ 404 -43 -211 406 -240 -285 450 -114 -118 299 -327 -47 398 -264 -30 280 -325 58 245 -257 137 112
3456A12m42N42n0m01M15j98j80N09l93j31N12m05j6L83m50J67K92n69L46K36o01
$$ 112 -330 212 162 -239 176 -22 -202 307 -86 -217 295 -110 -126 257 -193 -26 266 -303 43 279 -322
3477c22M35J13o03O07p5o33Q29j02p62P91j25o51R00k52o45Q63k87n54Q30k10
$$ -322 113 226 -377 230 155 -478 351 249 -513 278 153 -498 402 150 -495 368 81 -473 357 147
3497A47m83O00l51j99O52m03j52M48m22K8L82m10J83K29n50K55K51l70K37L8l04
$$ 147 -336 264 -87 -286 366 -37 -189 259 -163 -135 247 -163 20 249 -301 -46 205 -165 72 110 -194
3518a94L43j53k02M27k27j20L94m76N6N38o31J14N99p29N4N68o71K74N17p94K22
$$ -194 149 -4 -206 221 -6 -126 268 -208 -152 386 -245 -131 468 -261 -207 361 -310 -36 481 -313 -91
3539i1M37o96L67L48o22L79N1o58O73P9o33O62j42o68P47j18m93Q13k37p00O17
$$ -91 346 -350 17 365 -257 122 173 -485 188 267 -366 296 154 -514 233 115 -378 435 198 -502 115
3560A15m9k82N48k31l39L27k36L9L84k70L2j6l78M54J55m50L84o5m82M87n5k80
$$ 115 66 -216 332 101 -238 89 -147 -108 276 6 38 22 -356 98 253 -197 187 122 -360 127 72 -208
3582b08N58k82l74M90k79q5N69n09nN33p84J00Q15p34P5O32r07J26P76p86J77
$$ -208 350 68 -306 184 -95 -180 389 -120 -125 408 -376 -276 539 -195 -120 512 -395 -269 507 -279 -102
3603a02O78q52J8N27n23L13L11n87K28P3m50N06Q0l77M09l08m18P25p8l46M82
$$ -102 576 -276 -258 269 -254 59 370 -217 11 84 -366 140 220 -157 252 -56 -474 251 173 -173 309
3624C09l39l35M88j34NL36m31p3J95k10L86K9n18M49r3n33P21L6o32O05j96n76
$$ 309 -30 -365 123 -11 -6 330 -101 -174 21 -189 197 226 -292 157 64 -469 252 288 -344 261 65 -511
3646e11Q18j00n74O59k18m22O05k98j83O40n38j18O25o01J7O26o72J36O11q60
$$ -511 307 207 -367 292 74 -348 257 -41 -224 416 -122 -240 385 -216 -199 427 -245 -109 502 -358
3666c58Q9P12o16O1M90n93Q0L38l62K07J43l33J69p3p7M18l36j54M87m41r2N73
$$ -358 -269 443 -173 -112 378 -215 -135 203 -159 48 191 -142 27 -46 -123 295 -41 -195 292 -149 -241 332
3688C32m35m0M90n64NN58m95R0L38n24K33K01m96N05P7p16N43R9n80O90p1p86
$$ 332 -103 -143 347 -217 -212 346 -149 -59 279 -245 -12 189 -307 198 275 -441 102 201 -379 311 240 -546
3710e46P56K9o56O90l0o79N46ml17N25k75l33M45j62l4L04m41P4L45m71K38L41
$$ -546 210 239 -417 273 243 -436 110 106 -211 314 39 -294 151 -11 -45 259 -182 -108 237 -234 4 345
3732C45n98J94K94m46K90J52m98L33R5l23K90j71j28M55l59j42N34m67o9O37n84
$$ 345 -253 -59 235 -211 79 231 -267 66 161 -162 128 -43 -171 284 -75 -217 317 -150 -219 418 -166
3753a66p4O42o43K5P48p04j30O03m47J09L96o19R4L79m03L17J13n39L18P7l56
$$ -166 -240 402 -241 -216 532 -172 -302 301 -146 -37 359 -260 -166 213 -190 127 240 -299 19 96 -260
3774b60N75j08o42N20N9l49M69k07l91M83p2j86K79k48m4K76k46J85P8n44L65
$$ -260 315 207 -435 85 144 -205 264 57 -334 149 77 -109 170 -78 -122 154 -92 93 171 -373 -8
3795hL25m72K84l0n85O09K28o04L93l9n22N56N4l78M02k60k74O13k92k68N47l55
$$ -8 317 -155 129 99 -486 123 351 -253 140 101 -421 135 189 -189 213 -47 -321 292 0 -268 279 -76
3817g6m9N49o93j36P94l59r1M26o94j04P09j71M0J38o73MN06N7J87l19m94L91
$$ -76 -125 424 -269 -405 389 30 -61 365 -329 -433 276 105 145 283 -390 -386 120 177 364 45 -449 -58
3839e8J06l0L72m12l30M96j81j06M68m20j05N29l52j62K39k98L69L85o92n7K01
$$ -58 48 18 390 -22 -352 144 -37 -143 325 -95 -200 329 -23 -185 54 -244 125 510 -182 -239 -38
3860c8k68O34K30q52J19J41l69P48K03q51J67J24k47N61q2n29L91Jk01K53l21
$$ -38 -306 328 558 -294 -175 -34 -403 345 548 -303 -136 -12 -259 302 220 -309 82 83 -118 135 -186
3881a86k4O07k73k00J61n49K20Q25l45k58l4n49M51Q06l83l27j36k82N19L84l08
$$ -186 -210 397 124 -76 85 -464 -244 581 236 -22 -56 -605 -154 652 269 -58 -194 -476 43 427 119
3902A19o4k36j51N30k5k41J71k42M4M64m61k47M65o0J19J16o96L3N58j21K46p4
$$ 119 55 -181 -332 198 173 -68 103 -139 -95 369 -92 -339 126 66 185 301 -395 -362 196 75 321 247
3924B47q19L04M97k32L85j96q37N27M79m09K18r2n32N96J94n53K15Rj62M58j25
$$ 247 -572 -268 229 -3 382 186 -651 -124 355 -54 164 72 -460 136 330 -223 -8 1 -161 297 172
3945A72m52J63KJ74M37m70m27K48O5L51K20o56j86L21O3K41k9m68O9J58M1K67
$$ 172 -280 -117 -115 59 496 26 -401 -153 -88 263 483 -173 -359 -38 25 266 237 -231 -162 -4 37 304
3967C04l03l08L73Ql0K07m97q0O98k19k59J92l59J36N96m21k01K20l46K93M67
$$ 304 1 -307 66 74 44 251 -246 -326 372 153 -106 86 -273 -137 459 38 -163 57 -289 4 471
3988D71n58q4J66k24M63J80p58J54L43k39L19j5o31L08L42k63J60q5l68L04K16
$$ 471 -87 -171 -5 -229 234 414 -344 -190 153 -86 233 218 -413 -105 237 -26 134 49 -319 -15 201
4009B01j14l3k55K1L89n0j38r1k22L57K84l90l5%j40M07J01m18N0l8k1N02j95
$$ 201 87 54 -201 -180 209 159 21 -70 -292 65 349 -41 -76 -76 -216 191 292 -126 -76 -114 -135 367 172
4032A72m62K70k9M0M32n24l01O06j37j33L46n29j04P02k37j81K14m95J20O67k83
$$ 172 -290 -20 -49 -9 423 -101 -402 204 67 -66 280 -249 -353 349 112 -69 145 -350 -230 437 154
4053A54k56L9k93L91M47m84j82R2r3L65J23m54RQ6K1K80j39l16Q0J06K58L0n04
$$ 154 -102 -63 -356 35 482 -2 -184 -92 -185 180 303 -151 -142 -56 -35 245 106 -210 -130 -24 234 264 -240
4076b40j1K95J2K65j80o49L82M00k69K58j89o45N69L90m12K10k47m84P70K37o07
$$ -240 -251 44 56 321 141 -508 -126 274 5 263 74 -571 -2 388 -24 186 -61 -545 225 462 -145
4097a45J15j13j55P18j38o06K45J0j7N25l38m97L10O0J61K64n41k63L70J33K10
$$ -145 -30 -143 -298 420 282 -324 -79 -69 -86 439 101 -396 -86 -26 135 399 -142 -405 -35 98 308
4118C08j16n88J83L76o4J25k46m35M49K37j61J02l67k10N99J15k63n9l39J87N94
$$ 308 192 -396 -213 163 99 224 -22 -457 -8 229 68 170 -197 -407 192 307 44 -15 -354 -167 427
4139D27k81k29Ok75M78L40n56mN7k98O30J89q03J72J59k32O41q2q73M61K81l38
$$ 427 146 -83 -77 -352 126 466 -90 -94 -37 -335 295 484 -319 -147 12 -220 421 339 -534 -73 208 -130
4161a30M79k32o76O28K02l75L44k65m62O20J97l54P0k35o5N20j2k95q2q8K77J83
$$ -130 349 117 -559 69 271 -104 240 -25 -487 133 330 -24 46 -189 -254 266 254 -41 -123 -211 66 249
4183B49k32Pj92q8N58j01l48K36k83l9P42l93m86M99k18m1O36n80l28O51k82r8
$$ 249 17 24 -168 -256 302 201 -147 89 -194 -233 509 116 -370 129 -89 -130 506 -74 -402 249 -33 -131
4205a31N52n65k06O02k73ML26n62L4N02k79J5Q6l64K94K05l72K13n3k92M32j6
$$ -131 421 -144 -350 252 -21 -17 309 -253 -219 283 4 19 105 -259 35 240 -132 81 28 -264 168 152
4227A52l22L18k06k36N92j60l79L58j75q6M52l13j98L28j92J6K50k71K7J10k29
$$ 152 -170 148 -58 -294 298 138 -241 117 -58 -144 308 -5 -203 125 -67 -51 199 -72 -45 65 -164
4248a64K83O7l74K17j5j68M07k08l24M75j94k29N36l28k65N57l58j21O47n33k60
$$ -164 119 186 -188 29 14 -154 253 45 -279 196 2 -227 309 -19 -284 273 -85 -206 441 -92 -352
4269c52O70l86j18N89n54j45O67m23j39M91l91j30M35k12n7J64k46Q5J69r1J3
$$ -352 318 -68 -186 403 -151 -296 371 -52 -191 300 -91 -221 214 2 -55 109 -137 -52 117 26 39
4290C9j41KK88j85q2K28l11N6L98l89PK91m42J72M39n17%L10l87K94K60o18J90
$$ 39 -102 -100 188 3 -79 149 -162 -106 292 -97 -90 201 -241 -69 370 -147 -147 163 -224 70 330 -288 -98
4313i8L23l99K74J38n22K81J88l31L13m1m39L74R9k02K00k69j43M93j48j67K15
$$ -98 225 -174 100 238 -284 -3 185 -146 167 126 -313 61 160 -42 158 -111 -254 239 91 -76 139
4334A39l45P2M50l50l6K42m03J29M44l92p3K41k48J71J94l93L8K19p7J08j50j70
$$ 139 -206 -134 316 -34 -70 172 -231 -102 342 -50 -123 118 -130 41 235 -158 -120 99 22 130 -20 -190
4356a90K22j3L7J78m07m4L54j70J44J61o01J30M88l49J02J53n16L02L56n41J66
$$ -190 32 19 56 234 -173 -217 137 -33 111 272 -329 -199 289 -60 42 195 -321 -19 337 -204 -38
4377c8K35m44L46K12n96K00K13k78L93M4o56J70L09p2K29j82m09K12J87K6Q7k50
$$ -38 197 -247 99 311 -285 -85 128 -150 243 287 -369 -199 110 38 267 85 -324 -112 75 101 188 -62
4399f2r2J58n6J61K7l40K17J64k41N6n4j89M95R1m85J3j5ON27q7m75O6j38J34
$$ -62 -154 4 -52 109 136 -204 13 177 -64 -8 -62 -251 244 335 -150 -137 -152 -146 381 294 -181 -115 -253 -119
4423a19N74k64l89J33j67K14M27m69j58L63j99N3J81m40J74M36l32m4J1l91M05
$$ -119 455 191 -198 -65 -232 -18 409 -60 -218 145 -54 -1 180 -260 -86 350 18 -26 -15 -406 -1
4444aM60l24j34k17k59O23L73m04k09j68l6M86J46l05j04p5P7K23j07q0mj3K36
$$ -1 459 135 1 -216 -475 148 521 117 -92 -260 -296 190 336 31 -73 -148 -71 152 45 -35 -39 -52 184
4467A84o2m22J26K48N1K90m18n67M32L33J1J94m78n06M94K89k3J90n18l48N76
$$ 184 122 -300 -174 74 125 415 -3 -570 -138 195 206 400 -78 -584 -90 199 176 366 -152 -500 76
4488G6J27j62J15l46j8N08k41k80K19o9J53K74m66k31K56Q7L02O4n79k16K84K56
$$ 76 203 41 156 -190 -208 300 59 -221 -2 -71 82 356 -110 -341 -85 2 304 368 -211 -427 -143 113
4510A13L17j89n80L5K84J77J40k72k80J80J28O3Mk75J7K61kl7j91k56M33K97l00
$$ 113 430 241 -339 -304 -20 157 297 25 -255 -75 53 116 120 -155 -138 123 121 84 -107 -363 70 367 67
4533F7j06k07j10O27J56n03j2j13q4O10M6n36L2Jj5N02j70m84K16J38j4J72l01
$$ 67 -39 -246 -356 271 427 -76 -88 -201 -285 325 371 -165 -133 -132 -147 355 185 -299 -83 55 41 213 -88
4556h8k03L69Q7r4%k97J7L75K3q9j65k55K58L46j05j50k34m4M18R3k54m3j47O7
$$ -88 -291 78 165 71 71 -226 -209 166 189 100 -65 -320 -62 284 179 29 -205 -249 169 262 8 -35 -182 -115
4580a15L80j05k57M1r3J30L26k70k35J36J7J89R5m20lK38k0J13r0l42K46J91j44
$$ -115 265 160 -97 -56 -149 -19 307 37 -198 -62 -45 144 239 -181 -184 54 34 147 57 -285 -39 152 8
4603HJ45j91l19M05K02k36O0k22j76N13Q8l45N6j05l9L76q0k49J10o4L8K03j57
$$ 8 153 -38 -357 48 250 14 74 -148 -324 189 277 -68 -12 -117 -156 220 140 -109 1 -63 -25 178 21
4626B1j54J06L2J38m9k70O3J63O0Q4k42k02K59O2MJ48l27j60L46m1%J73l67r0
$$ 21 -133 -27 5 143 94 -176 -113 50 110 194 -48 -250 9 71 75 223 -104 -264 82 41 41 214 -153 -243
4650b43M39j44j42J99k23O3K93k96r9K42j33P3J64l08j9J54n7J74M0l43L7J28
$$ -243 196 52 -90 109 -114 -51 242 -54 -153 89 -44 29 193 -115 -134 20 -37 137 177 -166 -129 -1
4672aJ3J78j55k21J86K4n2J54j66o0K08j32k8J78k27L9K60j94m8P5j81J88J94
$$ -1 12 190 35 -186 0 24 -28 126 -40 -100 108 -24 -52 126 -101 -62 198 4 -44 31 -150 38 232
4695B32k92l2Q5j00K05L8k25R3k3j19K80n5j76J45j27j9K95k14j34K92j78n9K42
$$ 232 -60 -92 -7 -107 98 136 -89 4 -19 -138 142 87 -89 56 -71 -90 205 -9 -143 149 -29 -88 154
4718A54k29j0K75k44m0K44k33J8K30k33L4J32k29J29J71k58P3Q0j37J35j0j56
$$ 154 -75 -85 190 -54 -94 150 -83 -65 165 -68 -34 98 -131 -2 169 -89 -16 64 -73 62 52 -104
4740a04J46oj06J44n9p2J37j48L1J98k04lJ33j83J15J29k59J38J10l02J77J36
$$ -104 42 36 -70 74 15 -57 80 -68 -37 161 -43 -46 87 -96 19 148 -111 27 137 -165 12 148
4762A48k50J33M5k51K57P7l07J72L3j76K28m1j98J91n7j11K50q8j70J31q4P2J74
$$ 148 -102 31 76 -175 82 159 -148 24 57 -119 109 68 -130 61 4 -107 143 55 -115 16 -68 4 178
4785A78k31o5J75j10Q8Q5k28R8P4j76J79L8k48J65M5j51J62p0j82K98j9k23J32
$$ 178 -53 -118 57 -53 35 120 -108 -10 64 -112 67 105 -143 22 67 -84 78 8 -174 124 105 -118 14
4808A4o6k6K80j47k01J84q7NK34j77j21R2o9J46J43k83l8J15l8J80n5k65J67P1
$$ 14 -52 -78 202 55 -146 38 -49 -44 190 13 -108 -16 -85 61 204 -79 -117 -2 -40 140 85 -180 -13 58
4832E8r9J77j24k00K41j1o7J93k35j48L42m1j07J02k11J6L19j76j11J08j12Q3
$$ 58 -41 136 12 -188 53 42 -25 168 -67 -215 127 86 -21 81 -130 -114 205 29 -82 26 -86 -3
4854cJ75j95m0N5p9J93L6k46K9M0M8K04j85k46J99O0J5J23k53j33K87l7qJ37l15
$$ -3 172 -23 -63 -8 -87 106 142 -104 -75 -35 13 217 32 -214 -15 45 60 183 -70 -203 84 47 39 176 -139
4879a39m5L42p0m9L6k88J25L23j72j13L8j22J76J32j67m4j0m0K00nj63K4o1R8
$$ -139 -184 158 88 39 75 -213 -88 235 63 -50 -12 -134 42 174 7 -37 -47 -87 113 108 -55 -31 -92 6
4903FK13k48j35J64l6J15J16l53pK94j20M2Q9l58P9L04j27K0k3k82J97K92j84
$$ 6 219 -29 -164 0 -36 79 195 -158 -165 129 9 51 140 -218 -139 165 38 58 35 -247 -50 242 58
4926E8q0o8o6K59O3j80m5o7Q1K30j23q8j1j20K00K13k92p1R2p7K25Q2m06P3K25
$$ 58 -22 -90 -156 103 166 -14 -59 -126 -45 185 62 -26 -37 -157 43 256 -36 -107 -15 -92 133 215 -191 -118 107
4951A07j55J47K1l24J29K06j37P1m4k24J93J80j30m7j02j9K77nj72m3q0J57J96
$$ 107 -48 99 120 -204 -75 131 -6 65 21 -203 -10 170 40 -7 -109 -128 149 144 -28 -71 -151 6 202
4974B02j90n3lj13K46J33l02J9J8r1L16ll93J23J58j08K07q1l27K31J41j51J09
$$ 202 12 -41 -44 -157 89 222 -80 -61 -43 -134 182 179 -214 -91 67 -41 166 85 -242 -11 130 -21 88
4997H8j00j83K15J03p2k7j55K2K25j3p2p8j31K38J02j95M7l0j21K56Ok74J58j1
$$ 88 -12 -195 20 123 51 24 -131 -109 116 103 31 -47 -178 60 162 -33 14 -16 -137 119 125 -149 9 -2
5021bj14L24r0l58K00Q9n8J94j92k79L13J01j16J01j79j34K35N6m1J6j82J4J66
$$ -2 -116 208 118 -240 -40 49 -9 185 -7 -286 27 128 12 113 -66 -200 35 91 50 66 -116 -102 64
5044F4jj2p8j07J87N7j58M8m1l0K41r2k13J49l2l7K57j42k37J66oL0K10k42j83
$$ 64 63 51 -27 -134 53 110 -48 0 -41 -71 170 78 -135 14 -18 -55 202 60 -177 -11 -17 13 223 -19 -202
5069b02K31J1JP8j92qJ78q4J3J5j34J02R6j15N1r4j11K76K9j93O3j07l0L31j27
$$ -202 29 40 41 119 -73 -81 97 13 26 41 -93 9 105 -10 41 -53 -164 112 141 -52 11 -96 -126 205 78
5094G8k13J65q4m9K87j27j78J60p6l3K26j48j54J95Nm9K5r4K0J33k3m5n6l9J04
$$ 78 -135 30 -54 -103 184 57 -121 39 -37 -70 156 8 -146 49 54 5 30 -64 -44 89 66 21 -35 -74 30
5119C0L6l1M7j64l3K11l6n4N9j95N0K78j89q2J58j65L2K22k22l8J92j80M3K05
$$ 30 66 35 82 -82 -115 96 60 6 65 -130 -80 198 9 -73 85 -80 -48 174 -48 -86 106 -74 -31 174
5143A74k31n5J73p3K8R2k23L1J83q6mJ6q1O1L1n1N4m9o4J27m1j8N9j44L7J89j44
$$ 174 -57 -112 61 -12 16 108 -115 -84 99 13 9 25 -56 5 36 -15 39 -10 -74 53 12 -6 53 -91 -54 135 -9
5170in3J24j25O1J22j95K6J35j37M6J04j51L1O5q2R7Rj62Q2O3n9O0n1o1R8l1l3
$$ -9 -62 62 -63 -2 120 -75 -49 86 -51 -5 99 -52 -21 44 -38 59 68 -94 -12 51 -8 52 1 -60 38 7 -26
5197b6R8q3m2J01r7L9J26j90J7J59j47L2J21j88O8J24k21P8J68k03L7J13j52N5
$$ -26 72 -11 -53 48 -49 -10 116 -74 -57 102 -45 -13 108 -80 -12 112 -109 -31 137 -66 -29 84 -68 -13
5221a3J13j65O0J02j44K4O4o5M7k2k3N6l8l0Q1p9M4M4j41R1J05j78O5P4j59J31
$$ -13 100 -65 -5 97 -47 -23 41 -24 23 1 -22 34 -4 -34 47 -32 12 56 -85 6 111 -67 -2 72 -87 44
5247D4O5k03J13N6j85J54P8k04R0J6j17J77J3k18J22M9j08J05j7r2J07m5m3R1
$$ 44 109 -94 19 75 -110 44 122 -82 8 24 -93 84 97 -121 1 50 -58 47 30 -62 45 0 -43 48
5271D8p3j9R9o6K3N9j74Q8J40j35L2mj64J70J08k02Q8O4k17J40J20j66Q3Kj60
$$ 48 -25 -44 55 -11 12 71 -103 -15 125 -10 22 18 -146 24 132 -70 18 82 -135 5 125 -41 42 44 -116
5296a16J48M4j32O4M4o1L9p6mJ05j4J2j1j43Q0Q4r3J84p0k69J67Q7j15J97r8k55
$$ -116 32 76 -56 8 52 -9 30 -46 -50 55 41 53 42 -101 -21 63 -30 154 84 -185 -18 69 -46 151 53 -202
5322b02K39J9j89K73m3k53K27m1j92K86n1k07K37n2k21J87M5q1J35j22j36J15
$$ -202 37 56 -133 140 97 -156 71 30 -162 124 73 -134 103 51 -170 17 62 -19 116 -6 -142 -27
5344b7O7oL5n9m2k8J4J38k0r6P1j04l0J85q9o6K14j69j07J66j00L7K00k10p9J70
$$ -27 40 34 69 10 -32 -60 -46 92 72 -24 47 -57 -87 98 9 -57 157 -12 -119 47 -53 -16 184 -26 -105 65
5370F5j53N0K36k01l4Q8k21J68K01k43L3P3k17J57R7j82J59J7k57J59P0j48J81
$$ 65 -88 -38 198 -3 -37 51 -170 -2 199 -44 -11 62 -155 2 99 -83 76 93 -164 -5 65 -83 98
5393I8k4j82J52p0r1K27k8j50P9n7l3J64k7r5P0n1j6L2J5O7r9pQ4r9J0J48j63
$$ 98 74 -108 44 -26 -117 110 82 -68 11 -46 -79 85 58 -37 33 -18 -34 -2 13 80 -19 -26 58 -41 -31 117 -46
5420d6LK20k97j1L35k27n0K56k98j1L38k70l0L14l21m8L39k39k6K54k93J3K85
$$ -46 -43 177 -120 -131 204 -23 -73 183 -115 -126 212 -58 -88 226 -95 -143 196 -43 -69 185 -108 -95 190
5443A90k52m9K52j79k0J57j69NJ56j11%P6o4k7J8O3kj15O1K8n5J25n5j86J89N1
$$ 190 -62 -111 141 -38 -58 99 -70 -65 91 -20 -20 56 -8 -35 -17 46 44 -71 -10 18 -37 88 33 -153 36 87
5469H7j79J79k0k33K31Rk01K64q8k42K92j5k03K41j09j68L13j33j82K98j35j31
$$ 87 -92 87 67 -166 65 74 -127 137 49 -193 99 84 -119 122 13 -155 158 25 -157 141 6 -125
5491a25K76j68j23K88j74o1K66k15j19K37p1k4J46j99l2J83r3J7N2j11J9L7qK5
$$ -125 151 -17 -140 148 -26 -87 179 -36 -155 82 11 -13 133 -66 -98 85 -8 9 61 -50 -31 6 -2 23
5515B3j2l1J2j4P8k8j25J23N9j65J20oj96K55L2k59K13j4k86L04Q3l22K38j7l02
$$ 23 11 -20 -8 -22 56 28 -97 26 85 -80 40 34 -162 93 125 -134 79 65 -221 83 166 -156 82 65 -237
5540b37L59N4l50K34M1k85K79kk43K49j7k52K56kk10J94%j43J21n5q6J53K2r3
$$ -237 122 176 -174 60 101 -184 95 93 -150 99 82 -170 86 84 -126 68 68 -75 46 -9 -95 58 80 -13
5564a3Ok7L5J4QL9q7k6Q2o1N3R8k10LK04j57K1J31k22Q3J80k50N5J70k49J03J81
$$ -13 -7 -34 1 15 23 62 -25 -51 31 -30 23 121 -89 -86 118 -39 -18 113 -109 -26 154 -96 -41 129 -120 -17 164
5591A64k68Q5J31k69J90J52l28J10J49k39J85Q0k92J62Q3k23J82O8k26J09M9j19
$$ 164 -104 -19 112 -157 33 185 -143 -33 116 -123 62 142 -150 12 95 -128 54 122 -104 5 54 -65
5613f5J26Rj61J25K2p5M3k9j0N6j6k7jk5M0j1j3P8j06l3J53q0k1J05j63J7K22
$$ -65 61 70 -91 34 56 -19 24 -5 -15 41 25 -2 -3 -28 12 1 -12 66 -40 -73 80 0 -21 84 -79 -62 160
5640A60j86m5J89j96J7K25k22oK09k53M2K53k52k7K18k17O2J99k70M3K02j99K6
$$ 160 -26 -71 118 -78 -61 164 -58 -64 145 -108 -66 187 -65 -92 126 -91 -29 170 -100 -57 145 -54 -28
5663b8J65k19K8J37j29M6J05j67K8J02o9LJ2l4M1J5k6oKNjm4Q1k7q7J09l2m8J10
$$ -28 137 -82 -54 83 -46 0 105 -62 -34 68 -1 2 14 -20 21 36 10 4 6 11 10 -34 47 20 -67 42 10 -38 72
5692G2r0n3J76r4j26K00r1q2J98j39q5K41j33j06K43j42j10K26j10n2K11j85q2
$$ 72 -18 -71 105 11 -115 85 -6 -88 110 -29 -114 127 -6 -112 131 -11 -121 105 -5 -57 154 -31 -113
5715a13K44j20p8J77j31l7J56j36lJ41j26n0J35o9kO1q0J3P9p2lL8k6Kj7K0L5
$$ -113 131 11 -67 110 -21 -58 98 -38 -41 100 -26 -76 59 -10 -12 49 -31 -18 61 -11 -14 24 -2 0 -17 3 38
5742C8m6J2J7m7N6Mq8Q8K2j18J05Pj01J11l3j22J81l6j42J47j6j15J41m7j15J94
$$ 38 -8 4 21 -26 30 34 -54 34 56 -62 43 50 -51 60 27 -95 86 50 -92 55 39 -76 65 18 -97 97
5768I7q1j30J91n0j19J74q3p9J90j07r5J89q2j02J55p0l5J25j15k7J41o5n0P3
$$ 97 16 -114 77 27 -92 82 -1 -80 110 3 -92 97 15 -87 68 -2 -37 88 -27 -54 87 22 -28 45
5792D5n4j5O5m2LL4n5rM1J4ln5J4L9m2L2K4p3M9J9r5R4N2j56P7N6j27R4L3j57
$$ 45 -9 -24 41 -1 2 36 -19 -28 13 27 24 -31 -17 22 -20 12 36 -37 12 31 -64 30 82 -74 3 59 -68 26 59 -98
5822i8J35M4j78R8N3j27J17Oj26J15kj25J36J1j16P9j2n4J19n7r2J45m2p8R0n2
$$ -98 37 81 -97 1 54 -73 44 50 -76 39 37 -88 48 59 -57 22 10 -44 75 18 -74 71 29 -49 41 -11
5848a1j0J10q4m3R3p7j2J17p7lPq7P4J04q6k4jn3P7L8n1K5k6n3O2j1K7J8p7K4
$$ -11 -21 89 5 -38 55 -22 -34 83 6 3 10 -77 -3 101 15 -9 -10 -63 14 52 1 26 0 -53 9 -2 25 43 -34 -10
5878a0M1r1N7P8j00N2lj45J25Q2j43J05K3j92J16O8j20J36%k22J43Q0j53J21K8
$$ -10 31 -60 -3 75 -25 27 24 -121 4 86 -57 48 71 -121 -5 63 -57 79 79 -143 0 80 -73 48 76
5903G6j55J09Rj34J40L8j06N1k1q2Q9K4k4P2r2p1L7M6P8pj21QK0l8J34j2j00O7
$$ 76 -79 30 39 -95 45 83 -23 28 7 -75 14 38 14 86 -6 -77 -40 6 84 77 -44 -36 -16 -54 80 68 -32 35
5931C5p7n4J67Rj28J02m6j00J39l4m3J35r5j07Q9j6K4R8j03k7M3r4Q6J09j06J1
$$ 35 -42 -96 71 80 -48 54 8 -92 47 13 -30 105 10 -97 -8 -24 0 98 -5 -32 11 -83 3 112 6 17
5957A7j8j09J44N4j46J01j1j14J12Mj01J70m4j42J34l2r8J43nq4P8r2n5J63jo9
$$ 17 -1 -110 34 88 -58 43 32 -82 30 34 -67 103 59 -83 51 19 -79 64 59 -25 53 -39 -94 69 68 -1
5983aK3n9qQ2j4K0Jj00L7K6j5R2p7p1J13n4o0J38o9n2J44j50m4K06r6q5J70j06
$$ -1 22 -37 -45 37 23 43 44 -56 -19 7 -8 84 7 -64 49 -5 -65 73 4 -48 96 -54 -98 108 12 -73 97 -9
6011iq1J69p1m4J45j33p3J41m4JN3q3J6M6n5M1K5o0L3k2j7J03q5m8J32q9m4J41
$$ -9 -90 79 8 -36 109 -24 -97 44 0 1 54 -29 -13 33 -22 19 44 -16 17 -5 -22 81 -4 -52 80 -9 -53 88
6039H8j26NJ41j57pJ62j31j5J18j32K3J40j54MJ36j25qR0q5L1N6q3K7K4n2M4j
$$ 88 -38 -33 108 -49 -56 106 -25 -40 78 -54 -31 109 -45 -41 95 -30 -38 52 -33 -2 54 -29 -2 22 -30 14 13
6066A3j9M9r1LJ07n4j4P9j32L0J24j36M0J10j79mJ64j29M2O6j43O5Q3j22L7O4
$$ 13 -6 43 -48 -45 62 8 -6 73 -59 -29 95 -41 -1 109 -70 -74 90 -39 3 69 -74 -9 74 -48 -11 53
6092E3o1K9J2r3P7J3m1O9o0o1O7l5O5Q1j67k8J10o1O4O9j67K6R9j20O5J24j96
$$ 53 -8 21 33 -60 17 30 -11 58 -2 -63 4 -31 34 115 -52 -80 30 -31 33 102 -65 -39 60 -60 5 129 -67
6119f7M7R2j27O3N2j44Q4R2j28JJ4pR1k3o7Nl2M2R2n5ol0j08J53P9j46L3J7j00
$$ -67 -20 72 -55 8 60 -84 0 92 -36 -35 -21 -28 63 40 -27 -22 -54 -12 80 25 19 -11 -119 34 113 -33 0 17 -83
6148h3J54L6j97J07M5j49J46J5j90J34N3j11J16l5j73J48Q9r1L1p9m7J26L7o0
$$ -83 71 107 -90 17 62 -87 59 74 -116 18 71 -40 76 41 -132 16 105 14 45 -34 -81 45 82 22
6172B2j0o4K3N8K3jn9q8J09N3p6M7q6m9J90k5j47J01m6m1J68m7j41J03k9oJ47
$$ 22 12 -52 -29 29 52 51 -8 -96 13 66 -10 37 -49 -98 92 67 -80 21 -25 -66 102 55 -86 17 -12 -18 129
6199A29j09j28Q7RO8L3j45pQ1j8O8j6j42Q3M0m2R3o3j39J23N1n3O7j00r7K03J2
$$ 129 20 -108 -21 -12 56 89 -56 -63 18 0 68 52 -90 -7 33 -9 84 21 -118 5 56 3 70 -30 -127 76 88
6226H8j10M0m5m0J56k5r7N1m7j5J32l4q6j0J5P3K0n7n1k4Q3Q1j00l0L7o2M9J33
$$ 88 -22 18 -27 -67 89 64 -33 18 -29 -44 88 54 -32 -42 -27 46 66 9 -42 -66 17 98 -2 -32 5 -57 -8 125
6254A25j44n5J03p7N5J35k13l3J88q7OQ4j72K8J58r5k7R0j35J4J35l8n2K1q2P5
$$ 125 -19 -74 29 -48 7 142 -71 -104 84 -3 3 87 -85 -57 101 6 -21 69 -66 -52 83 45 -7 14 -68 7
6280GQ3p6l9qK2N2Kl9jl4L7L9l4J6j3q5J08L0j05K2K6m5Q8rj09P7J6o3P7j6p3
$$ 7 90 14 -25 -33 -11 41 43 4 3 -31 6 45 11 27 14 -71 37 67 -38 -16 10 -35 53 44 -65 12 28 -35 42 26 -47
6311d7N2Kk2O8m5o7Q4k9MN0q8J6P3q0J6P5q2J5N4p9L1P1j04PR3q7LP1q7K7M9p4
$$ -47 5 7 -15 53 8 -59 25 -4 0 50 -38 -22 51 -29 -13 62 -20 -5 49 -30 1 72 -32 -25 68 -19 -16 55 -32 -5 44 -30
6343c0L5L7n4j7N3j0nj0j4K2J8Ll2k9N6j2l3O5l0r4R1K4m7Q6r2r5J75Jj03P0m0
$$ -30 5 42 -12 -29 24 14 9 -1 -15 7 25 28 -4 -33 23 11 -22 43 13 -81 10 34 -13 73 -19 -114 61 62 -41 29 -11
6374a1p4J59pj22P3l5o9J43L3j40K9Oj6J22k7j23J9N4J1K5l8n8K5L5M5k3n2k3
$$ -11 -85 74 67 -55 18 -17 -86 57 90 -50 -21 -15 -31 91 64 -59 -40 14 25 50 12 -46 -21 14 59 36 -16 -39
6402c9K5M8M6p4q5P0M1K8jj00l4J14Pj9kq7J0J10pl7l3p8N9J44m7j00k4OJ08O0
$$ -39 -14 34 80 6 -79 -9 32 60 59 -41 -75 39 46 27 25 -62 -52 58 51 14 -19 -97 -38 106 59 -41 -65 -59 49 109
6432A09j12n3K1j1J20L1j37m1K1M5J29l9j69J4R6K9M8r8j13P7R7j1J1j01o5J16
$$ 109 -3 -56 -35 -46 74 105 -32 -73 -52 -7 122 83 -86 -72 24 53 101 3 -110 -33 64 53 64 -37 -102 14
6458A4P5k5m2j02nJ34N7p7q9k6R5Q5j4p4o5J1J04K9n7n1n7L3J67l8j36l%O8J36
$$ 14 89 64 22 -80 -85 49 106 29 -60 -86 9 94 80 6 -59 -48 56 85 28 -23 -80 -47 120 82 -54 -57 -57 11 147
6487A47j21j62J11K9L3P8j46j17J42N4J2K5j62n6J56O4l1m2j08M5J21Ro6m2m6
$$ 147 26 -136 -25 4 37 115 -31 -148 -6 48 60 85 -77 -133 23 87 56 14 -94 -49 72 81 15 -27 -73
6512g3Q0P7l4l4r1QJ36L0r7l1o0P3J56q4j10K8l0O8J31j30r0P3l7P0R7j61o2J13
$$ -73 7 84 50 16 -75 -67 69 99 2 -29 -89 -16 140 56 -54 -26 -56 12 143 13 -77 -4 -41 29 126 -35 -97 16
6540A6OM8j1j54L5J09Nk3k7q7P8P3m2K0q2n8J29L6l9j0j20L7J45l2n7no0N1J13
$$ 16 22 70 59 -95 -60 49 54 31 4 -83 -5 68 26 46 -36 -94 35 71 32 22 -98 -61 84 52 -5 -10 -70 -19 94
6569I4q4j0J2q9P4R2r3j5K1l7R6Kj24N1K6l2Q8n8o6R3m0j7R8p8o3J01n7J0Q0j31
$$ 94 10 0 12 -77 -3 89 -4 -19 2 -35 61 63 -61 -10 16 -16 72 14 -52 41 1 -16 82 4 -59 42 -15 -5 75 -56
6599e6LJ17q2J3N8j20N2Q6j04K6O6j25O7K7n6N4j2p7R2Oo3L7j8j3N7n0j0P2p8
$$ -56 -53 64 -18 -5 53 -67 -15 71 -33 -7 59 -66 1 28 -28 26 14 -63 29 35 -28 9 -9 -22 35 -15 -25 47 -31
6628c1jP3m7L6J2j23O6P7r2N3J7j22J01L6r1R9m2j16J24K8o9P1q0m9J51l2p2P2
$$ -31 -32 41 -6 30 42 -81 -15 62 -30 23 40 -82 19 55 -36 63 21 -95 29 57 -12 59 -21 -70 81 49 -23 49
6656D9r2j8J51p1m0O8j12K2J43q8m0L7o2P7O2j37QO6n1Q1j8j08N9J8k4R3n4j21
$$ 49 -43 -61 90 19 -21 47 -65 -43 100 12 -28 9 -53 24 86 -51 -43 23 -28 53 35 -73 -14 4 -20 73 19 -102
6684a02Q5K7K8M0j35k5J03RK9k5j29N8R1m4M4m5j54J33J01p0M1j00r5K03N9j33
$$ -102 -17 10 38 78 -57 -82 21 30 59 34 -95 -37 54 10 54 9 -145 -12 89 19 60 -40 -135 68 127 -6
6710fLm7k6J87k9j08L3q4L0J81p1j29L9m2Q8J30j60r5Q9KO7M1j49k9P3K8N4l1
$$ -6 -3 -50 -76 111 82 -26 7 -77 -47 134 63 -66 -27 -69 19 149 -11 -106 -17 -15 52 93 -56 -85 -12 16 70 39
6738C9j27L8N1M6L9j25p9J28L1K7l1j40L5J47l8J5m7j52J08J46o1j0r7r8K14J06
$$ 39 -88 -50 1 47 86 -39 -118 10 41 68 37 -103 -68 79 41 56 9 -143 -35 111 50 40 -57 -155 59 165
6764A65j50k8p3j9K22J9j82Pk1nJ95l3j64J9J0M6J13r2j30M7O5P9l0j28l1Q8O3
$$ 165 15 -13 -86 -105 117 136 -46 -39 -60 -65 130 97 -67 -48 -38 8 121 29 -101 -54 11 90 60 -68 -99 -11 52
6791E2N3j01j24N4Q0N1M6j46j02J19O1K9j3j73J9J58j0l5j0j09O2J43r2k8Mq4
$$ 52 105 4 -120 -66 14 65 111 -35 -137 -18 43 72 59 -114 -95 63 53 18 8 -101 -39 104 12 -16 -12 -96
6817i6J32J12j49n9j6K0J68L2k12k0N9K0J54n5j64J3L2M5J15q6j50N2N9M0L8j08
$$ -96 36 148 -1 -60 -76 -56 112 144 -68 -88 -29 -9 145 90 -74 -61 -29 16 131 45 -105 -53 6 46 84 -24
6843b4o4R4K6L3p4n6N3M8NJ5j02n4J22J7Rqj48J4J84m4n5J3j06P3J39j13l2O5
$$ -24 -88 6 32 65 -9 -65 -12 36 41 56 -46 -100 22 39 48 40 -108 -94 90 46 -9 4 -102 -29 110 -3 -35 30
6871C0r4N3J34j46l4Q1n6P6O1j75j1J17j7K9Kj32M1P8j1K4m4o7L8L6L4op4lN6
$$ 30 -64 -11 123 -23 -57 24 -32 44 105 -70 -81 36 19 48 50 -82 -41 37 26 50 6 -61 -23 13 47 41 -33 -36 20
6900B0lQj0n9O0M0j06O4J3p0P1J1q5O9Kp7J02k8r9R7Jl6O8q2n4J35k3n5N2p0j
$$ 20 17 25 15 -44 16 56 -50 14 27 -43 28 39 -46 23 25 -52 50 22 -77 20 21 -15 53 -29 -83 52 29 -26 26 -44 -45
6931d5J03m9l1O3q9K2Q9o2j2L3o2O4O2j37J1P1l7M3j5q5M8O0k8Kk5m3O0J9J1k4
$$ -45 58 9 -22 41 -48 -26 63 1 -11 22 -40 24 86 -51 -40 31 -6 37 22 -63 -15 45 17 19 -6 -49 11 30 41 17
6961A7p4J4Q1j2J1m7p6J15O2j10J8k0m9J47kj29M2l6j2J69k8j86L9M5J6J41q5
$$ 17 -57 -43 38 26 37 -10 -86 29 91 -19 -1 -21 -70 77 75 -54 -12 -48 -60 109 81 -105 -66 -21 -5 136 51
6988E1k00J00P7j3Q9j08j26J22M7rL8j11m8J11N9m7n9n5O3J18l2q1n3J5J12L5
$$ 51 -149 -49 28 15 104 -4 -130 -8 39 30 68 -43 -91 20 79 32 -27 -82 -19 99 67 -14 -67 -52 60 95
7014I5q1m4o3M9J44nj20l2k7R9J28j16j05J6L9R3M1j63l2O0M1N7nj74KJ08N1L7
$$ 95 14 -30 -93 -44 100 95 -25 -57 -84 15 143 27 -78 -62 -23 70 111 -52 -84 -24 17 74 69 -105 -103 5 56 93
7042I3q4j65J00J44j2nj24q0J53Q2p1j3o7n2J66L7r5k9o2L3J45lj53%M2N3P0q0
$$ 93 9 -156 -56 88 76 71 -53 -133 20 102 31 18 -49 -101 65 102 7 -22 -84 -51 94 91 -62 -62 -20 33 103 23
7070B3j11L4P5N1nj02n1N3Q8N1r9r3J6P9R0rj52l6J12K7J2mj44J1J32Lpk4j49
$$ 23 -88 -54 21 72 67 -35 -86 -33 55 106 7 -86 -70 9 99 90 -62 -98 14 41 53 49 -95 -84 48 51 44 20 -129
7099a29O7J68n2o6mp6R4J22j02q6L5j3O3O8q9n5K1K9N6J4r9k0N2M1L1o8o4M0M7
$$ -129 -62 106 54 -12 -16 -92 2 124 22 -64 -29 -42 21 89 0 -55 -34 -5 51 65 -34 -54 -2 39 70 2 -62 -22 25
7128B5J5ko4j0O4%jkq5J1R9Nm2k8l8M4P7l3l8l5J9L7K6l0j4l4J8N6%m7j4l1M0
$$ 25 40 38 -26 -36 28 28 27 25 -60 -49 50 55 13 -15 -53 -9 68 35 -3 -38 -19 18 44 14 0 -34 -16 40 40 -7 -21 -52 -12
7161a2Q3p0m2N3l5RR2r7rN3m6RR1r9j9Q4o0PN0o1j9R4m6m3N6rl5N8k8m0N2j3k6
$$ -12 71 1 -41 12 -23 -14 78 -19 -28 25 -21 -12 79 -20 -39 45 -15 -8 42 -19 -38 56 10 -33 23 14 -21 37 9 -31 21 8 -18
7194a8K6J9k4l9M3Rl0J8Kj7L6Lo2M3L9q4L7L8o6K3L5q3N6L9q0L0L4n3L0J9n6L5
$$ -18 8 27 3 -36 7 16 -14 4 6 -11 25 28 -34 9 48 -36 1 39 -27 -4 31 -52 4 43 -37 -7 27 -26 4 23 -33 2
7226BJ5o2M6L1m4RLj7M6k7k6M0k7j7O4m1OJ2o9M5O2n2j9M0l3K4M4o7j1M4m3K3
$$ 2 17 -45 1 32 -12 -3 0 -17 29 2 -24 16 -11 -28 36 -5 1 13 -56 -11 51 -1 -20 20 -13 11 55 -12 -23 21 -22 1
7258AK7l6OqJ5J4j2j7Rk2N8j0o3N0L4q1M8K8p2L1L8q4O7K2j25O5O9q3K9K5j05
$$ 1 28 -8 -2 -10 5 19 7 -10 -1 -23 35 25 -38 12 46 -35 13 41 -31 0 38 -46 21 43 -82 -17 52 -31 -2 23 -82
7289h2R4M8r8M0J9q2O7L6o8PJ0k7M4L7m9k9RM4J4k5qj7j0O9jn4J9k7l1J20j8q8
$$ -82 12 60 -38 2 21 -61 6 42 -26 -19 -9 -36 8 45 -4 -33 -24 20 34 9 1 -16 -26 43 42 -12 7 -20 -51 69 51 -37
7321c7K4Rj7R4o6o5Q0j1k4N6m8k9N1Jj2L6p8lP1k1J2k1p4P1O3o5J5k3o6Q6N0o9
$$ -37 -13 -4 -21 73 7 -58 22 11 -13 43 -5 -34 17 18 6 42 -36 -39 32 11 23 2 -72 -1 62 -3 12 -11 -77 9 59 -10
7353a0K4k3o1J02L6q4mmRO6nr1J3L1M1Ln0k7pL6P3l0q6J3QM3J03r4j27J01J9j1
$$ -10 14 -9 -70 32 68 -16 -20 -24 -15 51 46 -45 -32 -1 40 43 -7 -34 -41 -5 68 38 -48 -35 -27 16 119 25 -102 -1 18 7
7385GQ1j03p0J14lm0P3q5m5J12j0n3K3n2J3J30o3q3%J6N5O6q2m8RJ8O9mn5l4k3
$$ 7 88 -15 -85 29 26 -14 59 -26 -71 41 31 -22 1 -51 -38 92 29 -54 -54 -38 17 83 1 -47 -38 -20 49 45 -10 -44 -67
7416f7O5R3o0j03M3J9K3N7j11k0Q7j1J0Qp7kQ8qjl3q0N7Q4qj6p0l9J05M2o1mm1
$$ -67 -2 91 31 -72 -29 -10 13 70 -41 -61 26 15 25 33 -44 -46 42 34 33 0 -80 -23 61 53 37 -33 -72 33 75 14 10 -31
7448c1k8J27j4p0J6k8OQ8l9r0M6pM3L2r3k6O6J5J9qo9j2N4K8K5n5n8N5K2K1J1
$$ -31 -59 68 54 -16 0 -28 -22 66 27 -63 -17 -24 19 51 -42 -68 -2 13 32 24 -45 -57 -3 25 50 -5 -63 -8 14 35 46
7479D6j10kJ06k4pK1j05M7J06p0l0M9p2K1J12q5m7M4m0M5O2p8m9N7K9Nj6m1J5
$$ 46 -64 -66 40 16 9 30 -75 -28 78 8 -22 27 -45 -24 88 3 -44 0 -40 5 67 -11 -60 -3 26 31 15 -26 -11
7508a1J5J9Ol7k3K9RL2jq1J2N9k6J3k5m7N9N3p4J8mk9O6Oq2K8lj7Q3j4p0RMK3
$$ -11 4 23 29 -8 -31 -2 7 39 38 -43 -31 28 2 15 -10 -57 2 55 -19 -1 -5 -34 32 38 -44 -16 -19 -36 47 33 -37 -28 -24 -1
7542aO8p0m0N0j4K2L9p2j2N7m6K7L9p1ON9k6j2Qm5M2M9m4l6J1K7J9mk5k1pL9J9
$$ -1 67 -3 -43 7 -7 15 54 -18 -30 27 -19 8 47 -24 -18 41 15 3 11 -34 8 57 13 -23 -12 15 34 30 5 -16 -23 16 35
7575C5k9Kl6j1P9qp4M1%j5N8k5q6Q2K3o2M7j4o8O6L1m5L0k5p6R8M0o3lj7mN6J1
$$ 35 6 8 -28 -39 40 32 -42 -1 -1 -16 42 17 -69 13 36 -26 21 7 -61 5 36 -9 21 -4 -80 18 58 -5 -8 -25 -29 27 38
7608C8m0k0K2nK0j8oKKJ8Jl2lJ3L3K8o8l4M1J8K8rn1kK1QK1Qo2JM3rK6j8o8N8
$$ 38 -2 -22 0 -5 15 -3 -9 -7 -5 13 14 -18 -21 -8 25 53 -15 -49 -8 10 38 29 -22 -24 -3 5 26 34 -28 -27 16 7 33 15 -53 5
7644EK6k8Klk1M2Mn1L3qm5P6Op1L3Kk7O7k1q1M3N1m4K4ml5J8L7k9oL5l3pM1j1
$$ 5 31 3 5 2 -19 23 27 -24 9 1 -44 32 38 -33 0 2 -25 42 21 -60 -17 34 -10 14 10 -25 -7 30 1 -5 30 -3 -10 31 20
7679B0l5LJ6KK0ql5K5L2l6qL0l3kM0l0mK7m6rQ6m3m0M2k1kN3n6j3N2m7LM6k4l2
$$ 20 -15 -12 4 6 26 18 -17 8 40 4 -4 26 -7 -9 31 1 -3 24 -22 -31 55 12 -28 14 -7 -9 44 -12 -25 27 -20 -17 29 5 -27
7714b7M5l9J8K8l7mL8j5k3K3onJ5k6J7J9k7J5PqJ2lj9JK1kl0J6J0oKJ7j5pJ1k6
$$ -27 18 -21 -3 25 -12 -16 22 7 -16 7 1 -4 11 -15 2 21 -6 9 16 8 20 17 -2 -1 20 18 -12 4 14 8 10 27 12 5 16 -10
7750a0J4L8n2j6N4j6k9L0k4j9O4l4l8P3k7m7Q3l7m5M8j8k4Q8l4p3O0j2j3M8k7
$$ -10 4 42 -10 -26 28 12 -17 13 -11 -30 34 0 -38 35 8 -39 44 7 -38 10 -8 -32 56 22 -51 9 -3 -16 32 5
7780Em5O2j8k4M1k3l0M1%Nrj6rL8k%k9qM1qj8K5k3lK7j6JJ3m3K0N7n6lK1l8N2
$$ 5 -40 22 4 -20 21 -2 -32 9 9 14 5 -11 -20 18 16 16 -13 -21 20 12 -6 19 -4 -7 20 4 5 18 -25 -5 52 -4 -7 14 -24 28
7816B8J7r2K3N0m7M4mn7M1Jl4O8j5r3P4K1m5N5m3o7J03ln9N1k7l3Q3k1l5L9m4
$$ 28 45 -47 -24 26 -21 23 19 -38 3 4 -30 38 23 -70 4 25 -20 35 -8 -75 28 25 -34 17 -10 -43 40 19 -16 23 -21
7847b1%M8j2l5Rj3L5J6k3k2J3JK3km6M7lk6M1k4l0M0j8QM0o8j4P8m2JJ5p3M8N3
$$ -21 -21 27 15 -20 -11 -24 11 27 4 -18 -5 -4 19 17 -29 18 15 -11 30 6 -24 16 -2 6 46 -22 -36 42 0 1 16 -57 -9 44
7881D4o8J9K0o2M1N4n6J0Qo1P3J9q3J9K1m0P5j8o4N6Ll5N2k0n2O7l5J1M9p0JM2
$$ 44 -24 -5 15 -47 -6 48 -8 2 10 -51 22 41 -42 -23 -2 -42 33 15 -49 7 10 -25 27 7 -45 22 -13 -2 47 -23 -22 20
7913B0j8QLm1L0L3m6K6Jk5L8km3L7nn1P8j8m5L1k7j0P9n1m8O5k2mM7n3lM5n3K6
$$ 20 2 10 13 -28 2 35 -11 15 16 -9 29 27 -16 21 16 -35 43 25 -20 11 -16 -26 53 2 -46 19 -3 -7 40 -13 -16 29 -24 2
7947BM9o9QL5l5K9mp5N9N1p4K6ol5N7Nm9L7j7k7O0j0k2K6m0J7N2m8k3M3j7J8J4
$$ 2 51 -18 -10 25 -10 19 15 -60 -1 50 -24 2 -4 -39 18 23 -26 11 -6 -33 27 17 -5 21 -19 -2 50 2 -21 22 5 23 37
7980C7n5JM7l9M2on3L7jj5N1m0n2O0J4m1N2o2j0R0n1l3N3m7mN9n1JM2m5JN7n7
$$ 37 -18 -17 30 -9 33 27 -26 11 10 -5 46 6 -46 14 28 -13 39 -23 -33 57 6 -27 26 -21 -25 34 -17 -16 26 -19 -18 39 -18
8013a8kL2m3N1ko7L7K4l6L9j1l6L6rj4N6l1l5L8j3ML2n1pO9l7lJ9l1J7L8o9L1
$$ -18 -20 12 -31 20 18 -49 -12 12 -24 15 4 -32 4 -5 -19 37 6 -29 9 -4 0 32 -19 -26 43 6 3 22 -9 8 46 -23 8
8046HJ9m3K5Mj5K1l0j3M9jl2J0oj9M7l4j6M0j4j8L8l1mK5k3RL8o3mL6j3MJ2l1
$$ 8 27 -16 9 13 -2 19 -11 -24 25 24 -8 2 -4 -23 24 -10 -26 14 0 -18 20 -11 -15 10 -13 -4 34 -29 -33 3 -10 -6 6 -25
8080b5K0K2m6L7Rl0J6Mk6M8k8l4N5j1l2K5j1NK9m2JM1k2j3L9l5QJ2k5J6J7k6l
$$ -25 -5 17 -29 8 17 -13 3 7 -19 29 1 -33 22 11 -21 4 -7 -2 27 -15 -14 27 5 -8 31 -4 4 16 -9 7 24 -2 -5
8113eJ9rPjk7J4K3j3nj0LK8l9J1J3lj6J9j0%J4m8K3K9k7KK4l1J5J8k3J7Pl6J3
$$ -5 14 5 12 11 -16 -2 21 8 3 -7 -4 24 -15 -4 9 6 -10 9 -1 -1 13 -35 -12 17 -10 -8 16 -15 0 18 -5 12 19 -17 -4
8148dK3k9J4Kk4K6pk4M2nk3J9j6%L0k5nJ5Lk4J8mkJ4j5%K5j4j7JJ0Jk1RJ7o%m
$$ -4 19 -10 4 6 -18 8 1 -23 19 14 -9 10 -6 -6 24 -1 -6 9 12 -12 6 2 0 14 -1 -1 24 10 -7 -6 4 5 -16 -7 10 4 4 0
8186@nRll3J7
$$ 0 -5 4 1 -32 -15
8191a5
$$ Imaginary data points
##PAGE= N=2
##DATA TABLE= (X++(I..I)), XYDATA
0@%%%%%%%%%Qj6J6j6J7k5L2m0M8n6O5p3Q8j04J21j38J55j79K08k33K61k98L37
$$ 0 0 0 0 0 0 0 0 0 0 8 -8 8 -8 9 -16 16 -24 24 -32 33 -40 48 -56 65 -73 82 -97 111 -122 139 -159 178
32A78l77M23m72N24n84O49p20P98q86R83j088J203j330J475j638J821k030K270
$$ 178 -199 224 -248 276 -308 341 -379 419 -467 516 -572 631 -699 776 -862 959 -1071 1199
50A199k551K883l280L773m401N225o369Q071j0899J6709m6396P0252J9168j16004
$$ 1199 -1352 1531 -1749 2024 -2377 2848 -3521 4550 -6349 10360 -36036 34216 53384 -62620
64f2620J07248k6512r6998J02145K5339q8964N7409m266n3954N6268O318m1517
$$ -62620 44628 18116 -78882 23263 48602 -40362 17047 12781 -41173 15095 21413 -20104
76b0104L0834j4655q468L5262k7788j4623L4722j9175K44K5551l0177j4815K9703
$$ -20104 10730 -3925 -12393 22869 -4919 -19542 15180 -3995 -3751 21800 -8377 -23192 6511
89F511N549r483l833L310j1292q565L9830p73n2833L4323J8869n5279M4950K5853
$$ 6511 12060 2577 -1256 2054 -9238 -17803 22027 21254 -31579 2744 21613 -33666 11284 37137
103C7137q1450L9059M9664p4356K4083L8536o9854L3302M6283o2732J4731J7777
$$ 37137 -44313 -5254 44410 -29946 -5863 32673 -37181 -3879 42404 -20328 -5597 12180
115A2180m4767M7782J5076n4785L3408r456l9019P4417q898o5767N8007j1220
$$ 12180 -32587 15195 30271 -24514 8894 -562 -39581 34836 25938 -39829 18178 6958
127F958n2719P8645l623p2315N4414O838n2944M9167R758n0915K6830J6222k7063
$$ 6958 -45761 32884 29261 -43054 11360 18198 -34746 14421 24179 -26736 94 16316 -10747
140a0747R279O337q771M027K772K577j0322o689K0578m142j1110J5446j4704p793
$$ -10747 -1468 4869 -3902 125 2897 5474 -4848 -11537 9041 4899 -6211 9235 -5469 -13262
154a3262K6636j2041o133J5490k5094R193K7360l5105Q224K4625m3863K1963L6116
$$ -13262 13374 1333 -4800 10690 -14404 -5211 22149 -12956 -4732 19893 -23970 -2007 34109
167C4109n8911J3020M2783n4766J6399M5996o1876L942M9832m4291M241L8443
$$ 34109 -24802 -11782 31001 -23765 -7366 38630 -23246 -19304 30528 -13763 -9522 28921
179B8921m4685m04L6209k5816K133J6848k4804Q390J2389j6590J2125J11j6666
$$ 28921 -15764 -16168 20041 -5775 -3642 13206 -11598 -3208 9181 -7409 4716 4827 -11839
192a1839J7892j418j5078J7119l700j1713J5358m802r247J0110j808N09J294r089
$$ -11839 6053 4635 -10443 6676 2976 -8737 6621 1819 -7428 2682 874 1383 2677 -6412
206f412P681O81p297J5328q731j6591K3299k937j5679K2856j0356k0147K7483
$$ -6412 1269 1950 -5347 9981 1250 -15341 7958 5021 -10658 12198 1842 -18305 9178
219I178k637j5854J9411j2116j1719K4911r351q130J6608j8333K8K3424k1100
$$ 9178 6541 -9313 10098 -2018 -13737 11174 1823 -6307 10301 -8032 -8004 15420 -5680
232e680o07K0387k4937L920K5415k6681j080K4002k1805N09K1574k1529l133K0417
$$ -5680 -6287 14100 -10837 -6917 18498 -8183 -9263 14739 -7066 -6557 15017 -6512 -9645 10772
246A0772j1487l259R628r857L05Q794l458j068k400j674O308j204n28J563q606
$$ 10772 -715 -3974 5654 -4203 -3898 4896 1438 370 -2030 -3704 2604 1400 872 2435 -6171
261f171L542R120o432L51M4q397J0204N040j0813N379k681r052J7289R3j5711
$$ -6171 -2629 6491 59 410 454 -7943 2261 7301 -3512 1867 -814 -9866 7423 7516 -8195
276h195J1523l196j1556K1326j399k0090J3550N73j1657J7664j812j7792J1946
$$ -8195 3328 132 -11424 9902 8503 -11587 1963 2536 -9121 8543 6731 -11061 885
289H85K530q419J0798l176j0238R122J94l256O201o613l180Q876k895j549L560
$$ 885 3415 -5004 5794 2618 -7620 1502 1696 -1560 4641 -1972 -5152 3724 829 -720 2840
304B840o859J294P927m463k439J852k869K742L716k835k281j761J934M828j978
$$ 2840 -4019 -2725 5202 739 -1700 152 -2717 25 3741 906 -1375 -3136 -1202 3626 1648
319A648j697q02m370N700O291p382j565J952m465O616N175r524l12K781l968P400
$$ 1648 -49 -851 -5221 479 6770 -612 -2177 -225 -4690 1926 7101 -2423 -2735 46 -3922 3478
335C478K790j0470J572L013l137P651l87j0902M573L961l934N996j539r418N807
$$ 3478 6268 -4202 -2630 383 -2754 4897 4510 -6392 -1819 2142 -1792 4204 2665 -6753 -946
350i46M291m177L593j761o933N576M334l473J61j975k490N074K276l231j531r17
$$ -946 3345 -832 2761 1000 -5933 -357 3977 504 665 -1310 -3800 1274 3550 319 -1212 -2129
366b129J043L319jk564j918L43L023J446j449k452k074K890M232j969k759j007
$$ -2129 -1086 2233 2232 -332 -2250 -1907 1116 2562 1113 -1339 -3413 -523 3709 1740 -1019 -2026
382b026j062M599L453n267k426J349o85M642K577p145j918L254K27L956N34q031
$$ -2026 -3088 1511 4964 -303 -2729 -1380 -2065 2577 5154 -1991 -3909 -655 -428 3528 4062 -3969
398c969k78N402L36J514j327o543J923N755o84n66j749m327K921N409j330k811
$$ -3969 -4247 1155 1491 3005 1678 -4865 -2942 2813 2129 1563 -186 -4513 -1592 3817 2487 -324
414c24j816j005L671L628k534m162l50K591K460M51k418l481R17M383O91k016
$$ -324 -2140 -3145 526 4154 1620 -2542 -2892 -301 2159 2610 192 -3289 -2372 2011 2702 686
430F86j693k314K034N239j454m269m11J55K876L690l925m312J982J759J969J461
$$ 686 -1007 -3321 -1287 3952 2498 -1771 -2182 -2027 849 4539 614 -3698 -1716 43 2012 3473
446C473m692k857L385K242J115q08m824o07M450J952n14k964l299K574L902j61
$$ 3473 -1219 -4076 -691 1551 2666 1858 -2966 -3573 877 2829 2315 -649 -3948 -1374 2528 2367
462B367j530k916j171L992K165j715j515k319N24M511L58k982j446p10K502L191
$$ 2367 837 -2079 -3250 742 2907 1192 -323 -2642 -2118 2393 2751 -231 -1677 -2387 115 3306
478C306k272k728l4O85K895P21l597p92R76O35K778j002m098R83J787N96J763
$$ 3306 1034 -1694 -1728 -1043 1852 2573 -1024 -1816 -840 -205 2573 1571 -2527 -1544 243 839 2602
495B602k878l241L425J722p62M95l151j001M498k8j699N82k730M18M465j396k111
$$ 2602 -276 -3517 -92 1630 868 1363 -1788 -2789 1709 1681 -18 564 -2166 -1748 2717 1321 -790
512g90M65j703J944L276l024j911J009m8K378L96l474K83R60J7K472j565l070
$$ -790 -325 -2028 -84 3192 168 -1743 -734 -782 1596 1992 -1482 -1199 -239 -222 2250 685 -2385
529b385K278K22k64K677l076k368M078l46j156J814l142n8M425k421j463J867
$$ -2385 -107 115 -149 2528 -548 -2916 1162 816 -340 1474 -1668 -1726 2699 278 -1185 682
545F82k525J825L332m325m95K035k551L264K478n864R1K698j784L132O29n719
$$ 682 -1843 -18 3314 -1011 -1506 529 -2022 1242 3720 -2144 -2053 645 -1139 1993 2622 -3097
561c097J576K885j547J619j019l037L019Q71j412J176k614n20M577j137j828N76
$$ -3097 -1521 1364 -183 1436 417 -2620 399 1270 -142 1034 -1580 -2100 2477 1340 -488 88
577H8l141K107N204l129k492K55j755L813K954m097n97m97j365N208j8m633K676
$$ 88 -3053 -946 4258 1129 -1363 -1108 -2863 950 3904 -193 -790 -1287 -2652 2556 2538 -2095 581
594E81j166j896O234k873n450O331Ll437M483l974l995P990L52l820J880m253
$$ 581 -585 -2481 3753 880 -4570 1761 1764 -1673 2810 -1164 -5159 2831 3183 -637 1243 -3010
610c010q81P282p66j929j18n561K929O667l792n54M41n528M655N011o376L82K618
$$ -3010 -3891 3391 2625 696 578 -4983 -2054 4613 821 267 708 -4820 -165 4846 -1530 -1148 1470
627A470l809L341J972n694J018K572k40K360l097l963L124J181K279K145p592
$$ 1470 -2339 1002 2974 -2720 -1702 870 630 2990 -107 -4070 -946 235 2514 4659 -2933
642b933k218O169n63J581K294p643r70N824j158J275O35n363J958K474k170K692
$$ -2933 -5151 1018 455 2036 4330 -3313 -4283 1541 383 1658 2293 -3070 -1112 1362 -808 1884
658A884k365l007P312j953n936N686k589k938J0561l753r348P016o92l359R887
$$ 1884 -481 -3488 3824 1871 -4065 1621 -968 -3906 6655 2902 -6446 570 -122 -3481 6406
673F406k940r497M896J135r55N759l654m916L266l64J717K384n373Q92L294l909
$$ 6406 3466 -6031 -1135 0 -955 4804 1150 -3766 -500 -864 853 3237 -2136 -1244 2050 -1859
689a859K467J668n943L356M015m467N51r5k923M473J765k497l75l727J619O022
$$ -1859 608 2276 -3667 -311 3704 -763 -212 -307 -3230 1243 3008 511 136 -3591 -1972 4050
705D050l855l37K823p603K478Q545p295p92O061p702R63Q275o921j621N978m041
$$ 4050 195 -142 2681 -4922 -2444 6101 -1194 -1986 4075 -3627 -2664 5611 -1310 -2931 3047 -994
721i94L06K954m528J623K084k288L353k617m266O643j269l526P133m741o206R436
$$ -994 -688 2266 -2262 -639 1445 -843 2510 -107 -4373 2270 1001 -2525 4608 -133 -6339 3097
737C097q65n478O670l084n315P329n35l841L656k153j061L262k514J100J275m543
$$ 3097 2232 -3246 3424 340 -4975 2354 1819 -2022 1634 -519 -1580 1682 -832 268 1543 -3000
753c000L800K066o090L743J767n925M949J818o640L590J860m064L294k69k571
$$ -3000 800 2866 -3224 519 2286 -3639 1310 3128 -3512 78 1938 -2126 1168 899 -1672
768a672K983k377K31M074n560J060N316p493K208O896r646J475Q758r463K16Q768
$$ -1672 1311 -1066 -835 3239 -2321 -1261 4055 -3438 -1230 5666 -3980 -2505 6253 -3210 -2994 5774
784E774q313m28P811o570o57N834m701l1L121k934J584j2k380L880j940k567N430
$$ 5774 -2539 -2967 4844 -1726 -2383 3451 -1250 -1281 1840 -1094 490 478 -1902 1978 38 -2529 2901
801B901l054k869O175l371k692O217l496k630N206k693q42L165l597J334K102
$$ 2901 -153 -3022 3153 -218 -2910 3307 -189 -2819 2387 -306 -1148 2017 -1580 -246 1856
816A856m295L573R55n931N384R81o881O433Q00q097O791K053p827N189J403o149
$$ 1856 -2439 1134 2089 -3842 1542 2523 -4358 2075 2875 -5222 1569 3622 -4205 984 2387 -3762
832c762N110R99m827L334p38j869L837k455l83L066n114J747N134o398J298M850
$$ -3762 1348 2347 -2480 854 116 -1753 2084 -371 -754 2312 -2802 -1055 4079 -2319 -1021 3829
848C829p130J983N601o947J443N135o137R20L726m370J888K122l396K028o22k591
$$ 3829 -3301 -1318 4283 -2664 -1221 3914 -2223 -1303 2423 -1947 -59 2063 -1333 695 73 -2518
864b518M249r21j992L635l813j800N979k573j617M261m161j263M503k689O15K712
$$ -2518 1731 810 -1182 2453 -1360 -3160 2819 246 -1371 2890 -1271 -2534 1969 -720 -105 2607
880B607m402J119J913l687L670J083n026M331k10o054O157J410n956N223l46o792
$$ 2607 -1795 -676 1237 -2450 1220 2303 -2723 1608 1398 -4656 1501 2911 -3045 2178 1832 -4960
896d960N787J658m914M610l43n496L604Q33j760L321j821k332K320j736O07L085
$$ -4960 827 2485 -2429 2181 1838 -3658 -54 779 -981 2340 519 -1813 507 -1229 -622 2463
912B463k867K82J405m012J974L103l187J592Q81m184K006J383k078L246n08l714
$$ 2463 -404 -122 1283 -2729 -755 2348 -839 753 1634 -2550 -544 839 -1239 2007 1499 -2215
928b215K422p50j191M480j874k536L317k924j520N285j649j633K959l608j297
$$ -2215 207 -543 -1734 2746 872 -1664 1653 -1271 -2791 2494 845 -788 2171 -1437 -2734
943b734M276j354j4K173l499o63J899j038K441Q36l807J015K35j896L813K89l314
$$ -2734 1542 188 174 2347 -1152 -1815 84 -954 1487 2323 -1484 -469 -234 -2130 1683 1972 -1342
960a342K288j109k879M280M34k660K504j474k703L235o9j081K718j856k360K008
$$ -1342 946 -163 -3042 1238 1672 -988 1516 42 -2661 574 505 -576 2142 286 -2074 -66
976f6m05M56K197k181j144J170j088J006J631j558n1m6j238J642M05j216J265
$$ -66 -471 -15 2182 1 -1143 27 -1061 -55 1576 18 -33 -79 -1317 325 730 -486 779
993G79o56j035J634j317n66K917j325j340J941k117n64L541j368j114J951k624
$$ 779 123 -912 722 -595 -1161 1756 431 -909 1032 -1085 -1649 1892 524 -590 1361 -1263
1009a263p83L655q10j102J319k073m28K549p52m34J038j385l87J016k77M37L01
$$ -1263 -2046 1609 799 -303 1016 -1057 -1485 1064 312 -122 916 -469 -856 160 -117 320 621
1026F21q64J94j77l82R58m4q4M31j490k19J731m02m0N56j869J81J822j020J98
$$ 621 -243 -49 -226 -608 350 306 222 653 -837 -1056 675 273 233 789 -1080 -899 923 -97 101
1045A01R16k059J14J915r35m1N78j619N58J624j143l32M96p46N86P11q32K5m5
$$ 101 1017 -1042 -928 987 52 11 589 -1030 -472 1152 9 -323 173 -573 13 724 -108 -83 -128
1064a28m25R06J48n90J56n77J05J295p67o54Q95o26j00J094q98l18J126q35l32
$$ -128 -553 353 501 -89 67 -510 -405 890 123 -531 364 -262 -362 732 -166 -484 642 -193 -525
1083e25J139o51m25R11m09l28N02l78l3O58k53n58k8M77L26l86p5k1n21P60N45
$$ -525 614 -37 -462 449 40 -288 214 -164 -197 461 208 -350 -378 99 425 39 -36 -57 -578 182 727
1104G27j029K94K26j264J208J170j839J12P79j390J239J273k326K34J385j646
$$ 727 -302 -8 218 -1046 162 1332 -507 -395 384 -1006 233 1506 -820 -586 799 -847
1120h47O57J638j948j76J328j242L61J448j547n06J360n04m16Q46l29n50N40Q4
$$ -847 -190 1448 -500 -676 652 -590 -229 1219 -328 -834 526 22 -394 452 123 -427 113 197
1138A97n56L62N80q31k47J020n57n34J196n25q03J261o32p25J765o95j393J587
$$ 197 -359 3 583 -248 -495 525 -32 -566 630 105 -698 563 -69 -794 971 276 -1117 470
1156D70l00q43J594q32j119J636n68o99J641r19r51J306n66m7J222j440l54J352
$$ 470 170 -673 921 89 -1030 606 38 -661 980 61 -890 416 -150 -197 1025 -415 -769 583
1174E83q01J54Q31j330K28Q33j037O86O54j410L11O43o82O46J00r81N22L11m55
$$ 583 -218 -64 767 -563 -335 498 -539 147 801 -609 -298 345 -337 309 409 -572 -50 261 -194
1193a94K87K0r4q3k57N36m1m42P21o45m95J576r65q61K161j272j321K614j287
$$ -194 93 113 19 -64 -321 215 174 -268 453 -192 -687 889 -76 -937 1224 -48 -1369 1245 -42
1212d2j226K995j908j722L658j626j889L575j760k037L648j521j831L505j759
$$ -42 -1268 1727 -181 -1903 1755 129 -1760 1815 55 -1982 1666 145 -1686 1819 60
1227F0k076L422r94j707K490j245j306K360p53j074J537o81q15J004N6k24m8j69
$$ 60 -2016 1406 412 -1295 1195 -50 -1356 1004 251 -823 714 33 -782 222 278 54 6 -163
1245a63J14k79O67K60j429Q98O80j946J425J057k604J517R18k935K364J089l632
$$ -163 -49 -328 339 599 -830 68 748 -1198 227 1284 -1320 197 1115 -1820 544 1633 -1999
1262a999K417J117l709K781R56l709L058M31l915L584N14l812L424j26l468L854
$$ -1999 418 1535 -2174 607 1563 -2146 912 1343 -2572 1012 1526 -2286 1138 1012 -2456 1398
1278A398l99l305L868q13l187L897o97k626L351j289k157L446j002j939K575j048
$$ 1398 999 -2306 1562 749 -2438 1459 762 -1864 1487 198 -1959 1487 485 -1454 1121 73
1294G3j258K045p36o07J075q72r5N91j13L41q97P3J231j562N14J577k645R84J996
$$ 73 -1185 860 124 -483 592 -280 -375 216 103 444 -453 -380 851 -711 -197 1380 -1265 -281 1715
1313A715l511J726K483m720J934L013n102K408K931n882K906L260o290L096L326
$$ 1715 -1796 -70 2413 -2307 -373 2640 -2462 -54 2877 -3005 -99 3161 -3129 -33 3293
1328C293o460L082L108o162L444K729o263L352K596n601L240K076m983K891J403
$$ 3293 -3167 -85 3023 -3139 305 3034 -3229 123 2719 -2882 358 2434 -2549 342 1745
1343A745m102L017J101l580K053N74k096J900L5j360J004m89r1O85n98P92o56
$$ 1745 -2357 660 1761 -1819 234 808 -1288 612 647 -713 291 -198 -289 396 -202 590 -66
1360f6j165K243p76j363K644j880j323L728k455j228M206l424j222M876l728p70
$$ -66 -1231 1012 236 -1127 1517 -363 -1686 2042 -413 -1641 2565 -859 -2081 2795 -933 -1703
1376a703M888m800l29N498n261r0N543n714K16N420n929Q18N432o286P04N170
$$ -1703 3185 -1615 -1944 3554 -1707 -1797 3746 -1968 -1752 3668 -2261 -1443 3989 -2297 -1593 3577
1392C577n873J094M705n573J117L795n148J589L511m430J142K291l464J526J643
$$ 3577 -2296 -1202 3503 -2070 -953 2842 -2306 -717 2794 -1636 -494 1797 -1667 -141 1502
1407A502k695J329Q17j865R24J65m27O59o96O01Mj552J819k04j647L108j469l107
$$ 1502 -1193 136 953 -912 12 177 -250 409 -287 314 318 -1234 585 381 -1266 1842 373 -2734
1425b734M323j075k950N295k165m175N738k038l529O878k568m737O262k528l523
$$ -2734 1589 514 -2436 2859 694 -3481 2257 219 -3310 3568 1000 -3737 2525 -3 -3526
1440c526P057k770l850O057l508l130O829k632k652N208m049k263N801k691j235
$$ -3526 3531 761 -3089 2968 -540 -3670 3159 527 -2125 3083 -966 -3229 2572 -119 -1354
1455a354M502l900j866M003j927J10K978l006r81J778j192R22J186j062J54j119
$$ -1354 3148 -752 -2618 1385 -542 -432 2546 -460 -1441 337 -855 67 1253 191 345 -774
1471g74m97J884o83N34J296l048K54J822k490K320K251m296R68J174l684L867
$$ -774 -1271 613 -70 464 1760 -1288 -1034 788 -1702 618 2869 -1427 -459 715 -2969 898
1487H98K156m864K597K68n128M873J889m743M091o18o021N353J307m621N169m71
$$ 898 3054 -1810 787 1055 -4073 800 2689 -2054 2037 1419 -4602 751 2058 -2563 2606 2135
1503B135o141M395M83l603N516l35n305L078l54k442M737r4l169J665j636j295
$$ 2135 -4006 389 872 -2731 2785 2450 -2855 223 -131 -2573 2164 2070 -1099 566 -1070 -2365
1519b365L671J28j086M28k067k07J648K1J144k48j902L58p01K92K915j323j098
$$ -2365 1306 1434 348 776 -1291 -1498 150 171 1315 1067 -835 -477 -1178 -886 2029 706 -392
1536c92J462k970RL946k029J40K426m866k50M540k704Q53L237n280l16L769l306
$$ -392 1070 -1900 -1891 2055 26 166 2592 -2274 -2524 2016 -688 165 3402 -1878 -2194 1575 -1731
1553a731J799L664n047j12K617l555K258L202m012Q44J245m012K340K675k657
$$ -1731 68 3732 -1315 -1427 1190 -2365 -107 3095 -917 -73 1172 -2840 -500 2175 -482
1568d82J504j2l687K124J570j511K074n09k884J202L07l5K150j106j519N91q75
$$ -482 1022 1010 -2677 -553 1017 -494 1580 1071 -1813 -611 -304 -339 1811 705 -814 -223 -1098
1585a098Q08J556j149M03j80k071J523Q90j139J809p45k341K048l99j195L214
$$ -1098 -290 1266 117 520 340 -1731 -208 682 -457 1352 607 -1734 314 -85 -1280 1934
1601A934j052k408K236j423r09L832j665j872K741k257j036L796j753j059K700
$$ 1934 882 -1526 710 -713 -1622 2210 545 -1327 1414 -843 -1879 1917 164 -895 1805
1616A805k750p76L379j949m30K550k452m83K143j901N39K046k219q2J150j535
$$ 1805 -945 -1721 1658 -291 -721 1829 -623 -1106 1037 -864 -325 1721 -498 -580 570 -965
1632i65R93J017j475O64o9j271J406J87p46R40j063m56J650j030j43J377j595
$$ -965 28 1045 -430 234 165 -1106 300 487 -259 681 -382 -838 812 -218 -361 1016 -579
1649e79J21J360j733P04J358k209P66J276k114J051J032k086J324O06k203J630
$$ -579 -458 902 -831 -127 1231 -978 -212 1064 -1050 1 1033 -1053 271 877 -1326 304
1665C04O36j973J471K0j670J940j83j611J816n82j302J970o36r26J673j281o40
$$ 304 940 -1033 438 458 -1212 728 545 -1066 750 168 -1134 836 200 -726 947 -334 -974
1682i74K028j135n16J528j407p3J442j434L03J258j640L00R85j327P49O26j366
$$ -974 1054 -81 -597 931 -476 -549 893 -541 -238 1020 -620 -320 665 -662 87 713 -653
1699f53Q59K30j318J096K39q57R61o42p20J383n70m23J254j098l05J175j162L51
$$ -653 206 436 -882 214 453 -404 557 -85 -805 578 8 -415 839 -259 -564 611 -551 -200
1717b00J329j701J84J177j580O70J084j686Q32P04j958J101R52j605J016K76j655
$$ -200 1129 -572 -388 789 -791 -121 963 -723 109 813 -1145 -44 908 -697 319 595 -1060
1734a060J289K75j324J453j00j477J208j39p27J388o52q64J259o39m17J211p86
$$ -1060 229 504 -820 633 533 -944 264 125 -602 786 134 -730 529 -110 -527 684 -102
1751a02j72Q29j090K75R94j108K87N64j049O60L50j063R23J62j165R26O6q10R90
$$ -102 -274 555 -535 -260 734 -374 -87 477 -572 88 438 -625 298 460 -705 221 287 -523 467
1770D67m15o77J209n64n64J095p24j73J008j082J56J048j358L10J075j364N05
$$ 467 52 -625 584 20 -544 551 -173 -346 662 -420 -264 784 -574 -264 811 -553 -48
1787d8P46j538R17P68j693R30O74j587R86M50j417J152J92j433J201K11j172R69
$$ -48 698 -840 77 845 -848 82 756 -831 155 605 -812 340 532 -901 300 511 -661 308
1805C08j00q11J072l42o53J006m73m60P83m35O7M55q33K77M87o61N46L1q05Q33
$$ 308 208 -603 469 127 -526 480 7 -453 330 -105 -38 417 -416 -139 348 -313 233 264 -541 292
1825B92k21p13J334m37r88J199n71n43J607r74p89J601j011n83J732r77n28J316
$$ 292 71 -642 692 255 -733 466 -105 -648 959 -15 -804 797 -214 -797 935 -42 -570 746
1843G46j201j00J518j198j68J069j108K02Q45j050N13M69j198O92L82q63P98j88
$$ 746 -455 -555 963 -235 -403 666 -442 -240 605 -445 68 537 -661 31 413 -450 348 160
1861A60q01J132l66p22J171n82m95J077q18o5J103j246M2J179j220L44Q39j499
$$ 160 -641 491 125 -597 574 -8 -503 574 -244 -309 794 -452 -410 769 -451 -107 732 -767
1879g67P21Q21j594R74O66j716R81M81j406J336P2j612J414M7j245J422l38j031
$$ -767 -46 775 -819 155 821 -895 86 567 -839 497 569 -1043 371 418 -827 595 257 -774
1897g74J363o90n80J590r33n98J230r89O7J193j343J80R75j340N55Q05j245P19
$$ -774 589 -101 -681 909 -24 -622 608 -381 -314 879 -464 -284 691 -649 -94 711 -534 185
1915A85J35j202J345mj193J276n23q46J700r47o84J899j492o11K170j557l17J993
$$ 185 320 -882 463 459 -734 542 19 -827 873 -74 -758 1141 -351 -962 1208 -349 -666 1327
1933A327k103j4K253k184J16K044k328L43J806k208Q12J469k500R11J371k080
$$ 1327 -776 -790 1463 -721 -605 1439 -889 -546 1260 -948 -136 1333 -1167 -256 1115 -965
1949i65J097P99k021J278M60j651J526P8j515J259k61o77J416q97n52J254j054
$$ -965 132 931 -1090 188 648 -1003 523 601 -914 345 84 -593 823 -74 -626 628 -426
1966d26K23J071j525O73O60j841J509O76k191J579J89k058K377j16k383K531m70
$$ -426 -203 868 -657 16 676 -1165 344 1020 -1171 408 597 -1461 916 800 -1583 948 478
1983D78k187K948p11k056K836j325j629L319j530j631K974j834r75L043k128o40
$$ 478 -1709 1239 528 -1528 1308 -17 -1646 1673 143 -1488 1486 -348 -1323 1720 -408 -1048
1999a048K727k481k49K675k258J00J936k488O40J754k267R53J127k209J095N77
$$ -1048 1679 -802 -1051 1624 -634 -534 1402 -1086 -446 1308 -959 -6 1121 -1088 7 584
2015E84j544J685j79j664J630m92p95J872j258n49J685j762K75J971k217M39J425
$$ 584 -960 725 546 -1118 512 20 -775 1097 -161 -710 975 -787 -512 1459 -758 -319 1106
2032A106k462J484J337l015J751J073l009K374N71l220K816K40l052L307l01l330
$$ 1106 -1356 128 1465 -1550 201 1274 -1735 639 1210 -2010 806 1046 -2006 1301 1000 -2330
2048b330L402l39k533L564j339k730L692j086j904L488j792j846L074j727o92
$$ -2330 1072 733 -1800 1764 425 -2305 1387 301 -1603 1885 93 -1753 1321 -406 -1098
2063a098L019k224p88K240j986K93J921k001O06R15k217J221Q64j396J545o02
$$ -1098 1921 -303 -1091 1149 -837 -544 1377 -624 -18 897 -1320 -99 765 -631 914 312
2079C12j730J982o44o67K441j834j067K166j940M56K761l074n0K346l012J244
$$ 312 -1418 564 -80 -747 1694 -140 -1207 959 -981 -525 2236 -838 -888 1458 -1554 -310
2095c10K496l646J280J971l865K040K009l908K260J480l887K545Q74l751L280
$$ -310 2186 -1460 -180 1791 -2074 -34 1975 -1933 327 1807 -2080 465 1339 -2412 868
2110H68R10l660K648j14l002L536J9k712K737j128k218L235n60j351K188j870
$$ 868 1778 -1882 766 652 -2350 1186 1205 -1507 1230 102 -2116 1119 559 -792 1396 -474
2126d74r30K417j313J8J605j965K79Q44j668J605O55j892J463o21j685K620n85
$$ -474 -1404 1013 -300 -282 1323 -642 -363 481 -1187 418 1073 -819 644 23 -1662 958 373
2143C73j178K565k250j507L383j639m28L039l425o83L626k866K85L367l987P0
$$ 373 -805 1760 -490 -1997 1386 -253 -681 2358 -1067 -1750 1876 -990 -705 2662 -1325 -1255
2159a255L245l528J102K946m210J102K702l868J461K195l630J936J660l739J855
$$ -1255 1990 -1538 -436 2510 -1700 -598 2104 -1764 -303 1892 -1738 198 1858 -1881 -26
2174b6J290k901K303O84k826J836Pj802K485k87j768J558q51m86J843j247r9J189
$$ -26 1264 -1637 666 1350 -1476 360 367 -1435 1050 763 -1005 553 -298 -784 1059 -188 -287 902
2192I02j790O50J048j721J426L61k266J921L9k138K645l41k218K663j194j920
$$ 902 -888 -238 810 -911 515 876 -1390 531 570 -1568 1077 736 -1482 1181 -13 -1933
2208a933L675j304k044L255k029j458L862k167j272L453k826q76L809k611o60
$$ -1933 1742 438 -1606 1649 -380 -1838 2024 -143 -1415 2038 -788 -1664 2145 -466 -1126
2223a126L050l005k4L149k895O4K472k794N48K070k493Q48J300k402J264J018
$$ -1126 1924 -1081 -1105 2044 -851 -787 1685 -1109 -561 1509 -984 -136 1164 -1238 26 1044
2239A044j996J239K14j502J585k38j206J607p81p54J595j073j19J369j723L65
$$ 1044 -952 287 501 -1001 584 346 -860 747 -34 -788 807 -266 -385 984 -739 -374
2255c74J427j854P91R83k160J397P82k354J859M92k549K133K84k371K415k48k363
$$ -374 1053 -801 -10 973 -1187 210 992 -1362 497 989 -1560 573 857 -1514 901 653 -1710
2272a710K760m38k247K738p37j833K756j185j568K835j344j297K661j608r52K490
$$ -1710 1050 612 -1635 1103 366 -1467 1289 104 -1464 1371 27 -1270 1391 -217 -1169 1321
2288A321j643m53K153k004k46K110j620J0J294j723N59J179j524O52M40j329J108
$$ 1321 -322 -775 1378 -626 -872 1238 -382 -372 922 -801 -242 937 -587 65 505 -824 284
2305B84K18j054J046o46p10J759o72p79J131j258J26J872j568k03J220j806P09
$$ 284 502 -552 494 -152 -862 897 225 -554 577 -681 -555 1317 -251 -454 766 -1040 -331
2322c31J727j947M29Q86k143J390J384k282R65P10k081J603N97k140J675M63k035
$$ -331 1396 -551 -122 764 -1379 11 1395 -887 78 788 -1293 310 907 -1233 442 905 -1130
2339a130J525%j669J940Q3j471J343q24j143K154j52r22Q94j378l04J991o71l32
$$ -1130 395 395 -1274 666 749 -722 621 -203 -1346 808 656 -266 628 -750 -1054 937 266 -66
2357f6P41j510K07J368r21L76M01j403P32O35j137P13J32p18J185n70j262J249
$$ -66 675 -835 -628 740 -181 195 596 -807 -75 560 -577 136 268 -450 735 165 -1097 152
2375A52p1j89J317j362j045J369m84L89J526j922q32J295o96Q48J222k088j40
$$ 152 81 -108 1209 -153 -1198 171 -313 76 1602 -320 -1152 143 -553 295 1517 -571 -711
2392g11J125j167Q58R91j670N54O16j530Q92O17j235J152L66j645N21R6m30J655
$$ -711 414 -753 105 1096 -574 -20 596 -934 -42 575 -660 492 858 -787 -266 -170 -600 1055
2410A055j27j593K93k23J78J575n56r27J87p57N42J404p87l02J04r50Q37P65j088
$$ 1055 928 -665 -372 -595 -417 1158 602 -325 -138 -895 -353 1051 264 -38 66 -884 -47 718 -370
2429c70M81L55r91O48Rr78J217K90r40O27n96q74J489K53n18N15j228o20J695
$$ -370 111 466 -525 123 132 -846 371 661 -279 348 -248 -1122 367 620 102 617 -611 -1231 464
2448D64L9l34M44j285j87J331m30P1N70j189M6Q03o15L53L79q25N16J84r60N10
$$ 464 503 169 613 -672 -859 472 42 113 683 -506 -460 343 -272 81 460 -365 151 335 -625 -115
2468a15L31k87P00n24r28P93O8p9Q51p86o94O75l00L38Q85j089l64P15n52M28
$$ -115 216 -71 629 105 -823 -30 38 -41 810 24 -670 5 -295 43 928 -161 -525 190 -362 66
2488F6O27j081K45N61r42M79N54r14M98L42r38N52K12p87P73K37q60L78l1l66
$$ 66 693 -388 -143 418 -524 -45 509 -405 93 435 -503 49 261 -526 247 484 -376 2 -29 -395
2508c95P88j43n56M25k49j47N58k25q1K17n21J90M25l70J89Nm67M93J5m55O28
$$ -395 393 250 -306 119 -130 -277 281 56 -25 192 -329 -139 286 -84 105 110 -357 136 151 -304 324
2529C24k09n70O86j99k84P49o32m04J010m61l34P85o94j56R34o80j29P87q74K
$$ 324 115 -455 231 32 -252 497 -135 -539 471 10 -324 461 -233 -389 545 -135 -264 523 -351 -349
2549c49R28p10k0M80p92L65P44r26K9M95n26L89L50p84J50L07l03L87J13n68j9
$$ -349 579 -131 -151 329 -463 -98 646 -280 -251 244 -282 107 457 -327 -177 130 -173 214 327 -241 -260
2570b60J74K25K18l84k03P9M9M71j74n98M14M5k87O84l19p40P75k1l60P86p13
$$ -260 -86 139 357 -27 -230 -151 -102 369 195 -403 11 56 -231 453 134 -606 169 148 -212 574 -139
2591a39p32J321m5o45O54p97l96J530l76p52P21p33k66J446m34p28N02n83J07
$$ -139 -871 450 405 -240 414 -383 -779 751 375 -377 344 -389 -655 791 357 -371 131 -452 -345
2610c45J191o40o98M07j29L19M81p16k68L18L5L77o3n50K2R5L18M30o41m42L69
$$ -345 846 206 -492 -85 -214 105 586 -130 -398 -80 -45 332 269 -281 -259 -164 154 584 -57 -499 -130
2631a30P9M70O8j041J52O24k67M64j24j055O03N33n07O01l70j096J128M93p88
$$ -130 -51 419 487 -554 -402 222 -45 419 295 -760 -157 376 -131 470 100 -996 132 625 -163
2650a63M74n11p62J566Q5j148O06l62m84J501k46j135O51l39j91J411n38j160
$$ -163 311 -200 -962 604 689 -459 147 -215 -699 802 556 -579 72 -267 -458 953 415 -745
2668g45O20oJ23Q25q29p32O72J41J80K12p27j89L70K27L63m03o09L06J61L53L18
$$ -745 -125 -131 -8 817 -12 -744 -72 69 249 461 -266 -455 -85 142 505 102 -507 -201 -40 313 631
2689F31j065j98R39k84J88L15j275K90J154q24K34M07j458O30J284j123J24L24
$$ 631 -434 -632 307 23 211 526 -749 -459 695 -129 105 512 -946 -316 968 -155 -31 293
2707B93j293J068J060j534J40M67r33J098N42j523L85L75o91J118J12j400M76
$$ 293 -1000 68 1128 -406 -266 201 -732 366 908 -615 -230 145 -546 572 684 -716 -240
2724b40L20k44Q74m86j048P40K57q1M18p26l79P22m3J32J38q32J27N61j17L05
$$ -240 80 -164 710 224 -824 -84 173 92 510 -216 -595 127 84 216 354 -478 -351 210 93 398
2744C98l96p42Q16K76l78L83p05k93J223m03m42P51r89r7J525q95m33R34j205
$$ 398 2 -740 76 352 -26 357 -348 -641 582 179 -263 488 -501 -598 927 32 -401 533 -672
2763f72K51J663j419m69J178j080L87J296j620j17J204j056M26R77j553J46R73
$$ -672 -421 1242 -177 -646 532 -548 -161 1135 -485 -602 602 -454 -28 949 -604 -458 515
2780E15q78N78M46j423M68Q46p48L74O2q44O17L52m97K62j78k44M33j05P2P1o73
$$ 515 -363 215 661 -762 -294 552 -196 178 240 -604 13 365 -132 130 -48 -292 141 36 108 179 -494
2801d94M96M30p20M56K0q81J022K17j229Q77J27j045J138Mj147J098j92r08J379
$$ -494 2 432 -288 168 188 -693 329 546 -683 194 321 -724 414 418 -729 369 177 -731 648
2820F48m08j041J313m65o84J450r17p30J660q47p32J587r25o16J495r33m78J388
$$ 648 240 -801 512 47 -637 813 -104 -834 826 -21 -753 834 -91 -707 788 -145 -623 765
2838G65q67m46J103o96j61P42o34J18L83p03M24L13o16M12j37m66R04k06o69O08
$$ 765 -102 -548 555 -141 -302 440 -194 -76 307 -396 28 341 -275 137 0 -466 438 232 -437 171
2858A71k88j32P91n98k07M69o93N50P08j199K78L76j026J266N15j927Q04P02j423
$$ 171 -117 -249 542 -56 -263 206 -487 63 771 -428 -150 226 -800 466 981 -946 -142 560 -863
2877h63J278N11j952R83O61j377J126K47j537J061L98r80P80l98p46J496k34r40
$$ -863 415 926 -1026 -43 618 -759 367 614 -923 138 536 -444 336 -62 -808 688 454 -486
2895d86P42p17j48J630o82q38O63p19J42J396o60o86J69l37P17M60p75N9j76j27
$$ -486 256 -461 -609 1021 339 -499 164 -555 -413 983 323 -363 -194 -531 186 646 -129 -70 -246 -373
2915c73J087o30q18J113l83k81J232j218q80J603j93j31Q16j712m79J781j52J29
$$ -373 714 84 -734 379 -4 -285 947 -271 -1151 452 259 128 944 -768 -1247 534 382 511
2933E11J85j913L87J520p22O23J36k058R06J253j224P25K85j679J108Q39j538
$$ 511 696 -1217 -830 690 -32 591 727 -1331 -425 828 -396 329 614 -1065 43 882 -656
2950f56M01N61n46Q83k21j296M26L76M26P96j192r17N58k5J049Q34j801o68P76
$$ -656 -255 306 -240 643 422 -874 -448 -72 354 1150 -42 -959 -401 -426 623 1457 -344 -1012 -236
2969b36j14R91L94j583N6N30l69Q02j96q89R66j06o73Q40q50m57K011m25j215
$$ -236 -350 641 1035 -548 -492 38 -331 471 275 -614 352 246 -427 413 -437 -894 1117 692 -523
2988e23O29j047O2K426o54j422L72q76M34J958p26p96M5r81Q85J288j023j5J06
$$ -523 106 -941 -879 1547 893 -529 -157 -1033 -599 1359 633 -163 -118 -1099 -214 1074 51 36 142
3007A42r72R94M14j298Q42N43r68N05k49r56J178N87m99Q6r71m38J274L49J45
$$ 142 -830 164 578 -720 122 665 -303 202 -47 -1003 175 762 263 349 -622 -1060 214 563 708
3026G08j91j640K52J389l59M10M3j664O14R84q61O10K78j291P60L93j045P06J04
$$ 708 517 -1123 -871 518 159 569 612 -1052 -438 546 -315 295 573 -718 42 435 -610 96 200
3045B00n40J105n45j232J017%j02J261j158j152J268k07m8J311j156r52J009k65
$$ 200 -340 765 220 -1012 5 5 -97 1164 6 -1146 122 -85 -133 1178 22 -930 79 -186
3063a86J81Q74j032k87O49m94L42L07o95N93R8r02O04O0n56J017j93r11O22k65
$$ -186 -5 869 -163 -450 199 -295 47 354 -341 252 350 -552 52 112 -444 573 380 -531 91 -174
3083a74k74J186m23p19M82m89K63R15r18o1N91r45N24P37j182N00N65j281P19
$$ -174 -448 738 315 -404 78 -411 -148 767 -151 -212 379 -566 -42 695 -487 13 578 -703 16
3102A6O14j281O88N84j150N89K57r55R25J91r78O23n0m96Q83l72n64Q48m61k53
$$ 16 630 -651 37 621 -529 60 317 -638 287 478 -500 123 73 -423 460 88 -476 372 -89 -342
3122c42R03o55l06P76n41L5O50q27L5O48m93J74J11o17O10J49o52N52k08m90R72
$$ -342 561 -94 -400 376 -165 -130 520 -307 -272 376 -117 57 168 -449 161 310 -342 210 2 -488 484
3143D84k78o41P53n27l02J242n53o35O69n41J07J010r11k60O94p21M13O68j091
$$ 484 206 -435 318 -209 -511 731 178 -457 212 -329 -222 788 -123 -383 311 -410 3 671 -420
3162d20K95N61r91O93M68j303O34O49r91N77J05j090R49N34r22L02j15n24R13
$$ -420 -125 436 -555 138 606 -697 -63 586 -405 172 277 -813 136 670 -252 50 -65 -589 324
3181C24J19n28K27m98n5Q74k46k07R7o51M33O94o84M2J67m92O12J30p69M99rm23
$$ 324 443 -85 142 -356 -411 463 217 10 107 -544 -111 583 -101 -59 108 -384 228 358 -411 88 79 -344
3203c44Q76l40q37Q40j87k51J068q62q67J219j85l10Q85r37n49J200l16k26O60
$$ -344 532 192 -645 195 8 -243 825 -37 -904 315 130 -180 705 -232 -781 419 103 -123 537
3222E37q78j57R03m14P6K12q75N16O31p61K33N1o47Q65K28r24M31j1m65Q79n4
$$ 537 -341 -498 405 -9 67 279 -596 -80 551 -210 23 74 -573 292 520 -404 27 16 -449 430 376
3243C76p51L80k05kQ33n51m71M59l33L55N33r37J0N65n38M56L12r62L10M04m88
$$ 376 -375 5 -200 -202 631 80 -391 68 -265 90 623 -314 -304 261 -277 179 491 -471 -161 243 -245
3264b45O22j09q98O94J68l97O28n54n83J114k60n31Q38o63m35J216m65m96P57
$$ -245 377 268 -630 64 232 -165 463 -91 -674 440 180 -351 487 -176 -611 605 140 -356 401
3283D01p05j66J107m95m46M20m35K70N91o60m2J95l61N71J18o73L97j41l47Q87
$$ 401 -304 -470 637 142 -304 116 -319 -49 542 -118 -160 35 -326 245 363 -310 87 -54 -401 486
3303D86k65p02O21j94j68P95o89m06Q88m29n9O48q88j3Q69o81J58N80j086J91
$$ 486 221 -481 140 -54 -222 573 -116 -522 366 -63 -122 526 -362 -375 494 -187 -29 551 -535 -344
3323c44Q97o68J56K79q99M71O07o70K20O2n40N77N8m08M37l71k43P76l51k92N31
$$ -344 553 -115 41 320 -579 -108 499 -171 49 111 -429 148 206 -202 235 -136 -379 397 46 -246 285
3344B85n69O7Q17p54k05O63n25J70N25p81J37M29n54M23K53p85L64K05m39O33
$$ 285 -284 -217 600 -154 -359 304 -221 -51 474 -307 -170 259 -295 128 381 -404 -40 165 -274 359
3364C59j86p41P46K6m68O16l93m54Q78l37l05O87o17k24Q75n09j11N68q34J50
$$ 359 173 -568 178 204 -264 352 -41 -495 383 46 -259 428 -189 -413 462 -47 -158 410 -424 -274
3384b74R02p93l5N62p67L21O32q22J52M24o63L53L68n62K00M1k82M80j16l86L88
$$ -274 628 -165 -200 362 -405 -84 548 -274 -122 302 -361 -8 360 -202 -2 39 -243 237 121 -265 123
3405A23k00j8M12n08K0M96n75J82M64p26K50M38p12M39K89r03N56L88p99N27J01
$$ 123 -77 -95 317 -191 -171 325 -250 -68 396 -330 -80 358 -354 85 374 -529 27 415 -384 143 244
3426B44p79P73J12q13O54mo47P44q4n83O47k74m16Q27l11m26N89l74q5O30n59
$$ 244 -535 238 350 -463 191 187 -460 284 200 -383 264 -10 -426 401 90 -336 253 -121 -206 424 -135
3447a35j06N71n13N9M70n47J42L04n37L50K41n83L16J20l87M35j16l88N30j64
$$ -135 -241 330 -183 -124 346 -201 -59 245 -292 58 299 -284 32 152 -235 200 84 -304 226 62
3467F2l27N01k81j46M77m67K4N08n78J08M59o32K88L45p63N14L39r37N34L64q33
$$ 62 -265 236 -45 -191 286 -181 -157 351 -227 -119 340 -292 -4 341 -422 92 431 -506 28 392 -441
3488d41N92K28r09O54K23q40O74J90p87N30L0m72O05j25m91N26j69k45M95l01
$$ -441 151 379 -530 124 347 -493 181 371 -416 114 144 -328 277 152 -339 187 18 -227 268 -33
3508c3j13M03m47J0M95m12K0K55l64K03J13l46L51j2l43L88k05k18O09l89k76
$$ -33 -146 257 -190 -180 315 -97 -77 178 -186 17 130 -216 135 123 -220 168 -37 -255 354 -35 -311
3529c11P07m69l29P64m30j78P08o37j78P26n46k1O14n94L3M00o38L70M52p66L29
$$ -311 396 -73 -402 362 -68 -246 462 -175 -353 373 -173 -194 420 -174 -141 259 -379 -9 443 -323 6
3550FK93p80N23L42p43N40J60r02N23L60n27L82Rn31L51L6j58L86k12k11J71k59
$$ 6 299 -481 42 384 -359 181 341 -561 -38 322 -205 177 186 -345 6 42 -116 270 58 -153 18 -241
3572b41K59L44n23J22K15n20L27K72m53L50K0n84M91N1l67N31k36l91O27m24k73
$$ -241 18 362 -161 -39 176 -344 -17 255 -198 152 172 -412 79 130 -237 294 58 -333 294 -130 -403
3593d03R29m88m07P75n85k93R96n40l27Q24o03l66P94l24j07N02n61n9M24m22
$$ -403 526 38 -369 406 -179 -472 524 -16 -343 481 -122 -488 306 -18 -125 377 -184 -243 181 -241
3613b41K81L16n35J81N6n08O24K08o32L44j1n01N14J14l11L15k69k54L99j01J03
$$ -241 40 356 -179 2 58 -450 174 382 -250 94 83 -418 96 210 -101 214 -55 -309 90 -11 92
3634I2J77n55K05K89n68M42L55p82L16K63p02N87K92q00M47J84o39N07O4m69N56
$$ 92 269 -286 -81 208 -360 82 437 -345 -29 234 -468 119 411 -389 58 242 -397 110 174 -295 261
3655B61j95m81O92k60l82P56m03l24P53n42l21Q98m06l62O34l89k29N43k68n9
$$ 261 66 -415 277 17 -365 391 -12 -336 417 -125 -446 452 46 -316 318 -71 -300 243 -25 -84
3675h4K87l45K6J88j74K97j37l51M83j54l43N95j98l79N73l33k76O69l21k54M88
$$ -84 203 -142 -116 72 -102 195 58 -293 190 36 -307 288 90 -289 284 -49 -325 344 23 -231 257
3696B57l67o4M34m28J63L59p22K56N02o69L35L00q54M68M80q24M16L41q15L76
$$ 257 -110 -174 260 -168 -5 354 -368 -112 390 -279 56 356 -498 -30 450 -374 42 383 -432 -56
3716e6L61n17L37J7n23M58Q2k78L11k59j57M74l28p3M92m77j08N26l89L3L32m59
$$ -56 305 -212 125 142 -381 77 159 -119 192 -67 -224 250 -78 -151 341 -136 -244 282 -107 -74 258 -201
3738b01J12L40m02J35J11k74L59j18l65N33j65l90O61l00m37P35l32l50P87m17
$$ -201 -89 251 -151 -16 95 -179 180 62 -303 230 65 -325 336 36 -401 334 2 -348 439 22
3758B2m89P60k25k56N00m49j69N85l09l7L40n24J08L89m21K85J58o96L48M11n01
$$ 22 -467 293 68 -188 312 -137 -306 279 -30 -67 273 -251 -143 246 -175 110 268 -428 -80 331 -170
3779a70K31J02n03M08J47l87K54n4k29L47j21j02K21l97J46N07m84l0K87n33L69
$$ -170 61 163 -340 68 215 -172 82 28 -201 146 25 -77 144 -253 -107 400 -84 -114 173 -360 9
3800IM83p10R9L34n39L37L52n62K26P6m51N24Kn08N11o7l80N34l56l87Q54j16
$$ 9 492 -218 -119 215 -324 13 365 -197 29 105 -346 178 180 -328 183 116 -264 270 -86 -473 381 265
3822B65n25M54l67k83Q20o9l80J79m25n0O96k1j70j77m29L90L69k50J65j87m49
$$ 265 -260 194 -173 -456 364 295 -85 94 -331 -381 315 294 124 -53 -482 -92 277 27 192 5 -444
3843d44N30Q6l58L97j76l42N46j61l94L90q8M3L98o18k67N63j22K33K91q60p3
$$ -444 86 172 -186 211 35 -307 239 78 -316 74 -14 29 427 -191 -458 105 -17 216 507 -353 -426
3864d26N79k70L50L11r20k3N58k54K88J00o38K70L11l92J76k3j93N29j56m84K85
$$ -426 153 -117 233 544 -376 -399 159 -95 193 293 -345 -75 236 -156 20 -3 -196 333 177 -307 -22
3885b2j88K8P89l43o25J85j56K73Q03n22o32J58j7L90M02n07k30M9r2M58R0m47
$$ -22 -210 -182 607 264 -361 -176 -332 -59 744 222 -410 -252 -269 121 523 16 -214 -165 -257 201 291 -156
3907a56J42j8j34M33k76l89N60O0k25J31m64n4P45r7k06N0n97J74P86k96r9N1
$$ -156 -14 -32 -166 267 -9 -398 162 222 -3 128 -336 -390 355 258 52 102 -495 -321 465 169 70 121
3929A21p07L91P51n28j27J95m56L77M28o59L3L22k42K54L5n29K00K43j5K55l78
$$ 121 -586 -195 556 28 -99 96 -360 17 445 -214 -181 141 -101 153 188 -341 -141 102 87 342 -36
3950c6m83M37K43M1J25n80k34N68J21m1k1m30N4L65m1P9j67l50L88J82k60J32
$$ -36 -519 -82 161 202 327 -253 -487 81 202 161 140 -290 -236 129 88 167 0 -350 38 220 -40 92
3972I2k36j85O88j07n33K67o1p4N74l24m67L78q2M7M41m81k85M09r5J62K55p12
$$ 92 -144 -329 359 252 -281 -14 -75 -149 425 101 -366 12 -70 -23 418 -63 -348 61 -34 128 383 -329
3994c29nO28k45%J40n62K09N39l46p5J02l14K14L38k50j16p1mL76n3k91Po0K20
$$ -329 -334 294 49 49 189 -373 -164 375 29 -46 56 -258 -44 294 44 -72 -143 -147 229 176 -115 -108 -168 52
4018E2L08m28j79K38q2K35J70n11k3K52q0K96o1n62K70K25j52K92k95m32O49Q0
$$ 52 360 -68 -247 -9 -91 144 314 -197 -220 32 -48 248 187 -375 -105 120 -32 260 -35 -467 182 262
4040B62m29K86k10k67P06j02m97K79j74p2O81k60n16K06m2J86M45m90l64L46O
$$ 262 -167 119 -91 -358 348 246 -251 28 -146 -218 463 203 -313 -107 -149 37 482 -8 -372 -26 -20
4061b0J63J44m87n8L22lJ07r0l40J31K34P7k7m15m3M94j8m0p6n17K98O07l71r0
$$ -20 143 287 -200 -258 64 61 168 78 -262 -131 103 180 153 -262 -305 189 171 131 55 -462 -164 443 72 -18
4085a8N6n21M40N99n74r5J02l92N50M10p83l6K88j93M66L5p71K45L51j89L24j83
$$ -18 38 -483 -43 556 -18 -113 -11 -403 147 557 -226 -262 26 -167 299 334 -437 -192 159 -30 294 111
4107A11n92L82L03q6J26l98l04N26K05j05j09m50J75N39j63j13q1l60L98L92l83
$$ 111 -481 -99 204 118 244 -154 -458 68 273 168 59 -391 -216 323 160 47 -34 -394 4 396 13
4128A3n1q9k11N62J66n10n4m2J10N45k69m67J83m6K39L90n91k14L87j98L25K93
$$ 13 -38 -127 -338 224 390 -120 -174 -216 -106 439 170 -297 -114 -160 79 469 -122 -336 51 -147 178 471
4150D71q17j8N58k54K61J01q40L10O60m65J22N6o64M96M85n74R0P9m79N25L38
$$ 471 -346 -364 194 -60 201 302 -538 -228 432 -33 89 145 -519 -23 462 -112 -22 57 -422 103 441
4171D41n62k7O4j05M55J5m61j2R8J97J70l10p8M7q7L88L0n23K07O0j94N77j86
$$ 441 -121 -148 -84 -189 266 281 -180 -192 -94 103 273 -37 -115 -68 -155 233 263 -260 -53 7 -187 390 204
4194B04p04N20J42l16M97k88n84O97K9m32N01k88m29O79n9l58L84l33j77O33k06
$$ 204 -500 20 162 -154 343 55 -529 168 197 -235 266 -22 -451 228 169 -189 195 -138 -315 318 112
4215A12k75K41k42J03L55l92NJ97l07K70J95m68K16P0l41M70K9n52L19Q7k62L76
$$ 112 -163 78 -164 -61 294 -98 -93 104 -203 67 262 -206 10 80 -261 209 238 -314 5 92 -170 206
4237B06j22l61L54nj83K70j71j41K48j71R2J76l80J01K18k55K48J7m58L90R1m14
$$ 206 84 -277 77 72 -111 159 -12 -153 95 -76 16 192 -188 -87 131 -124 124 141 -317 73 164 -250
4259b50M29m1m97N19n0l98N87k33n31O95p3m67N65k33m30P02j60m51N24j51l42
$$ -250 179 138 -359 160 110 -288 299 66 -465 230 157 -310 255 22 -408 294 134 -317 207 56 -286
4280b86M82p6k76K32j30l5K51j29o7k4k6K48r9k26K44j22j18M22k55k37M16k81
$$ -286 196 120 -156 76 -54 -89 162 33 -34 -58 -84 164 65 -161 83 -39 -157 265 10 -227 189 -92
4302i2o7N13l96k62M80k33j9L88n07n1N28l54kL25m94J11M02l68Q6J68m35K49
$$ -92 -159 354 -42 -304 176 -57 -76 312 -195 -246 282 -72 -74 251 -243 -132 270 -98 -12 156 -279 -30
4324c0K98l48Q0l3k11M38Jl87K16q5j14M53k08k96L49k02q8M96l23k73L82j35
$$ -30 268 -80 0 -33 -244 194 195 -192 24 -61 -175 278 70 -226 123 -79 -167 329 6 -267 115 -20
4346b0j7K72l64m9L36r9m7k4j70K19R2j30J15k43j29M46o7j40K04m31k4O19k81
$$ -20 -37 235 -129 -178 158 59 12 -12 -182 37 129 -1 114 -129 -258 188 121 -19 185 -246 -270 349 68
4369F8k08K95l61O3N12m80j12M68l70P1L74n68J6M77k86R6J75n88J06N21j47m0
$$ 68 -140 155 -206 -143 369 -111 -223 245 -125 -54 320 -248 -232 245 -41 55 230 -358 -252 269 122 82
4391H2m7l84K40L27j15j4j62j30K31L2j6P0k86J02K77k82l5J32j63K95J78n84
$$ 82 35 -349 -109 218 103 89 -73 -203 28 60 44 114 -172 -70 207 -75 -110 22 -141 154 332 -252
4413b52k0K86n2L72p6n94J09J91K0M31k20n69K34J21L3L62l72l67M72m7j61K48
$$ -252 -272 14 -38 334 258 -336 -227 -36 -16 415 195 -374 -140 -19 14 376 4 -363 109 62 -99 149
4435A49k82k1N05l08k57K07k02K20M92m48l36R2p2M63L64n81l30J27P7M08R5m45
$$ 149 -133 -154 351 43 -214 -7 -209 11 503 55 -281 -189 -261 202 566 -15 -345 -218 -141 267 362 -83
4457h3j14R8P3K01r3j71O9KJ30pl87J28L96q6J0k41m91M78N33k36r3k73m26N77
$$ -83 -197 -99 -26 175 82 -89 -20 -18 112 105 -282 -154 242 156 166 -75 -566 -88 445 209 116 -157 -583 -6
4481fM71l08m6k77l41O18K81m17L1j13j02M63j21m21K99Q9p2K05l54k80M30J67
$$ -6 465 157 111 -166 -507 111 392 -25 6 -107 -209 254 133 -288 11 100 28 233 -121 -401 29 196
4503A96K3j4n24j30N03K30M1k57n04J28M75Q9p0k36k72K59K23p1l8j87%K95k8
$$ 196 219 205 -319 -449 54 284 325 68 -436 -308 167 256 186 -50 -322 -63 160 89 51 -136 -136 159 131
4526A31j69o8j39L27L22m12k24O1k3M77J75o47j05K30m9L92J11o62k1L04m8L09
$$ 131 -38 -106 -245 82 404 -8 -232 -171 -194 283 458 -189 -294 -64 -113 279 390 -272 -293 11 -37 272
4548B72q1n52K13L38j35J8j44k20L89J55k64k6j26kL88j1k48r4j04K32L36k15
$$ 272 191 -361 -148 190 55 73 -71 -291 98 253 -11 -37 -163 -165 223 212 -36 -130 -234 -2 334 119
4570A19k54o9M6L53R1l97n8O7M5K95p8l73J05Q3L8K38k17l25K39J34J9O0l38m4
$$ 119 -135 -204 -158 195 286 -111 -169 -102 -57 238 160 -213 -108 -25 13 251 34 -291 -52 82 101 161 -177 -221
4594b21L50j2p4j7k60J78K94k22j7k1k60L35K87l73n9J4j36L94J47m80jJ34p5
$$ -221 129 117 43 26 -234 -56 238 16 -1 -22 -282 53 340 -33 -92 -78 -214 180 327 -153 -154 -20 -95
4617i5K88l2l53J33Q8o9J72r7k05J61P0J5l0k16M2K47mm1j62j87L14J51j68O3
$$ -95 193 161 -192 -59 29 -40 132 35 -170 -9 61 76 46 -170 -128 119 115 74 -88 -275 39 190 22 85
4641H5j63k11L87Q6k22J44k05j68M56k5l21J99n5r5L13j98k37L26l7r2J75k38
$$ 85 -78 -289 98 184 -38 106 -99 -267 189 164 -157 42 -13 -108 205 7 -230 96 59 -33 142 -96
4663i6r8K79l4J3O7l26J5K80k8L0p0k29J68J48j49R2o8j32K11l4j23J76j25p0
$$ -96 -194 85 51 64 131 -195 -180 100 72 102 32 -197 -29 119 -30 62 -6 -138 73 39 -84 92 -33 -103
4687a03K71j47j63J86r8N4K22k83j36K36n6O9Q8k45K5J26j32J75L4k70J29L3j19
$$ -103 168 21 -142 44 -54 0 222 -61 -197 39 -17 52 140 -105 -80 46 -86 89 123 -147 -18 15 -104
4710a04K65j10k35K91m0k12K54j05j36L13j77j56K79j30j13K60j55q9K06j68J2
$$ -104 161 51 -184 107 67 -145 109 4 -132 181 4 -152 127 -3 -116 144 -11 -100 106 -62 -50
4731e0K24k31n5J93j21M3Q5j98R4J00j65J02K7j29J23n1p2J97j22j02J78j09k2
$$ -50 174 -57 -112 81 -40 3 88 -110 -16 84 -81 21 48 -81 42 -9 -81 116 -6 -108 70 -39 -61
4754f1K09k20j4K30k41K6K61k64KJ84k28J11J93l15N6J78j99J19P9k34J33P9j85
$$ -61 148 -72 -86 144 -97 -71 190 -74 -72 112 -116 -5 188 -127 -71 107 -92 27 106 -128 5 84 -101
4777a01J95kk29J41K9n9J63j70j21K28m2m4J22j85mJ98j88N1J32k35P7J70j98
$$ -101 94 92 -137 4 33 -26 137 -33 -154 74 32 -12 110 -75 -79 119 -69 -18 114 -121 -44 126 -72
4800g2P7N4k04J97J03l09J01R5j23K09n2k64J76N7r9J92j03k09J72J0NJ43k36
$$ -72 5 59 -145 52 155 -154 -53 42 -81 128 76 -188 -12 45 -54 138 35 -174 -2 8 13 156 -80
4823h0j11K42pK8jk56J14J95j48P2Jk47K18J14j89J14p0k02L16P4k62Q2m8o4K96
$$ -80 -191 51 44 72 71 -185 -71 124 -24 48 49 -198 20 134 -55 59 -11 -213 103 177 -85 -3 -51 -115 181
4848A81r6k54J69j4k2J93j71j09J48m1P1R1k66LJ66l3J15j02k61K08J57j16N1
$$ 181 85 -169 0 -14 -36 157 -14 -123 25 -16 55 146 -120 -117 49 16 131 29 -232 -24 133 17 68
4871F8j36j60L23M0j62R9j69j04L66%k31O9j37L5L53j64k41J09j3R4J34j95r4
$$ 68 -68 -228 95 135 -27 72 -97 -201 165 165 -66 3 -134 -99 254 90 -151 -42 -55 39 173 -22 -116
4894a16R7k5J45Nk07K1N9L9J56j74k24K31O5n0J09k74n5L64p3j30J12k25oL69
$$ -116 -19 -44 101 106 -101 -80 -21 18 174 0 -224 7 72 22 131 -143 -198 166 93 -37 75 -150 -156 213
4918B13j33j25N9j89J26L17k24j81N8oJ87P9k54n4O5N8J71j02k04R3k1R1K07k65
$$ 213 80 -45 14 -175 -49 268 44 -137 -79 -85 102 181 -73 -127 -62 -4 167 65 -139 -46 -67 24 231 -34
4942c4j69K23j4P1J08l68k3L65j17l8R3k66P9L01j84n2N5j91J41K20j92q7OrK20
$$ -34 -203 20 6 77 185 -183 -206 159 42 4 97 -169 -90 211 27 -25 30 -161 -20 200 8 -79 -73 -82 138
4967A38J5k53JL2J04J60j93j46J23n0J42J48l10q0J99n8J43P3m19O9L08j32K5
$$ 138 153 -100 -99 -67 37 197 4 -142 -19 -69 73 221 -89 -169 30 -28 115 188 -231 -162 146 14 39
4990C9L0k94J66K63k19KK1j69J73J61j81m7n6K2K10k1j50k9m6J64J45k41k5R7
$$ 39 69 -225 -59 204 -15 -13 8 -161 12 173 -8 -55 -111 -89 121 100 -50 -79 -125 39 184 -57 -82 15
5014A5j10J79Q0l17Q8J54j66J99J7l88J57K70j81O9o6k80K91K20k41Jl6j48K35
$$ 15 -95 84 164 -153 -65 89 -77 122 139 -249 -92 178 -3 66 0 -280 11 231 -10 -9 -45 -193 42
5037D2J14j56j4q9k2K22rj10l3n5J44J03k11MQ3o9J62l1k56J53R6j22J82n8k99
$$ 42 156 0 -14 -103 -125 97 88 -22 -55 -110 34 137 -74 -70 13 -56 106 75 -181 -28 68 -54 128 70 -229
5062b29J77J40r7J41j51k20K71R3j35M5j05m5K12n4q3O0r4N0J47j26m8L5j02K16
$$ -229 -52 88 -9 132 -19 -239 32 125 -10 35 -70 -115 97 43 -40 20 -74 -24 123 -3 -51 -16 -118 98
5086I8Q2k91K5P1o0K47l7l23J57P3j41K28k8k66J47N9j19J92p4k05J90O4j40M5
$$ 98 180 -111 -86 -15 -75 172 135 -188 -31 42 -99 129 101 -165 -18 41 -78 114 40 -165 25 89 -51 -6
5110fm1MJ39n0j17J0OR9L9j10L5r1k9K17Rj80N2p6oK82j30k16K05m7p8K15j26
$$ -6 -47 -43 96 46 -71 -61 -55 44 83 -27 8 -83 -112 105 114 -66 -14 -90 -96 186 56 -160 45 -2 -80 135 9
5137Ij75K64q4r1K23j56j49K51n0o3J01j50l0K14p0q2N6o1L7O5p8L4j6p0J17p
$$ 9 -166 98 14 -77 146 -10 -159 92 42 -21 80 -70 -100 114 44 -38 18 -43 -6 59 -19 15 -1 -71 46 39
5163C9q5P9p6k7J84q9j32J40m6l9J58j48o0J93j05m9J60j31n0J32n7J2N9j43K4
$$ 39 -46 33 -43 -70 114 25 -107 33 -13 -52 106 -42 -102 91 -14 -63 97 -34 -84 48 -9 3 62 -81 -57
5188e7J50q9Oj2o9R7K3q0Q6l7r3J23m6m0J34j35o6K12r9p7J60j20m2J75j52l7
$$ -57 93 4 10 -2 -71 26 49 -31 55 18 -75 48 2 -38 96 -39 -105 107 8 -69 91 -29 -71 104 -48 -85
5214h5K27j74n9J74j04k7J47j42JJ36j20k5J11o7pK6n8N9j2m3O6k2k0N4r2J3J49
$$ -85 142 -32 -91 83 -21 -48 99 -43 -42 94 -26 -51 60 -7 -14 12 -46 13 1 -42 24 2 -18 36 -56 -43 106
5241A06j45k4J32j04J2J22j86K3J60j74O1J42k03LJ48j28P6R3k31O9J45j25M1
$$ 106 -39 -63 69 -35 -23 99 -87 -64 96 -78 -17 125 -78 -75 73 -55 21 114 -117 -48 97 -28 13
5264A3L7j29R4K8r8R3k4n6Q4j9n4Q2j15K3J77j38o4J08j22P5J69k15oJ40j80N7
$$ 13 50 -79 15 43 -55 38 14 -42 42 23 -31 51 -64 -41 136 -2 -66 42 -80 -5 164 -51 -57 83 -97 -40
5290d0J98j77k7J02j53Q5J23j65J3J01q2Nok9J18m6l6Nq7N3J33r9N1K0k48J45
$$ -40 158 -19 -46 56 -97 -12 111 -54 -41 60 -22 -17 -23 -52 66 20 -16 -11 -98 -45 88 -11 40 60 -188 -43
5316d3J83j54N2L7k84K04J43k28J43P3l03J62J27k46K02P4k79J40R5k59J46J52
$$ -43 140 -14 38 75 -209 -5 138 -90 53 126 -177 -15 112 -134 68 142 -137 3 98 -161 -15 137
5338A37j59O7k8j66J35J08p0J1n4o0M2J1J02Pj52M9pn1J81m8j55J85p8j66K01
$$ 137 -22 45 17 -149 -14 94 24 35 -19 -79 -37 -26 76 83 -69 -20 -27 -78 103 55 -100 85 7 -159 42
5363D2J4j03J78j38j68K43o6o0K24j58j55J78r7L5K40k43q4J83j44L8J98j92J4
$$ 42 56 -47 131 -7 -175 68 2 -58 166 8 -147 31 -66 -31 209 -34 -118 65 -79 -41 157 -35 -21
5386b1J20k50Q1K10j84P1P5k30J02R3j41J50N4k36O1N7p7J44k2j38O2J0l7N3R
$$ -21 99 -151 -70 140 -44 27 102 -128 -26 67 -74 76 130 -106 -45 12 -65 79 57 -81 -19 -9 -46 7 16
5411A6J3m2o0J03l3o1J46o7j09K13j48j38L29j02k14K70j55j59L91j47k25L42
$$ 16 29 -13 -73 30 -3 -64 82 15 -94 119 -29 -167 162 60 -154 116 -39 -198 193 46 -179 163
5433A63j77j98L82j22k10K93j41j60L46j67j71K82r1j38J92r3q5J94o3j09J14
$$ 163 -14 -212 170 48 -162 131 -10 -170 176 9 -162 120 29 -109 83 -10 -95 99 36 -73 41
5454D1m3m7O5K8j5q7M0N4m4N1J3j93J20J45k05P8Q5k34J41J47k37J38M6k70J92
$$ 41 -2 -49 16 44 29 -58 -18 36 -8 43 56 -137 -17 128 -77 1 86 -148 -7 140 -97 41 87 -183 9
$$ [...]
8191B6
##END NTUPLES=NMR FID
##END=
