##TITLE=1H_Ly-801.24
 CCl4, 8 sc, 
 15.3.2019
##JCAMPDX= 6.0         $$ Bruker NMR JCAMP-DX V2.0
##DATA TYPE= NMR FID
##DATA CLASS= NTUPLES
##ORIGIN= UXNMR, Bruker Analytische Messtechnik GmbH
##OWNER= root
$$ XWIN-NMR		Version 3.5
$$ Fri Mar 15 14:37:06 2019 Russian Standard Time (UT+4h)  she@DPX200
##.OBSERVE FREQUENCY= 200.131
##.OBSERVE NUCLEUS= ^1H
##.DELAY= (6, 6)
##.ACQUISITION MODE= SIMULTANEOUS
##.ACQUISITION SCHEME= undefined
##.AVERAGES= 8
##.DIGITISER RES= 18
##SPECTROMETER/DATA SYSTEM= spect
##.PULSE SEQUENCE= zg30
##.SOLVENT NAME= CDCl3
##.SHIFT REFERENCE= (INTERNAL, CDCl3, 0, 15.7039)
##AUDIT TRAIL= $$ (NUMBER, WHEN, WHO, WHERE, WHAT)
$$ ##TITLE= Audit trail, XWIN-NMR		Version 3.5
$$ ##JCAMPDX= 5.01
$$ ##ORIGIN= Bruker BioSpin GmbH
$$ ##OWNER= she
$$ F:/spectra/data/she/nmr/H-F/1/audita.txt
$$ ##AUDIT TRAIL=  $$ (NUMBER, WHEN, WHO, WHERE, WHAT)
(   1,<2019-03-15 14:35:54.34 +0400>,<she>,<DPX200>,
      <created by zg, POWCHK disabled, PULCHK disabled
       configuration hash MD5:
       00 E9 B6 7A A2 85 ED C7 34 08 36 98 17 FE 4E 26
       data hash MD5: 16K
       52 9F C4 E9 AC 76 06 61 AF D0 EB 26 87 4E 3A A8>)
$$ ##END=
$$ 
$$ hash MD5
$$ EA EC 1F 05 75 34 14 FB 16 C3 89 1B B1 2A A9 C0
##$RELAX= 
##$RELAX= 
##$RELAX= 
##$RELAX= 
##$RELAX= 
##$RELAX= 
$$ Bruker specific parameters
$$ --------------------------
##$DU= <F:/spectra>
##$EXPNO= 1
##$NAME= <H-F>
##$PROCNO= 1
##$TYPE= <nmr>
##$USER= <she>
##$AMP= (0..31)
100 100 100 100 100 100 100 100 100 100 100 100 100 100 100 100 100 100 
100 100 100 100 100 100 100 100 100 100 100 100 100 100 
##$AQSEQ= 0
##$AQ_mod= 1
##$AUNM= <au_zg>
##$AUTOPOS= <>
##$BF1= 200.13
##$BF2= 200.13
##$BF3= 200.13
##$BF4= 200.13
##$BF5= 200.13
##$BF6= 200.13
##$BF7= 200.13
##$BF8= 200.13
##$BYTORDA= 1
##$CFDGTYP= 0
##$CFRGTYP= 5
##$CHEMSTR= <none>
##$CNST= (0..31)
1 1 145 1 1 1 1 1 1 1 1 1 1 1 1 1 1 1 1 1 1 1 1 1 1 1 1 1 1 1 1 1 
##$CPDPRG= <>
##$CPDPRG1= <>
##$CPDPRG2= <>
##$CPDPRG3= <>
##$CPDPRG4= <mlev>
##$CPDPRG5= <mlev>
##$CPDPRG6= <mlev>
##$CPDPRG7= <mlev>
##$CPDPRG8= <mlev>
##$CPDPRGB= <>
##$CPDPRGT= <>
##$D= (0..31)
0 1.2 0 0 0 0 0 0 0 0 0 0.03 0 0 0 0 0 0 0 0 0 0 0 0 0 0 0 0 0 0 0 0 
##$DATE= 1552646153
##$DBL= (0..7)
120 120 120 120 120 120 120 120 
##$DBP= (0..7)
150 150 150 150 150 150 150 150 
##$DBP07= 0
##$DBPNAM0= <>
##$DBPNAM1= <>
##$DBPNAM2= <>
##$DBPNAM3= <>
##$DBPNAM4= <>
##$DBPNAM5= <>
##$DBPNAM6= <>
##$DBPNAM7= <>
##$DBPOAL= (0..7)
0.5 0.5 0.5 0.5 0.5 0.5 0.5 0.5 
##$DBPOFFS= (0..7)
0 0 0 0 0 0 0 0 
##$DE= 6
##$DECBNUC= <off>
##$DECIM= 24
##$DECNUC= <off>
##$DECSTAT= 4
##$DIGMOD= 1
##$DIGTYP= 9
##$DL= (0..7)
0 120 120 120 120 120 120 120 
##$DP= (0..7)
150 150 150 150 150 150 150 150 
##$DP07= 0
##$DPNAME0= <>
##$DPNAME1= <>
##$DPNAME2= <>
##$DPNAME3= <>
##$DPNAME4= <>
##$DPNAME5= <>
##$DPNAME6= <>
##$DPNAME7= <>
##$DPOAL= (0..7)
0.5 0.5 0.5 0.5 0.5 0.5 0.5 0.5 
##$DPOFFS= (0..7)
0 0 0 0 0 0 0 0 
##$DQDMODE= 0
##$DR= 18
##$DS= 0
##$DSLIST= <SSSSSSSSSSSSSSS>
##$DSPFIRM= 0
$$ [...]
##$SUBNAM2= <"">
##$SUBNAM3= <"">
##$SUBNAM4= <"">
##$SUBNAM5= <"">
##$SUBNAM6= <"">
##$SUBNAM7= <"">
##$SUBNAM8= <"">
##$SUBNAM9= <"">
##$SW= 24.9337681822398
##$SWIBOX= (0..15)
0 0 2 0 0 0 0 0 0 0 0 0 0 0 0 0 
##$SW_h= 4990.01996007984
##$TD= 16384
##$TD0= 1
##$TE= 0
##$TE2= 300
##$TE3= 300
##$TEG= 300
##$TL= (0..7)
0 120 120 120 120 120 120 120 
##$TP= (0..7)
150 150 150 150 150 150 150 150 
##$TP07= 0
##$TPNAME0= <>
##$TPNAME1= <>
##$TPNAME2= <>
##$TPNAME3= <>
##$TPNAME4= <>
##$TPNAME5= <>
##$TPNAME6= <>
##$TPNAME7= <>
##$TPOAL= (0..7)
0.5 0.5 0.5 0.5 0.5 0.5 0.5 0.5 
##$TPOFFS= (0..7)
0 0 0 0 0 0 0 0 
##$TUNHIN= 0
##$TUNHOUT= 0
##$TUNXOUT= 0
##$USERA1= <user>
##$USERA2= <user>
##$USERA3= <user>
##$USERA4= <user>
##$USERA5= <user>
##$V9= 5
##$VALIST= <valist>
##$VCLIST= <CCCCCCCCCCCCCCC>
##$VD= 0
##$VDLIST= <DDDDDDDDDDDDDDD>
##$VPLIST= <PPPPPPPPPPPPPPP>
##$VTLIST= <TTTTTTTTTTTTTTT>
##$WBST= 1024
##$WBSW= 4
##$XGAIN= (0..3)
0 0 0 0 
##$XL= 0
##$YL= 0
##$YMAX_a= 72770
##$YMIN_a= -86027
##$ZGOPTNS= <>
##$ZL1= 120
##$ZL2= 120
##$ZL3= 120
##$ZL4= 120
##$ABSF1= 10
##$ABSF2= 0
##$ABSG= 5
##$ABSL= 3
##$ALPHA= 0
##$AQORDER= 0
##$ASSFAC= 0
##$ASSFACI= 0
##$ASSFACX= 0
##$ASSWID= 0
##$AUNMP= <proc_1d>
##$AZFE= 0.1
##$AZFW= 0.1
##$BCFW= 1
##$BC_mod= 2
##$BYTORDP= 1
##$COROFFS= 0
##$CY= 11.3945322036743
##$DATMOD= 1
##$DC= 2
##$DFILT= <>
##$DTYPP= 0
##$F1P= 18.9103706918063
##$F2P= -1.10871071338519
##$FCOR= 0.5
##$FTSIZE= 0
##$FT_mod= 4
##$GAMMA= 1
##$GB= 0.15
##$INTBC= 1
##$INTSCL= 1
##$ISEN= 128
##$LB= 0.24
##$LEV0= 0
##$LPBIN= 0
##$MAXI= 10000
##$MC2= 0
##$MEAN= 0
##$ME_mod= 0
##$MI= 1.114404
##$NCOEF= 0
##$NC_proc= 0
##$NLEV= 6
##$NOISF1= 3.799351
##$NOISF2= 2.8
##$NSP= 1
##$NTH_PI= 0
##$NZP= 0
##$OFFSET= 15.70392
##$PC= 1
##$PHC0= -9297.706
##$PHC1= 12.20026
##$PH_mod= 1
##$PKNL= yes
##$PPARMOD= 0
##$PSCAL= 0
##$PSIGN= 0
##$REVERSE= no
##$SF= 200.130013532006
##$SI= 16384
##$SIGF1= 3
##$SIGF2= 2
##$SINO= 400
##$SIOLD= 16384
##$SREGLST= <1H.CDCl3>
##$SSB= 0
##$STSI= 0
##$STSR= 0
##$SW_p= 3612.71676300578
##$SYMM= 0
##$S_DEV= 0
##$TDeff= 0
##$TDoff= 0
##$TI= <>
##$TILT= no
##$TM1= 0
##$TM2= 0
##$TOPLEV= 0
##$USERP1= <user>
##$USERP2= <user>
##$USERP3= <user>
##$USERP4= <user>
##$USERP5= <user>
##$WDW= 1
##$XDIM= 8192
##$YMAX_p= 0
##$YMIN_p= 0
$$ End of Bruker specific parameters
$$ ---------------------------------
##NTUPLES= NMR FID
##VAR_NAME=  TIME,          FID/REAL,        FID/IMAG
##SYMBOL=    X,             R,               I
##VAR_TYPE=  INDEPENDENT,   DEPENDENT,       DEPENDENT
##VAR_FORM=  AFFN,          ASDF,            ASDF
##VAR_DIM=   8192,          8192,            8192
##UNITS=     SECONDS,       ARBITRARY UNITS, ARBITRARY UNITS
##FACTOR=    0.0002004,     1,               1
##FIRST=     0,             0,               0
##LAST=      1.6414764,     0,               0
##MIN=       0,             -86027,          0
##MAX=       1.6414764,     72770,           0
$$ Real data points
##PAGE= N=1
##DATA TABLE= (X++(R..R)), XYDATA
0 0 0 0 0 0 0 0 0 0 0 0 0 0 0 8 -8 8 -8 8 -8 13 -16 16 -16 24 -24 29 -32 37 -40 45 -49 56 -64 69 -77 85 -95
37 -95 108 -117 130 -142 158 -175 195 -217 242 -267 300 -337 384 -437 504 -590 703 -854 1079 -1424
57 -1424 2022 -3241 6591 -31998 -86027 59292 4129 -46482 72770 971 -77790 35267
69 35267 18880 -31584 35245 1429 -39018 20812 6110 -11890 16131 -14519 -8607 28435
81 28435 -9183 -13821 11621 -14015 -1453 29515 -2689 -22929 -3636 7066 3360 4233 14086
94 14086 -11719 -32407 22641 24235 -30873 12525 19054 -46168 15952 42863 -47158 -4126 40635
107 40635 -33707 3519 37156 -43152 -9204 36381 -17058 9969 15454 -44262 6736 26337
119 26337 -19706 26158 5292 -56066 23109 29600 -35037 27055 15798 -57901 18072 36979
131 36979 -35865 9109 23860 -35876 2796 28137 -18491 -6699 13915 -3931 -1726 2850
143 2850 -2341 -4319 -2121 12683 3728 -15326 2461 2644 -7607 14953 2735 -16983 6262
156 6262 -1219 -4430 19706 -10935 -15383 21970 -10301 -9571 30529 -20675 -21511 39214 -10769 -23340
170 -23340 35617 -15523 -29283 41100 -1088 -29738 25839 -5253 -24156 28871 3184 -21575
182 -21575 12677 -2840 -9458 16258 -3902 -7662 9027 -8377 -183 12131 -10890 -1369 10780
195 10780 -9286 -184 8199 -8548 -31 7469 -2872 -1551 -2542 133 6058 -3776 1043 3982
209 3982 -13101 4031 15155 -12766 -1361 10633 -15990 2733 19024 -13874 -4417 10149
221 10149 -12235 4757 13682 -14050 -201 6539 -11348 10098 7195 -17445 7574 6408 -15353
234 -15353 12581 6577 -20798 9708 10637 -16317 7325 7243 -16698 6827 11636 -11559 -314
247 -314 4537 -6167 4086 5275 -4837 -2465 -907 2110 4589 -2173 -1719 -1169 -3437 6221 4407
262 4407 -6553 -986 -462 -1443 8552 -291 -8196 2709 -1854 -600 11762 -5266 -10281 7950
276 7950 -2309 -2529 13918 -7077 -12936 11254 518 -5116 11009 -5683 -11393 10587 2260
289 2260 -5179 5995 -4317 -6239 8123 947 -3027 2469 -4863 -842 7366 -2028 -2686 1475 -3796
304 -3796 2055 6024 -3860 -3364 1435 -533 2525 2675 -3180 -3121 -232 3100 3597 -2070 -2861 -1145 -1323
321 -1323 5239 4291 -6239 -2889 1864 -1159 4973 3527 -7748 -2174 3249 -707 4772 1776 -8516
336 -8516 -524 4215 -587 4126 -296 -8606 1995 5300 -1836 2400 -797 -7330 3168 5668 -2425
351 -2425 281 -1033 -5048 3580 5298 -2448 -2079 -1291 -1473 3825 3056 -2756 -2721 -689 1290 3194 579
368 579 -2749 -2454 252 3151 2103 -1507 -2854 -1880 2083 4429 -363 -3620 -1679 -374 3197 4242
384 4242 -2886 -4503 279 884 3205 3513 -4522 -4838 2107 2384 2670 1600 -5687 -3735 4199 3014
400 3014 845 -565 -5190 -1621 5209 2445 -1010 -1832 -3855 197 5432 1695 -2899 -2864 -1466 2282
416 2282 4326 -40 -4125 -2483 1466 3268 1746 -1500 -3680 -1489 3318 3287 -785 -2548 -2599 -47
432 -47 4544 2391 -3484 -3010 -326 1775 4178 225 -4918 -1796 1904 2347 2619 -1523 -4880 -298
448 -298 3316 2415 747 -3200 -3851 1729 3996 1425 -1480 -3868 -1416 3462 2826 -247 -2340 -3149
464 -3149 683 3908 1223 -1480 -2471 -1964 2377 3621 -678 -2582 -1864 115 3392 1753 -2468 -2119
480 -2119 -440 1440 3019 -382 -3033 -798 486 1866 2340 -2096 -3100 766 1513 1700 734 -3388
496 -3388 -1761 2566 1381 493 -555 -3238 111 3227 229 -393 -874 -2658 1444 3316 -893 -1309
512 -1309 -892 -1192 2554 2186 -2249 -1484 -94 452 2454 19 -2472 -322 127 1045 2243 -1637 -2237
529 -2237 1002 112 1058 1748 -2882 -1509 2563 -31 33 634 -2711 397 3022 -1298 -666 197 -2069
546 -2069 2075 2684 -2649 -820 56 -1595 3425 2266 -4055 -963 861 -605 3216 870 -4177 -74
562 -74 1576 -103 1735 -763 -2594 1348 1109 49 584 -2634 -972 3454 704 -681 -756 -3484 909
579 909 4844 -96 -1728 -1592 -2716 2428 3858 -952 -951 -2005 -2171 3836 1882 -2553 783 -1272 -1728
596 -1728 4655 -551 -4796 2838 1300 -1445 3304 -2456 -5235 3884 2985 -474 1428 -4119 -4038 4204
612 4204 2817 968 333 -5906 -1856 5223 736 467 717 -5369 -46 5178 -1672 -1075 1503 -2632
628 -2632 1202 3379 -2879 -2150 608 898 3681 128 -4463 -1431 -199 2727 5744 -2561 -5764 505
644 505 -140 2043 5714 -2800 -5186 1105 84 1686 3296 -3114 -1779 1738 -1048 1740 321 -4460
660 -4460 3231 3557 -4156 1065 -215 -5762 5621 5940 -5786 -748 158 -5276 5289 6590 -4842
675 -4842 -2458 -440 -2391 4401 3307 -3069 -910 -1531 -565 4134 -836 -2307 2337 -1526 -553 3635
691 3635 -3067 -2707 3936 602 -181 745 -3898 -1003 3177 1386 1813 -2211 -4791 2534 1639 -864
707 -864 4504 -2354 -6558 4718 1978 -3712 4343 -485 -5872 4361 1991 -4370 2155 623 -2090
722 -2090 2862 -713 -2350 1486 -1396 1446 3622 -4342 -1230 2948 -3516 2232 5294 -6006 -1954
737 -1954 4488 -2989 689 4445 -4206 -1595 3021 -1524 748 1381 -2379 934 170 -1315 2913 -1495
753 -1495 -2793 4215 -708 -2973 3803 -1506 -3059 4528 -417 -2942 2639 -1038 -1308 2512 -1189
768 -1189 110 1037 -3087 2202 1971 -4408 2710 1998 -5753 3564 3260 -6783 2767 4107 -6372 1895
784 1895 4187 -5320 995 3358 -3773 898 2021 -2495 1044 266 -1200 2077 -1517 -966 3223 -2524
800 -2524 -1176 4115 -2590 -1459 3858 -2637 -1164 3814 -2158 -1055 2304 -1898 557 1419 -2347
815 -2347 1757 313 -3186 3477 440 -4257 3799 419 -4651 4577 859 -5601 3677 1710 -4251
830 -4251 3005 806 -3861 2323 764 -1573 2132 -1420 -1374 2240 -1775 753 2947 -4171 -153 3749
846 3749 -3712 453 4142 -4142 -378 3735 -3595 -177 3530 -2458 60 1845 -2541 390 901
861 901 -1122 2522 -342 -2946 1803 -689 -1167 4191 -1021 -3198 2388 -1288 -1503 4013 -546 -1893
877 -1893 1458 -2093 -269 2764 -1496 685 1510 -3625 794 1923 -3138 2802 2699 -4987 749 2089
893 2089 -4049 2615 3695 -4001 181 1218 -3664 1911 3199 -1907 293 -426 -2533 1666 963 -343
909 -343 2048 -1533 -2311 1521 -773 251 3246 -1597 -1801 1200 -1897 90 3121 -714 -275 211
925 211 -2889 607 2154 -819 1626 213 -3463 860 794 -1527 3206 1055 -3564 513 -28 -1870
941 -1870 3136 1556 -2073 406 -1335 -1941 2574 1327 -173 677 -2564 -1427 2136 -128 882 1955
957 1955 -2728 -1343 1413 -1324 1227 2782 -2172 -1004 864 -2055 695 2655 -796 -10 -102 -2609
973 -2609 519 2087 -40 827 -485 -2411 357 908 155 1580 -356 -1907 114 -26 272 1443
989 1443 -534 -560 574 -1086 -103 1018 -642 854 1008 -2003 -226 798 -1227 1418 1808 -2013
1005 -2013 -548 381 -1471 1640 2150 -1803 -697 307 -1269 1038 1589 -981 -130 44 -1184 498
1021 498 903 -276 276 -102 -695 106 -188 105 980 -40 -430 -369 -900 644 1301 -396 -161 -225 -1243
1040 -1243 693 1276 -544 136 -166 -1426 878 1341 -889 -83 87 -924 868 828 -1054 -17 319
1057 319 -552 656 448 -805 -39 70 -77 797 -68 -789 124 14 196 617 -589 -427 581 -284 -75
1076 -75 645 -511 -274 615 -360 -103 541 -529 -155 707 -234 -351 146 -117 258 326 -384 -307 59 284
1096 284 326 -252 -208 -1 -363 425 715 -634 -299 162 -548 748 940 -1246 -385 717 -643 510 1085
1115 1085 -1310 -360 953 -803 262 1347 -1176 -705 1033 -421 -82 982 -759 -608 904 -200
1131 -200 -471 667 6 -539 211 193 -308 110 380 -352 -253 537 -260 -498 837 72 -883 503 70 -642
1151 -642 983 57 -1254 749 337 -932 925 219 -1291 641 277 -803 1037 77 -1375 660
1167 660 397 -580 826 -185 -1008 769 116 -501 839 -221 -804 580 -26 -122 711 -505 -553 614
1185 614 -33 -96 377 -313 -157 245 -138 102 169 -68 -48 -294 211 366 -513 214 375 -838 407 511
1205 511 -1094 767 710 -1741 647 1102 -1653 816 1082 -2153 797 1405 -2140 870 1539 -2430 498
1222 498 1688 -1950 644 1417 -2270 420 1736 -1666 232 1281 -1588 92 1223 -923 147
1237 147 724 -965 -130 793 -41 -220 -14 67 -241 -39 762 -346 -559 966 -608 -817 1760 -442
1255 -442 -1346 1729 -609 -1395 2264 -636 -1660 2425 -821 -1923 2647 -597 -1763 2558 -1027 -1832
1271 -1832 2852 -922 -1721 2755 -1143 -1728 2689 -1027 -1309 2585 -1424 -1447 2606 -957 -1148 2062
1287 2062 -1181 -965 1935 -814 -653 1432 -910 -650 1068 -223 -114 268 -420 57 36 189 308 -792
1305 -792 367 564 -1335 870 1009 -2002 919 1115 -2417 1506 1368 -3193 1644 1767 -3515 1776
1321 1776 1913 -3850 1911 2023 -4058 2058 2211 -4235 1820 2232 -3956 1886 2086 -3855 1730 1857
1337 1857 -3621 1709 1920 -3083 1200 1228 -2566 1406 1270 -2040 777 613 -1419 707 634 -492 135
1354 135 -349 -16 219 -151 843 -567 -1028 1522 -490 -1107 2182 -916 -1697 2511 -1017 -1514 3160
1371 3160 -1523 -2038 3497 -1515 -1877 3758 -1934 -1963 3981 -2218 -1889 4370 -2239 -2056 4127 -2397
1387 -2397 -1772 4331 -2311 -1777 3951 -2451 -1728 3942 -1780 -1396 3001 -2133 -1136 2946 -1443 -789
1403 -789 2067 -1468 -650 1473 -852 41 898 -750 -37 89 -209 363 -418 580 694 -1690 405 869
1421 869 -1747 1698 1372 -3125 1192 1247 -3375 2434 2384 -3972 1483 1501 -4325 2621 2828 -4194 1899
1438 1899 1762 -4856 2094 2694 -3551 2386 1531 -4860 1675 2062 -3010 2735 1587 -4140 1007 936
1454 936 -2403 2861 1613 -3031 370 47 -1674 2016 1277 -1029 130 -957 -1002 843 633 1041 57
1471 57 -1609 83 -427 -739 2526 495 -1565 978 -1706 -1873 3369 443 -1212 2168 -2420 -2652
1487 -2652 3329 -269 -498 3636 -2809 -3112 3182 -1257 -457 4666 -2332 -2798 2744 -2485 -909 5159
1503 5159 -1216 -2147 2079 -3008 -1391 4318 -251 -728 1701 -3093 -1862 2675 437 783 1323 -2585
1519 -2585 -1615 788 195 1594 1226 -1175 -1056 -1222 -224 1902 718 360 72 -2505 -551 1402 -478
1536 -478 1888 1693 -3284 -801 920 -1789 2511 2842 -3195 -375 634 -3190 2167 3456 -2386 299
1552 299 384 -3856 1529 2945 -1771 1375 687 -3877 576 1649 -1196 2383 955 -3338 63 368
1568 368 -1153 2569 1269 -1985 -141 -964 -1177 2300 1255 -623 -76 -1552 -886 1297 504 794 493
1585 493 -1737 -575 206 -358 1704 734 -1494 282 -620 -1406 1937 795 -858 1172 -1293 -2025 2050
1602 2050 399 -645 2001 -1288 -2115 1795 -366 -495 2634 -1162 -1962 1654 -859 -609 2517 -862
1618 -862 -1192 1511 -1377 -803 2156 -493 -462 1185 -1456 -587 1400 -534 257 997 -1295 -382 533
1635 533 -420 862 429 -1082 202 -77 -485 1050 -128 -589 804 -754 -511 1340 -593 -383 1125
1652 1125 -1028 -262 1287 -1115 -56 1430 -1243 -202 1151 -1171 264 1194 -1421 140 1020 -1263
1668 -1263 479 956 -1331 386 577 -1156 917 623 -1380 549 305 -928 1028 155 -1072 855
1684 855 -130 -917 1111 -21 -710 878 -504 -633 1058 -398 -368 1009 -604 -452 661 -614 174
1701 174 906 -817 -124 424 -762 423 594 -699 437 2 -1028 776 367 -690 766 -233 -939
1718 -939 940 -160 -671 1235 -295 -906 889 -485 -471 1342 -497 -629 1002 -762 -493 1238 -456
1735 -456 -239 812 -1006 -228 1098 -587 0 735 -866 -27 593 -649 425 532 -850 177 256
1752 256 -565 569 131 -617 562 -154 -626 715 -63 -399 621 -470 -340 825 -437 -262 724 -557
1770 -557 -129 614 -630 153 604 -817 184 567 -761 352 342 -843 635 331 -985 663 291
1787 291 -930 725 155 -864 888 5 -933 930 45 -824 823 -93 -645 863 -259 -610 850
1804 850 -243 -479 704 -281 -247 544 -477 -78 591 -379 -33 266 -441 241 175 -400 504 -48 -612 506
1824 506 -99 -291 794 -478 -587 886 -421 -380 1082 -545 -536 883 -689 -238 1240 -682 -492 910
1842 910 -668 -174 972 -638 -99 703 -815 16 789 -554 128 334 -702 380 332 -612 475 135
1860 135 -593 488 -71 -386 734 -304 -491 768 -342 -260 736 -607 -125 823 -779 -31 879 -875
1878 -875 3 781 -883 295 718 -1147 275 773 -980 398 569 -1017 437 362 -907 740 310
1895 310 -981 532 94 -608 854 -145 -682 777 -308 -452 908 -349 -349 652 -643 -40 888 -673
1913 -673 -28 533 -770 367 515 -860 592 291 -1080 797 299 -967 974 -83 -1161 1292
1929 1292 -36 -1163 1361 -213 -1206 1369 -324 -971 1567 -533 -1118 1477 -462 -796 1440 -693
1945 -693 -734 1331 -765 -440 1375 -806 -482 956 -730 42 888 -898 -3 569 -713 420 362 -678
1963 -678 492 -180 -586 1021 -237 -583 899 -737 -302 1396 -968 -341 1381 -1294 -199 1632
1979 1632 -1323 -56 1432 -1733 187 1747 -1716 169 1415 -1852 498 1444 -1851 621 1194
1994 1194 -2005 733 1209 -1705 845 726 -1813 1011 694 -1534 1091 381 -1471 927 98 -908
2010 -908 1259 -222 -1008 922 -413 -344 1165 -658 -272 693 -1071 313 1071 -1014 342 342 -1355
2027 -1355 1050 617 -1391 1112 86 -1602 1536 90 -1484 1731 -368 -1601 2102 -455 -1642
2042 -1642 2089 -616 -1273 2365 -1066 -1558 2307 -904 -980 2412 -1304 -1245 1993 -1212 -428 2283 -1447
2059 -1447 -844 1555 -1324 -10 1679 -1273 -36 939 -1490 310 1020 -835 704 151 -1354 651
2075 651 44 -474 1480 -411 -1045 730 -1000 71 2062 -1069 -589 993 -1782 378 2128 -1582
2091 -1582 179 1194 -2484 647 2032 -1978 759 1292 -2588 974 1445 -2411 1328 1446 -2425 1121
2107 1121 743 -2470 1641 1176 -1969 1438 144 -2455 1546 817 -1231 1577 -457 -1968 1380 140
2123 140 -633 1520 -627 -1057 843 -725 45 1362 -779 -13 399 -1361 555 712 -809 1300 -19
2140 -19 -1953 967 86 -763 2265 -505 -2064 1490 -701 -939 2916 -737 -1851 1823 -1370 -932
2156 -932 3130 -1130 -1480 2226 -1610 -957 2721 -1380 -781 2358 -1779 -794 2195 -1559 -294 2159
2172 2159 -1529 -347 1379 -1733 232 1796 -1200 31 568 -1460 623 901 -824 660 -60 -1103
2188 -1103 788 -61 -304 1096 -802 -484 1092 -1052 -21 1367 -1211 254 1124 -1955 393 1509
2204 1509 -1645 816 1105 -2366 782 1239 -1929 1457 993 -2677 1103 1017 -1985 1709 659 -2533
2220 -2533 1469 677 -2001 1762 448 -2116 1447 246 -1570 1677 -12 -1595 1399 -79 -1029
2235 -1029 1306 -429 -786 1165 -576 -405 1072 -721 -186 743 -808 323 618 -1023 488 358
2251 358 -971 837 103 -990 1081 -243 -1054 1430 -337 -1055 1496 -649 -929 1763 -875 -952 1875
2268 1875 -942 -867 1804 -1086 -640 1844 -1236 -536 1756 -1319 -346 1705 -1302 -225 1381 -1429
2284 -1429 182 1501 -1449 -5 1083 -1239 478 1021 -1334 294 634 -1043 701 552 -1038 423
2300 423 103 -537 891 -203 -774 683 -216 -101 840 -887 -353 892 -606 298 850 -1339 -93
2317 -93 857 -743 776 658 -1728 289 851 -944 973 459 -1668 729 529 -1246 1122 423 -1451
2334 -1451 985 270 -1359 979 204 -935 1357 -24 -1482 644 64 -253 1446 -413 -1281 472
2350 472 -254 156 1437 -555 -898 210 -562 485 1202 -731 -389 251 -643 495 533 -737 421 316
2368 316 -753 392 -139 -699 1024 347 -531 384 -930 -815 1508 471 -340 303 -1384 -687 1603
2385 1603 223 -100 517 -1424 -581 1269 -148 212 710 -1242 -248 895 -738 158 910 -618 215
2402 215 292 -1342 140 1033 -81 566 -95 -1531 3 714 343 982 -352 -1487 -75 327 541 1055
2420 1055 -556 -993 168 -204 268 923 -471 -295 378 -664 18 603 -523 348 729 -806 -285 16
2438 16 -525 1013 893 -916 -377 -297 -544 1201 800 -738 -126 -529 -659 1146 626 -495 91 -509 -467
2457 -467 823 73 -276 512 -276 -301 328 -430 0 722 -171 -19 107 -826 68 739 9 335 -158 -1088
2477 -1088 216 651 -48 475 -194 -919 322 255 -178 685 -140 -765 402 -5 -289 621 -200 -426 578
2496 578 -260 -484 518 -101 -116 532 -401 -380 386 -200 42 500 -308 -241 97 -222 319 350 -343 -48 -18
2517 -18 -210 357 84 -196 236 -233 -243 460 -60 -96 307 -429 -69 588 -328 -89 437 -492 3 581 -436
2538 -436 24 396 -632 150 629 -523 -22 302 -520 339 470 -662 74 319 -430 326 278 -608 106
2557 106 233 -272 388 91 -623 54 296 35 194 -207 -424 126 236 175 27 -333 -90 76 69 384 -107
2578 -107 -517 206 145 -23 413 -398 -536 674 139 -301 329 -467 -396 941 31 -469 353 -549 -318 1145
2598 1145 -2 -643 227 -485 -87 1166 -180 -773 220 -218 56 818 -291 -610 176 -36 213 460
2616 460 -411 -463 142 226 362 -54 -551 -117 220 342 262 -482 -407 226 113 349 235 -744 -257 454 48
2637 48 391 46 -993 98 772 -159 194 -77 -927 475 795 -463 102 -96 -823 716 762 -656 -31
2656 -31 -167 -582 981 583 -932 -126 34 -227 916 229 -965 -34 149 -20 722 -18 -863 -41 255
2675 255 297 415 -389 -605 83 360 442 -76 -623 -79 163 213 503 -396 -706 356 154 85 579 -717 -745
2696 -745 869 206 -181 448 -828 -520 1222 10 -493 444 -728 -308 1287 -132 -615 349 -609 0
2714 0 1273 -365 -769 281 -296 274 933 -639 -653 353 -67 359 522 -690 -432 279 115 465 79
2733 79 -733 -148 274 276 366 -439 -545 304 170 220 244 -673 -228 487 -61 285 141 -952 129 725 -301
2754 -301 260 -8 -1046 596 826 -727 227 104 -990 782 732 -958 244 158 -883 903 622 -1082
2772 -1082 162 224 -542 889 265 -1068 294 272 -383 675 -8 -815 358 195 -215 486 -192 -561
2790 -561 306 193 38 76 -357 -28 218 -32 236 -220 -437 483 5 -339 586 -316 -616 810 -18 -534
2810 -534 675 -356 -590 992 -161 -635 703 -348 -395 917 -445 -441 889 -564 -346 1019 -593
2827 -593 -377 938 -628 -267 989 -633 -328 928 -516 -310 716 -386 -123 500 -473 -70 435
2844 435 -217 103 51 -389 320 91 -269 362 -193 -402 537 6 -200 278 -478 -109 691 -202 -94 76
2864 76 -716 424 732 -668 157 162 -1044 682 878 -1007 208 317 -1120 754 906 -1191 98 544
2882 544 -754 542 418 -1014 319 495 -425 473 -181 -872 651 404 -192 493 -705 -885 988 552
2900 552 -185 183 -795 -543 902 423 -40 -137 -691 47 506 -4 295 -321 -681 819 309 -796 280
2919 280 -174 -401 1296 71 -1393 133 80 46 1362 -240 -1377 -7 -93 501 1455 -686 -1187 235
2937 235 -350 546 1348 -1013 -775 779 -487 23 940 -795 -252 1041 -368 -417 115 -538 489 1054
2955 1054 -214 -561 -806 -403 1340 915 -407 -426 -1109 -412 1553 677 -446 -173 -991 -309 1226 227
2973 227 -258 40 -650 184 630 -754 2 615 -340 555 113 -1628 146 1146 -82 714 -79 -1998
2991 -1998 -45 1257 319 734 -363 -1785 31 861 371 723 -503 -1094 378 83 -51 833 -369
3008 -369 -476 718 -401 -614 520 -79 285 926 -680 -973 11 166 993 731 -874 -716 -363 -60
3026 -60 1374 593 -952 -227 -454 -400 1341 379 -888 249 -199 -540 754 -64 -443 767 -108 -510
3044 -510 274 -596 -53 1152 -137 -316 111 -1097 30 1439 -120 -277 68 -1096 46 1180 -136
3061 -136 -88 138 -771 26 535 -163 294 42 -501 292 -74 -414 579 101 -221 470 -528 -607 729 157
3081 157 -62 418 -628 -436 560 -81 199 447 -728 -143 422 -387 398 402 -815 259 410 -778 374
3100 374 491 -712 382 274 -859 383 425 -558 390 115 -667 362 153 -315 481 -205 -495 544
3118 544 -28 -261 413 -384 -222 652 -232 -262 367 -324 -18 463 -303 -39 186 -331 288 224 -473 177 62
3139 62 -245 622 -86 -749 441 125 -243 656 -281 -755 542 68 -170 652 -414 -587 545 -57 -4
3158 -4 529 -643 -249 695 -347 -78 459 -625 76 718 -593 -179 422 -494 268 665 -608 -290 143
3177 143 -222 544 395 -622 -209 -28 18 648 16 -522 68 -164 26 629 -209 -364 225 -178 159 419
3197 419 -532 -101 437 -192 238 78 -757 296 563 -363 289 -8 -912 487 644 -424 283 -96 -882
3216 -882 589 629 -467 110 -149 -497 628 253 -438 163 -181 -211 619 -94 -390 234 -267 61 656 -397
3236 -397 -427 266 -114 267 397 -575 -233 281 -71 369 126 -613 49 163 -107 526 -96 -701 329 212
3256 212 -129 441 -301 -530 543 121 -153 288 -411 -257 587 -79 -55 256 -602 18 708 -306 -75 225
3276 225 -606 253 724 -551 -170 279 -425 302 513 -520 -127 140 -248 411 245 -494 -33 4 -21 536
3296 536 -140 -491 227 -51 6 488 -336 -315 373 -161 79 409 -522 -146 470 -202 191 219 -704 162 583
3317 583 -361 168 145 -689 325 550 -426 156 94 -600 354 440 -313 77 -97 -303 453 101 -293 145 -187
3338 -187 -40 466 -251 -211 292 -293 68 491 -415 -177 278 -262 227 323 -579 -43 309 -214 294 82 -585
3359 -585 225 212 -309 392 -16 -575 359 148 -269 382 -196 -469 525 72 -271 303 -306 -217 584 -184 -201
3380 -201 378 -389 -95 611 -285 -164 339 -423 31 584 -361 -153 306 -280 125 308 -360 13 172 -204
3400 -204 196 60 -256 183 -42 -113 348 -194 -238 344 -138 -42 340 -405 -93 476 -311 -34 367 -484 35
3421 35 475 -445 77 361 -579 140 504 -468 70 267 -513 262 383 -505 144 244 -417 270 212 -396 227
3442 227 70 -337 350 78 -330 252 -21 -188 327 -130 -194 312 -130 -103 255 -199 -10 238 -271 51 226
3463 226 -310 97 189 -292 176 97 -343 274 88 -362 268 -14 -266 393 -141 -327 454 -157 -290 525 -236
3484 -236 -308 516 -276 -226 607 -299 -344 534 -232 -202 493 -266 -173 392 -283 -103 395 -218 -20 199 -302 88
3506 88 240 -249 133 146 -301 103 108 -116 224 -36 -218 165 -54 -15 230 -205 8 228 -361 57 372 -367
3528 -367 66 355 -477 46 373 -477 131 447 -469 -12 269 -389 226 274 -404 162 96 -450 320 198 -344
3549 -344 349 -50 -515 402 100 -370 426 41 -465 227 18 -193 395 32 -300 53 -96 35 249 -47
3569 -47 44 -10 -369 152 264 -146 206 -8 -431 200 148 -190 329 22 -317 171 -134 -121 472 -173 -228 373
3591 373 -348 -227 556 -245 -152 568 -462 -390 616 -167 -191 535 -304 -343 344 -201 -40 438 -189 -127 108
3612 108 -262 155 263 -212 171 64 -456 151 216 -149 290 43 -411 96 71 -55 302 -7 -166 3 -239
3633 -239 133 408 -231 -3 137 -479 159 455 -370 115 270 -561 68 422 -314 129 197 -420 147 148 -337
3654 -337 278 102 -352 301 -63 -393 448 5 -399 458 -30 -482 367 53 -294 353 -41 -355 214 18
3674 18 -92 163 -82 2 70 -219 147 160 -257 192 90 -373 224 131 -333 287 153 -394 153 69 -192 343
3696 343 -48 -301 265 -129 -134 451 -201 -240 379 -311 -122 602 -299 -315 425 -219 -135 491 -234 -237 301 -179
3718 -179 -40 298 -185 -52 67 -205 230 119 -319 160 49 -273 273 36 -307 260 11 -277 257 -6
3738 -6 -183 211 -79 -71 210 -239 0 322 -252 26 231 -400 137 417 -415 38 326 -430 92 435 -348
3759 -348 9 193 -348 195 318 -300 22 25 -204 343 72 -323 176 -78 -236 405 6 -303 204 -104 -141
3780 -141 371 -78 -254 150 -52 27 161 -235 -9 165 -159 204 77 -437 148 204 -214 321 47 -564 194
3801 194 292 -197 265 -12 -423 266 154 -182 255 -82 -219 347 -95 -201 287 -191 -53 532 -233 -383
3821 -383 205 -99 143 543 -295 -458 96 -9 266 390 -273 -317 -121 -40 458 240 -325 -86 -135 -101 445
3842 445 38 -325 219 -25 -197 227 -145 -169 377 31 -129 54 -394 -36 579 41 -51 -89 -625 122 709
3863 709 -62 -68 -6 -558 106 582 -126 -23 63 -359 142 308 -222 19 106 -50 275 -107 -476 161 243 152
3885 152 336 -379 -611 211 298 242 344 -456 -603 153 271 328 194 -486 -319 159 85 226 56 -367 67
3906 67 165 -202 100 12 -224 337 192 -341 -89 -133 -3 606 113 -469 -171 -180 169 684 -86 -445 24 -183
3928 -183 119 617 -192 -378 174 -115 51 380 -292 -261 361 63 -38 5 -340 51 437 49 -52 -201 -364
3949 -364 246 436 2 -60 -297 -308 357 350 -75 -118 -271 -45 357 42 -129 -30 -191 116 279 -240 -104 116
3971 116 -145 220 244 -479 -145 261 -37 235 65 -532 -8 350 -2 128 -97 -409 206 263 -102 128 -163
3992 -163 -334 368 251 -207 27 -156 -180 437 162 -331 -50 -5 51 280 -52 -238 -8 52 185 123 -251 -125
4014 -125 60 55 274 -25 -426 5 214 69 164 -195 -370 198 194 5 101 -280 -229 343 78 -91 69 -324
4036 -324 -84 497 -67 -295 66 -179 108 492 -235 -404 120 11 194 318 -347 -307 134 93 276 138 -427
4057 -427 -174 224 129 203 -77 -410 74 294 51 -12 -203 -175 236 214 13 -135 -312 57 393 60 -61 -216
4079 -216 -379 323 497 -204 -193 -122 -260 423 412 -421 -184 25 -151 410 235 -523 -122 145 -4 371 -7
4100 -7 -619 61 351 31 160 -214 -468 248 366 -4 -10 -287 -247 321 302 2 -170 -353 60 430 89 -96
4122 -96 -223 -260 327 386 -177 -140 -125 -121 414 215 -326 -132 -93 29 470 1 -444 -52 10 166 385 -295 -421
4145 -421 173 69 138 278 -415 -286 323 50 110 153 -507 -135 465 5 -5 17 -459 95 510 -139 -139 2
4167 2 -284 199 423 -202 -167 -3 -117 261 279 -209 -193 -43 128 285 -29 -198 -69 -45 228 240 -256 -103
4189 -103 93 -134 268 217 -434 -37 201 -166 271 136 -526 85 332 -222 146 88 -455 177 309 -256 100
4210 100 53 -344 179 238 -202 36 -47 -166 265 87 -195 29 -92 6 260 -95 -107 113 -137 51 260 -167
4232 -167 -72 116 -155 132 212 -251 -7 122 -118 171 94 -231 93 66 -132 210 18 -202 141 -8 -68 268
4254 268 -102 -190 218 -59 -30 239 -214 -93 270 -193 -3 287 -308 -67 322 -234 17 283 -348 -51 364
4275 364 -197 -69 206 -239 -3 253 -134 -46 85 -125 44 116 -47 -16 -84 1 199 -46 -53 65 -151 90
4297 90 271 -214 -54 164 -197 122 257 -275 2 180 -208 195 231 -389 29 249 -191 150 124 -370 109
4318 109 263 -210 73 69 -270 135 196 -116 39 -66 -152 209 89 -95 10 -161 -4 277 -92 -116 109 -151
4340 -151 33 249 -168 -78 155 -89 73 142 -229 -60 145 36 139 -69 -271 105 150 31 120 -186 -218 226
4362 226 61 -6 180 -226 -165 299 4 -62 159 -234 -6 354 -186 -162 167 -126 133 299 -349 -215 218
4383 218 -36 164 248 -362 -250 188 84 172 110 -322 -162 145 124 81 -97 -146 62 29 13 26 -180 45 274
4406 274 -52 -89 -72 -251 195 457 -82 -222 -172 -232 354 467 -176 -207 -109 -167 349 331 -237 -85 -23 -137 275
4429 275 130 -302 66 155 -41 101 -164 -301 291 304 -22 -86 -382 -212 421 334 19 -145 -453 -164 454
4450 454 304 -29 -186 -346 3 330 92 -84 -110 -66 143 50 -153 -62 3 155 288 -172 -388 -37 88 350
4472 350 389 -374 -530 31 177 377 335 -442 -427 151 119 228 254 -348 -221 233 28 33 85 -248 71 362 -123
4495 -123 -249 -60 -36 339 343 -262 -381 -124 95 449 243 -302 -352 -162 173 444 71 -310 -214 -53 203 241
4517 241 -119 -196 34 59 118 -11 -262 -25 218 118 77 -205 -368 149 347 98 8 -341 -361 334 379 -22
4539 -22 -37 -282 -221 369 232 -141 -11 -144 -78 356 68 -271 -13 23 101 267 -157 -322 83 197 166 89 -282
4562 -282 -243 142 214 142 -56 -296 -107 175 194 107 -210 -267 115 194 68 5 -243 -137 267 100 -93 -14 -182
4585 -182 -29 298 28 -154 -32 -108 82 283 -129 -199 11 23 202 144 -287 -159 128 73 192 38 -337 -68
4607 -68 175 67 172 -58 -329 31 225 56 59 -108 -185 170 140 -74 -18 -64 -33 194 43 -141 -50 -56 107 202
4631 202 -63 -172 -110 -12 234 142 -201 -117 -52 1 240 40 -216 1 -3 -79 198 -5 -238 101 60 -88 120
4654 120 -92 -179 241 118 -140 5 -107 -52 291 85 -151 -17 -115 2 260 54 -101 -47 -98 60 189 -48
4676 -48 -69 -10 -42 97 36 -123 50 55 -47 111 -49 -169 107 56 -17 121 -129 -208 142 79 5 76 -166 -118 155
4701 155 -1 -18 70 -136 -30 126 -58 29 80 -154 50 130 -133 6 71 -113 118 75 -189 34 98 -97 107
4724 107 36 -162 73 54 -81 120 17 -140 68 37 -42 111 -45 -92 106 3 -42 73 -47 -18 60 -59 36
4747 36 84 -99 1 48 -82 84 24 -144 75 36 -132 124 26 -157 64 -1 -125 156 -12 -168 105 24 -91
4770 -91 106 -47 -123 167 -4 -74 101 -79 -67 126 -27 -10 63 -124 1 146 -41 -3 23 -96 93 96 -112
4793 -112 35 35 -62 115 30 -122 75 11 -47 173 -18 -174 74 32 26 142 -104 -167 125 56 4 91 -141 -103 119
4818 119 12 25 53 -173 -38 138 -7 28 -46 -161 88 129 -99 -4 -53 -98 165 56 -132 42 -44 -63 184
4841 184 15 -150 27 -24 15 208 -74 -181 97 44 57 114 -150 -100 132 38 52 37 -182 -29 131 49 56 -65
4865 -65 -199 107 158 -14 14 -132 -128 209 85 -98 4 -125 -65 223 40 -143 9 -100 -18 226 -43 -197
4887 -197 9 -12 69 143 -161 -139 77 36 60 34 -179 -49 94 53 90 -66 -189 80 135 29 51 -154 -146 211
4911 211 122 -55 0 -153 -54 256 53 -110 3 -120 0 246 18 -156 -27 -46 117 177 -100 -150 3 34
4933 34 129 51 -168 -40 36 38 154 -62 -203 46 63 30 115 -150 -197 159 98 -37 38 -156 -97 231 49 -108
4957 -108 -1 -109 -13 231 0 -147 -46 -66 96 199 -57 -156 -38 39 167 63 -141 -58 -2 55 185 -21
4979 -21 -164 20 17 48 173 -110 -195 123 60 8 81 -164 -104 212 61 -81 3 -135 -11 204 16 -76 -52 -111
5003 -111 60 187 -51 -93 -76 -35 154 78 -154 -38 -19 7 166 -45 -181 52 18 4 161 -111 -203 116 63
5026 63 32 118 -172 -181 184 118 -10 21 -127 -91 158 63 -30 -2 -69 6 114 3 -32 -54 -39 131 43 -101 -27 -38
5052 -38 36 180 -55 -178 20 -3 49 189 -88 -198 42 -14 53 156 -133 -162 90 40 12 75 -140 -77 148 -8
5076 -8 -40 8 -102 32 112 -36 -44 -63 -93 123 117 -68 -41 -68 -39 189 41 -131 7 -9 -29 151 18 -102 66
5101 66 0 -31 90 -32 -107 80 46 12 17 -110 -27 128 66 -2 -62 -108 38 101 7 34 -73 -129 79 70 -17 30 -97
5128 -97 -102 142 28 -102 49 -46 -52 145 -40 -128 86 -14 -56 128 -36 -125 71 21 -22 93 -56 -86 86 57
5152 57 -4 16 -61 -7 62 9 17 -2 -46 46 31 -11 56 -41 -64 97 51 -48 24 -31 -29 116 -25 -83 55 -22 -24 98 -23
5181 -23 -62 63 -35 -13 86 -54 -72 43 -21 2 50 -70 -16 46 -28 14 15 -51 23 13 -66 60 20 -78 56 15 -86
5208 -86 72 12 -69 88 5 -99 71 41 -45 65 3 -58 69 -10 -43 78 3 -32 41 -12 -10 66 -24 -9 39 -31 11
5235 11 25 -15 41 1 -81 50 27 -38 41 -25 -69 84 -11 -79 73 -38 -106 81 18 -69 79 -64 -91 129 2 -90
5261 -90 55 -25 -47 82 -20 -42 70 -25 -21 55 -52 -10 54 -16 39 35 -92 8 74 -3 82 12 -103 52 55 -29 93
5288 93 25 -100 39 14 -40 86 10 -71 66 -12 -63 50 2 9 68 -79 -65 25 -13 63 64 -109 -45 -13 -64 120 92
5315 92 -112 -20 -29 -104 136 62 -119 56 8 -141 93 69 -83 120 14 -174 79 52 -75 128 70 -110 10
5338 10 -10 -30 132 81 -70 -31 -27 -4 60 53 39 -16 -81 13 18 14 121 -12 -79 64 -50 -68 158 38 -70 73 -110
5365 -110 -113 169 17 -66 127 -98 -146 139 0 -22 151 -101 -149 119 -15 -26 154 -50 -76 45 -78 -25 153
5388 153 -10 -30 7 -95 9 93 2 51 25 -111 12 67 28 71 -2 -77 30 14 1 72 -1 17 27 -69 32 67
5414 67 -54 73 50 -123 49 33 -112 140 74 -189 39 54 -127 124 63 -201 67 57 -169 127 72 -178 86
5437 86 63 -161 90 44 -161 105 80 -134 31 39 -79 93 66 -83 3 48 -28 21 43 8 -60 -2 92 20 -3 51
5463 51 -86 -26 170 -33 -76 116 -60 -55 196 -46 -76 148 -96 -65 206 -69 -95 158 -71 -72 152 -123 -78 179
5487 179 -78 -80 131 -108 -50 158 -52 -54 77 -108 -32 139 -22 -51 2 -80 24 83 -11 -23 -14 -25 27 23 14 27 -37
5514 -37 0 47 -11 41 21 -49 91 61 -109 64 42 -75 143 40 -166 92 45 -128 175 70 -180 83 44 -127
5538 -127 180 58 -192 99 55 -145 119 53 -149 105 29 -146 86 40 -111 66 31 -97 23 8 -51 52
5560 52 25 -62 -39 -3 8 13 15 18 -73 -30 84 -28 8 86 -107 -34 148 -43 -32 118 -80 -26 163 -82 -44 158 -97
5587 -97 -29 173 -103 -48 141 -91 0 179 -117 -67 144 -72 -3 132 -118 -39 133 -76 -7 101 -84 -22 66
5610 66 -37 8 39 -66 0 49 -14 -20 -10 -3 28 -2 -2 -1 -34 30 30 -39 47 -6 -84 78 53 -80 60 -9 -96 130 28
5639 28 -125 99 23 -103 125 24 -123 113 13 -104 153 14 -139 101 39 -68 127 0 -111 107 26
5660 26 -93 101 15 -101 67 25 -35 71 -12 -56 51 33 -30 -1 -6 -9 19 3 4 -17 4 29 -33 -2 53 -60 -11 68
5688 68 -60 -2 60 -75 30 98 -97 0 80 -73 21 108 -110 11 112 -104 22 125 -102 -8 113 -62 31
5711 31 109 -108 17 123 -73 10 91 -62 3 64 -64 21 63 -62 0 51 -18 7 23 -23 8 21 -5 -3 -5 10 -10 -30
5739 -30 27 8 -41 28 -9 -42 61 -3 -49 75 -13 -75 69 12 -51 69 -13 -67 98 -13 -58 99 -5 -64 81 -12
5765 -12 -44 106 -24 -62 112 -9 -43 102 -23 -32 98 -14 -33 104 -1 -44 67 -2 -23 58 -26 -31 51 -11 -8 34
5791 34 -15 -12 8 -7 18 17 -24 -23 3 22 21 -42 -12 13 -26 16 35 -44 10 15 -70 40 51 -69 9 49 -66 18 46 -75 54
5822 54 83 -87 24 61 -60 37 60 -65 34 51 -78 61 89 -59 15 36 -53 57 36 -56 43 36 -48 17 16 -29 51
5849 51 15 -20 17 -28 -20 37 16 13 -6 -66 -19 61 15 3 1 -57 -10 30 -5 41 16 -52 -11 -1 -10 49 -7 -17 46 -35 -32 71
5881 71 19 23 55 -86 -37 82 -6 24 95 -68 -45 65 -37 43 118 -71 -33 72 -33 14 87 -44 10 65 -73 -9
5907 -9 109 -17 4 52 -65 -30 32 -1 51 56 -35 -52 -34 22 66 9 -14 -28 -74 -15 65 -7 22 5 -102 -3 59 -33 23
5936 23 49 -61 -5 19 -62 71 90 -60 -11 -5 -68 68 93 -21 45 -9 -101 56 89 13 59 -33 -72 65 21 -8 79
5963 79 -15 -29 52 -50 7 84 -26 -14 45 -72 -23 65 -16 21 47 -99 -51 48 -4 33 22 -66 -20 -5 -13 51 30 -44 -13
5992 -13 -34 -3 66 -14 -18 58 -61 -33 58 -34 13 83 -74 -30 67 -46 25 111 -40 -4 55 -66 38 123 -48 -23 58
6019 58 -38 24 69 -23 16 24 -46 22 38 -6 26 -26 -32 55 -17 -22 40 -30 -18 42 -60 1 78 -68 -24 75 -56 -3 68 -69
6049 -69 1 69 -72 -19 77 -45 -9 41 -60 3 42 -35 27 34 -43 14 13 24 61 -20 -27 45 -8 19 84 -34 -8 63 -43
6078 -43 29 106 -35 -6 74 -47 23 85 -65 15 76 -66 -7 58 -41 30 48 -47 -2 5 -47 53 58 -29 -5 -45 -37 87 16
6107 16 -25 18 -61 -16 91 -16 -5 40 -77 -12 95 -38 -20 45 -54 18 71 -79 -27 86 7 34 24 -75 -3 53 19
6134 19 72 2 -66 -8 47 53 69 -63 -48 53 19 31 55 -69 -30 87 -24 5 56 -79 6 108 -50 -35 19 -74 31
6161 31 126 -57 -69 18 -39 54 88 -68 -58 -7 1 58 51 -43 -45 -35 26 77 -25 -47 -2 -7 47 71 -89 -25 67 -19 56 41
6191 41 -100 -7 79 -7 58 29 -113 29 111 3 22 -17 -86 57 83 -25 7 -21 -53 58 53 -25 1 -52 -17 91 22
6218 22 -42 -31 -42 31 91 -52 -44 -6 -33 40 75 -64 -47 14 -16 61 48 -78 -58 23 30 58 -24 -62 -5 36 57 42 -41 -38
6248 -38 35 -1 52 42 -78 -15 72 15 55 33 -98 15 108 -23 -7 32 -64 31 103 -33 0 31 -59 42 104 -37 -47
6275 -47 6 -10 61 59 -50 -32 10 14 21 12 -25 -30 -15 33 17 -38 -2 -23 -13 67 12 -80 -1 24 -29 38 -1 -73 31 46 -38 54
6307 54 19 -65 32 35 -29 38 -10 -47 49 34 -21 22 -10 -10 45 11 -1 44 -19 -5 56 -3 13 19 -29 9 41 -23 3 36 -24 15
6339 15 29 -22 23 25 -32 -7 27 5 12 -32 -13 13 4 -3 -12 -39 -11 17 -27 20 6 -58 -7 39 -7 3 -11 -68 49 56 -42 -8 13
6372 13 -54 36 63 -32 -7 11 -51 70 84 -55 -31 32 -5 51 28 -58 -17 42 19 16 16 -38 -12 35 61 15 -37 -50 -18 47
6402 47 54 -35 -82 -16 44 25 27 -48 -91 38 55 -3 5 -54 -77 61 73 -20 -36 -63 -32 106 74 -57 -49 -32 11 93 39 -65
6432 -65 -58 -1 39 106 24 -83 -34 29 87 67 -45 -68 2 59 67 20 -66 -39 34 49 59 3 -69 -25 78 64 25 -46 -76 25
6462 25 91 20 -40 -79 -33 68 73 -8 -49 -69 -9 81 48 -32 -59 -58 30 109 -18 -90 -43 0 73 73 -50 -93 1 30 68 51
6492 51 -83 -88 23 55 81 31 -102 -52 83 61 41 -24 -92 4 86 35 -5 -25 -68 28 83 42 -16 -68 -15 88 54 -19
6520 -19 -43 -58 38 109 -2 -44 -22 -56 26 106 -19 -70 -5 -31 53 78 -61 -85 9 7 55 27 -90 -40 48 13 35 1 -90
6549 -90 -15 50 40 45 -33 -72 33 68 43 11 -67 -41 61 47 16 25 -60 -12 62 17 26 15 -60 12 98 -11 -12 11 -35 36 60
6580 60 -54 -6 12 -15 42 23 -39 -12 -11 -18 63 1 -64 4 5 9 55 -18 -48 44 -14 -12 47 -31 -31 27 -25 -3 48 -46 -27 47 -8
6613 -8 22 37 -46 13 48 -15 23 35 -33 11 17 8 48 0 -33 34 15 2 57 -23 -17 62 -24 3 71 -39 -33 48 -13 32 56 -82
6645 -82 -27 60 -17 19 30 -84 4 47 -50 18 23 -100 6 57 -31 26 -16 -82 36 54 -42 -7 -25 -25 59 9 -33 5 -27
6674 -27 1 73 2 -25 -16 -35 67 85 -28 -38 1 3 79 50 -55 -20 3 11 85 15 -72 -9 0 31 108 -25 -112 33 43 25
6704 25 61 -81 -86 69 22 18 44 -93 -63 75 34 19 -1 -119 -24 114 10 -14 -39 -89 45 102 -9 -36 -39 -44 59
6731 59 68 -17 -45 -52 17 95 46 -50 -66 -31 77 101 -32 -55 -14 8 83 83 -76 -47 1 17 110 42 -133 -49 37 48 113 -25
6761 -25 -154 -4 87 47 72 -43 -131 41 81 18 40 -79 -106 65 90 -7 -35 -73 -13 92 52 -56 -68 -43 50 86
6787 86 6 -57 -73 -16 106 81 -29 -60 -78 34 144 28 -77 -31 -27 54 123 -31 -78 15 -8 57 105 -70 -77 53 41
6814 41 73 36 -118 -60 106 71 28 -16 -115 -15 108 45 22 -37 -93 9 91 33 -13 -82 -62 64 66 -10 -36 -42 -4 57
6842 57 3 -41 -27 -24 36 59 -22 -48 -44 -24 97 55 -75 -42 -13 22 100 16 -97 -4 13 -1 96 4 -73 34 26 12 73 -38
6872 -38 -72 67 50 -16 26 -36 -36 87 35 -35 13 -12 -7 75 23 -25 -23 -34 19 43 5 -18 -24 -2 32 4 -31 8 -11 -16 39 -26
6904 -26 -21 35 -31 -24 42 -47 -22 43 -19 -3 27 -69 0 82 -30 -14 32 -28 18 58 -46 -11 41 -15 21 43 -32 1 27 -11
6934 -11 40 19 -30 21 55 8 19 -18 -22 66 35 -30 -14 -21 4 57 28 -25 -13 -39 20 66 6 -40 -41 -34 64 53 -56 -39 -8 8
6966 8 71 19 -73 -8 -11 24 94 -10 -94 21 44 49 67 -76 -98 62 67 35 32 -86 -60 96 58 18 24 -62 -38 107 63 -10
6996 -10 -22 -35 35 92 7 -59 -31 21 67 59 -26 -64 -26 53 94 21 -61 -70 -12 90 107 -33 -111 -23 19 84 59 -86 -76 2
7026 2 23 66 33 -107 -51 68 44 43 -14 -113 -7 119 49 -8 -58 -83 53 109 6 -40 -47 -37 75 98 -15 -34 -39 -3
7054 -3 107 74 -63 -41 7 44 83 12 -80 -14 50 52 50 -43 -69 -1 52 70 15 -76 -55 37 75 56 -51 -81 -5 60 39 24
7084 24 -67 -64 31 29 25 6 -70 -59 66 45 -33 -16 -59 -11 96 13 -63 -1 -32 17 93 13 -47 8 10 26 76 -13 -64 15 34
7115 34 45 31 -28 -40 37 43 7 -13 -30 -5 32 32 30 -11 -33 6 36 41 -1 -55 -30 37 25 -7 -1 -40 -1 50 9 0 1 -45 -19 43
7149 43 -3 -17 -5 -42 4 45 -16 -30 3 -21 7 24 -29 -3 4 -10 21 23 -30 1 23 2 41 9 -38 31 55 -6 20 9 -23
7180 -23 23 17 -19 28 28 -26 11 33 -7 4 9 -2 20 10 3 -18 1 27 -9 -12 13 -3 -24 11 -4 -18 9 -37 -40 30 6 -29 19
7213 19 -1 -39 23 -9 -30 40 -5 -53 32 29 -30 14 0 -34 48 17 -7 14 12 -17 20 21 8 13 -10 9 33 25 25 4 -7 31 26 -15
7247 -15 14 12 -18 10 16 -3 23 -13 -25 40 22 -15 -3 -8 -7 25 -14 -20 16 -14 9 17 -34 -13 -8 -25 17 32 -53 -26 26 -14 25 4
7281 4 -64 9 46 -20 26 27 -61 3 47 -10 29 17 -66 14 70 0 3 9 -14 24 63 13 -1 5 17 30 30 16 -26 -33 37 46 2 11 -30
7316 -30 -41 66 29 -54 -4 -11 -39 52 28 -54 -1 -6 -28 61 1 -69 -8 23 12 30 -43 -70 26 40 17 14 -52 -56 40 35 33 2 -77
7349 -77 -24 64 46 14 -33 -56 29 73 10 -6 -7 -39 45 60 -15 -16 -16 -7 72 42 -22 -37 -17 41 78 2 -45 -19 0 45 54 -53
7381 -53 -40 11 -16 50 35 -60 -45 24 -9 31 -5 -107 -2 69 -1 -17 -33 -81 38 80 -18 -38 -37 -40 39 81 -4 -55 -50 4
7411 4 71 57 -21 -40 -32 47 42 -23 8 -16 -11 65 51 -38 4 10 6 83 19 -63 -19 45 40 53 -12 -68 19 48 18 18 -41 -38 19 30 15
7446 15 9 -60 -36 38 12 -9 -27 -49 28 54 -28 -27 -24 -27 36 38 -33 -34 -17 -9 66 38 -37 -25 3 27 67 1 -38 0 18 34 29 -24
7480 -24 -11 43 -3 40 29 -41 -8 38 6 19 10 -53 25 59 -24 2 -4 -24 40 52 -32 -12 9 -16 24 18 -26 -28 -19 22 29 -16 -36
7513 -36 -26 13 41 5 -44 -16 19 -8 36 -4 -58 15 17 -3 34 -8 -65 37 50 -6 15 -11 -47 46 62 -22 -11 -4 1 44 41 -12
7545 -12 -1 -2 7 39 4 -9 7 27 36 37 -34 -24 18 19 29 -11 -41 4 30 11 19 -7 -34 3 15 30 19 -48 -31 23 22 13 -7 -42
7579 -42 22 28 -19 8 0 -31 16 33 -32 -12 1 -27 42 48 -42 -35 19 7 36 45 -43 -8 43 8 29 45 -27 -11 33 20 6 16 -18
7612 -18 5 32 28 -13 -12 21 28 14 16 -12 -28 50 21 11 19 -27 -42 42 36 -16 -7 -32 -25 38 23 -36 -1 13 -1 34 1 -40 4 10 4
7647 4 19 -5 -37 14 12 5 10 -15 -19 34 16 -12 25 -14 -2 29 11 9 18 5 5 30 29 1 -14 14 18 28 9 -4 6 21 24 -2 17 6
7683 6 -17 34 21 -22 -1 -9 -27 19 35 -30 -8 8 -22 25 18 -41 14 16 -36 -1 36 -20 -8 32 -16 11 28 -14 -2 25 -2 -11 26
7716 26 2 -22 19 -5 8 38 -1 -6 17 12 9 0 11 16 15 12 3 5 16 29 4 15 8 1 10 15 5 11 -4 -14 33 20 -13 -3 0 -6 24 2
7754 2 -22 19 -8 -25 20 3 -32 4 -16 -14 45 -17 -56 5 1 -8 27 -15 -29 20 1 -20 38 6 -16 30 21 -9 17 3 -19 23 18
7787 18 -13 4 19 16 17 9 12 -2 18 8 5 6 17 -25 1 39 -9 -14 10 -5 2 27 -31 -12 30 -9 9 23 -30 -19 23 -17 11 12 -44
7822 -44 -16 37 -1 -16 -5 -46 6 25 -16 -13 -2 -19 8 13 -24 2 8 -20 32 25 -17 1 14 2 40 8 -16 23 14 4 31 -15 12
7855 12 21 17 27 19 -20 5 18 -4 31 -2 -27 29 36 -14 10 -10 -30 41 8 -36 24 -31 -32 44 15 -27 17 -14 -19 42 3 -45 -2
7888 -2 -6 -9 33 -26 -28 20 2 -6 24 -17 -16 32 7 19 7 -32 10 44 5 10 5 -15 28 23 -10 18 -5 -26 31 10 -5 22 -11 8 53
7923 53 5 -10 4 -9 31 47 -34 -17 19 -15 9 21 -48 -17 -4 -22 8 27 -55 -11 13 -10 19 -13 -60 26 7 -25 3 -8
7953 -8 -35 24 6 -23 17 -7 -26 29 3 -15 5 -6 18 40 -1 -1 28 9 26 33 -25 3 19 -6 27 31 -15 0 10 -8 35 -3
7985 -3 -43 20 10 -4 13 -25 -32 34 3 -20 37 -15 -32 31 -4 -6 22 -38 -19 38 -22 -19 11 -23 12 22 -42 2 22 -15 8 11 -18
8018 -18 1 16 -4 37 13 -25 11 16 7 19 -4 -13 31 6 -8 28 -5 3 31 -3 6 25 -8 1 40 -3 20 14 -22 20 32 -21 -6 4
8052 4 -19 19 8 -20 6 -7 -32 9 19 -16 3 -4 -6 16 -21 -33 11 4 -17 2 -10 -9 16 -7 -14 12 -5 -4 17 -5 -3 32 -20 12
8086 12 22 -5 4 20 4 24 28 -3 21 20 2 30 16 -9 23 -1 -5 40 19 -10 15 10 -3 29 4 -3 23 2 -3 22 -3 -4 18 1
8120 1 6 7 -20 1 8 5 3 -3 -16 15 -1 -19 18 6 -7 9 -2 -6 23 0 -18 22 2 -17 15 12 1 30 2 -10 26 6 5 20 6
8155 6 5 13 -9 25 28 4 8 6 12 15 20 -2 5 27 7 -11 7 -2 10 -5 -5 5 3 -8 -7 -4 13 3 -4 -1 11 -18 -4 0 -24 4
8191D
$$ Imaginary data points
##PAGE= N=2
##DATA TABLE= (X++(I..I)), XYDATA
0 0 0 0 0 0 0 0 0 0 0 8 -8 8 -8 14 -16 16 -24 24 -32 38 -41 49 -57 65 -78 89 -100 113 -129 146 -167 186
32 186 -209 233 -260 291 -323 361 -399 443 -491 540 -599 663 -735 814 -904 1007 -1125 1259
50 1259 -1418 1610 -1839 2126 -2498 2997 -3704 4792 -6697 10963 -38409 33886 58313 -64470
64 -64470 44605 22173 -83204 18866 54399 -40157 14376 16516 -42873 11855 25082 -21005
76 -21005 9346 -1660 -14958 24200 -560 -24815 13283 -514 -6616 24225 -2019 -28766
88 -28766 247 14847 5693 -680 3740 -7995 -24934 16614 32764 -28230 -7966 28302 -32300
101 -32300 -3421 50157 -34529 -26094 49755 -17588 -21319 40555 -27251 -25355 46605 -6397 -15456
114 -15456 20138 -32182 -5212 42218 -16166 -1098 15824 -47331 9064 49631 -32788 -1507
126 -1507 28966 -48613 1284 53300 -30542 -14061 33212 -26897 -10666 35581 -13211 -17230
138 -17230 18321 -683 -7578 4022 -1787 -2555 502 8187 3936 -15695 -1290 10764 -5974
151 -5974 6887 6486 -18845 2203 9606 -7380 12184 -2298 -21064 18533 3893 -19087 23088
164 23088 -4867 -30113 33453 6634 -35751 26197 4717 -36690 32212 15439 -40098 16031
176 16031 13081 -28530 20467 14633 -28946 6789 9677 -13377 12288 2817 -14267 8329 -895
189 -895 -5914 12470 -6131 -7856 12599 -5028 -6127 10303 -5206 -4200 9195 -2654 -4455
202 -4455 778 -53 5285 -1779 -3861 4859 -7365 -822 16169 -9144 -9849 13464 -8113 -4716
216 -4716 20035 -9632 -13262 14093 -4964 -3167 15377 -11168 -7962 12382 -7005 1779 11405
229 11405 -15934 -102 13998 -13349 3322 12881 -18954 1777 17713 -15016 -1529 13381
241 13381 -13822 214 15706 -10896 -5956 9061 -3959 357 6400 -5639 -3706 2295 1987
254 1987 3510 -2375 -3863 984 -1061 3838 4627 -7331 -2967 3779 -685 5030 997 -9795 1794
269 1794 3941 -2371 7679 -2231 -12780 7475 4792 -6246 9152 -2333 -15297 10390 7514
282 7514 -9348 6202 -373 -12804 9424 7432 -9004 2634 287 -7173 7371 3828 -6448
295 -6448 1374 -1179 -2176 7106 -798 -5704 2322 -758 188 5628 -3467 -5124 3132 1300 680 1887
311 1887 -3442 -3007 1798 3160 2257 -2802 -3849 730 944 3306 3239 -6372 -4144 4686 929 1660 2807
328 2807 -7215 -3259 6330 675 826 1608 -7594 -1331 7283 -231 -59 415 -7255 1229 7889 -2272
344 -2272 -1559 726 -5590 2255 7319 -3234 -2887 841 -3125 2681 5776 -3496 -3919 699 155 2963
360 2963 2563 -3732 -3050 1124 2107 2241 -379 -3337 -1573 1621 3036 1071 -2627 -2703 -88 2622 3459
377 3459 -1317 -4520 -657 1864 2592 2592 -3330 -4961 1824 3059 1538 1511 -4297 -4687 3767 3992 235
394 235 -362 -4628 -3009 5553 3704 -1928 -1884 -3416 -666 5848 2236 -3479 -2306 -1644 1088 5197
410 5197 772 -4574 -2416 726 2827 3267 -1318 -4614 -1309 3016 3216 214 -2651 -2949 20 3812
426 3812 2670 -2267 -3260 -921 1367 3895 1386 -4420 -2956 1786 2562 2450 -799 -5050 -1126 3813
442 3813 2227 403 -2112 -4208 719 4553 1401 -1383 -3076 -2625 2763 4323 -241 -2935 -2904 -68
458 -68 4085 2367 -2092 -2792 -1631 1603 3976 301 -3003 -1965 -306 2648 3138 -1715 -3396 -600
474 -600 1391 2879 977 -3259 -2094 1145 1874 1937 -922 -3397 -194 1970 1388 1071 -2153 -3057 1648
491 1648 2519 418 -327 -2792 -1457 3332 1687 -1211 -967 -2103 280 3637 30 -2036 -531 -1310
507 -1310 1227 3366 -1364 -2535 98 -49 1862 1930 -2709 -1975 1260 931 1440 -146 -2821 -144 1491
524 1491 642 1249 -1419 -2585 1525 1318 -67 1031 -2145 -1911 3076 769 -1449 564 -1552 -248
540 -248 3254 -1019 -2073 1041 -821 957 2737 -2731 -1967 1703 -493 1844 2224 -4243 -1777 2841
556 2841 81 1356 938 -4206 -516 3208 -169 224 -227 -2549 1231 2031 -916 -148 -1379 -951 3448
573 3448 831 -2484 -662 -1508 882 4721 -676 -3752 -715 -661 2240 3866 -1985 -2750 -479 -892
589 -892 3249 2483 -3608 -581 834 -1684 3236 870 -5206 1983 3397 -2681 1089 -479 -4763 3764
605 3764 4605 -2698 -811 -2067 -3184 4927 3864 -2051 -1271 -3897 -1462 6404 1546 -2718 138 -3413
621 -3413 -672 5975 -861 -3355 1960 -1067 -297 3389 -2426 -2876 2247 1465 1634 -381 -4777 -714
637 -714 2687 2184 3362 -2885 -6684 1738 3278 893 3500 -2741 -6292 2242 2854 320 2216 -2683
653 -2683 -3039 2799 165 -112 1269 -3402 1417 4562 -4305 -1552 2537 -3742 3236 6611 -6590
668 -6590 -3824 3443 -2559 3068 6724 -5931 -4987 2481 -254 2955 3430 -4404 -2265 840 -188
683 -188 3354 141 -3719 1846 385 -1903 2974 -1311 -3461 4081 1646 -2487 228 -2218 -954
698 -954 4262 1111 -881 -1791 -3954 2541 3966 -1973 1522 -663 -6402 3839 4949 -4692 1455
713 1455 1850 -5930 2738 4380 -4946 440 2799 -2691 1475 732 -3190 1618 622 -330 3025 -3220
729 -3220 -2981 4296 -1179 -542 5047 -4639 -4159 5958 -678 -2066 4334 -2965 -3369 4188 -244 -1159
745 -1159 1904 -2060 -235 1664 -1571 1558 196 -3384 3171 1274 -4177 2589 865 -3956 3514
760 3514 1435 -4292 1921 951 -2358 2325 -62 -1562 1604 -1893 389 3173 -3739 202 3843
775 3843 -4776 708 5223 -5815 -322 6171 -5204 -1127 5971 -4248 -1614 4954 -2933 -1170
789 -1170 3367 -2234 -327 1707 -1605 1204 11 -2026 2762 -728 -2651 3808 -767 -3239 3742
804 3742 -703 -2873 3774 -718 -2785 2750 -695 -1046 2186 -1843 65 1789 -2965 1659 2291 -4484
820 -4484 1822 2807 -4856 2305 3191 -5764 1667 4104 -4604 908 2824 -4057 1129 2610 -2448 1016
836 1016 91 -2248 2330 -147 -1087 2839 -2714 -1956 4578 -1947 -1900 4539 -2671 -2599 4516 -1904 -2110
853 -2110 4174 -1496 -1923 2542 -1718 -710 2216 -1065 898 566 -3314 1251 1466 -1793 2807 134
869 134 -4332 1958 1102 -2217 3185 472 -3500 1253 -227 -1084 3065 -698 -1351 1824 -2558 -568
885 -568 3416 -2149 406 3392 -4503 -1221 4095 -2664 398 4434 -3905 -2011 2957 -2260 591
900 591 3993 -2354 -1588 840 -1820 1383 2189 -1253 644 -716 -2682 1839 1004 -728 2403 -1102
916 -1102 -3040 1616 -73 -570 3062 -553 -2068 553 -1612 226 3095 -820 -368 588 -3083 318
932 318 2612 -1303 1397 1447 -4026 -358 2047 -1335 1972 1989 -3128 -679 370 -1376 2445 1931 -1701
949 -1701 -333 -1419 -1341 2832 888 -734 1224 -2148 -2002 2452 100 -22 2422 -2000 -2265 1711
965 1711 -608 43 2818 -945 -1591 369 -1563 424 2812 -359 -709 -288 -1997 507 2009 -108
981 -108 456 -316 -2105 283 1073 73 973 -417 -1264 603 -366 -399 1346 -265 -175 937 -1682 -787
999 -787 1666 -498 355 1721 -2040 -1394 1408 -493 766 2085 -2007 -1639 1172 -386 510 1703
1015 1703 -1188 -989 541 -670 337 1272 -452 -309 63 -643 165 344 13 714 -109 -874 -144 -229
1033 -229 562 1298 -581 -875 101 -634 512 1475 -714 -681 239 -911 579 1589 -985 -777 560 -538
1051 -538 414 1028 -1093 -457 782 -368 201 590 -868 -242 515 -53 433 19 -925 125 470 17
1069 17 385 -416 -632 651 87 -368 543 -251 -533 649 -71 -395 556 -239 -373 699 -75 -557 261
1088 261 101 64 268 -368 -333 266 291 169 -276 -346 147 -73 208 603 -609 -598 483 -131 279 857 -1119
1109 -1119 -785 1118 -160 -133 985 -1041 -855 1274 -229 -370 1213 -831 -1149 1235 138 -591 834
1126 834 -399 -891 926 205 -716 491 216 -663 125 388 -261 -31 358 -224 -351 461 49 -572 587
1145 587 340 -957 261 569 -660 520 434 -1267 372 924 -950 360 677 -1271 265 923 -849
1162 -849 430 517 -1405 359 1018 -746 278 235 -1093 560 639 -766 421 144 -972 498 416 -428
1180 -428 458 -211 -739 646 264 -399 277 -165 -322 328 -20 -56 197 -155 -99 -100 88 413 -385 -142 530
1201 530 -581 -27 830 -809 55 1064 -1385 -77 1658 -1289 -197 1598 -1692 -199 2072 -1659
1217 -1659 -340 2116 -1886 -581 2375 -1414 -598 1955 -1685 -550 2282 -1233 -800 1673 -1100
1232 -1100 -614 1610 -649 -567 927 -694 -403 988 -19 -489 9 89 -51 -68 517 -85 -784 692
1250 692 73 -1047 1298 293 -1809 1187 490 -1824 1632 512 -2274 1731 521 -2509 2001 804
1266 804 -2559 1830 450 -2565 2257 553 -2659 2127 323 -2592 2257 384 -2326 2106 -88
1281 -88 -2322 2350 241 -2146 1794 -82 -1732 1840 22 -1460 1329 -229 -1144 1182 113 -643
1297 -643 340 -285 -72 296 -33 224 -531 -108 843 -926 50 1417 -1600 -167 1856 -1881 112 2260
1315 2260 -2658 44 2908 -2912 -55 3175 -3225 -46 3433 -3410 -8 3649 -3622 -221 3733
1330 3733 -3346 -153 3488 -3347 -148 3289 -3096 -9 3154 -2809 -316 2459 -2231 206 2170
1345 2170 -2059 -162 1474 -1335 206 1126 -794 -146 20 -160 464 -138 269 -97 -1155 1104 438
1362 438 -1562 1470 207 -2294 1922 485 -2381 2381 65 -3063 2871 364 -3152 3044 13
1377 13 -3370 3414 -100 -3425 3810 -180 -3733 3699 -187 -3408 3919 -321 -3529 3635 -427
1392 -427 -3233 3744 -113 -3054 2831 -514 -2371 3014 -266 -2112 2070 -531 -1522 1779 -229
1407 -229 -755 1057 -598 -480 516 -234 281 -60 -47 704 -1262 -299 1578 -1182 347 1865 -2747 -243
1425 -243 2608 -2554 592 3372 -3679 -615 3189 -3327 624 4178 -3927 -591 3416 -3897 255
1440 255 4428 -3287 -169 2884 -4242 158 4038 -2690 471 2591 -4065 -253 2959 -1942 1240
1455 1240 2262 -3490 -653 1719 -1195 1331 1700 -1846 -597 -66 -715 1243 944 60 -253 -1668
1471 -1668 -115 825 -446 1710 803 -2502 153 -7 -1645 2986 1454 -2739 904 -704 -2856 3379
1487 3379 1526 -2257 2196 -1364 -3977 3474 1171 -2037 3458 -1139 -4443 2890 251 -1987 4492
1502 4492 -238 -4273 1850 -571 -1903 4375 615 -2941 1085 -1526 -1999 3498 1313 -1035 530
1517 530 -2124 -1722 2047 1072 621 656 -1802 -1378 5 442 1971 662 -1024 -421 -1709 -491 2400
1534 2400 190 212 1228 -3046 -1578 2484 -450 935 2713 -3335 -1995 2166 -1570 976 3916
1549 3916 -2663 -1920 1526 -2454 722 4030 -1867 -923 1324 -3157 -7 3306 -975 482 1192 -3450
1565 -3450 -506 2170 -658 1408 1387 -2766 -827 563 -609 2031 1425 -1737 -740 -656 -542 1802 867
1582 867 -303 39 -1577 -710 1226 163 901 709 -1932 -362 539 -978 1520 1352 -1688 138 -252
1599 -252 -1904 1953 1495 -1561 908 -425 -2475 1787 1074 -1314 1756 -415 -2707 1604 628 -1293
1615 -1293 2032 -151 -2202 1349 -160 -1314 2108 169 -1523 980 -644 -1003 1732 20 -637
1630 -637 902 -981 -780 1104 -65 213 551 -1185 -124 608 -441 696 268 -1014 539 -59 -793
1647 -793 1226 -24 -1015 1015 -367 -851 1369 -460 -793 1477 -693 -960 1419 -570 -529 1405 -1012
1664 -1012 -625 1442 -849 -321 1293 -1095 -333 1140 -939 177 1039 -1367 -28 988 -909 438
1680 438 662 -1257 416 546 -1044 758 530 -1080 543 122 -879 934 147 -831 837 -162 -850
1697 -850 789 -99 -291 905 -594 -615 745 -388 17 847 -687 -117 440 -859 447 841 -860
1714 -860 231 277 -1040 684 485 -944 801 227 -1288 710 252 -820 1077 -5 -1185 867
1730 867 -92 -874 1191 -3 -883 751 -480 -626 1243 -223 -622 789 -549 -443 887 -374 -67
1747 -67 713 -760 -185 664 -450 212 440 -726 246 279 -706 531 333 -658 421 -28 -589 754 -49
1766 -49 -642 703 -181 -525 712 -311 -295 745 -557 -250 823 -570 -133 680 -728 149 720 -951
1784 -951 189 752 -933 259 635 -956 419 514 -1063 536 558 -1042 474 420 -879 587 226
1801 226 -851 658 198 -782 575 99 -566 515 -146 -366 648 -195 -355 410 -273 -7 414 -387
1819 -387 178 236 -655 335 343 -491 520 -71 -836 795 116 -750 881 -79 -966 846 -81 -682 1117
1838 1117 -260 -1012 936 -122 -629 967 -283 -640 784 -428 -395 943 -362 -355 546 -537 16
1855 16 618 -598 97 445 -652 211 340 -540 463 57 -731 639 85 -625 646 -173 -533 841
1873 841 -367 -508 975 -494 -507 988 -510 -296 972 -821 -268 1137 -736 -207 912 -855 -52
1890 -52 829 -795 221 711 -1009 143 626 -710 468 295 -919 543 223 -734 732 55 -769
1907 -769 611 -201 -449 915 -374 -550 728 -471 -118 797 -735 21 692 -995 292 846 -1048
1924 -1048 387 561 -1260 777 684 -1426 800 549 -1518 939 528 -1388 1106 271 -1565 1194
1940 1194 387 -1328 1143 57 -1279 1206 -27 -1011 1272 -227 -1058 1071 -190 -530 1000 -581
1956 -581 -510 876 -449 -67 675 -695 90 346 -682 698 241 -987 673 -66 -776 1250 -348
1973 -348 -1059 1352 -521 -939 1715 -660 -1021 1631 -959 -760 2037 -1100 -922 1829 -1203 -546 1941
1990 1941 -1387 -486 1781 -1541 -250 1876 -1446 -185 1430 -1589 206 1482 -1499 281 1104
2005 1104 -1529 390 941 -1128 717 408 -1360 719 349 -764 992 -193 -882 857 -461 -249
2021 -249 1308 -791 -462 856 -1025 370 1217 -1455 260 893 -1626 809 1021 -1791 939 695
2037 695 -1992 1400 689 -2190 1491 610 -1999 1732 136 -2294 1989 389 -1932 1958 -215 -2137
2053 -2137 1961 7 -1415 2079 -618 -1804 1793 -317 -872 1821 -769 -1000 1314 -914 -313 1527
2069 1527 -728 -173 597 -1294 321 879 -703 868 44 -1547 712 77 -440 1822 -654 -1597 1218
2086 1218 -691 -402 2335 -1125 -1196 1629 -1553 -356 2641 -1516 -752 1903 -1999 -228 2370 -1944
2102 -1944 -48 2253 -2239 -196 1842 -2103 563 2146 -2153 166 1227 -2281 905 1898 -1655
2117 -1655 498 440 -2108 1128 1227 -1178 901 -41 -1578 935 179 -471 1324 -519 -858 738 -838
2134 -838 91 1351 -828 282 502 -1950 579 1283 -1029 1265 203 -2586 1146 857 -1439 2109
2150 2109 139 -2822 1469 299 -1637 2637 -73 -2693 1932 -118 -1858 2566 -230 -2032 2179
2165 2179 -629 -1840 2348 -460 -1407 2202 -795 -1464 1717 -833 -625 2081 -888 -972 1059 -949
2181 -949 69 1448 -886 -101 475 -1110 559 666 -695 734 -248 -1005 1119 -303 -680 1480 -683
2198 -683 -726 1380 -1266 -456 2047 -1172 -441 1619 -1877 -206 2149 -1584 93 1726 -2417 56
2214 56 2162 -1818 412 1556 -2493 475 1866 -2025 670 1425 -2288 627 1381 -1796 876 899
2230 899 -1913 877 847 -1449 876 327 -1258 980 101 -936 1020 -220 -745 921 -388 -248 912
2247 912 -804 -80 861 -873 295 690 -1113 579 514 -1274 981 464 -1456 1079 264 -1429 1414
2264 1414 63 -1604 1596 21 -1595 1615 -129 -1451 1721 -351 -1404 1756 -474 -1232 1780
2279 1780 -588 -1132 1610 -717 -700 1711 -967 -857 1498 -756 -323 1341 -1088 -391 1162 -824
2295 -824 67 921 -1046 -27 684 -617 488 235 -995 574 339 -509 666 -431 -730 1074 -144
2312 -144 -379 873 -936 -550 1325 -387 -82 851 -1432 -210 1517 -722 78 857 -1549 118 1286
2329 1286 -1133 359 983 -1526 302 986 -1370 450 930 -1140 641 493 -1662 450 923 -539
2345 -539 826 -109 -1607 544 602 -190 1029 -433 -1378 484 185 163 1079 -702 -922 569 -199 156
2363 156 756 -695 -60 595 -727 63 419 -615 703 614 -971 2 -156 -667 1450 747 -1105 -80
2381 -80 -598 -583 1780 551 -1002 166 -805 -673 1596 275 -612 521 -871 -602 1227 -259 -369
2398 -369 993 -512 -476 518 -898 -44 1399 -157 -281 -37 -1243 91 1347 188 177 -414 -1481
2415 -1481 181 1067 345 475 -613 -1230 409 454 79 728 -396 -743 470 -228 -199 798 -273 -145
2433 -145 700 -718 -572 562 -106 564 812 -1147 -740 387 -95 894 800 -1127 -539 109 -314 997
2451 997 758 -957 -286 -32 -365 784 350 -615 268 -33 -537 357 -52 -182 693 -126 -472 148 -486
2470 -486 -14 946 -55 -250 -82 -822 217 1020 -137 -75 -71 -850 295 715 -263 285 43 -843 319
2489 319 433 -385 414 81 -630 437 97 -622 477 225 -371 380 -183 -537 487 115 -195 418 -240
2508 -240 -425 262 0 111 352 -388 -237 189 -118 230 194 -346 80 -23 -288 413 118 -343 210 -179
2528 -179 -233 603 -147 -407 457 -237 -265 620 -264 -330 496 -359 -148 724 -393 -365 502 -287 -5 602 -559
2549 -559 -205 572 -297 18 421 -544 -89 495 -215 94 225 -558 1 517 -36 -18 -127 -372 212 371
2569 371 8 -111 -316 -92 252 88 168 -91 -526 173 385 -150 161 -173 -542 591 396 -571 113 -73
2589 -73 -438 796 243 -838 181 -47 -397 968 184 -1034 145 93 -178 944 -61 -1095 249
2606 249 298 -115 601 -201 -797 290 302 24 312 -367 -500 337 360 135 -120 -536 -10 440 222 49 -455
2627 -455 -408 412 301 53 82 -621 -298 704 139 -87 29 -779 13 994 -161 -338 81 -649 305 986
2647 986 -547 -389 233 -535 445 912 -796 -434 313 -336 626 678 -1088 -368 546 -92 516 284 -1065
2666 -1065 -133 631 -8 350 5 -915 7 624 167 116 -370 -586 316 535 187 -198 -587 -18 475 149
2686 149 190 -307 -703 422 502 -177 241 -432 -780 875 527 -630 152 -344 -577 1155 297 -1002 247
2705 247 -146 -460 1158 92 -1102 303 -16 -220 1098 -222 -1163 404 236 -27 729 -521 -893
2722 -893 583 297 -8 376 -601 -531 569 286 109 9 -696 -117 589 207 56 -355 -529 428 410 -62
2742 -62 82 -484 -275 705 96 -133 162 -689 -27 970 -247 -281 218 -741 327 1076 -753 -334 492 -705
2762 -705 379 997 -1012 -284 667 -669 410 846 -1154 -246 742 -451 386 471 -1126 45 751 -414
2780 -414 276 224 -869 234 570 -339 211 16 -605 312 425 -146 -13 -236 -85 353 -9 10 -47 -411
2800 -411 388 305 -489 321 44 -694 632 369 -780 408 120 -731 766 260 -934 512 161 -684
2818 -684 753 2 -811 770 -45 -724 907 -139 -820 882 -161 -701 945 -219 -781 890 -131
2835 -131 -698 737 -69 -479 539 -231 -327 550 -127 -168 198 -304 176 301 -378 171 61 -434 456 228
2855 228 -445 185 -150 -230 703 -61 -458 220 -338 162 859 -623 -340 508 -687 280 1122 -970 -407
2874 -407 781 -769 233 1158 -1108 -443 980 -553 18 700 -914 -28 860 -502 7 171 -787
2891 -787 501 736 -563 28 -269 -793 973 793 -688 -182 -379 -437 994 519 -534 -259 -418 67
2909 67 716 -54 -125 -111 -582 599 579 -919 30 403 -412 812 258 -1537 101 867 -83 737 -173 -1599
2929 -1599 182 759 247 926 -678 -1551 532 468 160 1005 -851 -1241 979 137 -420 869 -447 -674
2947 -674 1006 -139 -805 354 -80 223 903 -497 -917 -252 79 1228 770 -1044 -770 -395 -14 1527
2965 1527 647 -1156 -487 -346 -113 1308 350 -830 -61 -277 -3 781 -486 -325 821 -240 -106 276
2983 276 -1207 49 1623 -154 -284 -7 -1550 81 1909 195 -308 -395 -1489 232 1522 194
2999 194 -21 -479 -1134 462 675 -231 504 -171 -815 575 13 -763 603 317 -177 545 -603 -1100 469
3018 469 653 553 350 -1116 -854 333 381 982 412 -1338 -516 280 -109 1046 500 -1250 -89 356
3036 356 -491 589 340 -678 495 159 -785 273 11 -181 1039 -47 -904 148 -418 -41 1471
3053 1471 -75 -994 110 -486 -5 1332 -100 -712 164 -463 -57 799 -118 -117 144 -518 102 261 -397
3072 -397 394 314 -510 183 -164 -618 745 431 -472 166 -343 -524 717 209 -219 317 -565 -371 684
3091 684 -131 -17 484 -711 -128 701 -592 0 747 -629 -68 570 -728 90 743 -554 2 390
3109 390 -617 166 481 -422 211 81 -570 445 264 -467 295 -55 -384 608 -13 -514 377 -62 -234
3128 -234 495 -180 -292 321 -192 48 334 -456 -29 347 -287 291 120 -778 312 514 -415 307 9 -824
3148 -824 467 469 -422 338 -138 -727 572 302 -338 375 -348 -465 773 -45 -448 507 -299 -225 777 -394
3168 -394 -497 609 -182 -89 677 -522 -525 470 26 233 377 -682 -331 361 104 404 31 -693 28 194
3188 194 -37 462 -122 -584 251 77 -84 370 -390 -307 550 -86 -143 190 -571 91 775 -405 -183 219
3208 219 -694 279 897 -534 -196 204 -677 392 864 -602 -247 183 -388 456 457 -609 -10 138 -252
3227 -252 485 71 -575 224 82 -123 523 -246 -610 406 173 -28 322 -475 -354 514 74 52 145 -578
3247 -578 -36 465 -114 205 18 -701 245 515 -270 142 -89 -570 489 387 -427 108 -145 -344 569 88
3267 88 -383 209 -311 -165 755 -186 -449 328 -308 1 771 -466 -482 485 -170 11 562 -474 -349 393
3287 393 -76 176 297 -543 -139 302 -24 324 -48 -611 223 249 -151 337 -192 -476 418 95 -190 341
3307 341 -337 -325 579 -51 -179 255 -500 -53 748 -310 -249 315 -486 111 703 -436 -215 303 -446 164
3327 164 595 -413 -192 145 -242 311 234 -445 39 64 -140 397 -103 -404 334 -40 -124 461 -270 -369 431
3348 431 -59 -42 363 -461 -206 515 -112 5 221 -502 67 481 -312 108 177 -570 226 436 -380 143 50
3369 50 -516 417 302 -475 150 -15 -324 527 23 -474 325 -112 -289 593 -114 -452 369 -168 -190 577 -254
3390 -254 -421 396 -98 -91 351 -295 -166 315 -162 20 170 -292 82 133 -180 239 -20 -353 330 78 -236
3411 -236 297 -175 -253 519 -119 -307 416 -242 -200 569 -256 -243 470 -368 -128 627 -365 -250 448 -348 -19
3432 -19 507 -456 -127 440 -336 26 371 -398 34 270 -353 179 235 -419 118 165 -282 213 38 -314 258
3453 258 30 -257 237 -56 -163 286 -162 -111 325 -202 -64 303 -237 -14 243 -287 108 260 -375 126
3473 126 213 -315 234 82 -423 362 103 -440 410 47 -484 452 33 -434 523 -41 -544 491 55 -431
3493 -431 427 -57 -391 385 -71 -282 396 -86 -240 247 -171 -76 327 -217 -56 217 -274 -17 233 -145
3513 -145 66 57 -266 137 104 -123 186 -89 -145 271 -181 -108 448 -220 -187 408 -311 -167 512 -283 -151 515
3535 515 -355 -239 450 -207 -7 404 -375 -61 312 -339 142 393 -386 101 170 -510 272 387 -444 187
3555 187 234 -534 137 285 -240 235 119 -420 21 101 -37 230 -64 -173 32 -256 67 374 -164 -49 86
3576 86 -382 118 348 -232 124 117 -371 112 118 -178 362 13 -426 313 -57 -353 547 1 -423 455 -172 -522
3598 -522 625 119 -429 427 -86 -506 387 75 -198 398 -111 -332 183 -92 50 328 -221 -57 160 -364
3618 -364 72 407 -184 32 98 -413 38 271 -90 138 17 -303 30 -43 57 403 -207 -265 217 -262 -7
3639 -7 542 -279 -194 384 -381 -109 579 -214 -151 313 -315 -20 355 -282 80 292 -353 125 188 -400 290 255
3661 255 -470 263 214 -524 256 307 -357 197 138 -407 171 212 -170 130 3 -113 112 -120 45 249 -219
3682 -219 25 216 -335 49 294 -323 88 275 -403 28 261 -227 169 100 -389 173 102 -242 344 -27 -415
3703 -415 325 -32 -293 522 -91 -539 425 53 -326 423 -66 -400 323 26 -172 278 -105 -201 188 -97
3723 -97 83 198 -313 28 221 -252 135 199 -345 135 175 -309 151 152 -257 143 60 -178 183 -93 -123 338
3745 338 -154 -190 288 -246 -83 469 -315 -229 448 -270 -115 495 -279 -228 317 -205 10 381 -311 -144 222
3766 222 -150 181 178 -390 73 142 -248 283 140 -397 113 121 -196 287 61 -346 162 112 -87 142 -150 -93
3788 -93 249 -92 12 144 -368 32 377 -216 63 161 -519 70 505 -233 -11 93 -416 155 315 -264 76
3809 76 65 -308 247 67 -318 241 30 -206 411 -112 -520 278 162 -56 381 -262 -588 246 248 111 240
3830 240 -328 -428 105 131 320 202 -444 -185 108 -31 346 119 -430 106 165 -224 153 65 -224 312 111
3851 111 -324 30 -141 -41 583 50 -372 -66 -318 102 776 -101 -455 25 -296 41 664 -135 -346 99
3871 99 -225 27 385 -217 -146 200 -86 81 -31 -429 177 423 -20 43 -296 -553 361 529 5 29 -403
3892 -403 -560 371 518 92 -19 -470 -302 372 227 56 22 -362 -24 310 -159 -31 158 -170 197 228 -412
3913 -412 -146 156 36 427 78 -617 -129 154 174 510 -124 -668 56 133 43 467 -167 -580 201 125 -90
3934 -90 300 -188 -350 355 140 -234 -10 -173 27 439 -37 -288 -127 -169 241 459 -155 -282 -175 -140 373
3955 373 378 -236 -252 -107 17 375 79 -268 -26 -42 64 265 -214 -210 218 -30 39 232 -384 -203 422 42
3977 42 -25 66 -425 -42 509 -12 -115 -34 -317 172 405 -190 -101 -28 -275 301 317 -356 -125 30 -136 324
3999 324 181 -435 -108 178 35 158 -67 -304 27 146 109 53 -236 -136 184 90 118 -37 -382 24 385
4020 385 27 -33 -118 -305 230 338 -121 -46 -131 -185 376 176 -269 12 -115 -106 463 30 -446 78 63 16 387
4043 387 -199 -505 214 224 32 166 -320 -364 275 215 71 45 -412 -181 368 157 -14 -108 -339 79 382 -19
4065 -19 -171 -131 -113 249 204 -144 -171 -167 99 408 7 -272 -121 -166 301 505 -285 -388 60 -25 305 395 -468
4088 -468 -324 253 -11 210 218 -533 -194 397 32 115 5 -538 51 535 -36 -97 -129 -362 263 472 -146 -209
4110 -209 -157 -138 358 296 -193 -252 -188 126 452 25 -289 -159 -96 295 369 -276 -271 35 -7 300 211 -436 -185 151
4134 151 88 317 -2 -513 -8 258 90 244 -219 -451 257 276 -18 130 -299 -313 428 188 -126 100 -333
4155 -333 -170 549 56 -263 40 -269 33 548 -129 -357 85 -107 95 414 -244 -339 97 8 142 219 -287
4176 -287 -242 112 142 178 -82 -287 -16 77 150 157 -286 -199 207 -26 92 202 -397 -137 354 -78 23 194 -440
4199 -440 -34 493 -180 -94 183 -351 52 433 -240 -93 195 -266 86 341 -217 -100 101 -120 189 166 -258
4220 -258 -15 63 -31 202 -49 -218 130 -18 -50 237 -136 -179 172 -54 8 217 -232 -128 218 -64 32 120
4242 120 -235 7 180 -139 86 96 -263 69 105 -127 172 -18 -268 196 73 -148 199 -96 -198 287 -34
4263 -34 -172 279 -158 -202 361 -87 -163 305 -198 -176 421 -94 -240 246 -111 -101 295 -76 -156 150 -41 -3
4285 -3 151 -65 -64 -15 -8 165 -26 -151 72 -51 2 247 -173 -174 217 -93 -46 258 -238 -168 276 -133 2 262
4309 262 -328 -112 371 -135 -58 186 -298 -3 380 -173 -95 165 -185 45 261 -151 -68 47 -106 179 138
4330 138 -173 -17 -26 -11 255 -47 -220 130 -16 -32 239 -111 -177 206 0 -46 147 -170 -100 223 32 -23 -38
4353 -38 -218 103 257 -44 -8 -121 -207 238 169 -144 70 -118 -212 289 77 -209 92 -105 -106 320 -90 -294
4375 -294 228 30 -48 247 -269 -293 348 99 -19 165 -290 -280 322 185 11 21 -285 -146 259 163 -4 -100
4397 -100 -148 84 94 -23 21 -93 3 253 -64 -215 7 -85 144 414 -167 -385 -29 -5 291 405 -314 -388
4419 -388 42 4 269 310 -327 -236 103 -58 174 170 -313 -42 247 -101 -42 -57 -226 278 331 -200 -226 -179 -69
4442 -69 467 333 -248 -244 -247 -5 520 275 -257 -264 -194 89 397 70 -200 -88 -5 127 86 -152 -35 107 93 139
4466 139 -204 -377 92 287 205 158 -408 -521 238 404 183 99 -460 -453 327 312 56 91 -339 -287 317 112 -110
4489 -110 45 -156 -25 319 -127 -332 53 110 219 211 -367 -398 92 266 338 96 -423 -337 76 299 353 -35
4511 -35 -429 -169 133 219 188 -152 -235 98 132 34 -24 -195 2 281 56 -92 -174 -262 207 424 -36 -216 -235
4534 -235 -224 371 432 -195 -233 -146 -114 357 274 -286 -129 -1 -56 277 89 -340 -34 160 48 141 -129 -323 152
4557 152 272 36 -46 -244 -198 248 244 1 -146 -250 -42 254 162 -23 -222 -215 176 263 -13 -88 -152 -83 287 147
4581 147 -200 -53 -54 -15 278 32 -250 -41 29 63 204 -129 -278 92 115 98 79 -282 -155 223 114 25 -8
4604 -8 -308 -60 270 74 -9 -79 -274 46 292 -4 -78 -87 -155 158 206 -126 -68 16 -24 144 30 -167 -38 47
4628 47 77 142 -97 -218 -6 107 183 90 -238 -150 100 62 171 46 -260 -25 126 -32 123 65 -238 53 169
4651 169 -115 27 9 -182 165 149 -224 -68 27 -44 215 77 -263 -52 14 2 198 23 -206 -50 -17 44 166
4674 166 -74 -128 33 -5 54 55 -126 27 96 -65 18 0 -171 94 131 -76 26 -54 -177 148 155 -79 11 -95
4698 -95 -115 167 72 -104 50 -84 -78 153 -12 -57 95 -103 -25 163 -112 -58 129 -60 21 114 -162 -30 158
4721 158 -81 11 64 -148 22 110 -93 55 61 -160 38 102 -59 52 3 -128 84 47 -81 54 -10 -58 83
4744 83 -18 -12 80 -75 -23 95 -42 33 65 -141 40 121 -117 52 104 -156 42 87 -121 100 78 -185 84 121
4768 121 -133 64 17 -131 121 66 -121 71 -12 -89 121 26 -85 56 -81 -43 156 -22 -79 39 -65 26 92
4791 92 -117 -28 69 -78 33 63 -154 25 84 -67 91 0 -196 55 114 -44 73 -67 -180 139 125 -71 42
4814 42 -77 -104 169 69 -46 32 -112 -55 184 23 -57 -5 -106 75 171 -101 -59 27 -61 120 88 -171 -11 56
4838 56 -61 135 56 -205 22 78 -27 125 -64 -217 93 116 -20 56 -106 -119 166 67 -34 16 -126 -40 178
4861 178 16 -51 -64 -146 79 186 -63 -87 -66 -94 189 126 -170 -38 -8 -43 204 67 -199 -2 34 0 198 -20
4885 -20 -231 52 109 27 85 -125 -152 130 98 -5 5 -150 -48 148 35 -6 -60 -166 53 179 -35 -51 -105 -118
4909 -118 191 142 -161 -65 -36 -46 224 71 -208 -31 7 5 214 -2 -242 -4 38 65 138 -118 -176 76 96 76
4933 76 20 -156 -37 130 35 74 -37 -188 52 149 7 43 -88 -163 194 166 -116 -19 -45 -59 231 87 -192 -8
4957 -8 7 -17 204 23 -213 -27 19 59 143 -98 -196 1 93 101 7 -176 -81 71 69 93 -40 -201 14 93 -16 86
4983 86 -95 -192 131 145 -69 1 -88 -123 208 100 -176 -25 -21 -12 193 30 -158 -29 -15 67 156 -62 -144 -4 26
5008 26 134 93 -163 -47 81 25 110 -22 -186 62 111 -22 77 -57 -200 120 162 -51 25 -119 -171 203 164
5031 164 -114 -49 -81 -76 168 69 -108 -31 -46 -3 111 -18 -76 -33 -3 86 51 -131 -40 45 35 125 -50 -208 41 100
5057 100 13 112 -68 -216 90 113 1 99 -107 -190 134 119 -57 32 -66 -70 152 35 -92 25 -20 16 126 -45
5081 -45 -92 -18 -24 97 113 -121 -101 -3 -7 153 52 -193 -50 39 -35 106 28 -153 19 55 -58 46 -14 -118 57
5106 57 72 -47 -34 -78 -20 136 45 -66 -60 -64 57 123 -6 -44 -49 -79 91 119 -59 -22 -40 -79 136 73 -135 27 26
5133 26 -66 113 28 -143 73 71 -90 79 22 -145 53 81 -59 32 -24 -113 75 82 -41 -6 -36 -17 58 -1 -39 -1
5159 -1 -47 9 51 -48 -11 -16 -72 64 50 -90 -10 -5 -37 94 14 -107 49 30 -52 87 8 -83 56 28 -44 90 -24
5186 -24 -103 64 31 -30 36 -40 -46 71 -3 -28 50 -27 -11 32 -53 33 62 -79 10 49 -68 34 53 -67 40 38 -110
5213 -110 45 75 -67 23 28 -85 52 31 -69 28 30 -69 4 12 -34 45 -21 -46 41 -29 -19 30 -31 -1 22 -76 32 74
5241 74 -51 9 18 -58 74 65 -81 42 38 -83 79 66 -82 37 2 -82 106 54 -108 35 25 -63 66 -7 -68 58
5267 58 25 -64 42 -12 -54 56 -11 -24 29 -92 -16 99 -12 -2 -9 -117 19 92 -57 11 26 -119 6 47 -54
5292 -54 37 20 -109 30 43 -66 39 30 -22 53 -57 -80 77 32 21 54 -89 -61 63 -10 75 116 -116 -54 60 -39
5318 -39 103 124 -139 -7 63 -140 56 128 -100 23 37 -171 31 120 -88 55 75 -157 -31 55 -21 99 73
5341 73 -123 -58 21 10 69 12 -24 -44 -80 25 54 0 56 -23 -121 45 33 -66 120 72 -123 19 -18 -118 158 73
5367 73 -145 60 -22 -154 140 80 -75 96 -33 -162 128 71 -73 104 1 -149 60 3 -34 131 -2 -111
5389 -111 7 -42 -14 108 -20 -37 8 -104 -5 103 5 -4 -21 -98 12 46 -33 26 -17 -37 5 -54 -11 87 -50 12 63
5416 63 -98 4 100 -83 58 115 -185 -27 144 -110 47 125 -178 6 156 -137 47 137 -165 10 132 -123
5438 -123 33 118 -137 45 144 -132 -26 95 -79 37 94 -103 -38 65 -9 -2 29 -17 -51 -4 75 1 -63 13 -47
5463 -47 -52 135 -15 -158 81 -5 -108 133 8 -163 106 7 -121 166 1 -176 140 17 -126 150 -24 -135
5485 -135 170 7 -150 110 -18 -93 149 -10 -123 98 -16 -49 141 17 -105 28 -19 10 115 -9 -59 10
5507 10 -19 24 22 -16 23 -30 -18 59 -13 -7 38 -65 33 73 -105 3 85 -74 24 62 -171 22 120 -129 60 114 -202
5534 -202 15 131 -130 79 118 -208 31 154 -132 42 125 -161 28 98 -129 42 115 -111 44 99 -94 1
5556 1 54 -41 48 46 -77 -48 31 34 8 -20 -3 -38 -37 90 12 -52 49 -57 -77 149 -4 -109 99 -42 -89 135 -42
5583 -42 -124 137 -31 -113 126 -55 -141 125 -41 -93 152 -80 -129 159 -5 -75 96 -72 -89 139 -34 -66 93
5606 93 -57 -70 89 -7 -35 38 -47 -11 67 -13 -26 17 -3 12 7 -10 19 -35 20 49 -53 3 19 -68 48 88 -95 15
5634 15 42 -85 81 75 -150 44 84 -122 72 76 -153 32 74 -128 66 67 -185 39 101 -117 51 31 -134 66
5658 66 76 -104 41 44 -102 35 58 -56 21 16 -66 40 43 -38 -5 6 8 19 -9 1 -3 -10 50 -9 -10 52 -27 -24 79 -19 -38
5689 -38 59 -47 -19 101 -67 -70 103 -33 -49 106 -89 -70 121 -75 -53 113 -84 -90 124 -45 -48 110 -83 -54
5713 -54 133 -41 -64 92 -40 -40 91 -37 -27 70 -56 -34 68 -14 -26 23 -20 4 34 -7 -10 9 0 8 -25 42 37 -36 18
5742 18 36 -32 42 22 -55 48 35 -76 44 53 -73 43 19 -80 58 35 -90 49 18 -84 37 24 -85 74 4
5767 4 -101 69 29 -94 47 12 -89 53 6 -80 62 13 -88 57 18 -47 44 -18 -55 49 -5 -38 26 -15 -19 16
5793 16 3 1 10 -38 -19 33 17 13 -25 -17 24 -3 -9 39 -22 3 41 -38 6 76 -58 -23 79 -55 -36 67 -63 -7 94 -81
5823 -81 -37 78 -46 -20 69 -72 -30 58 -67 1 69 -71 -30 52 -41 16 56 -70 14 49 -53 -18 27 -32 10 24 -40
5850 -40 0 7 -31 37 24 -37 -8 -36 -23 81 19 -32 -4 -29 -8 50 4 6 18 -58 -10 31 15 41 8 -45 36 -11 -53 59
5880 59 25 -37 37 -60 -68 93 -2 -52 56 -59 -101 67 4 -17 82 -66 -98 77 -7 -46 77 -41 -72 49 -52 -46
5906 -46 89 -3 -55 38 -51 -47 53 20 11 35 -55 -60 17 54 66 1 -54 -30 -29 14 77 13 -24 15 -69 -22 101 -6 -7 48 -58
5937 -58 -36 63 -31 39 107 -73 -59 18 -31 45 92 -60 -33 -9 -84 47 109 -43 -13 -26 -74 47 55 -43 25 -3 -83 24
5965 24 2 -30 74 -17 -64 36 -28 -43 70 13 -15 34 -68 -57 86 20 -13 18 -64 -44 39 6 27 9 -77 -23 13 5
5993 5 56 -3 -57 50 -15 -59 70 -7 -34 79 -56 -74 71 -13 -44 90 -35 -77 55 -21 -3 97 -34 -72 55
6018 55 -21 -18 51 -51 -29 22 -56 -15 38 -31 -13 6 -48 50 7 -45 44 0 -37 48 -19 -27 85 -29 -39 84 -26 -49 77
6047 77 -36 -35 90 -32 -43 106 -34 -50 67 -17 -15 57 -25 -13 32 -46 -19 27 -18 9 -21 -58 26 3 -22 48 -26 -55
6075 -55 40 -25 -12 87 -41 -87 43 -32 -26 75 -47 -43 82 -66 -59 60 -28 -20 50 -59 -42 30 -38 18 65 -55 -45 -13
6103 -13 -16 83 44 -66 -14 -23 -8 94 5 -42 43 -38 -37 96 -19 -53 49 -23 -20 64 -58 -45 83 1 -34 17 -65 -7 69
6132 69 5 -10 -16 -87 3 64 32 35 -66 -80 51 41 -13 32 -59 -54 88 -13 -42 55 -45 -45 101 -25 -74 45 -23 1
6160 1 104 -64 -114 45 1 32 76 -52 -70 41 31 41 41 -54 -54 4 45 52 -32 -75 24 7 20 39 -75 -45 75 -14 -18
6189 -18 29 -99 -48 93 -8 -28 23 -108 -1 115 -19 -62 -20 -70 19 87 -42 -43 -4 -54 47 54 -44 -36 -4 -13 93
6216 93 27 -85 -20 4 43 84 -46 -77 34 19 16 54 -56 -74 39 16 37 36 -73 -54 73 51 25 -21 -71 3 63 24
6244 24 7 -43 -47 46 32 17 20 -75 -43 79 14 -38 25 -73 -5 111 -31 -60 18 -55 -4 82 -46 -72 29 -35 -2 87 -50
6273 -50 -75 35 19 27 39 -70 -51 39 41 4 -3 -22 -21 2 26 29 -27 -18 12 0 53 27 -68 2 67 -14 19 10 -66 25 60 -46
6305 -46 21 43 -66 8 57 -30 1 10 -53 33 35 -48 1 5 -31 16 -3 -33 19 0 -40 24 -1 -38 9 -27 -14 48 -15 -46 31
6336 31 -6 -8 26 -13 -11 31 -30 2 51 5 0 11 -12 25 32 -16 5 8 7 35 10 2 16 -37 5 60 -19 -33 6 -49 32 76 -48
6369 -48 -44 30 -32 16 67 -51 -41 28 -39 37 75 -62 -59 46 2 18 12 -74 -42 49 17 -5 -13 -48 -16 32 31 -22 -42 -17 27
6400 27 50 28 -43 -66 15 62 15 -7 -25 -54 48 84 -9 -7 -15 -44 66 107 -32 -43 -16 7 87 60 -79 -66 21 23 67 17
6430 17 -99 -49 35 45 55 -14 -98 -21 67 58 10 -74 -88 32 73 22 -10 -64 -37 59 46 5 -31 -82 -8 89 39 -38 -71 -51
6460 -51 53 97 -2 -74 -56 3 72 61 -38 -65 -39 30 95 41 -68 -56 -1 79 99 -31 -106 -11 52 67 54 -67 -97 19
6488 19 62 29 25 -92 -89 63 70 31 -21 -120 -28 103 57 -22 -51 -72 10 86 10 -45 -43 -52 31 69 8 -51 -60 -5 89 31 -72
6519 -72 -52 -15 37 100 -23 -84 -20 3 26 88 -30 -91 4 17 49 73 -61 -81 58 54 24 22 -71 -27 73 30 -3 -3 -67
6548 -67 -7 77 32 -8 -45 -75 27 79 -7 -50 -62 -42 60 32 -39 -25 -60 -38 64 2 -39 -11 -48 -12 88 -22 -64 12
6576 12 -22 8 51 -56 -39 38 -15 11 28 -57 -20 23 -20 37 18 -77 12 37 -9 33 -3 -69 25 29 -27 43 -11 -36 31 6
6606 6 -16 39 -26 -39 64 12 -7 30 -35 -16 60 -15 -9 18 -27 -12 20 -10 17 -11 -53 3 26 -26 24 -31 -59 43 1 -45
6636 -45 53 -28 -64 49 6 -14 38 -54 -63 71 -7 -17 30 -60 -6 78 -12 -8 36 -64 -9 77 -16 -7 20 -63 39 73 -49
6665 -49 -24 3 -13 47 39 -44 0 8 -5 71 1 -65 -10 -3 42 69 -70 -78 9 11 37 19 -86 -56 26 12 49 4 -103 -28 35
6696 35 11 55 -28 -122 28 73 -3 22 -53 -88 71 70 -26 9 -48 -53 100 52 -28 -2 -66 -7 115 25 -55 -30 -45 43 98
6725 98 -30 -70 -9 1 73 75 -55 -71 -16 28 89 23 -83 -46 -1 50 86 -59 -86 12 39 59 43 -99 -60 33 33 61 9
6754 9 -134 -56 98 44 39 -40 -151 -3 131 10 -6 -55 -115 50 111 -8 -8 -37 -73 90 103 -31 -55 -39 11 89 46
6781 46 -70 -45 -5 72 74 -31 -72 -40 9 104 63 -70 -84 -24 46 126 11 -117 -45 17 37 87 -52 -128 26 36 23
6808 23 60 -74 -101 64 68 5 -2 -100 -64 123 75 -47 -54 -91 1 128 33 -55 -49 -63 44 112 19 -45 -57 -28 76 89 -13
6837 -13 -35 -14 27 76 -6 -53 -3 13 50 43 -27 -34 17 32 70 40 -96 -47 43 23 63 -12 -109 -9 63 12 39 -16 -101 23
6867 23 61 -16 26 -14 -88 46 70 -51 -9 -17 -48 72 39 -73 -21 9 -13 34 17 -58 -19 -7 12 49 3 -28 -20 -2 39
6896 39 3 -35 4 16 -13 17 -22 -24 61 -1 -40 42 -8 -28 58 13 -38 35 -33 -6 100 -17 -61 42 -4 -8 51 -42 -49 46
6926 46 0 -2 32 -28 -33 37 -7 5 14 -48 8 59 -11 -13 -5 -29 46 37 -63 -31 2 9 55 18 -49 -25 -9 20 67 -8 -56 -18 2
6959 2 59 47 -74 -55 23 19 56 13 -85 -1 29 27 49 -22 -95 31 70 17 23 -73 -113 84 90 -27 -21 -64 -65 83 62 -61 -18
6990 -18 -55 -35 97 53 -70 -50 -17 26 57 -27 -118 -26 35 56 9 -67 -61 12 45 72 -10 -110 -52 31 82 68 -69 -125 -13
7019 -13 69 69 30 -84 -76 70 46 15 8 -85 -45 91 60 -8 -31 -81 16 135 22 -66 -60 -47 48 103 -37 -82 -37 -7 69
7048 69 69 -51 -82 -16 18 75 30 -110 -56 24 39 26 -41 -99 -23 56 35 2 -72 -81 20 60 25 -27 -83 -44 67 68 -1 -75
7078 -75 -75 16 74 16 -20 -67 -48 48 58 -8 -16 -60 -38 78 58 -37 -28 -33 -12 85 23 -92 -12 3 8 65 -4 -83 0 22 2 46
7110 46 -15 -73 2 36 -6 -2 -42 -51 24 56 -18 -38 -35 -14 21 31 -14 -32 -45 10 33 9 -16 -55 -12 58 40 -36 -11 -31 -1 51
7142 51 1 -36 2 -8 -2 60 22 -42 -2 7 20 54 -23 -34 21 9 3 37 -28 -16 12 -26 11 26 -18 -10 22 -12 11 3 -44 11 38
7175 38 -27 -21 18 -40 1 25 -52 -15 17 -41 -15 13 -16 -31 -5 -5 9 6 -16 -25 -5 22 -4 -16 5 -2 -22 7 9 -12 15 -4 -39
7208 -39 35 41 -34 27 15 -28 21 22 -31 23 27 -55 23 32 -36 1 13 -22 19 17 -24 4 19 -29 9 20 -3 -5 -16 -11 17 -2 -13 -10
7242 -10 -16 3 16 -19 -1 3 -27 2 31 -15 -9 -1 -13 15 29 -19 -16 7 2 17 1 -33 19 9 -15 18 -11 -10 18 0 10 39 -29 -17
7276 -17 47 11 4 20 -45 -12 67 -20 -5 21 -61 -9 61 -6 -4 15 -53 -9 65 -13 -47 -14 -35 -1 38 -27 -47 -13 5 10 11 -14
7308 -14 -29 -33 26 42 -26 -28 -27 -25 51 28 -52 -24 18 -23 28 28 -65 -19 24 -6 31 21 -65 0 57 17 12 -17 -57 51 77 -14 -15
7341 -15 -32 -29 48 48 -9 -3 -54 -13 63 44 -30 -37 -49 13 69 -24 -53 -24 -16 21 39 -49 -53 -6 6 36 20 -58 -49 -16 45 67 -39
7374 -39 -78 -2 16 51 40 -68 -43 33 17 22 35 -72 -39 58 13 1 0 -77 9 79 -8 -39 -4 -32 34 70 -26 -49 -9 -11 47
7405 47 64 -17 -65 -33 25 77 15 -39 -44 -15 64 49 -36 -28 0 -15 18 27 -65 -45 25 10 28 4 -102 -31 61 21 4 -25 -77
7436 -77 20 70 -13 -13 -34 -51 22 42 2 1 -37 -12 52 34 -22 -26 -19 21 60 -25 -34 7 8 30 25 -46 -42 23 5 52 24 -58 -39 25
7470 25 33 40 -13 -69 11 30 10 1 -36 -24 22 10 -3 2 -55 -32 37 -1 -23 -9 -52 3 56 -12 -57 -3 -22 3 33 -45 -29 23
7502 23 12 6 14 -36 -17 12 25 22 -16 -34 1 30 39 8 -48 -2 24 -5 15 -2 -46 6 43 -18 7 -3 -62 26 60 -29 -13 6
7534 6 -20 39 49 -42 -21 20 -10 26 14 -38 -13 5 -5 19 -3 -31 -5 11 6 -3 -41 -34 22 11 -6 -31 -45 -10 37 10 -10 -28
7566 -28 -43 8 34 37 -9 -20 -13 43 32 -4 -4 -22 10 47 -11 -24 15 -11 6 43 -26 -23 15 -8 15 38 -61 -51 23 26 4 6 -56
7599 -56 -43 29 -1 -5 14 -31 -33 21 16 -18 -5 -25 -1 18 2 -35 -29 20 21 -9 -31 -28 -28 36 20 -12 -4 -5 -29 35 53 -7 -29 -14 -5
7634 -5 47 21 -45 -1 22 -2 20 14 -28 7 32 -8 18 -1 -23 16 28 0 8 -10 -25 34 18 -17 -11 -15 -26 12 13 -9 -9 -11 -15 17 1
7669 1 -19 -11 3 3 -1 -19 -16 -16 22 16 -21 -12 -5 -25 -16 11 -18 -14 1 -21 12 36 -43 -21 24 -13 8 35 -19 -5 30 -18 -11 36 -1 -30
7705 -30 44 4 -10 33 -4 -5 41 12 -22 22 13 -9 13 6 -8 2 4 -24 0 21 -3 -9 4 4 8 0 -18 10 9 14 -18 -4 -1 -6 11 20 1
7742 1 9 -2 -12 19 22 -13 4 4 0 30 7 -16 10 12 -11 34 25 -32 0 16 -13 29 10 -43 15 28 -8 18 16 -13 25 28 -19 17 19
7777 19 -28 27 34 -11 0 -5 -9 14 8 -30 -16 8 -1 -9 -9 2 -18 -2 3 -4 -23 2 -7 2 23 -17 -35 10 12 4 21 -14 -12 41 18 -19 29
7814 29 -13 -29 45 6 -6 28 -34 -19 51 2 2 9 -12 6 41 -13 -6 16 -3 0 34 -2 3 17 -7 20 27 -34 -29 20 8 16 -5 -22
7848 -22 16 25 -2 7 -20 -24 11 3 -6 -2 -29 -19 18 -4 0 5 -32 17 38 -33 -8 11 -4 33 28 -38 5 7 -26 38 20 -26 3 12 -18 40
7884 40 4 -53 21 25 -13 16 -10 -19 45 7 -18 14 -16 -22 19 9 -6 0 -22 -7 23 -6 2 -1 -18 30 33 -20 -6 12 -12 19 8 -43
7918 -43 2 -6 -22 26 -4 -47 -2 -3 6 26 -25 -33 32 -4 -18 27 -15 -29 41 -12 14 38 -54 -12 51 12 3 12 -17 33 39 -18 1 21
7952 21 -15 24 22 -23 7 12 -20 26 10 -26 9 -2 -12 31 -11 -48 17 -9 -7 20 -35 -13 18 -8 -6 11 -35 -7 18 -6 5 -3 -64
7985 -64 -1 31 -22 -4 -11 -26 31 17 -25 15 9 -21 33 8 -27 20 -3 -22 46 16 -25 20 -1 -1 42 -16 -21 35 -5 5 29 -12
8017 -12 -4 18 -7 13 15 -30 10 24 -10 6 -5 -21 13 12 -14 20 -2 -19 30 4 -14 16 -22 -19 41 8 -22 13 -18 -5 17 -10
8049 -10 -25 22 -13 -5 13 -19 1 14 -17 9 2 -18 2 13 -10 12 3 -29 23 27 -13 6 11 -7 21 1 -15 24 -11 -22 14 5 -26
8082 -26 3 -13 -14 30 -4 -24 15 2 1 24 -23 -16 8 -20 13 5 -16 -14 -15 -22 3 4 -32 0 8 -8 16 -1 -9 12 0 -16 -2 12 -19
8117 -19 13 2 0 12 -16 -10 11 -4 10 -3 -4 19 4 -28 15 9 -8 12 16 -3 11 15 -19 29 15 -20 11 4 0 14 -6 -25 8 13 -14
8152 -14 -8 2 -13 -10 -20 -16 4 -10 -29 -12 11 -10 -15 -13 -1 7 -8 -16 5 1 5 -4 -13 13 3 -19 11 0 8 7 -8 0 21 -12 5 5 7 0 -8
8191h
##END NTUPLES=NMR FID
##END=
