##TITLE=1H_LY-xylene.2
 
 8 sc, 
 5.04.2022
##JCAMPDX= 6.0         $$ Bruker NMR JCAMP-DX V2.0
##DATA TYPE= NMR FID
##DATA CLASS= NTUPLES
##ORIGIN= UXNMR, Bruker Analytische Messtechnik GmbH
##OWNER= root
$$ XWIN-NMR		Version 3.5
$$ Tue Apr  5 11:51:06 2022 Russian Standard Time (UT+4h)  she@DPX200
##.OBSERVE FREQUENCY= 200.131346
##.OBSERVE NUCLEUS= ^1H
##.DELAY= (6, 6)
##.ACQUISITION MODE= SIMULTANEOUS
##.ACQUISITION SCHEME= undefined
##.AVERAGES= 8
##.DIGITISER RES= 18
##SPECTROMETER/DATA SYSTEM= spect
##.PULSE SEQUENCE= zg30
##.SOLVENT NAME= CD2Cl2
##.SHIFT REFERENCE= (INTERNAL, CD2Cl2, 0, 15.7039)
##AUDIT TRAIL= $$ (NUMBER, WHEN, WHO, WHERE, WHAT)
$$ ##TITLE= Audit trail, XWIN-NMR		Version 3.5
$$ ##JCAMPDX= 5.01
$$ ##ORIGIN= Bruker BioSpin GmbH
$$ ##OWNER= she
$$ F:/spectra/data/she/nmr/H-F/1/audita.txt
$$ ##AUDIT TRAIL=  $$ (NUMBER, WHEN, WHO, WHERE, WHAT)
(   1,<2022-04-05 11:47:38.00 +0400>,<she>,<DPX200>,
      <created by zg, POWCHK disabled, PULCHK disabled
       configuration hash MD5:
       00 E9 B6 7A A2 85 ED C7 34 08 36 98 17 FE 4E 26
       data hash MD5: 16K
       95 EC 5B E8 B4 C1 E7 FF 41 D9 BB A8 05 CD 6F CE>)
$$ ##END=
$$ 
$$ hash MD5
$$ 78 29 9C A6 6A 5C 2D 2F DE B3 40 BF 29 02 51 E7
##$RELAX= 
##$RELAX= 
##$RELAX= 
##$RELAX= 
##$RELAX= 
##$RELAX= 
$$ Bruker specific parameters
$$ --------------------------
##$DU= <F:/spectra>
##$EXPNO= 1
##$NAME= <H-F>
##$PROCNO= 1
##$TYPE= <nmr>
##$USER= <she>
##$AMP= (0..31)
100 100 100 100 100 100 100 100 100 100 100 100 100 100 100 100 100 100 
100 100 100 100 100 100 100 100 100 100 100 100 100 100 
##$AQSEQ= 0
##$AQ_mod= 1
##$AUNM= <au_zg>
##$AUTOPOS= <>
##$BF1= 200.13
##$BF2= 200.13
##$BF3= 200.13
##$BF4= 200.13
##$BF5= 200.13
##$BF6= 200.13
##$BF7= 200.13
##$BF8= 200.13
##$BYTORDA= 1
##$CFDGTYP= 0
##$CFRGTYP= 5
##$CHEMSTR= <none>
##$CNST= (0..31)
1 1 145 1 1 1 1 1 1 1 1 1 1 1 1 1 1 1 1 1 1 1 1 1 1 1 1 1 1 1 1 1 
##$CPDPRG= <>
##$CPDPRG1= <>
##$CPDPRG2= <>
##$CPDPRG3= <>
##$CPDPRG4= <mlev>
##$CPDPRG5= <mlev>
##$CPDPRG6= <mlev>
##$CPDPRG7= <mlev>
##$CPDPRG8= <mlev>
##$CPDPRGB= <>
##$CPDPRGT= <>
##$D= (0..31)
0 1.2 0 0 0 0 0 0 0 0.06 0 0.03 0 0 0 0 0.0002 0 0 0 0 0 0 0 0 0 0 0 0 
0 0 0 
##$DATE= 1649144857
##$DBL= (0..7)
120 120 120 120 120 120 120 120 
##$DBP= (0..7)
150 150 150 150 150 150 150 150 
##$DBP07= 0
##$DBPNAM0= <>
##$DBPNAM1= <>
##$DBPNAM2= <>
##$DBPNAM3= <>
##$DBPNAM4= <>
##$DBPNAM5= <>
##$DBPNAM6= <>
##$DBPNAM7= <>
##$DBPOAL= (0..7)
0.5 0.5 0.5 0.5 0.5 0.5 0.5 0.5 
##$DBPOFFS= (0..7)
0 0 0 0 0 0 0 0 
##$DE= 6
##$DECBNUC= <off>
##$DECIM= 32
##$DECNUC= <off>
##$DECSTAT= 4
##$DIGMOD= 1
##$DIGTYP= 9
##$DL= (0..7)
0 120 120 120 120 120 120 120 
##$DP= (0..7)
150 150 150 150 150 150 150 150 
##$DP07= 0
##$DPNAME0= <>
##$DPNAME1= <>
##$DPNAME2= <>
##$DPNAME3= <>
##$DPNAME4= <>
##$DPNAME5= <>
##$DPNAME6= <>
##$DPNAME7= <>
##$DPOAL= (0..7)
0.5 0.5 0.5 0.5 0.5 0.5 0.5 0.5 
##$DPOFFS= (0..7)
0 0 0 0 0 0 0 0 
##$DQDMODE= 0
##$DR= 18
##$DS= 0
##$DSLIST= <SSSSSSSSSSSSSSS>
$$ [...]
##$SUBNAM2= <"">
##$SUBNAM3= <"">
##$SUBNAM4= <"">
##$SUBNAM5= <"">
##$SUBNAM6= <"">
##$SUBNAM7= <"">
##$SUBNAM8= <"">
##$SUBNAM9= <"">
##$SW= 18.0517287032376
##$SWIBOX= (0..15)
0 0 2 0 0 0 0 0 0 0 0 0 0 0 0 0 
##$SW_h= 3612.71676300578
##$TD= 16384
##$TD0= 1
##$TE= 0
##$TE2= 300
##$TE3= 300
##$TEG= 300
##$TL= (0..7)
0 120 120 120 120 120 120 120 
##$TP= (0..7)
150 150 150 150 150 150 150 150 
##$TP07= 0
##$TPNAME0= <>
##$TPNAME1= <>
##$TPNAME2= <>
##$TPNAME3= <>
##$TPNAME4= <>
##$TPNAME5= <>
##$TPNAME6= <>
##$TPNAME7= <>
##$TPOAL= (0..7)
0.5 0.5 0.5 0.5 0.5 0.5 0.5 0.5 
##$TPOFFS= (0..7)
0 0 0 0 0 0 0 0 
##$TUNHIN= 0
##$TUNHOUT= 0
##$TUNXOUT= 0
##$USERA1= <user>
##$USERA2= <user>
##$USERA3= <user>
##$USERA4= <user>
##$USERA5= <user>
##$V9= 5
##$VALIST= <valist>
##$VCLIST= <CCCCCCCCCCCCCCC>
##$VD= 0
##$VDLIST= <DDDDDDDDDDDDDDD>
##$VPLIST= <PPPPPPPPPPPPPPP>
##$VTLIST= <TTTTTTTTTTTTTTT>
##$WBST= 1024
##$WBSW= 4
##$XGAIN= (0..3)
0 0 0 0 
##$XL= 0
##$YL= 0
##$YMAX_a= 241591
##$YMIN_a= -209506
##$ZGOPTNS= <>
##$ZL1= 120
##$ZL2= 120
##$ZL3= 120
##$ZL4= 120
##$ABSF1= 10
##$ABSF2= 0
##$ABSG= 5
##$ABSL= 3
##$ALPHA= 0
##$AQORDER= 0
##$ASSFAC= 0
##$ASSFACI= 0
##$ASSFACX= 0
##$ASSWID= 0
##$AUNMP= <proc_1d>
##$AZFE= 0.1
##$AZFW= 0.1
##$BCFW= 1
##$BC_mod= 2
##$BYTORDP= 1
##$COROFFS= 0
##$CY= 11.3945322036743
##$DATMOD= 1
##$DC= 2
##$DFILT= <>
##$DTYPP= 0
##$F1P= 2.36226072786647
##$F2P= -0.459571619588291
##$FCOR= 0.5
##$FTSIZE= 0
##$FT_mod= 4
##$GAMMA= 1
##$GB= 0.15
##$INTBC= 1
##$INTSCL= 1
##$ISEN= 128
##$LB= 0.24
##$LEV0= 0
##$LPBIN= 0
##$MAXI= 10000
##$MC2= 0
##$MEAN= 0
##$ME_mod= 0
##$MI= 1.114404
##$NCOEF= 0
##$NC_proc= 0
##$NLEV= 6
##$NOISF1= 3.799351
##$NOISF2= 2.8
##$NSP= 1
##$NTH_PI= 0
##$NZP= 0
##$OFFSET= 15.70392
##$PC= 1
##$PHC0= -17746.57
##$PHC1= 11.00078
##$PH_mod= 1
##$PKNL= yes
##$PPARMOD= 0
##$PSCAL= 0
##$PSIGN= 0
##$REVERSE= no
##$SF= 200.130013532006
##$SI= 16384
##$SIGF1= 3
##$SIGF2= 2
##$SINO= 400
##$SIOLD= 16384
##$SREGLST= <1H.CDCl3>
##$SSB= 0
##$STSI= 0
##$STSR= 0
##$SW_p= 3612.71676300578
##$SYMM= 0
##$S_DEV= 0
##$TDeff= 0
##$TDoff= 0
##$TI= <>
##$TILT= no
##$TM1= 0
##$TM2= 0
##$TOPLEV= 0
##$USERP1= <user>
##$USERP2= <user>
##$USERP3= <user>
##$USERP4= <user>
##$USERP5= <user>
##$WDW= 1
##$XDIM= 8192
##$YMAX_p= 0
##$YMIN_p= 0
$$ End of Bruker specific parameters
$$ ---------------------------------
##NTUPLES= NMR FID
##VAR_NAME=  TIME,          FID/REAL,        FID/IMAG
##SYMBOL=    X,             R,               I
##VAR_TYPE=  INDEPENDENT,   DEPENDENT,       DEPENDENT
##VAR_FORM=  AFFN,          ASDF,            ASDF
##VAR_DIM=   8192,          8192,            8192
##UNITS=     SECONDS,       ARBITRARY UNITS, ARBITRARY UNITS
##FACTOR=    0.0002768,     1,               1
##FIRST=     0,             0,               0
##LAST=      2.2672688,     0,               0
##MIN=       0,             -209506,         0
##MAX=       2.2672688,     241591,          0
$$ Real data points
##PAGE= N=1
##DATA TABLE= (X++(R..R)), XYDATA
$$ [...]
1089a961K311M172j4496J4510q882K997R617j3702J2991r788k891R630j3803J4658
1103E363m185l055J0958j6249R726m232n470J4326j2357J0394j135r570J1743
1116F257j4257P414L052q117J5065j1903L747K221j2523J3451r211M401P503j1836
1130d736J2163j0192j216P424j2050J3997n036j116Q876j4812R625n560l430J2365
1144F302j1444J1095k958p288J0073j4152Q643Q05n829J4035j2222N579k65j0845
1158h471J2803j0264O650N412j0195J2176j1784Q90N073j0998J4464o428J292
1171F20P034j3978R838p397j442J0690j0483J1826m318n415Q267j3750R019p09
1185a98l729J2826j1588O326k117r187J1182j0019P811L865q070J1130j2033J813
$$ y = [-1961, 350, 4522, -9974, 4536, -4346, -1349, 8268, -5434, 7557, -2231, -5122, 4508, -9295, 5363, 1178, -1877, 9081, -7168, 2558, -1674, -7144, 7182, -5175, 5219, 4084, -5486, 6257, -8000, -586, 2466, -5651, 9414, -2489, 1258, 3479, -9044, 4407, -4804, -403, 7100, -4736, 7427, -2765, -3981, 3443, -8607, 5390, 354, -762, 8114, -6698, 2927, -2633, -6063, 6302, -5142, 5953, 2995, -4293, 5780, -8372, 271, 1076, -4753, 9282, -2940, 2639, 2374, -8471, 4332, -5932, 718, 6130, -4065, 8111, -3673, -2783, 2290, -8708, 5756, -672, 620, 7654, -6324, 3514, -3883, -5325, 5365, -5118, 6708, 2390, -3025, 5242, -8508, 511, -198, -3927, 8899, -2689, 3637, 1520, -7667, 3515, -6504, 1307, 5172, -2898, 8232, -3801, -1988]
1199a988K956r502J3981o781L282N306j2905R595r021L38Q982r395J2754n821
1213A781l377O507j3839R870k653j578J2021j1448P725m268p741J0101j0576R407
1227A932K323o281J0676j2695L008Q80q245J3516p077M950L808j1538Q752r703
1241e694J345P400p917J2582o077k065M820j2987R356l530R5J0667j0155P907
1255E747n438o357Q289j0021R869J154m303R685j2547L820j062o855J2649p313
1269b683O576K224j0025Q323j0790K812N510o819J2825p033q5L143j2276R441
1283A143n039J809R313r321Q552o692m788O794r779J0346j56k504Q633j1996M389
1298G04k601n420J1231o986P380J038q264P299j0715L450L760n387J1994o998
$$ y = [-1988, 968, -8534, 5447, -1334, 1948, 7254, -5651, 3944, -5077, -4739, 4243, -5152, 7602, 1781, -1596, 4911, -8928, 942, -1711, -3289, 8732, -2716, 5009, 741, -7000, 3101, -7475, 1932, 4255, -2026, 8650, -4045, -1037, -157, -8402, 5114, -1963, 2987, 6795, -4743, 4009, -5694, -4349, 3051, -4866, 7716, 1639, -426, 4394, -8593, 763, -2767, -2672, 7995, -2160, 5747, 309, -6048, 2241, -7780, 2089, 3243, -1060, 8625, -3922, -102, -1164, -8019, 4630, -2683, 3893, 6117, -3908, 4415, -6375, -3563, 1947, -4872, 7953, 920, 835, 3978, -8298, 1143, -3896, -2087, 7226, -2095, 6457, -235, -5023, 1771, -8008, 2338, 2182, -322, 8311, -3685, 704, -1897, -7317, 3914, -3072, 4308, 5346, -2918, 4381, -6334, -2884, 876, -4511, 7483, 485]
1312D85J326J656j0902Q724n857K999P677q100Q785p485l098N234r421J0600j691
1327I32p54P689j1575N534m283m056J0139p460Q614m83o569O984j1223M722J826
1342C7m415J1592p572K963M10r733Q458o817M062O102p098Q858p892j641L864
1357A178q715J0178k622M81O590j0486N772n027k932Q623p086Q776j375m937O175
1372D593j0753N156L69l373J0603p557M111o48q382P946p480M959M555o148Q934
1387F885q429j05K610q221J0189l854J806N589r838O458o134j700P406p017R263
1402D908k400l489N488j0493N626r02k395R713p316M841j534p116P057p475N358
1417a29L360m916Q268q166O83J400p172R376m085K710M417q593O105o566p02N990
$$ y = [485, 1811, 3467, -7435, 1289, -4568, -1569, 6108, -1992, 6793, -692, -3790, 1444, -7977, 2623, 932, 178, 7867, -3708, 1826, -2457, -6513, 3626, -3834, 4780, 4297, -2272, 4712, -6511, -1789, 37, -4378, 7214, -358, 2605, 3015, -6718, 1740, -5077, -1015, 5087, -2011, 6847, -1045, -2686, 1178, -7537, 2641, 19, 500, 7090, -3396, 2376, -2651, -5583, 3040, -4046, 4730, 3355, -1582, 4593, -6160, -1004, -635, -4008, 6595, -962, 3149, 2501, -5881, 2065, -5415, -456, 4099, -2049, 6885, -1544, -1649, 961, -7260, 2929, -925, 881, 6470, -3368, 3090, -3044, -4744, 2662, -4355, 4908, 2508, -981, 4507, -5986, -360, -1262, -3657, 6056, -1260, 3581, 2047, -5069, 1988, -5487, -129, 3231, -1685, 6583, -1583, -900, 500, -6672, 2704, -1381, 1329, 5746, -2847, 3258, -3308, -4010, 1980]
1433A980o215R182l040k158M434j0008N896k083j167Q833p109N712k787n876O254
1448A848p791O311K043l663P996q609J755m9o325R093m630M019L314p693N920
1463C539p325K48M764n363R236l506r82L203r388N624k749k7P849o190N742l498
1479A177m997N060p343O544J388k364P223q378K062j288n352Q432m510N035K305
1494D994o677N358q005J112L583m430R483m070K49J966r173N759l843J372P168
1509D846n725O401m772m004L999p383P325N23j013O670q453K478k568m528P904
1524A700m333N932J549n803M639q333J526K604l336R233l920R42Q57q541N056
1539b28m093K206O485m718O278n234l429K853o979P426J07K00O029q190K674l708
$$ y = [1980, -4235, 4947, 1907, -251, 4183, -5825, 71, -2012, -3179, 5654, -1455, 4257, 1470, -4406, 1848, -5943, 368, 2411, -1252, 6744, -1865, -110, -159, -6484, 2609, -2021, 1998, 5312, -2381, 3539, -3786, -3538, 1226, -4137, 5099, 1593, 611, 3814, -5574, 50, -2699, -2726, 5123, -1067, 4675, 1177, -3820, 1240, -6103, 441, 1829, -535, 6688, -1690, 372, -916, -6268, 2164, -2346, 2689, 4994, -1683, 3675, -4330, -3218, 365, -4065, 5418, 1348, 1597, 3563, -5610, 149, -3694, -2322, 4846, -879, 5522, 750, -3254, 745, -6638, 687, 1210, 197, 6867, -1586, 892, -1676, -6204, 1700, -2633, 3299, 4848, -955, 3684, -4649, -3123, -519, -3855, 5378, 1458, 2400, 3257, -5284, -228, -4321, -2115, 4370, -348, 5930, 696, -2733, 120, -6859, 567, 674, 874, 6903, -1287, 1387, -2321]
1555b321l749P272m186O836P22m835M084q853K217J469k466R283m248K030k31
1570C024q079M857m836L245N613l931O443n838k590J767o578P389m06J253N347
1585F680p598K679m416l041O300l705P041K82l797L304q531K209O73j662Q604
1600E022l850K514q88p275M259n073L690M774l164O384o048j677P97o189P270
1615E46j192K246M615o993L111n203k155N335l748P419n04k652K964q400K742
1630a869n04j022P948l935L356j502o210L784n309L945L684k444O118n801q86
1645f47J72n618O580j616K626L930o038L184n226j541M275l534P023r15j642K585
1661C598p637K879j277o63O971l869L890j828n048L552n604M194K363j954N988
$$ y = [-2321, -6070, 1202, -2984, 3852, 4574, -261, 3823, -5030, -2813, -1344, -3810, 5473, 1225, 3255, 3024, -5055, -198, -5034, -1789, 3824, -107, 6336, 498, -2092, -325, -6903, 486, 80, 1333, 6680, -918, 1761, -2655, -5696, 604, -3101, 3940, 4222, 425, 3729, -4802, -2593, -1920, -3582, 5022, 1172, 3686, 2798, -4477, -218, -5291, -1601, 3173, 9, 6393, 345, -1332, -535, -6724, 546, -646, 1600, 6215, -778, 2333, -2870, -5025, 310, -3438, 3981, 3477, 825, 3789, -4611, -1869, -2373, -3395, 4553, 618, 3974, 2472, -3738, 46, -5263, -1318, 2366, -78, 6040, 239, -647, -475, -6093, 487, -1129, 1497, 5427, -611, 2573, -2653, -4194, 81, -3453, 3570, 2655, 1013, 3598, -4039, -1160, -2437, -3100, 3871, 2, 3892, 2064, -2984, 568, -5036, -842, 1521, -433, 5555]
1676E555n760M05n12n006O112k596L178L078n191L697n396o83L201l612O763j621
1692A612n87K372o894L193k020l71N804l732M145j866l854L170n351L854J377
1707H52j596N445n137J117o75m364N306l029L124K373m267L900n139K2K243l577
1723c402O217k176L09K121o033L564k807J2M701l847M646k282k487K902n391M049
1739I6Oj082M967m893K164j142l577M684l633L322J522l423M093m942P00J392
1755B54l424N557k545R66J889n109L581l083J20L710l625M561k185j592K621n062
1771c366L777p43q01M433m449K753j414k856M032l928L389P45k604M059m732J399
1787c06N18l139N089l042J746J416m337L755l628O87K665l436M719k571n11K125
$$ y = [5555, -205, 200, -312, -5318, 794, -1802, 1376, 4454, -737, 2960, -2436, -3119, 82, -3530, 3233, 1612, 1025, 3397, -3497, -304, -2324, -2695, 3109, -623, 3522, 1656, -2198, 972, -4379, -525, 852, -744, 4701, -436, 681, 6, -4358, 948, -2081, 1043, 3416, -851, 3049, -2090, -2068, 175, -3402, 2815, 639, 948, 3069, -2964, 600, -2207, -2195, 2506, -1341, 3305, 1023, -1464, 1438, -3953, 96, 102, -980, 3987, -906, 1258, 116, -3461, 1223, -2410, 912, 2434, -989, 3104, -1838, -1138, 254, -3170, 2387, -158, 808, 2697, -2412, 1169, -1914, -1794, 1916, -1709, 2852, 667, -925, 1696, -3366, 411, -332, -1133, 3300, -1149, 1604, 190, -2666, 1366, -2562, 827, 1572, -1032, 3027, -1705, -306, 212, -2927, 2162, -880, 866, 2282, -2055, 1700, -1928, -1241, 1424, -2012, 2707, 136, -375, 1750]
1803A750m737L775j583k57L803m072L176j709k176L413l989L423J64j924L821
1818B878m437J721m5k737M483l052K074J025l612L551l694R27J966l056M526k668
1834a50J25J670m336L680k101K49L214l732L467k197j413K802l951L693n62j150
1850f92L454m361K225q17k132M064l207K642L57k942L323l898J418J232k571M372
1866B467k841P00J098l921L515k356O98K675l315L424k406r68K311l684L665q55
1882B07o55L027m114K329j228j638L629l074K867r1k381K971l935J779O21k027
1898a713M137k960J220M48l437L364k671J261K098k921L473k808l65J716l426
1913b584L773j319j9K548l896K500j720j100L204k965L099n23j868K655l882J974
$$ y = [1750, -2987, 788, -795, -1052, 2751, -1321, 1855, 146, -2030, 1383, -2606, 817, 981, -943, 2878, -1559, 162, 117, -2620, 1863, -1189, 885, 1910, -1702, 1849, -1845, -918, 1048, -2008, 2518, -150, -25, 1645, -2691, 989, -1112, -863, 2351, -1381, 2086, -111, -1524, 1278, -2673, 1020, 458, -692, 2762, -1599, 626, -191, -2323, 1741, -1466, 1176, 1533, -1409, 1914, -1984, -566, 666, -1905, 2467, -374, 326, 1424, -2497, 1018, -1338, -640, 2035, -1280, 2144, -262, -1230, 1081, -2603, 1062, 207, -448, 2579, -1535, 794, -434, -2072, 1557, -1517, 1350, 1259, -1122, 1849, -2086, -307, 314, -1713, 2424, -536, 684, 1132, -2305, 1059, -1612, -351, 1747, -1174, 2299, -509, -874, 842, -2584, 1189, -130, -149, 2399, -1497, 1003, -717, -1817, 1387, -1578, 1521, 998, -870, 1785, -2097, -123]
1929a23J79j576L824k897J480O0l026L081k719J524J657k496L325k889PJ216l082
1946b455L617j528M30K091l529K534k050o43K682k802L266r29j237K253l776K230
1962A54m44j057L467k904J945m43k481K822k934J917J028k012L229l002N12O85
1978D82k765L430j801Q43J720l138K558k270l17K190k624L239j116p52J971l522
1994a872K197q06p85L083k700K160o77j977K462k971K003N45j553L050k884R17
2010A92K04k433L106k067J294J270k624K612k526J36J505k427L234j425r3J655
2026A613l275K305j363m19K644k592K513r70j435K142l062K120Nj124K899k751
2042g50J309j69k159K752k236J498R90k124K596k551L52R89k288L039j494L89
$$ y = [-123, 56, -1520, 2304, -593, 887, 947, -2079, 1002, -1717, -193, 1464, -1032, 2293, -596, -589, 627, -2455, 1162, -366, 64, 2155, -1374, 1160, -890, -1533, 1149, -1653, 1613, 684, -553, 1700, -2076, 154, -290, -1347, 2120, -784, 1161, 718, -1763, 1059, -1875, 42, 1070, -942, 2287, -715, -203, 482, -2283, 1147, -654, 189, 1909, -1229, 1329, -941, -1258, 932, -1692, 1547, 431, -321, 1650, -1872, 325, -481, -1266, 1817, -883, 1277, 600, -1377, 1085, -1886, 117, 662, -891, 2159, -725, 192, 396, -2037, 1069, -998, 296, 1566, -1058, 1554, -972, -836, 669, -1758, 1476, 51, -42, 1613, -1662, 643, -720, -1139, 1505, -1087, 1426, 456, -979, 1163, -1899, 221, 226, -898, 2001, -750, 559, 390, -1769, 983, -1253, 245, 1235, -889, 1707, -844, -492, 497, -1791, 1248, -246, 143]
2058A43J417k904K202j692k01K133k315K641j057r30J780l015K078m65p25K718
2074A808k560J688n88j811K379k437J799N71j583K554k612O70M13k097K886j658
2090e78Q96J143k557K215k044L5J653k105K766j188m16J442k893J968q24m11K458
2107A560k273J846p56j538J971k452J864L15j131K437k517Q45k7j847K595j691
2123g99J233Q71k115K040k209K65J175j842K763j305L2J111k713J947j229k9K119
2140A315k058K094j085j115J612k479J995n5p07K281k453J098m15j598K367j795
2156i98J526N81j759J949k325N03P51j580K642j352L66Q07k451J845j390K00J791
2173A106j837K116j239p64J307k338J994l43l67J999k295J254p01j257K115j832
$$ y = [143, 1560, -1344, 858, -834, -1035, 1098, -1217, 1424, 367, -563, 1217, -1798, 280, -185, -910, 1808, -752, 936, 348, -1463, 916, -1521, 278, 849, -734, 1820, -792, -122, 291, -1806, 1080, -578, 318, 1461, -1096, 1119, -925, -890, 763, -1342, 1424, 236, -180, 1262, -1631, 337, -487, -898, 1560, -713, 1133, 377, -1161, 810, -1642, 222, 537, -594, 1843, -674, 171, 144, -1703, 892, -799, 434, 1305, -810, 1230, -979, -714, 461, -1381, 1382, 77, 109, 1220, -1493, 454, -775, -804, 1315, -743, 1351, 266, -849, 763, -1716, 279, 224, -483, 1798, -655, 443, 28, -1570, 797, -998, 528, 1109, -650, 1299, -1026, -523, 228, -1352, 1290, -62, 304, 1111, -1340, 505, -885, -685, 1106, -731, 1385, 146, -618, 689, -1649, 345, 2, -365, 1634, -661, 593, -108, -1365, 750, -1082]
2189a082J704K60j422J856k380P82L80j357K553j574P34M95k189J866j613N18
2205d69J385j668K153j444l98J058k196K035o11j04J750k194J409r12r61J882
2221G15j786J774l3j112J659k280R46J35j113K320j576Q48K70j896J794j684P25
2238b94J081j503K076j576n9P71j949K043q74J74J422k066J511j122n80J631j757
2255a071J896l90q10J503k257J203j73q21K114j677J106o7j578J708j730R62P27
2272F45j293J962j675K09N35j738J991j004L88J132j886J492j240k98J373j588
2288i95J854n68n53J246k094J273l65n76J905j636J200l04j298J570j760J176
2304G5M18j035J833j756M91K28j501J942j196O84Q20j697J540j466K8J075j468
$$ y = [-1082, 622, 882, -540, 1316, -1064, -282, 98, -1259, 1294, -280, 454, 949, -1240, 626, -987, -469, 916, -752, 1401, -43, -441, 617, -1579, 456, -155, -259, 1491, -703, 706, -206, -1167, 715, -1071, 703, 670, -442, 1217, -1063, -117, 18, -1095, 1225, -351, 497, 767, -1129, 665, -1019, -294, 787, -716, 1360, -216, -275, 496, -1453, 590, -284, -110, 1312, -754, 757, -365, -945, 686, -1071, 825, 435, -375, 1128, -1129, 74, -99, -920, 1194, -483, 623, 556, -1022, 686, -1044, -82, 645, -648, 1314, -361, -152, 383, -1355, 636, -368, 20, 1152, -734, 758, -482, -780, 593, -995, 859, 291, -262, 984, -1110, 163, -202, -778, 1127, -509, 691, 387, -911, 659, -1101, 75, 493, -542, 1291, -465, 26, 254, -1247, 695, -501, 183, 1003, -694, 846, -620, -592, 483, -985]
2321i85J927q28j97R76j991J364o34k76J654j538J323n36j016J350j719J271K03
2338C48p92J698j710N96pj292J775j191Q45O16j453J456j540J74P94j302J933
2355I48r08N7P65j879J347q70k6J445j411J486p68p41J102j748J394r3m30J573
2373A243j680P91l45j101J622j259J101M00j192J389j680L64M73j110J895r62
2389e1L43N41j735J260j038J65J235j227J536q62n23Q24j693J394k46j84J463
2406A202j572Q85n82r28J401j258J272K29r05J278j728M91J63r44J842j017O36
2423D65L17j556J195j274M07R71j054J655j029k31N51j635J419n01J42J286j452
2440c24J006q28p13J166j253J392L7o04J166j725N84r4p80J712j002Q13J66j358
$$ y = [-985, 942, 114, -83, 893, -1098, 266, -368, -644, 1010, -528, 795, 259, -757, 593, -1126, 145, 348, -444, 1254, -456, 140, 133, -1159, 616, -575, 270, 886, -567, 889, -651, -477, 317, -985, 948, 40, 97, 862, -1017, 330, -540, -566, 879, -532, 954, 186, -555, 547, -1201, 193, 100, -330, 1243, -437, 354, 9, -1092, 530, -729, 372, 772, -420, 969, -711, -347, 126, -984, 911, -51, 292, 833, -902, 358, -680, -515, 720, -507, 1029, 167, -356, 468, -1225, 169, -77, -261, 1202, -370, 515, -67, -995, 406, -852, 420, 649, -256, 1022, -706, -215, -52, -996, 846, -171, 465, 782, -774, 421, -853, -446, 525, -529, 1126, 97, -134, 417, -1218, 201, -300, -158, 1128, -324, 682, -146, -859, 307, -946, 446, 483, -121, 1045, -680, -96, -190, -970, 742, -260, 553, 719, -639]
2458f39J117j370N12P46q82J630j078j3L64j542J374o60L21J135j349J128r98
2475b04n03R76j253J495k07l25J028j677P43l76n46J526j050J006o5j081J023
2492E10j434O90M53p29J564j139K29J79j350J320q10M58Q91j187J148j046k68
2509e21P89j201J450l63j73R14j553Q59n02l89J313j078J074k22q41R83j372P83
2527e0K00o09J395j174M40N1j110J267r45N88N73j044J163j101L9N94j068J366
2545E75o27K9P24j378J010o24j63J067j112J066m24n36R22j260R12o1n09J174
2563G85j193O03n3q17J201r85O05K96r38J116j043K76M87r68J269q22J29N44j189
2582f97J114o68L2Q16j122J029o03k87Q60j116J034k86m00R56j245P59j58n32
$$ y = [-639, 478, -892, -380, 366, -516, 1114, 36, 23, 387, -1155, 219, -441, -120, 1015, -334, 794, -204, -707, 269, -984, 511, 304, -21, 1007, -670, 73, -303, -849, 677, -373, 633, 568, -513, 510, -924, -234, 219, -510, 1054, -85, 144, 323, -1027, 293, -517, -59, 832, -355, 793, -253, -521, 268, -933, 517, 154, -19, 895, -658, 201, -301, -690, 623, -455, 619, 397, -444, 539, -833, -50, 150, -459, 936, -238, 202, 253, -857, 410, -535, 53, 626, -418, 745, -356, -317, 277, -791, 575, -52, -23, 701, -677, 333, -291, -454, 613, -499, 567, 143, -393, 529, -731, 181, 120, -389, 785, -408, 195, 142, -675, 526, -459, 146, 442, -496, 620, -423, -147, 340, -628, 641, -181, -52, 492, -697, 417, -251, -219, 597, -525, 504, -99, -386, 474, -642, 392, 106, -294, 662, -583, 176, 18, -514]
2600e14J161j046O99k5q12J041j045N53L21p74J147r69J96L41j005J181o82K12
2618b0O43j143R80p57j00Q01r85J120m29k97P37j240Q38k50k91J086j022P35k42
2637A64p13R33j016P33K27o29J060j086L02J26q38J183o92M04M40j044Q97q73
2655d22O4O77q45J168n53j69N69j224Q86l77r2J001r90Q02m21n88Q21r86Q32J04
2675B57m80R73j088L78j8p23J134p26N38K94r26Q50r40J89N16p43J150o13j3M27
2695D36j118Q81n08N5Q52r05Q50n31m10O89r93R12q9k92Q92j097N33k08n58J014
2715D05p81O52J37p32Q17r62L09L21o66J105o78J73L04r94Q70o20J45O83q44R01
2735E45n72k46O05r79Q95k40j78P98j007O30k95m40Q73q30P19j9n49Q05r49M14
$$ y = [-514, 647, -399, 300, 275, -537, 504, -541, 12, 333, -441, 706, -263, -67, 274, -731, 450, -232, -20, 623, -520, 460, -297, -397, 404, -581, 539, 110, -187, 550, -690, 148, -102, -393, 693, -329, 406, 164, -549, 384, -632, 101, 328, -301, 759, -327, -25, 101, -737, 446, -246, 158, 598, -446, 451, -422, -358, 319, -526, 642, 89, -80, 489, -735, 151, -226, -318, 683, -307, 495, 74, -514, 307, -679, 153, 257, -223, 750, -338, 40, 22, -701, 433, -293, 245, 539, -387, 463, -477, -288, 228, -515, 635, 22, 9, 436, -682, 199, -309, -254, 598, -307, 543, 12, -398, 291, -702, 210, 121, -171, 721, -376, 157, -51, -609, 405, -376, 276, 413, -319, 498, -464, -155, 166, -500, 605, -73, 100, 404, -590, 280, -340, -195, 488, -356, 545, -27, -273, 332, -647, 248, 8, -170, 628, -379, 251, -44, -484, 389, -441, 278, 259, -290, 515, -434, -20]
2755b0J23n72R85p13L29K02q26Q55p07K31M62p44R11o14l8M72r04Q68l98o2O76
2776E16r04P26l78l20P46q60P32j24m16P95r34N29l7m97Q93p82M57J16o74Q31
2796D15p60L01L09o88Q84o28J20L76q24Q41n16L9N44q17P63m51j44O14q28P26
2816B76k56k53O82q40N85j43l85P84q02N17qn15P93p72M03J54o09Q25o97K65K52
2837B56p14Q55n94J45L95p65P72m96j1N20p76P60l90j69N93q20O76k26k48O93
2857D56q11N56j46m24P61p51N18M0n04P39p60L31J57n69Q30o02K29K49p21P25
2877C03n66J35M59o71P67m83r9M46p98P34k76q9O37q12N77l10l32O94p17O55m0
2898B14m14O62q40L72K7m23Q56o17L56Q8o90O64o45K72L95n50Q01n81l6K75p53
$$ y = [-20, 103, -469, 516, -197, 132, 334, -492, 363, -344, -113, 349, -395, 516, -98, -136, 336, -568, 300, -98, -160, 516, -388, 338, -40, -360, 386, -474, 258, 134, -282, 513, -421, 108, 71, -426, 467, -315, 142, 258, -416, 415, -345, -44, 265, -423, 461, -167, -47, 329, -495, 346, -170, -131, 413, -404, 359, -92, -236, 378, -450, 276, 20, -233, 449, -391, 194, 51, -334, 450, -352, 165, 157, -358, 435, -337, 66, 220, -389, 436, -261, 4, 256, -458, 397, -197, -52, 343, -422, 350, -146, -157, 363, -413, 347, -43, -212, 381, -439, 237, 11, -237, 456, -355, 201, 55, -369, 392, -359, 159, 199, -305, 434, -326, 5, 162, -407, 423, -179, 50, 299, -422, 303, -263, -128, 331, -340, 427, -56, -155, 291, -507, 227, -49, -138, 499, -313, 264, -46, -378, 316, -401, 254, 214, -200, 462, -378, -6, 21, -402, 454, -163, 193, 281, -409, 255, -390, -118, 277, -273, 528, -53, -89, 186, -567]
2919e67P44l04P9N61p47N46m40k70O01o35P31q9k85N55q90M01r7l06Q43n65M47
2940C13k1o41N71p11L78L18m25Q15o31L7J12p20P52l60K35M98o95N52n73j72M69
2961A01n70Q01j54j54M48q80M13k12j93Q01n43N44j41n57M98p35M37K36l04P80
2981F16o53J10No64P08l74L40M00o14N21o20j01L64n15Q32k22l7L61q65M45l05
3002b68r0P08n09N70k07m55M47p42M99J17k06P17o68K15r2n67O83m56M20L01n30
3023a13N26o74L2K69m82P96k98N9K70p56M81l78nN86m86N78k70l30L84o77N22
3044C4kj55O39o75L00j44m31O21m82M39J55m56N39o57J47J96m32P32m09J30K09
3065B98o64N44m23R1M46m98N64l62j67L70o22N62j26j11N13o40L66j74k96N83
$$ y = [-567, 177, -127, -48, 513, -234, 312, -128, -398, 203, -432, 299, 210, -75, 480, -410, -9, -106, -412, 431, -134, 313, 292, -349, 222, -489, -111, 207, -218, 597, -34, 3, 115, -605, 147, -213, 22, 520, -175, 377, -196, -368, 101, -469, 332, 178, 24, 472, -408, 5, -207, -400, 401, -142, 402, 261, -296, 202, -533, -96, 140, -164, 616, -37, 73, 78, -586, 122, -252, 88, 488, -126, 395, -225, -326, 38, -477, 355, 133, 96, 457, -408, 37, -268, -358, 350, -159, 411, 204, -251, 196, -546, -47, 70, -136, 581, -87, 128, 36, -531, 152, -304, 116, 417, -113, 413, -261, -229, 40, -442, 354, 56, 115, 385, -371, 110, -268, -273, 313, -173, 405, 135, -195, 189, -488, 34, 32, -123, 516, -159, 141, -3, -434, 187, -295, 144, 299, -157, 382, -275, -128, 68, -364, 368, -41, 89, 298, -366, 178, -245, -154, 292, -206, 358, -4, -171, 199, -423, 139, 13, -98, 415, -225, 141, -33, -329, 254]
3085B54n03M29J6m04M98o00K66J47l60O32m83J55J28n44N62l93J73L13n19N35
3105C02m20m6L47n20N95k33p9L76o29M27k03j40N48n25M31j40l46M78n69L96O1
3126A11k85N58n60K00J7m08O01m05K68J84m97M71m80O2L05m35O29l07l8K61o34
3147c82M66k24JM85m82M11k52k85M12n21M72L2k09M79n99K15n8l43O10l96L48
3168A80J00m77M19n37J65K36l34O25l61L5J35n83M67k81J27M25m45M35l41k09
3188b19L11m75N12l2j02M19o08K47j51k53N42l48L78M8m00L61n56J89J66k69O23
3209C83l61Q5O8n48M46l21J71L76l88M40l85j39K41m77N32q6j5L81n69K75k47
3230a38j85M77l48M34k5k92L20n48K13O1j99N73l55J69J1m80L90l54K07K98l32
$$ y = [254, -249, 180, 196, -208, 290, -310, -44, 103, -257, 375, -108, 47, 175, -369, 193, -200, -27, 286, -233, 302, -118, -164, 183, -337, 258, 25, -54, 322, -307, 120, -83, -223, 325, -200, 231, 91, -255, 223, -346, 50, 111, -174, 384, -176, 24, 41, -367, 234, -171, 97, 281, -216, 255, -225, -163, 142, -293, 336, 29, -9, 252, -382, 84, -140, -139, 346, -136, 275, 23, -262, 150, -371, 101, 133, -76, 403, -196, 19, -39, -382, 228, -168, 180, 280, -197, 222, -315, -150, 86, -248, 377, 16, 51, 186, -397, 70, -211, -84, 341, -104, 331, -10, -219, 92, -383, 129, 97, -5, 414, -194, 53, -98, -351, 191, -157, 221, 269, -131, 230, -326, -137, 29, -240, 383, 22, 107, 175, -373, 73, -248, -77, 299, -89, 351, -34, -173, 68, -409, 123, 37, 22, 403, -166, 109, -138, -323, 154, -194, 240, 215, -77, 243, -305, -92, -31, -230, 343, -12, 157, 168, -312, 78, -276, -69, 229, -103]
3251a03M58l90p0J62m43M97j48O1L27m90K89k82j54M03l56M52m8k08L00n41K37
3272d7l9j46N26l48K50l2m00L38l91K28K13k61M66l83NP3m22M60k03J33K79m17
3294a18L24l36q3K84l44M76j10q4K57n04K39j04j14M54l29L05o5l29L10m27K56
3315d2J19k03M68l75P8K4m00M39k64J84K38l70L61l63n8K21l50M85j46j5K48n02
3337b23K72j88p0L99l20L55j21k34K69m32K74N1j44M29l63J32l3l31L75k66K09
3358D0J77k97L33l65LJ49l17M57j63K8K04m51K75k21l4L63l14L71j54j73K34m38
3380b93L03k0q4L70l56J82p8k82L58k92K55J19k65L38l86O0R5k66M26j99Q4J48
3402B17l99K75k51L4K88k88L68k02j23K07l88K93n9n0L48l62K04j24k18L29k89
$$ y = [-103, 355, -35, -105, 57, -386, 111, -37, 24, 351, -139, 150, -132, -286, 117, -239, 213, 165, -43, 257, -284, -47, -86, -232, 294, -54, 196, 164, -236, 102, -289, -61, 152, -109, 357, -26, -21, 52, -370, 90, -113, 20, 299, -118, 206, -130, -213, 71, -273, 203, 93, 9, 266, -238, 1, -103, -217, 237, -92, 213, 148, -181, 129, -298, -42, 77, -126, 342, -33, 45, 69, -331, 108, -156, 28, 266, -104, 257, -106, -164, 57, -293, 192, 46, 31, 279, -223, 49, -139, -209, 190, -130, 225, 104, -130, 139, -293, -19, 32, -112, 317, -46, 86, 53, -278, 97, -169, 40, 217, -80, 253, -112, -109, 40, -277, 180, 17, 45, 249, -202, 73, -148, -182, 181, -133, 238, 84, -89, 145, -293, 10, -10, -94, 276, -80, 102, 24, -258, 100, -192, 63, 182, -83, 255, -131, -71, 24, -242, 184, -15, 69, 217, -182, 93, -158, -124, 164, -124, 244, 42, -81, 126, -262, 31, -28, -78, 270, -92, 112, -12, -230, 99, -190]
3423a90K83N5k17L01l95J13N2k21M17k25J17P9l54K72k53P8K32k63L61k21r4J75
3445A02l62L26r1rK82l45K19j66j55K95k78K92Nj68K59l85J43J9j76L83k31J41
3467A00L0l09K68k77J24K01k37L40k47m0J19l38L53j30L4K55l54K42k08j09K76
3488I3k77L34n9j27K30l90J91m3j14L63k45J71k4k60K31k66J48J45j79L21k76
3509c3K0N1k88L16j37Q3K00l08K39k24p1K23k38L15o5q8J92l68J85o0j00L40k43
3532e9J97n2k25K27k99J84R5j53L12k72N7K3k67L02j72J23J70k70K30k43l1J68
3554D5k25L11q1l5J56l31J85j03n3K88k27K25o5j82J99l05J92M2j09L02k74J10
3576F5k5k30K64j96J42J25k18K47k58QJ12k29L12j24L2J39l06K09j64k6K32k13
$$ y = [-190, 93, 148, -69, 232, -163, -50, 2, -219, 198, -27, 90, 169, -185, 87, -166, -88, 144, -119, 242, 21, -73, 102, -260, 66, -25, -34, 248, -97, 122, -44, -199, 96, -182, 110, 115, -53, 206, -179, -36, -17, -193, 190, -41, 100, 130, -179, 89, -188, -64, 137, -100, 240, -7, -47, 72, -266, 87, -43, -9, 246, -108, 134, -74, -183, 93, -184, 150, 91, -36, 194, -196, -5, -48, -162, 201, -44, 127, 103, -157, 74, -192, -44, 101, -78, 243, -33, -13, 38, -250, 66, -71, 12, 212, -96, 143, -81, -152, 71, -167, 148, 83, -5, 187, -181, 4, -56, -156, 184, -59, 138, 86, -139, 88, -211, -27, 68, -85, 227, -45, 12, 35, -232, 70, -102, 21, 191, -79, 151, -92, -123, 45, -180, 131, 50, 15, 171, -160, 25, -78, -131, 157, -70, 155, 90, -92, 107, -198, -6, 36, -73, 229, -45, 65, 40, -190, 74, -122, 20, 145, -73, 174, -84, -76, 36, -193, 119, -5, 27, 166, -140, 69, -95, -121, 111, -102]
3598a02K48r8j05J68l08K04j9p2K74k40J49n0k03K32k24J72Q9j67K49k53K8M6
3620A8k04K82j36Q0J19k63J90j84j7J83j98K76j05n6J32k85J83o6m6K62k31J87
3642A21q1j58J96k44J71N4j13K46k39N8Jj96K81j74J17Q2j98J99k15J0J16j70
3664a36K65j22J2J02k60J65j03j2K06j95J83p5j30J69k34J75J1p7K23k29J02k0
3686B0j71K27j61J40O5j87K07k25M9P0j64K48j38N4O6k23J82j39%J83j88J98r3
3709B0p2J23k10J83m9m5J90k17J36p2j08K00j83J47J3j30J81k03Q7M3j47K29j59
3732d3N9N3j79J93j47L6J13j78J99j28k0J18j95J97r9l0J50k09J63o3o7J77k01
3755a01J53j8j08J70k00J33%j11J92j82Q1K4j39K13j60O8O2j82J83j51K8J25j55
$$ y = [-102, 146, 48, -57, 111, -197, 7, -12, -84, 190, -50, 99, 49, -154, 78, -146, 26, 115, -52, 197, -56, -28, 18, -186, 96, -40, 40, 159, -104, 86, -98, -115, 68, -130, 146, 41, -15, 117, -168, 15, -51, -97, 165, -66, 121, 40, -118, 78, -166, 5, 59, -54, 192, -47, 11, 12, -184, 97, -77, 40, 122, -76, 123, -92, -82, 34, -136, 129, 7, 19, 121, -139, 26, -77, -89, 117, -78, 105, 30, -100, 69, -165, 10, 21, -56, 167, -62, 40, 20, -151, 76, -85, 55, 120, -67, 140, -85, -36, 34, -130, 118, -20, 34, 100, -123, 59, -80, -80, 103, -85, 113, 20, -52, 71, -139, 44, -5, -50, 140, -77, 59, -13, -121, 79, -104, 43, 56, -74, 107, -96, -9, 34, -113, 116, -43, 16, 69, -110, 83, -64, -28, 85, -93, 106, -22, -42, 76, -119, 78, -21, -51, 99, -110, 53, -10, -77, 100, -101, 52, 34, -74, 96, -104, 29, 29, -82, 110, -72, 9, 33, -106, 107, -53, 15, 77, -105, 78, -73, -45, 80, -75]
3778g5J85j12k5R2j89J74o7j6J66j90J23p1r2J51j64J60J4r4J55k12O9%j09K17
3802I0j25R0K5j75J44j58N6J13j11K06j52nM1j91J72o3M0J35j55J21j29p8J22
3825A3j31J93jn1J12k27O3k7n3K03j06J12j0j54R6j81Q4R1o9K03j38j1nj73J51
3850a6o1R9J26j46J13j62n5R4j23K04oj0Q5k24O3o4l3J87p6J32l1j43P6j86R5
3875f2O5k8J86j30J2m7j65J45p0J18J11j21J01j75m2O1q5K03k8J4P5k07N7q8j0
3900a10J67o2J40n1j06N2j74R1M5j3J97j43L3p1j32J18q9J38Q5r0R5j77j1J5q0
3925a33J95k6L1M8j79O1j09J2J39o2J58p4q2M0j54R9J0J7J49j14M3o8j27J17q7
3950i6J30P0p9R6j67oOp0J79m7M1M1j60O0j03K7J10o5J53p4n2K4j43J02j2K3J20
$$ y = [-75, 110, -2, -27, 65, -124, 50, -17, -33, 133, -57, 66, -5, -97, 54, -110, 50, 64, -30, 125, -87, -18, -18, -127, 90, -35, 55, 80, -95, 49, -109, -53, 60, -51, 155, 3, -2, 39, -152, 20, -43, -3, 132, -23, 98, -31, -109, 13, -118, 75, 74, 23, 135, -92, -29, -56, -109, 94, -12, 100, 90, -64, 32, -149, -65, 26, -43, 160, 22, 11, 6, -167, -16, -77, 22, 148, 2, 115, -47, -102, -8, -131, 73, 67, 57, 142, -82, -19, -83, -116, 71, -5, 127, 96, -47, 29, -157, -62, 3, -25, 161, 31, 43, -4, -169, -24, -94, 24, 135, 14, 115, -60, -102, -41, -126, 77, 49, 63, 138, -69, -12, -100, -110, 57, -5, 135, 84, -22, 30, -144, -53, -8, -21, 176, 33, 66, -5, -137, -19, -108, 30, 115, 25, 120, -57, -68, -53, -133, 62, 36, 67, 115, -64, -3, -112, -100, 39, -23, 135, 61, -21, 19, -135, -36, -26, -9, 140, 26, 69, 1, -126, -9, -96, 34, 104, 25, 121, -46, -52, -46, -116, 63, 16, 57, 98, -62, -2, -105, -78, 32, -33, 120, 46, -6, 18, -125, -23, -35, -12, 108]
3977A08j03N9p7q3Q5p2J18M9n8O6j42J1On8J54o0N9J3j21O4j13M4Q1o3J26o6l0
4004cJ7j22J02k5K3R8r3N7q0n7P0o6J20Pm1P2j46L9rl9J26m1N9j0j05O9r6L7P7
4033D0n3J13r9jQj13J08j9K6Q3j13O4q0l9O0m9J17rm0M8j23L3j0j8J26o2O2k0
4061D0j05O8q1M0O5l6J07r6qLj06J15k5M8O9j11N9j01j5O7m8J21k7k3L5j27L5
4088c7k7NJ21n2O4m7q5M2p1N7N4j7R3p9l1k5p3R6j5O8N9q7L4j04j8M6m2J51j8
4117F2j3K6j39K7l3J5J20l7O8m6r9K9r0P9M1J4Q8q4j7n6q3R8k0R2N9o5L6j22l6
4146h6L7k0J36OKRj46J9m6K6J19j6Q2o9q0nr4O9N9L8Q4p3k5p2o3O6j0J04N1n8
4176D4L2j41k4Qj4J46QK4qj23J0p6M4J04LR3o4o4k3j08O8N2M3R4o9Jj01p2O3k0
$$ y = [108, 5, 64, -13, -96, -11, -83, 35, 84, 26, 92, -50, -39, -33, -91, 63, 3, 62, 75, -46, 18, -95, -51, 30, -33, 93, 27, -3, 14, -108, -6, -31, -8, 90, -3, 54, -26, -83, -13, -79, 41, 48, 7, 79, -67, -28, -37, -76, 50, 9, 68, 58, -47, 22, -74, -37, 40, -13, 100, 1, 0, 8, -105, 3, -16, 10, 93, -20, 44, -36, -75, -15, -64, 53, 44, 4, 52, -71, -38, -48, -66, 60, -2, 60, 40, -65, 3, -78, -38, 27, -9, 98, 2, -6, -3, -109, 6, -19, 29, 98, -13, 46, -55, -70, -3, -51, 70, 43, 20, 55, -72, -37, -64, -59, 62, 10, 74, 27, -58, -16, -87, -30, 24, 7, 100, 21, -10, -35, -108, -12, -27, 41, 100, 13, 47, -57, -75, -29, -71, 80, 62, 49, 75, -64, -37, -70, -55, 65, 28, 96, 50, -49, -20, -110, -31, 10, 24, 112, 28, 11, -45, -128, -30, -50, 42, 101, 36, 72, -50, -86, -49, -69, 67, 73, 75, 84, -62, -43, -89, -63, 56, 40, 122, 53, -27, -32, -126, -57, 2, 40, 124, 51, 26, -46, -109, -43, -53, 51, 102, 44, 76, -65, -89, -81, -95, 51, 59, 83, 75, -48, -38, -114, -70, 34, 37, 130, 66, 2, -21, -129, -61, -9, 34, 128, 59, 60, -41, -113, -50, -70]
4206g0J19L7j1J1j23m1noJ28J4L7oj15j6p4L7R1J3R9n5n7l6j03P2K0O5R6n7j1
4235E3q8n9L3k1J31K2J3Nj10l1l8RJ11NO0j0q8j8q5K4O1L5R2m2l3n2q4L2J9O8
4265A4P9m5J6q2o5K4k0R2L9K2kr0j3o4J5R1RP2rp8j6p6K6M5K7Q7l1k2n4p5K7o
4297f3P0O7m0K4q3l6nj7R2L4K0K1r9pn2PP1J1O9k4m3j7q9M2J8L8P7n0Ln3n5J8
4329e1lO5M8k0K5q8k2qj7Q2PL7%o8jn3NN4PO4k6k6j9o2K8RK8P1l4Km4m0J1j6O5
4364A0L6RLo3l3nlN8K1K8j0n0j0n5J7M6MO1k6j8l0o0L7RK7N5l3Nn4k6K2k4P4K3
4398D5j%n5k1k1mQ1mM1j9m0qo2K2M4K2N3j8l1l7m6J9%N7L8ron6m1J1kN4L1J3n
4433D5o2k1k3QN6J5N1j7m4k7n9K9K8M3M8k1j8m4n8K6J1N1K4J6mo9k9j9J1O4K6
$$ y = [-70, 49, 86, 75, 86, -37, -78, -83, -89, 39, 53, 90, 84, -31, -47, -121, -84, 7, 20, 119, 64, 7, -29, -132, -60, -40, 25, 121, 64, 53, -35, -94, -61, -82, 49, 71, 84, 89, -21, -52, -90, -81, 30, 35, 95, 85, -3, -21, -106, -82, -21, 14, 106, 64, 31, -21, -105, -73, -54, 14, 93, 48, 64, -18, -83, -59, -79, 13, 52, 74, 72, -18, -31, -95, -80, 11, 20, 92, 83, 5, -11, -87, -61, -16, 11, 98, 67, 45, -9, -84, -57, -63, 7, 74, 34, 58, -25, -61, -66, -83, 9, 43, 63, 84, -15, -22, -74, -67, 4, 15, 84, 60, 17, 0, -89, -47, -29, 9, 86, 36, 39, -14, -69, -51, -54, 11, 59, 39, 64, -24, -46, -54, -71, 11, 18, 55, 55, -13, -14, -67, -62, -8, -1, 63, 37, 11, -8, -70, -42, -33, -5, 66, 32, 34, -10, -50, -39, -55, 10, 46, 55, 58, -5, -38, -43, -46, 12, 33, 61, 51, 1, -9, -64, -47, -1, 3, 64, 38, 20, -10, -70, -33, -24, 3, 58, 25, 30, -24, -50, -28, -52, 22, 45, 44, 44, -11, -32, -53, -57, 24, 20, 61, 42, 2, -6, -68, -46, -2, 20, 73, 55, 24, -13, -59, -40, -40, 17, 55, 46, 40, -16, -57, -46, -48, 6, 37, 50, 45, -17, -38, -61, -53, 3, 18, 69, 52, 8, -19, -78, -49, -21, 22, 70, 49, 31, -13, -71, -45, -34, 17, 41, 57, 53, -16, -45, -64, -53, 11, 37]
4464C7J8jo8k5m9J3P0K2M5lm9m4o2L1K9M7O2j4j7p0l5QON5O0Qj9o6k4l3RO6L5
4497D2L0j7m8l5m6MN6L8N9j5m9m7o1L1QO5N5j6j0p1m2pKQ7L7J8Np7m7k4J9N6L6
4530C6M8j1n7m2n8K1M1N1N3j6k5o1n2J2J1O7M0L%o5m7k1MO9L4L7jp5l0m9J5O2
4562fK6N7j6l2n2n2K1J9M4N4jj7n4n0lK3N4L1J7%o7j8m1lO6L1L6j4m4k5n3J2M5
4595a2J6N3j1k1l6m9MJ7M1N7k1J8n8k9j3rN5L6QJ9n5k7k8oM9QN0ql3j7m0RJ5J6
4629bM8k2Ml3l1nMJ8M6nJ2l4j9j1j7L6J4J5K1k4j1l5j2L6kM0Oj5pl5rJ8LM0nL
4665C0j5l8J1j7J7L5mJ5k1j4ok5K6nK6J8l4J1k2j3J0kL5noMl0PqkL8k0K6qj1l
4701@j7jL4j6K8qj0%k3J3k7J4M1l8K9k5j3J8j9J4J4pK4l6J2j9nJ9rK1Qj0Mk4Q
$$ y = [37, 55, 54, -14, -39, -88, -75, -5, 17, 62, 59, 10, -34, -96, -65, -36, 11, 73, 59, 42, -28, -63, -55, -49, 6, 66, 74, 55, -11, -35, -68, -59, 7, 42, 72, 55, 7, -28, -74, -70, -14, 24, 83, 68, 19, -28, -89, -58, -50, 15, 70, 54, 44, -27, -69, -76, -74, 13, 50, 68, 73, -4, -51, -75, -56, 0, 36, 84, 73, 16, -26, -84, -63, -22, 29, 82, 66, 41, -20, -72, -60, -49, 18, 58, 61, 61, -4, -51, -72, -68, 1, 35, 72, 71, -4, -34, -83, -68, -6, 20, 77, 61, 29, -23, -75, -54, -35, 9, 63, 62, 45, -9, -59, -62, -39, 15, 46, 63, 63, -4, -22, -63, -66, 0, 31, 67, 53, 9, -16, -69, -57, -12, 4, 57, 46, 25, -11, -60, -56, -39, 2, 59, 38, 56, -2, -31, -44, -53, 2, 38, 46, 65, 10, -17, -45, -51, -2, 6, 56, 48, 15, -2, -42, -33, -18, -2, 46, 24, 28, -5, -36, -41, -37, -19, 27, 22, 34, 0, -19, -30, -47, -11, 3, 18, 39, 15, 4, -31, -43, -7, -9, 31, 37, 22, 15, -20, -29, -11, -8, 32, 27, 30, 15, -23, -12, -29, -12, 23, 19, 34, 13, -1, -7, -32, -6, -11, 15, 33, -1, 10, -12, -25, -15, -17, 18, 13, 7, 11, -19, -12, -20, -22, 16, -4, 22, 14, 3, 0, -17, -18, 16, 0, 28, 20, 10, 10, -13, 0, -27, -13, 28, -10, 19, -6, -19, -1, -20, -6, 8, 1, 25, -11, 1, -18, -23, -4, -13, 8, 16, 6, 10, -14, -6]
4736fj2RL0j8K5nk6qpPK3jJ9k8lRl1J3j0K2K7k7J1k5lQk7L3J2nQk3Jkj3K6%J4
4774A7qj5J0k7QK6nK3k1j0J0l7K3nJ3K1j7J3k7j5J3mK8oNJ7m4J6j0j6K0MJ8jk2
4809eLj6KJ3jL4k5lOl4K4qJ7K1k3K2l2nRj8K9PnK4m6J4j9mK4j7L0mpNl8J0K1j3
4847hL0k7Npk0J5j7L2J2k4K1l4J0k%K3KQMl0J4rqK9j6K0qj2mk3J5%NK9k7jqj1
4885b2J5j6K2Pj0J2k5PKj3L6j6QOk9J0j3RJ5KK0k5oOk4K1kRK0k7J0j2j7K7j6J8
4921ILj6J4k4nMj2L5mOOk8jj9J7J9oK9j9k4J4l9L3PQJ7l4K6k9j3K9j6J9J2j6J2
4957A4k8j3J1j9N1j0J1rj6mk2J4J3%L9l2Lj9l9K5QJ7J9j4Nj5k6RNL2LJJ6m1pK
4993a6j2M0OMmk8Jl1K4J7KL2j3j2j9k6K3nK5J4j3Rl7k0J4j5M2NQKl4lj5qM5qK9
$$ y = [-6, -18, -9, 21, 3, 28, 23, -3, -11, -18, -11, 12, 11, 30, 2, -1, 8, -23, -10, -20, 2, 29, 2, 13, -12, -15, -7, -34, -1, 11, 6, 14, -9, -8, -10, -23, 3, 3, 17, 9, -6, 4, -23, -15, 11, 6, 29, 8, -2, 8, -29, -6, -11, 2, 23, 6, 19, -8, -23, -10, -14, 14, 8, 13, 30, -14, 2, -8, -24, -4, 0, 18, 17, -5, -2, -18, -16, -3, -4, 30, 5, 2, 8, -26, -2, -10, 7, 28, 5, 27, -5, -10, -1, -19, 10, 17, 12, 36, -10, 4, -15, -19, 5, -12, 18, 14, 7, 12, -26, -16, 5, -8, 22, -5, 0, -7, -27, -12, -29, 3, 15, -9, 12, -22, -12, -14, -14, 9, 11, 19, 23, -7, 7, -2, -10, 19, 3, 23, 15, 3, -1, -24, -9, -9, -4, 25, -2, -3, -11, -22, -7, -23, -1, 6, -4, 8, -17, -10, -8, -21, 15, -1, 7, 13, -16, -6, -19, -10, 5, 7, 27, 2, -4, 2, -22, -1, -3, 6, 26, -1, 9, -3, -20, 7, -9, 9, 12, -4, 10, -14, -19, -15, -27, 8, 4, 10, 16, -12, -13, -32, -15, 4, -2, 27, 8, -16, -2, -41, -8, -1, 7, 24, -10, 16, -13, -26, 3, -13, 6, 18, 2, 14, -14, -27, -16, -35, 16, 6, 17, 8, -8, -12, -34, -20, -7, -7, 32, 0, 3, -16, -55, -30, -22, -5, 14, 0, 5, -10, -36, -27, -22, 10, 13, 14, 30, -11, -18, -16, -28, 12, 18, 22, 18, -10, -9, -40, -16, 1, 3, 35, 22, 10, -9, -35, -12, -17, 8, 22, 9, 18, -19, -39, -25, -40, 2, 7, 15, 17, -17, -20, -35, -43, 2, -6, 23]
5030B3rj7kl5J8J1J0M1j0%k1m2K4j7M0J4j6Rk8j9loL4NK1Nm3Pk1mJ8JL8j0j2k
5066Bm2QJ0J6L6k1J6k8k6K3k5K7K0qK8m1kj2j5L9%J9Nk9kl1mL2%L5pj5j9k3Pm
5102c1J2L3qK0k6k5LnK4RJ9Ol1rj8oK7QK2mrj6k0kRK0J5Qqj1l8J4mJ3K8oKj6j5
5141a6mj5K7J3Rml1J7k5oK6NK7lj3ll0JJ3J0J2J2lpl4OJK1LMNk1j2J0j6J5J9K
5179A5Pl1Nj4qK2rK1J2j8nk0j4J5J2K4kJrk9J7j5QL3mNk0j1Kj1L8lJ4jk8mpnJ4
5218cLK0%k2rj9J8JNK2j2Pj8j4MjJ7J3nJ8k9j4%mK4MK0Kk2kj2lK0lJ7jj6j5jl
5258a3QJ0OrNnk5J3j5K2K2j0Ok3j5jNK6J3Klk2j0j6OK6RRKj2j9%lJ1J3PqKj3j3
5298a2j0J2J9J2J1j7j9Jk1mJ8J6J6jk8kl2RJ5K9J0mj3lk8oK3J7J3Pjk6k2NMJ4
$$ y = [23, 14, -3, -5, -40, -22, -11, -1, 40, 30, 30, 9, -33, -9, -26, 14, 28, 12, 21, -7, -26, -29, -35, -1, 4, 25, 30, -13, -6, -27, -31, -13, -12, 26, 16, 4, 2, -40, -32, -22, -6, 30, 9, 25, -3, -29, -6, -31, -4, 16, 8, 36, -5, -7, -19, -34, 5, 5, 24, 29, 0, -2, -33, -37, -5, -5, 30, 23, 8, -11, -34, -27, -31, -19, 14, 6, 26, 0, -25, -22, -27, -3, 6, 25, 31, 0, -9, -27, -33, -6, 2, 24, 20, 11, -5, -25, -27, -18, 2, 17, 25, 17, 6, -32, -18, -22, -9, 19, 13, 15, -1, -16, -20, -35, -8, 5, 14, 10, -21, -4, -29, -35, -9, -4, 23, 20, 7, 4, -26, -25, -12, -2, 10, 22, 19, 12, -22, -16, -15, 6, 9, 13, 18, -3, -15, -5, -21, -6, 13, 15, 22, -9, -4, -18, -26, -4, -13, 8, 20, 2, -3, -23, -37, -22, -10, 14, 12, 13, 4, -25, -8, -23, -15, 18, 14, 19, -1, -12, -10, -21, 17, 14, 28, 27, -1, -5, -12, -17, -3, 0, 20, 20, -2, -11, -30, -12, -11, -6, 16, 4, 11, -7, -21, -17, -18, -1, 12, 7, 25, -4, -18, -18, -22, 2, 6, 26, 28, 6, 4, -8, -11, 9, 6, 23, 22, 6, -9, -10, -13, -5, 5, 11, 2, 7, 2, -23, -10, -25, -3, 19, 9, 15, -8, -23, -24, -19, 7, 20, 22, 19, -3, -13, -29, -23, 3, 12, 21, 23, 11, -8, -8, -11, 0, 13, 20, 12, 14, 1, -12, -22, -10, 9, 21, 32, 15, -4, -3, -24, -28, -10, 6, 22, 21, -7, -9, -41, -32, -17, 12, 22, 18, 5, 2, -26, -32, -9, 8, 21, 28, 27, 1, -21, -16, -12, 2]
5334BJ5J1Ok7k1jpJ9J8J7oj6j9j6pJ0K3K0Ok1k4j3pJ7K3J1Pj3pj8j1LJ0L8LQj7
5371A6j8l4K1J6J1K3kok2k9kPL0J1J2jm5qrjL4MJ7Mk4j8j3oQL0K9Jk3k9rj2J2
5408b5K6K6Oj9k0j2k0K1J2K3Rkj7l6kMJ8K4J5kk1j6k4mK0K7J2Jj5k0j5j6J7K7
5442BJ0J1rk3k2jNL2OJ6npk2k2NJ7J8J7J2k2k1j7oLL6Rljj7l2J2j2J7K6RNm1j1
5480b6%nK2K0NJ2k6oj4NNK0J7pj5ok5KLK0J9LQl4j8lRJ6J2J2mj4j4j7nK3J2K2
5518B8j5rnl1J3QJ8J5j1j2Lj5JmQK9kkrk6QnJ9J3nJ2k2j0j3%K9nLQj5lj8NKK1
5558FLj6J2j2j5JlJ6QMJ0rk4pPJ7PJ3%k6rpJ0J2J0LQj5nj9PRoK6j0Kj9j6J6pJ6
5599bNj1J4k9Oj0JK1j2K1Kk2Mj5J3J2MJ0nJKk8RNQJ8j3kqj3RpJ4J5Qpk3Jmj3J8
$$ y = [2, 17, 28, 34, 7, -14, -15, -22, -3, 15, 32, 26, 10, -9, -25, -32, -22, 1, 21, 27, 6, -18, -31, -38, -21, 2, 13, 20, 7, 0, -18, -29, -26, -16, 22, 25, 33, 16, -2, -36, -15, 1, 12, 35, 33, 27, 5, -24, -26, -19, 11, 22, 34, 33, -12, -20, -29, -30, 4, 8, 25, 29, 5, -13, -26, -32, -24, 6, 35, 36, 13, -16, -25, -37, -25, 1, 27, 33, 14, -6, -18, -38, -17, -5, 18, 27, 25, 8, -28, -30, -26, -8, 16, 31, 29, 8, -8, -32, -36, -16, 11, 23, 24, 9, -11, -26, -42, -25, 2, 12, 23, 14, -9, -31, -32, -27, 5, 11, 27, 22, 15, -7, -29, -24, -7, 11, 28, 40, 18, -3, -20, -26, -23, 13, 22, 19, 18, 1, -31, -19, -31, -14, 12, 21, 26, -15, -26, -26, -31, -9, 11, 16, 28, 2, -4, -18, -13, -8, 12, 29, 22, 7, 1, -24, -22, -19, 1, 20, 23, 31, -3, -21, -24, -15, 1, 13, 25, 21, 7, -7, -24, -29, -6, 6, 28, 13, 4, -1, -32, -19, -11, 7, 22, 11, -1, 2, -13, -12, -16, -8, 21, 19, 17, 8, -18, -10, -15, 4, 17, 12, 24, 2, -8, -21, -21, 8, 3, 6, 14, -1, -4, -22, -17, -15, 6, 9, -7, 5, -7, -22, -21, -24, -8, 0, 4, 14, 5, -19, -26, -19, -2, 5, 18, 18, -8, -17, -24, -14, -2, 8, 11, 19, 4, -1, -20, -13, -4, -10, 16, 6, 8, -11, -27, -11, -18, -2, 3, -8, 6, -23, -17, -27, -26, -5, -17, 4, 6, -16, -12, -27, -14, -2, 2, 12, 7, 8, 10, -18, -9, -4, 4, 22, 9, 7, -1, -14, -5, -12, 2, 17, 25, 18, -5, -4, -8, -21, -3]
5640cJ0M%j9Oj7mJ8rL0j3okk2OKPL1j5Lk3j3J9j1K7JRJ1k7omj7K5kJ9lj6mplJ1
5681gmK8j1jk2j0LJ4mK2pJKk7OqK1J4j2J8j7oj0j2L2qK0Nk9Qj2oK2pK5j4Jol0
5720b8OMNL6j8Mj0k8J0j9L1QJJ5k7lj5lK8kJ7Qk1kk9J1JNK5kLql6K1rJ3K5kJ2
5759B7k9j8J3k5L0LK3pk8lj6pL3j5K7%kJl9QRlL7lqOl4Kj7K1L1rK2j7k8Rk5K7
5797djJ4K1l3Mk2JK4j7L0Ok6Pk7oJ0mL6j3J3ol1Oj3%L0rK3j8rKj8L4pQK2j7KK
5836A4l2J7j5K6Oo%l1Rj7OL1%oRl3K0l6J4J7kL4k9j1Oj5J4mJ6J0k0J8l3lJ6j8
5872b8L5Lj3K0l2J1j2kL1j7J8J0j8Kk9K4%j5K7k5P%k6J7jKJ5k4K7k2lRk3L9j6
5907iRK2l7K4k1j0K4j9L6pk3J6l0K6p%L4j8Nrl4L4j3QJ8k3K5l9POk2L2mkLk2K6
$$ y = [-3, 7, 11, 11, -8, -2, -19, -23, -5, -14, 16, 3, -3, -5, -27, -21, -19, -12, 19, 4, 7, -16, -29, -10, -21, 6, 7, 16, 27, 0, -6, -10, -27, -2, -4, 15, 12, -4, -8, -15, -18, -7, -11, 17, 6, 5, -17, -27, -24, -10, -14, 8, 1, 2, 4, -23, -17, -25, -4, 10, -2, 16, -1, -7, -17, -29, 3, -5, 15, 20, -9, -1, -13, -19, 3, -4, 21, 7, 8, 2, -28, -22, -18, -13, 23, 5, 9, -1, -29, -19, -38, -7, 1, 2, 17, -10, -13, -28, -31, -3, -5, 12, 20, -1, -3, -32, -21, -20, -15, 10, 8, 11, 3, -33, -12, -21, -8, 17, 15, 27, -2, -20, -7, -32, -2, 1, 24, 17, -11, -14, -30, -37, -4, -19, 8, 8, 6, 7, -32, -24, -15, -18, 19, 16, 8, 14, -20, -18, -35, -14, 17, 8, 30, 13, -15, -6, -31, -4, -5, 9, 30, -3, 1, -21, -20, 4, -13, 17, 23, -3, 4, -23, -29, -19, -23, 13, 0, 13, 7, -24, -18, -31, -31, -1, -10, 13, -5, -14, -12, -30, 4, -3, 5, 27, 10, 12, 14, -18, -1, -16, 10, 16, 10, 10, -21, -12, -29, -23, 8, 8, 2, 11, -22, -2, -38, -24, -7, -9, 25, -4, -15, -9, -24, -10, -14, 2, 12, -8, 10, -23, -26, -10, -28, 7, 10, -3, 17, -15, -4, -16, -18, 13, -4, 14, 24, 6, 8, -21, 3, 3, -12, 15, -10, -3, -3, -29, -12, -13, -11, 4, -20, 7, -15, -18, -9, -32, 7, -9, 0, 22, -15, 9, -12, -22, 2, -17, 19, 12, -11, 5, -25, 1, -6, -6, 28, 10, 15, 6, -28, 6, -7, 1, 19, -4, 21, -18, -11, -5, -27, 5, 1, -1, 2, -20, 6]
5944Fk7mK8j0J7j6j1L1k8J1jqK6j4J8j4k7K7j4J8J0qNj8lJ0k1K5j1J1Nk2J2j2
5978iLJ1j6K8j2k4K3k9K3j4J4K7l8J3mk1K9j9K7Kj6K0k5PNj6K8qPkk1K1k9KJ9
6013Fk0L4k8LQk6K6j1oL0k0Roj7J0j5K6Ok7L4l7MMj2L6k4J5J2k4J6k6J4J4k3M1
6048B6k4RLl3J7ljK5j7K2m0JK0l2K6Lj3K2l8J3Kj8M2k7J3J4k9J5k4NK1%J6j2k
6083BLl4K6qJ0J3j5J9j6%Rl0L9qj5L0m2J5%k6L2j5J8Mk3K0m3K2krM3k0nOl2K5
6119gj9K0K7j2J7k3pRk7K5KkL2l9J2roJ4j7K0J1k8K7l4J7j2kK9k1Pqj2J9k7LL0
6155Ik0K1j7%Ok9K7qOK5k3J9j6k0K9k5L5Lj8K3l9J4pkL1j9J5mk2J9k4OOj5L6l3
6191a1QNk3J9rJ1J6l2K8j9j0J9k6L7jmJ7l9K0j9nL6j7J9pj7J7l1K0Qj5K9k6NO
$$ y = [6, -21, -25, 3, -7, 10, -6, -17, 14, -14, -3, -4, -12, 14, 0, 18, 4, -23, 4, -10, 8, 18, 10, 15, -3, -6, 4, -17, 8, -3, 8, 13, -9, 3, -9, -6, 5, -11, 17, 5, -19, 4, -25, -2, -16, -2, 25, -13, 0, -4, -25, 4, -15, 12, 14, -2, 18, -7, 0, 5, -11, 17, 9, 16, 14, -7, 14, -15, -13, 6, -14, 20, -8, -5, 3, -23, 3, -8, -14, 16, -4, 5, -1, -18, -8, -23, 3, 9, -18, 16, -21, -17, -13, -25, 11, -13, 2, 14, -10, 6, -20, -6, 8, -15, 26, 2, 11, 14, -19, -2, -5, -6, 19, 2, 24, -16, -15, 5, -27, -1, 2, -11, 11, -27, -14, -12, -30, 12, -15, -2, 12, -17, -2, -26, -21, 0, 0, 16, 4, 2, 5, -29, -3, -11, -1, 12, -3, 16, 0, 0, 9, -21, 18, 10, -5, 25, -17, -2, -2, -28, 4, -11, 7, 11, -12, 8, -35, -13, -15, -24, 19, -1, -6, 0, -32, -7, -26, -6, 21, 9, 26, 3, -4, 5, -22, 3, 5, 3, 35, -4, 8, -1, -7, 7, -10, 10, 21, -7, 20, -14, 3, -9, -11, 18, -3, 4, -4, -16, 3, -24, -21, 9, -11, 10, -7, -7, -1, -30, -3, -11, -5, 20, -3, 16, 0, -20, 9, -16, 19, 22, 4, 27, -12, 2, -5, -7, 24, 5, 20, 16, -6, 13, -11, -5, 1, -14, 22, -11, -3, 2, -21, -2, -11, 0, 16, -16, 12, -7, -17, 2, -24, 13, 12, 8, 25, -14, 6, -13, -18, 18, 1, 20, 13, -4, 13, -18, 2, 10, -5, 24, -2, 3, 9]
6226Il2K6k8K2K1k6K2l2jRj8K8nj2K8l1K4k3kL0j2K8j3k5K4k8J9kj1L3k3J0lk0
6260a4J8j6J5J5k4L2l9PJ4k9K7j0j0K8l1K7k8nK8j9J8j1jJ3k2J7qk0M5k7K3Qm3
6293b2L5k2J0J6k3L0k8KOl1M6j8LJ5j6Kj2qK2k2L7j0pJ3m9L5j2%K7j9J3k3pK5
6327Hl8K5J2j7K7j5pOj9L5j7QK0m0L4k7lOj5L5j4mJ3m0L6l0J1K4k5J2qoJ8l0K8
6362CpnK4k7J4kl4L8k2K6jk6L3l2K2jk0L8j3nJ5l3K2j4jL2l4L1k3j6L2l3K0Mj6
6397a1K6k4J3nj8K5k7K0J1k7L9l0nK8l8M2k0JJ2k9K5j6OK2k7L6k8KJ0l2K5J2j6
6430BJ9k0Pj2kK0k8K5rj3K8m5J8J7l6L9j7QLl3L4j5nL0l9M6l3kJ7l1L7j1NK4l9
6465a1J6j3LJ8j6LJ1k4L2k9OMk3L9j6Rnk4K0j8J2J2k6K8k1mK6m2K9n%K4l9L3j6
$$ y = [9, -23, 3, -25, -3, 18, -8, 14, -18, -19, -10, -28, 0, -5, -17, 11, -20, 4, -19, -21, 9, -3, 25, 12, -13, 11, -17, 2, 0, -11, 22, -1, 9, 6, -14, 4, -12, 3, 18, -6, 26, -13, -6, 8, -21, 6, -4, -14, 14, -17, 10, -18, -23, 5, -14, 4, -7, -8, 5, -17, 0, -8, -28, 17, -10, 13, 21, -22, 13, -9, 1, 17, -6, 24, -4, -2, 4, -27, 19, 1, 4, 19, 3, 5, -7, -15, 7, -15, 22, 12, 5, 18, -31, 4, -8, -8, 19, 0, 13, -10, -17, 8, -30, -5, 7, -10, 17, 2, -5, 1, -18, 17, 0, 8, 28, -12, 22, -5, -8, -2, -17, 18, 4, 0, 13, -27, 9, -21, -10, 14, -11, 1, -7, -13, 5, -25, 3, -4, -9, 15, -12, 2, 0, -34, 4, -18, 8, 7, -19, 14, -18, 4, 3, -17, 21, 8, 3, 18, -15, 7, -7, -8, 24, -10, 21, -2, -18, 14, -19, 1, 5, -11, 15, -9, 4, -1, -19, 6, -21, -1, 10, -17, 22, -8, -13, 15, -23, 19, -1, 0, 12, -17, 8, -8, -2, 20, -7, 29, 1, 3, 13, -19, 6, 18, 2, 21, 1, 8, -4, -6, 14, -14, 11, 2, -11, 17, -28, -10, 7, -29, 10, -7, 1, 4, -29, 5, -10, -15, 15, -24, 22, -11, -13, 4, -27, 10, -1, 4, 28, -11, 5, -8, -5, 13, -3, 0, 11, -13, 19, -10, -4, 0, -23, 16, 0, 9, 4, -20, 0, -18, -6, 6, -20, 8, -13, -17, 9, -33, -4, -9, -9, 15, -24, 9, -7]
6500gj1L1k2J9pnL1m2J4Jj0K4j8J1Kk1J8j8LJ2k1L4k4jPk1K1j2MJ5j8K2k1j2K4
6535Bk0K6j1OLk3J0qnL1j1J5qk1J5j6J6Rk8M4l0K1ql0L0k0J1J1k8J5j0MprK9l
6571BnJ5l5RJ1j8L5l2L9j6k3L2n4L1J2j3L8l7J4nk5K1rJ3J0j8K7k2mK1k7K1pQ
6605IJ1k8J4j6oJ5j8L5k1j2J5k8J7MrL1k8K3nk2K2j6QK0j3L3m0Qoj9L4j9RJ2k3
6640iJ7j7jK1l3M2mk2Ql1K8j1j2L5k0K1k7pJ5j4J5J0j0J4k0lQk5L7j3J7Pj5J0
6674A1k5NK8j8J9k1MJ4k8J1pKK2k6L5k8k1K4k4L0j1j1L6k9jJ0l2L3nOOk4K8k4
6708a1qK3j6K4nkJ1m2K6jmK8k6K0k0oJ6k5K0nLL2m5K3j3j6J1nK4Kk3K0k3QJ2k4
6744a7L0j7kJ8k7K4l2J7K7m2L6j9oJ5l0L6j6nK5k0J1pj6L1k4J5jk0L7m2K8jj2
$$ y = [-7, -18, 13, -9, 10, 3, -2, 29, -13, 1, 2, -8, 16, -2, 9, 11, -10, 8, -10, -7, 5, -16, 18, -6, -7, 0, -21, 0, -12, -8, 7, -11, 11, -10, -22, 2, -18, 8, -3, 3, 6, -17, -7, -15, -20, 11, 0, 15, 7, -14, 1, -15, 1, 10, -18, 26, -4, 17, 9, -21, 9, -11, 0, 11, -17, -2, -12, -8, -15, -24, 5, 2, -3, 12, -23, -14, -3, -21, 14, -18, 21, 5, -18, 14, -40, -9, 3, -10, 28, -9, 5, 0, -25, -4, -13, 0, 10, -8, 19, -3, -7, 14, -13, 8, 1, 9, 20, -8, 6, -10, -16, -1, -19, 16, -5, -17, -2, -30, -13, -9, -18, 13, -15, 8, 3, -19, 3, -13, -5, 15, 2, 35, -5, 3, -3, -22, 12, -7, 2, 14, -9, 8, -9, -10, 11, -22, 20, 16, -6, 2, -29, -1, -12, -24, 11, -9, 12, -15, -22, -7, -21, -6, 4, -6, 8, -12, -15, -7, -32, 5, -8, 9, 16, 1, 11, -14, -9, 19, 1, 20, -1, 3, 17, -11, 0, -7, -5, 17, -9, 26, -2, -23, 1, -23, 7, -4, -15, 21, -8, -9, 1, -31, 2, -3, 3, 9, -15, 13, -11, -19, 4, -12, 12, 7, 5, 16, -26, 0, -1, -5, 23, -3, 17, -3, -9, 7, -18, 2, -3, 0, 32, -13, 10, -3, -19, -8, -13, 11, 13, -10, 10, -13, -5, 7, -17, 13, -4, -6, 12, -15, 9, -23, -6, 21, -21, 15, -4, -10, 5, -25, 11, -5, -10, 15, -5, 6, -1, -17, 14, -10, 5, 4, -16, 21, -21, 7, 6, -6]
6777fRmJMk2J1jrJ7j4J7rqK6k8J5mqL2k6K0j3jK0k4K2j0j3J4l8L1Qk1K2k0J5Q
6814A3l5K3j4J3J9m2K2j4ORk3K6j9OK0k4J8k2JJ9qNkrJ5j9K3%mJ3j9J5Mj4J6k7
6850iJ5Rk5K7k3rPrK5j6LQj5K6l3MJ9j8J9Lk4J8k6K3%LPj4J4Mk9K4j7KJ3j9L1
6887A8k6QJ2j6K0j0PMk7K8l2%J7k3K7rj4K2k7K5mqK1l0J7mqJ7k8K7NpPj9POj5
6924a2J8mJJ1k0J8k1kK5l2L2pLjk1K1j9J0J8k2jMj2J8k6J6Jj4K6l2K2kj4L2k7
6959a3K3kk0K4l2K6Kj5K3j6Rmk2K4j0JK6j8MmkLj6K6j3nK6l9J7rnJ6k1J9kj7K0
6996Dj7NJnJ7j0Rmj4J6jnK6k5J8rnJ3k7L2j8J0J1k1OmrJ2j9J1J7k7K7l0J7oj0
7033a4J6j2J0jj6J8j3LJ5k7L0j1QJ0k5QJJOrJ6plJ7j5LNj2K8l8LJ1k3K4j6%J1
$$ y = [-6, 3, -1, 0, 4, -18, -7, -8, -17, 0, -14, 3, -6, -14, 12, -16, -1, -5, -13, 19, -7, 13, 0, -1, 19, -5, 17, 7, -6, 8, -30, 1, 9, -12, 10, -10, 5, 13, -22, 1, -13, 0, 19, -23, -1, -15, -9, 0, -23, 3, -16, -10, 10, -14, 4, -18, -17, 2, -6, -1, -3, -12, 3, -16, 7, 7, 3, 16, -3, 12, 16, 2, 18, -9, 6, 15, -10, 17, -6, -15, -8, -17, 8, -8, -5, 3, -12, 14, -19, -15, 4, -14, 5, 8, -16, 2, -24, -1, -1, 2, 9, -5, 9, 13, -16, 8, -9, -7, 6, -13, 18, -8, 0, 12, -4, 16, 6, 13, 17, -10, 18, -14, -14, 3, -20, 7, -2, -16, 6, -21, 4, 0, -8, 13, -17, 0, -4, -12, 5, -23, 4, 9, 2, 9, -10, -3, 3, -12, 6, 2, 3, 14, -6, 12, -9, -11, 14, -18, 14, 7, 10, 9, -12, 9, -10, 0, 18, -4, -5, -1, -13, 5, -21, -5, -4, -18, 8, -24, -2, -4, -18, 14, -13, 10, 8, -12, 12, -20, 6, 8, -7, 16, 0, 9, 5, -17, 7, -3, -2, 24, 6, 10, 6, 4, 7, -9, 17, 4, -1, 25, -14, 3, -6, -11, 5, -16, 3, 1, -16, 4, -13, -8, -7, -12, 5, -5, 4, 0, -14, 2, 1, -4, 22, -3, 15, 6, 1, 14, -13, 19, 1, 11, 22, 1, 7, 3, -6, 6, -13, -2, 15, -12, 15, -15, 2, -4, -14, 2, -10, 0, -1, -17, 1, -12, -9, 6, -21, 9, -2, 6, 16, -9, -1, 0, 1, 7, -2, 14, 7, 4, 21, 6, 9, 14, 2, 30, -8, -5, 6, -17, 7, -9, -9, 2]
7070Bj4J5k4K0Lj7K9l9K1Oj7K0j1%K0k9K3j3oK4k7J9Qk0K1k7J6pLK0k4QJ2j8K2
7105A9k1QRk0J7j7lJ5k1J5j6RJ3j7RomK0k0J7j2NOk3K7j2LJ4j5J3Mj1Qj9Q%oK8
7143B4k6J0J1l3L0j8oJ4j8J8j0jJ8k5QnMK1l2J9j3QKj6J5%jJ7k3J6Ok2K1j2QM
7179A3j0J0j4RKj8K0j3JJ8l1K8j9j1J7j6J8prJ6j9J7j0qL0k3J0knJ5j7QOk7K9
7214Hj6J2Rj1jnJ4mj0K4k6J2Mj9K6j1j2J6j8J9j2kJ4k3J4ojMqJ1%j3J7k0K0oj
7251aJ4k0K2j5%Qkj6Qj0K4j5JK0k6K4j8RQj9Rn%Rj0J1j5%Pj0MMqK4l6J2J3k0K3
7290Hj9OJ2j7QnJ4onJ5nnJ1j9J6j9JK9k4J2rnK2k5J4Mj9K7k3MPj3J3j0J6j1j1
7327a1QmNkj1K2k4PJ2k6K9j9kJ6j5J6%mJ2j6J0oJ2Oj6J2okJ1k0J5mpPj6QRj5K2
$$ y = [2, -12, 3, -21, -1, 2, -15, 14, -25, -4, 2, -15, 5, -6, -6, 14, -15, 8, -5, -11, 13, -14, 5, 13, -7, 14, -13, 3, -4, -1, 19, -5, 3, 15, -3, 19, -2, 6, 15, -5, 12, -5, -8, 7, -14, 1, -15, -6, 7, -10, -1, -7, -11, 9, -11, 6, -6, -1, 5, -18, 9, -3, 0, 14, -1, 12, 16, 5, 13, -6, 2, 2, -4, 24, -2, 8, 19, -14, 16, -2, -8, 6, -12, 6, -4, -5, 13, -12, -4, -9, -5, 16, -16, 3, -10, -2, 0, -16, -1, -1, -2, 15, -8, 8, 14, -8, 13, 1, 9, 13, 3, 13, -1, 8, 10, -8, 12, -1, 0, 18, -13, 15, -4, -15, 2, -14, 4, -3, -12, 4, -15, 2, -8, -16, 14, -9, 1, -1, -6, 9, -8, 0, 6, -21, 8, -8, 4, 13, 2, 1, -4, 10, 6, -4, 20, -6, 6, 10, -9, 17, 6, -6, 10, -8, 11, -1, -3, 11, -12, 2, -4, -5, -1, -9, 2, 2, -11, 6, -14, 6, 0, -1, 13, -7, 15, 0, 0, 8, 6, -10, -2, -12, 12, -3, -2, 18, -8, 16, -2, 7, 15, -4, 5, 0, 0, 9, -1, 10, -5, -5, 2, -8, -4, 0, -8, 16, -20, -8, 5, -15, 8, -11, -5, 7, -10, -2, -7, 7, 1, -4, 11, 6, 1, 12, -7, 9, -10, -9, 20, -4, 8, -1, -6, 16, -9, 5, 9, -10, 17, -6, -2, 5, -8, 5, -5, 11, 0, -11, -3, -7, -2, -4, -15, 7, -17, -10, 2, -24, 5, -14, -16, 0, -15, 1, 1, -3, 9, -7, 3, -3, 9, 15, -1, 11, 5, 3, 14, -6, 9, 5, -2, 5, -11, -3, 6, -9, 13]
7366A3l0J3Nj9K2k2PMoQpJQoPpKNkRmJJ2j4J4%j9J8j4KLj2PJOjj7J8j2MKj6J9
7409CpOLk1J1jkRk9K8lqJ5k5K6poK7l0J6jj9K7j9J2Kj0RolOlJ2j5jOqK0j6lJ1
7450Fj7J2opQj4J1J2j0J8k5J2joK2k6K2nj2QjoNpJ9j0NPj7J2j8NJ4pPj7KJ6k1
7489a0J3nNJj5P%qK3k6PkLNqlOoJ5qlJ4j4OpMQjPj7LlKK1j8OJ3j9J2j1lPj5J3
7533aLj9K4j9NlnJ8j2J8j6kJ0j5J6kpJ7k6J5nMQmJ4nj5J2j3nK5j8J6pj3K6k4N
7571@qORj2lJ3pLj6RJ6j7Qj3QjpQjjNlQj0JJ0pJ2k3J1QrOj4NJ7k2J4knJ6k4J9
7614Glj6J9j9J3plRqP%mKoRMkJ1j3%Qj1LJ4okj1J2mmJ8k4J3%LkrJ0oj3J2mLJk
7659apoJ2npQ%pJ4j2%OqJ0%LnJ1j2j1OK0oRj2J2%j1Mj0JJ9k1RrNQoJ5k2qJ5Jn
$$ y = [13, -17, -4, 1, -18, 4, -18, -11, -7, -13, -5, -12, -11, -3, -9, -2, -9, -7, -2, -4, 5, 1, 2, 14, 0, 14, 14, -5, 13, -1, 1, 4, -8, -1, 0, 6, 5, -12, 6, -6, -2, 0, -16, 3, -4, 2, 5, -16, -5, -6, -8, 1, -28, 0, -3, -11, 4, -21, 5, -2, -8, 19, -11, 5, 4, -15, 12, -7, 5, 7, -3, 6, 0, -3, 3, 0, 12, -3, -4, 2, -6, 14, -2, -5, 6, -11, 1, -5, -12, -4, -18, -7, 5, -5, 13, -12, 0, -1, -7, 15, -11, 11, 6, -6, 2, 1, -5, 0, -7, 12, 2, 7, 14, -3, 9, -9, -4, 10, 3, 10, -7, -5, 11, -10, 3, -2, 3, 4, -11, -4, -4, -12, 11, -15, -8, -10, -7, -2, -10, -13, -7, -13, 2, -6, -9, 5, -9, -3, -10, -6, 2, 1, 8, -9, -6, -9, -7, 14, -4, 2, 15, -4, 8, -3, -6, 1, -14, -1, 2, -17, 7, -12, -7, -10, -15, 3, -9, 9, -7, -9, 1, -14, 2, 0, -7, 10, -16, -1, -6, -2, 6, 2, 16, 11, -4, 8, -5, -10, 15, -3, 13, 6, -7, 19, -5, 0, -8, -2, 7, -5, -8, 5, -2, 1, -15, -6, 10, -7, 1, -12, -4, -5, -12, -4, -5, -6, -1, -4, 4, -6, -5, 5, -2, 10, -13, -2, 6, -3, 3, -11, -6, 11, -11, 3, 1, -4, 12, -12, 7, 4, -12, 7, -12, 1, -6, -9, 0, -8, -1, -1, -5, -3, -9, 0, 4, 2, 13, 0, 0, 8, -3, 0, 14, 8, 6, -5, 7, 3, -1, 17, -7, 6, 6, 9, 7, -2, 8, 2, -11, 1, -3, 0, 1, -1, -8, -14, -2, -7, -14, -6, -6, -13, 1, -11, -11, -5, -13, -3, -3, 0, -5, 6, -6, -17, -11, 9, 3, 12, 0, 12, 12, 1, 5, -5, -4, 15, -6, 3, -6, -1, 7, 1, 16, -6, -14, 1, 2, -3]
7703cokQj7J9j2LOpJ0Rj1Rj5QjNKj1LQpJ1k1J1J0Jkj5PJ4k0J4Kj4Oj3J4j0j1J6
7744bj0%qLLoJ4j7J7Pk0J1JPNk0K0rNOj8J9JoJ0j5NK%Ppojj4J9j4NJ2%nq%J4n
7788Bl%lNJqO%Np%mKJ6j6RkKRj7NPmjLj5J6mkpMPj6RoRJj3J0j0J%j2K5omJ4j4
7836fKKmRJnnoJ5Nj0OmPj0mJ2qJ4j0MJ2j4lnJNnNjj1PrPmkOqRjrJ1nMQnqkRmM
7887cJKkNoJ7j1oJ2moNkjlJ2r%J3k4RnJNj2J1kqJ1jNkpPj0Mk%J9k1ROj1J5mKJ
7934A0rK%R%j0NkmJ2k2J4%mNj8PkJ0PqoMrllPnQKk%nMMmNlJJ0j6POoPJj3Oj2J2
7984aJoJ1lrJqK5k1J0oPrlR%pjKlJ1mlKJl%%QrJ5rKmKPKMPj5J6j9LnPOj2OnqP
8035alNnklp%J3kJNLJ%nj6J7lLlP%Pj4QqJ0J1j6j1OrK1j7J6LjrkMpk%Jj5J1LL
$$ y = [-3, -9, -11, -3, -20, -1, -13, -10, -4, -11, -1, 8, -3, 6, -9, -1, -2, 3, 5, -6, -3, 5, -2, 9, -12, -1, 9, 10, 8, -7, 0, 14, -6, 8, 10, -4, 2, -11, 3, -7, -18, -2, -12, -12, -20, -17, -14, -20, -6, -23, -6, 1, -19, -8, -7, 0, 5, -15, 5, -4, 1, 7, -11, 8, 9, 3, 13, -2, 3, 5, 5, 12, 5, -1, -2, -16, 3, -11, -6, 6, 6, 1, -7, -7, 7, 2, -1, -1, -4, 1, 2, -6, 0, 0, 5, -2, -2, -6, -4, 12, -4, 5, 3, 5, 14, -3, 2, 9, 5, 4, 7, -8, 8, 4, 2, -5, -1, 6, -10, -1, -7, 2, 3, -10, 0, -10, -9, -9, -21, 4, -2, -6, 8, -6, -4, -2, -6, 3, 4, -1, -6, -12, 3, 8, -2, 4, 0, 7, -3, -7, 5, -3, 11, 1, 5, 17, 3, 0, -5, -4, 1, -4, 1, 0, -11, -4, -13, -6, -10, -12, -6, -14, -5, -6, -15, -4, -9, -5, 3, -2, -10, -12, -3, -7, -3, -2, 0, -2, 3, -3, 14, 3, -3, 9, 5, -1, 4, 2, 1, -2, 10, 1, 1, 14, -10, -1, -6, -5, 0, -12, -1, -3, -11, 0, -1, 4, 2, -5, 2, -8, -4, -6, -6, 13, -8, 1, 7, -4, 11, 7, 9, 10, 1, 3, 3, 12, 12, 2, 7, 5, 1, 13, -9, 5, 5, 1, 6, -12, -5, -7, 3, 10, 2, -4, 0, -9, -12, -15, -8, -13, -5, -3, -5, -5, -10, -6, -2, -6, -1, -4, -3, 7, -9, -2, 4, -2, 5, 6, -7, -1, -13, -1, 0, -6, 5, 2, -7, -6, -14, 11, -10, 0, -6, 1, -8, -11, -2, -2, -9, -10, -8, -11, 0, -4, -7, -5, -4, -7, -7, -7, 1, -8, 7, -2, 0, -4, -2, 5, 7, 11, 18, 3, 19, 0, 3, -2, 5, 11, -1, 5, 0, -8, -1, -4, 1, -4, -6, -9, -16, -16, -3, -5, -4, 1, 4, 5, 5, 0, -16, 1, -2, 1, -2, 5, 5, 12, -2, 6, -2, 8, 19, 3, -8, -2, -11, 10, -7, 9, 12, 11, 2, 0, 4, -3, -5, -5, -4, -19, -8, -5, -2]
8083bmPkoMoRkpJ1j8J7JM%j0JJ9j3MnLMqjqK1nj5MJ1rN%%Kj4OMrNpJ3qqJ4%Mj2
8132fjLpRPj5QKOMnQj0MroJ7jKnnOoPkJqmlJ7j5NOj0J4j7NLnLoNNrJ0j2J4pJJ
8182aoJ6kj6Q%JQ%
$$ y = [-2, -6, 1, -1, -7, -3, -9, 0, -2, -9, 2, -16, 1, 2, 6, 6, -4, -3, 16, 3, 7, 2, 5, 9, 1, 0, -8, 13, 8, -7, -3, 8, -1, 4, 4, 4, 6, -8, -2, 2, -7, -2, -9, 4, -4, -12, 2, 2, 6, -6, -7, -4, -11, -2, 5, -10, -2, 0, 6, 10, 5, 13, 3, 7, -2, -8, 9, 8, 10, 5, 0, 6, 0, 7, 5, 6, -2, -6, -9, 8, -7, -2, 4, -6, 8, -9, -4, -1, -6, -3, -9, -4, 1, -8, 2, -10, 4, -3, -2, -1, -7, 9, 7, -9, -1, -1, 0, 8, 8]
8191H
$$ Imaginary data points
##PAGE= N=2
##DATA TABLE= (X++(I..I)), XYDATA
0@%%%%%%%%%%Qj6J6j6K2l0L2m0N6o5P4r0J13j36J54j79K10k47K87l30L78m32M94
33B63n60O32p13Q04r03J012j131J260j402J556j724J909k110K330k571K835l122
50a635L438l787M169m595N071n603O202o884P668q578R651j0939J2519j4510J7107
65I294k0656K5837l4256N1137j39957J38989m9575K1844K38934l30350K07970
76A19211k09230p6724K22504k04541K82612k8271j24720J86310l42979J49778
86b6050k6325q5997L12872k01475J45656k6388k38509K03679k34504J45331J19776
97H8066j41070K60330k27563J246M2322k32213K64739j07295P7919J51777k40607
108f2349J66520j81613n0954J72142j78708K56452n5594o6685J37180k81705J39712
$$ y = [0, 0, 0, 0, 0, 0, 0, 0, 0, 0, 0, 8, -8, 8, -8, 14, -16, 16, -24, 32, -33, 41, -49, 64, -72, 82, -97, 113, -134, 153, -177, 201, -231, 263, -297, 335, -378, 426, -477, 535, -596, 664, -738, 818, -906, 1003, -1107, 1223, -1348, 1487, -1635, 1803, -1984, 2185, -2410, 2661, -2942, 3260, -3624, 4044, -4534, 5117, -5822, 6697, -7813, 9294, -11362, 14475, -19781, 31356, -108601, 30388, -19187, 2657, 241591, -88759, 119211, -90019, -166743, 55761, -148780, 133832, 105561, -19159, 167151, -175828, -26050, -52375, -138372, 174500, -26975, 118681, 92293, -146216, 57463, -177041, -31710, 88066, -53004, 207326, -20237, -18991, 23331, -208882, 55857, -51438, 26481, 178258, -62349, 104171, -77442, -128396, 43746, -134962, 121490, 65896, -789, 136391, -145314, -5602]
119e602n1159n2041K48359j76025J48666m8332j71302J61161k06805J38224P2151
130E7295j03455K18777k00707L0599J3419j81469K18757j11536Q5643J06535j87517
141e3659J51314j67924j6670J18428j46409K17473o7450k7158J00132k23772J26012
152A0317o5535k5538J86768j45718J38183n6476j18416J25197j77655J27772L3689
163C2588o9805J77448j72776M9401q564j37380J78765j10476R0305O8820j44428
174d6102J35715j54648Q624Q0431j22915J88701p7601n67P6260j85439J22506
185B4965p7633p235J44933j31277J34786o5260p8328J03079j58691J22601L117
196A5057m7061J46459j51653O3354k2713j03223J46688j06884Q9548M1142j10179
$$ y = [-5602, -56761, -108802, 139557, -36468, 112198, 63866, -107436, 53725, -153080, -14856, 57295, -46160, 172617, -28090, 2509, 15928, -165541, 53216, -58320, 27323, 133858, -53659, 97655, -70269, -86939, 31489, -114920, 102553, 35103, 7945, 108077, -115695, 10317, -55218, -80756, 106012, -39706, 98477, 42001, -76415, 48782, -128873, -1101, 32588, -37217, 140231, -32545, 16856, 8292, -129088, 49677, -60799, 29506, 98326, -46102, 89613, -65035, -56411, 24020, -98895, 89806, 12205, 11638, 87898, -97541, 24965, -52668, -59903, 85030, -46247, 88539, 23279, -55049, 48030, -110661, 11940, 15057, -32004, 114455, -37198, 26156, 3443, -99780, 46908, -59976, 29572, 70714, -39465]
207c9465J19272j38449K4623N1136r9910J59914p9872J7975N3592j48564J10931
218C1183q0871P561J07663j10834J23195o7609m8448Q1603j37423J13250j6109
229C161k9905J21115j34127P2090l2875p7953J24077j05631R0946J9153q5255
240c5204J08968j29675L9455K8362q3424J40817q3845L2920L6578j22846J04176
251C6282q4669J9448Q0997r6553J15703p1080k5406O3367j19698J05996l0737
262f350j3103R6853j15903P3993m1333n4310R9614r5650Q7604K734o1560R2042
274F4631j15759M5952J0493o4916J19882q0845M2417K0803r8972R3581q4958K9463
286a8228N7990q1143J07325p3329p004M6901j04865J00093m1703M82P9099j03589
$$ y = [-39465, 79807, -58642, -34019, 17117, -82793, 77121, -2751, 15224, 68816, -79748, 31183, -49688, -42127, 65536, -45298, 77897, 10288, -38160, 43443, -93980, 19270, 3161, -26744, 94371, -39756, 32334, -541, -78494, 45583, -60048, 30898, 50051, -35204, 73764, -55911, -16456, 11906, -71518, 69299, -14546, 18374, 54952, -67894, 36282, -48387, -28939, 52058, -44495, 71208, 128, -25278, 38089, -81609, 24387, -6350, -19453, 77400, -38503, 35490, -5843, -60153, 39461, -56189, 31415, 34149, -27411, 64631, -51128, -5176, 5317, -59599, 60283, -20562, 21855, 42658, -56314, 37267, -47691, -18228, 39762, -41381, 65944, -7385, -14389, 32512, -72353, 27740, -13963, -13481, 65618, -37971]
298c7971P6920m9501l6942Q3272r0960Q8760j1357m3784Q0657j08491N3387m821
310h31m9718J04623p9047N0660O792p9132Q3004q3451L7248L8941o5350R6607
322F0346p2160O333L0991q8260R0287m6704J2127O0948q7638P3251n3995k1410
334c5884O4812q0189Q4935k0823k7135O6317r7709N5458j6306l5725Q9902p4770
346b7117N5886m286o3266P4101q2443M3893K4172n3604Q9777p3126J7720J8619
358B0326p6748Q4901n2330K2001M7256p6630P1637n8178r356N1098p2160Q1846
370C3663k7847j4523N4588q7917N5667k4481k3748P5491o7889N7070j2680m7849
382c0455O2036p6011M5761J1898m0071P7662o7952K4096P433o2312P4307n2141
$$ y = [-37971, 38949, -10552, -47494, 35778, -55182, 33578, 22221, -21563, 59094, -49397, 3990, -831, -50549, 54074, -24973, 25687, 32479, -46653, 36351, -47100, -9852, 29089, -36261, 60346, -11814, -5481, 25510, -62750, 27537, -19167, -7040, 53908, -33730, 39521, -14474, -35884, 28928, -51261, 33674, 12851, -14284, 52033, -45676, 9782, -6524, -42249, 47653, -27117, 28769, 24483, -38783, 35318, -47125, -3232, 20940, -32664, 57113, -16013, 1707, 20326, -56422, 28479, -23851, -1850, 45406, -31224, 40413, -17765, -27121, 23977, -48183, 33663, 5816, -8707, 45881, -42036, 13631, -10850, -34598, 40893, -26996, 30074, 17394, -30455, 31581, -44430, 1331, 13229, -26842, 50820, -17132, 6964, 14397, -47915, 26392, -25749]
394b5749K8325L3804o3304O5930n8795Q52L7661o2730P7032l3538l128M3359p8535
407c8816N6190l1976j2971O3157o3406N9268k0628l4901N3804p2622M9173P98
419G070l0176O9457o5844L1071j582n1036O6818n3330L3662K2332n2126O1036
431C7352n8259R261K5762n3241P0062l6325N852L2513o6742N2694l5434m264M9681
444B8912n5211N6762k5060k2768M3480o5253M8646q006j9978N8789o0619L5312
456A5006r462l9297N8155n2737L7639J1709m1927N6559n8073J7439J5694m6032
468c5327O5813m1053J4331K3810n8775N3143m0704M169L9170n1247N7259l0776
480a87j1949L6084o0368M9552j6174j1892N0067n6377L8653j5219k9407N0106
$$ y = [-25749, 2576, 36380, -26924, 39006, -19789, -18937, 18724, -44006, 33026, -512, -3640, 39719, -38816, 17374, -14602, -27573, 35584, -27822, 31446, 10818, -24083, 29721, -42901, 6272, 7070, -23106, 46351, -19493, 11578, 9996, -41040, 25778, -27552, 6110, 28442, -23684, 37352, -20907, -11646, 14116, -39125, 30937, -5388, 464, 32977, -33765, 18929, -16505, -20769, 28912, -26299, 30463, 5403, -17365, 26115, -39138, 9508, 1502, -18476, 40313, -20306, 15006, 5544, -33753, 24402, -28335, 9304, 21013, -20914, 35645, -22428, -4989, 10705, -35327, 30486, -10567, 3764, 27574, -31201, 21942, -18762, -14593, 24577, -26670, 30589, -187, -12136, 23948, -36420, 13132, -3042, -14934, 35133, -21244, 17409, 2190, -27217, 22889]
492B2889n0931L9368L111l2200N0301n4712K2359P030l7304N7798m0995J9375
504F089J5567m8498M9017m1241R813K8920m4629N3780l3143l234K8608n3869M8484
517A5664k2137n133M1747n2212M1371k0259k0446M3564n0177M1526m895k4374
529a5761M6169n3130K7774l08l1081N2833m2997K4612Q830m0856M7032m2910J5307
542d486J9974l8967N0783l4967M070K1564m6979M5758k5707P56L3107m5879M0595
555A9622k3085j2335L5148m5133L9953j0263j6271L8693m7695K9325n887k3587
567b1515M5161m1108K7073K476l2221M2485m2108J9339J1985l2896M6946l6007
579a0390J0201J5249m1157M4114k9443O283K6231m1727M1269k6703n436K9025
$$ y = [22889, -28042, 11326, 14437, -17763, 32538, -22174, 185, 7215, -30089, 27709, -13286, 6089, 21656, -26842, 22175, -19066, -9253, 19667, -24962, 28818, -4325, -7559, 21049, -32820, 15664, -6473, -11606, 30141, -22071, 19300, -959, -21405, 22159, -28018, 13508, 8613, -15761, 30408, -22722, 5052, 4744, -26337, 26496, -16501, 8111, 16941, -23915, 23117, -19793, -4486, 15488, -23479, 27304, -7663, -3593, 17971, -29008, 16750, -8957, -8201, 24906, -20973, 19622, -3463, -15798, 19350, -25783, 14170, 3907, -12364, 26329, -21366, 7959, 2072, -21515, 23646, -17462, 9611, 12087, -20134, 22351, -19757, -418, 11567, -21329, 25617, -10390, -189, 15060, -26097, 18017, -11426, -5143, 21088, -20639, 20630, -6073, -11509, 17516]
591A7516m2594M0717j5619r702L3639m5075L1737j1369j7016L9267l9654K9552
603A1399l289k4750L7417m0220K1878N504k6218M1632l4930J4084R094l4050L9842
616A7393k9998J0581J8645l4958L8265k7913O23K1686l7007L8462j8736l555K7088
629B0576m0407L2061j5531j0864L3389l7609L1381q278j8349L3389l9715K5268
641E311o63k0805L8639l5743J8709L294k8841L7591l1898J5106J2767l0474L7097
654B0090k9805N504J6193l3179L7319k1559J548K1662l6283L1714j8472n499K7140
667A6373l3847L0894j1600j2112K7694l5951K5320m893j5070L2891l2908K0343
679G134j135k2673L2898l0974J7443P249k4764L3954k9823R626J0513k8624L5159
$$ y = [17516, -25078, 15639, 20, -9682, 23957, -21118, 10619, -750, -17766, 21501, -18153, 11399, 8110, -16640, 20777, -19443, 2435, 7939, -18279, 23353, -11577, 2507, 11601, -22449, 17393, -12605, -2024, 16621, -18337, 19928, -7985, -7362, 14324, -22683, 15779, -2957, -6512, 20576, -19831, 12230, -3301, -14165, 19224, -18385, 12996, 4718, -13631, 19758, -19957, 5311, 4648, -16157, 22482, -13261, 5448, 8742, -20099, 17492, -14406, 700, 13467, -17007, 20090, -9715, -4211, 11982, -21197, 16122, -5437, -3889, 17773, -18510, 13204, -5268, -10767, 16373, -17474, 13420, 1820, -10292, 17402, -18549, 6771, 1878, -13192, 19699, -13209, 7134, 5999, -16674, 16224, -14750, 2693, 9942, -14822, 19132, -10691, -1065, 9448, -19176, 15983]
692A5983k3678O168J6589l2395L1766k1580n41K2070l1973L1990j5558o588K3968
705A6221l4467K7328r815j0358K9055l2284K3275n382j7334K9541l0893J9710
717D597J979j9729L0919k9001J2920N734k3860L1408k4108R197J1673k6866K9516
730A4379k1947K995J6241k7812K9564j6824j836J9298l0165K6387j2721o317K3840
743A5082k9600K4211q264j1927K5666k9952K0972k788j5435K8417k8491J6591
755D482J510k0140K9160k6291J2726P220k2814K9491k3691P142J1022k5532K8738
768A3023j9267K991J5787k6863K6303j5778k917J8955k7133K4762j0213o863K1616
781A4403k7807K0411o542j1166K4362k5379J8075j453j5614K4265k5322J3442
$$ y = [15983, -7695, -1527, 15062, -17333, 14433, -7147, -7688, 14382, -17591, 14399, -1159, -7747, 16221, -18246, 9082, -733, -11091, 17964, -14320, 8955, 3573, -13761, 15780, -15113, 4597, 6576, -13153, 17766, -11235, 1685, 7419, -16441, 14967, -9141, 56, 11729, -15137, 14379, -7568, -4573, 11668, -16144, 13420, -3404, -5240, 14058, -16107, 10280, -2441, -8758, 15082, -14518, 9693, 1429, -10498, 15168, -14784, 6188, 3400, -12035, 16382, -12109, 4482, 5992, -14148, 15012, -11279, 1447, 8667, -14147, 15344, -8347, -1205, 9817, -15715, 13023, -6244, -3253, 12534, -14329, 11974, -3804, -6721, 12234, -14899, 9863, -350, -7213, 14403, -13404, 7007, 465, -10701, 13661, -11718, 6357, 4904, -10710, 13555, -11767, 1675]
793A675L539j7427K6857k2180R189O353k2302K5637j9707O510J2585k2747K5436
806A3418j8049r1J4160k4915K5333j2011k016J8369k6623K0765j0751p556K1675
819A1708k3974K0904m676j1847K1045k6194J5322l49j2880K5464k1747J1913J648
832F337j9222K2598k0164R828R245j7919K3435j8887J986R007k1339K3752j2063
845c406K155J4481k3321J8740j3194m366J7616k0409K1513o545p930J6677k5194
858a3183J5616l533q393K3327k0538J4004k414j6414K0088k1023J3054O177j4298
871g530K2901k0876M829M624j9367K3953j3835O572J1368k1512J8684j6500j174
884g863J4344j8329K2819q586m367J3245k4405J5765o225m669K1001j8681J5022
$$ y = [1675, 5214, -12213, 14644, -7536, 1653, 8006, -14296, 11341, -8366, -1856, 10729, -12018, 13418, -4631, -4722, 9438, -15477, 9856, -2155, -4171, 14198, -12425, 8340, -2411, -9967, 11708, -12266, 8638, 3962, -7885, 13160, -13034, 2288, 1939, -10941, 14523, -7224, 4689, 6337, -12885, 9713, -10451, -623, 8622, -9297, 14138, -4749, -2763, 6244, -15095, 8657, -3406, -1251, 13230, -10091, 8649, -4545, -8911, 8705, -11704, 9809, 3264, -4666, 12011, -13183, 2433, -1100, -9493, 13834, -6704, 7300, 4886, -11528, 8560, -12463, 591, 6768, -7530, 15371, -5505, -676, 3948, -15419, 8534, -5301, 1271, 12639, -8873, 9811, -6689, -7863, 6481, -11848, 10971, 2385, -1982, 11263, -13142, 2623, -3602, -8271, 12730, -5951, 9071]
897I071n293j3512J6682k0131J4287L779j0331K0551k0254N955J077j6352K1854
910G383j3550R072Q520j8638J7224j7786J108J1199j6090K3017j0159j194J0378
923A0484k3460J6337r016j451J8913j7932J6862q252j0701J4643k0574J6334Q74
936C061p348J9470k0814Q161k169j3992K0618j4241J1514N748j5957J6098j8544
949h395L150Q108j3653K1880j0674J223P534k0883J5148r984P48J5832j5522J6276
963A0788r239p940J1768j8832J6070j112m581J6983j9438R180m410j1212J8415
976F440j4249J2998K985j3207J5185j9139N626M957j1691K1198j2326M225M840
989G842j8825J5475j2130L506J2798j4445J6999j1288m554R477j7808J6629l878
$$ y = [9071, 3778, -9734, 6948, -13183, 1104, 4883, -5448, 15103, -5151, 804, 1881, -14471, 7383, -6167, 2905, 11425, -7213, 10011, -7775, -6667, 4532, -11558, 11459, 1300, 106, 10484, -12976, 3361, -5655, -7106, 11807, -6125, 10737, 2485, -8216, 6427, -14147, 2187, 3061, -4287, 15183, -5631, 2530, 361, -13631, 6987, -7254, 4260, 10008, -5949, 10149, -8395, -5245, 2863, -10790, 11090, 416, 1639, 9173, -11710, 3438, -6546, -5798, 10034, -5488, 10788, 1549, -6391, 5377, -13455, 2615, 1503, -3078, 13905, -5533, 3647, -763, -11975, 6440, -7809, 5189, 8174, -5033, 10152, -8987, -3361, 1596, -10095, 11103, -1223, 3002, 7842, -10983, 4492, -7638, -4132, 8666, -5779, 11220, -68, -4622, 4855, -12953, 3676, -202]
1002b02j905J4565j8204J0403o338q324J5897j3812J3504O04j0268J3477j8039
1015h642O870K418r396J8879j2272N755K697j5877J4352j2484N065R673j2553
1028e515J6233j2034j747P281j6134J6438o013K23J2280j7227J1849q265n552
1041h183J4066j4309J4848k363p543J2580j8121R238m58p523J7583j3420P976
1054D371N06j3523J4168j3585O970O801j1176J5830j2856P71N308j4365J5830
1067E050p422J902R870j5461J1868q963l314J1697j3070J4274l773n412J0835
1080H081j6657R715j977n708J5554j3163Q938j263j1089J3151j3698Q271M304
1093D459r513J5033j3437K952L363j2877J5680r081L912P735j4325J2569j0607
$$ y = [-202, -2107, 12458, -5746, 4657, -1681, -10005, 5892, -7920, 5584, 6188, -4080, 9397, -8642, -1772, 646, -8750, 10129, -2143, 3612, 6309, -9568, 4784, -7700, -2635, 7038, -5515, 10718, -1316, -3063, 4218, -11916, 4522, -1491, -1268, 11012, -6215, 5634, -2631, -8183, 5883, -8426, 6422, 4059, -3484, 9096, -9025, 213, -245, -7768, 9815, -3605, 4371, 4877, -8646, 5522, -8063, -1093, 5708, -5468, 10362, -2494, -1723, 3585, -10780, 5050, -2372, -470, 9400, -6061, 5807, -3156, -6470, 5227, -7843, 6431, 2658, -2754, 8081, -8576, 1139, -838, -6546, 9008, -4155, 4783, 3520, -7569, 5582, -8116, 155, 4459, -5054, 9979, -3458, -506, 2857, -10020, 5660, -3421, 491, 8226, -6099, 6470, -4137]
1106d137q32R633j2504J4868n749l083R229j5951J0588l880l647J3822j2755R803
1120E405k993q899J1613j3263R064K395p468J3539j3079M026J456j0786J4243
1133E253r042N175N628j2245J1546j0945P22P457j0829J4407o672j002P111j4774
1147h210J0778n616j345J1967j1945J0765n040o674R911j3343J0509K25n183J2689
1161I488j3590N766j135r091J3619r879P450L560j0585J1134j2233K488N245r328
1175g091J4443p521J001N139j3733J0410o796M69J0341j0573J1004o249n030P884
1189C698j2566J0726r74k913J1180j2776O100k992p467J2142r430Q706K095q725
1203c196J0109j2945L702L135p753J4392q147L081L111j2825J0222q477K540Q823
$$ y = [-4137, -4969, 4664, -7840, 7028, 1279, -1804, 7425, -8526, 2062, -1818, -5465, 8357, -4398, 5405, 2412, -6487, 5126, -8137, 927, 3322, -4146, 9393, -3686, 340, 1796, -8990, 5253, -3789, 1386, 7014, -5231, 6315, -4630, -3908, 3549, -7280, 7127, 455, -547, 6564, -8210, 2568, -3048, -4393, 7574, -4371, 6394, 1354, -5320, 4591, -8752, 1757, 1982, -3201, 9488, -4102, 1664, 529, -8562, 5057, -4822, 2628, 6188, -4397, 6737, -5496, -3008, 2237, -7091, 7352, -169, 832, 5971, -7762, 2648, -4148, -3679, 6662, -3911, 7093, 844, -4186, 3698, -8868, 1858, 884, -2029, 9151, -3625, 2475, -517, -7984, 4158, -5272, 3434, 5529, -3196, 6913, -6032, -2330, 805, -6948, 7444, -703, 2378, 5489, -7336, 2886, -5591, -3051, 5772]
1217E772r529J1901p903l189O041j2482J1573k586p43J0267j2602P017m962o059
1231g484J0972r387J0013P29o903R044j3111M272J421o160J3561p762M189J677
1245E071j1585R115q864L529P409p817J1531q246j931M073j1473J1075l267J015
1259c65Q952j1471P177o382m626R333q944J0881n92m925P980j3214N205o24m658
1274f273J2912q062N924k4j0173Q535r889N002N590o477J1594q982k90K348j0657
1289h922J0883m368K663P621j0385P389p446l203P580q197J0975j522l102O676
1303F642j2404N352j995l272J1456p434O647j167q396P332r892N632L847m945
1317b597J0928q975J135Q14r544J0307n383M070O119r215P852q519j551N932p990
$$ y = [5772, -3757, 8144, 241, -2948, 3093, -9389, 2184, -402, -1145, 9122, -3480, 3537, -1425, -7484, 3488, -5899, 4114, 4843, -2060, 6984, -6127, -1855, -434, -6594, 6967, -795, 3394, 5071, -6514, 2601, -6263, -2734, 4675, -3142, 8389, 143, -1788, 2285, -9188, 1887, -1380, -365, 8587, -2884, 4293, -2089, -6715, 2618, -6326, 4555, 3963, -962, 7018, -6196, -991, -1615, -6273, 6639, -1423, 4501, 4477, -5696, 2839, -7050, -2048, 3542, -2935, 8659, -323, -613, 1735, -8922, 1961, -2407, 256, 7877, -2508, 4881, -2565, -5768, 1812, -6385, 4590, 3068, -34, 6642, -5762, -410, -2405, -5677, 5779, -1655, 4992, 3825, -4571, 2761, -7131, -1499, 2348, -2597, 8331, -644, 491, 1305, -8239, 2068, -3315, 755, 6874, -2341, 5511, -3008, -4559, 1373, -6617]
1332f617J1442k989j242N809j2052O324l768j954J0304p630P857k471o739O725
1346B999j0232O474K124l817J0390r045K491m27q344R507n956M904M760p861P632
1361E599q644m69M433p224J0839l578J08M759j0906O361m682r34Q814p169Q244
1376E551l304n089N890j0082O962N22k675R658r015L764j626p170Q935o754N933
1391A500L367o811P812r240Q96L035o739J0770m543J503L831j0135O622n654O1
1406c725P569o723Q528l959l746M936r624O988n34j566Q645q351M196k457n996
1421e819P796o521O253K313n415P035q984J574J694n626R983m676K520K661r010
1436d222O290o297J124O290o014Q778m813k351L760r300P370j769j69P829q117
$$ y = [-6617, 4825, 1836, 594, 6403, -5649, 675, -3093, -5047, 5257, -2373, 5484, 3013, -3726, 2999, -7233, -759, 1365, -2452, 7938, -1107, 1384, 957, -7387, 2120, -3836, 1068, 5828, -2033, 5599, -3045, -3514, 919, -6305, 4534, 956, 1064, 5823, -5083, 1278, -3404, -4338, 4476, -2693, 5551, 2247, -2842, 3048, -7034, -72, 450, -2225, 7433, -1582, 2182, 556, -6614, 2321, -4433, 1500, 4867, -1944, 5868, -3372, -2476, 559, -6180, 4590, 47, 1550, 5381, -4754, 1868, -3786, -3725, 3844, -2879, 5649, 1690, -2056, 2880, -6744, 244, -290, -1856, 6789, -1562, 2634, 177, -5819, 1977, -4544, 1709, 4022, -1393, 5642, -3342, -1768, -74, -5700, 4283, -393, 2127, 4788, -4222, 2068, -4229, -3105, 3185, -2829, 5949, 1136, -1215, 2545, -6755, 615, -1154, -1323, 6506, -1611]
1451a611M996l792m852O934o696P213J151m115O523r282K349L25m637R574m803
1466g23L575J545q079N689o717J961N151m831Q476n002j512K452q551O943k115
1481a738R64O937p277M889m620l987N793o162P649M59k797N634r294K700r39l546
1497e335R176m777M684L71p309N204p515L045M106l842Q797n792l80J061q277
1512f783P144k962K469O154o754N149n796l124M775n773Q216j08j666M846r248
1527c461K784j940k578Q622m272N245m21o494M194p532L384L385k656Q418n630
1542A048O2q9p687O595l123L445N494n892M979o505k473L709n327Q608o36m53
1558A755M096r221L049l124j618Q142m133O182j400n626L590q028M141K313j606
$$ y = [-1611, 3385, -407, -5259, 1675, -5021, 2192, 3343, -772, 5751, -3531, -1182, -857, -5494, 4080, -723, 2852, 4397, -3682, 2007, -4710, -2749, 2402, -2429, 6047, 1045, -467, 1985, -6566, 377, -1738, -774, 6163, -1114, 3775, -845, -4832, 961, -5201, 2448, 2907, 110, 5744, -3550, -850, -1789, -5335, 3841, -936, 3748, 4119, -3190, 2014, -5501, -2456, 1650, -2192, 6605, 813, 433, 1494, -6783, 361, -2601, -132, 6022, -732, 4417, -1379, -4503, 272, -5501, 2715, 2607, 941, 5787, -3461, -677, -2617, -5195, 3427, -845, 4400, 3979, -2515, 1679, -5853, -2469, 916, -1740, 6678, 1048, 1110, 1021, -6666, -71, -3194, 251, 5745, -147, 4832, -1673, -4146, -437, -5764, 2844, 2208, 1755, 5851, -3370, -321, -3445, -5063, 3079, -1054, 5128, 3728, -1898, 1692, -6336, -2195, 118, -1488]
1573a488Q286n852R44j263p058O150l450M293M731m997M787o865j869K635m730
1588e746Q400q44M92L296q517K762l657r58P212l484O287j759m708K794p787M181
1604b036J517p95P807n605J581k048o318N602l873M986L772m119M837p220r32
1619b844J539m368Q274j558J546K700p948L154m522k29O199l399O702k368l470
1634e92K280p585M311M78j22P066n192K179k469n435M866l997M981K977l263M609
1650E092o813l28P49l906P484j872K083K169o837L132m731K13M994l186O547k606
1666B184k297J946p107M367o32K97O294n018L080k895m306M292m495N186J759
1681B655k459M644o583P08n8l595O823k615K766J629n785L458m969O63L750l089
$$ y = [-1488, 6798, 946, 1890, 627, -6431, -281, -3731, 562, 5293, 296, 5083, -1782, -3651, -1016, -5746, 2654, 1810, 2302, 5598, -2919, -157, -3814, -4772, 2440, -1044, 5243, 3484, -1224, 1570, -6217, -2036, -519, -1314, 6493, 888, 2469, 421, -5897, -295, -4168, 818, 4590, 471, 5308, -1912, -2844, -1305, -5673, 2601, 1043, 2589, 5289, -2659, 495, -4027, -4256, 1943, -1456, 5246, 2878, -592, 1688, -5897, -1586, -1108, -1230, 5836, 644, 2823, 354, -5081, -215, -4212, 769, 3746, 483, 5092, -1721, -2049, -1300, -5206, 2278, 406, 2489, 4658, -2179, 953, -3778, -3565, 1429, -1757, 4790, 2184, -113, 1833, -5274, -907, -1539, -1242, 5052, 34, 3114, 219, -4087, 205, -4290, 896, 2655, 196, 4840, -1743, -1035, -1093, -4688, 2135, -480, 2286, 3915, -1870, 1588, -3381, -2718, 1032, -2057]
1697b057O217k733j176J677o342M103j351L82N326m471L416k723l378L688m514
1712c936M732R23j861M421n890J419n93l185N885l092L105J138m658L661n051
1727b982J171K528l048N995l157N3J402n700M254k423Q24M264m220M069k985k173
1743b128L108m675M629j62j190M192n400K211j143k717N041l487L331O89l647
1758a348L680m844J414J585k889N409l079P43J250m916L977k874Q74L434l782
1773a366M234k914j295K548m558M362r68n71L789m851K790j671k133M244l779
1788b139L652L2k680L688m882J971N38k559N056l402J686P47m186L884l435J310
1804g19K477l331M357l052m45J963m311M136j537m2L336m335L034j982j644L533
$$ y = [-2057, 4160, 1427, 251, 1928, -4414, -311, -1662, -1280, 4046, -425, 2991, 268, -3110, 578, -3936, 796, 1719, -142, 4279, -1611, -192, -785, -3970, 1915, -1177, 1928, 3066, -1592, 2069, -2982, -1811, 717, -2331, 3664, 507, 560, 1962, -3738, 516, -1907, -1083, 3181, -1039, 3030, 45, -2128, 980, -3695, 934, 772, -418, 3774, -1626, 585, -558, -3275, 1766, -1721, 1610, 2299, -1348, 2332, -2512, -1098, 487, -2402, 3007, -72, 671, 1921, -2995, 982, -1892, -1018, 2416, -1366, 2868, -46, -1341, 1207, -3351, 1011, 43, -528, 3261, -1590, 1200, -471, -2604, 1640, -2139, 1513, 1545, -1135, 2553, -2329, -358, 180, -2379, 2677, -725, 961, 1708, -2478, 1406, -2029, -719, 1758, -1573, 2784, -268, -713, 1250, -3061, 1075, -462, -504, 2832, -1503, 1531, -451, -2095, 1438]
1820A438l682L638l28j947L357m540K093n7k163M528l314K082L62l523L583l627
1836b100J631J746k848M302l228K81J310l950M060k116O56K733l939L315k552
1851f99r24K855l585L923r53j156K944m467K457p73j574M112l324K563k15k926
1867a742L260l716J951J185k334M044l244O56Q10l538L834k267J048K246l499
1882a306L192k749m88K320l248L888j236o16K466m222K562j240j015L651l155
1897a196K843p54k309K840l768K367N43j746L818l384J182J40l073L680k543J607
1913B47J658l072L185l094L3J749k948L911j550q9K001l966K627j618n57L224
1929A741k952K971j063j846K463l631K448J77j312L506l259J396k28k662L338
$$ y = [1438, -2244, 1394, 1066, -881, 2476, -2064, 29, -28, -2191, 2337, -977, 1105, 1467, -2056, 1527, -2100, -469, 1277, -1571, 2731, -497, -216, 1094, -2856, 1204, -912, -256, 2477, -1462, 1853, -699, -1623, 1232, -2353, 1570, 617, -539, 2405, -2062, 395, -378, -1952, 2160, -1164, 1399, 1184, -1742, 1518, -2198, -247, 938, -1396, 2648, -596, 60, 870, -2668, 1166, -1101, -53, 2193, -1306, 1886, -863, -1351, 969, -2279, 1609, 373, -243, 2223, -1999, 563, -677, -1692, 1959, -1196, 1647, 893, -1416, 1424, -2344, 23, 566, -1180, 2638, -746, 436, 576, -2497, 1183, -1360, 247, 1905, -1167, 2018, -1076, -1043, 706, -2242, 1669, 119, 30, 2031, -1935, 692, -926, -1483, 1741, -1211, 1760, 697, -1149, 1314, -2317, 131, 308, -1004, 2502, -757, 639, 411, -2251, 1087]
1944A087k561J885J211k590K993l177M11J212k624L795j806M60J559l626K664
1959H93k050l3K648k728L147j475j202K051l547K643m25p77L173l185J830p43
1975B20k156K984k702K179P48k090K868l193P36P13k349L576j939Q47J223l179
1991a514K558k245K01K149k484L135j556p13J700l331K542q21m30K815k897K071
2007A180j039j693K541k782K349K56j509K728l135J145R2k021L251k140J365Q37
2023A425k676K546k563N27J540k246L222j790p8J360l170K549j359l9K432k657
2039i77K373j289j254K101k803K352j08j043K625k948J358l18j809K857k172J640
2055E85O18k151K411k645O72R82j991L074j743M20J039k876K348j690K19K033
$$ y = [1087, -1474, 411, 1622, -968, 2025, -1152, -741, 471, -2153, 1642, -164, 296, 1855, -1771, 893, -1157, -1190, 1458, -1270, 1877, 402, -800, 1251, -2296, 347, -78, -855, 2318, -867, 963, 220, -1936, 1048, -1654, 525, 1273, -817, 2051, -1142, -406, 307, -2042, 1534, -405, 442, 1665, -1514, 1044, -1201, -1000, 1149, -1335, 1800, 244, -469, 1231, -2100, 442, -379, -809, 2006, -891, 1180, 141, -1552, 989, -1793, 556, 812, -697, 2031, -1104, 41, 133, -1888, 1363, -777, 588, 1425, -1251, 1295, -1268, -741, 799, -1447, 1775, -15, -93, 1267, -1903, 646, -713, -752, 1680, -977, 1396, 107, -1147, 954, -1849, 503, 395, -648, 1977, -971, 387, 69, -1740, 1117, -1055, 585, 1203, -948, 1463, -1182, -510, 472, -1519, 1555, -188, 232, 1271, -1605, 743, -947, -728, 1305]
2071A305k307K565j464q05J644k835K409n75m78K417k747J654q14j490K445k277
2087a353J969L23j626K322k759Q93M02j759K971j799R08P56k549K163j980M18
2103g00J645j968K627j507m38J253k729K251p95j40K206k426J757j082j248K026
2119G32k221K098Q1j127K107k699J011o3j458K719j773J276M55k189K008k219
2135a262O97J187j669K684j664K2Q49k577K209j134K61J922k197J908j365r19
2151a048J667k199K230k13p15J941k628J175m57j174K463j739J494J78j808J800
2167I67k251Q44Q23j385K542j646K94N45k302K064j293N21J581j943J928j525
2183b36n77J331k053K236m88l57J695k510J358p63q76K226j803J736j66j443J708
$$ y = [1305, -1002, 1563, 99, -706, 938, -1897, 512, -63, -541, 1876, -871, 783, -31, -1521, 924, -1353, 616, 939, -687, 1635, -1124, -231, 171, -1588, 1383, -416, 492, 1248, -1301, 862, -1118, -700, 945, -1023, 1604, 97, -341, 912, -1817, 434, -361, -501, 1705, -721, 1036, -46, -1294, 732, -1489, 609, 690, -437, 1670, -1029, -18, -81, -1539, 1180, -593, 683, 1138, -1051, 957, -1262, -565, 622, -1047, 1637, -27, -5, 844, -1733, 476, -658, -397, 1525, -672, 1236, -129, -1048, 619, -1580, 650, 437, -278, 1663, -965, 210, -247, -1421, 1042, -697, 797, 975, -833, 967, -1284, -440, 383, -1002, 1540, -106, 188, 733, -1569, 495, -798, -277, 1304, -639, 1289, -236, -813, 518, -1535, 701, 213, -144, 1551, -959, 399, -364, -1240, 986, -817, 919, 753, -690, 1018]
2200A018k347J139M11j132K421j786O31K35k031K012j479P86J222j751J939j657
2216c69k49J078j923K217p17r6J429k328J438r33n67J921j710J748l77j153J521
2233I30k197J229J61r06K207j836Q59l7j699J918j569R98Q54j527J873j788J06
2250d24P85j713K207r96K11J110k170J581j166k30J632j671J857o93q05J330k139
2267a294J437j52o22J973j839J035k89j389J785j599J166N57j310J740j809L38
2283b72N27j473K083j095M00Q42j939J505j224J3J374j535J827q61n47J112k018
2300a281J522l77l51J734j801J185n45j090J623j630J371K24j044J644j895O32
2316g9J90j258K035j244P13N08j713J511j432K97J060j343J827j019k44Q37j882
$$ y = [1018, -1329, -190, 221, -911, 1510, -276, 355, 590, -1441, 571, -908, -122, 1100, -651, 1288, -369, -618, 460, -1463, 754, 37, -59, 1370, -958, 480, -453, -1020, 901, -809, 939, 562, -591, 930, -1267, -38, 123, -783, 1424, -412, 447, 410, -1289, 629, -940, 58, 912, -615, 1258, -530, -424, 361, -1352, 855, -141, 70, 1180, -990, 591, -575, -805, 827, -844, 1013, 320, -485, 845, -1294, 143, -9, -631, 1342, -497, 538, 249, -1140, 645, -954, 212, 769, -541, 1199, -610, -272, 255, -1218, 865, -230, 170, 1012, -927, 578, -646, -633, 741, -794, 1033, 172, -375, 737, -1281, 241, -136, -487, 1247, -554, 631, 86, -1004, 619, -1011, 360, 584, -460, 1184, -711, -79, 111, -1147, 888, -356, 357, 865, -848, 663, -769, -472, 588, -755, 1072, 53, -191, 646, -1236]
2333a236J527n80r5J534j668J230p29q57J383j558J436O9p86J489j855P10m5j022
2351a053J864j253R07L21j496J388j528M61Q04j161J879j143M4N70j792J530q43
2368e01K20J304j503J375j006n85J096j531J556j60m40J352j847Q45l79q25J720
2385F91j233J140J04j227J238j640O01N24r23J830j141K54L31j653J402r61M24
2402b39J135j289J404j105m39Q34j487J586l10j37J215j754R06o58o39J517j195
2419f55J337p3r52J114j757P51K15p09J816j204N53M8j483J328j175O77Q97j059
2437c31J428j257j71N24j393J596m82J51J062j612R35q58m67J293j121J429j98
2454E28p16R79j737P86j7n34J704j161P17j08j308J190j243Q03O85r00J445j324
$$ y = [-1236, 291, -289, -384, 1150, -518, 712, -17, -874, 509, -1049, 387, 456, -330, 1159, -696, 14, -31, -1053, 811, -442, 465, 786, -710, 678, -850, -389, 415, -746, 1133, -10, 34, 604, -1188, 342, -501, -281, 1023, -480, 895, -111, -696, 400, -1131, 425, 265, -175, 1177, -670, 175, -204, -1029, 691, -542, 598, 702, -525, 713, -927, -326, 198, -725, 1105, -36, 218, 549, -1104, 298, -663, -239, 896, -393, 1011, -94, -533, 301, -1186, 400, 90, -47, 1168, -586, 320, -338, -977, 540, -655, 682, 609, -343, 771, -986, -235, -20, -729, 1087, -117, 436, 484, -999, 329, -846, -169, 728, -331, 1097, -160, -331, 193, -1200, 396, -86, 65, 1127, -485, 450, -408, -875, 418, -703, 726, 528, -188, 791, -946, -160, -177, -711, 993, -168, 549, 441, -867, 323, -920, -117, 568, -332, 1113, -211]
2472b11L5L13j308J572o47M06Q41j468J054j084k06J037j085J515m23m08Q27j669
2490i09R17k88l31J508j167Q99l01j053J094j302R11M25p43J376j333K66J42j149
2508a038J477p91N19O54j292J069j091l4Q28j043J472n75j97P23j519R91m47j82
2526d76J258j153R95m53p41J004j288J003J12n86J243j315M98k8r07J361r48O30
2544B09L66j087J108j117K43N92r73J356p71K7N67j285J087n83m0R74j167J038
2562E44n52m55R34j169J009j39m91J049j251O70o8o93J229j033O46J26r24J125
2580E57j071M66M03q88J210r53J89M32j064J176o79J26O81j149R99o64j40Q57
2598D88j076J090m30l66Q34j215Q74j92l96J104j087O45j24p47J058r95O77K58
$$ y = [-211, -176, 137, -1171, 401, -246, 160, 1001, -467, 587, -497, -703, 334, -751, 764, 341, -67, 760, -909, 8, -280, -611, 897, -270, 629, 328, -725, 369, -933, -22, 403, -340, 1036, -297, -31, 111, -1038, 439, -352, 167, 821, -471, 598, -493, -527, 301, -742, 730, 155, -42, 681, -838, 153, -294, -476, 782, -371, 624, 171, -570, 434, -854, 149, 261, -325, 918, -397, 101, 73, -834, 527, -421, 209, 575, -512, 596, -521, -278, 314, -659, 697, -74, -47, 520, -765, 322, -261, -301, 673, -494, 544, -8, -463, 471, -698, 311, 172, -319, 730, -521, 149, 81, -612, 617, -416, 230, 356, -568, 557, -514, -48, 355, -533, 677, -276, -87, 345, -719, 457, -222, -96, 585, -564, 435, -229, -369, 488, -588, 502, 72, -294, 540, -675, 199, 7, -389, 715, -372, 273, 149, -598, 460, -535, 142, 400]
2616D00q01J074j073K91L10q67J227p31K54M42j122R65p59P4P87r43J083n72k91
2635b52O60j167R64k56j92J001j121P08l62o01R96r51Q53Q4o31R36j147L85J40
2654D7o74J233p61L86K62j061R17q62K66O64q18J113p30j35M66j107J021l73M
2673a42Q57j052P27n00m62Q81r07R36k8m94Q48j168M92m0n38J150p65N14J07r13
2693d97Q52r06L72N02p03J082p70K2L22j011R79m87J46P35r62P86o12k85P04q83
2713f14R66j93k81P41j114N77j84m29J028p98O28jp42Q32r60M70K85o11J054p85
2733a31J81K25r06R29n86K28N82q74Q69o73j37N79q93R45l12j38O70j020O76l32
2753a18l18Q78q18O94j15n32P66r37N16R4n19R61p88L49J21p53Q74o91L05M04
$$ y = [400, -401, 673, -400, -109, 201, -666, 561, -170, 84, 526, -596, 369, -390, -316, 471, -472, 611, 39, -252, 408, -759, 205, -51, -243, 758, -363, 345, -17, -618, 378, -573, 280, 364, -267, 669, -478, -93, 47, -627, 606, -155, 231, 493, -568, 349, -513, -247, 417, -401, 712, -18, -153, 313, -794, 227, -146, -142, 715, -337, 390, -110, -572, 309, -598, 338, 310, -184, 664, -504, -12, -52, -590, 560, -205, 309, 416, -497, 355, -551, -179, 323, -380, 702, -68, -46, 276, -735, 244, -243, -97, 638, -324, 462, -150, -435, 269, -614, 352, 159, -122, 619, -495, 82, -102, -531, 497, -301, 327, 326, -416, 416, -544, -74, 211, -400, 654, -131, 50, 275, -631, 298, -288, -60, 522, -352, 517, -156, -293, 286, -607, 338, 26, -112, 558, -462, 214, -118, -436, 442, -376, 318, 203, -329, 437, -500, 16, 110, -409, 552, -236, 113, 234, -519, 355, -336, -31, 373]
2773C73p45Q75o77L4M30q33Q98m42j1N89r21P38m19k07P24q54P67k36l51P23r07
2794d52N85p4m35Q57q01M84K5o14Q23p51L57K42o33Q50o93J83L19p49Q46n43R4
2815h0M60q09P89m86p6N80q18P67l37k08O43q52O64k15l15P44q30N70r3m47P68
2836D19p71M74O6n56P96p23L02K20o32Q17o19J85L18p49Q10n50P9M83p63P66m70
2857i8r6N37p91P23k69j93O30q29N81k01l32P43p33N56n4m74O99p83L95J22m88
2878c55Q25o59K49J68p10P73n63K27M20o88P33n62m2M14p42Q05l10m4N44q53N92
2899B22l56k16P09o89O67j55l99N91q47M77K3l32Q33o72L26oo58P04o03L74L51
2920C44n49P02o68lK80o60Q34l25Q6M69q32N47m79j30O48n90P46k16l21M65q74
$$ y = [373, -372, 503, -174, -140, 290, -543, 355, -87, -98, 491, -430, 308, -111, -318, 406, -448, 319, 83, -268, 455, -452, 133, 59, -376, 481, -320, 164, 189, -425, 398, -353, 4, 246, -387, 463, -230, -47, 272, -477, 369, -174, -80, 380, -429, 360, -126, -202, 378, -440, 327, -10, -218, 425, -427, 237, 22, -293, 451, -379, 191, 98, -349, 419, -352, 122, 188, -368, 428, -295, 7, 227, -405, 412, -207, -22, 296, -453, 357, -193, -114, 369, -394, 372, -98, -194, 343, -448, 275, 6, -187, 443, -386, 195, -6, -338, 405, -328, 228, 174, -300, 399, -384, 11, 133, -355, 470, -189, 60, 228, -482, 291, -272, -45, 375, -313, 420, -142, -184, 230, -512, 293, -17, -61, 483, -370, 222, -134, -350, 359, -330, 337, 182, -217, 374, -473, 4, 27, -305, 528, -144, 182, 176, -482, 222, -381, -7, 344, -205, 497, -171, -174, 106, -554, 280, -45, 41, 510, -322, 225, -254, -384, 264, -326, 420, 204, -117, 348, -526]
2941e26M97n2j92Q23o52M04j55o15O28o32N04K78m41P04p46O9J22o01Q32l41K35
2962A43L56p73N16n75l7N43n03P93k77k10L43q68N24j48o8P72o18M47k70n07N32
2983A15o22N73J91l18O48p70J37pn07Q04l80L39K64o90M89o36O9M24m55Q17l57
3004A28r7K50q19N51k45L8O70n86N02l53l97M79o40O27O4k21N90p49K31r6m22
3025d95P47m27M20J25n75M94o54J56L13l96P40l95KJ96p28N64k98P6N49n66N18
3046C66l83k80M32o00O24o5j55N20p16L20j48l06O83n00M29L3m92N25o44K72J91
3067A06l69P00n11J18J33n89N82l68J51L82n33N12m15j12L76n36O06j87j25M34
3087C55o79M17j60j97N87n41M30r9l82N09n68L60R9l37N90n50J74R7m75O26m19
$$ y = [-526, -29, -81, -273, 550, -102, 302, 147, -468, 160, -472, 32, 310, -131, 573, -173, -104, 18, -583, 249, -92, 143, 499, -274, 242, -333, -370, 173, -330, 463, 186, -24, 319, -549, -25, -173, -241, 531, -87, 360, 90, -417, 115, -507, 66, 257, -61, 587, -183, -46, -53, -560, 244, -136, 203, 467, -223, 266, -370, -301, 123, -332, 485, 128, 31, 281, -538, 13, -232, -194, 476, -110, 392, 39, -358, 121, -519, 108, 172, -49, 541, -208, 23, -73, -495, 252, -175, 245, 370, -205, 289, -365, -209, 104, -292, 448, 53, 55, 251, -477, 87, -211, -135, 414, -152, 366, -17, -297, 135, -465, 159, 94, -61, 459, -257, 63, -85, -391, 292, -208, 221, 254, -238, 287, -357, -85, 106, -263, 437, -74, 44, 177, -412, 170, -198, -47, 335, -198, 314, -101, -213, 163, -373, 233, 46, -79, 355, -324, 93, -67, -264, 323, -218, 212, 113, -269, 240, -328, 32, 131, -206, 384, -166, 8, 105, -370, 256, -163]
3108a63K08K31n34N00m37M6L53m83N99l05r3L24o21M96k03n0N00n59M05k17k86
3129b89M78n10M66Nk68M73o15K45J8l25O15l89K35J07n19M61m76J80K98l90N89
3150C89m15l8K14n71N37j97M3M35n41L75l08k23M46m57N27m6k29L95o33K76n0
3171g1k29O19m12L03rm62M12m93K52K46l08N65m44J2J04n21N43k45J54L68m94
3192a10L75l97j48L60m04N73j07j29L24o15K67j09j59N76l79L48p6m13L68n28
3212c83L04J72k30N58m56P4J5m64M96k80K31K93m34L80m27p7K70l76N69j48k8
3233E9K60n80L05k17p8M79l43M01j19l19L16n20L10Q0j57N19m30J38n6m00M47
3254I5l21K61K41l51L86m51j8J80l71N37j81N9K52n38L08k84m3M05l35M46j45
$$ y = [-163, 45, 276, -258, 242, -195, -149, 204, -279, 320, 15, -78, 246, -375, 121, -82, -132, 368, -191, 214, -3, -289, 189, -321, 145, 150, -118, 355, -260, -15, 3, -322, 293, -96, 139, 246, -273, 188, -288, -108, 190, -200, 389, -26, -64, 150, -421, 116, -81, -38, 397, -144, 231, -77, -300, 146, -311, 216, 170, -59, 336, -297, -21, -71, -300, 319, -93, 210, 201, -261, 151, -342, -90, 156, -152, 413, -31, -19, 85, -436, 107, -138, 16, 384, -110, 265, -132, -280, 80, -324, 249, 142, 13, 337, -278, -11, -120, -279, 297, -82, 266, 190, -223, 145, -383, -79, 93, -137, 421, -35, 39, 54, -410, 86, -194, 37, 330, -104, 276, -151, -228, 42, -334, 235, 87, 59, 319, -261, 44, -173, -251, 228, -115, 286, 167, -152, 164, -356, -46, 34, -123, 396, -34, 104, 48, -352, 95, -226, 35, 276, -75, 311, -140, -158, 22, -349, 188, 7, 66, 318, -220, 88, -196, -239, 166, -169, 277, 132]
3275A32k11K61n28L26j7r8M86m02K18j14l38L87l68L08J59k72M11m62N4P2l40
3296c36N01k12J34J87m45L04l31JL06l11M76j79j25K22n06L19r7n7M45l57K58
3317A97j31l00L29l78L03J11k04M01m33R3K0l20M61k49K00J55l96L34l76K9K37
3338H3l01M66j92m2J83m82L17j57KL64l25L05j77k24K73l75L15M1j31L73m22J39
3360C3m5k65M20k61K30J10l28K98l76P7J64k61M56k23K2J33m38L12k11N7L15l22
3382a03L36k12j68K36l76L40oq8L34m21J79r0k12L74k75K77N4k80K90l85J19J15
3404C8k06M14k54P2R1l92L16k32R6K53k92L19k35j01J94l46L59p2n5K99m06K05
3426F5j38j39L37k72K88Ok47K74m05J85O7j80M14k95J13K9l29L10k44J41K07k72
$$ y = [132, -79, 182, -346, -20, -37, -135, 351, -51, 167, 53, -285, 102, -266, 42, 201, -71, 340, -122, -68, 4, -336, 165, -47, 87, 274, -171, 133, -198, -197, 109, -202, 274, 95, -30, 192, -314, 5, -92, -149, 296, -61, 197, 66, -234, 95, -283, 20, 131, -73, 328, -105, -12, 8, -312, 149, -100, 100, 255, -141, 193, -183, -154, 83, -218, 248, 56, 14, 197, -285, 32, -125, -123, 241, -84, 221, 44, -180, 93, -282, 33, 74, -57, 316, -106, 33, -12, -277, 143, -118, 112, 222, -106, 192, -184, -107, 57, -204, 252, 29, 51, 184, -254, 58, -153, -96, 219, -103, 233, 21, -147, 89, -287, 53, 47, -41, 293, -128, 51, -39, -251, 123, -152, 125, 179, -101, 189, -196, -77, 38, -168, 246, -8, 64, 155, -237, 79, -153, -57, 196, -96, 223, -12, -113, 81, -265, 94, 22, -33, 266, -140, 65, -73, -212, 125, -147, 141, 147, -100, 174, -231, -46, 21, -159, 255, -40, 73, 102, -227, 83, -161, -20, 187, -85]
3448h5L16k78l9J52l13L63r7rK21l69K18j72r8L12k54L04o1j95K34l66J77M2j38
3471a35L69k73J24k3k89L03k37J59J71k41K95l08j1J40k95L80j33L9J89l73K27
3492G8j96l6K81k60L19r2j52J91l68K34j5q6L38k81J58q4k40K79k53K05J15k00
3514f5K70k99K3Q8k54L49j45P7J40l15K17k09mK26k30L30j40q3J63l51K35o8m5
3537i0L04k64J79j13j93K36k54K37O4j53K67l13P9J5k21L25j77J28J06k72K04
3558I4k29K1J81k08L18j39m8J35l18K24j04j1K67k51K16j19j53J96k63K29K0j06
3580d8K53k81J06l6k01K99j91J56Q9k28K20k66M7J18j98L29j65J6J00l05K32j60
3602a14J7K30k14K41j35j11J54k68K26j4n6K37k61J32o5j56K40k08J92N1j73K18
$$ y = [-85, 231, -47, -86, 66, -247, 116, 19, 10, 231, -138, 80, -92, -190, 122, -132, 172, 111, -84, 150, -216, -39, 3, -135, 234, -39, 85, 62, -227, 76, -161, -2, 169, -72, 223, -85, -96, 44, -251, 129, -4, 35, 224, -149, 78, -118, -154, 127, -133, 186, 94, -58, 133, -235, -1, -16, -102, 236, -45, 113, 29, -211, 68, -185, 20, 135, -65, 205, -94, -71, 17, -237, 112, -33, 44, 184, -131, 86, -123, -127, 99, -131, 199, 59, -24, 139, -212, 23, -45, -90, 214, -50, 129, 16, -177, 59, -195, 42, 106, -47, 220, -93, -14, 1, -220, 105, -72, 56, 162, -110, 94, -135, -114, 67, -141, 177, 38, -10, 125, -193, 31, -73, -84, 183, -68, 148, 29, -124, 72, -191, 38, 58, -48, 205, -76, 30, -6, -207, 92, -99, 57, 146, -82, 138, -128, -81, 37, -161, 168, 3, 19, 119, -186, 46, -114, -97, 133, -81, 160, 25, -86, 68, -200, 26, 12, -44, 193, -68, 64, -1, -157, 83, -125, 67, 118, -55, 163]
3624A63k73O9N0j66K83j53P6Q2k65J93j79K8J82j98K57j36o1J25k71K14o4j6K32
3647A72k44J69j06j30K04k09K00K2j24K19k67Q1Nj37K53j45J00O7k24J80j94M2
3669f6J31j67K53j47%Q1k50J98j00K1J93k15J86j31q8J53k12K08j2o8J86k46J25
3692C3l4j27K31j76J40L0j75J74k12R2O3j29K26j56M4N4k02J92j41M6J40j90J96
3715A19j39m7J29k05K03o9k7J66k31J57q0q2J99j96J61j6j19J84k06J07K7j21
3737h6K09j77P3M6j68J89j44M9Q9j63J84j49J8J14j92K05j00l8J40k17J71p3m2
3760f2J74k06J41n9p0J71j98J65k0j02J61j88J03Nj12K15j61O2N0j77J80j42N3
3783a7J06j43J65j36k1R7j84J88n0oJ32k04J27r6o2J72j61J93m6r7J26k20J11
$$ y = [163, -110, -41, 9, -157, 126, -27, 49, 131, -134, 59, -120, -92, 90, -108, 149, 13, -48, 77, -194, 20, -44, -60, 172, -72, 97, -9, -139, 65, -144, 56, 78, -46, 173, -94, -13, -8, -145, 108, -37, 63, 130, -94, 86, -108, -66, 65, -102, 151, 4, 4, 85, -165, 33, -67, -46, 147, -68, 118, -13, -101, 52, -160, 48, 36, -32, 154, -92, 33, -1, -128, 103, -73, 67, 97, -78, 96, -116, -24, 39, -90, 136, -20, 24, 78, -124, 68, -73, -27, 113, -77, 119, -20, -67, 62, -143, 60, -9, -36, 130, -101, 56, -24, -106, 93, -103, 58, 42, -77, 107, -99, 8, 35, -86, 123, -54, 19, 65, -103, 86, -58, -9, 80, -83, 101, -48, -30, 84, -108, 97, -3, -41, 99, -118, 53, -20, -62, 112, -94, 47, -12, -82, 89, -109, 56, 36, -66, 95, -93, 10, 15, -97, 118, -43, 19, 69, -108, 72, -70, -17, 89, -54, 111, -25, -46, 51, -133, 55, 5, -1, 131, -73, 54, -42, -104, 68, -93, 100, 54, -43, 83, -137, -26]
3806b6ln1K05j53R2k3j65J57j44R4J04j11J64j61k6M4j51J99n1L7J15j79Q5j25
3830g3m7J53j08J88k9q4R1k30R9pl4K11j24R0o2j53J11j45J33Q6p3J69j85nLj45
3856a70J84m6Q3R5j79R1j61oJ12p5K03n7m0N2k28R8m4J7K00j12J17r4j38Q9j43
3881a52J40O1l0J57j93Lm3j09J71m4J11N8j45P2j68qQ9m6J93n1k2K1j96R4n4K8
3907f3J66q1J11q8j22O6j47J51M5pJ39j68J2o3j02J62m9J18L9j15O2j82J0N3l7
3932i0J97o5RJ2j74P3o3M2J42p4J11r9p6M1j32J38L5lJ26j63L5n7r1J41o6J20
3958F9M0j13O9j50J4L7l3J78p7K3Oj57Q1q6O6R0o4J20j12o0L6r7J19oK7R4j36
3985b2L5o6m9J08n9J23Np2N3j41N6J2l6J54q6M7l0j13Q1q1N5Q7p4J10j04l0L7
$$ y = [-26, -29, -80, 125, -28, 64, 41, -124, 33, -111, -17, 87, -24, 140, -21, -47, -3, -154, 45, -6, 31, 146, -33, 52, -73, -120, 33, -75, 113, 84, 0, 91, -139, -40, -47, -81, 130, 6, 96, 34, -119, -8, -153, -20, 66, -7, 162, -23, -28, -25, -170, 14, -32, 51, 146, -33, 58, -103, -109, 3, -72, 131, 74, 34, 86, -142, -44, -88, -71, 129, 17, 134, 40, -98, -9, -152, -12, 49, 19, 176, -17, -14, -57, -166, 5, -39, 72, 130, -15, 57, -111, -119, -30, -76, 117, 66, 44, 65, -131, -37, -91, -63, 103, 22, 133, 45, -77, -11, -158, -7, 38, 31, 170, 2, 14, -49, -151, 11, -38, 80, 119, 4, 66, -116, -106, -53, -90, 107, 42, 51, 63, -111, -38, -101, -59, 83, 9, 120, 21, -55, -14, -146, -8, 27, 24, 150, -13, 22, -35, -126, 15, -51, 69, 109, -4, 65, -85, -71, -34, -67, 111, 34, 57, 63, -94, -13, -99, -33, 57, -7, 113, 1, -59, -23, -120, -1, -7, 20, 114, -22, 13, -53, -102, 6, -53, 70, 75, 3, 56, -85, -29, -17, -53, 101, 15, 62, 32, -81, 0, -81, -26, 61, -13, 97, -7, -37, 0]
4012@j04J30k8J7P5j31N2p2k2J06o6J10k1n7O1j48P0J8k8J29q6M7l2j03R3q3P8
4039EO0n5Q3j10nMo7J22l1K2O0j21M3p2oQ8n3J03k0o7M5j26O7J4j3J21q5M1m3
4068Dr2R1p8Q8N2m9P9j30QKp3J41l4M2M2j15L9q0kO6k2J15m0n1K2j34O3LK4J18
4098I9q2L8o0p5O9q7J07N0l2O4j10k2pn0J28j8N8J9j17K3q4J6P7k2J22l8m0pj21
4127a02N1lM4J05o5L6p7o5L7o6J05M9NL5j00k1l9m3J04PQ5J8j14J6j05J5O2PJ17
4156I8l1j7k9j24M2k2P2J01l5N1j10o1J3o2J05M2K7N4j17j2p3k7R8MJ03J0p9M
4184B5j30J3M0K1J32l4%n8j23L5k5Q7R4k3O0r7o6j4m3R4M9N4L2j09k7o9l1Q7J8
4213hR8J9o4j3j28JK5K3J38l0K0o1j10J6l0P9Q2oO2r9n6k9o8J07L6O5M6q5j2r3
$$ y = [0, -104, 26, -2, 15, 90, -41, 11, -61, -83, 23, -43, 67, 46, -11, 50, -98, -28, -10, -38, 91, 5, 52, 20, -83, 10, -73, 5, 65, 10, 93, -17, -22, -18, -85, 37, 6, 28, 88, -33, 10, -62, -68, 20, -33, 70, 50, -17, 28, -98, -31, -17, -30, 91, 6, 47, 4, -88, 3, -75, 13, 65, 16, 95, -35, -27, -25, -98, 43, 9, 51, 93, -22, 17, -63, -65, 1, -21, 94, 54, 3, 25, -109, -46, -43, -19, 99, 17, 55, -5, -80, -11, -98, 9, 59, 27, 91, -19, -41, -48, -98, 30, 12, 70, 89, -28, -5, -89, -73, 4, -18, 104, 66, 26, 19, -102, -51, -54, -10, 95, 30, 66, -11, -76, -39, -105, 0, 49, 54, 89, -11, -32, -71, -114, -10, -3, 82, 100, -14, 2, -103, -88, -26, -19, 98, 67, 50, 21, -103, -61, -83, -11, 90, 55, 106, -4, -65, -52, -114, -9, 33, 60, 114, -3, -15, -88, -115, -17, -13, 90, 100, 21, 25, -105, -92, -52, -31, 101, 67, 67, 9, -114, -79, -104, -17, 77, 54, 114, 17, -49, -63, -106, -12, 37, 91, 123, 14, -13, -82, -113, -26, -8, 90, 109, 45, 32, -96, -95, -70, -47, 91, 61, 81, 20, -90, -74, -104, -25, 57, 51, 113, 14, -42, -71, -139, -32, 4, 69, 115, 30, 18, -75]
4243g5l0O5J1J25ll9j5j18LPL5J12j1J9l8r9ln6Q4O2J6N1p9m8l6n8Q3K7O6N0p8
4274C0j3q6l2N6LJ12jk3j2j03J0j5L3J00lK9n5p3J1o4O9M4J4O9q0k7m0m8O2J5
4304a8O9L4p3J0q6j8K9J0Q9JKj6q8J0j6J6Q0nM5m7n5j1n5P7L6L0L9o0j2n4l2L8
4336c1J4N7K6m0lp2lK1KQ8j5Ok0r1J7k3L7N9jL8n2m2om7O4K1K4M1o0ln2k0M3j
4370b4O5K3k9j4o2p%K2P1MNk3p3J1j9L6N7j1L4n6k9j8l7O2QL3L8n4mn2j7K9PP1
4404D7mpj5q0QPK8N7%K3m1n1ok9M0M7K1K3m5k7m3k9N2K3M3J7l2j4o6oJ5J9P5j5
4438C5mk1p0OoL7O7%J5l9n1j7k5M2L7L7L2n0l3m6rL0L6O5Nj7l2p7j2J7L4P0mN
4472E7l3q1%nL6N6K3K0n7m6l1k4M6M5N9J3m6k4o4j5L2L1P0J5k5k5q2j5J5L4O8
$$ y = [-75, -105, -40, -29, 96, 93, 54, 39, -79, -76, -69, -34, 78, 67, 86, 48, -51, -54, -110, -26, 36, 52, 103, 24, -24, -60, -118, -35, -8, 58, 108, 30, 17, -69, -101, -45, -42, 70, 69, 46, 34, -69, -59, -74, -41, 59, 56, 85, 30, -43, -32, -96, -27, 17, 31, 100, 20, -7, -47, -95, -33, -18, 51, 85, 12, 22, -64, -82, -53, -43, 46, 47, 49, 33, -55, -45, -61, -45, 35, 30, 75, 28, -27, -38, -93, -16, 20, 50, 89, 29, 17, -37, -69, -31, -17, 40, 66, 26, 23, -49, -52, -31, -29, 59, 44, 50, 30, -61, -44, -67, -30, 29, 28, 66, 14, -28, -34, -81, -17, 4, 28, 69, 9, 6, -46, -66, -23, -24, 41, 64, 35, 21, -41, -48, -48, -26, 45, 49, 54, 31, -42, -31, -50, -14, 43, 32, 66, 10, -19, -37, -74, -12, -4, 29, 67, 13, 9, -43, -60, -31, -24, 47, 43, 36, 21, -59, -51, -44, -16, 41, 41, 64, 23, -28, -34, -63, -23, 24, 45, 68, 23, -4, -47, -76, -24, -1, 42, 59, 27, 13, -53, -59, -44, -25, 50, 35, 31, 10, -60, -54, -60, -23, 44, 44, 59, 20, -31, -48, -73, -31, 6, 43, 75, 25, -8, -54, -63, -33, 3, 68, 73, 56, 24, -53, -65, -48, -14, 56, 52, 57, 24, -57, -57, -62, -26, 30, 53, 73, 16, -30, -61, -85, -39, 6, 65, 78, 32, 8, -56, -71, -39, -8, 62, 77, 52, 27, -55, -70, -55, -21, 47]
4503D7L4j1m5p1j1k5M6O6L1K1m8n3l2m5O2L2O3J3m5j3q8nJ6M3O6K0j4l3o7k1n
4534g2M2P4J7J3m8m9k7k5M6N4L4L5m8n3l6l5L4L6N5K5l9j4p4k1RL8O8J5Lk8p7
4565d8j3k2M8N4L2J5l7l1n8j7M8L8L4K7k2l4m9l3L6K4N2K7j6l1o0j8PJ8N5K1J5
4596F2l2n5j2m3M4M4L1K1l5l2l0k2L7PM2L1l1kn2k1K0JN3L7j8pn4j3j8K5N4oL1
4629E7j5m9ll8K9L5MK7k1j4l6k1J8KM1K3k5J7m6j7RlL0K2Mjl9qj7J4K4J1K0qj3
4664A3ql9K4J4j2M1k4Qj4k9J3j3L3J9j9J8k6k1J3l3M2nJ6Qj8jk7oK7rK4%kQl7
4699b2KjjL6%Mj2j6K0k7RJ8%K2l0Mnk4L1k4J7K0j4J0k6qJ2k3J9NQJ1l4J0mlJ6
4736@j4K0lj3Pj9%J5lM2l1RJ2l5lKK7M%J1k6krj2K2mML4l1Kk2lPj6L2Lj3J0k2
$$ y = [47, 81, 70, 25, -46, -57, -82, -36, 30, 61, 82, 34, -19, -51, -96, -34, -2, 61, 74, 29, 16, -72, -77, -61, -18, 48, 68, 54, 21, -46, -67, -72, -30, 44, 61, 74, 26, -23, -50, -75, -29, 25, 59, 94, 46, -7, -43, -78, -44, -8, 47, 72, 33, 19, -55, -76, -67, -29, 39, 54, 57, 29, -48, -61, -83, -35, 19, 51, 66, 29, -2, -60, -77, -29, 9, 43, 70, 48, 14, -35, -68, -32, -8, 44, 71, 55, 24, -36, -54, -47, -29, 26, 47, 62, 30, -25, -37, -80, -36, 8, 39, 60, 25, -7, -37, -59, -22, -15, 27, 58, 27, 25, -27, -48, -28, -27, 26, 63, 45, 38, -16, -29, -47, -22, 32, 26, 57, 42, -7, -10, -48, -19, 16, 20, 47, 26, 12, -24, -45, -27, -25, 16, 39, 14, 31, -15, -32, -23, -26, 4, 26, 30, 29, -10, -18, -35, -21, 3, 14, 34, 26, 13, 5, -34, -10, 4, -8, 33, 9, 17, 3, -26, -13, -26, 7, 26, 7, 25, -1, -22, -9, -42, 0, -5, 11, 19, 1, 0, -27, -33, -6, -15, 9, 9, 7, 15, -22, -20, -21, -22, 14, 14, 18, 6, -10, 10, -17, -8, 10, 10, 32, 2, 6, 1, -23, 8, -16, 1, 21, 7, 17, -9, -17, -5, -28, -9, -4, 4, 15, -19, -9, -13, -16, 0, -14, 6, 3, -10, -3, -22, -22, -7, -10, 32, 1, 10, 22, -13, -16, -14, 13, 17, 17, 28, 2, 0, -9, -21, 1, -3, 1, 35, 4, 6, -16, -19, -12, -28, 4, 7, -6, 4, -18]
4775a8MrQL7j6jok2K4k8NK3lL0k5j0lk1M0j9J1L2l0%j6j3K0pK9NlPm1J6j5rL0
4812Fj2J5pj7J6k2PJ7j2L0k0nLk4J9oK1K6l5Mj4rK3pK7ppLm2L2j9RK8j9K6k9o
4849gJj9J8J2lJ5k9OrrL1j5J7onJ2k5RJ0k6L7prjj6J6j2J3K9k1J0j5pKj4K2qR
4887FRj7J1k5KQpK7j0j2L0n1kK4%K7k2NLk1J2j4K6LqK0k3rJ0k7L4qJ1K3k6mj9
4924a4LK5j9K9ok4L0m4NRj3L8j1ojl1K3j6J9K4j9J9l0KMj7K4jJ4Ql1Jk0J1L1k4
4960hK8Lj7Rl5J8j5J5L2k3J0j0l1J4j2J3K2qK3l1lOl5L2rK0K2k7Ol4rK9j3M8o
4995B4pQn4RKJ9K4j6J4pl0J1k3K5J7NK0k9ok7j9K9PJ3K6k4Km0qK1kM2j5JJm0O
5032b1mJ8J9JK1j9k4Pl6K3L1jK7l6Nk3j7K6nK8J4qkm2j1LJ5L0%lnl1j0kJ4K1R
$$ y = [-18, -14, -23, -15, 22, 6, 5, -1, -23, 1, -27, -22, 1, -2, 28, 3, -7, -10, -31, 9, -10, 1, 33, 3, 3, -13, -26, -6, -13, 16, 21, 18, 25, -16, 0, -15, -24, 6, -6, 9, 2, -15, 1, -21, -14, 3, -9, 21, 1, -4, -1, -25, -6, -12, 9, 35, 0, 4, -10, -19, 4, -3, 24, 17, 10, 13, -29, 3, -16, -7, 21, 2, 28, -1, -7, -6, -25, -7, 5, 2, 17, -12, -6, -15, -24, 7, -8, 9, 3, -2, 10, -15, -6, 4, -22, 15, 8, -1, -2, -18, -2, -14, -1, 28, 7, 17, 2, -5, -3, -17, 5, -3, 6, 15, -2, 9, -16, -14, -6, -13, 14, 4, -8, 22, -29, -31, -7, -7, 20, -2, 3, 6, -15, -3, -17, 9, 12, 4, 24, 1, -8, 2, -25, 9, 1, 12, 35, 9, 5, -14, -11, 14, -5, 24, 18, -6, 24, -20, -15, -6, -19, 19, 8, 2, 1, -30, -7, -23, -4, 20, 1, 20, -10, -8, -4, -21, 3, 2, 16, 24, -7, -6, -26, -15, 16, -8, 20, 23, 6, 15, -20, -2, -17, -2, 30, 7, 17, 7, -24, -10, -22, -9, 13, 5, 28, -3, -6, 0, -35, -3, -12, 8, 30, 3, 9, -25, -34, -5, -18, 30, 24, 17, 25, -29, -20, -18, 1, 25, 9, 23, 16, -14, -3, -26, -1, 16, 21, 41, 12, 6, -21, -40, -11, -4, 9, 35, 11, 13, -27, -35, -14, -16, 26, 11, 12, 13, -27, -21, -25, -7, 12, 13, 34, 15, -9, -2, -38, -15, 16, 15, 42, 6, 11, -12, -29, -3, -8, 20, 34, 26, 24, -18, -29, -26, -11, 19, 19, 16, 11, -20, -30, -32, -18, 3, 12]
5069A2K1k7j9nk5K8OK6J8j6pk5j3J3JL8Lj2Pl8kNKL5Jj4J3l9j1qK0J0J7J5qk4
5105bnl5K0K1K0Oj7Ql3k6K3pL6J1rKk6j9QQK5OQKk8oj4RJ5LK9j3qj4k8K1j4L5
5143A2J5rj2k9j1J7j9L4PpJ5l2qj0QL3LJ4k1j3qj4K2J7jK9j5j9Kk8J0mL5KmJk2
5180a0j6QJ0J9QoKl0poRK1KKLk4nj0K2%PK1k3Oj5rJ4KJ7Lj0jk1mJ4LNOQkk0j0
5222a7oRL0jLj6j5lrJ0lK0J2j9Ok7JNJ2K6oknk1j4RQK0NKkk5PpJ5J3rJ5k2Jj2
5263a2j1K1NLJ9k1Kk1k2K5JK0Qj9Nk5j%K0J7M%j1k0rj4K3J6J3J1j5j5qj8J7J6
5299DJ6jj2pj1plJ1K6Pmjk4j9MJ3J6jNj9j2j7lK5KL3J0j6k2k0kK0LK0J0lj3l2
5337b4j8J5K1L1JJpk7j1j1J2K0K6Qk3k1j5j0RK6K2rnk0k2j2J7J8K2J1oj7j8qr
$$ y = [12, 33, 6, -13, -18, -43, -15, -9, 17, 35, 19, 12, -13, -26, -13, -12, 26, 29, 17, 24, -14, -16, -11, -9, 26, 27, 13, 26, -13, -24, -32, -12, -2, 15, 30, 22, -2, -7, -42, -22, -1, 19, 25, 8, 16, -17, -43, -20, -27, 9, 20, 11, 13, -13, -32, -24, -16, 9, 15, 23, 25, -3, -9, -23, -14, 1, 4, 33, 20, 12, -2, -30, -9, -23, 12, 27, 18, 6, -23, -34, -17, -36, -2, 5, -2, 13, -19, -27, -37, -29, 4, 7, 21, 0, -13, -21, -35, -13, 4, 3, 32, 17, -2, 0, -28, -18, -22, 13, 15, 11, 12, -10, -26, -18, -8, 11, 19, 13, 15, -15, -22, -28, -19, 2, 4, 6, 9, -15, -20, -30, -8, -8, -1, 20, -3, 3, -12, -21, -7, -5, 12, 15, 5, 4, -17, -21, -7, -4, 1, 7, 15, 13, -7, -17, -23, -14, 16, 15, 18, 2, -13, -16, -25, -15, -18, 2, 14, -5, 1, -26, -25, -20, -8, 18, 12, 10, 5, -16, -30, -21, -13, 7, 12, 14, 12, -13, -6, -13, 2, 15, 6, 21, -1, 0, -12, -23, -2, 3, 6, 25, 4, 6, -15, -37, -12, -11, 9, 17, -2, 3, -22, -23, -23, -3, 14, 18, 18, 7, -13, -22, -36, -13, 3, 16, 27, 12, -3, -11, -29, -12, 4, 20, 19, 7, 0, -11, -18, -21, -10, 16, 23, 19, 18, -6, -25, -21, -8, 8, 7, 12, -7, -19, -36, -39, -14, -12, 21, 31, 15, -7, -27, -29, -9, -6, 14, 24, 21, 8, -24, -42, -27, -6, 25, 26, 27, 20, -7, -18, -29, -17, 3, 29, 37, 14, -7, -22, -32, -23, 3, 25, 16, 11, -9, -31, -43, -26, -8, 14, 25, 19, 2, -16, -24, -33]
$$ [...]
8191c
##END NTUPLES=NMR FID
##END=
