##TITLE=1H_LY-xylene-1
 
 8 sc, 
 5.04.2022
##JCAMPDX= 6.0         $$ Bruker NMR JCAMP-DX V2.0
##DATA TYPE= NMR FID
##DATA CLASS= NTUPLES
##ORIGIN= UXNMR, Bruker Analytische Messtechnik GmbH
##OWNER= root
$$ XWIN-NMR		Version 3.5
$$ Tue Apr  5 11:40:12 2022 Russian Standard Time (UT+4h)  she@DPX200
##.OBSERVE FREQUENCY= 200.131346
##.OBSERVE NUCLEUS= ^1H
##.DELAY= (6, 6)
##.ACQUISITION MODE= SIMULTANEOUS
##.ACQUISITION SCHEME= undefined
##.AVERAGES= 8
##.DIGITISER RES= 18
##SPECTROMETER/DATA SYSTEM= spect
##.PULSE SEQUENCE= zg30
##.SOLVENT NAME= CD2Cl2
##.SHIFT REFERENCE= (INTERNAL, CD2Cl2, 0, 15.7039)
##AUDIT TRAIL= $$ (NUMBER, WHEN, WHO, WHERE, WHAT)
$$ ##TITLE= Audit trail, XWIN-NMR		Version 3.5
$$ ##JCAMPDX= 5.01
$$ ##ORIGIN= Bruker BioSpin GmbH
$$ ##OWNER= she
$$ F:/spectra/data/she/nmr/H-F/1/audita.txt
$$ ##AUDIT TRAIL=  $$ (NUMBER, WHEN, WHO, WHERE, WHAT)
(   1,<2022-04-05 11:38:09.67 +0400>,<she>,<DPX200>,
      <created by zg, POWCHK disabled, PULCHK disabled
       configuration hash MD5:
       00 E9 B6 7A A2 85 ED C7 34 08 36 98 17 FE 4E 26
       data hash MD5: 16K
       AF B2 74 BF 43 D3 5F C2 CC 4F 22 76 C5 6B 00 DE>)
$$ ##END=
$$ 
$$ hash MD5
$$ 3E 08 22 0E 88 9B 13 7C E8 5F 97 30 A7 A4 2B 68
##$RELAX= 
##$RELAX= 
##$RELAX= 
##$RELAX= 
##$RELAX= 
##$RELAX= 
$$ Bruker specific parameters
$$ --------------------------
##$DU= <F:/spectra>
##$EXPNO= 1
##$NAME= <H-F>
##$PROCNO= 1
##$TYPE= <nmr>
##$USER= <she>
##$AMP= (0..31)
100 100 100 100 100 100 100 100 100 100 100 100 100 100 100 100 100 100 
100 100 100 100 100 100 100 100 100 100 100 100 100 100 
##$AQSEQ= 0
##$AQ_mod= 1
##$AUNM= <au_zg>
##$AUTOPOS= <>
##$BF1= 200.13
##$BF2= 200.13
##$BF3= 200.13
##$BF4= 200.13
##$BF5= 200.13
##$BF6= 200.13
##$BF7= 200.13
##$BF8= 200.13
##$BYTORDA= 1
##$CFDGTYP= 0
##$CFRGTYP= 5
##$CHEMSTR= <none>
##$CNST= (0..31)
1 1 145 1 1 1 1 1 1 1 1 1 1 1 1 1 1 1 1 1 1 1 1 1 1 1 1 1 1 1 1 1 
##$CPDPRG= <>
##$CPDPRG1= <>
##$CPDPRG2= <>
##$CPDPRG3= <>
##$CPDPRG4= <mlev>
##$CPDPRG5= <mlev>
##$CPDPRG6= <mlev>
##$CPDPRG7= <mlev>
##$CPDPRG8= <mlev>
##$CPDPRGB= <>
##$CPDPRGT= <>
##$D= (0..31)
0 1.2 0 0 0 0 0 0 0 0.06 0 0.03 0 0 0 0 0.0002 0 0 0 0 0 0 0 0 0 0 0 0 
0 0 0 
##$DATE= 1649144289
##$DBL= (0..7)
120 120 120 120 120 120 120 120 
##$DBP= (0..7)
150 150 150 150 150 150 150 150 
##$DBP07= 0
##$DBPNAM0= <>
##$DBPNAM1= <>
##$DBPNAM2= <>
##$DBPNAM3= <>
##$DBPNAM4= <>
##$DBPNAM5= <>
##$DBPNAM6= <>
##$DBPNAM7= <>
##$DBPOAL= (0..7)
0.5 0.5 0.5 0.5 0.5 0.5 0.5 0.5 
##$DBPOFFS= (0..7)
0 0 0 0 0 0 0 0 
##$DE= 6
##$DECBNUC= <off>
##$DECIM= 32
##$DECNUC= <off>
##$DECSTAT= 4
##$DIGMOD= 1
##$DIGTYP= 9
##$DL= (0..7)
0 120 120 120 120 120 120 120 
##$DP= (0..7)
150 150 150 150 150 150 150 150 
##$DP07= 0
##$DPNAME0= <>
##$DPNAME1= <>
##$DPNAME2= <>
##$DPNAME3= <>
##$DPNAME4= <>
##$DPNAME5= <>
##$DPNAME6= <>
##$DPNAME7= <>
##$DPOAL= (0..7)
0.5 0.5 0.5 0.5 0.5 0.5 0.5 0.5 
##$DPOFFS= (0..7)
0 0 0 0 0 0 0 0 
##$DQDMODE= 0
##$DR= 18
##$DS= 0
##$DSLIST= <SSSSSSSSSSSSSSS>
$$ [...]
##$SUBNAM2= <"">
##$SUBNAM3= <"">
##$SUBNAM4= <"">
##$SUBNAM5= <"">
##$SUBNAM6= <"">
##$SUBNAM7= <"">
##$SUBNAM8= <"">
##$SUBNAM9= <"">
##$SW= 18.0517287032376
##$SWIBOX= (0..15)
0 0 2 0 0 0 0 0 0 0 0 0 0 0 0 0 
##$SW_h= 3612.71676300578
##$TD= 16384
##$TD0= 1
##$TE= 0
##$TE2= 300
##$TE3= 300
##$TEG= 300
##$TL= (0..7)
0 120 120 120 120 120 120 120 
##$TP= (0..7)
150 150 150 150 150 150 150 150 
##$TP07= 0
##$TPNAME0= <>
##$TPNAME1= <>
##$TPNAME2= <>
##$TPNAME3= <>
##$TPNAME4= <>
##$TPNAME5= <>
##$TPNAME6= <>
##$TPNAME7= <>
##$TPOAL= (0..7)
0.5 0.5 0.5 0.5 0.5 0.5 0.5 0.5 
##$TPOFFS= (0..7)
0 0 0 0 0 0 0 0 
##$TUNHIN= 0
##$TUNHOUT= 0
##$TUNXOUT= 0
##$USERA1= <user>
##$USERA2= <user>
##$USERA3= <user>
##$USERA4= <user>
##$USERA5= <user>
##$V9= 5
##$VALIST= <valist>
##$VCLIST= <CCCCCCCCCCCCCCC>
##$VD= 0
##$VDLIST= <DDDDDDDDDDDDDDD>
##$VPLIST= <PPPPPPPPPPPPPPP>
##$VTLIST= <TTTTTTTTTTTTTTT>
##$WBST= 1024
##$WBSW= 4
##$XGAIN= (0..3)
0 0 0 0 
##$XL= 0
##$YL= 0
##$YMAX_a= 241553
##$YMIN_a= -208739
##$ZGOPTNS= <>
##$ZL1= 120
##$ZL2= 120
##$ZL3= 120
##$ZL4= 120
##$ABSF1= 10
##$ABSF2= 0
##$ABSG= 5
##$ABSL= 3
##$ALPHA= 0
##$AQORDER= 0
##$ASSFAC= 0
##$ASSFACI= 0
##$ASSFACX= 0
##$ASSWID= 0
##$AUNMP= <proc_1d>
##$AZFE= 0.1
##$AZFW= 0.1
##$BCFW= 1
##$BC_mod= 2
##$BYTORDP= 1
##$COROFFS= 0
##$CY= 11.3945322036743
##$DATMOD= 1
##$DC= 2
##$DFILT= <>
##$DTYPP= 0
##$F1P= 2.36226072786647
##$F2P= -0.459571619588291
##$FCOR= 0.5
##$FTSIZE= 0
##$FT_mod= 4
##$GAMMA= 1
##$GB= 0.15
##$INTBC= 1
##$INTSCL= 1
##$ISEN= 128
##$LB= 0.24
##$LEV0= 0
##$LPBIN= 0
##$MAXI= 10000
##$MC2= 0
##$MEAN= 0
##$ME_mod= 0
##$MI= 1.114404
##$NCOEF= 0
##$NC_proc= 0
##$NLEV= 6
##$NOISF1= 3.799351
##$NOISF2= 2.8
##$NSP= 1
##$NTH_PI= 0
##$NZP= 0
##$OFFSET= 15.70392
##$PC= 1
##$PHC0= -17746.68
##$PHC1= 10.20078
##$PH_mod= 1
##$PKNL= yes
##$PPARMOD= 0
##$PSCAL= 0
##$PSIGN= 0
##$REVERSE= no
##$SF= 200.130013532006
##$SI= 16384
##$SIGF1= 3
##$SIGF2= 2
##$SINO= 400
##$SIOLD= 16384
##$SREGLST= <1H.CDCl3>
##$SSB= 0
##$STSI= 0
##$STSR= 0
##$SW_p= 3612.71676300578
##$SYMM= 0
##$S_DEV= 0
##$TDeff= 0
##$TDoff= 0
##$TI= <>
##$TILT= no
##$TM1= 0
##$TM2= 0
##$TOPLEV= 0
##$USERP1= <user>
##$USERP2= <user>
##$USERP3= <user>
##$USERP4= <user>
##$USERP5= <user>
##$WDW= 1
##$XDIM= 8192
##$YMAX_p= 0
##$YMIN_p= 0
$$ End of Bruker specific parameters
$$ ---------------------------------
##NTUPLES= NMR FID
##VAR_NAME=  TIME,          FID/REAL,        FID/IMAG
##SYMBOL=    X,             R,               I
##VAR_TYPE=  INDEPENDENT,   DEPENDENT,       DEPENDENT
##VAR_FORM=  AFFN,          ASDF,            ASDF
##VAR_DIM=   8192,          8192,            8192
##UNITS=     SECONDS,       ARBITRARY UNITS, ARBITRARY UNITS
##FACTOR=    0.0002768,     1,               1
##FIRST=     0,             0,               0
##LAST=      2.2672688,     0,               0
##MIN=       0,             -208739,         0
##MAX=       2.2672688,     241553,          0
$$ Real data points
##PAGE= N=1
##DATA TABLE= (X++(R..R)), XYDATA
$$ [...]
$$ plain form
979 -8557 3105 -3866 -9521 8187 -6375 8102 5600 -5689 7641 -11186 -1347 1750 -6853
992 -6853 12526 -2303 2891 4368 -11786 4667 -7263 -678 9072 -5026 10432 -3073 -4965
1005 -4965 3429 -11658 5965 486 -403 10955 -7369 3535 -3398 -8578 7009 -6459 7171
1018 7171 4835 -4748 7508 -10016 -760 1008 -6565 11075 -2637 3238 4073 -10248 4715 -7145
1032 -7145 -665 7748 -5119 10084 -2964 -3843 3692 -11274 5965 -641 -568 10362 -7290 4599
1046 4599 -3275 -7633 6688 -7109 6840 3928 -4353 7862 -9368 -39 780 -6795 10291 -3260
1060 -3260 3303 4148 -9338 5096 -6988 -715 6678 -5141 9368 -2608 -3069 3628 -10186 5142
1074 5142 -811 -927 9419 -6429 4397 -2464 -7051 6151 -6895 5949 3539 -4018 7699
$$ packed form
979h557J1662o971n655J7708j4562J4477k502j1289J3330j8827R839L097q603
992f853J9379j4829N194J477j6154J6453j1930O585R750j4098J5458j3505j892
1005d965Q394j5087J7623n479q89J1358j8324J0904o933n180J5587j3468J3630
1018G171k336r583J2256j7524R256J768p573J7640j3712N875Q35j4321J4963j1860
1032g145O480Q413j2867J5203j3048q79P535j4966J7239o606P3J0930j7652J1889
1046D599p874m358J4321j3797J3949k912q281J2215j7230R329Q19p575J7086j3551
1060c260O563Q45j3486J4434j2084O273P393j1819J4509j1976m61O697j3814J5328
1074E142n953j16J0346j5848J0826o861m587J3202j3046J2844k410p557J1717
$$ plain form
1087 7699 -8424 256 649 -6624 9316 -3336 3162 4197 -8519 5204 -6719 -888 6050 -5403
1101 -5403 9182 -2542 -2416 3773 -9931 5033 -1476 -913 8886 -6031 4705 -2348 -6504 5512
1115 5512 -6830 5442 3274 -3513 7490 -7645 202 373 -6438 8415 -3034 3199 4117 -7484
1129 -7484 4649 -6331 -1084 5170 -4730 8485 -1897 -1929 3375 -9251 4180 -1688 -807 8348
1143 8348 -5215 4858 -2383 -6042 4589 -6887 5267 2886 -2538 7388 -7196 369 -483 -6407
1157 -6407 7818 -3066 3912 4184 -6822 4661 -6984 -1134 4354 -4585 8944 -1719 -936 3026
1171 3026 -9249 3691 -2471 -517 8126 -4373 5308 -2300 -5835 3687 -7140 4902 2765 -1665
1185 -1665 7520 -6582 357 -1302 -6448 6825 -2772 4388 4362 -5712 4128 -7068 -1735 3435
$$ packed form
1087G699j6123Q680L93p273J5940j2652O498J035j2716J3723j1923N831O938j1453
1101e403J4585j1724J26O189j3704J4964o509N63R799j4917J0736p053m156J2016
1115E512j2342J2272k168o787J1003j5135P847J71o811J4853j1449O233R18j1601
1129g484J2133j0980N247O254r900J3215j0382l2N304j2626J3431n868Q81R155
1143H348j3563J0073p241l659J0631j1476J2154k381n424R926j4584P565q52n924
1157f407J4225j0884O978K72j1006J1483j1645N850N488q939J3529j0663P83L962
1171C026j2275J2940o162J954Q643j2499R681p608l535R522j0827J2042k137m430
1185a665R185j4102O939j659n146J3273r597P160k6j0074R840j1196N333N170
$$ plain form
1199 3435 -4225 8911 -937 -179 2964 -9294 2991 -3296 -510 8072 -3661 6189 -2257 -5524
1213 -5524 2884 -7826 4659 2417 -851 8104 -6093 708 -1972 -6971 6211 -3139 4968 4765
1227 4765 -4910 4402 -7461 -2092 2405 -4312 8835 -374 665 3017 -8888 2075 -3795 -946
1241 -946 7666 -2707 6446 -1452 -5287 2125 -8057 3673 2262 -244 8320 -4939 824 -2300
1255 -2300 -7141 4957 -3144 4964 5080 -3722 4474 -7188 -2489 1414 -4539 8444 -9 1611
1269 1611 3310 -8356 1752 -4644 -1279 6908 -2350 7040 -1030 -4475 1727 -8389 3011 1494
1283 1494 -5 8450 -4126 1461 -2362 -7176 4031 -3628 4806 5067 -2704 4788 -6615 -2551
1297 -2551 513 -4719 7540 286 2206 3640 -7272 1354 -4870 -1829 5845 -2005 6986 -284
$$ packed form
1199C435p660J3136r848P58L143j2258J2285o287K786Q582j1733R850q446l267
1213e524Q408j0710J2485k242l268Q955j4197O801k680m999J3182r350Q107k03
1227D765r675R312j1863N369M497o717J3147r209J039K352j1905J0963n870K849
1241i46Q612j0373R153p898l835P412j0182J1730j411k506Q564j3259N763l124
1255b300m841J2098q101Q108J16q802Q196j1662M699L903n953J2983q453J620
1269A611J699j1666J0108o396L365Q187r258R390q070l445O202j0116J1400j517
1283A494j499Q455j2576N587l823m814J1207p659Q434K61p771P492j1403M064
1297b551L064n232J2259p254J920J434j0912Q626o224L041P674p850Q991p270
$$ plain form
1311 -284 -3515 1538 -8142 2112 680 -84 8105 -3222 2103 -2054 -6842 3239 -4257 4321 4662
1326 4662 -2036 5381 -6073 -2051 -101 -5184 6897 -277 2758 3955 -6427 1853 -5217 -2015
1340 -2015 4901 -2367 7062 -33 -2540 1824 -7910 1749 -148 -410 7619 -2712 2668 -1559 -6265
1355 -6265 2640 -4570 3524 4161 -1579 5499 -5076 -1748 -308 -5358 5803 -486 2682 4174 -5394
1370 -5394 2074 -4940 -2272 3980 -2614 6672 226 -1739 2138 -7388 1505 -814 -717 7043 -2459
1385 -2459 3235 -1177 -5645 2389 -4980 3077 3536 -1366 5764 -4531 -1195 -495 -5519 5135 -960
1400 -960 2717 4259 -4680 2373 -4812 -2446 3232 -2838 6278 517 -1121 2335 -6843 1059 -1205
1415 -1205 -1024 6448 -1913 3420 -686 -5082 1897 -4962 2446 3138 -918 5685 -3717 -936 -710 -5430
$$ packed form
1311b84l231N053r680J0254j432p64Q189j1327N325m157m788J0081p496Q578L41
1326D662o698P417j1454M022J950n083J2081p174L035J197j0382Q280p070L202
1340b015O916p268R429p095k507M364r734R659j897k62Q029j0331N380m227m706
1355f265Q905p210Q094O37n740P078j0575L328J440n050J1161o289L168J492r568
1370e394P468p014K668O252o594R286o446j965L877r526Q893k319R7P760r502
1385b459N694m412m468Q034p369Q057M59m902P130j0295L336P00n024J0654o095
1400i60L677J542q939P053p185K366N678o070R116n761j638L456r178P902k264
1415a205J81P472q361N333m106m396O979o859P408O92m056O603r402K781K26m720
$$ plain form
1431 -5430 4281 -1045 2734 4320 -3905 2461 -4709 -2595 2553 -2986 6150 674 -443 2458 -6662
1446 -6662 877 -1904 -1134 6115 -1632 4000 -509 -4674 1510 -5395 2128 2752 -505 5987 -3235
1461 -3235 -595 -1065 -5612 3651 -1237 2975 4470 -3103 2473 -4651 -2867 1785 -2906 5844 1210
1476 1210 100 2531 -6286 208 -2258 -1441 5797 -1027 4291 -120 -4410 925 -5703 1624 2435
1491 2435 5 6223 -2620 -378 -1465 -5867 2964 -1450 3255 4774 -2379 2740 -4855 -3119 1020
1506 1020 -3129 5926 1476 947 2700 -6124 -153 -2968 -1654 5488 -520 4810 312 -4126 470
1521 470 -6084 1006 2195 342 6516 -1910 -155 -1713 -6111 2081 -1603 3244 5028 -1452 2776
1536 2776 -4580 -3542 209 -3236 5469 2007 1572 2980 -5628 -655 -3489 -2037 4965 -72 5229
$$ packed form
1431e430R711n326L779J586q225O366p170K114N148n539R136n476j117K901r120
1446f662P539k781P70P249p747N632m509m165O184o905P523O24l257O492r222
1461c235K640m70m547R263m888M212J495p573N576p124J784M652m691Q750m634
1476A210j110K431q817O494k466Q17P238o824N318m411m290N335o628P327Q11
1491B435k430O218q843K242j087m402Q831m414M705J519p153N119p595J736M139
1506A020m149R055m450n29J753q824N971k815J314P142o008N330m498m438M596
1521D70o554P090J189j853O174q426J755j558m398Q192l684M847J784o480M228
1536B776p356J038L751l445Q705l462m35J408q608M973k834J452P002n037N301
$$ plain form
1551 5229 797 -3540 66 -6363 428 1660 630 6730 -1238 350 -1827 -6299 1412 -2158 3264
1566 3264 5078 -774 3281 -4492 -3496 -581 -3623 5089 1978 2226 3294 -4988 -785 -3908 -2472
1581 -2472 4258 85 5407 1395 -2861 47 -6362 -256 1048 563 6600 -424 869 -1558 -6078
1596 -6078 594 -2493 2724 4958 -94 3636 -3773 -3411 -1002 -4053 4378 1764 2563 3695 -4282
1611 -4282 -471 -4164 -2776 3398 -250 5460 1663 -1980 349 -6184 -594 248 125 6300 -131
1626 -131 1597 -1028 -5634 362 -3113 2188 4401 155 4078 -3040 -2808 -1153 -4289 3475 1318
1641 1318 2445 3954 -3367 -42 -3795 -3103 2604 -768 4946 1903 -1270 900 -5545 -808 -381
1656 -381 -442 5466 74 1991 -339 -4796 227 -3327 1338 3608 63 4234 -2252 -2018 -895 -4393
$$ packed form
1551E229m432m337L606o429O791J232j030O100p968J588k177m472P711l570N422
1566C264J814n852M055p773R96K915l042Q712l111K48J068q282M203l123J436
1581b472O730m173N322m012m256K908o409O106J304m85O037p024J293k427m520
1596f078O672l087N217K234n052L730p409L62K409l051Q431k614P99J132p977
1611d282L811l693J388O174l648N710l797l643K329o533N590Q42j23O175o431
1626a31J728k625m606N996l475N301K213m246L923p118K32J655l136P764k157
1641A318J127J509p321L325l753O92N707l372N714l043l173K170o445M737M27
1656c81o1N908n392J917k330m457N023l554M665K270l545M171o486K34J123l498
$$ plain form
1672 -4393 2776 465 2138 3902 -2609 789 -3359 -2893 1877 -1477 4305 1710 -641 1571 -4776
1687 -4776 -563 -851 -1113 4611 -244 2323 237 -3836 484 -3419 718 2621 -223 4032 -1508
1702 -1508 -1228 -445 -4068 1988 -164 1431 3605 -1948 1366 -2504 -2562 1397 -1999 3417 1340 -263
1718 -263 2070 -3797 -182 -1034 -1542 3647 -626 2321 673 -2921 964 -3345 370 1715 -744 3819
1734 3819 -1243 -318 -18 -3670 1648 -970 946 3021 -1601 1922 -1886 -2036 1126 -2427 2677 863
1750 863 -169 2423 -3036 300 -989 -1828 2864 -1047 2144 966 -2136 1358 -2933 42 1107
1765 1107 -1148 3349 -885 140 536 -3206 1406 -1329 386 2535 -1449 2212 -1342 -1515 981
1780 981 -2604 2054 372 -157 2488 -2390 694 -881 -1914 2281 -1436 1945 1003 -1616 1760 -2705
$$ packed form
1672d393P169k311J673J764o511L398m148M66M770l354N782k595k351K212o347
1687d776M213k88k62N724m855K567k086m073M320l903M137J903k844M255n540
1702a508K80P83l623O056k152J595K174n553L314l870n8L959l396N416k077j603
1718b63K333n867L615q52n08N189m273K947j648l594L885m309L715J345k459M563
1734C819n062R25L00l652N318k618J916K075m622L523l808j50L162l553N104j814
1750H63j032K592n459L336j289q39M692l911L191j178l102L494m291K975J065
1765A107k255M497m234J025L96l742M612k735J715K149l984L661l554j73K496
1780I81l585M658j682n29K645m878L084j575j033M195l717L381r42k619L376m465
$$ plain form
1796 -2705 58 610 -1462 3006 -873 593 813 -2731 1340 -1578 77 2116 -1359 2322 -937
1811 -937 -1147 956 -2639 1636 62 -198 2461 -1953 887 -761 -1861 1806 -1545 1643 998 -1258
1827 -1258 1795 -2319 -50 388 -1592 2651 -794 708 972 -2423 1312 -1682 -48 1782 -1290
1842 -1290 2391 -809 -787 889 -2593 1476 -208 -107 2377 -1732 1114 -789 -1733 1556 -1703 1625
1858 1625 869 -985 1856 -2223 26 138 -1607 2431 -774 821 990 -2205 1212 -1700 -185 1592
1874 1592 -1241 2334 -624 -686 865 -2526 1264 -275 -126 2316 -1497 1152 -720 -1689 1363 -1687
1890 -1687 1502 875 -810 1858 -2052 8 -8 -1608 2251 -739 942 1009 -2017 1153 -1785 -244
1906 -244 1391 -1181 2344 -557 -515 795 -2514 1139 -444 -93 2254 -1370 1266 -694 -1611 1197
$$ packed form
1796b705K763N52k072M468l879J466K20l544M071k918J655K039l475L681l259
1811i37k10K103l595M275j574k60K659m414K840j648j100L667l351L188o45k256
1827a258L053m114K269M38j980M243l445J502K64l395L735k994J634J830l072
1842a290L681l200K2J676l482M069j684J01K484m109K846j903r44L289l259L328
1858A625p56j854K841m079K249J12j745M038l205J595J69l195L417k912J515J777
1874A592k833L575k958o2J551l391L790j539J49K442l813K649j872r69L052l050
1890a687L189o27j685K668l910K060j6j600L859k990J681O7l026L170k938J541
1906b44J635k572L525k901M2J310l309L653j583L51K347l624K636j960r17K808
$$ plain form
1922 1197 -1733 1431 832 -632 1873 -1897 7 -103 -1604 2048 -660 969 1062 -1778 1063 -1703
1938 -1703 -356 1176 -1086 2199 -359 -375 763 -2366 909 -527 -161 2100 -1154 1314 -603 -1501
1954 -1501 986 -1789 1280 678 -471 1874 -1685 142 -254 -1584 1784 -758 1054 1051 -1456 1126
1970 1126 -1691 -336 884 -1100 2102 -298 -88 791 -2152 778 -695 -257 1870 -983 1367 -409
1986 -409 -1302 860 -1823 997 527 -429 1880 -1379 234 -246 -1593 1432 -857 945 1046 -1136
2002 -1136 1201 -1516 -379 610 -1184 1874 -246 165 919 -1873 742 -890 -359 1561 -901 1504
2018 1504 -240 -950 783 -1836 787 242 -385 1855 -1131 501 -214 -1574 1182 -1114 861 977
2034 977 -909 1406 -1390 -292 335 -1349 1604 -300 333 1062 -1546 745 -962 -563 1253 -916
$$ packed form
1922A197k930L164n99j464K505l770J904j10j501L652k708J629R3k840K841k766
1938a703J347J532k262L285k558j6J138l129L275j436L66K261l254K468j917q98
1954a501K487k775L069o02j149K345l559J827l96j330L368k542J812lk507K582
1970A126k817J355J220j984L202k400K10Q79k943K930j473M38K127k853K350j776
1986d09q93K162k683K820m70r56K309l259J613m80j347L025k289J802J01k182
2002a136K337k717J137R89j794L058k120M11P54k792K615j632N31J920k462K405
2018A504j744p10J733k619K623n45o27K240k986J632p15j360K756k296J975J16
2034I77j886K315k796J098O27j684K953j904O33P29k608K291j707L99J816k169
$$ plain form
2050 -916 1520 10 -663 850 -1777 537 -27 -468 1767 -829 712 -32 -1435 892 -1226 582
2066 582 889 -691 1533 -1083 -230 187 -1526 1331 -441 434 1159 -1250 858 -1063 -637 874 -1009
2083 -1009 1470 88 -316 918 -1658 387 -296 -586 1600 -674 944 137 -1230 744 -1386 410
2099 410 701 -512 1603 -771 -81 118 -1536 975 -484 397 1250 -948 937 -949 -738 603 -1125
2116 -1125 1347 165 -69 989 -1479 291 -520 -650 1352 -554 1063 239 -989 639 -1435 252
2132 252 469 -440 1642 -612 187 71 -1484 793 -690 450 1147 -686 1066 -879 -649 401 -1194
2149 -1194 1200 125 83 1075 -1328 345 -667 -729 1152 -624 1128 256 -759 606 -1433 156
2165 156 260 -431 1522 -468 282 117 -1383 659 -755 353 1070 -575 1133 -766 -518 303 -1177
$$ packed form
2050i16K436j510o73J513k627K314n64m41K235k596J541p44j403K327k118J808
2066E82L07j580K224k616Q53M17j713K857j772Q75P25k409K108j921M26J511j883
2083a009K479j382m04J234k576K045o83k90K186k274J618q07j367J974k130J796
2099D10K91j213K115k374O90J99j654K511j459Q81Q53k198J885j886K11J341j728
2116a125K472j182k34J058k468J770q11j30K002j906J617q24j228J628k074J687
2132B52K17r09K082k254P99j16j555K277j483J140O97j833J752j945K30J050j595
2149a194K394j075m2R92k403J673j012o2J881j776J752q72j015J365k039J589
2165A56J04o91J953j990P50j65j500K042j414J108P17j645J708j899K48Q21j480
$$ plain form
2182 -1177 1089 34 180 1060 -1140 407 -648 -714 1015 -654 1111 271 -631 679 -1423 209
2198 209 89 -455 1438 -519 423 63 -1233 611 -811 333 902 -518 1081 -678 -439 286 -1152
2215 -1152 979 -28 170 1025 -1025 448 -604 -645 882 -630 1019 262 -508 665 -1242 174
2231 174 88 -457 1309 -470 415 110 -1132 615 -833 313 753 -507 1038 -687 -308 204 -1058
2248 -1058 874 -117 173 899 -920 464 -576 -576 794 -659 981 170 -438 657 -1173 247 18
2265 18 -406 1211 -476 455 92 -1004 587 -790 294 681 -471 1000 -634 -264 193 -1005 821
2282 821 -173 180 807 -848 456 -582 -517 672 -624 897 152 -384 610 -1096 222 -27 -397 1138
2300 1138 -468 493 78 -914 568 -811 316 586 -422 1020 -606 -153 154 -988 802 -236
$$ packed form
2182a177K266j055J46Q80k200J547j055o6J729j669J765q40r02J310k102J632
2198B09j20n44J893j957R42l60j296J844j422J144N69j420J599j759K39P25j438
2215a152K131j007J98Q55k050J473j052m1J527j512J649p57p70J173j907J416
2231A74q6n45J766j779Q85l05j242J747j448J146M40j260J545j725L79N12j262
2248a058J932r91K90P26j819J384j040%J370j453J640q11o08J095j830J420k29
2265A8m24J617j687R31l63j096J591j377J084L87j152J471j634L70M57j198J826
2282H21r94L53O27j655J304j038O5J189j296J521p45n36R94j706J318k49l70J535
2300A138j606R61m15r92J482j379J127K70j008J442j626M53L07j142J790j038
$$ plain form
2316 -236 238 793 -798 528 -626 -475 584 -658 897 107 -274 577 -1072 184 -127 -410 1054
2333 1054 -416 522 119 -867 489 -839 242 546 -360 1045 -514 -105 119 -998 697 -262 266
2350 266 829 -654 569 -599 -494 477 -680 881 163 -133 641 -1020 166 -264 -443 955 -371
2367 -371 638 135 -755 400 -931 145 416 -308 1060 -406 -15 71 -1026 562 -349 278 859 -519
2385 -519 651 -584 -518 331 -738 844 194 21 713 -904 135 -366 -499 848 -311 720 246
2402 246 -605 363 -974 31 267 -269 1063 -284 92 47 -1035 385 -479 235 799 -372 724 -536
2420 -536 -492 162 -822 737 147 138 769 -794 182 -487 -546 720 -347 818 287 -434 390 -1001 21
2439 21 102 -259 1059 -199 255 60 -974 290 -575 185 742 -271 783 -452 -442 88 -890 622
$$ packed form
2316b36M74N55j591J326j154J51J059j242J555p90l81Q51j649J256l11k83J464
2333A054j470R38m03r86J356j328J081L04r06J405j559M09K24j117J695r59N28
2350B66N63j483J223j168J05R71j157J561p18k96P74j661J186m30j79J398j326
2367c71J009n03q90J155j331J076K71p24J368j466L91Q6j097J588r11O27N81j378
2385e19J170j235O6Q49j069J582o50j73O92j617J039n01j33J347j159J031m74
2402B46q51R68j337J005K36n36J332j347L76m5j082J420q64P14N64j171J096j260
2420e36M4O54r84J559n90rO31j563R76o69n9J266j067J165n31p21Q24j391J022
2439B1Q1l61J318j258M54j95j034J264q65P60N57j013J054j235J0N30r78J512
$$ plain form
2457 622 90 171 801 -681 206 -506 -602 576 -392 777 324 -327 448 -964 -21 11 -318 1010 -183
2476 -183 355 112 -862 278 -646 158 623 -223 821 -379 -328 64 -879 519 -19 161 762 -594 279
2495 279 -457 -570 469 -464 695 269 -257 471 -861 -5 -51 -368 859 -206 358 167 -740 319
2513 319 -592 107 507 -265 770 -323 -190 116 -754 475 -88 113 659 -498 337 -346 -459 429 -480
2532 -480 569 168 -257 477 -729 100 -43 -367 707 -317 314 134 -596 393 -539 120 374 -342 652
2551 652 -348 -76 199 -629 514 -173 52 500 -522 381 -276 -266 436 -462 481 13 -268 447 -586
2570 -586 225 37 -314 604 -420 223 76 -527 477 -443 189 281 -431 515 -428 -32 245 -487 559
2589 559 -201 -6 349 -595 368 -234 -108 518 -425 459 -126 -307 375 -555 379 94 -168 565 -478 145
$$ packed form
2457F22n32Q1O30j482Q87p12r6J178r68J169m53o51P75j412R43L2l29J328j193
2476a83N38k43r74J140r24Q04M65q46J044j200N1L92r43J398n38J80O01j356Q73
2495B79p36j13J039r33J159m26n26P28j332Q56m6l17J227j065N64j91r07J059
2513C19r11O99M00p72J035j093J33L06q70J229n63K01N46j157Q35o83j13Q88r09
2532d80J049m01m25P34j206Q29j43l24J074j024O31j80p30R89r32O59K54p16R94
2551F52j000K72K75q28J143o87K25M48j022R03o57J0P02q98R43m68k81P15j033
2570e86Q11j88l51R18j024O43j47o03J004r20O32R2p12R46r43L96K77p32J046
2589E59p60J95L55r44R63o02J26O26r43Q84n85j81O82r30R34k85k62P33j043O23
$$ plain form
2609 145 -16 -449 535 -301 277 280 -468 414 -510 -59 271 -399 638 -193 -25 218 -659 328 -242 -15
2629 -15 540 -345 426 -185 -363 282 -530 396 156 -100 558 -499 94 -111 -437 524 -241 371 280 -401
2649 -401 327 -547 -59 222 -295 653 -123 11 186 -666 257 -289 1 535 -310 458 -235 -351 192 -557
2669 -557 383 104 -24 528 -459 81 -172 -425 451 -243 377 279 -338 334 -536 -56 159 -267 620 -96
2689 -96 93 173 -585 215 -292 3 475 -247 465 -186 -289 167 -563 335 39 -15 516 -418 160 -217 -397
2710 -397 356 -323 370 203 -250 340 -501 -27 67 -310 548 -139 143 192 -490 263 -337 -12 378 -243 492
2731 492 -150 -182 196 -521 293 -33 -48 492 -370 239 -137 -366 338 -370 312 139 -223 393 -445 38 12
2752 12 -327 449 -205 151 205 -395 289 -313 -45 284 -305 455 -136 -78 248 -465 292 -99 -68 421 -329
$$ packed form
2609A45j61m33R84q36N78Lp48Q82r24M51L30o70J037q31J68K43q77R87n70K27
2629a5N55q85P71o11j78O45q12R26k40k56O58j057N93k05l26R61p65O12r1o81
2649d01P28q74M88K81n17R48p76J34J75q52R23n46K90N34q45P68o93j16N43p49
2669e57R40k79j28N52r87N40k53k53Q76o94O20r8o17O72q70M80K15m26Q87p16
2689i6J89Q0p58Q00n07K95M72p22P12o51j03M56p30Q98k96n4N31r34N78l77j80
2710c97P53o79O93j67m53N90q41M74R4l77Q58o87K82M9o82P53o00L25L90o21P35
2731D92o42l2L78p17Q14l26j5N40q62O09l76k29P04p08O82j73l62O16q38M83k6
2752A2l39P76o54L56N4o00O84o02K68L29n89P60n91N8L26p13P57l91L1M89p50
$$ plain form
2773 -329 284 -74 -271 325 -384 243 97 -214 411 -365 106 40 -338 396 -284 139 177 -353 333 -311 -17
2794 -17 202 -331 366 -144 -50 259 -394 274 -119 -118 351 -333 291 -48 -204 329 -365 237 43 -198 378
2815 378 -317 151 60 -287 355 -280 106 157 -314 344 -275 22 190 -342 350 -210 -25 213 -368 303 -144
2836 -144 -77 275 -347 257 -82 -165 314 -323 241 7 -204 327 -342 161 52 -224 385 -258 130 97 -312
2857 -312 328 -245 83 215 -274 334 -216 -59 157 -359 317 -107 -17 280 -352 224 -166 -164 276 -273 283
2878 283 20 -182 246 -386 102 23 -195 417 -202 147 58 -361 260 -287 101 243 -198 396 -225 -75 110
2899 110 -381 315 -68 73 331 -313 191 -216 -208 249 -252 341 68 -134 227 -426 40 -44 -166 416 -127
2920 -127 177 39 -374 147 -326 69 266 -121 415 -186 -96 23 -402 262 -39 133 366 -244 184 -252
$$ packed form
2773c29O13l58j97N96p09O27j46l11O25p76M71o6l78P34o80M23L8n30O86o44K94
2794a7K19n33O97n10R4L09o53O68l93JM69o84O24l39j56N33o94O02j94k41N76
2815C78o95M68r1l47O42o35L86N1m71O58o19K97J68n32O92n60J85K38n81O71m47
2836a44O7L52o22O04l39q3M79o37N64k34k11N31o69N03j09k76O09o43L88l3m09
2857c12O40n73L28J32m89O08n50J57K16n16O76m24R0K97o32N76l90KM40n49N56
2878B83k63k02M28o32M88p9k18O12o19L49q9m19O21n47L88J42m41N94o21J50J85
2899A10m91O96l83J41K58o44N04m07QM57n01N93k73k02L61o53M66q4j22N82n43
2920a27L04j38m13N21m73L95J97l87N36o01R0J19m25O64l01J72K33o10M28m36
$$ plain form
2940 -252 -236 187 -218 388 129 -39 230 -427 18 -117 -151 410 -77 253 35 -335 89 -372 58 213 -66
2961 -66 414 -156 -73 -25 -441 197 -71 140 367 -183 206 -270 -254 126 -224 387 143 12 243 -401 7
2982 7 -143 -152 392 -50 299 70 -279 84 -386 47 172 -51 424 -130 -29 -39 -420 161 -120 136 342 -164
3004 -164 203 -265 -248 76 -270 341 110 18 252 -365 22 -154 -166 356 -95 291 89 -241 128 -365 60
3025 60 136 -61 416 -124 26 -3 -358 158 -131 113 288 -163 208 -227 -202 77 -276 286 55 -14 227 -338
3047 -338 52 -134 -179 300 -138 242 37 -213 147 -326 62 115 -105 353 -147 31 28 -300 215 -141 99
3068 99 227 -180 218 -185 -109 122 -217 261 5 -41 185 -297 85 -82 -123 272 -176 168 -13 -212 163
3089 163 -251 104 91 -122 268 -203 7 29 -247 237 -93 85 160 -220 186 -181 -41 170 -164 286 -39
$$ packed form
2940b52J6M23m05O06k59j68K69o57M45j35l4N61m87L30k18l70M24m61M30J55k79
2961f6M80n70Q3M8m16O38k68K11K27n50L89m76J6L80l50O11k44j31K31o44M08
2982Gj50rN44m42L49k29l49L63m70M33J25k23M75n54J01j0l81N81k81K56K06n06
3004a64L67m68J7L24l46O11k31r2K34o17L87j76j2N22m51L86k02l30L69m93M25
3025F0P6j97M77n40J50k9l55N16k89K44J75m51L71m35K5K79l53N62k31o9K41n65
3047c38L90j86m5M79m38L80k05k50L60m73L88N3k20M58n00J78ll28N15l56K40
3068I9J28m07L98m03P6K31l39M78k56m6K26m82L82j67m1L95m48L44j81j99L75
3089A63m14L55j3k13L90m71K10K2k76M84l30J78P5l80M06l67J40K11l34M50l25
$$ plain form
3110 -39 -38 123 -266 144 -34 -27 273 -158 139 -63 -190 178 -206 167 100 -109 211 -255 -5 -4 -194 266 -84
3133 -84 100 110 -249 125 -210 -2 185 -112 292 -67 -69 81 -288 149 -14 41 291 -147 138 -113 -200 148
3155 148 -163 213 132 -59 197 -261 -41 -27 -165 292 -57 131 102 -271 75 -246 -9 170 -88 302 -84
3176 -84 -67 34 -317 117 -39 52 291 -127 135 -125 -217 117 -173 231 123 -13 224 -249 -23 -62 -158 267
3198 267 -21 156 130 -202 69 -240 -54 148 -78 305 -35 -51 30 -331 82 -82 34 270 -105 165 -119
3219 -119 -209 61 -209 176 123 -1 229 -217 -19 -72 -187 234 -47 187 147 -155 98 -229 -50 104 -65
3240 -65 285 2 10 56 -282 55 -103 -6 250 -81 182 -84 -172 39 -243 135 65 15 220 -167 11 -83 -193
3263 -193 142 -86 169 142 -109 119 -221 -53 43 -106 263 5 71 90 -228 67 -128 -4 214 -46 215
$$ packed form
3110c9JJ61l89M10j78PL00m31K97k02j27L68l84L73o7k09L20m66K50Jj90M60l50
3133h4J84J0l59L74l35K08J87k97M04l59kJ50l69M37j63N5K50m38K85k51q7L48
3155A48l11L76q1j91K56m58K20J4j38M57l49J88k9l73L46l21K37J79k58L90l86
3176h4J7J01l51M34j56R1K39m18K62k60r2L34k90M04j08j36K37m73K26l9r6M25
3198B67k88J77k6l32K71l09J86K02k26L83l40j6Q1l61M13j64J16K36l75K70k84
3219a19r0K70k70L85n3j24K30m46J98n3j15M21k81K34m0l02K53l27J79J54j69
3240f5L50k83QM6l38L37j58R7K56l31K63k66q8K11k82L78p0n0K05l87J78r4j10
3263a93L35k28K55k7k51K28l40J68R6j49L69k58O6J9l18K95j95J24K18k60K61
$$ plain form
3284 215 -32 -123 49 -239 104 31 5 241 -131 60 -96 -193 107 -127 149 103 -74 137 -199 -48 3 -129
3306 -129 217 -10 86 105 -186 76 -154 -33 162 -65 223 -19 -59 69 -216 87 19 3 236 -98 83 -65
3328 -65 -184 108 -147 129 101 -58 175 -189 -23 -16 -154 175 -50 90 95 -174 63 -159 -39 108 -78 208
3350 208 -2 -34 64 -218 63 -27 -8 222 -80 125 -31 -145 85 -133 112 94 -32 184 -130 -8 -17 -154
3372 -154 153 -41 90 107 -141 82 -161 -50 72 -90 181 -18 -22 48 -207 56 -46 -11 178 -85 106 -36
3394 -36 -122 82 -138 101 74 -26 171 -131 11 -4 -129 149 -42 96 100 -117 92 -143 -32 73 -83 182
3416 182 -29 -8 54 -193 52 -56 -12 156 -91 97 -48 -125 69 -150 86 64 -28 160 -120 8 -15 -130
3438 -130 147 -30 89 93 -116 94 -127 -17 91 -64 179 -17 9 77 -174 72 -51 2 163 -74 121 -55
$$ packed form
3284B15k47r1J72k88L43p3k6K36l72J91j56r7L00k34K76m6j77K11l36J51N1j32
3306a29L46k27R6J9k91K62k30J21J95k27K88k42m0J28k85L03o8j6K33l34J81j48
3328f5j19K92k55K76k8j59K33l64J66Pj38L29k25J40Nk69K37k22J20J47j86K86
3350B08k10l2R8k82K81r0J9K30l02K05j56j14K30k18K45j8j26K16l14J22rj37
3372a54L07j94J31J7k48K23k43J11J22j62K71j99mP0k55K63j02L5J89k63J91j42
3394c6q6K04k20K39k7j00J97l02J42j5j25K78j91J38Mk17K09k35J11J05j56K65
3416A82k11K1O2k47K45j08M4J68k47J88j45p7J94k19K36k2r2J88k80J28k3j15
3438a30K77j77J19Mk09K10k21J10J08j55K43j96K6O8k51K46j23N3J61k37J95j76
$$ plain form
3460 -55 -113 57 -136 87 56 -27 141 -137 -5 -28 -121 126 -51 80 79 -117 73 -133 -23 83 -68 182 -4
3483 -4 -2 64 -159 64 -37 9 170 -57 122 -48 -90 53 -136 96 48 -9 132 -125 -2 -37 -129 109 -43 78
3507 78 79 -107 57 -139 -50 45 -74 159 -14 2 52 -164 46 -52 -2 145 -47 122 -27 -95 69 -132 99
3530 99 50 6 150 -99 25 -26 -97 109 -59 94 84 -68 69 -128 -41 20 -76 143 -20 13 53 -157 39 -84
3554 -84 -25 117 -65 101 -31 -78 49 -140 64 29 -23 160 -68 39 -16 -111 94 -74 96 75 -51 108 -105
3577 -105 -8 16 -89 131 -26 37 74 -128 45 -86 -47 91 -62 107 -12 -68 44 -148 38 -6 -34 142 -62
3600 -62 47 -12 -111 71 -95 53 79 -48 112 -85 -7 13 -99 117 -27 54 84 -89 73 -73 -30 77 -64
3623 -64 111 8 -36 60 -130 13 -19 -52 114 -63 67 -11 -104 55 -111 22 45 -52 109 -63 -1 15 -110 85
$$ packed form
3460e5n8J70j93K23l1q3J68k78J32k3r3K47j77J31jj96J90k06J10J06j51K50j86
3483dKO6k23K23j01M6J61k27J79j70m2J43j89K32m8n7J41k57J23l5r2K38j52J21
3507G8Jj86J64j96Q9R5j19K33j73J6N0k16K10r8N0J47j92J69j49o8J64k01K31
3530I9m9m4J44k49J24n1p1K06j68J53j0j52J37j97Q7O1r6K19j63L3M0k10J96j23
3554h4N9J42j82J66j32m7J27j89K04l5n2J83k28J07n5r5K05j68J70k1j26J59k13
3577a05R7K4j05K20j57O3L7k02J73j31L9J38j53J69j19n6J12j92J86m4k8J76k04
3600f2J09n9r9J82j66J48K6j27J60j97P8K0j12K16j44Q1L0j73J62j46M3J07j41
3623f4J75j03m4R6j90J43l2l3J66j77J30p8r3J59j66J33K3r7J61j72O2J6j25J95
$$ plain form
3647 85 -53 46 94 -67 91 -67 -33 53 -80 120 7 5 80 -106 23 -22 -37 104 -45 86 18 -69 62 -102
3671 -102 19 36 -49 107 -68 7 18 -108 73 -60 26 71 -60 82 -56 -45 44 -82 90 -8 -4 87 -95 51
3695 51 -19 -35 103 -47 74 28 -41 62 -85 25 27 -49 109 -38 23 29 -95 62 -54 4 59 -84 73 -52
3719 -52 -44 40 -97 74 -24 -19 67 -89 43 -27 -41 90 -68 63 20 -52 71 -75 46 31 -46 102 -54 17 29
3744 29 -53 93 -41 23 64 -74 68 -41 -6 65 -72 79 -17 -31 53 -101 53 -21 -28 81 -82 37 -18 -77 63
3769 63 -80 54 45 -54 80 -89 4 27 -46 109 -28 28 47 -77 57 -43 9 86 -39 83 -9 -41 41 -99 47
3794 47 12 -9 109 -67 25 -40 -90 60 -67 49 37 -51 47 -102 -21 -1 -61 91 -13 30 24 -100 20 -77 -4 59
3820 59 -18 100 -18 -29 19 -99 40 20 14 115 -38 30 -42 -84 41 -58 77 64 -18 64 -103 -34 -29 -75 100 -5
$$ packed form
3647H5j38R9M8j61J58j58L4Q6j33K00j13kP5j86J29m5j5J41j49J31o8q7J31j64
3671a02J21J7q5J56j75P5J1j26J81j33Q6M5j31J42j38J1Q9j26J72r8MR1j82J46
3695E1p0j6J38j50J21m6o9J03j47J10Kp6J58j47O1Oj24J57j16N8N5j43J57j25
3719e2QQ4j37J71r8NQ6j56J32p0j4J31j58J31m3p2J23j46J21j5p7J48j56P1J2
3744B9q2J46j34O4M1j38J42j09L5P1j37J51r6j4Q4j54J54p4pJ09j63J19n5n9J40
3769F3j43J34rr9J34j69R3K3p3J55j37N6J9j24J34j00N2P7j25J22r2l2Q2j40J46
3794D7l5k1J18j76R2o5n0J50j27J16j2q8R8j49Q1K0o0J52j04M3oj24J20r7P3O3
3820E9p7J18j18j1M8j18J39k0oJ01j53O8p2m2J25r9J35j3q2Q2j67O9Nm6J75j05
$$ plain form
3846 -5 41 34 -90 2 -88 -14 66 -13 107 0 -21 0 -115 22 1 32 125 -28 47 -32 -89 28 -51 97 86 19 82
3873 82 -84 -27 -10 -75 101 11 66 53 -90 6 -96 -37 45 -18 117 -7 -25 -2 -128 6 -20 17 121 -17 52
3898 52 -37 -88 8 -70 67 69 11 87 -57 -20 -25 -62 78 20 71 71 -54 20 -91 -43 54 -16 129 10 -2 15 -130 -4
3926 -4 -41 -1 101 -15 68 -39 -80 -5 -84 41 46 7 72 -59 -23 -32 -75 58 -4 61 72 -38 27 -84 -42 33 -31 106
3954 106 18 18 39 -90 10 -38 -4 93 -20 65 -23 -68 2 -92 38 35 3 75 -64 -17 -48 -78 39 -42 42 51 -51 25
3982 25 -78 -27 27 -44 90 8 5 38 -91 18 -22 -5 98 -14 77 -2 -50 27 -71 41 30 10 92 -51 4 -34 -66
4009 -66 46 -35 34 36 -41 35 -80 -21 7 -48 64 -4 -16 17 -90 18 -30 -10 77 -14 55 -17 -43 35 -69 49 40 2
4037 2 98 -42 18 -7 -58 67 -17 64 57 -46 37 -68 -17 17 -41 75 -3 -2 20 -100 10 -38 -4 61 -27 43 -17 -59
$$ packed form
3846eM6pj24R2r0P4Q0p9J20j07k1K1j15J37k1L1R3j53P5p9n7J17p9J48j1o7O3
3873H2j66N7J7o5J76r0N5j3j43R6j02N9Q2o3J35j24j8K3j26J34k6L7J04j38O9
3898E2q9n1R6p8J37Kn8P6j44L7nl7J40n8N1%j25P4j11M8R7p0J45j19j2J7j45J26
3926dl7M0J02j16Q3j07m1P5p9J25Nl9O5j31L6rm3J33o2O5J1j10O5j11M2P5o4J37
3954A06q8%K1j29J00m8L4R7j13Q5q8m5P0r4J30ll2P2j39M7l1l0J17q1Q4Rj02P6
3982B5j03N1N4p1J34q2lL3j29J09m0J7J03j12R1p9m8P7r8J12j1k0Q2j43N5l8l2
4009f6J12q1O9Kp7P6j15N9K8n5J12o8j2L3j07J08m8K0Q7r1O9p2k6P8j04J18rl8
4037BR6j40O0k5n1J25q4Q1pj03Q3j05N1L4n8J16p8JK2j20J10m8L4O5q8P0o0m2
$$ plain form
4065 -59 14 -69 37 39 6 77 -46 5 -19 -60 52 -15 56 61 -28 32 -70 -15 20 -15 89 18 15 20 -81 -12 -46 -4 70
4094 70 -8 55 -18 -60 -13 -81 27 21 10 74 -39 -16 -51 -72 30 -19 54 69 -24 36 -67 -34 4 -21 102 34 45 34
4122 34 -78 0 -45 5 87 14 85 -6 -52 -15 -89 27 15 35 86 -28 -10 -55 -98 7 -33 57 81 -17 23 -81 -63 -23
4150 -23 -39 81 27 47 36 -78 -25 -68 -15 81 27 106 23 -32 -11 -92 9 27 43 110 9 26 -36 -91 -5 -32 59 84
4178 84 4 49 -69 -60 -38 -56 60 29 45 51 -69 -36 -86 -46 50 15 92 30 -37 -9 -110 -5 16 39 121 15 41 -30
4206 -30 -93 -8 -38 60 90 39 69 -49 -52 -39 -69 57 44 60 66 -57 -27 -101 -68 28 0 95 30 -12 -18 -117 -32 -18 9 91
4236 91 25 41 -17 -90 -20 -61 40 73 46 83 -21 -34 -41 -56 38 37 69 75 -19 -7 -66 -48 21 4 101 49 5 15 -104 -37
4266 -37 -38 -9 72 16 49 -14 -81 -21 -77 20 42 21 78 -40 -29 -45 -82 32 15 67 76 -6 6 -59 -45 6 -4 79 40 24
$$ packed form
4065e9P3q3J06Kl3P1j23N1k4m1J12o7P1Nq9O0j02N5L5l5J04p1lNj01O9l4M2P4
4094G0p8O3p3m2M7o8J08oj1O4j13K3l5k1J02m9P3J5r3O0j03L3L8k5J23o8J1j1
4122C4j12P8m5N0Q2p3P1r1m6L7p4J16j2K0N1j14J8m5m3J05m0R0K4r8M0j04J8M0
4150b3j6J20n4K0j1j14N3m3N3R6n4P9q3n5K1q1J01J8J6O7j01J7o2n5Q6k7R1K5
4178H4q0M5j18RK2j8J16l1J6Oj20L3n0M0R6l5P7o2o7K8j01J05K1K3Q2j06K6p1
4206c0o3Q5l0R8L0n1L0j18lJ3l0J26j3J6Oj23L0p4L3R6k8R5o5m2or9Q5J4K7Q2
4236I1o6J6n8p3P0m1J01L3k7L7j04j3pj5R4jL2Or4J2n9J8O9j7R7n2m4J0j19O7
4266c7jK9Q1n6L3o3o7O0n6R7K2k1N7j18J1j6l7J14j7N2Rq2J2o5J4N1j0Q3l9j6
$$ plain form
4296 24 16 -81 -27 -40 -16 78 17 56 -4 -73 -18 -93 0 28 21 63 -36 -13 -45 -90 0 -13 49 54 -15 17 -66 -49 5 -18 82
4327 82 38 35 29 -61 -8 -25 2 64 32 64 13 -35 1 -53 9 36 13 76 -15 -6 -31 -71 12 -26 42 46 -16 18 -61 -52 -13 -29 44
4360 44 27 22 36 -62 -15 -38 -12 50 3 60 9 -28 8 -57 15 37 24 75 1 10 -19 -62 23 -19 37 62 0 30 -53 -45 -16 -44
4392 -44 56 13 21 18 -71 -19 -55 -21 38 0 62 11 -23 -14 -80 9 21 13 84 4 17 -17 -55 17 -12 43 69 6 43 -36 -39 -11
4424 -11 -31 61 27 31 29 -59 -17 -50 -16 49 6 69 12 -18 -15 -84 -9 -7 23 72 1 16 -42 -74 -2 -30 52 63 22 38 -53 -40
4456 -40 -14 -23 75 47 55 57 -40 -18 -46 -20 45 30 88 18 -24 -13 -88 -13 -7 18 74 6 16 -54 -78 -13 -50 38 55 26 38 -51
4488 -51 -46 -35 -37 56 40 62 51 -45 -9 -70 -32 46 32 92 41 10 -1 -73 -16 -5 29 85 22 41 -31 -75 -24 -46 28 57 37
4519 37 53 -39 -45 -56 -59 41 30 58 34 -31 -22 -68 -47 16 9 87 43 9 9 -72 -17 -11 15 98 38 50 -9 -52 -16 -55 28 48 44
$$ packed form
4296B4qr7N4j3K4R4o1L9o0o9N5p5R3K8pM2r9K3l2m5R0j3O2No9L2q3J7N4k3J00
4327H2m4lor0N3j7K7O2l2L2n1m8L6n4O2K7k3O3r1Rk5m0Q3l8O8Mo2L4p9RL9j6P3
4360D4j7nJ4r8M7k3K6O2m7N7n1l7L6o5P2K2j3N1p4Rk9m3Q5m2N6K5o2L0q3QK9k8
4392d4J00m3Qlq9N2l6L4N9l8O2n1l4Ro6Q9J2qP1q0J3l4l8P2k9N5K6o3L7p9lK8
4424a1k0R2l4Mkq8M2l3L4O5m3O3n7l0Lo9P5KL0M9p1J5n8l2P2k8Q2J1m1J6r1J3
4456d0K6rR8k8QKr7K2k8K6O5j5N8p0m2J1p5P5OK5N6o8J0p0k4O5l7Q8J7k9J2q9
4488e1NJ1kR3j6K2j1r6L6o1L8P8j4O0n1l1j1p2N7J1L4N6o3J9p2m4N1k2P4K9k0
4519C7J6r2oj1lJ00j1K8k4o5Rm6K1O3pP8m4l4%q1N5OK6Q3o0J2n9m3L6l9Q3K0m
$$ plain form
4552 44 63 -20 -20 -49 -67 11 13 62 50 -13 -8 -74 -47 -3 1 59 42 16 -2 -70 -30 -29 -10 63 26 59 13 -44 -8 -44 13 37 45
4585 45 78 -15 -16 -31 -45 20 6 65 59 7 3 -49 -34 -17 -22 52 18 26 17 -55 -26 -47 -17 33 16 35 7 -35 -22 -52 -2 16 28
4618 28 64 12 11 -8 -42 15 -5 46 55 20 33 -23 -21 6 -8 39 37 21 39 -20 -2 -31 -24 30 12 50 4 -6 -10 -53 -4 -2 0 35
4652 35 3 -1 -12 -43 -2 -11 17 22 5 37 -9 -1 8 -14 29 16 31 35 -7 19 -11 -16 24 0 32 16 9 17 -29 5 -8 -16 35 -4 14
4687 14 11 -25 -4 -36 -7 9 -20 26 3 -2 4 -42 0 -13 3 30 -6 26 0 -8 9 -7 33 14 26 31 -8 18 -1 -10 16 2 39
4720 39 20 0 13 -26 -7 5 -21 19 -5 -2 4 -39 -15 -24 -3 25 -14 19 -9 -20 -7 -29 -4 2 -8 36 4 17 -2 -7 19 -16 25
4753 25 24 16 28 -2 -9 -12 1 29 9 12 21 -11 5 -6 -9 17 -10 20 -3 -17 -8 -41 -11 -22 -23 20 -11 2 -9 -22 -8 -32 1 24 5
4788 5 29 -1 -4 -5 -12 24 21 33 16 -1 3 -7 -7 15 1 32 8 5 2 -22 4 -9 -8 17 -2 8 -11 -24 -9 -32 -1 10 -7 12 -10
$$ packed form
4552D4J9q3%k9j8P8KM9j2o3No6K7M4MN8j7k6j8o8M0JJ9P3l7L3m6n7L6l6N7K4Q
4585D5L3r3jj5j4O5j4N9on2mn2J5J7nP4l4Qrp2K9k1L0N0j7J9k8m2J3l0N0J8J2
4618B8L6n2jj9l4N7k0N1Rl5J3n6KK7j4M7kj6J8n9J8k9PN4j8L8m6j0mm3M9KKL5
4652C5l2mj1l1M1rK8Nj7L2m6QRk2M3j3J5Mm2K6l0nM0k4L2j6pQm6L4j3qN1l9J8
4687A4ll6K1l2K9J6k9M6k3nOm6M2j3J6K7l6L2k6qJ7j6M0j9J2Nl9K6j9rK6j4L7
4720C9j9k0J3l9J9J2k6M0k4LOm3K4rK1K8l9L3k8j1J3k2K5Oj0M4l2J3j9nK6l5M1
4753B5jqJ2l0plJ3K8k0LRl2J6j1lK6k7L0k3j4Rl3L0j1jM3l1J3j1j3J4k4L3K3j9
4788EK4l0ljpL6lJ2j7j7Mj0%K2j4L1k4llk4K6j3JK5j9J0j9j3J5k3L1J1j7J9k2
$$ plain form
4823 -10 -19 -12 -26 16 -7 23 8 -8 19 -8 0 13 -1 39 24 19 23 4 2 -1 5 30 13 17 13 -7 3 -9 -3 18 -2 17 -18 -14 -18 -24 -3
4860 -3 -10 2 10 -11 11 -18 -15 5 -6 26 11 -4 1 -11 -4 1 -2 18 20 25 13 -3 14 4 21 17 1 29 7 -3 7 -8 22 19 12 13 -8
4897 -8 6 -16 -13 -3 -8 9 3 -8 -9 -18 -4 1 -1 13 5 7 -8 -5 -9 -8 3 20 5 22 -3 -10 8 -21 22 18 11 21 0 7 -11 -4 11 -11 14
4936 14 6 8 3 -21 1 -19 -3 5 3 -3 -16 -21 -17 -16 9 7 9 3 -10 -1 -4 -13 0 5 20 30 -1 19 6 -1 9 10 24 27 10 23 -12 -2 -7 -10 23
4977 23 15 22 8 -12 -21 -11 -1 3 -10 23 -8 -3 -20 -30 -15 3 13 21 12 16 -11 -23 4 -8 18 25 15 25 0 8 0 4 27 24 30 27 -8 3
5015 3 -17 -4 0 14 23 12 3 -6 -26 -19 -6 12 17 -6 1 -16 -30 -19 -13 -1 1 11 3 -14 -12 -12 -12 14 9 29 28 -10 -5 -15 2 10 21 29 18 4
5055 4 6 -21 -4 -4 4 27 15 12 -16 -23 -16 -22 0 15 17 6 -5 -22 -24 -23 -15 -5 12 5 12 -14 -15 -18 1 8 28 25 18 16 -21 3 -15 11 29 24 34
5096 34 8 -7 -1 -18 1 13 17 7 1 -4 -24 -26 -11 -8 0 23 -1 -6 -18 -36 -20 -14 3 4 0 0 -25 -20 -4 -5 10 15 20 7 -8 -12 0 8 11 24
$$ packed form
4823a0rPj4M2k3L0j5j6K7k7QJ3j4M0j5nMj9klOK5j7Mmk0J0j2OK1k0J9l5MmoK1
4860cpJ2Qk1K2k9LK0j1L2j5j5Nj2PNlK0KNj2j6J7j0J7mj6K8k2j0J0j5L0lpJk1
4897hJ4k2LJ0nJ7oj1jrJ4NkJ4qKj5LmJJ1J7j5J7k5pJ8k9M3mpJ0k1Pj8PJ5k2K5
4936A4qKnk4K2k0J6Qkoj3nMJK5kKoj3RlrJ3NJ5J0l1K0j3pJ0JJ4Lj7J3l5J0nlL3
4977B3qPj4k0rJ0J0Mj3L3l1Nj7j0J5J8J0QrMk7j2K7j2K6Pj0J0k5QqMK3lOll5J1
5015Ck0J3MJ4Rj1rrk0PJ3J8Nk3Pj7j4J1OJ2KJ0qj7K%%K6nK0jl8Nj0J7QJ1Qj1j4
5055DKk7J7%QK3j2lk8pPoK2J5Kj1j1j7kJQJ0J7pPk6jlJ9PK0lpkl7K4j8K6J8nJ0
5096C4k6j5Oj7J9J2Mj0onk0kJ5LQK3k4nj2j8J6OJ7Jm%k5NJ6jJ5NNj3j5mJ2QLJ3
$$ plain form
5136 24 25 8 8 5 1 18 6 18 22 3 2 -8 -15 -8 -6 -12 0 2 5 -12 -8 -28 -11 2 0 0 -2 -6 -6 -25 -12 5 19 20 8 4 0 -4 21 6 11 22
5178 22 20 14 -2 -12 0 1 16 20 14 16 -10 -10 -13 -18 0 -3 11 3 -23 -14 -25 -20 -11 -13 3 -5 -7 -15 -32 -4 -7 7 17 -4 6 -1 6 10 -2 15 25
5219 25 9 17 -5 0 0 3 20 17 10 12 -9 -6 -11 -12 2 7 1 -4 -14 -11 -26 -17 -15 -2 19 -8 0 -3 -12 5 -7 6 8 11 17 -3 -8 -1 5 16 22 24 20 10
5263 10 2 -1 -10 15 14 17 15 2 -1 -21 -12 -4 -2 16 10 -6 -2 -26 -17 -12 -5 3 3 16 -22 -12 -8 -22 -2 -2 18 26 12 -10 -18 0 8 20 32 29 13 16
5305 16 -13 2 11 12 31 19 7 13 -14 -10 -6 -2 22 7 7 -4 -20 -19 -31 -10 5 5 12 -7 -11 -28 -21 -10 8 18 16 0 17 -6 -10 -8 8 24
5343 24 25 29 22 -9 9 6 1 24 15 40 3 5 -2 -32 0 1 16 25 -2 -9 -20 -29 -15 -16 14 19 4 7 -22 -24 -18 -12 6 14 21 9 -6 -9 -15 -8 21 15
5385 15 35 18 5 10 -9 3 21 23 44 22 15 -3 -15 -5 -17 22 25 4 16 -12 -28 -29 -30 4 -1 16 6 -22 -18 -35 -23 -7 -1 24 15
5420 15 -1 -1 -16 -6 8 10 37 24 28 7 -5 2 -9 21 32 29 35 4 -2 -12 -11 8 13 24 25 3 -1 -26 -24 -8 -9 13 2 -13 -2 -30 -34
$$ packed form
5136B4Jj7%lmJ7j2J2Mj9jj0pPKoJ2KLj7Mk0J7J3k%km%j9J3J7J4Jj2mmmK5j5NJ1
5178B2koj6j0J2JJ5MoKk6%lnJ8lJ4qk6Rj1NRkJ6qkqj7K8lJ4J0k1J0pPMj2J7J0
5219B5j6Qk2N%LJ7lpKk1LnjJ4Nonj0Lj5RKJ3K1k7QlrJ7j2J3KLOk0nPOJ1OKmj0
5263A0qlrK5jLkj3lk0RQKJ8oj6Mk4RNPQ%J3l8J0Mj4K0%K0Qj4k2qJ8QJ2J2lj6L
5305A6k9J5RJJ9j2j2Ok7MMMK4j5%j1j6Jj2K1J5%Pj9mj7PJ1J8J0kj6J7k3mKJ6J6
5343B4JMpl1J8lnK3rK5l7Kpl0L2JJ5Rk7pj1rJ4jL0Nj5Lk9kOOJ8QPj2j5loPK9o
5385A5K0j7j3Nj9J2J8KK1k2pj8j2J0j2L9Lk1J2k8j6jjL4nJ7j0k8Mj7J2J6OK5r
5420A5j6%j5J0J4KK7j3Mk1j2Pj1L0J1lOl1oj0JJ9NJ1Jk2mk5KJ6jK2j1j5J1k8m
$$ plain form
5457 -34 -13 -5 26 17 26 -2 -22 -13 -5 -2 27 20 36 18 1 5 -16 19 3 34 32 1 11 -22 -20 2 -5 33 19 10 11 -16 -22 -14 -9 11 -10 11
5495 11 -14 -24 -22 -29 -12 2 3 22 6 0 -5 -25 6 3 10 37 7 17 -10 -8 6 -1 32 20 19 25 -6 6 -8 8 11 16 28 15 -10 -2 -18
5532 -18 1 4 -2 17 -2 -12 -14 -33 -8 -4 8 17 -1 12 -3 -7 0 0 20 10 1 19 -1 12 -1 4 29 7 29 12 11 0 -10 4 2 2 20
5569 20 -12 1 -9 -20 4 -16 4 2 -4 -5 -18 -15 -8 -11 5 5 -1 3 -19 0 -13 -9 11 7 22 9 2 8 -13 5 23 10 33 18 3 10 -10
5606 -10 6 3 20 21 2 12 -27 -19 0 -21 5 8 3 -1 -18 -12 -15 -29 8 -7 13 4 -18 -6 -28 3 10 12 35 6 7 12 -15 8 5 26 21 16
5644 16 19 10 -8 8 -2 27 17 12 19 -14 -7 -8 -10 19 -8 20 12 -8 -1 -24 -7 6 0 16 1 10 3 -19 8 -4 17 17 7 16 -2 -10 3 -11
5682 -11 23 25 23 21 3 7 -12 -15 15 7 20 14 2 -2 -23 -7 -5 -12 17 -4 -1 -10 -36 -15 -21 -3 3 -11 8 -10 -19 -11 -12 4 12 17 30 6 -1 -9 -11
5723 -11 19 12 22 31 19 22 -18 6 5 1 28 13 20 2 -16 3 -23 -21 16 3 14 -20 -24 -9 -31 -1 -6 3 23 -14 1 -32 -26 -4 -1 15
$$ packed form
5457c4K1QL1rRk8k0RQLK9pJ6j8j7Mk1L5j6L1kl1J0l3KK2pL8j4rJk7oQNK0k1K1
5495A1k5j0KpJ7J4JJ9j6onk0L1lPK7l0J0k7KJ4pL3j2jOl1J2j4J6LNJ2j3k5Qj6
5532a8J9LoJ9j9j0kj9K5MJ2Rj8J3j5mP%K0j0rJ8k0J3j3NK5k2K2j7jj1j0J4k%J8
5569B0l2J3j0j1K4k0K0kojj3LPlJ6%oMk2J9j3MK0mJ5j3pOk1J8J8j3K3j5j5Pk0
5606a0J6lJ7Jj9J0l9QJ9k1K6Lnmj7Olj4L7j5K0rk2J2k2L1PKK3k9JNk7K3lK1nn
5644A6Lrj8J6j0K9j0nPl3PjkK9k7K8qk0Pk3J7J3oJ6j5Rpk2K7j2K1%j0Rj8qJ3j4
5682a1L4Kkkj8Mj9lL0qJ3oj2mk1J6KpK9k1Lrk6K1oJ8Oj4J9j8rQjJ6QNJ3k4pqk
5723a1L0pJ0Rj2Lm0K4jmK7j5Pj8j8J9k6KL7j3J1l4mJ5k2L0nRK0l7J5l3OK2LJ6
$$ plain form
5759 15 18 8 13 -13 -2 6 2 32 13 26 21 -7 14 -13 -8 14 8 40 12 1 -4 -21 0 -6 1 15 -18 1 -18 -26 -4 -25 9 14 -4 18
5795 18 -17 -5 -21 -19 1 16 18 9 -6 8 -13 -4 17 10 30 8 0 15 -22 2 8 13 35 3 15 -1 -19 4 -19 6 10 8 7 -21 -18 -11 -31
5832 -31 6 -4 15 9 -18 7 -20 -10 -4 3 20 2 12 21 -13 11 1 15 34 7 40 7 3 16 -11 19 18 7 22 -12 5 -4 -10 16
5866 16 -9 12 5 -15 4 -24 -20 -9 -23 18 1 -1 4 -21 -4 -11 -9 16 -5 18 7 -11 10 -10 8 8 14 32 9 16 6 -7 23 5 24
5901 24 12 4 18 -12 -2 7 1 21 -12 -12 9 -24 0 -8 -11 9 -16 9 -6 -16 4 -14 14 3 -7 13 -6 8 -5 -12 11 4 21 22 -2
5936 -2 26 2 -2 13 -2 16 -1 11 26 -11 17 -18 -5 11 -14 13 2 -13 -4 -30 1 -1 -7 6 -24 -8 -11 -14 5 -18 8 6 -11 14
5970 14 -9 -6 -4 -12 21 2 16 30 -3 24 -2 2 29 -3 24 12 5 15 -17 11 6 -9 18 -1 6 -8 -27 3 -21 -6 8 -18 3 -20
6004 -20 -11 -8 -27 11 -2 -2 15 -12 10 -8 -7 9 -3 27 11 5 21 -10 23 5 -1 23 2 19 11 -7 17 -17 14 22 4 10 -11 -2 -7 -18
$$ packed form
5759A5Lj0Nk6J1QmL0j9J3nk8K1k7NK2oL2k8j1nj7K1oPJ4l3J9j9qK2k1L4Nj8K2
5795A8l5J2j6KK0J5Krj5J4k1RK1pK0k2qJ5l7K4ONK2l2J2j6j8K3k3K5Mkjk8LPk0
5832c1L7j0J9ok7K5k7J0OPJ7j8J0Rl4K4j0J4J9k7L3l3mJ3k7L0jj1J5l4J7roK6
5866A6k5K1pk0J9k8MJ1j4M1j7kNk5J7pKK5k1K3j1j8K1k0J8%OJ8k3Pj0j3L0j8J9
5901B4j2qJ4l0J0RoK0l3%K1l3K4qlK0k5K5j5j0K0j8K8j1j0K0j9J4j3pK3pJ7Jk4
5936bK8k4mJ5j5J8j7J2J5l7K8l5J3J6k5K7j1j5Rk6L1koJ3l0J6llJ9k3K6kj7K5
5970A4k3LKqL3j9J4J4l3K7k6MK7l2K7j2pJ0l2K8nj5K7j9Pj4j9L0k4J5J4k6K1k3
6004b0RLj9L8j3%J7k7K2j8JJ6j2L0j6oJ6l1L3j8oK4k1J7qj8K4l4L1Qj8Ok1Rnj1
$$ plain form
6040 -18 -2 -11 -2 2 -24 -2 -23 -9 8 -15 20 -6 -7 10 -5 16 -6 1 20 -10 22 3 -4 17 -2 13 22 -1 30 -1 -1 -1 -21 13 -9
6075 -9 11 5 -8 4 -21 -14 -9 -17 12 1 -13 -3 -21 0 -10 -12 18 -4 18 6 -19 3 -12 11 15 12 30 0 10 1 -13 13 10 25 18 2
6111 2 21 -9 -7 13 -21 12 -3 -4 9 -14 11 -11 -16 -1 -18 8 -3 -28 2 -24 -5 14 -7 24 -9 4 -4 -26 19 3 17 16 2
6144 2 22 4 7 28 -1 37 22 14 28 5 19 -7 -9 21 -3 20 10 -7 11 -18 -3 1 2 4 -13 -4 -8 -32 1 -23 5 15 0 15 -4
6179 -4 -11 5 -13 20 10 8 27 3 19 -1 -7 18 6 35 12 19 22 -7 8 4 15 16 3 14 -3 -18 0 -15 -1 4 -3 11 -5 -12 -14 -18 2
6216 2 -18 -6 11 -15 9 -20 -9 -10 -13 20 11 1 12 -2 4 5 17 28 8 24 19 8 18 -1 16 5 0 23 -2 -2 5 -22 -2 -12 -2
6251 -2 3 -14 14 -10 -14 5 -21 19 0 -2 21 -11 0 -6 -6 13 6 25 13 15 26 4 10 6 -2 26 3 9 18 -4 10 5 11 24 0 9 -8 -10 7
6290 7 -20 13 3 -10 8 -28 4 -14 -18 -3 -15 4 5 -17 11 -11 -1 6 6 30 -3 12 18 -1 25 6 11 13 0 19 5 7 20 -2 16
$$ packed form
6040a8J6rRMk6K2k1J4J7k3L5k6jJ7j5K1k2PJ9l0L2j9pK1j9J5Rk3L1l1%%k0L4k2
6075iK0oj3J2k5PNqK9j1j4J0j8K1j0kL0k2K2j2k5K2j5K3MlJ8l0J0rj4K6lJ5pj6
6111BJ9l0KK0l4L3j5jJ3k3K5k2nJ5j7K6j1k5L0k6J9J9k1L1l3J3qk2M5j6J4jj4
6144BK0j8LK1k9L8j5qJ4k3J4k6kL0k4K3j0j7J8k9J5MJKj7Rmk4L3k4K8J0j5J5j9
6179dpJ6j8L3j0kJ9k4J6k0oK5j2K9k3PLk9J5mJ1Jj3J1j7j5J8j5J4NpJ4j6pkmK0
6216Bk0J2J7k6K4k9J1jlL3rj0J1j4OJJ2J1k0J6nj1J0j9J7j1nK3k5%Pk7K0j0J0
6251bNj7K8k4mJ9k6M0j9kK3l2J1o%J9pJ9j2KJ1k2OmqK8k3ORk2J4nOJ3k4Rj7kJ7
6290Gk7L3j0j3J8l6L2j8mJ5j2J9Jk2K8k2J0P%K4l3J5Oj9K6j9NKj3J9j4KJ3k2J8
$$ plain form
6325 16 9 8 18 -8 3 -4 -15 11 -18 -1 -3 -9 6 -15 8 -1 -11 8 -16 4 -4 -15 14 -6 5 17 -5 24 11 4 13 -1 9 -2 12
6360 12 32 10 24 4 -7 22 0 7 17 0 16 -10 -8 1 -11 -6 -13 4 4 -16 12 -10 -9 2 -3 -9 1 1 -12 -21 5 0 0 21 -4 26 6
6397 6 2 27 12 22 13 13 29 -2 9 20 4 32 15 12 10 -8 8 -9 2 3 -12 17 -13 -8 0 -22 8 -11 0 4 -6 6 -4 -10 10 -13
6433 -13 10 10 -7 13 1 4 13 -2 20 4 21 20 1 18 7 11 22 -4 15 -5 5 17 -10 11 -4 -1 4 -19 8 -12 -13 -5 -19 4 -2
6468 -2 -17 -2 -14 -1 -2 -20 16 -2 18 5 -11 5 -13 4 21 6 26 4 14 21 -2 13 3 8 19 0 23 8 3 16 -11 10 -2
6501 -2 -9 14 -12 2 -8 -18 0 -13 6 10 -11 2 -18 -2 9 -3 16 -1 6 12 -8 14 7 7 13 10 23 2 7 15 -1 12 7 6 23 -13 6
6538 6 11 -1 9 2 15 13 1 10 -13 -4 -3 -19 -6 -14 -2 3 -16 -5 -3 -7 -1 2 8 13 1 9 0 14 13 11 21 11 25 14 12 24 8 23 18 9 20
6579 20 -13 4 8 -4 26 -1 1 14 -10 13 -5 -17 15 -8 11 4 -17 0 -19 0 4 -1 17 -2 1 8 -12 7 7 9 21 10 24 -7 16
$$ packed form
6325A6pjJ0k6J1pj1K6k9J7koJ5k1K3rj0J9k4K0qj1K9k0J1J2k2K9j3pRj4J0j1J4
6360A2K0k2J4k0j1K9k2PJ0j7J6k6KRj2NpJ7%k0K8k2JJ1noJ0%j3rK6n%K1k5L0k0
6397FmK5j5J0r%J6l1J1J1j6K8j7lkj8J6j7J1Jj5K9l0NQk2L0j9J1Mj0J2j0oK0k3
6433a3K3%j7K0j2LRj5K2j6J7jj9J7j1MJ1k6J9k0J0J2k7K1j5LNk3K7k0jQj4K3o
6468bj5J5j2J3jj8L6j8K0j3j6J6j8J7J7j5K0k2J0Pk3J5j0NJ1j9K3j5nJ3k7K1j2
6501bpK3k6J4j0j0J8j3J9Mk1J3k0J6J1j2J9j7POk0K2p%OlJ3k1NQj6J3njJ7l6J9
6538FNj2J0pJ3kj2Rk3RJj6J3qJ2Nj9J1KmOLONj2QrJ4jkJ0j0J4j1kJ2j6J5nrJ1
6579B0l3J7Mj2L0k7KJ3k4K3j8j2L2k3J9pk1J7j9J9MnJ8j9LPk0J9%KJ2j1J4l1K3
$$ plain form
6614 16 19 0 26 8 22 11 3 17 1 -5 3 6 6 -10 -6 8 -26 -4 -9 -1 3 1 7 -4 -8 4 -11 2 4 0 15 -2 1 6 -6 14 21 17 22 10
6654 10 19 6 12 12 14 29 10 0 21 -4 3 -7 18 19 -3 14 1 -11 1 -11 0 2 -6 9 -8 4 -2 -18 -5 -5 13 6 -2 16 -8 7
6690 7 21 4 17 21 12 18 16 18 33 11 28 24 18 14 15 18 2 17 15 -9 16 10 14 3 -15 11 -8 -2 9 -12 1 -16 -7 -6 -14 2 -8 12 8 -8
6730 -8 12 12 14 21 9 18 10 8 24 4 16 19 6 19 7 25 24 0 11 5 -2 14 -3 1 -1 4 0 -10 13 -9 5 1 -11 -4 -8 1 2 -21 8 0 -7
6771 -7 9 -3 3 12 -3 13 15 10 2 12 17 10 15 31 8 18 8 10 17 1 22 12 -4 14 -6 4 7 5 4 5 8 0 -9 0 -13 -7 1 -21 3 0 9 8
6813 8 -9 12 -7 18 12 9 18 9 15 21 8 6 23 13 21 5 18 2 3 13 -3 5 -14 -8 2 -23 5 -6 -12 1 -6 -15 -7 -8 3 -10 -4 6 1 5
6853 5 -1 11 2 6 10 17 4 23 10 22 11 19 20 18 10 0 10 14 16 13 8 16 23 14 19 9 -4 -2 -3 4 7 -7 3 -2 -10 -4 -4 -2 -1 -3 1 -4 -14 5 3 7 15
6900 15 10 19 5 12 15 18 11 11 23 11 14 16 8 11 11 15 13 16 5 1 0 10 -1 3 1 -3 7 -8 -4 -12 -9 1 -3 -6 -3 -16 4 -7 6 2 0 1 -4 13 15 8
$$ packed form
6614A6Lj9K6j8J4j1qJ4j6oQL%j6MJ4l4K2nQMkOj1mJ2j5J3KmJ5j7LNj2K0PmNj2
6654A0Rj3O%KJ5j9j0K1k5Pj0K5Jk2J7j3j2J2j2J1KqJ5j7J2oj6J3%J8pqJ8k4J5
6690GJ4j7J3MrOkKJ5k2J7momJLj6J5kk4K5oMj1j8K6j9OJ1k1J3j7RJqJ6j0K0mj6
6730hK0%KPj2RqkJ6k0J2Lj3J3j2J8jk4J1opJ6j7MkNmj0K3k2J4mj2PmRJk3K9qp
6771gJ6j2ORj5J6KnqJ0NpNJ6k3J0j0KPj6K1j0j6J8k0J0LkjJLqrRj3OQk2K4lRj
6813Hj7K1j9K5olRrOOj3kJ7j0Qj6J3j6JJ0j6Qj9OJ0k5K8j1oJ3prQjJ1j3OJ0nM
6853EoJ2rMMPj3J9j3J2j1QJkqj0J0MKlnQPrNj0j3KjPLj4J0nqO%KJkMnj0J9kMQ
6900A5nRj4PLLp%J2j2LKqL%MkLj1mjJ0j1MkmJ0j5MqLJ0mlLj3K0j1J3mkJnJ7Kp
$$ plain form
6946 8 -3 7 14 15 12 24 -1 12 7 -2 6 7 15 8 -14 5 -5 -6 2 -12 5 -2 5 -3 -4 -14 -9 -11 3 -9 -5 -3 -9 -3 -5 0 10 -1 7 -4 10 17 0
6989 0 20 9 9 21 13 18 17 4 25 13 28 13 8 17 17 3 9 8 4 0 -8 0 0 -14 -12 0 -11 -6 -2 -9 -3 5 0 10 2 5 0 -3 15 7 8 19 15 21 18 19
7035 19 17 14 24 14 1 25 -1 6 -1 -1 2 -4 11 2 -6 -8 0 -10 1 -15 -3 -10 -8 -9 -4 -4 -9 -10 -6 0 3 -5 6 4 -3 9 11 4 14 10 18 25 13 16 7 16
7081 16 17 6 11 13 4 4 10 0 -4 8 11 3 4 1 -9 -1 -15 -4 -5 -7 1 -9 -5 8 -5 12 -6 4 15 4 4 4 0 16 6 20 12 12 24 13 12
7122 12 5 11 12 15 9 10 9 7 16 3 0 4 0 -8 12 -3 -10 -5 -4 0 -13 -2 -7 -3 -12 0 -4 17 5 -2 14 -2 8 -5 7 17 -4 13 21 4 15 2
7164 2 14 10 12 17 8 1 8 3 5 0 2 7 -4 3 -8 -4 -6 -8 -8 -4 -13 -6 -13 -6 -13 5 0 -4 19 4 6 3 11 15 15 8 10 6 18 14 10 19 20 10 14 12 19 -1 18 12 16
7215 16 8 -1 -2 4 -3 2 2 2 -7 -8 -5 -11 2 -4 -9 8 -5 1 9 -5 5 6 4 10 11 9 3 8 16 9 22 22 6 12 27 21 7 5 11 11 12 6 7 0 -8 -4 5 -4 0 -7 -16
7266 -16 11 -5 -4 -8 -6 -2 -7 -2 -5 5 6 1 5 10 6 8 2 10 9 2 5 17 10 12 9 13 10 21 14 8 12 -10 -2 21 -1 5 10 4 7 -9 5 -1 -8 15 0 2 1 -11
$$ packed form
6946Hj1J0PJlJ2k5J3nrQJQpk2J9j0jQj4J7pPqjj0NkJ4j2MKoOkNJ0j1Qj1J4Pj7
6989@K0j1%J2qNjj3K1j2J5j5nR%j4OjmmqQ%j4KJ2j1NMpOQnJ0qLnlJ8qJJ1mOlJ
7035A9klJ0j0j3K4k6Pp%LoJ5rqkQj0J1j6J2pKjN%njMOLqJ1kpJ2KpJ0mQPj2LrR
7081A6Jj1NKr%Oj0mJ2LqJlj0Qj4J1jkQj0MJ3j3J7j8J0J1j1%%mJ6j0J4q%J2j1j
7122A2pOJLoJjkRj3lMmqK0j5pNJMj3J1nMrJ2mK1j2pJ6j6J0j3J2J0k1J7Qj7J1j3
7164BJ2mKNrpPnKnKNj1Pj1Mkk%MrPpPpJ8nmK3j5KlQM%pKmJ2mmRJj0MkPk0J9oM
7215A6qrjOpN%%rjLoJ3onJ7j3OQj4J0JkOJkoNQpJ3%j6OJ5oj4kO%JoJpqMRrMpr
7266a6K7j6JmKMnNlJ0JnMNmKoQjpLJ2pKlMlJ1poMk2QK3k2ONoLj6J4opK3j5Kjj2
$$ plain form
7314 -11 2 0 12 1 -2 17 6 8 13 11 14 16 9 18 15 12 20 7 21 9 15 18 13 18 8 17 11 4 17 1 8 5 -3 10 3 4 11 -3 8 -10 -14 -2 -3 3
7358 3 -6 2 -3 -7 5 9 9 12 6 11 14 13 7 21 10 18 15 21 21 21 5 11 7 12 10 10 8 5 -5 -3 4 -13 1 2 -1 -1 -18 7 2 -16 0 -7 5 -4 2 -2 0 -1 7
7407 7 13 13 13 12 15 11 25 13 11 16 22 17 17 13 13 5 4 11 12 19 -3 6 6 -6 -4 -4 0 1 -3 8 -13 3 -9 7 4 -2 0 -10 2 1 3 13 12 8 25 20 13 13
7455 13 18 18 21 13 27 8 9 16 8 16 5 16 7 1 2 -9 -5 1 -3 10 -3 -15 -8 -13 -3 -3 -3 -2 -10 -1 -11 0 -1 -1 6 5 -3 8 0 7 14 7 25 4 21
7500 21 13 17 19 7 23 14 12 6 12 16 1 0 15 -11 5 1 -9 -10 2 -13 -1 -13 -12 -1 -4 -9 -9 -4 -6 -6 -3 -2 -5 11 7 11 2 15 12 14 15 15 21 18 13 18
7546 18 7 6 12 20 14 3 14 10 3 0 -4 1 0 -5 -5 -15 1 -1 -4 -1 -11 -8 -2 1 1 -2 3 14 7 11 18 14 19 10 7 25 23 13 11 20 16 12 25 3 9 15 16 15 0
7595 0 5 9 -6 8 -7 -1 -2 -4 -10 -8 -2 5 -11 0 -1 2 5 9 -6 6 7 13 15 12 9 1 28 14 14 14 4 22 24 3 8 24 25 17 10 18 14 17 -3 17 9 -5
7641 -5 -4 -3 2 0 12 1 -9 -12 -4 -1 -10 -5 -4 11 1 -1 4 6 9 7 17 14 11 17 18 11 20 22 30 17 12 8 21 24 11 14 4 9 1 0 6 0 -3 4 -1 8 -12 3 -5
$$ packed form
7314a1J3kJ2j1lJ9j1KNkLKpRllQj3J4j2OLnNj0RopJ3j6PlqJ3pJPj4J1j8mJ2jO
7358CrQnmJ2M%LoNLjoJ4j1QlO%%j6OmNk%klj0KPj7J4Jl%j7K5nj8J6pJ2rOmKjQ
7407GO%%jLmJ4j2kNOn%m%qjPJPk2R%j2K%MJmJ1k1J6j2J6loKj0J2jKJ0jmJ7np%
7455A3N%LqJ4j9JPqQj1J1roJj1MOmJ3j3j2PnJ0%%JqRj0J1j%PjqJ1qPPpJ8k1J7
7500B1qMKj2J6rkoOMj5jJ5k6J6mj0jJ2j5J2j2JJ1ln%Nk%LJlJ6mMrJ3lKJ%OlnN
7546A8j1jOQoj1J1mplmNjn%j0J6klLj0LOL%lNJ1pMPmNrlJ8kj0kRmmJ3k2OOJjj5
7595@NMj5J4j5OjkoKOPj6J1jLLMj5J2JOKllqK7j4%%j0J8Kk1NJ6JqpQmLk0K0qj4
7641eJJNkJ2j1j0lQLrNJJ5j0kNKLkJ0llOJpRKQj3nmJ3Lj3Lj0NqjOolPnRk0J5q
$$ plain form
7690 -5 -5 -5 -10 -7 -10 -2 6 5 0 2 1 12 13 7 9 13 2 25 17 5 16 11 15 16 13 18 12 21 10 16 4 2 9 7 8 -3 -8 -2 0 -1 -3 -3 -11 4 -4 -9 -9 -2 2 -8 2
7741 2 0 2 3 2 14 0 4 22 7 22 5 10 12 11 12 14 6 12 -6 2 13 -4 5 -5 0 4 2 2 -7 3 -2 -5 -6 4 -1 -4 -2 2 -12 7 -1 -9 6 0 13
7786 13 12 -13 14 10 15 5 6 21 10 16 19 7 21 16 20 14 19 16 -1 11 17 10 1 8 5 8 -2 -4 6 -5 0 3 -8 -5 -3 -7 9 6 2 3 -3 7 5 3 8
7831 8 10 16 3 14 11 20 10 18 18 15 12 19 17 11 0 4 5 7 10 7 4 -8 3 -4 -2 -4 -4 -12 -1 -8 2 -7 -7 -5 4 -2 10 -11 4 7 6 11 12 14 10 10 12 25 14
7880 14 26 18 23 15 19 13 19 15 21 5 6 -2 -1 0 0 3 2 -5 -7 -5 3 -6 -5 -2 -1 -1 -12 -4 12 3 4 6 12 3 8 30 22 4 16 13 20 14 14 22 12 19 10 9 16 10 8 4
7932 4 2 7 6 9 0 -5 1 0 5 5 -15 -9 -11 0 -3 -7 1 -2 -4 -7 6 16 13 4 -2 2 9 2 24 23 11 19 13 8 8 18 18 8 11 26 18 11 3 -4 18 -3 9 1 -2
7981 -2 2 -11 -3 9 -7 0 -11 6 8 0 -2 -1 6 -2 -5 7 9 6 13 9 17 15 17 14 13 25 15 11 22 12 14 6 6 19 13 16 13 4 6 9 9 -2 -7 -8 2 -7 -1 -5
8029 -5 6 4 2 8 -17 3 -4 -4 -2 2 11 14 10 3 4 13 19 11 14 16 17 21 15 20 4 14 24 13 5 12 9 6 2 0 16 5 -5 -11 -7 -10 -6 -4 -9 11 -4 -3 0 -4 6
$$ packed form
7690e%%nLlQQjnKjJ1JoKMj1K3qj2J1nMJlNoRj1Oj2kPkJj1nOKjk%qJ5qn%PMj0J0
7741BkKJjJ2j4MJ8j5J5j7NKjJKqOj8QJ1j7Rj0NMk%rJ0nljJ0nlKMj4J9qqJ5oJ3
7786A3jk5K7mNj0JJ5j1OLj2J4nMoNlj7J2OprPlLj0kJ0j1NLj1LKmJ6lmJoJ0kkN
7831HKOj3J1lRj0Q%llPkoj1MJKLllj2J1pKk%qJ1pJ0r%KRoJ2k1J5LjNJKm%KJ3j1
7880A4J2qNqMoOmOj6JqJJ%LjpkKQrJLJ%j1QJ6rJKOrNK2qj8J2lPo%Qj0PrjPokm
7932DkNjLrnOjN%k0OkJ1lmQlklJ3J0lroMPpK2jj2Qon%J0%j0LJ5qpqpK2k1J2ql
7981bMj3QJ2j6Pj1J7KqkJPqlJ2KlPmQkKljJ2j0mJ1j0Kq%J3oLlrKL%j1njJ0rOm
8029eJ1kkOk5K0p%KMRLmpJROqLKJMoNj6J0J0j1qPllmkJ6j1j0oMlMKnK0j5JLmJ0
$$ plain form
8078 6 -5 -6 13 9 10 8 5 26 11 30 22 17 25 3 14 20 15 16 20 13 12 3 4 12 9 12 -1 5 -12 -4 8 -7 2 0 -1 -2 -13 -11 0 -8 3 -12 14 6 -9
8123 -9 9 1 6 2 8 25 21 29 22 10 19 18 18 18 15 21 6 9 19 6 18 -3 15 17 0 4 6 -2 -3 -14 -4 -3 1 4 -7 2 0 -7 2 8 13 4 0 6 14 -2 18
8170 18 21 16 17 18 19 17 31 26 22 23 22 18 11 12 13 3 5 4 13 8 -6
$$ packed form
8078Fj1jJ9mJklK1j5J9qnQk2J1OnJMpjrJQlLj3Oj7QJ2j5Rkjjj1KJ1qJ1j5K6qj5
8123iJ8qNmOJ7mQpj2Rj%%lOj5LJ0j3J2k1J8Kj7MKqjj1J0JMLj1RkpRONrmOQj6K0
8170A8LnJJJkJ4nmJjmpJJj0KjRnj4
8191f
$$ Imaginary data points
##PAGE= N=2
##DATA TABLE= (X++(I..I)), XYDATA
$$ plain form
0 0 0 0 0 0 0 0 0 0 0 0 8 -8 8 -8 9 -16 16 -24 32 -33 41 -49 58 -72 81 -97 113 -129 153 -175 201 -225 257
33 257 -293 330 -373 419 -472 528 -586 655 -728 807 -892 988 -1092 1205 -1330 1466 -1613
50 -1613 1776 -1958 2155 -2376 2624 -2901 3215 -3575 3987 -4473 5047 -5743 6606 -7709 9172
65 9172 -11215 14292 -19540 30993 -107556 30109 -18777 2001 241553 -86898 118339
76 118339 -85377 -169052 54864 -149547 126507 109656 -20545 170809 -166625 -32088
86 -32088 -46490 -147863 167258 -22809 110174 107294 -143071 58612 -168714 -49968 88726
97 88726 -60677 200887 -786 -23376 39542 -207718 39592 -46022 2479 184207 -53801
108 -53801 102773 -50088 -139216 43984 -140087 94321 79293 -9975 149957 -122196 -17950
$$ packed form
0@%%%%%%%%%%Qj6J6j6J7k5L2m0N6o5P4r0J07j30J53j78K10k42K82l28L76m26M82
33B57n50O23p03P92q91J000j114J241j383J535j699J880k080K297k535K796l079
50a613L389l734M113m531N000n525O116o790P562q460R520j0790J2349j4315J6881
65I172k0387K5507l3832N0533j38549J37665m8886K0778K39552l28451K05237
76A18339k03716q3675K23916k04411K76054j6851j30201J91354l37434J34537
86c2088j4402j01373L15121j90067J32983k880k50365K01683k27326J18746J38694
97H8726j49403K61564k01673k2590O2918k47260K47310q5614M8501J81728k38008
108e3801J56574j52861q9128J83200j84071K34408j5028q9268J59932k72153J04246
$$ plain form
119 -17950 -40063 -131941 125018 -30738 92645 93913 -102631 58327 -135720 -47165 60753
130 60753 -62674 161658 1474 -6275 44211 -164206 32152 -49777 -8906 142232 -45003
141 -45003 95038 -31623 -102114 36094 -122001 67249 52473 -8388 127005 -89225 -3048
152 -3048 -31585 -110217 91376 -35745 73505 77847 -73529 57546 -107971 -38165 39592
163 39592 -60181 128327 -564 4476 44127 -129449 29452 -49961 -14012 110121 -41181
174 -41181 86511 -20762 -75444 34488 -107503 51441 32993 -11927 110241 -71047 9526
185 9526 -21614 -94277 73970 -43130 58009 63914 -58484 60832 -87682 -27434 28363
196 28363 -60301 103454 -6025 9083 44159 -102526 29657 -46142 -17643 85588 -39277
$$ packed form
119a7950k2113r1878K56959j55756J23383J268j96544J60958j94047Q8555J07918
130F0753j23427K24332j60184p749N0486k08417J96358q1929M0871J51138j87235
141d5003J40041j26661p0491J38208j58095J89250j4776o0861J35393k16230Q6177
152c048k8537p8632K01593j27121J09250M342j51376J31075j65517O9806P7757
163C9592r9773J88508j28891N040L9651j73576J58901p9413L5949J24133j51302
174d1181J27692j07273n4682J09932j41991J58944j8448m4920J22168j81288Q0573
185I526l1140p2663J68247j17100J01139N905j22398J19316j48514O0248N5797
196B8363q8664J63755j09479J5108L5076j46685J32183p5799K8499J03231j24865
$$ plain form
207 -39277 75751 -12598 -56110 33546 -92580 39593 19666 -13865 93257 -56484 16209
218 16209 -14820 -78090 58782 -43743 44982 51860 -46404 58518 -69876 -20407 22018
229 22018 -58543 84355 -9803 10077 44256 -84334 31955 -42999 -19330 68906 -40443
240 -40443 68733 -8783 -42113 34292 -82035 32745 10238 -16393 81325 -47572 20535
251 20535 -8946 -67283 49891 -44242 35877 43153 -38733 56191 -57801 -14583 16568 -54363
263 -54363 69294 -11454 11205 40637 -67993 29687 -38465 -19068 54556 -36794 59894 -5133
275 -5133 -31659 31891 -71285 26496 3859 -16335 70349 -39957 23203 -6201 -57302 41992
287 41992 -43734 29951 35442 -32210 53729 -49276 -9880 12822 -51741 59600 -13742 11880
$$ packed form
207c9277J15028q8349m3512Q9656j26126J32173j9927l3531J07122j49741P2693
218A6209l1029o3270J36872j02525Q8725O878r8264J04922j28394M9469M2425
229B2018q0561J42898r4158J9880L4179j28590J16289p4954K3669Q8236j09349
240d0443J09176p7516l3330P6405j16327J14780k2507k6631R7718j28897O8107
251B0535k9481n8337J17174r4133Q0119P276q1886R4924j13992M3218L1151p0931
263e4363J23657q0748K2659K9432j08630R7680o8152J9397P3624r1350R6688o5027
275e133k6526O3550j03176R7781k2637k0194Q6684j10306O3160k9404n1101R9294
287D1992q5726P3685N491o7652Q5939j03005L9396K2702o4563J11341p3342K5622
$$ plain form
299 11880 38872 -58456 30451 -36543 -18362 45732 -36508 55610 -4426 -24066 30912 -64570
311 -64570 23567 -1290 -15817 61989 -34609 24854 -4479 -49150 35426 -41979 25025 29392
323 29392 -26342 49938 -41443 -6798 9186 -47587 49995 -13999 12422 35711 -48501 28502
335 28502 -33767 -17469 37074 -33785 50065 -2680 -18145 29152 -57918 20036 -4284 -16029
347 -16029 55835 -30721 25854 -2464 -43992 32057 -41734 21765 25150 -23493 48576 -36820
359 -36820 -3810 7345 -45365 43976 -15079 12286 33771 -41945 27764 -31116 -16881 31182
371 31182 -32143 45227 -1536 -13821 27439 -51470 17035 -6377 -15269 48573 -26142 25048
383 25048 -1164 -37415 26875 -38388 17789 20597 -19373 44027 -30772 -1725 5468 -41019
$$ packed form
299A1880K6992r7328Q8907o6994J8181O4094q2240R2118o0036j9640N4978r5482
311f4570Q8137k4857j4527P7806r6598N9463k9333m4671Q4576p7405O7004M367
323B9392n5734P6280r1381L4645J5984n6773R7582o3994K6421K3289q4212P7003
335B8502o2269J6298N4543p0859Q3850n2745j5465M7297q7070P7954k4320j1745
347a6029P1864q6556N6575k8318m1528P6049p3791O3499L385m8643P2069q5396
359c6820L3010J1155n2710Q9341n9055K7365K1485p5716O9709n8880J4235M8063
371C1182o3325P7370m6763j2285M1260p8909O8505k3412q892O3842p4715N1190
383B5048k6212l6251O4290o5263N6177K808l9970O3400p4799K9047P193m6487
$$ plain form
395 -41019 37141 -15172 11759 30509 -35350 26753 -28476 -14948 25586 -30678 40981 -2074
407 -2074 -9732 26158 -46146 16285 -8582 -14839 42863 -24495 25298 -294 -32126 24973 -37042
420 -37042 15525 16253 -17857 41441 -27190 1289 4786 -37712 32370 -16531 10991 27108 -29723
433 -29723 26174 -25474 -12616 20282 -28667 35554 -2255 -6266 24275 -39357 14586 -9481
445 -9481 -14262 36310 -22007 24170 653 -26509 22612 -34467 13232 11935 -16146 37902 -23773
458 -23773 3870 4463 -34190 28538 -17662 9604 24402 -26625 26823 -23111 -10523 18041
470 18041 -29247 32801 -4237 -4409 24339 -35834 15973 -10580 -13987 31892 -22176 23558 1114
483 1114 -22225 22093 -32117 11432 8878 -16005 34712 -20972 5531 5191 -30793 25250 -17965
$$ packed form
395d1019P8160n2313K6931J8750o5859O2103n5229J3528M0534n6264P1659m3055
407b074p658L5890p2304O2431k4867o257N7702o7358M9793k5592l1832N7099o2015
420c7042N2567P28l4110N9298o8631K8479L497m2498P0082m8901K7522J6117n6831
433b9723N5897n1648J2858L2898m8949O4221l7809m011L0541o3632N3943k4067
445i481m781N0572n8317M6177k3517k7162M9121n7079M7699j297k8081N4048o1675
458b3773K7643N93l8653O2728m6200K7266J4798n1027N3448m9934J2588K8564
470A8041m7288O2048l7038j72K8748o0173N1807k6553l407M5879n4068M5734k2444
483A114k3339M4318n4210M3549k554k4883N0717n5684K6503l40l5984N6043m3215
$$ plain form
496 -17965 7754 21200 -23153 25636 -19704 -8448 15288 -27307 27954 -4731 -3529 22893
508 22893 -30798 15492 -9689 -13589 27574 -21721 21677 1413 -18703 21941 -29604 10731
520 10731 6098 -16058 31650 -19721 7279 5883 -27584 23678 -18596 6210 18441 -21732
532 -21732 25546 -17473 -6238 14282 -26680 25162 -6240 -3011 21792 -27343 15928 -9223
544 -9223 -12566 23780 -20988 19672 1282 -15467 20604 -26276 9578 4138 -15007 27574 -17468
557 -17468 7628 5743 -23521 20814 -17339 4987 15276 -19097 23333 -14966 -4361 12630
569 12630 -24304 22056 -6992 -2472 19817 -24228 15971 -8802 -11159 20950 -20619 18522
581 18522 451 -13151 20007 -24626 9785 2406 -14409 25583 -17142 8673 5280 -21377
$$ packed form
496a7965K5719J3446m4353M8789m5340J1256K3736m2595N5261l2685J202K6422
508B2893n3691M6290k5181l900M1163m9295M3398k0264k0116M0644n1545M0335
520A0731m633k2156M7708n1371K7000j396l3467N1262m2274K4806J2231m0173
532b1732M7278m3019J1235K0520m0962N1842l1402L229K4803m9135M3271k5151
544i223l343L6346m4768M0660j8390j6749L6071m6880L5854n440j9145M2581m5042
557a7468K5096j885k9264M4335l8153K2326J0289l4373M2430l8299J0605J6991
569A2630l6934M6360k9048M520K2289m4045M0199k4773k357L2109m1569L9141
581A8522j8071j3602L3158m4633L4411p379j6815L9992m2725K5815l393k6657
$$ plain form
593 -21377 19965 -17667 5103 13042 -17673 22566 -14253 -2585 10962 -22451 20031 -7446
605 -7446 -1627 17797 -21330 15029 -8147 -9893 18264 -18980 16725 214 -11125 18322 -22093
618 -22093 9186 1226 -12956 22633 -15691 8715 4612 -18643 18037 -16651 4620 11184 -16124
631 -16124 21247 -13093 -1624 10110 -21423 18802 -8074 -1109 16860 -20009 15374 -8423
643 -8423 -8907 16631 -18652 16232 -295 -9654 17655 -20777 8923 566 -12584 21115 -14935
656 -14935 8677 4665 -17087 17062 -15986 4158 9678 -14831 19701 -11748 -742 8975 -19235
669 -19235 16359 -7718 -1082 14957 -17281 14041 -7195 -7986 14408 -17184 14287 -419 -8184
682 -8184 16363 -18503 8453 -185 -11593 18702 -13989 8607 4312 -14967 16052 -15261 3871
$$ packed form
593b1377M1342l7632K2770P939l0715M0239l6819J1668J3547l3413M2482k7477
605g446N819J9424l9127L6359k3176j746K8157l7244L5705j6511j1339K9447m0415
618b2093L1279p960j4182L5589l8324K4406m103k3255L6680l4688K1271O564k7308
631a6124L7371l4340J1469J1734l1533M0225k6876O965J7969l6869L5383k3797
643h423m84K5538l5283L4884j6527r359K7309l8432K9700q357j3150L3699l6050
656a4935K3612m012k1752L4149l3048K0144N520k4509L4532l1449J1006R717k8210
669a9235L5594k4077O636J6039l2238L1322k1236p91K2394l1592L1471j4706p765
682h184K4547l4866K6956q638j1408L0295l2691K2596m295j9279L1019l1313J9132
$$ plain form
695 3871 8151 -14148 18777 -11195 430 8581 -18150 15691 -8629 -827 13570 -16249 14403
708 14403 -7009 -6515 13051 -16770 13178 -1454 -7034 15426 -16572 8640 -636 -10731 16239
721 16239 -13445 8017 3923 -12521 14965 -13618 3424 6316 -13080 16418 -9861 1249
733 1249 8205 -15696 13991 -8516 -1296 11558 -14743 13821 -5939 -4901 11940 -15926 11747
746 11747 -2676 -6373 14503 -14877 9492 -709 -9918 14566 -14087 7622 3197 -10960 15477
759 15477 -12864 4064 4794 -13357 15108 -10233 2418 8326 -13838 13797 -8929 -1775 9569
772 9569 -14214 13397 -4805 -3270 11580 -14945 10075 -3728 -6450 13261 -12791 9920 57
785 57 -8651 12325 -13837 5958 2389 -9029 14860 -10355 4160 3737 -12992 12283 -9847
$$ packed form
695C871M280k2299L2925k9972J1625Q151k6731L3841k4320P802J4397k9819L0652
708A4403k1412M94J9566k9821K9948j4632n580K2460l1998K5212r276j0095K6970
721A6239k9684K1462m094j6444K7486k8583J7042K892j9396K9498k6279J1110
733A249O956k3901K9687k2507P220J2854k6301K8564j9760J038J6841k7866K7673
746A1747j4423l697K0876k9380K4369j0201r209K4484k8653K1709m425j4157K6437
759A5477k8341J6928P30j8151K8465k5341J2651N908k2164K7635k2726P154J1344
772I569k3783K7611j8202J535J4850k6525K5020j3803k722J9711k6052K2711r863
785E7q708K0976k6162J9795l569j1418K3889k5215J4515m23j6729K5275k2130
$$ plain form
798 -9847 2544 8502 -11277 13429 -8488 -2347 7346 -14051 12628 -4028 -1336 11581 -13840
811 -13840 9066 -5242 -6720 11945 -11624 10969 760 -7334 11205 -14520 4897 1114 -7997
824 -7997 15149 -8840 5307 2867 -12817 10161 -10478 2848 8186 -8658 13379 -7775 -2492
837 -2492 4839 -13678 10881 -3156 442 11393 -11590 7599 -6177 -7146 9674 -10015 11153
850 11153 1828 -5368 9803 -14199 3311 -413 -7001 14592 -6926 6437 2443 -12240 8231
863 8231 -11341 2789 7710 -6865 14152 -7318 -1992 3172 -14296 10110 -3667 2008 11851
876 11851 -10371 7979 -7429 -7516 8031 -10066 11787 2363 -3604 9631 -14173 2318 -1952
889 -1952 -6952 14074 -5574 7478 2795 -11504 6706 -11882 1926 7032 -5387 14282 -5915
$$ packed form
798i847J2391N958j9779K4706k1917O141R693k1397K6679j6656K692J2917k5421
811a3840K2906j4308j478J8665k3569K2593j0209q094J8539k5725J9417l783r111
824g997K3146k3989J4147k440j5684K2978k0639J3326N338j6844K2037k1154N283
837b492P331j8517K4559j4037L598J0951k2983J9189j3776r69J6820j9689K1168
850A1153r325p196J5171k4002J7510l724o588K1593k1518J3363l994j4683K0471
863H231j9572J4130M921j4575K1017k1470N326N164j7468K4406j3777N675R843
876A1851k2222J8350j5408q7J5547j8097K1853r424n967J3235k3804J6491m270
889a952n000K1026j9648J3052m683j4299J8210j8588J3808N106j2419J9669k0197
$$ plain form
902 -5915 -1535 2062 -14187 8307 -3726 2518 11837 -8434 7804 -7253 -7821 6333 -9986
915 -9986 11216 2889 -2284 9816 -13477 1815 -3059 -7354 13260 -5124 8371 3297 -10626
928 -10626 6273 -12542 1228 6096 -5091 14705 -5101 -666 1912 -14404 7346 -4527 2496
941 2496 11787 -7289 8339 -6884 -7612 5082 -10090 10255 2941 -1227 9739 -11912 1357
954 1357 -3482 -7446 11496 -4374 8096 3790 -9028 5531 -11751 293 4875 -4609 13575
967 13575 -3877 64 1824 -13260 6036 -4873 2118 10802 -6196 8522 -6263 -6720 4198
980 4198 -10172 9522 2054 -445 9588 -10941 2131 -4062 -7080 10255 -4867 8300 3453
993 3453 -7646 5787 -11464 512 3551 -4671 12808 -3833 1172 1830 -12038 5577 -5446
$$ packed form
902e915M380L597j6249K2494j2033O244R319k0271J6238j5057n68J4154j6319
915i986K1202q327n173J2100k3293J5292m874m295K0614j8384J3495n074j3923
928a0626J6899j8815J3770M868j1187J9796j9806M435K578j6316K1750j1873P023
941B496R291j9076J5628j5223p28J2694j5172K0345p314m168J0966k1651J3269
954A357m839l964J8942j5870J2470m306j2818J4559j7282J2044M582r484J8184
967A3575j7452L941J760j5084J9296j0909O991Q684j6998J4718j4785m57J0918
980D198j4370J9694p468k499J0033k0529J3072o193l018J7335j5122J3167m847
993C453j1099J3433j7251J1976L039q222J7479j6641N005O58j3868J7615j1023
$$ plain form
1006 -5446 1822 9370 -5461 8403 -5439 -5593 3565 -9689 8229 1312 -228 9031 -9536 2575
1020 2575 -3910 -6503 8817 -5043 7811 2952 -6249 5733 -10519 755 2493 -4631 11673
1033 11673 -3853 1836 2025 -10946 5691 -5963 1630 8292 -5612 8833 -5327 -4309 3538
1046 3538 -9765 7932 82 -173 8746 -8955 3476 -3754 -6189 8139 -5734 7401 2635
1059 2635 -5621 6238 -9943 1044 1874 -4845 10731 -3856 2191 2189 -9698 5282 -5664 1102
1073 1102 7291 -5160 8151 -4327 -3814 3505 -9152 6895 -110 -457 8317 -8061 3609 -3319
1087 -3319 -5824 7317 -5776 6753 2449 -5001 6250 -9177 1032 1526 -5070 10088 -3925
1100 -3925 2462 2405 -9151 5390 -6013 995 6561 -5041 8240 -4110 -3102 3200 -8867 6330
$$ packed form
1006e446P268P548j4831J3864j3842j54R158j3254J7918o917j540R259j8567J2111
1020B575o485k593J5320j3860J2854m859r201J1982j6252J1274J738p124J6304
1033A1673j5526N689J89j2971J6637j1654P593O662j3904J4445j4160J018P847
1046C538j3303J7697p850k55Q919j7701J2431p230k435J4328j3873J3135m766
1059B635q256J1859j6181J0987Q30o719J5576j4587O047kj1887J4980j0946O766
1073A102O189j2451J3311j2478N13P319j2657J6047p005l47Q774j6378J1670o928
1087c319k505J3141j3093J2529m304p450J1251j5427J0209M94o596J5158j4013
1100c925O387n7j1556J4541j1403P008N566j1602J3281j2350J008O302j2067J5197
$$ plain form
1114 6330 -455 -314 7981 -7240 3611 -3114 -5677 6520 -5561 6288 2493 -4259 5896 -8436
1128 -8436 695 969 -4731 9081 -3213 2565 2350 -8234 4508 -5775 626 5936 -4325 7982
1142 7982 -3588 -2631 2576 -8642 5694 -867 297 7691 -6369 3796 -3520 -5432 5524 -5568
1156 -5568 6450 2473 -3304 5977 -8458 660 44 -4755 8984 -3112 3571 2289 -7777 4139
1170 4139 -6540 601 5258 -3678 8326 -3176 -2093 1937 -8765 4934 -1187 698 7757 -5448
1184 -5448 3985 -3749 -5479 4430 -5559 6376 2646 -2133 5770 -7935 124 -838 -4729 8300
1198 8300 -2346 4134 2653 -7210 3523 -7098 109 4710 -3187 8924 -2692 -1361 1419 -9172
1212 -9172 4309 -1957 1176 7967 -4639 4617 -4005 -5660 3553 -6190 6405 2728 -1277 6328
$$ packed form
1114F330o785J41Q295j5221J0851o725k563J2197j2081J1849l795o752J0155j4332
1128h436R131K74n700J3812j2294N778k15j0584J2742j0283O401N310j0261J2307
1142G982j1570R57N207j1218J4336o561J164P394j4060J0165p316j912J0956j1092
1156e568J2018l977n777R281j4435R118o16m799J3739j2096O683j282j0066J1916
1170D139j0679P141M657q936J2004j1502J083M030j0702J3699o121J885P059j3205
1184e448R433p734j730R909r989J1935l730m779P903j3705Q059r62l891J3029
1198H300j0646O480j481r863J0733j0621P207M601p897J2111j1616J331K780j0591
1212i172J3481o266L133O791j2606R256q622j655R213r743J2595l677m005P605
$$ plain form
1226 6328 -7803 84 -1779 -5141 7814 -2155 4905 3037 -6413 3052 -7395 -586 3999 -2726
1240 -2726 8926 -1615 -911 1291 -9145 3140 -2262 1009 7998 -3491 4876 -3610 -5689 2423
1254 2423 -6371 5703 2850 -324 6523 -6871 -159 -2438 -5509 6835 -1992 5328 3474 -5451
1268 -5451 3016 -7714 -1038 2951 -2717 9005 -1139 108 1297 -8944 2524 -3103 843 7645
1282 7645 -2774 5532 -3181 -5278 1763 -6834 5083 2479 290 6826 -5984 120 -2840 -5718
1296 -5718 5690 -2068 5337 3767 -4298 2970 -7334 -1568 1953 -2798 8343 -469 836 1576
1310 1576 -8175 1795 -3613 335 6839 -2115 5830 -2443 -4562 1308 -7052 4216 1794 515 7002
1325 7002 -5133 852 -2914 -5769 4876 -2790 5343 3690 -3398 3612 -7125 -1390 1054 -3262
$$ packed form
1226F328j4131P887j863l362J2955r969P060j868r450R465j0447O809M585o725
1240b726J1652j0541P04K202j0436J2285n402L271O989j1489Q367q486k079Q112
1254B423q794J2074k853l174O847j3394O712k279l071J2344q827P320j854q925
1268e451Q467j0730O676L989n668J1722j0144J247J189j0241J1468n627L946O802
1282G645j0419Q306q713k097P041q597J1917k604k189O536j2810O104k960k878
1296e718J1408p758P405j570q065P268j0304N766L521m751J1141q812J305P40
1310A576r751R970n408L948O504q954P945q273k119N870q360J1268k422j279O487
1325G002j2135N985l766k855J0645p666Q133j653p088P010j0737N735K444m316
$$ plain form
1339 -3262 7865 -607 1617 1955 -7470 1803 -4175 -111 5979 -2051 6075 -1847 -3745 1223 -7002
1354 -7002 3414 1142 429 6824 -4158 1283 -2534 -5605 3943 -3082 4670 3657 -2639 3903 -6291
1369 -6291 -1397 533 -3597 6984 -577 1994 2349 -6576 1829 -4378 -516 5111 -2098 6140 -1432
1384 -1432 -2910 1308 -6950 2955 383 289 6620 -3680 1912 -2318 -5369 3410 -3589 4334 3404
1399 3404 -2104 4287 -5769 -1218 58 -3887 6329 -597 2303 2678 -5781 1739 -4411 -960 4380
1414 4380 -1947 5946 -815 -2326 1257 -6649 2212 -28 193 6296 -2883 2119 -2053 -5096 2604
1429 2604 -3659 3831 3273 -1459 4326 -5187 -1241 -420 -4061 5720 -581 2683 2877 -5225 1733 -4785
1445 -4785 -1158 3734 -1886 6238 -552 -1621 1138 -6726 1825 -625 288 6297 -2323 2645 -2011
$$ packed form
1339c262J1127q472K224L38r425R273n978M064O090q030Q126p922j898M968q225
1354g002J0416k272p13O395j0982N441l817l071R548p025P752j013o296O542j0194
1369f291M894J930m130J0581p561K571L55q925Q405o207L862N627p209Q238p572
1384a432j478M218q258R905k572r4O331j0300N592m230l051Q779o999P923r30
1399C404n508O391j0056M551J276l945J0216o926K900L75q459P520o150L451N340
1414D380o327P893o761j511L583p906Q861k240K21O103r179N002m172l043P700
1429B604o263P490n58m732N785r513L946Q21l641R781o301L264J94q102O958o518
1445d785L627M892n620Q124o790j069K759p864Q551k450R13O009q620M968m656
$$ plain form
1460 -2011 -5028 1988 -4031 3646 3228 -768 4536 -4774 -1341 -1035 -4197 5064 -292 3008 3163 -4549
1476 -4549 1305 -4870 -1722 3208 -1600 6234 118 -1218 999 -6762 1144 -1050 349 6296 -1569
1491 -1569 3031 -1942 -5008 1211 -4339 3424 3266 -47 4908 -4437 -1346 -1694 -4574 4677 -293
1506 -293 3650 3487 -4001 1257 -5389 -2064 2534 -1446 6492 641 -600 896 -6865 429 -1539
1521 -1539 235 6344 -855 3422 -1682 -5039 476 -4661 2977 3318 657 5156 -3715 -1511 -2184
1536 -2184 -4845 3835 -5 3894 3969 -3186 1053 -5450 -2637 1812 -1381 6489 1251 108 906 -6745
1552 -6745 -229 -2169 122 6113 -189 3933 -1392 -4835 -119 -5165 2549 3052 1127 5611 -3269
1567 -3269 -1156 -2643 -5169 3208 -350 4229 4204 -2359 1277 -5459 -2932 989 -1549 6245 1715
$$ packed form
1460b011l017P016o019P677m18l996N304r310L433L06l162R261n356L300J55p712
1476d549N854o175L148M930m808P834o116j336K217p761P906k194J399N947p865
1491a569M600m973l066O219n550P763j58l313M955r345L091l48k880R251m970
1506b93L943j63p488N258o646L325M598l980P938n851j241J496p761P294j968
1521a539J774O109p199M277n104l357N515n137P638L41k661M499q871K204o73
1536b184k661Q680l840L899P5p155M239o503K813M449l193P870n238j143P98p651
1552f745O516j940K291N991o302M122n325l443M716n046P714N03j925M484q880
1567c269K113j487k526Q377l558M579k5o563L636o736K527L921k538P794m530
$$ plain form
1582 1715 795 1225 -6323 -715 -2658 -336 5650 309 4293 -762 -4333 -553 -5351 1722 2648 1364
1598 1364 5729 -2342 -873 -2586 -5393 2350 -724 3996 4368 -1636 1753 -5202 -2993 223 -2021
1613 -2021 5810 1676 1509 1620 -5692 -698 -3191 -786 4921 260 4646 -227 -3579 -380 -5560
1628 -5560 1208 1858 1139 5765 -1763 -95 -2285 -5241 1669 -1334 3442 4197 -994 2228 -4397 -2905
1644 -2905 -173 -2553 4929 1541 1711 2190 -4792 -488 -3261 -1320 3991 8 4494 350 -2677
1659 -2677 -57 -5192 570 1095 615 5353 -1183 585 -1584 -4785 1275 -1997 2731 3634 -683 2839
1675 2839 -3649 -2215 -432 -2978 4040 877 1792 2516 -3872 124 -3141 -1645 3082 -658 4215
1690 4215 577 -1789 573 -4732 363 293 11 4646 -900 1180 -857 -3995 1002 -2298 1798 2960
$$ packed form
1582A715r20M30p548N608j943K322N986n341L984n055l571L780m798P073R26j284
1598A364M365q071J469j713k807P743l074M720L72o004L389o955K209L216k244
1613b021P831m134j67J11p312M994k493K405N707m661M386m873l352L199n180
1628e560O768O50p19M626p528J668k190k956O910l003M776P55n191L222o625J492
1644b905K732k380P482l388J70M79o982M304k773J941N311l983M486m144l027
1659b677K620n135N762N25m80M738o536J768k169l201O060l272M728R03m317L522
1675B839o488J434J783k546P018l163R15P24o388L996l265J496M727l740M873
1690D215l638k366K362n305N095p0k82M635n546K080k037l138M997l300M096J162
$$ plain form
1706 2960 -587 3045 -2620 -1615 -280 -3154 3090 269 1490 2638 -2942 746 -2689 -1703 2213
1721 2213 -1242 3597 600 -1063 1172 -4068 356 -341 -619 3918 -1028 1702 -323 -3180 1131
1736 1131 -2678 1294 2053 -686 3166 -2003 -779 -76 -3104 2415 -417 1134 2583 -2306 1385
1751 1385 -2192 -1615 1658 -1803 3002 500 -603 1651 -3346 427 -616 -1106 3150 -1072 1759
1766 1759 240 -2504 1257 -2652 700 1441 -942 3075 -1497 -207 193 -2938 1909 -931 793
1781 793 2312 -1798 1747 -1716 -1359 1280 -2119 2493 302 -322 2005 -2819 711 -808 -1360 2631
1797 2631 -1330 1896 439 -1917 1435 -2619 475 888 -1090 2900 -1193 197 414 -2726 1597
1812 1597 -1219 497 2102 -1524 1945 -1374 -1164 1033 -2203 2037 181 -181 2039 -2301 723
$$ packed form
1706B960l547L632n665J005J335k874O244k821J221J148n580L688l435R86L916
1721B213l455M839k997j663K235n240M424o97k78M537m946K730k025k857M311
1736A131l809L972P59k739L852n169J224P03l028N519k832J551J449m889L691
1751A385l577N77L273l461M805k502j103K254m997L773j043m90M256m222K831
1766A759j519k744L761l909L352P41k383M017m572J290M00l131M847k840J724
1781G93J519m110L545l463L57K639l399M612k191o24K327m824L530j519n52L991
1797B631l961L226j457k356L352m054L094M13j978L990m093J390K17l140M323
1812A597k816J716J605l626L469l319K10K197l236M240j856l62K220m340L024
$$ plain form
1827 723 -770 -1467 2190 -1314 1776 613 -1564 1517 -2480 351 590 -1154 2745 -1073 495 445
1843 445 -2507 1435 -1457 439 1838 -1348 2070 -1274 -936 830 -2289 1877 -36 -9 2042 -2108
1859 -2108 864 -916 -1432 1904 -1364 1780 620 -1281 1484 -2371 233 422 -1158 2598 -914
1874 -914 588 539 -2374 1269 -1465 313 1753 -1187 2069 -1100 -865 715 -2253 1662 -74 62
1890 62 2016 -1873 835 -937 -1451 1657 -1356 1749 642 -1081 1453 -2319 190 218 -1148 2508
1906 2508 -830 754 537 -2237 1183 -1579 283 1625 -1085 2155 -1017 -726 608 -2277 1541
1921 1541 -168 129 2002 -1677 880 -955 -1453 1446 -1351 1660 673 -897 1416 -2170 71 78
1937 78 -1161 2274 -665 784 596 -2034 981 -1565 113 1445 -949 2083 -794 -600 541 -2210
$$ packed form
1827G23j493o97L657l504L090j163k177L081l997K831K39j744L899l818J568n0
1843D45k952L942k892J896J399l186L418l344L38J766l119M166j913K7K051m150
1859b108K972j780n16L336l268L144j160j901K765l855K604J89j580L756l512
1874i14J502m9k913L643k734J778J440k940L256l169K35J580k968L915j736J36
1890F2J954l889K708j772n14L108l013L105j107j723K534l772K509K8j366L656
1906B508l338J584k17k774L420k762J862J342k710L240l172K91J334k885L818
1921A541j709K97J873l679K557j835m98K899k797L011r87j570K313l586K241P
1937G8j239L435k939J449j88k630L015k546J678J332k394L032k877J94J141k751
$$ plain form
1953 -2210 1307 -287 170 1944 -1439 1027 -922 -1328 1204 -1417 1595 602 -618 1471 -1993 143
1969 143 -158 -1182 2028 -698 938 619 -1743 930 -1626 -3 1131 -896 2010 -625 -383 530
1985 530 -2109 1032 -428 54 1842 -1179 1112 -735 -1256 963 -1496 1325 530 -430 1542 -1656
2001 -1656 177 -255 -1257 1679 -708 977 747 -1386 992 -1597 -106 779 -950 1921 -506 -46
2017 -46 557 -1950 861 -724 -52 1610 -1002 1290 -590 -1073 792 -1667 1114 322 -318 1672 -1425
2034 -1425 394 -349 -1322 1389 -881 1005 801 -1020 1121 -1464 -216 492 -1066 1744 -343 182
2050 182 775 -1732 739 -889 -256 1373 -863 1408 -307 -818 670 -1703 749 128 -298 1674
2066 1674 -1065 516 -285 -1400 1065 -1068 886 826 -763 1314 -1360 -186 192 -1200 1548 -358
$$ packed form
1953b210L517j594M57J774l383K466j949m06K532k621L012r93j220K089l464K136
1969A43l01j024L210k726J636l19k362K673k556J623J134k027K906k635K42R13
1985E30k639L141j460M82J788l021K291j847n21K219k459K821p95r60J972l198
2001a656J833m32j002K936k387J685k30k133K378k589J491Q85j729K871k427M60
2017d6O03k507K811j585O72J662k612K292j880m83J865k459K781p92o40J990l097
2034a425J819p43r73K711k270J886k04j821K141k585J248P08j558K810k087N25
2050A82N93k507K471j628O33J629k236K271j715n11J488k373K452o21m26J972
2066A674k739J581q01j115K465k133J954o0j589K077k674J174L78j392K748j906
$$ plain form
2082 -358 463 878 -1434 703 -1036 -414 1082 -825 1487 -101 -538 679 -1719 534 -136 -318 1627
2099 1627 -783 719 -191 -1314 748 -1187 668 804 -527 1389 -1081 -211 55 -1344 1281 -361
2115 -361 549 1004 -1159 727 -1095 -515 772 -790 1461 38 -240 673 -1600 385 -345 -343 1507
2132 1507 -621 927 -134 -1140 591 -1330 587 590 -328 1435 -915 -50 -119 -1355 1027 -476 595
2149 595 1008 -933 804 -1101 -536 566 -898 1422 26 -35 705 -1480 355 -521 -372 1325 -524
2166 -524 997 -20 -955 512 -1304 448 480 -290 1443 -771 87 -110 -1298 887 -557 593 924
2183 924 -756 830 -1030 -496 411 -932 1292 -15 47 761 -1390 391 -613 -388 1196 -579 1077
2200 1077 -68 -774 511 -1297 453 297 -256 1347 -673 175 -82 -1205 799 -580 523 862
$$ packed form
2082c58Q21M15k312K137j739O22J496j907K312j588m37J217k398K253o70j82J945
2099A627k410J502r10j123K062j935J855J36j331J916k470Q70K66j399K625j642
2115c61R10M55k163J886j822N80J287j562K251j423k78R13k273J985p30KJ850
2132A507k128J548j061j006J731j921J917Lr18J763k350Q65o9j236K382j503J071
2149E95M13j941J737j905N65J102j464K320j396o1P40k185J835q76J49J697j849
2166e24J521j017r35J467j816J752L2p70J733k214Q58j97j188K185j444J150L31
2183I24j680J586j860N34R07j343K224j307O2P14k151J781j004K25J584j775J656
2200A077j145p06J285j808J750j56n53J603k020Q48k57j123K004j379J103L39
$$ plain form
2216 862 -696 875 -926 -412 355 -912 1176 -39 77 709 -1218 366 -557 -413 1040 -570 945
2233 945 -33 -713 511 -1242 420 219 -275 1244 -687 266 -118 -1054 733 -610 524 728 -588
2250 -588 825 -838 -302 315 -850 1097 -106 118 680 -1129 429 -574 -333 946 -573 929
2266 929 -72 -585 484 -1145 400 137 -277 1150 -645 255 -111 -1003 688 -630 497 636 -554
2283 -554 788 -826 -245 252 -784 1001 -108 153 615 -1005 412 -549 -325 864 -536 918 -62
2300 -62 -506 488 -1125 397 59 -229 1104 -617 340 -148 -927 627 -699 499 569 -487 840 -818
2318 -818 -180 154 -817 960 -181 245 609 -927 420 -612 -303 739 -508 916 -2 -421 471
2335 471 -1074 337 33 -221 1095 -523 411 -96 -900 559 -717 450 569 -379 864 -736 -174
$$ packed form
2216H62j558J571j801N14P67j267K088j215J16O32j927J584r23J44J453j610J515
2233I45r78o80J224j753J662k01m94J519j931R53l84r36J787j343J134K04j316
2250e88J413j663N36O17j165J947j203K24N62j809J558j003K41J279j519J502
2266I29j001n13J069j629J545k63m14J427j795R00l66q92J691j318J127J39j190
2283e54J342j614N81M97j036J785j109K61M62j620J417r61K24J189j400J454r80
2300f2m44R94j613J522l38k88J333j721R57m88p79J554j326J198P0j056J327j658
2318h18O38L34r71J777j141M26L64j536J347j032L09J042j247J424r18m19Q92
2335D71j545J411l04k54J316j618R34n07q04J459j276J167J19r48J243j600N62
$$ plain form
2352 -174 77 -863 852 -195 300 648 -832 427 -680 -362 595 -513 962 21 -266 439 -1084
2369 -1084 246 -125 -227 1047 -402 514 -64 -849 435 -801 383 526 -268 948 -638 -138 -17
2386 -17 -908 754 -206 379 717 -668 440 -721 -439 436 -537 936 118 -118 451 -1061 128 -278
2404 -278 -279 957 -296 605 -3 -754 300 -889 291 430 -161 1012 -497 -35 -99 -942 598 -285
2422 -285 435 762 -506 524 -723 -445 285 -609 942 123 42 512 -1006 126 -435 -309 855 -257
2440 -257 731 47 -626 244 -947 191 292 -131 1021 -383 45 -108 -963 448 -370 391 750 -387
2458 -387 590 -668 -430 179 -651 840 130 137 583 -872 140 -467 -356 763 -281 782 88 -505
2476 -505 272 -964 155 159 -133 976 -335 167 -107 -879 373 -456 336 654 -317 629 -584 -355 134
$$ packed form
2352a74K51r40J715j047M95L48j480J259j107L18R57j108J475r41k87P05j523
2369a084J330l71j02J274j449R16n78p85J284j236J184J43p94J216j586N00J21
2386a7q91J662r60N85L38j385J108j161K82Q75r73J473q18k36N69j512J189m06
2404b78jJ236j253R01o08p51J054j189J180J39n91J173j509M62o4q43J540q83
2422b85P20L27j268J030j247K78P30q94J551q19q1M70j518J132n61J26J164j112
2440b57R88o84o73Q70j191J138J01m23J152j404M28j53q55J411q18P61L59j137
2458c87R77j258K38O09q30J491p10PM46j455J012o07J11J119j044J063o94n93
2476e05P77j236J119Mk92J109j311N02k74p72J252q29P92L18r71R46j213K29M89
$$ plain form
2495 134 -692 749 42 158 581 -754 207 -439 -360 640 -332 702 116 -408 336 -845 148 109 -209
2514 -209 873 -328 217 -31 -752 363 -484 261 497 -331 587 -476 -246 139 -636 603 -53 84
2532 84 518 -658 282 -373 -294 552 -402 611 28 -300 388 -718 224 37 -241 716 -394 232 15
2551 15 -575 452 -448 237 361 -388 551 -458 -81 200 -523 577 -179 8 380 -597 339 -265 -186 492
2571 492 -455 445 -84 -319 426 -599 324 51 -264 587 -507 215 11 -422 561 -381 258 216 -448 457
2591 457 -459 52 298 -411 597 -260 -41 251 -611 424 -209 -24 487 -460 378 -236 -321 373 -490 427
2611 427 96 -233 468 -589 119 -17 -371 629 -305 291 164 -525 372 -508 104 329 -293 613 -253
2630 -253 -75 151 -618 394 -126 80 540 -408 342 -296 -345 336 -431 499 129 -138 415 -621 66 -107
$$ packed form
2495A34q26J441p07J16M23j335R61o46P9J000r72J034n86n24P44j181R93l9l18
2514b09J082j201N45k48p21J115q47P45K36q28R18j063K30L85p75J239o56J37
2532H4M34j176R40o55P9Q46r54J013n83l28O88j106R42j87k78R57j110O26k17
2551A5n90J027r00O85J24p49R39j009L77K81p23J100p56J87L72r77R36o04P9O78
2571D92r47R00n29k35P45j025R23k73l15Q51j094P22k04m33R83r42O39m2o64R05
2591D57r16N11K46p09J008q57K19K92q62J035o33J85N11r47Q38o14q5O94q63R17
2611D27l31l29P01j057P08j36l54J000r34N96j27o89Q97q80O12K25o22R06q66
2630b53J78K26p69J012n20K06M60r48P50o38m9O81p67R30l70k67N53j036O87j73
$$ plain form
2650 -107 -314 595 -220 321 143 -503 275 -540 68 327 -235 652 -266 -61 75 -636 360 -189 146 523
2670 523 -335 343 -330 -330 245 -415 490 138 -69 425 -557 76 -143 -301 551 -197 365 129 -425 238 -528
2691 -528 27 239 -212 597 -206 -21 67 -608 299 -227 110 470 -300 399 -312 -271 184 -436 461 57 1
2712 1 414 -482 141 -187 -280 454 -229 374 125 -325 284 -514 62 136 -225 569 -202 83 98 -508 294 -284
2734 -284 52 386 -298 410 -256 -204 191 -481 373 -39 -38 424 -440 211 -174 -270 376 -306 347 107 -235
2755 -235 329 -430 98 89 -278 483 -215 127 153 -427 320 -311 39 287 -306 419 -204 -103 202 -451 316
2776 316 -90 -75 384 -391 269 -124 -249 344 -380 295 48 -217 366 -398 134 39 -289 403 -260 136 148
2797 148 -338 340 -262 24 238 -314 391 -172 -48 246 -389 308 -132 -78 325 -358 277 -84 -195 306
$$ packed form
2650a07k07R09q15N41j78o46P78q15O08K59n62Q87r18K05J36p11R96n49L35L77
2670E23q58O78o73%N75o60R05l52k07M94r82O33k19j58Q52p48N62k36n54O63p66
2691e28N55K12m51Q09q03J85Q8o75R07n26L37L60p70O99p11M1M55o20Q97m04n6
2712AM13q96O23l28r3P34o83O03k49m50O09p98N76P4l61P94p71K85J5o06Q02n78
2734b84L36L34o84P08o66N2L95o72Q54m12JM62q64O51l85r6O46o82O53k40l42
2755b35N64p59N28rl67P61o98L42K6n80P47o31L50K48n93P25o23J01L05o53P67
2776C16m06J5M59p75O60l93j25N93p24O75k47k65N83p64N32r5l28O92o63L96J2
2797A48m86O78o02K86K14n52P05n63J24K94o35O97m40N4M03o83O35l61j11N01
$$ plain form
2817 306 -358 238 -5 -209 340 -356 172 38 -255 360 -308 133 94 -301 343 -268 75 175 -304 328
2837 328 -217 -14 210 -328 323 -114 -55 288 -362 257 -102 -138 343 -323 265 -21 -198 302 -350 173 48
2858 48 -212 372 -294 113 49 -324 314 -258 104 195 -286 317 -275 -46 155 -311 349 -89 3 242 -366
2879 -366 194 -149 -116 343 -236 304 -9 -208 238 -405 158 57 -134 427 -247 113 -14 -356 271 -243
2899 -243 159 236 -207 322 -305 -107 76 -321 369 -64 61 238 -383 148 -238 -133 306 -174 368 21
2919 21 -179 160 -428 93 40 -72 466 -159 131 -23 -388 201 -257 189 286 -127 344 -304 -126 -2 -344
2940 -344 351 -14 137 269 -362 105 -303 -165 260 -153 406 38 -144 108 -474 56 -27 -46 461 -106 168
2961 168 -64 -392 118 -284 174 277 -62 354 -264 -119 -48 -346 330 4 179 296 -296 116 -318 -186
$$ packed form
2817C06o64N96k43k04N49o96N28j34k93O15o68M41l9l95O44o11L43J00m79O32
2837C28n45K03K24n38O51m37N9L43o50O19l59l6M81o66N88k86j77N00o52N23j25
2858D8k60N84o66M07o4l73O38n72L62R1m81O03n92K29K01m66O60m38R2K39o08
2879c66N60l43L3M59n79N40l13j99M46o43N63j01j91N61o74L60j27l42O27n14
2899b43M02P7m43N29o27J98J83l97O90m33J25J77o21N31l86J05M39m80N42l47
2919B1k00L39n88N21n3j12N38o25K90j54l65N89m58M46R7m13M71o48J78J24l42
2940c44O95l65J51J32o31M67m08J38M25m13N59l68j82K52n82N30q3j9N07n67K74
2961A68k32l28N10m02M58J03l39M16o18J45P1k98O76l26J75J17n92M12m34J32
$$ plain form
2981 -186 199 -144 408 55 -76 105 -467 24 -83 -52 410 -96 206 -66 -350 81 -320 150 232 -38 370
3002 370 -242 -95 -53 -355 291 -38 186 287 -249 140 -296 -165 202 -157 397 58 -44 153 -409 50
3022 50 -95 -69 374 -116 228 -45 -312 94 -321 128 168 -59 336 -221 -56 -45 -317 255 -69 134 256
3043 256 -241 168 -239 -124 176 -191 347 15 -37 155 -352 100 -57 -83 349 -151 201 -13 -243 167 -279
3064 -279 158 131 -110 288 -233 -8 3 -260 244 -109 97 154 -241 152 -205 -83 169 -200 261 -46 -79
3085 -79 143 -312 144 -27 -50 280 -181 155 -45 -186 189 -200 179 97 -127 229 -238 23 29 -181 281 -114
3107 -114 86 90 -269 152 -175 12 174 -144 230 -118 -107 92 -267 182 -14 -14 240 -229 88 -116 -174 207
3129 207 -159 219 75 -132 167 -279 35 42 -101 320 -80 87 45 -276 146 -171 57 215 -117 240 -166
$$ packed form
2981a86L85l43N52l53j31J81n72M91j07L1M62n06L02k72k84M31m01M70Q2k70M08
3002C70o12J47M2l02O46l29K24J01n36L89m36J31L67l59N54l39j02J97n62M59
3022E0j45K6M43m90L44k73k67M06m15M49M0k27L95n57J65J1k72N72l24K03J22
3043B56m97M09m07J15L00l67N38l32n2J92n07M52j57k6M32n00L52k14k30M10m46
3064b79M37k7k41L98n21K25J1k63N04l53K06N7l95L93l57J22K52l69M61l07l3
3085g9K22m55M56j71k3L30m61L36k00j41L75l89L79q2k24L56m67K61Ok10M62l95
3107a14K00Ml59M21l27J87J62l18L74l48J1J99l59M49j96%K54m69L17k04n8L81
3129B07l66L78j44k07K99m46L14Pj43M21m00J67m2l21M22l17K28J58l32L57m06
$$ plain form
3150 -166 -109 33 -258 202 11 45 222 -236 52 -147 -175 204 -128 233 98 -134 137 -331 -7 16 -102
3171 -102 330 -73 106 18 -285 86 -193 69 215 -70 257 -144 -112 17 -264 194 20 80 261 -196 72
3192 72 -168 -189 142 -137 234 101 -85 113 -309 -42 -25 -114 296 -36 118 45 -289 63 -216 34 203 -48
3214 -48 288 -110 -85 8 -269 162 -1 91 261 -137 97 -151 -193 110 -138 241 105 -47 158 -261 -31 -68
3236 -68 -126 262 -30 142 50 -221 47 -230 -15 149 -70 265 -77 -62 -5 -300 109 -64 75 244 -109 140
3258 140 -133 -154 70 -166 195 100 20 190 -200 -2 -69 -135 209 -57 172 86 -163 80 -230 -15 76 -62
3280 -62 247 -52 3 16 -267 75 -103 23 210 -99 173 -122 -140 48 -210 163 40 30 191 -173 21 -93
3302 -93 -142 167 -73 173 103 -98 119 -214 -21 39 -89 248 -36 52 47 -226 67 -129 18 161 -68 169
$$ packed form
3150a66N7J42k91M60j91L4J77m58K88j99k8L79l32L61j35k32K71m68L24K3j18
3171a02M32m03J79q8l03L71k79K62J46k85L27m01L2J29k81M58j74O0J81m57K68
3192G2k40k1L31k79L71j33j86J98m22K67J7q9M10l32J54p3l34L52k79K50J69k51
3214d8L36l98K5R3k77M31j63R2J70l98K34k48m2L03k48L79j36j52K05m19K30l7
3236f8n8L88k92J72r2k71K68k77K15J64k19L35l42J5N7k95M09j73J39J69l53K49
3258A40k73k1K24k36L61r5q0J70l90J98o7o6L44k66K29q6k49K43l10K15R1j38
3280f2L09k99N5J3k83L42j78J26J87l09K72k95j8J88k58L73j23j0J61l64J94j14
3302i3m9L09k40K46p0k01K17l33J93O0j28L37k84Q8nk73K93j96J47J43k29K37
$$ plain form
3324 169 -92 -114 35 -226 114 14 7 190 -155 57 -99 -152 132 -108 161 74 -72 122 -208 -20 -6 -91
3346 -91 221 -21 66 77 -185 87 -129 7 151 -69 194 -49 -69 40 -210 100 1 7 183 -127 60 -85
3368 -85 -160 95 -129 127 52 -70 115 -194 -16 -15 -116 192 -55 95 54 -164 74 -146 2 115 -58 178
3390 178 -42 -51 50 -184 96 -11 5 177 -107 68 -66 -133 92 -124 130 69 -52 120 -172 -6 -23 -116
3412 -116 162 -65 68 51 -156 70 -152 -8 92 -69 177 -62 -36 33 -184 97 -24 24 161 -90 85
3433 85 -62 -113 93 -101 129 57 -50 126 -163 5 -7 -101 175 -43 84 46 -157 72 -140 9 92 -64
3455 -64 157 -78 -52 19 -177 88 -27 17 136 -105 69 -69 -107 81 -96 137 66 -41 105 -145 4 -7
3477 -7 -82 175 -30 86 52 -135 61 -132 2 84 -62 148 -64 -40 17 -176 78 -36 11 140 -102 56 -93
$$ packed form
3324A69k61k2J49k61L40j00pJ83l45K12j56n3K84k40K69q7j46J94l30J88J4q5
3346i1L12k42Q7J1k62K72k16J36J44k20K63k43k0J09k50L10r9OJ76l10J87j45
3368h5p5K55k24K56p5j22J85l09J78Jj01L08k47J50m1k18K38k20J48J13j73K36
3390A78k20rJ01k34K80j07J6J72k84J75j34o7K25k16K54o1j21J72k92J66j7r3
3412a16K78k27J33j7k07K26k22J44J00j61K46k39K6O9k17K81j21M8J37k51J75
3433H5j47n1K06j94K30p2j07J76k89J68j2r4K76k18J27l8k03K29k12J49Q3j56
3455f4K21k35K6P1j96K65j15M4J19k41J74j38l8J88j77K33p1j07J46k50J49j1
3477gp5K57k05J16l4j87J96j93J34Q2j46K10k12K4N7j93K54j14M7J29k42J58j49
$$ plain form
3500 -93 -111 62 -106 107 40 -36 93 -154 -16 -24 -94 132 -34 88 48 -126 58 -124 7 92 -45 163 -29
3523 -29 -8 24 -163 82 -40 23 143 -80 72 -81 -103 48 -121 106 25 -27 90 -153 -1 -50 -98 118 -52
3546 -52 91 52 -116 55 -135 -12 66 -48 160 -37 -3 32 -152 58 -45 16 133 -64 105 -50 -82 60
3568 60 -123 97 31 -9 125 -112 30 -49 -103 97 -69 76 50 -91 59 -129 -18 16 -78 130 -36 9 45
3591 45 -135 64 -68 -2 109 -61 125 -25 -53 62 -129 79 18 -14 149 -85 50 -25 -101 83 -82 76
3613 76 59 -61 92 -113 -16 10 -87 111 -29 30 59 -113 45 -98 -40 74 -81 109 -18 -55 53 -140 61
3636 61 -3 -20 127 -74 77 -16 -88 64 -76 64 62 -39 116 -92 6 9 -94 102 -39 35 65 -92 58 -83
3660 -83 -37 52 -67 101 -20 -22 43 -124 22 -30 -35 108 -68 57 -3 -87 47 -109 41 39 -27 109 -68 21 22 -89
$$ packed form
3500i3j8J73j68K13o7p6J29k47J38qp0K26j66J22m0j74J84j82J31Q5j37K08j92
3523b9K1L2j87K45j22O3J20k23J52j53k2J51j69K27q1n2J17k43J52m9m8K16j70
3546e2J43l9j68J71j90J23P8j14K08j97L4L5j84K10j03O1J17j97J69j55l2J42
3568F0j83K20o6m0J34k37J42p9n4K00j66J45k6j41J50j88J11L4r4K08j66M5L6
3591D5j80J99j32O6J11j70J86j50k8J15j91K08o1l2J63k34J35p5p6J84j65J58
3613G6j7j20J53k05R7K6r7J98j40N9K9j72J58j43N8J14j55J90j27l7J08j93K01
3636F1o4j7J47k01J51r3p2J52j40J40kj01J55k08R8Lj03J96j41P4L0j57J50j41
3660h3M6Q9j19J68j21kO5j67J46n2nJ43j76J25o0q4J34j56J50ko6J36j77Q9Jj11
$$ plain form
3686 -89 88 -36 49 82 -67 92 -61 -22 43 -79 112 -9 -9 61 -109 34 -39 -34 81 -58 52 -7 -75 52
3710 52 -92 28 34 -52 96 -74 10 8 -94 85 -56 32 65 -72 82 -57 -6 75 -67 86 -16 -9 70 -90 54
3735 54 -20 -28 81 -78 56 -3 -54 68 -74 37 5 -71 70 -84 2 16 -73 70 -63 -2 31 -98 71 -64
3759 -64 0 62 -71 77 -33 -20 52 -84 74 6 -3 79 -74 41 -15 -51 84 -53 65 25 -65 52 -98 3
3783 3 32 -45 96 -43 0 24 -99 34 -50 17 78 -64 67 -51 -59 32 -94 68 8 0 80 -87 11 -58 -60 88 -22
3810 -22 87 51 -43 50 -101 6 25 -22 120 -19 23 2 -98 34 -49 23 88 -38 78 -66 -59 0 -104 53 17
3835 17 12 86 -81 5 -67 -89 66 -27 102 45 -36 26 -116 -9 11 -22 125 5 52 16 -94 21 -66 26 93 4
3861 4 102 -40 -44 -4 -111 63 29 36 101 -65 3 -70 -86 41 -36 84 49 -40 47 -121 -39 -17 -38 124 0 53 19
$$ packed form
3686h9J77j24Q5L3j49J59j53L9O5j22J91j21%P0j70J43p3NJ15j39J10n9o8J27
3710E2j44J20Oq6J48j70Q4kj02J79j41Q8L3j37J54j39N1Q1j42J53j02PP9j60J44
3735E4p4qJ09j59J34n9n1J22j42J11l2p6J41j54Q6J4q9J43j33O1L3j29J69j35
3759f4O4O2j33J48j10J3P2j36J58o8rQ2j53J15n6l6J35j37J18m0r0J17j50J01
3783CK9p7J41j39M3K4j23J33q4O7O1j42J31j18qR1j26J62o0qQ0j67R8o9kJ48j10
3810b2J09l6r4R3j51J07J9m7J42j39M2k1j00J32q3P2O5j26J16j44PN9j04J57l6
3835A7nP4j67Q6p2k2J55r3J29n7q1O2j42J07K0l3J47j20M7l6j10J15q7R2O7q9
3861DR8j42mM0j07J74l4PO5j66O8p3j6J27p7J20l5q9Q7j68Q2K2k1J62j24N3l4
$$ plain form
3888 19 -86 6 -81 16 85 0 109 -22 -38 -2 -101 56 21 49 109 -31 26 -60 -76 45 -32 93 68 -28 43 -114
3914 -114 -37 -17 -56 110 0 47 21 -100 -5 -94 -11 67 -5 94 -22 -26 -9 -103 39 3 43 105 -25 41 -47 -71 35
3941 35 -43 83 69 -3 62 -82 -28 -22 -47 88 -3 54 38 -74 11 -92 -7 58 -8 96 -30 -40 -13 -111 24 -26 15
3968 15 88 -35 43 -37 -74 19 -54 69 37 4 65 -68 -2 -5 -37 87 4 69 45 -62 31 -65 -7 50 -11 92 -12
3995 -12 -15 6 -105 37 -28 7 75 -45 32 -44 -59 6 -69 49 16 -10 60 -81 3 -25 -45 74 -11 47 32 -53 25 -63
4023 -63 -7 45 -18 93 -2 -6 23 -79 39 -18 19 75 -30 33 -39 -63 17 -58 57 14 -23 38 -86 -12 -31 -57 61
4050 61 -26 43 23 -64 23 -70 1 39 -13 88 -4 -9 -1 -84 36 -7 31 85 -19 35 -18 -58 38 -51 65 43 0 64 -69
4079 -69 -8 -38 -44 74 -16 53 21 -74 -2 -86 -33 33 -1 79 -21 -7 -8 -89 13 -12 42 95 -12 54 -36 -62 7 -41 72
$$ packed form
3888A9j05R2q7R7O9q5J09j31j6L6r9J57l5K8O0j40N7q6j6J21p7J25k5r6P1j57
3914a14P7K0l9J66j10M7k6j21R5q9Q3P8p2R9j16mJ7r4J42l6M0O2j30O6q8k4J06
3941C5p8J26j4p2O5j44N4Ok5J35r1N7j6j12Q5j03Q5O5o6J04j26j0K7r8J35n0M1
3968A5P3j23P8q0l7R3p3J23l2l3O1j33O6ll2J24q3O5k4j07R3r6N8N7o1J03j04
3995a2lK1j11J42o5L5O8j20P7p6j5O5p5J18l3k6P0j41Q4k8k0J19q5N8j5q5P8q8
4023f3N6N2o3J11r5mK9j02J18n7L7N6j05O3p2k4Q0p5J15m3l7O1j24P4j9k6J18
4050F1q7O9k0q7Q7r3P1L8n2J01r2nQq3J20m3L8N4j04N4n3m0R6q9J16k2m3O4j33
4079f9O1l0oJ18r0O9l2r5P2q4N3O6l4Q0j00J4jq1J02k5N4N3j07O6r0k6O9m8J13
$$ plain form
4108 72 43 24 67 -64 -14 -40 -43 77 7 70 40 -51 11 -78 -20 18 5 101 9 7 -16 -101 -6 -35 16 74 -9 33 -47 -82
4138 -82 -25 -66 50 50 42 75 -56 -23 -51 -64 55 22 88 62 -18 0 -84 -29 24 -6 127 17 27 -7 -108 -19 -65 18
4166 18 72 6 59 -49 -74 -33 -75 37 34 35 79 -53 -30 -72 -96 28 -3 86 76 -18 13 -99 -43 3 -19 110 42 36 13
4195 13 -98 -19 -53 10 89 34 99 -19 -60 -34 -89 27 33 46 85 -27 -21 -75 -95 11 -13 64 71 -15 15 -95 -68 -27 -43
4224 -43 83 50 49 27 -82 -23 -69 -18 70 34 106 11 -41 -21 -101 8 16 56 111 -10 19 -59 -85 -1 -20 60 71 12 33
4253 33 -69 -64 -36 -53 59 34 43 25 -74 -30 -77 -30 57 11 87 17 -21 -14 -85 11 19 49 109 5 28 -30 -64 8 -38 68
4283 68 70 26 57 -62 -38 -44 -46 65 24 55 43 -53 -22 -78 -30 45 0 77 13 -22 -13 -101 -9 -18 14 87 1 32 -41 -66 2 -45
4315 -45 43 69 32 64 -41 -23 -18 -35 60 26 61 48 -35 -1 -68 -23 25 -4 80 20 -5 -10 -88 -13 -24 -1 66 -6 27 -30 -67
$$ packed form
4108G2k9j9M3j31N0k6lJ20p0O3l0r1O2q9N8L8j3R6r2kk3q5R5k9N1N8q3M2q0l5
4138h2N7m1J16%qL3j31L3k8j3J19l3O6k6q0J8q4N5N3l0J33j10J0l4j01Q9m6Q3
4166A8N4o6N3j08k5M1m2J12lJM4j32K3m2k4J24l1Q9j0r4L1j12N6M6k2J29o8ok3
4195A3j11P9l4O3P9n5O5j18m1K6n5J16OJ3L9j12On4k0J06k4P7Pq6L0j10K7M1j6
4224d3J26l3jk2j09N9m6N1Q8l6P2r5n2K0q0J09QM0N5j21K9p8k6Q4j9Q0J1n9K1
4253C3j02NK8j7J12k5Rj8r9M4m7M7Q7m6P6p0l8Pp1R6QL0O0j04K3n8l4P2m6J06
4283F8Km4L1j19K4okJ11m1L1j2r6L1n6M8P5m5P7o4l5Rq8R2rL2P3q6L1p3k5O8m7
4315d5Q8K6l7L2j05J8Nj7R5l4L5j3q3L4o7M5M8k9Q4o0k5np8P5j1K3O7p2L3n7l7
$$ plain form
4346 -67 -2 -52 34 31 19 55 -41 -22 -36 -51 34 5 50 48 -25 6 -47 -10 36 0 85 22 19 12 -57 4 -20 8 57 13 34 -22
4378 -22 -56 -15 -56 16 27 1 50 -40 -18 -45 -62 24 -13 50 42 -36 8 -73 -32 8 -14 70 13 12 7 -61 -4 -12 10 62 16 50
4410 50 -15 -47 -8 -45 24 38 20 50 -28 -21 -39 -65 9 -15 39 29 -36 -6 -87 -48 -7 -20 77 17 16 3 -80 -7 -30 6 65
4441 65 27 52 -8 -43 -20 -50 30 38 50 56 -25 -9 -44 -53 8 5 52 56 -14 12 -73 -49 -6 -16 64 16 19 -10 -79 -30 -62 -7 55
4474 55 15 56 -16 -48 -33 -73 7 19 40 68 -9 2 -39 -58 16 8 75 66 20 15 -59 -46 -19 -12 82 43 45 4 -62 -35 -58 -13 40
4507 40 18 65 -7 -39 -42 -93 -6 11 36 70 -11 -10 -58 -79 -22 -18 67 55 19 17 -62 -38 -26 -9 69 60 46 28 -53 -20 -68 -13 54
4540 54 21 73 -2 -31 -36 -79 -4 -4 31 69 13 3 -51 -73 -28 -33 46 45 29 27 -59 -43 -55 -32 52 39 60 30 -34 -20 -58 -11 26
4573 26 31 76 24 -1 -11 -66 -7 2 22 75 7 26 -30 -67 -13 -46 39 41 19 32 -52 -46 -44 -51 26 4 39 26 -22 -9 -49 -33 10
$$ packed form
4346f7O5n0Q6lj2L6r6J9j4j5Q5k9M5kp3L1n3L7M6l6Q5o3lpo9O1k4K8M9m4K1n6
4378b2l4M1m1P2J1k6M9r0K2k7j7Q6l7O3qp8M4q1M1M0k2Q4n7jno8N7qK2N2m6L4
4410E0o5l2L9l7O9J4j8L0p8Pj8k6P4k4N4j0o5L0q1L9M1j3R7o0jj3q3P3k3L6N9
4441F5l8K5o0l5K3l0Q0QJ2Oq1J6l5rO1lM7Mp0K6q5K4M3j0Q0m8Lk9o9M9l2N5O2
4474E5m0M1p2l2J5m0Q0J2K1K8p7J1m1j9P4qO7rm6np4J3K7PR4l9Km1o6K7k3M5N3
4507D0k2M7p2l2ln1Q7J7K5L4q1Jm8k1N7MQ5j2l6kp9K4J2J7P8rj4j8q1L3m8N5O7
4540E4l3N2p5k9nm3P5%L5L8n6j0n4k2M5nP9jj6kq6J6j2K3Q4j3K1l0o4J4l8M7L7
4573B6NM5n2k5j0n5N9RK0N3o8J9n6l7N4l3Q5Kk2J3q4OKpP7k2L5j3m8J3m0J6M3
$$ plain form
4606 10 13 59 23 8 -8 -43 -9 -11 16 54 20 35 -12 -41 -11 -38 21 25 20 40 -29 -4 -30 -34 19 -5 38 21 -19 11 -44 -37 -10
4639 -10 -12 40 1 10 -4 -55 -20 -25 -10 36 1 32 3 -25 2 -28 21 27 13 48 0 16 -1 -24 28 -10 22 28 -7 20 -17 -19 -8
4672 -8 -33 29 -1 15 9 -29 -4 -24 -19 6 -13 19 -3 -18 -3 -37 -5 -11 2 28 3 25 4 -11 8 -11 15 26 8 42 15 13 14
4705 14 -22 24 -1 7 34 -10 15 -25 -19 -10 -27 19 -7 -11 20 -25 -13 -12 -23 8 -8 15 5 -20 -14 -24 -14 -6 -3 27 9 1 14 -26 9
4740 9 9 17 34 7 32 7 -7 9 -14 24 20 18 31 -4 2 -13 -25 -9 -8 10 8 1 -2 -31 -29 -17 -19 20 0 4 1 -37 1 -20 -3 25 2
4777 2 24 0 -11 0 -25 12 11 15 28 -8 17 -11 -16 11 -11 21 17 10 10 -13 -10 -14 -20 16 9 14 8 -24 -13 -26 -20 13 -17 16 -3 -10 3 -30
4815 -30 -4 -12 -3 29 6 15 8 -5 12 -4 26 29 15 26 -6 8 3 -5 19 3 8 12 -14 -7 -16 -17 2 1 9 -3 -10 -9 -29 9 -8 -7 25 -6 -9
4854 -9 -12 -22 -5 -11 13 2 3 7 -22 -7 -3 -3 28 10 24 23 -2 21 -12 2 27 10 27 1 -2 3 -21 1 10 -4 7 5 -9 -16 -30 1 -14
$$ packed form
4606A0LM6l6j5j6l5L4kK7L8l4J5m7k9L0k7N9MnK0o9K5k6mN3k4M3j7m0L0n5PK7
4639a0kN2l9Rj4n1L5nJ5M6l5L1k9k8K7l0M9Oj4L5m8J6j7k3N2l8L2Ol5K7l7kJ1
4672hk5O2l0J6ol8K5k0NK5j9L2k2j5J5l4L2oJ3K6k5K2k1j5J9j9K6J1j8L4k7kJ
4705A4l6M6k5QK7m4K5m0ORj7M6k6mL1m5J2Jj1L1j6K3j0k5Oj0J0QLL0j8qJ3m0L5
4740I%QJ7k7K5k5j4J6k3L8mkJ3l5Oj5j2J6JJ8kplk9KJ2kL9k0Mll8L8k1J7K8k3
4777BK2k4j1J1k5L7jMJ3l6K5k8nK7k2L2mp%k3LmoL6pNol2J1j3OL3l0L3j9pJ3l3
4815c0K6qRL2k3Rpj3J7j6L0Lj4J1l2J4nqK4j6NMk6PrjJ9jQj2pJk0L8j7JL2l1l
4854ilj0J7oK4j1JMk9J5M%L1j8J4jk5K3l3J4K5j7J7k6lNk4K2Rj4J1kj4pj4L1j5
$$ plain form
4891 -14 6 7 -15 2 -24 -20 -19 -7 23 3 0 11 -10 1 -15 8 24 12 26 9 0 3 -13 12 5 9 18 7 5 -2 -13 2 -2 0 4 -9 1
4928 1 -18 -13 -18 -25 6 -5 -6 -11 -22 -8 -25 -13 11 -3 16 -9 -1 8 -28 2 5 10 28 4 7 1 -25 -1 -2 10 23 17 14 4 -4 -7 -6 11 20 18
4968 18 16 -23 -12 -21 -15 -2 -12 15 -15 -15 -14 -39 -9 -14 -8 14 0 12 -14 -29 -21 -7 15 20 20 17 7 -4 2 -16 20 12 22 20 2 -12 -13 -23
5006 -23 7 -6 24 10 1 -6 -38 -20 -21 -11 7 -15 10 -7 -27 -23 -23 -5 1 13 12 -7 -11 -23 -29 -5 13 20 19 6 -8 -13 -14 15 0 29 27
5043 27 21 16 -12 -12 -10 -5 21 6 12 10 -32 -26 -31 -11 -5 4 8 0 -13 -22 -31 -2 -5 7 24 4 7 -13 -10 -4 -10 13 26 1 17 -15 -9 -7 -6 18 21 32
5085 32 30 -11 -4 -12 -6 9 11 19 7 -8 -22 -23 -27 -13 -7 15 3 1 -22 -34 -29 -23 3 17 7 10 0 -13 -8 -7 10 20 27 17 4 3 -9 -15 16
5124 16 -1 31 18 -6 0 -29 -17 -7 3 28 9 4 -10 -15 -20 -13 2 -3 -2 5 -18 -28 -27 -27 -10 -1 8 3 -15 -8 -16 -15 -1 -1 14 18 9 9 -6 1 7
5165 7 15 23 20 18 11 -12 -13 -9 8 11 18 12 -10 -7 -20 -20 -2 6 2 9 -18 -7 -15 -8 -7 -15 7 -6 -9 -5 -10 -8 -9 4 14 10 8 3 0 8 0 16 23 21 28 6 5 -1
$$ packed form
4891a4K0Jk2J7k6MJJ2L0k0lJ1k1J1j6K3J6j2J4j7rLj6K5pMRj1kpj1J5mKMj3J0
4928Aj9NnpL1j1jnj1J4j7J2K4j4J9k5QRl6L0LNJ8k4Lok6K4jJ2J3olj0qlJJ7Rk
4968A8kl9J1rOJ3j0K7l0%Jk5L0nOK2j4J2k6j5QJ4K2N%lj0j1Oj8L6qJ0kj8j4jj0
5006b3L0j3L0j4rpl2J8jJ0J8k2K5j7k0M%J8OJ2jj9mj2oK4J8Pjj3j4njK9j5K9k
5043B7onk8%KNK6j5Okm2OnK0ORMqj3rrK9lJ2J7k0Lk0LOoK3J3k5J6l2OKJK4LJ1
5085C2km1PqOJ5KQj2j5j4jmJ4OK2j2kk3j2NOK6J4j0Lj0j3NJJ7J0Pj0j3jj2oL1
5124A6j7L2j3k4Ok9J2J0J0K5j9nj4nnPJ5nJPk3j0J%J7RRnj8PqJJ4%J5Mr%j5PO
5165GQQlkpk3jMJ7LPok2Lj3%J8QmPk7J1qPJqK2j3lMnKjJ3J0mknlQqJ6PkPk2jo
$$ plain form
5213 -1 -12 18 9 7 18 -1 -10 -18 -22 -18 -3 2 -4 2 -12 -21 -26 -9 -3 0 6 12 5 -16 -15 -16 14 12 2 14 7 -5 -5 -15 -4 7 8 24 8 8 -9 -6 -1
5256 -1 7 16 21 7 5 -9 -4 -4 -17 2 0 -7 4 -25 -21 -15 -17 3 -4 12 -6 -19 -16 -17 -7 5 3 24 9 8 -2 -8 7 8 21 28 14 18 -9 -9 -16 -4
5298 -4 16 18 20 13 1 -20 -21 -7 16 9 13 4 -5 -7 -21 -4 5 -3 14 -3 -8 -13 -39 -13 -13 -1 24 1 15 4 -7 1 -3 25 29 34 22 2 -5 -10 -9
5339 -9 16 19 16 18 3 -9 -41 -15 -8 2 21 8 1 -23 -37 -16 -10 -1 10 1 7 -16 -19 -18 -33 -4 8 17 18 -8 -6 -21 -18 7 5 34 29 12 3 -23
5379 -23 -10 1 11 30 25 18 6 -22 -23 -11 2 12 0 17 -18 -20 -35 -39 -11 0 22 20 -9 -13 -25 -31 -4 -1 15 14 3 -1 -21 -15 -14 -5 30
5416 30 16 24 16 -4 -5 -24 4 28 28 31 18 4 -7 -24 -3 12 13 22 -9 -2 -30 -34 -21 -12 3 0 3 -1 -34 -25 -18 -14 15 5 22 10 -15 -8 -19
5455 -19 -2 19 27 33 16 15 0 -22 -6 7 20 31 10 13 -9 -21 -1 -6 18 27 8 8 -17 -14 -10 -32 1 15 -2 -3 -22 -11 -22 -19 1 -11
5491 -11 23 3 -10 1 -17 2 16 22 25 19 10 3 1 2 -5 14 24 19 24 -22 -10 -19 -18 11 11 16 17 -6 -8 -25 -20 -9 0 17 9 -7 -13 -30 -2 -16
$$ packed form
5213aj1L0rkJ1j9rqmMJ5NoOj4rnJ7OLOOpk1JjL0kj0J2pj2%j0J1J1JJ6j6%j7LN
5256aQRNj4kj4N%j3J9kpJ1k9MOkK0pJ6j8j3LjJ0J2kK1j5jj0oJ5JJ3Pj4Mk7%pJ2
5298dK0KKpj2k1jJ4K3pMrrkj4J7RqJ7j7nnk6K6%J2K5k3J4j1j1QmK8MNj2k0pnJ
5339iK5LlKj5j2l2K6PJ0J9j3pk4j4K1ORJ1rOk3lJj5K9J2RJk6Kj5LK5kK9nj7rk6
5379b3J3J1J0J9npj2k8jJ2J3J0j2J7l5kj5mK8J1K2kk9mj2oK7LJ6jj1mk0OJRL5
5416C0j4Qqk0jj9K8K4%Lj3j4j1j7K1J5JRl1Pk8mJ3RJ5lLml3RPMK9j0J7j2k5Pj1
5455a9J7K1QOj7jj5k2J6J3J3J1k1Lk2j2K0nK4Rj9%k5LMk2L3J4j7jj9J1j1LK0j2
5491a1L4k0j3J1j8J9J4OLorpkJpJ9J0nNm6J2rJK9%NJk3kj7NJ1RJ7qj6oj7K8j4
$$ plain form
5531 -16 -1 25 -1 15 -9 -13 -7 -12 13 7 20 23 3 8 10 -10 29 14 18 27 8 9 -18 -7 15 6 18 5 -9 2 -22 3 -23 -9 8 -2
$$ packed form
5531a6J5K6k6J6k4mOnK5oJ3Lk0NKk0L9j5MRj9Jk7J1K2rJ2j3j4J1k4K5k6J4J7j0
$$ [...]
8191g
##END NTUPLES=NMR FID
##END=
