##TITLE=1H_LY-propal
 CDCl3,8 sc, 
 30.9.2021
##JCAMPDX= 6.0         $$ Bruker NMR JCAMP-DX V2.0
##DATA TYPE= NMR FID
##DATA CLASS= NTUPLES
##ORIGIN= UXNMR, Bruker Analytische Messtechnik GmbH
##OWNER= root
$$ XWIN-NMR		Version 3.5
$$ Thu Sep 30 11:55:36 2021 Russian Standard Time (UT+4h)  she@DPX200
##.OBSERVE FREQUENCY= 200.1313468511
##.OBSERVE NUCLEUS= ^1H
##.DELAY= (6, 6)
##.ACQUISITION MODE= SIMULTANEOUS
##.ACQUISITION SCHEME= undefined
##.AVERAGES= 8
##.DIGITISER RES= 18
##SPECTROMETER/DATA SYSTEM= spect
##.PULSE SEQUENCE= zg30
##.SOLVENT NAME= CDCl3
##.SHIFT REFERENCE= (INTERNAL, CDCl3, 0, 15.7039)
##AUDIT TRAIL= $$ (NUMBER, WHEN, WHO, WHERE, WHAT)
$$ ##TITLE= Audit trail, XWIN-NMR		Version 3.5
$$ ##JCAMPDX= 5.01
$$ ##ORIGIN= Bruker BioSpin GmbH
$$ ##OWNER= she
$$ F:/spectra/data/she/nmr/H-F/1/audita.txt
$$ ##AUDIT TRAIL=  $$ (NUMBER, WHEN, WHO, WHERE, WHAT)
(   1,<2021-09-30 11:54:29.73 +0400>,<she>,<DPX200>,
      <created by zg, POWCHK disabled, PULCHK disabled
       configuration hash MD5:
       00 E9 B6 7A A2 85 ED C7 34 08 36 98 17 FE 4E 26
       data hash MD5: 16K
       62 89 A4 07 A1 AF 4D 8C B0 BF A9 D5 D5 35 1C D0>)
$$ ##END=
$$ 
$$ hash MD5
$$ C6 AC 17 2D 1F 24 85 52 83 2B 12 FC 25 CE B2 68
##$RELAX= 
##$RELAX= 
##$RELAX= 
##$RELAX= 
##$RELAX= 
##$RELAX= 
$$ Bruker specific parameters
$$ --------------------------
##$DU= <F:/spectra>
##$EXPNO= 1
##$NAME= <H-F>
##$PROCNO= 1
##$TYPE= <nmr>
##$USER= <she>
##$AMP= (0..31)
100 100 100 100 100 100 100 100 100 100 100 100 100 100 100 100 100 100 
100 100 100 100 100 100 100 100 100 100 100 100 100 100 
##$AQSEQ= 0
##$AQ_mod= 1
##$AUNM= <au_zg>
##$AUTOPOS= <>
##$BF1= 200.13
##$BF2= 200.13
##$BF3= 200.13
##$BF4= 200.13
##$BF5= 200.13
##$BF6= 200.13
##$BF7= 200.13
##$BF8= 200.13
##$BYTORDA= 1
##$CFDGTYP= 0
##$CFRGTYP= 5
##$CHEMSTR= <none>
##$CNST= (0..31)
1 1 145 1 1 1 1 1 1 1 1 1 1 1 1 1 1 1 1 1 1 1 1 1 1 1 1 1 1 1 1 1 
##$CPDPRG= <>
##$CPDPRG1= <>
##$CPDPRG2= <>
##$CPDPRG3= <>
##$CPDPRG4= <mlev>
##$CPDPRG5= <mlev>
##$CPDPRG6= <mlev>
##$CPDPRG7= <mlev>
##$CPDPRG8= <mlev>
##$CPDPRGB= <>
##$CPDPRGT= <>
##$D= (0..31)
0 1.2 0 0 0 0 0 0 0 0.06 0 0.03 0 0 0 0 0.0002 0 0 0 0 0 0 0 0 0 0 0 0 
0 0 0 
##$DATE= 1632988469
##$DBL= (0..7)
120 120 120 120 120 120 120 120 
##$DBP= (0..7)
150 150 150 150 150 150 150 150 
##$DBP07= 0
##$DBPNAM0= <>
##$DBPNAM1= <>
##$DBPNAM2= <>
##$DBPNAM3= <>
##$DBPNAM4= <>
##$DBPNAM5= <>
##$DBPNAM6= <>
##$DBPNAM7= <>
##$DBPOAL= (0..7)
0.5 0.5 0.5 0.5 0.5 0.5 0.5 0.5 
##$DBPOFFS= (0..7)
0 0 0 0 0 0 0 0 
##$DE= 6
##$DECBNUC= <off>
##$DECIM= 32
##$DECNUC= <off>
##$DECSTAT= 4
##$DIGMOD= 1
##$DIGTYP= 9
##$DL= (0..7)
0 120 120 120 120 120 120 120 
##$DP= (0..7)
150 150 150 150 150 150 150 150 
##$DP07= 0
##$DPNAME0= <>
##$DPNAME1= <>
##$DPNAME2= <>
##$DPNAME3= <>
##$DPNAME4= <>
##$DPNAME5= <>
##$DPNAME6= <>
##$DPNAME7= <>
##$DPOAL= (0..7)
0.5 0.5 0.5 0.5 0.5 0.5 0.5 0.5 
##$DPOFFS= (0..7)
0 0 0 0 0 0 0 0 
##$DQDMODE= 0
##$DR= 18
##$DS= 0
##$DSLIST= <SSSSSSSSSSSSSSS>
$$ [...]
##$SUBNAM2= <"">
##$SUBNAM3= <"">
##$SUBNAM4= <"">
##$SUBNAM5= <"">
##$SUBNAM6= <"">
##$SUBNAM7= <"">
##$SUBNAM8= <"">
##$SUBNAM9= <"">
##$SW= 18.0517286264689
##$SWIBOX= (0..15)
0 0 2 0 0 0 0 0 0 0 0 0 0 0 0 0 
##$SW_h= 3612.71676300578
##$TD= 16384
##$TD0= 1
##$TE= 0
##$TE2= 300
##$TE3= 300
##$TEG= 300
##$TL= (0..7)
0 120 120 120 120 120 120 120 
##$TP= (0..7)
150 150 150 150 150 150 150 150 
##$TP07= 0
##$TPNAME0= <>
##$TPNAME1= <>
##$TPNAME2= <>
##$TPNAME3= <>
##$TPNAME4= <>
##$TPNAME5= <>
##$TPNAME6= <>
##$TPNAME7= <>
##$TPOAL= (0..7)
0.5 0.5 0.5 0.5 0.5 0.5 0.5 0.5 
##$TPOFFS= (0..7)
0 0 0 0 0 0 0 0 
##$TUNHIN= 0
##$TUNHOUT= 0
##$TUNXOUT= 0
##$USERA1= <user>
##$USERA2= <user>
##$USERA3= <user>
##$USERA4= <user>
##$USERA5= <user>
##$V9= 5
##$VALIST= <valist>
##$VCLIST= <CCCCCCCCCCCCCCC>
##$VD= 0
##$VDLIST= <DDDDDDDDDDDDDDD>
##$VPLIST= <PPPPPPPPPPPPPPP>
##$VTLIST= <TTTTTTTTTTTTTTT>
##$WBST= 1024
##$WBSW= 4
##$XGAIN= (0..3)
0 0 0 0 
##$XL= 0
##$YL= 0
##$YMAX_a= 412843
##$YMIN_a= -538948
##$ZGOPTNS= <>
##$ZL1= 120
##$ZL2= 120
##$ZL3= 120
##$ZL4= 120
##$ABSF1= 10
##$ABSF2= 0
##$ABSG= 5
##$ABSL= 3
##$ALPHA= 0
##$AQORDER= 0
##$ASSFAC= 0
##$ASSFACI= 0
##$ASSFACX= 0
##$ASSWID= 0
##$AUNMP= <proc_1d>
##$AZFE= 0.1
##$AZFW= 0.1
##$BCFW= 1
##$BC_mod= 2
##$BYTORDP= 1
##$COROFFS= 0
##$CY= 11.3945322036743
##$DATMOD= 1
##$DC= 2
##$DFILT= <>
##$DTYPP= 0
##$F1P= 2.36226072786647
##$F2P= -0.459571619588291
##$FCOR= 0.5
##$FTSIZE= 0
##$FT_mod= 4
##$GAMMA= 1
##$GB= 0.15
##$INTBC= 1
##$INTSCL= 1
##$ISEN= 128
##$LB= 0.24
##$LEV0= 0
##$LPBIN= 0
##$MAXI= 10000
##$MC2= 0
##$MEAN= 0
##$ME_mod= 0
##$MI= 1.114404
##$NCOEF= 0
##$NC_proc= 0
##$NLEV= 6
##$NOISF1= 3.799351
##$NOISF2= 2.8
##$NSP= 1
##$NTH_PI= 0
##$NZP= 0
##$OFFSET= 15.70392
##$PC= 1
##$PHC0= -14591.84
##$PHC1= 10.40085
##$PH_mod= 1
##$PKNL= yes
##$PPARMOD= 0
##$PSCAL= 0
##$PSIGN= 0
##$REVERSE= no
##$SF= 200.130013532006
##$SI= 16384
##$SIGF1= 3
##$SIGF2= 2
##$SINO= 400
##$SIOLD= 16384
##$SREGLST= <1H.CDCl3>
##$SSB= 0
##$STSI= 0
##$STSR= 0
##$SW_p= 3612.71676300578
##$SYMM= 0
##$S_DEV= 0
##$TDeff= 0
##$TDoff= 0
##$TI= <>
##$TILT= no
##$TM1= 0
##$TM2= 0
##$TOPLEV= 0
##$USERP1= <user>
##$USERP2= <user>
##$USERP3= <user>
##$USERP4= <user>
##$USERP5= <user>
##$WDW= 1
##$XDIM= 8192
##$YMAX_p= 0
##$YMIN_p= 0
$$ End of Bruker specific parameters
$$ ---------------------------------
##NTUPLES= NMR FID
##VAR_NAME=  TIME,          FID/REAL,        FID/IMAG
##SYMBOL=    X,             R,               I
##VAR_TYPE=  INDEPENDENT,   DEPENDENT,       DEPENDENT
##VAR_FORM=  AFFN,          ASDF,            ASDF
##VAR_DIM=   8192,          8192,            8192
##UNITS=     SECONDS,       ARBITRARY UNITS, ARBITRARY UNITS
##FACTOR=    0.0002768,     1,               1
##FIRST=     0,             0,               0
##LAST=      2.2672688,     0,               0
##MIN=       0,             -538948,         0
##MAX=       2.2672688,     412843,          0
$$ Real data points
##PAGE= N=1
##DATA TABLE= (X++(R..R)), XYDATA
$$ [...]
2798c496j091n14L62O33J87K45J205J995J577N46L04R83J531J348M96n08j296
$$ -3496 -4587 -5101 -4739 -4106 -3919 -3674 -2469 -474 1103 1649 1953 2936 4467 5815 6311 5803 4507
2815D507j683j450p61p62j441j921j301m11p0j66J99J390J861J310K63J57R85
$$ 4507 2824 1374 613 -149 -1590 -3511 -4812 -5223 -5293 -5459 -5260 -3870 -2009 -699 -436 -279 706
2832G06J722J802J381M29p47j280r17m0j40j235k189j740j225j106j060l03J054
$$ 706 2428 4230 5611 6040 5293 4013 3096 3056 2916 1681 -508 -2248 -3473 -4579 -5639 -5942 -4888
2849d888J466Q99K35J90P53J510K088K022R28m98j118n25N49N43p16j567j594
$$ -4888 -3422 -2523 -2288 -2098 -1345 165 2253 4275 5203 4705 3587 3062 3611 4154 3438 1871 277
2866B77j375j686j515p41L92P81M66K6J5L74J180K180K530J437k16r60k17Q12
$$ 277 -1098 -2784 -4299 -5040 -4648 -3867 -3401 -3375 -3360 -2986 -1806 374 2904 4341 4125 3165 2948 3760
2884C760O92k42r38j039j382j712j818j124j84J07m2j34k66j10N37K080K862J878
$$ 3760 4452 4210 3272 2233 851 -861 -2679 -3803 -3987 -3880 -3922 -4056 -4322 -4432 -3895 -1815 1047 2925
2902B925K33n46K21R78Q23O9m24n68j073j612j631j150p57n26l78l26n55r35k13
$$ 2925 3158 2612 2833 3811 4634 4703 4279 3711 2638 1026 -605 -1755 -2512 -3038 -3416 -3742 -4297 -5232 -5445
2921e445J486K487J980N96J26O98J260R29M61J22j49o90j215j225j075j275r38
$$ -5445 -3959 -1472 508 1104 1230 1928 3188 4117 4578 4700 4551 3861 2646 1421 346 -929 -1867
2938a867m58k68q00j366r45P74J837J454N65N41J020J399J086Q60O39K20k40n44
$$ -1867 -2325 -2593 -3393 -4759 -5704 -4930 -3093 -1639 -1074 -533 487 1886 2972 3832 4471 4691 4451 3907
2956C907n40j088j584j498n27j64q56j675j231K7J075P57N00P35J180J285J082
$$ 3907 3367 2279 695 -803 -1330 -1494 -2350 -4025 -5256 -5229 -4154 -3397 -2897 -2162 -982 303 1385
2973A385J176J036N36K00M62K00p32j721j701n71j85r76j715j532m89L2nK73O49
$$ 1385 2561 3597 4133 4333 4795 4995 4263 2542 841 270 85 -891 -2606 -4138 -4627 -4595 -4600 -4327 -3678
2992c678J008R59J184J364J077O17P57J242J123j68j502j430o12j06r01j557j515
$$ -3678 -2670 -1711 -527 837 1914 2531 3288 4530 5653 5485 3983 2553 1941 1835 934 -623 -2138
3009b138j025q44p02j13M13M84P05J051J204Q69M25R54J934J873M05r44j028l06
$$ -2138 -3163 -4007 -4709 -4822 -4409 -3925 -3220 -2169 -965 -96 329 1283 3217 5090 5495 4551 3523 3217
3027C217j33n08j101j195j373j556j203m82j92m6K81R71J068L96J30Q84K251K179
$$ 3217 3084 2576 1475 280 -1093 -2649 -3852 -4334 -4526 -4572 -4291 -3320 -2252 -1856 -1726 -842 1409 3588
3045C588J007k71l99o7o9j85m38o81j463j749j415q23q42p25j31P08P72l5l58
$$ 3588 4595 4324 3925 3858 3789 3604 3166 2485 1022 -727 -2142 -2965 -3807 -4532 -4663 -3955 -3183 -3218 -3576
3064c576P26K128K295J390N16K17K9R2K62K24l29j150j538j199j070j359j391
$$ -3576 -2850 -722 1573 2963 3479 3696 3725 3817 4079 4303 3974 2824 1286 87 -983 -2342 -3733
3081c733m73M75M04n32p06K21J495J996J618J181O87L08K57O64Q06J41q99j009
$$ -3733 -4206 -3731 -3327 -3859 -4565 -4344 -2849 -853 765 1946 2633 2941 3198 3862 4668 4809 3910 2901
3099B901q26r47j724j754p47J12N5p35r47k85O69J273J520J539J032M35M56J075
$$ 2901 2075 1128 -596 -2350 -3097 -2985 -2930 -3665 -4612 -4897 -4228 -2955 -1435 104 1136 1571 2027 3102
3117C102J136M66l78l15j58o47j821j950j095j58k58q87j058p70j99N37J237J556
$$ 3102 4238 4704 4326 4011 3853 3206 1385 -565 -1660 -1818 -2076 -2963 -4021 -4791 -4990 -4453 -3216 -1660
3135a660J066L63P00J298J337O54J35L98N05k03j425j746j194m84n51p68j068
$$ -1660 -594 -231 469 1767 3104 3758 3893 4291 4796 4593 3168 1422 228 -256 -807 -1575 -2643
3152b643j225r74l04Q70J272P49M05O71J406J322P14L90J039J100L81q71j229
$$ -2643 -3868 -4842 -5146 -4276 -3004 -2255 -1850 -1179 227 1549 2263 2653 3692 4792 5173 4302 3073
3169C073j114p84o26n28q67j499j618q92L20O91L19K48P29J409J029O48O13J348
$$ 3073 1959 1175 549 21 -846 -2345 -3963 -4855 -4535 -3844 -3525 -3277 -2548 -1139 -110 538 1151 2499
3187B499J460Q23l6o17q51r49m89j99n64j572k000j245k01L0k04j99P25J083Q96
$$ 2499 3959 4782 4746 4129 3278 2329 1840 1641 1077 -495 -2495 -3740 -3941 -3911 -4115 -4314 -3589 -2506 -1610
3206a610L99O73J345J559J336P47J47o27q16l71K03k26j400j903j463o31n75q21
$$ -1610 -1211 -538 807 2366 3702 4449 4596 3969 3153 2782 2985 2759 1359 -544 -2007 -2638 -3213 -4034
3224d034m89L42P34N15L04M58J064J394J623J559P15k42n61n8N60J45j026j610
$$ -4034 -4523 -4181 -3447 -2932 -2628 -2170 -1106 288 1911 3470 4185 3943 3382 3324 3884 4029 3003 1393
3242A393j228q88j067j295q32k4J00K23N0J95M88Q96J648K012J321J84k41K75
$$ 1393 165 -723 -1790 -3085 -3917 -3941 -3841 -3618 -3568 -3373 -2885 -1989 -341 1671 2992 3176 2935 3210
3260C210R37K77m54r48r10q58j363j372j177n78l18j30n4o0k17K45J401K136J507
$$ 3210 4147 4424 3970 3022 2112 1254 -109 -1481 -2658 -3236 -3554 -3684 -3738 -3798 -4015 -3770 -2369 -233 1274
3279A274N34J20O96J038O03ll65k96p06j127j415j283j084p24l32j30m20p50l45
$$ 1274 1808 1928 2624 3662 4265 4262 3897 3601 2895 1768 353 -930 -2014 -2738 -3070 -3200 -3620 -4370 -4715
3298d715Q44J807J524O97M12R24J067Q74M54K83M4k31p33r98j273j361j113m41
$$ -4715 -3871 -2064 -540 157 569 1493 2560 3434 3888 4171 4215 3984 3251 2253 980 -381 -1494 -1935
3316a935j57p33j330q76L10J206J185P14O69R62J002J009Q81P10N26J31j11l70
$$ -1935 -2092 -2825 -4155 -5031 -4721 -3515 -2330 -1616 -947 15 1017 2026 2907 3617 4143 4274 4163 3793
3334C793j021j414j307m73k53q69j606j287k88N54O68N56O16O79R85R80J131R79
$$ 3793 2772 1358 51 -422 -675 -1544 -3150 -4437 -4725 -4171 -3503 -2947 -2331 -1652 -667 313 1444 2423
3352B423P16N65N78L03o07j320j163l29k27q39j633j553p80j70L2K02M39M43O95
$$ 2423 3139 3704 4282 4585 3978 2658 1495 1166 939 100 -1533 -3086 -3866 -4036 -4004 -3802 -3363 -2920 -2225
3371b225R88J203R36P41Q58J212R66j09r81q72l04q6o94j397j504j208q57m22
$$ -2225 -1237 -34 902 1643 2501 3713 4679 4570 3589 2717 2413 2327 1633 236 -1268 -2476 -3333 -3755
3389c755j21o3P7L54R03J081Q24M81J040J535J484M65l59n46j18q1l33r07j252
$$ -3755 -3876 -3939 -3862 -3508 -2605 -1524 -700 -219 821 2356 3840 4305 3946 3400 3282 3201 2868 1961 709
3408G09j299j192r14n00n02l68P4O35Q22M52J97P67J702J717J000J99j52R4J88
$$ 709 -590 -1782 -2696 -3196 -3698 -4066 -3992 -3357 -2535 -2083 -1886 -1119 583 2300 3300 3499 3347 3441 3629
3427C629n2l72q30j216j284r79r00q67q87k98L98N57J06j52M98J489J749J342
$$ 3629 3577 3205 2375 1159 -125 -1104 -2004 -2871 -3758 -4056 -3658 -3101 -2995 -3147 -2649 -1160 589 1931
3445A931O76K68K09L64L47J99l65r01j146r27r76j295j216p23Q6J99k76m40R1
$$ 1931 2607 2875 3084 3448 3795 3994 3629 2728 1582 655 -321 -1616 -2832 -3555 -3469 -3270 -3546 -3986 -3895
3464c895R57J578J525J135O28L94M55Q27P25J4m96p55n93r55j380j524r16l08
$$ -3895 -2938 -1360 165 1300 1928 2322 2777 3604 4329 4343 3847 3092 2499 1544 164 -1360 -2276 -2584
3482b584k04o17q32m06M19J004J414J281O88N42O65J217J029N19r4j71j60n55
$$ -2584 -2788 -3405 -4237 -4643 -4224 -3220 -1806 -525 163 705 1370 2587 3616 4135 4041 3870 3710 3155
3500C155j156j342j116n79m76q11j074q85l28M22J101J047P04L38P85J315J224
$$ 3155 1999 657 -459 -1038 -1514 -2325 -3399 -4284 -4612 -4190 -3089 -2042 -1338 -1000 -215 1100 2324
3517B324Q53L25J99L49q0p68j084j016o96n02q46j102j280r16n3N41O95M19J70
$$ 2324 3177 3502 3701 4050 3970 3202 2118 1102 406 -96 -942 -2044 -3324 -4240 -4293 -3752 -3057 -2638 -2468
3536b468P04J290J321J014O32O39O99L65j84o48p77p79n78o25j040j439j262o77
$$ -2468 -1764 -474 847 1861 2493 3132 3831 4196 4012 3364 2587 1808 1230 605 -435 -1874 -3136 -3813
3554c813J19K66r7r4M59J051J253R90P53Q33R77Q77M51r7m76n56l78l13q54j411
$$ -3813 -3694 -3428 -3525 -3619 -3160 -2109 -856 134 887 1720 2697 3574 4025 3928 3452 2896 2518 2205 1351 -60
3574f0j409q78m14k43n27m04Q9O52R69Q23O03P59J074J223R84L70j10m12j16p5
$$ -60 -1469 -2347 -2761 -3004 -3531 -3935 -3846 -3194 -2225 -1402 -799 -40 1034 2257 3241 3611 3501 3089 2973 2898
3594B898m06j081j282r46o25n84p21p21l47L43O37N30L64M99R13J324J368Q32
$$ 2898 2492 1411 129 -817 -1442 -2026 -2747 -3468 -3815 -3472 -2835 -2305 -1941 -1442 -529 795 2163 2995
3612B995K00K4J5K85j60p55j133j000p97p64r62r90n57p6M21L07J67J84O41J264
$$ 2995 3195 3219 3234 3519 3359 2604 1471 471 -326 -1090 -2052 -3042 -3599 -3675 -3254 -2947 -2780 -2596 -1955 -691
3632f91J491J114M69L19L96O10K56j71p54q13p96q79j110j255j076n39n9K3j18
$$ -691 800 1914 2383 2702 3098 3708 3964 3793 3039 2226 1430 551 -559 -1814 -2890 -3429 -3488 -3465 -3583
3651c583j29K76J003J444J296P76M33O36Q89P53J34j83m46m51n79q95j204j281
$$ -3583 -3712 -3436 -2433 -989 307 1083 1516 2152 3041 3794 3928 3745 3299 2848 2269 1374 170 -1111
3669a111q74m53l67n20p00k39M89J122J204P65O64P43J030J128O32J90r5j76k67
$$ -1111 -1985 -2438 -2805 -3325 -4025 -4264 -3775 -2653 -1449 -684 -20 723 1753 2881 3513 3703 3608 3432 3165
3688C165n27r92j241r90o38l74p69q98p23L0N88P63O33M17O28J069J273J074M76
$$ 3165 2638 1646 405 -585 -1223 -1597 -2366 -3264 -3987 -3957 -3369 -2606 -1973 -1556 -928 141 1414 2488 2964
3707B964L05K61J98r4p01j040r87p09o07p57j165j098m15J81M95L42J98M57R24
$$ 2964 3269 3530 3728 3634 2933 1893 906 197 -410 -1167 -2332 -3430 -3845 -3664 -3169 -2827 -2629 -2172 -1248
3726a248J295J094P16M85N24O15L27j35o51r08n88n15p37j197j220r08k58K4L6
$$ -1248 47 1141 1857 2342 2866 3481 3808 3673 3022 2114 1526 1011 274 -923 -2143 -3051 -3309 -3285 -3249
3745c249r8R9O16J114J173P97P22O53R20P92L13k35o12l67l68n48j081j316j169
$$ -3249 -3347 -3248 -2632 -1518 -345 452 1174 1827 2747 3539 3852 3617 3005 2638 2270 1722 641 -675 -1844
3764a844o14k64l22l99l45K78Q05J041P09O05P03R80J067P89K09j24p5Pk11p47
$$ -1844 -2458 -2722 -3044 -3443 -3788 -3510 -2705 -1664 -955 -350 353 1333 2400 3189 3398 3274 3199 3206 2995 2248
3784B248j146j219q77n33o50q00p26k38M09O56O39M76O56J019J255J015M83K16
$$ 2248 1102 -117 -994 -1527 -2177 -2977 -3703 -3941 -3532 -2876 -2237 -1761 -1105 -86 1169 2184 2667 2883
3802B883J72L15R1m07q19r58p68n20o29j012j032o56j17K03J97J52L04P69J168
$$ 2883 3055 3370 3461 3054 2235 1277 509 -11 -640 -1652 -2684 -3340 -3457 -3254 -3057 -2905 -2601 -1832 -664
3821f64J241Q67N65N03O12N90N4n42q33p96n09n49r73j168r72l76LL6j14J4L71
$$ -664 577 1444 2009 2512 3124 3714 3768 3226 2393 1597 1088 539 -434 -1602 -2574 -2950 -2947 -2911 -3025 -3011 -2640
3842b640P89J019Q11N44O36Q61R64N69m2m10l50l08l62q35j342j283p86l92l22
$$ -2640 -1851 -832 -21 523 1159 2020 2984 3553 3511 3101 2751 2443 2081 1246 -96 -1379 -2165 -2557 -2879
3861b879l90k46J07O39R20P90N52O22Q78J072P73L00k11j22J40j4m26r92j110
$$ -2879 -3269 -3515 -3408 -2769 -1849 -1059 -507 115 993 2065 2838 3138 2927 2805 2945 2931 2505 1513 403
3880D03r36o01n87p43p96m36J27N26N30M54N46R62J323J150O75J34J04K19K96
$$ 403 -533 -1134 -1721 -2464 -3260 -3696 -3569 -3043 -2513 -2059 -1513 -551 772 1922 2597 2731 2835 3054 3350
3899C350j42o64j031q95o72m88p93q76o86l62K24J61K7J98O01J160J221Q43M57
$$ 3350 3208 2544 1513 618 -54 -542 -1335 -2211 -2897 -3259 -3035 -2874 -2847 -2649 -2048 -888 333 1176 1633
3918A633L74O87O18L73k47o43q43o82n35q26j048j030n46j56j0k10j98L15R23
$$ 1633 2007 2694 3312 3685 3438 2795 1952 1270 735 -91 -1139 -2169 -2715 -2871 -2881 -3091 -3289 -2974 -2051
3937b051J053R26N98M59O63Q53P34K45k74m66l31m29o37j071j157p29l54l59n12
$$ -2051 -998 -72 526 985 1648 2501 3235 3480 3206 2740 2409 1980 1343 272 -885 -1614 -1968 -2327 -2839
3956b839o06j18M39Q37Q84O05M97P10J022R77O66J24p0n0j14m99r50j177p51m72
$$ -2839 -3445 -3563 -3124 -2287 -1403 -798 -301 409 1431 2408 3074 3198 3128 3078 2964 2465 1515 338 -413 -885
3976h85n31o83q30n45RN31P20M79L11N30Q54J029R04M65L22K78L65p2n38q82q25
$$ -885 -1416 -2099 -2929 -3474 -3465 -2934 -2214 -1735 -1424 -894 -40 989 1893 2358 2680 2958 3323 3251 2713 1831 1006
3997A006m64n62q61j124r77n22J50L60M25K02L83P48J105J029O45M20N84M64K28
$$ 1006 542 -20 -881 -2005 -2982 -3504 -3354 -2994 -2569 -2367 -1984 -1236 -131 898 1543 1963 2547 3011 3239
4016C239l11n59n73k93k79o15r96j205q29l53K7r3j50m3M36Q63R76P99P50Q97
$$ 3239 2928 2369 1796 1503 1224 609 -387 -1592 -2421 -2774 -2747 -2840 -2990 -3033 -2597 -1734 -758 41 791 1688
4036A688R30P07J09l74m00l60k39m94q94j248j039m57j10j11l77l19J23M61O49
$$ 1688 2618 3325 3434 3060 2660 2300 2061 1567 673 -575 -1614 -2071 -2181 -2292 -2669 -2988 -2865 -2404 -1755
4055a755M54N00Q21R76R96O49J63J21k0J38j4o93j160j290q64m96m84p00n63q9
$$ -1755 -1301 -801 20 996 1992 2641 2804 2925 2905 3043 3029 2336 1176 -114 -978 -1474 -1958 -2658 -3221 -3310
4075c310M33N18L62M11O77Q79R40Q18L42R7J59M04L86j45o54q86p64m61o82r19
$$ -3310 -2877 -2359 -1997 -1586 -909 -30 910 1728 2070 2167 2326 2730 3116 2971 2317 1431 667 206 -476 -1395
4095a395j024n00o8M4J8J26L70Q25J170J159Q55K81J91N05M62K04m25o97m82m59
$$ -1395 -2419 -2919 -2987 -2943 -2925 -2799 -2429 -1604 -434 725 1580 1861 2052 2557 3019 3223 2798 2101 1619 1160
4115A160o89r87q41n79k65j58k37l02k46K77Q55J243Q71M39M03O77R47N47K03
$$ 1160 471 -516 -1357 -1936 -2201 -2359 -2596 -2898 -3144 -2867 -2012 -769 102 541 944 1621 2568 3115 3318
4134C318k60k26m49p03r84j005p47m56k86l92n97n80l9O31J093Q51M18K42N72
$$ 3318 3058 2832 2383 1680 696 -309 -1056 -1512 -1798 -2190 -2787 -3367 -3406 -2775 -1682 -831 -413 -171 401
4153D01R27Q50M38L47J90j31m61o85q46p88o17k49m27r22j152n38K68R17P22L08
$$ 401 1328 2178 2616 2963 3153 3022 2561 1876 1030 242 -375 -624 -1051 -1973 -3125 -3663 -3395 -2478 -1756 -1448
4173a448K34N09Q22Q23Q60P45M73J85o7m83o20p38n48k78l81j010j417r41k7N17
$$ -1448 -1214 -705 117 940 1800 2545 3018 3203 3136 2653 2033 1295 747 469 88 -922 -2339 -3280 -3307 -2790
4193b790N17J46J20K91M85P80R78R25O62M33K68J49k73l79k76m0k22j087j593
$$ -2790 -2273 -2127 -2007 -1716 -1231 -451 527 1452 2114 2547 2815 2964 2691 2312 2036 1996 1774 687 -906
4212i06j323n12p4P5j5l6J33K73Q31J001J014O16M96O32M11j14l48JL27O4o01
$$ -906 -2229 -2741 -2815 -2740 -2755 -2791 -2658 -2385 -1554 -553 461 1077 1573 2205 2616 2502 2154 2155 2482 2546 1945
4233A945j213j083o39l56l91l57n17m73j55M55Q30Q00O81Q12J040P84J97j11L3
$$ 1945 732 -351 -990 -1346 -1737 -2094 -2611 -3084 -3239 -2784 -1954 -1154 -473 339 1379 2163 2360 2249 2282
4252B282K98J33n01r48q68o86m63j98k84n20o31k94J39N52K47J70N36R59J019
$$ 2282 2580 2713 2212 1264 396 -290 -753 -951 -1235 -1755 -2386 -2680 -2541 -1989 -1742 -1572 -1036 -77 942
4271I42M83L53L32N96L07j60m58p08q11o98n29n69p57q55m11K49M06J26n8L40
$$ 942 1425 1778 2110 2706 3013 2853 2395 1687 876 178 -351 -920 -1677 -2532 -2943 -2694 -2288 -2162 -2220 -1880
4291a880J001R85O90M23L79M06M04K50K05k50m97n90l85o24r56j142n58j54j3
$$ -1880 -879 106 796 1219 1598 2004 2408 2658 2863 2613 2116 1526 1141 517 -439 -1581 -2139 -2293 -2306
4310b306m39n32O8P20J071Q77Q11O05N45L72N74N11Q4k01l75k81n25j074j030
$$ -2306 -2745 -3277 -3209 -2489 -1418 -541 270 875 1420 1792 2366 2877 2961 2760 2385 2104 1579 505 -525
4329e25m65o7k07p21q21m84J94N23Q47P62M90K77M28R65R16O54J67R2%n65j012
$$ -525 -990 -1057 -1264 -1985 -2806 -3290 -3096 -2573 -1726 -964 -474 -197 231 1196 2112 2766 2933 3025 3025 2460 1448
4350A448r77m39o1l35q15j035p17k97K78P84P39L67q1J86Q56J032Q22M97M85L21
$$ 1448 471 32 -29 -364 -1179 -2214 -2931 -3228 -2950 -2166 -1427 -1060 -1141 -955 -99 933 1755 2252 2737 3058
4370C058k04p95o64k60j3l22q56j030j158p69J1M97O62P8k59J13P44J041Q12P51
$$ 3058 2854 2059 1395 1135 1122 800 -56 -1086 -2244 -3013 -3002 -2505 -1843 -1765 -2024 -1911 -1167 -126 686 1437
4390A437Q29N32J3l53m75o8%k08n96r85j335j042l58L58M13j42m50p4N48O37P38
$$ 1437 2266 2798 2811 2458 1983 1915 1915 1707 1111 126 -1209 -2251 -2609 -2251 -1838 -1980 -2430 -2504 -1956 -1319 -581
4411e81P50R06Q22K53k3O2J46J42P3k38p80j300j341o78R0j4m50n83o9K70N22
$$ -581 169 1075 1897 2150 2127 2189 2335 2477 2550 2312 1532 232 -1109 -1787 -1697 -1711 -2161 -2744 -2813 -2543 -2021
4432b021N36P46Q96P47M73L16K20J90J44K04K57l04r99j170n85j14k40p93p87
$$ -2021 -1485 -739 157 904 1377 1693 1913 2103 2247 2451 2708 2404 1405 235 -350 -464 -704 -1497 -2284
4451b284l81j23LK50M80P51P67P64P83O53K60J88M16M48p2q68q88m84l38m24o71
$$ -2284 -2665 -2788 -2785 -2535 -2055 -1304 -537 227 1010 1663 1923 2111 2527 2975 2903 2035 1147 663 325 -99 -770
4472g70o24m66k63j86o0J52R9K81O56R47O40L44L75P21Q35L83k88m78l72l65p15
$$ -770 -1394 -1860 -2123 -2309 -2369 -2217 -2118 -1837 -1181 -234 406 750 1125 1846 2681 3064 2776 2298 1926 1561 846
4493H46r12p63n75m61k82q1o3j54J31N46R32O74J88J60O00P62N60K71Q5Q5j62
$$ 846 -66 -829 -1404 -1865 -2147 -2228 -2291 -2445 -2314 -1768 -836 -162 26 186 786 1548 2108 2379 2464 2549 2387
4514B387n38o62o44p26o00m85m61m57p62k78N47J006P53K50J59O49P00O11M51
$$ 2387 1849 1187 543 -183 -783 -1268 -1729 -2186 -2948 -3226 -2679 -1673 -920 -670 -511 138 838 1449 1900
4533A900L87L21n6l64l91m20o05n69k91l83q02j078p10J77O47N16J28K42M43N97
$$ 1900 2287 2608 2552 2188 1797 1377 772 203 -88 -471 -1273 -2351 -3061 -2884 -2237 -1721 -1593 -1351 -908 -311
4553c11O30P61P85M97J81j01j31k85n32m64j33k32q75j317r80k06K96K78N3J64
$$ -311 319 1080 1865 2362 2543 2442 2311 2026 1494 1030 897 665 -210 -1527 -2507 -2713 -2417 -2139 -2086 -1922
4573a922K41M23N80Q08Q55O67K92K71K01j67n25j54Q6l3p02j199j069m83j50j54
$$ -1922 -1681 -1258 -678 130 985 1652 1944 2215 2416 2249 1724 1570 1656 1623 921 -278 -1347 -1830 -1980 -2134
4593b134q7j3j1J5M97P96Q78O96N55P17M52n1l81j35K68J16n59q48r34o29m87
$$ -2134 -2221 -2234 -2245 -2230 -1733 -937 -59 637 1192 1909 2361 2310 1929 1794 2062 2178 1619 771 -163 -792 -1279
4614a279l40j33k53l53k22J93N84N71M38O80J018P96J97n7J9M21K41j58n64p57
$$ -1279 -1619 -1752 -2005 -2358 -2580 -2387 -1803 -1232 -794 -114 904 1700 1897 1840 1859 2280 2521 2363 1799 1042
4634A042q09o71m93j95l93n77l09l7K35J78K15O48J150Q90L67M0K29M30L99J29
$$ 1042 233 -438 -931 -1126 -1519 -2096 -2405 -2442 -2207 -2029 -1814 -1166 -16 874 1241 1281 1510 1940 2339 2468
4654B468j05l80p69q01m49k27m87o58m40k16j18k41k00M20R88Q97N77L45L42N50
$$ 2468 2363 1983 1214 413 -36 -263 -750 -1408 -1848 -2064 -2182 -2423 -2623 -2203 -1215 -318 259 604 946 1496
4674A496M92M89L35k24o83p44m45l49n12o23l83j88k79n80m41J11N92O76M59L60
$$ 1496 1988 2477 2812 2588 1905 1161 716 367 -145 -768 -1151 -1339 -1618 -2198 -2639 -2528 -1936 -1260 -801 -441
4694d41L90L50O27Q96Q20J79l57m03k57l57o90o79n65k78m62p43n10j35L29M64
$$ -441 -51 299 926 1822 2642 2821 2464 2061 1804 1447 757 78 -487 -765 -1227 -1970 -2480 -2615 -2286 -1822
4714a822N35L92J81J61M28J001R33M14K4p7P8j03m92m84n08l59n61q79p80m41
$$ -1822 -1287 -895 -714 -553 -125 876 1809 2223 2247 2170 2248 2145 1653 1169 661 302 -259 -1138 -1918 -2359
4734b359q5J52L59L59J48P0M37R48R33N38J79K09L42Q5l54k94k53k71n68o19p44
$$ -2359 -2444 -2292 -1933 -1574 -1426 -1356 -919 29 962 1500 1679 1888 2230 2315 1961 1667 1414 1143 575 -44 -788
4755g88p31n22j77J57J69n1j24L21Q46Q14N19N04N13M98K63kj37j22k30m05m54
$$ -788 -1519 -2041 -2218 -2061 -1892 -1943 -2067 -1746 -900 -86 433 937 1450 1948 2211 2209 2072 1950 1720 1315 861
4776H61n73q38p79m07k9r8k35k15K33M67N55M23M45P13P28M68K83J51p4j56o8
$$ 861 288 -550 -1329 -1736 -1765 -1863 -2098 -2313 -2080 -1613 -1058 -635 -190 523 1251 1719 2002 2153 2079 1923 1855
4797A855j76m12o97q89n70k91k72m80l09J3L04J71K32L02O71P71P09O33L09J13
$$ 1855 1679 1267 570 -319 -889 -1180 -1452 -1932 -2241 -2228 -1924 -1753 -1521 -1219 -548 223 932 1565 1874 1987
4817A987q9N6K33j32n55q49o40m98m86n35l01r9J6p7n0J13M98N73Q17P52M68J98
$$ 1987 1898 1954 2187 2055 1500 651 11 -487 -973 -1508 -1809 -1908 -1892 -1969 -2019 -1906 -1408 -835 -18 734 1202 1400
4839A400O5L25N10K79k86o50o30n54o69n71m70k74j65l12k11q2J65N25P68Q24
$$ 1400 1465 1790 2300 2579 2293 1643 1013 459 -210 -781 -1251 -1525 -1690 -2002 -2213 -2295 -2130 -1605 -837 -13
4859a3N15R7J3N40P47N45K7k39l55m96o10n39m86m01m08n43m95k75j64J99P40
$$ -13 502 599 612 1152 1899 2444 2471 2232 1877 1381 771 232 -254 -655 -1063 -1606 -2101 -2376 -2540 -2341 -1601
4880a601P78M78P9M8N19Q50O70L78J12j43l14m22k95l26l60n40n80n60o17n64
$$ -1601 -823 -345 -266 -218 301 1151 1821 2199 2311 2168 1854 1432 1137 811 451 -89 -669 -1229 -1846 -2410
4900b410l3M70N44L89k5J16M44P17P84N91L45J4j04j21j00j93l08m58n20n24p98
$$ -2410 -2443 -1973 -1429 -1040 -1065 -949 -505 212 996 1587 1932 1946 1842 1721 1621 1428 1120 662 142 -382 -1180
4921a180o55l68J93L90K20o1KM65O40P26O96L80J24P0R5R2n8k46l07l08n03o89
$$ -1180 -1835 -2203 -2010 -1620 -1400 -1461 -1459 -994 -354 372 1068 1448 1572 1642 1737 1829 1771 1525 1218 910 407 -282
4943b82p93n60j03l2m1j40k3K27N20P21P27N87L66J93L21K40P6j23k42k17k80
$$ -282 -1075 -1635 -1738 -1770 -1811 -1951 -1974 -1747 -1227 -506 221 808 1174 1367 1688 1928 2004 1881 1639 1422 1142
4964A142n38p09o41k85l46l05k57k13j06L01N36N73N17M91M79N48N86K08L2j12
$$ 1142 604 -105 -746 -1031 -1377 -1682 -1939 -2152 -2258 -1957 -1421 -848 -331 160 639 1187 1773 1981 2013 1901
4984A901n5j19l92n60n37m41m49l97m21l22k38p1K38L03K89K48N62P62P44M89
$$ 1901 1846 1727 1335 775 238 -203 -652 -1049 -1470 -1792 -2030 -2101 -1863 -1560 -1271 -1023 -461 301 1045 1534
5004A534J25Q4J46J13j24l28m31n87m65n13m27m33l69j67kL3oJ31M26P06P36N22
$$ 1534 1659 1743 1889 2002 1878 1550 1119 532 67 -446 -873 -1306 -1675 -1842 -1844 -1811 -1817 -1686 -1260 -554 182 704
5026G04L16K90K13L60J65K5k29m76n87m43m97n14m11l78j27j80k71n7K23N68O39
$$ 704 1020 1310 1523 1883 2048 2073 1844 1368 781 338 -159 -673 -1084 -1462 -1589 -1769 -2040 -2097 -1874 -1306 -667
5047f67N02K96L79L65N12M86L44m1k63l73m34l88n21m87m00l54l87l95k83JL93
$$ -667 -165 131 510 875 1387 1873 2217 2176 1913 1540 1106 718 197 -290 -690 -1044 -1431 -1826 -2109 -2108 -1715
5068a715L98M84K99K53L53M90N72M43N09oj89k40k88l65m91l92m29l94o08m58
$$ -1715 -1317 -833 -534 -281 72 562 1134 1577 2086 2080 1891 1651 1363 998 507 115 -314 -708 -1316 -1774
5088a774j27l3K63L70J83J45K34N31P71M25N65p7L01j15J53k48m51k76m24m15
$$ -1774 -1901 -1934 -1671 -1301 -1118 -973 -739 -208 563 988 1553 1476 1777 1662 1815 1567 1116 840 416 1
5108Ao06n52m73j65L0J66R1K0K17L82O19O52M88L29L00K40J03q0k04j95l55l40
$$ 1 -605 -1157 -1630 -1795 -1765 -1599 -1508 -1488 -1271 -889 -270 382 870 1199 1499 1739 1842 1762 1558 1363 1008 668
5130F68n43n37n45m15j75l5o3o2J5K66M29N72N04L75M01M08L20J50R3j66j15k56
$$ 668 125 -412 -957 -1372 -1547 -1582 -1645 -1707 -1692 -1426 -997 -425 79 454 855 1263 1583 1733 1826 1660 1545 1289
5152A289m12m58n99n25l38j97k19k65j10J15K56L75M43L82M00N22M42L64K09L3
$$ 1289 877 419 -180 -705 -1043 -1240 -1459 -1724 -1834 -1719 -1463 -1088 -645 -263 137 659 1101 1465 1674 1707
5172A707K5j08j76l48m59n53m73l04l57l70k36j30J24J87K33K88L66M73N07N02
$$ 1707 1732 1624 1448 1100 641 88 -385 -689 -1046 -1416 -1652 -1782 -1658 -1471 -1238 -950 -584 -111 396 898
5192H98L69J62J85Q2R4k26l56m32m38m02m02m67l53k97j09J9J19J14K24M54M73
$$ 898 1267 1429 1614 1696 1790 1564 1208 776 338 -64 -466 -933 -1286 -1583 -1692 -1673 -1554 -1440 -1216 -762 -289
5213b89N12L38L97K42K79K33R0j83l06k85l88l76n21m43l53l72j52j01%J05K38
$$ -289 223 561 958 1200 1479 1712 1802 1619 1313 1028 640 264 -257 -700 -1053 -1425 -1577 -1678 -1678 -1573 -1335
5234a335L93M86M19L85K84M06L59K45N3l7k02k89k72m02n01m90l72l13k22k73
$$ -1335 -942 -456 -37 348 632 1038 1397 1642 1695 1658 1456 1167 895 493 -8 -498 -870 -1183 -1405 -1678
5254a678q8N7K53L76L63M11L41M18M48L49K82M1L3r8q8l11l93n11l67l89l68l46
$$ -1678 -1766 -1709 -1456 -1080 -717 -306 35 453 901 1250 1532 1573 1606 1508 1420 1109 716 205 -162 -551 -919 -1265
5276a265k09j71J9J52K50K29L36M38M66N05L33K05J58J75l1n3k88l65m13l78l46
$$ -1265 -1474 -1645 -1626 -1474 -1224 -995 -659 -221 245 750 1083 1288 1446 1621 1590 1537 1249 884 471 93 -253
5297b53m35l85l24k14J4P1P9K04L54M39M89L88L20L57K11J95J06n2k70k79k53
$$ -253 -688 -1073 -1397 -1611 -1597 -1526 -1447 -1243 -889 -450 39 427 747 1104 1315 1510 1616 1564 1294 1015 762
5318G62l45m26m18m40l12j74r5p6rJ20L89L90L81L47L59L91L86K27J17n8j07j58
$$ 762 417 -9 -427 -867 -1179 -1353 -1448 -1524 -1533 -1413 -1024 -634 -253 94 453 844 1230 1457 1574 1516 1409 1251
5340A251k92l52l91m59l95l33k92j77r3j3J52K71K71L37L35M16M25L15L79J45
$$ 1251 959 607 216 -243 -638 -971 -1263 -1440 -1533 -1546 -1394 -1123 -852 -515 -180 236 661 976 1355 1500
5360A500n7j1r4k39l05m34l82l58l27l32l37j45L7P1K33K35K22L31M40M17M07
$$ 1500 1443 1432 1338 1099 794 360 -22 -380 -707 -1039 -1376 -1521 -1484 -1413 -1180 -945 -723 -392 48 465 872
5381H72L06J55R2M7q8j31k83l27l62m26l30l89l76j26j05P9J09J05K39L21N39
$$ 872 1178 1333 1425 1472 1384 1253 970 643 281 -145 -475 -864 -1240 -1366 -1471 -1392 -1283 -1178 -939 -618 -79
5402g9L46L92K69K74J46J52r8j06j93k89k82l89m32m52l38j81m0o7j2P6K12L10
$$ -79 267 659 928 1202 1348 1500 1402 1296 1103 814 532 143 -289 -741 -1079 -1260 -1300 -1367 -1379 -1303 -1091 -781
5424g81M40L93L70L17L43J90P4O1n8j36j52l86l44m57m03k60k23k53j30o4P6J93
$$ -781 -341 52 422 739 1082 1272 1346 1407 1349 1213 1061 675 331 -126 -529 -789 -1012 -1265 -1395 -1459 -1383 -1190
5446a190K06M00L54L84L65L08L23J58P6n3R2k11l13m16l54m01l02l23k22j59q9
$$ -1190 -984 -584 -230 154 519 827 1150 1308 1384 1331 1423 1212 899 483 129 -272 -574 -897 -1119 -1278 -1367
5467a367n0J59J79L11L29M04L56L68K00K59J06J28jr2k97l45l88k28l93l27k86
$$ -1367 -1417 -1258 -1079 -768 -439 -35 321 689 889 1148 1254 1382 1381 1289 992 647 259 31 -362 -689 -975
5488i75k31j49p8J49J58K17K67M20L48M03K01K35K10K04j8n4k31k95k82l60l26
$$ -975 -1206 -1355 -1433 -1284 -1126 -909 -642 -222 126 529 730 965 1175 1379 1361 1307 1076 781 499 139 -187
5509a87l05l29k83j47j50kJ09K25K80L99L49K21L27L30K95K51N1k9j89k96k31
$$ -187 -492 -821 -1104 -1251 -1401 -1403 -1294 -1069 -789 -390 -41 180 507 837 1132 1383 1434 1405 1216 920 689
5530F89l54k93l21l78k33k66k28r6R4K29L08K25K74K29L54L56L82K63J29o6j03
$$ 689 335 42 -279 -657 -890 -1156 -1384 -1480 -1386 -1157 -849 -624 -350 -121 233 589 971 1234 1363 1297 1194
5551A194j87j98k00k64k74l65m16l28k74m0P5J72K16J23K43K44L88L57M37K42
$$ 1194 1007 809 609 345 71 -294 -710 -1038 -1312 -1352 -1277 -1105 -889 -766 -523 -279 109 466 903 1145
5571A145J06o9o1j06j53j93j70k14m96m23k95j84m1jP1P6R3J22K98M76M03M32
$$ 1145 1251 1182 1121 1015 862 669 499 285 -211 -634 -929 -1113 -1154 -1155 -1084 -1008 -915 -793 -495 -19 384 816
5593H16K22L2O6%n7j36k4k11l42m71m74k63j89mj0k2m3l0J84M18M08L99L12K32
$$ 816 1038 1070 1136 1136 1079 943 919 708 366 -105 -579 -842 -1031 -1035 -1045 -1067 -1110 -1140 -956 -538 -130 269 581 813
5617H13J91N2P9L4L1r6l71l30l98l32k83j92j05r3j55j34M6K25L86K58M06K96
$$ 813 1004 1056 1135 1169 1200 1104 733 403 5 -327 -610 -802 -907 -1000 -1155 -1289 -1243 -1018 -632 -374 32 328
5639C28K58K12J69J85Q5Qj55k54k88l21l70l12j19j77k06k82m3J02K40J68L09
$$ 328 586 798 967 1152 1237 1245 1090 836 548 227 -143 -455 -574 -751 -957 -1239 -1282 -1180 -940 -772 -463
5660d63L13K67K60K26L44J90J13k4k0k46k74l75l04k45k42k87k66j53%j5J00J88
$$ -463 -150 117 377 603 947 1137 1250 1226 1206 960 686 311 7 -238 -480 -767 -1033 -1186 -1186 -1201 -1101 -913
5682i13K75K88L09K81L82K27J36J97R2J6j81k99j91k94l43l71k87j61j94j60o3
$$ -913 -638 -350 -41 240 622 849 985 1182 1274 1290 1109 810 619 325 -18 -389 -676 -837 -1031 -1191 -1254
5703a254J32J12J63K30M06L73K11J39K54L03J71l3m0k21k13k61l41k75k21k83
$$ -1254 -1122 -1010 -847 -617 -211 162 373 512 766 1069 1240 1207 1167 946 733 472 131 -144 -365 -648
5723f48k61j96r5J3P9K26L03L01J53J82K64L43K51J83Q3J0j76l32j99j25j83k63
$$ -648 -909 -1105 -1200 -1187 -1108 -882 -579 -278 -125 57 321 664 915 1098 1181 1191 1015 683 484 359 176 -87
5745h7l84l62j57j81q8K08L26K54J2J54J98L53L34L07K06K7j32k07j40lj05k76
$$ -87 -471 -833 -990 -1171 -1259 -1051 -725 -471 -459 -305 -107 246 580 887 1093 1120 988 781 641 638 533 257
5767B57k26m06l35k83j93R7J02J11P5P5K45K45M14L94M12J23k2j82K8j3j07j68
$$ 257 31 -375 -710 -993 -1186 -1089 -987 -876 -801 -726 -481 -236 178 572 984 1107 1085 903 931 918 811 643
5789F43k78k43m28m14k51J4M0m1k9NR2K13K70M64M81K68l4Q8Q8J22j05l5r8k10
$$ 643 365 122 -306 -720 -971 -957 -917 -958 -987 -982 -890 -677 -407 57 538 806 772 860 948 1070 965 930 832 622
5813F22m29m64k63j35o7p9j58n3k7L1K74L90M45K16J41J45K29J11N2M9K5r2l77
$$ 622 193 -271 -534 -669 -736 -815 -973 -1026 -1053 -1022 -748 -358 87 303 444 589 818 929 981 1030 1055 963 586
5836E86l79k96j98k21j86j18j42o1j09R9L19L09K45J84K77K49J35J60J25J38k
$$ 586 207 -89 -287 -508 -694 -812 -954 -1015 -1124 -1025 -706 -397 -152 32 309 558 693 853 978 1116 1114
5857A114k38k47j79l43k29k83j30k09j35j95j9J24K27J93J65L27K68J39K04K30
$$ 1114 876 629 450 107 -122 -405 -535 -744 -879 -1074 -1093 -969 -742 -549 -384 -57 211 350 554 784
5877G84J51J08n9q8r7j89m00k27j58j90l08k53j04n7K9J03K27L00K88J87J66K15
$$ 784 935 1043 984 896 799 610 210 -17 -175 -365 -673 -926 -1030 -1087 -1058 -955 -728 -428 -140 47 213 428
5899D28K35J38J52R2ok74k51k16n8k28k23l54j60j70j26j12K7L42J84J90K97K32
$$ 428 663 801 953 1045 1039 765 514 298 240 12 -211 -565 -725 -895 -1021 -1133 -1106 -764 -580 -390 -93 139
5921A39J41L01K31K58J03j76j89r4k42j57k58j98j44l15k38k06L5Q1J61L0K89
$$ 139 280 581 812 1070 1173 997 808 714 472 315 57 -141 -285 -600 -838 -1044 -1009 -928 -767 -737 -448
5942d48J52J54J52L99M02K26k8p1o2m6j92j44j87j67l62l94k14j33q1O0J61J70
$$ -448 -296 -142 10 409 811 1037 1009 938 876 830 638 494 307 140 -222 -616 -830 -963 -1044 -984 -823 -653
5964f53J35J2J77L31M65K19J59J3J6j4j09j28K7j55l20l58k60k19j86j32N9J28
$$ -653 -518 -506 -329 2 467 686 845 858 874 860 751 623 650 495 175 -183 -443 -662 -848 -980 -921 -793
5986g93JkO6L10L63L67K95J85P6J09j24k7m3j10j57l41k22k78k88k49J09L8q8
$$ -793 -792 -794 -728 -418 -55 312 607 792 868 977 853 826 783 673 516 175 -47 -325 -613 -862 -753 -715 -803
6009h03p6M1P3L09L11K61L56J58M5K1K04P8l2j13k00j91l75l51l08p7k8q3j66
$$ -803 -879 -838 -765 -456 -145 116 472 630 675 696 900 978 946 833 633 442 67 -284 -592 -669 -697 -780 -946
6032i46n0J17J00K64K95L50J68J44J32J66J35%L1J1j00l31l60l26j38j15j65j67
$$ -946 -996 -879 -779 -515 -220 130 298 442 574 740 875 875 906 917 817 486 126 -200 -338 -453 -618 -785
6054g85j07q8k7R4K92L26K96R1K17K14J51O7J38J61lk15l12k68k36j64j97j62
$$ -785 -892 -980 -1007 -913 -621 -295 1 92 309 523 674 741 879 1040 1037 822 510 242 6 -158 -355 -517
6076e17j84j54k09l7K19K40K43J82K42K42J39J01J87K12R1k6j80j64k30j64k54
$$ -517 -701 -855 -1064 -1101 -882 -642 -399 -217 25 267 406 507 694 906 997 971 791 627 397 233 -21
6097b1j21k07k99k60q6j7P9J37K29L23K02J43J59K24K79K13J8jj45k04l23m9j53
$$ -21 -142 -349 -648 -908 -994 -1011 -932 -795 -566 -243 -41 102 261 485 764 977 995 994 849 645 322 273 120
6120A20j18l05k78j43j30p7p1J32K92J37J25J00L28L11K67J88J41J9j38j68j51
$$ 120 2 -303 -581 -724 -854 -931 -1002 -870 -578 -441 -316 -216 112 423 690 878 1019 1038 900 732 581
6141E81r4k45k79k97j96j77k13l7Q2J41J15R7RK56K39K57K60K65J30l3l1l4J9
$$ 581 487 242 -37 -334 -530 -707 -920 -957 -875 -734 -619 -522 -513 -257 -18 239 499 764 894 861 830 796 815
6164H15j37k51k77k63k87l00k32m9P2O7L4J44J99J59J97L49L09J43N9OM6N5j36
$$ 815 678 427 150 -113 -400 -700 -932 -981 -909 -842 -808 -664 -465 -306 -109 240 549 692 751 757 803 858 722
6187G22j19j54j30k45k79k92k00n9j46qO0Q3J03O8L61L89L03J34J17J50k5J4j17
$$ 722 603 449 319 74 -205 -497 -697 -756 -902 -910 -850 -767 -664 -596 -235 154 457 591 708 858 833 847 730
6210G30l6p3k29l66k21k43j77j45JJ7r2j0j6K94K63L00J76K93J55J55m0J00J05
$$ 730 694 621 392 26 -195 -438 -615 -760 -759 -742 -834 -844 -860 -566 -303 -3 173 466 621 776 736 836 941
6233I41l2j13l01k73k49l84j78q4K2j25j45PJ17J72K25K42K70K92J39Q3J29J12
$$ 941 909 796 495 222 -27 -411 -589 -673 -651 -776 -921 -914 -797 -625 -400 -158 112 404 543 626 755 867
6255H67P7Lj18k01k93l67k27j36k9k32k07l9m0J05J4K83K86K86J55J64K06J35
$$ 867 944 947 829 628 335 -32 -259 -395 -424 -656 -863 -902 -942 -837 -823 -540 -254 32 187 351 557 692
6277F92J29J02P5r5k01l54k57j28j57k18k44j29j12m6R3O9K45K30J54K14K22J44
$$ 692 821 923 998 903 702 348 91 -37 -194 -412 -656 -785 -897 -943 -850 -781 -536 -306 -152 62 284 428
6299D28J51K32J22R4j82k18j10k14j18k37k46k33k25j61j58J07O4K15K18K17K56
$$ 428 579 811 933 1027 845 627 517 303 185 -52 -298 -531 -756 -917 -1075 -968 -904 -689 -471 -254 2
6320BJ43J38L16K95J59r5r4j32j71j25k03j93k54k07k34j53m6q3J9Q2K32J40Q1
$$ 2 145 283 599 894 1053 958 864 732 561 436 233 40 -214 -421 -655 -808 -854 -937 -918 -836 -604 -464 -383
6343c83K42K64M15K91J00K3K4q9j09k05j82k37k45k77k48j29j38m8O5J46R8P4
$$ -383 -141 123 538 829 929 952 976 887 778 573 391 154 -91 -368 -616 -745 -883 -931 -866 -720 -622 -548
6365e48J05K37K68K43J84K02J00O8o7K4k2k13k07j92k44k68l87j66q3J70J7M5
$$ -548 -443 -206 62 305 489 691 791 859 792 816 794 581 374 182 -62 -330 -717 -883 -966 -796 -779 -734
6387g34K7K04K83L05K39J48J94k8J27k8j1o8j02r9k18k65k83l36m8l9l9n4o5N2
$$ -734 -707 -503 -220 85 324 472 666 638 765 737 726 658 556 457 239 -26 -309 -645 -693 -732 -771 -825 -890 -838
6411h38J90L16K59K80K34J84J70P8J6lq2q4j34l20l22k32k07p0j03j58p2J0K3
$$ -838 -648 -332 -73 207 441 625 795 873 889 886 804 720 586 266 -56 -288 -495 -565 -668 -826 -898 -888 -865
6434h65J65K33K56K05K22K44K18J23K0M4R2r5j79k96l05k17j55k13j67j42j56
$$ -865 -700 -467 -211 -6 216 460 678 801 821 865 957 862 683 387 82 -135 -290 -503 -670 -812 -968
6455i68l7J11J64K30J47K08K50L03J95P2J36J08N8j31j79k36j85j85k23k70j02
$$ -968 -1005 -894 -730 -500 -353 -145 105 408 603 675 811 919 977 846 667 431 246 61 -162 -432 -534
6476e34k54j43K3J2J17J02J24K94L01K13R7K47K25N4J49j05j68j61j77k12k40
$$ -534 -788 -931 -908 -896 -779 -677 -553 -259 42 255 352 599 824 878 1027 922 754 593 416 204 -36
6497c6k74k27k05r7j6n0qJ21K13L83J09K05J03K38K73J51L4jr8j46j14j52k89
$$ -36 -310 -537 -742 -839 -855 -905 -913 -792 -579 -196 -87 118 221 459 732 883 917 916 818 672 558 406 117
6520A17k68k24j40j72j67j94J8J62K03K17K32K37J43L33J91J88O1Kn5j41k05j02
$$ 117 -151 -375 -515 -687 -854 -1048 -1030 -868 -665 -448 -216 21 164 497 688 876 937 939 884 743 538 436
6542D36l01j67j90k10j90k15j26KJ16J67P7J56J95K45L40K79K02Q6K6P8j44j34
$$ 436 135 -32 -222 -432 -622 -837 -963 -961 -845 -678 -601 -445 -250 -5 335 614 816 902 928 1006 862 728
6564G28k28j59k06l08k58k21k28o4J37k5N6Q2J65J90K95K74J55K23P5J92J06q8
$$ 728 500 341 135 -173 -431 -652 -880 -944 -807 -832 -776 -694 -529 -339 -44 230 385 608 683 875 981 893
6586H93r7j27q0j56l65l63k62j51j28qn1RL9J79K32K94K60K68J87J25J45k1Kj0
$$ 893 796 669 589 433 68 -295 -557 -708 -836 -844 -895 -886 -847 -668 -436 -142 118 386 573 698 843 822 824 814
6610H14j9j74k31k65k41k70j60r5j12j86k1J2J90J96K46K36K35L07K01J66J4N5
$$ 814 795 621 390 125 -116 -386 -546 -641 -753 -939 -960 -948 -758 -562 -316 -80 155 462 663 829 843 898
6632H98L7n9k21j77k47k63k33j66j16k59r8k2Q0Q3J10J93K32K57K68K12J05J58
$$ 898 935 876 655 478 231 -32 -265 -431 -547 -806 -904 -926 -846 -763 -653 -460 -228 29 297 509 614 772
6654G72J04Q6K0j43k69k11j66k50k02k74k65o7j2j5P2N8J83J94L11J96K25K25
$$ 772 876 962 982 839 570 359 193 -57 -259 -533 -798 -865 -877 -892 -820 -762 -579 -385 -74 122 347 572
6676E72J41J49R7Lr0k10j30k00k32k76k85j95j42o9Pn7J15R3K60K08K15J92K11
$$ 572 713 862 959 962 872 662 532 332 100 -176 -461 -656 -798 -867 -860 -917 -802 -709 -449 -241 -26 166 377
6699C77K08L02J00o9j3n1j26k29k41l70j97k22j83m8k27rP8K08J82J61K09J76
$$ 377 585 887 987 918 905 854 728 499 258 -112 -309 -531 -714 -762 -989 -998 -920 -712 -530 -369 -160 16
6721A6L03K48J56J00M4J8K1j14j97k69j52l10k02k89k29j38m3J30M7J84J18K01
$$ 16 319 567 723 823 867 885 906 792 595 326 174 -136 -338 -627 -856 -994 -1037 -907 -860 -676 -558 -357
6743c57K98L59J64J83J18J10J34l2j72j85j51k33j99k78k08k13j80l0o3R8K0J47
$$ -357 -59 300 464 647 765 875 1009 977 805 620 469 236 37 -241 -449 -662 -842 -872 -935 -837 -817 -670
6765f70J93K70L04J72K42K03J18R4N9r2j29j76j37k76k99k72k11j81p1j07M9j2
$$ -670 -477 -207 97 269 511 714 832 926 985 893 764 588 451 175 -124 -396 -607 -788 -859 -966 -917 -929
6787i29J56K88J45K07K44K30K70K18R2P4l3j31r0j51k23l34k69k17j70j99j65
$$ -929 -773 -485 -340 -133 111 341 611 829 921 995 962 831 741 590 367 33 -236 -453 -623 -822 -987
6808i87l0J02J17J69K06J77K64J68K84K94N9N3O9q8l0j79k39k35j80k90k16j95
$$ -987 -1017 -915 -798 -629 -423 -246 18 186 470 764 823 876 945 857 827 648 409 174 -6 -296 -512 -707
6830g07j88p8l7J21J24J47J46L40L06K41K39J25J23Q2K6j30j11k01k77k38k10
$$ -707 -895 -973 -1010 -889 -765 -618 -472 -132 174 415 654 779 902 984 1010 880 769 568 291 53 -157
6851a57k62k77j04n0k5l3qJ67J72K93K52K99J76J69K02J39Q1p0j33j51k34j72
$$ -157 -419 -696 -800 -850 -875 -908 -916 -749 -577 -284 -32 267 443 612 814 953 1034 964 831 680 446 274
6873B74l01l20k41j33j16n4j5n8Q6K59L01J83K56J67K60K49P9L0Jn9r3j21j92
$$ 274 -27 -347 -588 -721 -837 -891 -906 -964 -878 -619 -318 -135 121 288 548 797 876 906 907 848 755 634 442
6896D42l35k77k98q2k07j44q3k1J50J37K21K14J21L03L69J56J20O9N1K3j9j34
$$ 442 107 -170 -468 -550 -757 -901 -984 -1005 -855 -718 -497 -283 -162 141 510 666 786 855 906 929 910 776
6918G76k59k63k42k54k41k00k20k0NL5Q9J09J28K79L56K62K42J12N3R4J43k3r1
$$ 776 517 254 12 -242 -483 -683 -903 -923 -918 -883 -794 -685 -557 -278 78 340 582 694 747 841 984 961 870
6941H70k56k54j81k35l18j69k05q6j07p1K7P2K87K80L05K17K22J58J79J68J23
$$ 870 614 360 179 -56 -374 -543 -748 -834 -941 -1012 -985 -913 -626 -346 -41 176 398 556 735 903 1026
6962A026j6j37j63j79k37j93l04k34j57j76j42j27J7N6K64K41K14J67J90K62L21
$$ 1026 1010 873 710 531 294 101 -203 -437 -594 -770 -912 -1039 -1022 -966 -702 -461 -247 -80 110 372 693
6983F93K47J68q7j31m0j95k33k17k53k53k35k08j55j35L7J30J26J72R2J51K92
$$ 693 940 1108 1021 890 850 655 422 205 -48 -301 -536 -744 -899 -1034 -997 -867 -741 -569 -477 -326 -34
7004c4L04L99J53J13M6k8o5p9j63k21j83k92l05k37k61j27NJ44R0k2Q5K26L61
$$ -34 270 669 822 935 981 953 888 809 646 425 242 -50 -355 -592 -853 -980 -975 -831 -741 -763 -678 -452 -91
7027i1K33L06J96J49O8JO1n5k03j35j27l32k89l20k12q6L8Llr4J63K32L52K54
$$ -91 142 448 644 793 861 862 923 868 665 530 403 71 -218 -538 -750 -836 -798 -795 -798 -892 -729 -497 -145 109
7051A09K86J18J51J95J03m6n2m7j67j46l53l07l27j38j12j06r1l9Q5J04K66K44
$$ 109 395 513 664 859 962 916 864 817 650 504 151 -156 -483 -621 -733 -839 -930 -969 -884 -780 -514 -270
7073b70K42J40K62K22K02J87q1J0j5q5k39k94l03k45j71k66j69j39j3PJ60J58
$$ -270 -28 112 374 596 798 985 904 914 899 814 575 281 -22 -267 -438 -704 -873 -1012 -1025 -1018 -858 -700
7095g00K48J85K45L59K07J84O0O4O0J8qk85k56j92k74j86k54k34j78n7L1N8O5
$$ -700 -452 -267 -22 337 544 728 788 852 912 930 922 637 381 189 -85 -271 -525 -759 -937 -994 -963 -905 -840
7118h40J41K78L17L55J62J65Q7K20Q1R2j66q3k28l04k69j68k18k67j26j21m8q8
$$ -840 -699 -421 -104 251 413 578 665 885 966 1058 892 809 581 277 8 -160 -378 -645 -771 -892 -940 -1028
7140a028J6J77L75K70K32J74J73K38K22J51J18j12j42k12j75k35k63k36j99k09
$$ -1028 -1012 -835 -460 -190 42 216 389 627 849 1000 1118 1006 864 652 477 242 -21 -257 -456 -665
7160f65k13j70m7N6K22K83K03J46J85K26K81K48K21J35j15j10j69j17k10k15k61
$$ -665 -878 -1048 -1095 -1039 -817 -534 -331 -185 0 226 507 755 976 1111 996 886 717 600 390 175 -86
7181h6k28j87l75r6j37Q7K24R3K19J04K06K67L81L15J28M5J4m9o0j99j80k17j89
$$ -86 -314 -501 -876 -972 -1109 -1022 -798 -705 -486 -382 -176 91 472 787 915 960 974 925 865 666 486 269 80
7204H0k99k81k76j76j2qQ0J45Q6J29J95L91M12J69J71O9Q4L3j35j33kk00l02l27
$$ 80 -219 -500 -776 -952 -964 -972 -892 -747 -661 -532 -337 54 466 635 806 875 959 992 857 724 722 522 220 -107
7228a07l03k46j90p2m6N3l5M2K25L10L02K66K23K48J20J66J9p7M8j47j82k49l41
$$ -107 -410 -656 -846 -918 -964 -911 -946 -904 -679 -369 -67 199 422 670 790 956 975 898 946 799 617 368 27
7251B7l10k49k14M0j05j23r7Q3J95K84J87K46M05K68J22P3O8O8o4j9j50k48k94
$$ 27 -283 -532 -746 -706 -811 -934 -1031 -948 -753 -469 -282 -36 369 637 759 832 900 968 904 885 735 487 193
7274A93l79k03j39j23j82j58m9J03O2J63K42L65K87K62J36J78J45O2J5k0q2k52
$$ 193 -186 -389 -528 -651 -833 -991 -1040 -937 -875 -712 -470 -105 182 444 580 758 903 965 980 960 878 626
7296F26l71k16j83j41k97j95j53m9m1N0J97K54L03K27K26J97K03J13K22J34J3
$$ 626 255 39 -144 -285 -582 -777 -930 -979 -1020 -970 -773 -519 -216 11 237 434 637 750 972 1106 1119
7317A119j98l04j74k15k40k93j81k01j58j66m8M1J33K11K80K55K79M6J82L45K74
$$ 1119 921 617 443 228 -12 -305 -486 -687 -845 -1011 -1059 -1018 -885 -674 -394 -139 140 186 368 713 987
7338I87J35j08r7j77j19k19k55k35k29l25j25j93p3k3J14K16L29J48Q5K03L01
$$ 987 1122 1014 917 740 621 402 147 -88 -317 -642 -767 -960 -1033 -1056 -942 -726 -397 -249 -164 39 340
7359C40L43K18Q7Lm2q9j68k49j44k53k10l20k05j97j75k1J02L10N2Q1J91L13L60
$$ 340 683 901 988 991 949 860 692 443 299 46 -164 -484 -689 -886 -1061 -1082 -980 -670 -618 -537 -346 -33 327
7382C27L18J57J47O3p9n6r9j16j66k55k79k98k38l13j32L1J26M1mR9K58L50J98
$$ 327 645 802 949 1012 933 877 778 662 496 241 -38 -336 -574 -887 -1019 -988 -862 -821 -825 -726 -468 -118 80
7405H0L08L11J95K5P2r4J7j57j68k46j33l92m16j94j00K7k5p2N3J56J56K35L25
$$ 80 388 699 894 919 991 897 914 757 589 343 210 -182 -598 -792 -892 -865 -890 -962 -909 -753 -597 -362 -37
7428c7L76K91J38R4R5M2j35r4L7k01l21m08k98k39m0j40j06ln6P9J92K36L10L32
$$ -37 339 630 768 862 957 999 864 770 807 606 285 -123 -421 -660 -700 -840 -946 -949 -1005 -926 -734 -498 -188 144
7452A44K54K57J74M8o4J48M8q4k38l77k79k48k16k04j06j12j35j04O5K34K68K31
$$ 144 398 655 829 877 813 961 1009 925 687 310 31 -217 -433 -637 -743 -855 -990 -1094 -1029 -795 -527 -296
7474b96K38L09L31R4M5O4K39P6j81k13k26k70k93j88k16j18k39j94m3P0J66J26
$$ -296 -58 251 582 676 721 785 1024 1100 919 706 480 210 -83 -271 -487 -605 -844 -1038 -1081 -1011 -845 -719
7496g19K27M20L02J00Q1K53K22J47N2r4j67k61k37k92j30j78k81k38j60m6j3R
$$ -719 -492 -72 230 330 411 664 886 1033 1085 991 824 563 326 34 -96 -274 -555 -793 -953 -999 -1012 -1003
7518a003J92L39K46J87J25K42K24L01K02j1l6j11k76j32j84k08l15k67j30k57
$$ -1003 -811 -472 -226 -39 86 328 552 853 1055 1044 1008 897 621 489 305 97 -218 -485 -615 -872
7538h72j96j13J89J74J92K40J55K12K05K66L48K55O3r9j25q8j80j90k95k08j63
$$ -872 -1068 -1181 -992 -818 -626 -386 -231 -19 186 452 800 1055 1118 1019 894 806 626 436 141 -67 -230
7559b30k91k72k15o6N9R9J97J46J81J34K99L63L27J82k6J03%j03j69k18j40j77
$$ -230 -521 -793 -1008 -1074 -1015 -916 -719 -573 -392 -258 41 404 731 913 887 990 990 887 718 500 360 183
7581A83l07l81k81j13q2L9KJ78J02L8J72M01L48K85J31J78J36m8j34q5l1j17l03
$$ 183 -124 -505 -786 -899 -981 -942 -940 -762 -660 -622 -450 -49 299 584 715 893 1029 981 847 762 731 614 311
7604C11l59l04l14j62r7L2K7j4NJ18K88L17K73K19K95J84P6O2o6N0o9j92l34k61
$$ 311 -48 -352 -666 -828 -925 -893 -866 -880 -875 -757 -469 -152 121 340 635 819 895 957 891 941 872 680 346 85
7628H5l30l49j21p2J1j58j56P0K82K52K13K88L09K05J42R2J16J19nl4j59j78m52
$$ 85 -245 -594 -715 -787 -776 -934 -1090 -1020 -738 -486 -273 15 324 529 671 763 879 998 993 959 800 622 170
7651A70l14k63j29m6k18k43l4J12P3J92K64K27L47J53K26J77J16J63P4J3q2l34
$$ 170 -144 -407 -536 -582 -800 -1043 -1077 -965 -892 -700 -436 -209 138 291 517 694 810 973 1047 1060 978 644
7673F44k92k68j56k58k21k55j29l0j8M5J18K56K40K83J77K82J52J18J94K11n0
$$ 644 352 84 -72 -330 -551 -806 -935 -965 -983 -938 -820 -564 -324 -41 136 418 570 688 882 1093 1043
7694A043j67j85k14j84k07l58j95k33j65j21o6J02N4K26K15L37K16J65J19K96
$$ 1043 876 691 477 293 86 -272 -467 -700 -865 -986 -1052 -950 -896 -670 -455 -118 98 263 382 678
7714F78J57J46J2q1p0j16k95l02k32k06k03k69j26j32j7K2K12L57K08J80J72K81
$$ 678 835 981 993 912 842 726 431 129 -103 -309 -512 -781 -907 -1039 -1056 -1034 -822 -465 -257 -77 95 376
7736C76K90J60J51M9j9j20k27k03j40j86k99j94k35k79j97k4N8L14J06J68J08
$$ 376 666 826 977 1026 1007 887 660 457 317 131 -168 -362 -597 -876 -1073 -1097 -1039 -725 -619 -451 -343
7757c43L00K82L03K49J50J18n8j20j45j49j77j59j81k48l76l58j36M0J60O5J9
$$ -343 -43 239 542 791 941 1059 1001 881 736 587 410 251 70 -178 -554 -912 -1048 -1008 -848 -783 -764
7778g64j5K42K88L04L69L71K01Nk2j14o5q5j08j90k01l79m43j82r4M1k9l6n7J32
$$ -764 -779 -537 -249 55 424 795 996 1001 979 865 800 715 607 417 216 -163 -606 -788 -882 -841 -870 -906 -963 -831
7802h31J78K44L81L82K52J37J78L9j1K3M2j48k09l46m41l36j66m1j29o9q3j01
$$ -831 -653 -409 -28 354 606 743 921 960 949 972 1014 866 657 311 -130 -466 -632 -673 -802 -871 -954 -1055
7824a055P3J79L76L38K49J43K34J94J27N4J20J4o3l27l42k24k82j44k45j63j44
$$ -1055 -982 -803 -427 -89 160 303 537 731 858 912 1032 1046 983 656 314 90 -192 -336 -581 -744 -888
7845h88j20n2M8K89J76K31K54K12K21K23J47J94K07q8j47k75k16j72k04k17k61
$$ -888 -1008 -1060 -1012 -723 -547 -316 -62 150 371 594 741 935 1142 1054 907 632 416 244 40 -177 -438
7866d38j76k59k21J04P1J18J19J95K65K34K20K21K34K51O1K2j38o8j65k18k39
$$ -438 -614 -873 -1094 -990 -919 -801 -682 -487 -222 12 232 453 687 938 999 1021 883 815 650 432 193
7887A93k34l00k46j83j66L4o1J8J52K16K23K56K46K30J95K26R0O8L5j06j69j49
$$ 193 -41 -341 -587 -770 -936 -902 -963 -945 -793 -577 -354 -98 148 378 573 799 889 957 992 886 717 568
7909E68j90l14l07k27j19j83j87q1m3J55K85J70K39K40J45L34J80J18J91K2o8
$$ 568 378 64 -243 -470 -589 -772 -959 -1040 -1083 -928 -643 -473 -234 6 151 485 665 783 974 996 928
7930I28j05k01k18k57j74j84k07l35k08o4K4J35J56K25Q9J60K38L23K85J74J80
$$ 928 823 622 404 147 -27 -211 -418 -753 -961 -1025 -1001 -866 -710 -485 -396 -236 2 325 610 784 964
7951I64L2K4j65j55k17j55j21k59l01l56j71q8j9R3J41P2O5J71K96L47K89K11
$$ 964 996 1020 855 700 483 328 207 -52 -353 -709 -880 -968 -987 -894 -753 -681 -616 -445 -149 198 487 698
7973F98J70Q3m2k1j52o8q1k35l02l11l01k21l8k4K1m0J0J20J47L36L30K40K56
$$ 698 868 951 909 888 736 668 587 352 50 -261 -562 -783 -821 -845 -824 -864 -854 -734 -587 -251 79 319 575
7996E75K06O6p1J21oOj19l57l01l28k66j84k2r8r2k7k2J58K28K37K57K56K11J57
$$ 575 781 847 776 897 891 897 778 421 120 -208 -474 -658 -680 -778 -870 -897 -919 -761 -533 -296 -39 217 428 585
8020E85J54J31O8P8n2j08l27k96l20j92j50j73k21j79j08J17J73J75L00K19K29
$$ 585 739 870 938 1016 964 856 529 233 -87 -279 -429 -602 -823 -1002 -1110 -993 -820 -645 -345 -126 103
8041A03J83J10K29J40R7R1j8j08j50k76j47k69j97k48k82j93q9KP0J96J57L38
$$ 103 286 396 625 765 862 953 935 827 677 401 254 -15 -212 -460 -742 -935 -1024 -1022 -952 -756 -599 -261
8063b61J71L04K10J50J51J59P3Nj33j75j09j77k14l13j96j89k47j33l4j5J08J08
$$ -261 -90 214 424 574 725 884 957 962 829 654 545 368 154 -159 -355 -544 -791 -924 -958 -973 -865 -757
8085g57J75L07K76J36L07K39J29J93n7j15m6j35j18l01k66j93k62j58j80r9m0
$$ -757 -582 -275 1 137 444 683 812 1005 948 833 787 652 534 233 -33 -226 -488 -646 -826 -925 -965
8106i65M9J88J56J91K21K10K06L03J90P9Q9Ml2j37k06j47k59k40k08k46j81j55
$$ -965 -916 -728 -572 -381 -160 50 256 559 749 828 917 921 889 752 546 399 140 -100 -308 -554 -735 -890
8128h90o4L5R6J40J18K65K04L06K22K28J96K5R3m6j39j01k70j55k97j45k61k86
$$ -890 -954 -919 -823 -683 -565 -300 -96 210 432 660 856 881 974 928 789 688 418 263 -34 -179 -440 -726
8150g26j08Pj8M8KJ09J95K36L04K45K34J46J77R9on2j21j52j80l12k22l25j92
$$ -726 -834 -827 -845 -797 -795 -686 -491 -255 49 294 528 674 851 950 944 892 771 619 439 127 -95 -420 -612
8173f12k14j8j5q4J15N0K15K80J84K71K15K02J77J08K1l2m2j67
$$ -612 -826 -844 -859 -943 -828 -778 -563 -283 -99 172 387 589 766 874 895 863 821 654
8191F54
$$ Imaginary data points
##PAGE= N=2
##DATA TABLE= (X++(I..I)), XYDATA
0@%%%%%%%%%%%%%%%%%%%%pJ2j3J6j6J6j8K3k8L1l5M1m4N1n9O5p3Q1r2J03j14J27
$$ 0 0 0 0 0 0 0 0 0 0 0 0 0 0 0 0 0 0 0 0 0 -7 5 -8 8 -8 8 -10 13 -15 16 -19 22 -22 29 -30 35 -38 43 -49 54 -60 67
42F7j42J56j71J87k09K32k55K80l07L38l73M15m58N07n62O28p04P94r04J040j215
$$ 67 -75 81 -90 97 -112 120 -135 145 -162 176 -197 218 -240 267 -295 333 -371 423 -481 559 -656
63f56J445j766K247l041M584q664M0057J19665n2310j78927j71827p0634J7686
$$ -656 789 -977 1270 -1771 2813 -5851 34206 153871 101561 -77366 -249193 -319827 -302141
76c02141N5287M1917K7646K4346L3376N6702Q9081R7078R7022J07655Q4874k5009
$$ -302141 -246854 -204937 -177291 -152945 -119569 -62867 26214 123292 220314 327969 412843 387834
88C87834j56706j83273o9368O0334O4666n0584j48055j39252n4562K8225O4482
$$ 387834 231128 47855 -21513 38821 103487 52903 -95152 -234404 -288966 -260741 -196259
99a96259N0487J0192k2300j3619L1908O4765O1364P0969J16643J27399M5760o9057
$$ -196259 -145772 -135580 -157880 -171499 -139591 -74826 -13462 57507 174150 301549 347309 278252
111B78252j06412l5400N1955M2360n9788j46897j52926r7114j9818L7985L6346
$$ 278252 171840 136440 188395 230755 170967 24070 -128856 -225970 -245788 -207803 -171457
122a71457j1195l9138r265M5389O5070M3656M0676Q6660J16378O4884k3481n1995
$$ -171457 -182652 -221790 -231055 -185666 -120596 -76940 -36264 50396 166774 231658 208177 156182
134A56182n42N5713M4694k6697r7462j23285r5161l1213J8316N173m9584p1723
$$ 156182 155640 211353 256047 229350 131888 8603 -86558 -117771 -99455 -94282 -143866 -215589
146b15589k5937L8854N2798J8080Q674N5917R5198P0179J7654J465K8185N6949
$$ -215589 -241526 -202672 -149874 -131794 -123120 -67203 27995 98174 115828 117293 145478 202427
158B02427M9601J130n9356r5462q5273l4553O720j6052p8991r3208k9653M1853
$$ 202427 252028 253158 193802 98340 13067 -21486 -14766 -30818 -109809 -203017 -232670 -190817
170a90817N0639J1996n961K3534N8194N5825L2281K3107L3379M5470M6135K5818
$$ -190817 -140178 -128182 -134143 -110609 -52415 3410 35691 58798 92177 137647 183782 209600
182B09600j6233n5283n2738p897J8176k5882r9770j14187n0156K0913L3517p9
$$ 209600 193367 138084 85346 77449 95625 69743 -30027 -144214 -194370 -173457 -139940 -140019
194a40019k1239k334L1152M9973N4622N1395M0721L4695M0367L4664r18l7641
$$ -140019 -161258 -163592 -132440 -82467 -27845 23550 64271 98966 139333 173997 173079 135438
206A35438l1066J2855L1113j9533r4869j10762n1616J3413K5491m470l3040l5596
$$ 135438 104372 117227 148340 128807 33938 -76824 -128440 -115027 -89536 -94006 -127046 -162642
218a62642j2195K4714N3621N5832L7199K8151M1151M6270J8866j3384m487L7333
$$ -162642 -174837 -150123 -96502 -40670 -3471 24680 65831 112101 130967 117583 113096 150429
230A50429M7018j0857q6670j06463o1816o444J3964l870l6594n3657l4847J2880
$$ 150429 197447 186590 99920 -6543 -68359 -74803 -60839 -64709 -101303 -154960 -189807 -176927
242a76927N4420N7267L0253J6974L3430M2276J6710r529P439N0274N9838J1988
$$ -176927 -122507 -65240 -34987 -18013 15417 57693 74403 64874 72313 122587 182425 194413
254A94413n2852p8107n2258r669J1602k938m3910p8613o8866j4566L6246M2010
$$ 194413 141561 63454 11196 1527 13129 10191 -33719 -112332 -181198 -195764 -159518 -117508
266a17508J9936J6450L8854M9338K7318M494J7270N1095N8173J9382l4368o2137
$$ -117508 -97572 -81122 -42268 7070 34388 38882 56152 107247 165420 184802 150434 88297
278H8297n1134j5781J5937J4037k8184p2262o9734k1875J9805J8747m359n674
$$ 88297 37163 21382 37319 51356 23172 -49090 -118824 -140699 -120894 -102147 -106506 -112180
290a12180J9329L4647K1247P523K2730N3448O5581M5518N937l0518m2035k0932
$$ -112180 -92851 -58204 -36957 -29434 -6704 46744 112325 157843 163780 133262 91227 70295
302G0295R702J0438l1026p5686p4496k8647J0695R383q823n171J8020K9359J8080
$$ 70295 79997 90435 59409 -16277 -90773 -119420 -108725 -99342 -108165 -113336 -95316 -65957 -47877
315d7877M909Q878K7737M5360M6710K5945n992k2676n943K6337K9836j2547o1452
$$ -47877 -42968 -34090 -6353 39007 85717 111662 105670 82994 77051 103388 133224 120677 59225
328E9225o7683l6288j3007k0094l3514k5288J230K2480K5774J8482J4714K1431
$$ 59225 -8458 -44746 -57753 -77847 -111361 -136649 -135419 -112939 -87165 -68683 -53969 -32538
340c2538L7350M9444L8265L228k3211j1270K2509L1852P54l5956m0448j9725q588
$$ -32538 4812 54256 92521 95749 72538 61268 83777 115629 116383 80427 39979 20254 11666
353A1666k2352m1223m1407k3087j660J0694J0077K206M001K7651N6309N6396K3599
$$ 11666 -10686 -51909 -93316 -116403 -118063 -107369 -97292 -95086 -91085 -63434 -7125 49271 72870
366G2870p043l513K1262K8115L153k5129k7684j1816m608j6458l3984m1768l3321
$$ 72870 65827 62314 83576 111691 114844 89715 62031 50215 45607 29149 -4835 -46603 -79924
379g9924j2611M691K797j3977j8564P552M5593N7536L3793O568P336K6033K9661
$$ -79924 -92535 -87844 -85047 -99024 -117588 -110036 -64443 -6907 26886 33454 40790 66823 96484
392I6484R363j2491j6712q001j666p972k4379l8442l6027j6021L398p31k5369
$$ 96484 105847 93356 76644 68643 66977 59005 34626 -3816 -39843 -55864 -52466 -53197 -78566
405g8566l8156j5017K5910M4647L1368J4210J6893L2319L7037K3661M337o514
$$ -78566 -116722 -131739 -105829 -61182 -29814 -15604 1289 33608 70645 94306 98643 92129
417I2129o029k100n004j9957l8291l9921j7305P795N833k1463l9417k4561P539
$$ 92129 86100 84000 78996 59039 20748 -19173 -36478 -28683 -22850 -44313 -83730 -108291 -100752
430a00752K4219J6341M462Q127K4300L6104L4332K2234J0462O786J1142J1045
$$ -100752 -76533 -60192 -55730 -47603 -23303 12801 47133 69367 79829 86615 97757 108802
442A08802p203l5171m5772k7416k386l77k1899l7524k5972J044J6564J2075K292
$$ 108802 101599 66428 20656 -6760 -9146 -9523 -31422 -68946 -94918 -93874 -77310 -65235 -62943
455f2943K099J2951K6223L1109K2671R603P317J9038K6993J2949j6668l3996k3817
$$ -62943 -60844 -47893 -21670 9439 32110 41713 49030 68068 95061 108010 91342 57346 33529
468C3529m278l140k2214l7546l1657j2473J649K702l144m419O273K3672L3278
$$ 33529 29251 26111 3897 -33649 -65306 -77779 -76130 -73428 -76572 -80991 -74718 -51046 -17768
481a7768K5388R093M989J9640L4074K5208l452k3843k0085o043l555j6253k9164
$$ -17768 7620 16713 21702 41342 75416 100624 97172 73329 53244 47201 43646 27393 -1771
494a771k9210j7471n728l665r575j3015m122J5327K8447K1204L039r34J7811L8417
$$ -1771 -30981 -48452 -54180 -57845 -67420 -80435 -84557 -69230 -40783 -19579 -16540 -17474 337 38754
508C8754L6992J4459o923j0675l288j236j0723k3699k9257k4400j5323j1103j5712
$$ 38754 75746 90205 83282 72607 69319 68083 57360 33661 4404 -19996 -35319 -46422 -62134
521f2134j9801r559J3231K8326K0103l86p423Q994L1522L7083K1714K952l325
$$ -62134 -81935 -91494 -78263 -49937 -29834 -30220 -37643 -28649 2873 39956 61670 64622 61297
534F1297J521O584L284p636j8650k1416j6838j6286k4810l1601k2197J662J9750
$$ 61297 62818 69402 72686 65050 46400 24984 8146 -8140 -32950 -64551 -86748 -85086 -65336
547f5336J5780k147r024N938K8977L8654K8754J0426j236j74P411R680J561r739
$$ -65336 -49556 -51703 -60727 -54789 -25812 12842 41596 52022 50786 50612 58023 67703 69264 59525
561E9525j4181j1081j1208k1451l1819k7139o794R681O611r196j6726m293J9161
$$ 59525 45344 34263 23055 1604 -30215 -57354 -64148 -54467 -47856 -57052 -73778 -78071 -58910
574e8910L5332L2830J7337M013L492J1961J6819J0033l113r881p627p804j8009
$$ -58910 -23578 9252 26589 30602 34094 46055 62874 72907 69794 59913 52286 44482 26473
587B6473k9428k7405j1700K727J703j1745k0875j2760Q507K6868K9444J7219M295
$$ 26473 -2955 -30360 -42060 -39333 -37630 -49375 -70250 -83010 -74503 -47635 -18191 -972 3323
600C323L867J5073K2985J7499M475l001j805j940j0828k3025k5614j5301l784
$$ 3323 7190 22263 45248 62747 67222 64221 62416 60476 49648 26623 1009 -14292 -18076
613a8076l265j4081k3500j9369j497J7818K3620J3704J852K980J6016K6254K3092
$$ -18076 -21341 -35422 -58922 -78291 -79788 -61970 -38350 -24646 -22794 -19814 -3798 22456 45548
626D5548J0706K187K811M256k421j4131k0357j6512q594o687j4274k3823k3091
$$ 45548 56254 58441 61252 65508 63087 48956 28599 12087 3493 -3194 -17468 -41291 -64382
639f4382q390R465J5974P997k537p94J3425K5555K4343J3700N788P017J0822Q396
$$ -64382 -72772 -63307 -47333 -39336 -41873 -42667 -29242 -3687 20656 34356 40144 47161 57983 66379
653F6379j274j0973j3632r837q236j4714k4502k6752j6016J35P644J867o448l560
$$ 66379 65105 54132 40500 30663 22427 7713 -16789 -43541 -59557 -59422 -51778 -49911 -56359 -59919
667e9919J0795K4027K4442J4244N207N536J1892J4623Q770j002o581n456l620
$$ -59919 -49124 -25097 -655 13589 18796 24332 36224 50847 59617 58615 52034 46578 42958
680D2958q224j8439k4033j8607p439k143p542j4684j1302L874J9178K2986J4904
$$ 42958 34734 16295 -7738 -26345 -33784 -35927 -43469 -58153 -69455 -65581 -46403 -23417 -8513
693h513N780N189J2608J8317J5009M510l851m459j312l287j0871j6875j4773p100
$$ -8513 -2733 2456 15064 33381 48390 52900 49049 44590 43278 39991 29120 12245 -2528 -9628
707i628l800r629j7687j6748m030J1053J6699J1054K518K303J1621K0886K0604
$$ -9628 -13428 -23057 -40744 -57492 -61522 -50469 -33770 -22716 -20198 -17895 -6274 14612 35216
720C5216J0849Q25k310j25n41o624j3200j3289q053n454j0204j7652j8459q297
$$ 35216 46065 46890 44580 44455 43914 37290 24090 10801 2748 -2706 -12910 -30562 -49021 -57318
734e7318N662J2425P788m13r29Q746K0384K3514J5738N494J464L437M199r36p919
$$ -57318 -51656 -39231 -31443 -31856 -32785 -24039 -3655 19859 35597 41091 42555 45992 50191 49255 41336
749D1336j1036q813o955j0710j8039k0657j3447j269N877K949m361n235M335J7724
$$ 41336 30300 21487 14532 3822 -14217 -34874 -48321 -49590 -43713 -40764 -45125 -50360 -46025 -28301
763b8301K3472J8408R703N705P924J0136O616j046o622o841n793q789j5810j9927
$$ -28301 -4829 13579 23282 28987 36911 47047 53663 52617 45995 39154 33361 24572 8762 -11165
777a1165j6025o337K85j713q851j0581k220J0894J8582J6267R116O156J0018J4794
$$ -11165 -27190 -33527 -33242 -34955 -43806 -54387 -56607 -45713 -27131 -10864 -1748 4408 14426 29220
791B9220J3571O712j45k630k407m715j1324j7309j6506r697l844m951j0888j3471
$$ 29220 42791 49503 49358 46728 44321 39606 28282 10973 -5533 -15230 -19074 -24025 -34913 -48384
805d8384o904N166J3250J1960O278L832Q572J5292J7026J1871M768J559K129P47
$$ -48384 -55288 -50122 -36872 -24912 -18634 -14802 -6230 9062 26088 37959 42727 44286 46415 47162
819D7162m920j1972j4432j1000o739p643j3202j6235j1116n93P653P961K937Q34
$$ 47162 42242 30270 15838 4838 -1901 -9544 -22746 -38981 -50097 -50690 -43037 -35076 -32139 -31305
833c1305N943J4164J8067J4672Q188M816N493N974K100n044r687r007o638p914
$$ -31305 -25362 -11198 6869 21541 29729 34545 40038 46012 48112 43068 33381 24374 17736 9822
847I822j3224j7298j4682n849J925K886j318l305J537J0476J6210J4778R243N971
$$ 9822 -3402 -20700 -35382 -41231 -39306 -36420 -37738 -41043 -39506 -29030 -12820 1958 11201 17172
861A7172P459R497P699J661l757m881l914n203j0643j5981j5643r278k543j122
$$ 17172 24631 34128 41827 43488 39731 34850 30936 25733 15090 -891 -16534 -25812 -28355 -29477
875b9477m631p089l050N866J3036J3341Q776N699P334J0670J0628N922O10j348
$$ -29477 -34108 -41197 -44247 -38381 -25345 -12004 -3228 2471 9805 20475 31103 37025 37635 36287
889C6287o83j735o691j2676j4556j0772n125l645o996j0097p513O07Q648J0666
$$ 36287 35604 33869 27178 14502 -54 -10826 -15951 -19596 -26592 -36689 -44202 -43595 -34947 -24281
903b4281P675N310P185J1399J2537R232M186J818K236J720k474q821j2481j0968
$$ -24281 -16606 -11296 -4111 7288 19825 29057 33243 35061 37297 39017 36543 27722 15241 4273
917D273o629m872p752j1846j1156m456L182O301M742L267N613J0433J3020J1152
$$ 4273 -2356 -7228 -14980 -26826 -37982 -42438 -39256 -32955 -28213 -24946 -19333 -8900 4120 15272
931A5272P075M845N413N724K728l620r208r836o717m867p516j2053j3012q438
$$ 15272 22347 27192 32605 38329 41057 37437 28229 18393 11676 6809 -707 -12760 -25772 -34210
945c4210j881J656J111L24K902P911J1386J0977Q011O164P153Q985P568J813m609
$$ -34210 -36091 -34435 -33324 -33000 -30098 -22187 -10801 176 8187 14351 21504 30489 38057 39870 35261
960C5261p323n449l656n862j0685j3233j0671n848k749k725k818l47M631Q876
$$ 35261 27938 22489 18833 12971 2286 -10947 -21618 -27466 -30215 -32940 -35758 -36105 -31474 -22598
974b2598R740P591N826P343J0643J1213O700r4l948l018j528l438q113j1371j1078
$$ -22598 -12858 -5267 559 7902 18545 29758 36458 36364 32416 29398 27870 24432 16319 4948 -6130
989f130q260o298n990o195m069N17N420P420N903M342O028J0697J3261J0341M175
$$ -6130 -14390 -20688 -26678 -32873 -36942 -36425 -31005 -23585 -17682 -13340 -7312 3385 16646 26987 31162
1004C1162j2j71R57m61m421q225r516q657p810q096q546p574l669J695M574L503
$$ 31162 31150 30979 31936 31475 27054 18829 9313 656 -7154 -15250 -23796 -31370 -35039 -33344 -28770 -25267
1020b5267J534L401Q853J3091J1999P333L527K751L237K194p41m134o586p328
$$ -25267 -23733 -20332 -11479 1612 13611 20944 24471 27222 30459 32653 31912 27778 21192 13864
1034A3864p312q047r803j0267p066j722J625O12j451P6N687J0933J1755R016O348
$$ 13864 6552 -1495 -11298 -21565 -28631 -30353 -28728 -28116 -29567 -29491 -23804 -12871 -1116 7900 14248
1049A4248N204N052M641K891k54l111m725n062o567r516j1548r599m404j007j826
$$ 14248 19452 24504 29145 32036 31782 28671 23946 18884 12317 2801 -8747 -18346 -22750 -23757 -25583
1064b5583m290l205J642O915R330R074P728O616O384O508N708L270K50j347j519
$$ -25583 -29873 -33078 -31436 -24521 -15191 -6117 1611 8227 14611 21119 26827 30097 30347 29000 27481
1079B7481l302p781j1524j0510o017l038l972o107n882k581J999N548P478P488
$$ 27481 24179 16398 4874 -5636 -11653 -14691 -18663 -24770 -30652 -33233 -31234 -25686 -18208 -10720
1093a0720O680O524P514P705N473K763K006K478N44m764r588r861o670m248m826
$$ -10720 -4040 2484 9998 17703 23176 25939 27945 30423 30967 26203 16615 6754 84 -4164 -8990
1108h990o705p288n897k827J320M593N721N286N741P587Q299O257M047M542O009
$$ -8990 -15695 -22983 -28880 -31707 -30387 -25794 -20073 -14787 -9046 -1459 6840 13097 17144 21686 27695
1123B7695M479r49o211p718o208m805m889o076p366q262o733k609J147K759K739
$$ 27695 32174 31225 25014 17296 11088 6283 1394 -4682 -12048 -20310 -27043 -29652 -28505 -25746 -23007
1138b3007M308O975P843N800M335N946Q343P383K880k074m560m918m574m060m401
$$ -23007 -18699 -11724 -3881 1919 6254 12200 20543 27926 30806 28732 24172 19254 14680 10620 6219
1153F219o493r004q896n538k177r11m88K287N708O374M590L583N986Q917Q991
$$ 6219 -274 -9278 -18174 -23712 -25889 -26800 -27288 -25001 -19293 -12919 -8329 -4746 1240 10157 19148
1168A9148O212K525q38l014l596k527k215m836q410r176o911n073m653l720k72
$$ 19148 25360 27885 27047 24033 20437 17910 15695 10859 2449 -6727 -13638 -18711 -23364 -27084 -27356
1183b7356L512M375K600K397M904P766Q986Q443O504K946q40j882m26J64k694
$$ -27356 -23844 -19469 -16869 -14472 -9568 -1802 7184 15627 22131 25077 24237 22355 21929 22093 19399
1198A9399o621p728o630o486p529o554k646J086J703O80R51K834N051P230R174
$$ 19399 12778 5050 -1580 -8066 -15595 -22149 -24795 -23709 -22006 -21326 -20375 -17541 -12490 -5260 3914
1213C914R140N773J456O9J702K036o85m044m749m892o637q955q228m569j674o75
$$ 3914 13054 18827 20283 20352 22054 24090 23405 19361 14612 9720 3083 -5872 -14100 -18669 -20343 -21018
1229b1018q90l08M46J490M416Q392J0146P464L327K198L548L425R75j171j329
$$ -21018 -21908 -22216 -21770 -20280 -15864 -7472 2674 10138 13465 15663 19211 22636 23611 22440 21111
1244B1111k372n638q615q455o027m091l130j970j202k004k169R93O517R276P336
$$ 21111 18739 13101 4486 -3969 -9996 -14087 -17217 -19187 -20389 -22393 -24562 -23569 -17052 -7776 -440
1259d40M502M241N099M211K163J644K113O21l385o528p171o600o178m866k506
$$ -440 4062 8303 13402 17613 19776 21420 23533 24154 20769 14241 7070 470 -5708 -10574 -13080
1274a3080j890m050n328k190L426O523N907M987N616N871M271L014L745M728L036
$$ -13080 -14970 -19020 -24348 -26538 -23112 -16589 -10682 -5695 -79 5792 10063 13077 16822 21550 24586
1289B4586n75l233m658o282p209n675k415k215n138p125m593N5K786L336M346
$$ 24586 24011 20778 16120 9838 2629 -3046 -5461 -7676 -12814 -19939 -24532 -24477 -21691 -18355 -14009
1304a4009O109N812L828L325N004O010M550K326R01j318m934p227n477k300k222
$$ -14009 -7900 -2088 1740 5065 10069 16079 20629 22955 23856 22538 17604 10377 4900 2600 378
1319C78n385p521n843k989j429N3L045N279M689L083L227N133N894M936M703M779
$$ 378 -5007 -12528 -18371 -21360 -22789 -22736 -19691 -14412 -9723 -6640 -3413 1720 7614 12550 17253 22032
1335B2032K308k635n866m290j520j975m833o325n796n239n131k906J011L515K978
$$ 22032 24340 21705 15839 11549 10029 8054 3221 -3104 -8900 -14139 -19270 -22176 -21165 -17650 -14672
1350a4672J896K989M523M312M109N902P310N016m15l499k573q26j712l555m064
$$ -14672 -12776 -9787 -5264 -952 3157 9059 16369 21385 20970 17471 14898 14072 12360 8805 4741
1365D741m371o085p313n070r31J029P95J103K775L420K274K743O113Q651O687
$$ 4741 370 -5715 -13028 -18098 -19029 -18000 -17205 -16102 -13327 -9907 -7633 -4890 1223 9874 16561
1380A6561J869p63n64m71j688k117j742k994o294q190o058k824j570j461J96K318
$$ 16561 18430 17667 17103 16632 14944 12827 11085 8091 1797 -6393 -12451 -15275 -16845 -18306 -18110 -15792
1396a5792J911J74J141N490Q522P230M084K620J893K55j032l07P16j309n412p438
$$ -15792 -13881 -13707 -12566 -7076 1446 8676 12760 15380 17273 17528 16496 16189 16905 15596 10184 2746
1412B746o167m528m603l853q63J349K56j907m03L801O654O340N547N193L791J060
$$ 2746 -3421 -7949 -12552 -16405 -17268 -15919 -15663 -17570 -17973 -14172 -7518 -1178 4369 9562 13353 14413
1428A4413k15J635K800M93l589n090m627n173o361n350j864P9j473l136j720J611
$$ 14413 14198 15833 18633 19126 15537 10447 5820 647 -5714 -11064 -12928 -12849 -14322 -17458 -19178 -17567
1444a7567L565M441N698O733N011J716R60L087M035J566j336k063k521m874p122
$$ -17567 -14002 -9561 -3863 2870 7881 9597 10557 13644 17679 19245 17909 15846 13325 8451 1329
1459A329o197k829j581k877l686k279n15J21J703N111P237N344K450K381M180
$$ 1329 -4868 -7697 -9278 -12155 -15841 -18120 -18635 -18514 -16811 -11700 -4463 881 3331 5712 9892
1474I892M493K323J053J405L46l331o388n630l579l100m251l933k779l064l618
$$ 9892 14385 16708 17761 19166 19512 16181 9793 4163 584 -2516 -6767 -10700 -13479 -16543 -20161
1489b0161j470L181N793M625K899L544M918M227K572K933M190K962j041l852l826
$$ -20161 -21631 -18450 -12657 -8032 -5133 -1589 3329 7556 10128 13061 17251 20213 19172 15320 11494
1504A1494l330l928m034k561j992m168o202m121L40K796K255K155L707M379K795
$$ 11494 8164 4236 202 -2359 -4351 -8519 -14721 -18842 -18502 -15706 -13451 -11296 -7589 -3210 -415
1519d15J955L892N829M667J443q29j636l015m517l630j083r39m154o575m980j367
$$ -415 1540 5432 11261 15928 17371 16542 14906 11891 7374 3744 2661 1722 -2432 -9007 -13987 -15354
1535a5354L02O09J908L807L312J107Q75L481N592M852L165K205P12k459m572k827
$$ -15354 -15052 -14443 -12535 -8728 -5416 -4309 -3434 47 5639 10491 13656 15861 16573 14114 9542 6715
1551F715J24k60l924o459n576l588k599j318J577L656K617O21R59L421M842M659
$$ 6715 6839 6579 2655 -3804 -9380 -12968 -15567 -16885 -15308 -11652 -9035 -8414 -7455 -4034 808 5467
1567E467M667M630K573j801m002j999R64M09k887m937n010m939n089l297J49K039
$$ 5467 10134 14764 17337 15536 11534 9535 10499 10908 8021 3084 -1926 -6865 -11954 -15251 -15102 -13063
1583a3063P44o70L57K481L448L925N754P129M637n1k302n61J536O29j760l023
$$ -13063 -12319 -12989 -12632 -10151 -6703 -2778 2976 10105 14742 14691 12389 11828 13364 13993 12233 9210
1599I210l944n440o292m162q59K90r75j319k7R81Q17J931N163P338N397J481n8
$$ 9210 5266 -174 -6466 -10628 -11487 -11197 -12172 -13491 -13518 -12537 -11720 -9789 -4626 2712 8109 9590 9532
1616I532J255K252J261J47n22k234n067o329m436k075j845k706j887k65k84j217
$$ 9532 10787 13039 14300 14447 13925 11691 6624 295 -4141 -6216 -8061 -10767 -12654 -12919 -13203 -14420
1632a4420K33M081O532N129K438J764K457K276J552J566J608m14l590m806l491
$$ -14420 -14187 -10106 -3574 1555 3993 5757 8214 10490 12042 13608 15216 14802 11212 6406 2915
1647B915k688l508m014k227n61j409k891j478K151M205L847L089L388L352K302
$$ 2915 227 -3281 -7295 -9522 -10083 -11492 -14383 -15861 -13710 -9505 -5658 -2569 819 4171 6473
1662F473J850K909L176J035j794k543j851k841m793m789k289r31k218l620k508
$$ 6473 8323 11232 14408 15443 13649 11106 9255 6414 1621 -3168 -5457 -6388 -8606 -12226 -14734
1677a4734R1J696K196L160M087L588J887J900L379L669J824K1L26L14k010m670
$$ -14734 -14643 -12947 -10751 -7591 -3504 84 1971 3871 7250 10919 12743 12764 13090 13404 11394 6724
1693F724m627k224j276k626l869l349k256j508j65K513M274L485J999K542L913
$$ 6724 2097 -127 -1403 -4029 -7898 -11247 -13503 -15011 -15176 -12663 -8389 -4904 -2905 -363 3550
1708C550L763K091J643K518J935j332m238m099k211j472k057k617k715l399l899
$$ 3550 7313 9404 11047 13565 15500 14168 9930 5831 3620 2148 91 -2526 -5241 -8640 -12539
1723a2539k077J001K600J744R17K033L438L109K438L341N045M236P42k321k919
$$ -12539 -14616 -13615 -11015 -9271 -8354 -6321 -2883 226 2664 6005 11050 15286 16028 13707 10788
1738A0788k336k138k246k093k584m345n132l000K73J720R29P74J818K294J280
$$ 10788 8452 6314 4068 1975 -609 -4954 -10086 -13086 -12813 -11093 -10164 -9390 -7572 -5278 -3998
1753c998Q80K849N058M824K409K65n92j001j271r43l50j849m788o270m526j747
$$ -3998 -3118 -269 4789 9613 12022 12287 11695 10694 9423 8480 8130 6281 1493 -4777 -9303 -11050
1769a1050o76o58L45J916K202Q67R52K732M768M462K987J639L25r13j267J51J141
$$ -11050 -11726 -12384 -12039 -10123 -7921 -7054 -6102 -3370 1398 5860 8847 10486 10811 9898 8631 8782 9923
1786I923k39l508m957l960k585k497k541j003O30O10j24N2K060L759M221M219
$$ 9923 9684 6176 1219 -2741 -5326 -7823 -10364 -11367 -10737 -10127 -10251 -10199 -8139 -4380 -159 4060
1802D060L828K173j58p17O12J736J79k565l772l263k934l582l365j631j05j07
$$ 4060 7888 10061 9903 9186 9798 11534 11713 9148 5376 2113 -821 -4403 -7768 -9399 -9504 -9611
1818i611p92m17O69J738K689M093M693L083O21J7J549K533J125q25j622j743k751
$$ -9611 -10403 -10820 -10151 -8413 -5724 -1631 3062 6145 6766 6783 8332 10865 11990 11165 9543 7800 5049
1835E049m047m063k642j607j378j318q79n61k75J304L893N217L852J400P45J975
$$ 5049 1002 -3061 -5703 -7310 -8688 -10006 -10885 -11446 -11721 -10417 -6524 -1307 2545 3945 4690 6665
1851F665K357J293K10M5l79j823l334l553k868k141j797j252j040k079k621q24
$$ 6665 9022 10315 10525 10570 10191 8368 5034 1481 -1387 -3528 -5325 -6577 -7617 -9696 -12317 -13141
1867a3141K472M326L562J896J655K486K663J967J660J599R25r16k452k961l144
$$ -13141 -10669 -6343 -2781 -885 770 3256 5919 7886 9546 11145 12070 11154 8702 5741 2597
1882B597k876k187j124j090k741l771k088J064L116K858J946J894K267K282K056
$$ 2597 -279 -2466 -3590 -4680 -7421 -11192 -13280 -12216 -9100 -6242 -4296 -2402 -135 2147 4203
1897D203K236K579J747L85q01j641k473k766j842o19r48l176m657l493p84J047
$$ 4203 6439 9018 10765 11150 10349 8708 6235 3469 1627 1008 60 -3116 -7773 -11266 -12050 -11003
1913a1003J261J267J651K057K228K784L438L342K470J382M52o29k293k952j864
$$ -11003 -9742 -8475 -6824 -4767 -2539 245 3683 7025 9495 10877 11329 10700 8407 5455 3591
1928C591m95o98k591l877l132j218q0Q4M3J49L92Q67K021L083L199K791K772K823
$$ 3591 3096 2398 -193 -4070 -7202 -8420 -8500 -8416 -8373 -8224 -7832 -6965 -4944 -1861 1338 4129 6901 9724
1946I724J763l11j692j388o40j426l180m293l569k140j011m34j25O1J96R75K033
$$ 9724 11487 11176 9484 8096 7456 6030 2850 -1443 -5012 -7152 -8163 -8597 -8722 -8661 -8465 -7490 -5457
1963e457K495J896J318J825K847K381R86K1L17P53k22j830k955k985k735k366
$$ -5457 -2962 -1066 252 2077 4924 7305 8291 8312 8629 9382 9160 7330 4375 1390 -1345 -3711
1979c711k284k143j998j401M15K332K785J928J384K022L319L147J852O19M44J24
$$ -3711 -5995 -8138 -10136 -11537 -11122 -8790 -6005 -4077 -2693 -671 2648 5795 7647 8266 8710 8834
1995H834m32j336j605j589j569j478j776k533l131k637p34J200J337K24k38J031
$$ 8834 8402 7066 5461 3872 2303 825 -951 -3484 -6615 -9252 -9986 -8786 -7449 -7225 -7463 -6432
2011f432K961L985L495K759J870Q51M2o57r60j190j380j684k043k951l675k957
$$ -6432 -3471 514 4009 6768 8638 9489 9531 8874 7914 6724 5344 3660 1617 -1334 -5009 -7966
2027g966o40J331J183m73j345n31J505L023L575L252K200J267P60N75O80L51j48
$$ -7966 -8606 -7275 -6092 -6565 -7910 -8441 -6936 -3913 -338 2914 5114 6381 7141 7716 8396 8747 8599
2044H599o64j669l403m519l736j305P17N63r26k213j533M92K458L670L361K230
$$ 8599 7935 6266 2863 -1656 -5392 -6697 -5980 -5417 -6343 -8556 -10089 -9597 -7139 -3469 -108 2122
2060B122J183Q90J364J566J421J016M53r11k924m421l924j646J80K46j334k615
$$ 2122 3305 4195 5559 7125 8546 9562 10015 9104 6180 1759 -2165 -3811 -3631 -3385 -4719 -7334
2076g334k437o29J734L145K984J645N53P30J565K253K248K312J817M65j764l556
$$ -7334 -9771 -10400 -8666 -5521 -2537 -892 -339 391 1956 4209 6457 8769 10586 11051 9287 5731
2092E731l472j904o39q51k151l593l466j453J294L184K933J547N58O95J608K125
$$ 5731 2259 355 -284 -1135 -3286 -6879 -10345 -11798 -10504 -7320 -4387 -2840 -2282 -1587 21 2146
2108B146K188K205J953J059o21j784j823p62L6n22k280m236m557l131m31J433
$$ 2146 4334 6539 8492 9551 8930 7146 5323 4561 4597 4075 1795 -2441 -6998 -10129 -10560 -9127
2124i127J460M11Q4Q46K183L039L093K801K239J455R1r50r76l38K94j33j653l533
$$ -9127 -7667 -7256 -7172 -6326 -4143 -1104 1989 4790 7029 8484 8575 7625 6649 6311 6605 6472 4819 1286
2142A286m054k915p02N76J96j139j621l39J347K418K589K415K146J650J137P22
$$ 1286 -2768 -5683 -6385 -5809 -5613 -6752 -8373 -8712 -7365 -4947 -2358 57 2203 3853 4990 5712
2158E712O38Q83R85M11j271l084l877k858j003r7p04j927k139o98J351K598K725
$$ 5712 6350 7233 8218 8629 7358 4274 397 -2461 -3464 -3561 -4265 -6192 -8331 -9029 -7678 -5080 -2355
2175b355K049J210R67Q23P91Q13R61J065P06l75j834k439j615k76l7j369l147
$$ -2355 -306 904 1871 2694 3485 4298 5259 6324 7030 6655 4821 2382 767 491 454 -915 -4062
2192d062l598k275O6J984K349J854J327J527K152K411K088J536R54J26j093k311
$$ -4062 -7660 -9935 -9869 -7885 -5536 -3682 -2355 -828 1324 3735 5823 7359 8313 8439 7346 5035
2208E035k360j402O4M08q16k570l426k424l72R65R07J29m83J77J574K938L411
$$ 5035 2675 1273 1337 1745 929 -1641 -5067 -7491 -7863 -6898 -5991 -5862 -6345 -6168 -4594 -1656 1755
2225A755L074K389J581K97j004j692j234k98l32j494l190l752k566m63J143J009
$$ 1755 4829 7218 8799 9096 8092 6400 5166 4868 4536 3042 -148 -3900 -6466 -6929 -5786 -4777
2241d777l97j273r35O06K141K738K667K208J805J139L86P2L00O83L98j190l062
$$ -4777 -5174 -6447 -7382 -6776 -4635 -1897 770 2978 4783 5922 6308 6380 6680 7363 7761 6571 3509
2258C509l950l115r33M30L81j115k009j501J86J841K454K206J743J422J395J166
$$ 3509 -441 -3556 -4489 -4059 -3678 -4793 -6802 -8303 -8117 -6276 -3822 -1616 127 1549 2944 4110
2274D110J050J160J403R72m04k438l423k915j320K5j92j585k532k027l28J547
$$ 4110 5160 6320 7723 8695 8291 5853 2430 -485 -1805 -1780 -1972 -3557 -6089 -8116 -8444 -6897
2290f897K026J529J030Q46J121J427J609J738J971J648O16j115k278k136r83k40
$$ -6897 -4871 -3342 -2312 -1466 -345 1082 2691 4429 6400 8048 8664 7549 5271 3135 2152 1912
2306A912q47k394l426k869j008R16J599J164N27O15J168J833J936J952J732J483
$$ 1912 1065 -1329 -4755 -7624 -8632 -7716 -6117 -4953 -4426 -3811 -2643 -810 1126 3078 4810 6293
2322F293P13m85j276j185j78L49k17j934l336l107j520rM55j60p91m49O83J806
$$ 6293 7006 6521 5245 4060 3882 4231 4014 2080 -1256 -4363 -5883 -5892 -5437 -5597 -6388 -6837 -6154 -4348
2340d348K369K533K307K076J416N01n41o60j59K05n25k038l157k877j292J82M25
$$ -4348 -1979 554 2861 4937 6353 6854 6313 5653 5494 5699 5174 3136 -21 -2898 -4190 -4008 -3583
2357c583k90j370j276j80R33J613J669J580J703J711J340R60P60J104J172K33
$$ -3583 -3873 -5243 -6519 -6699 -5766 -4153 -2484 -904 799 2510 3850 4810 5570 6674 7846 8079
2373H079j587k953l248k076n93k89r09j817j606l38J012J677J412J159J055J292
$$ 8079 6492 3539 291 -1785 -2378 -2667 -3576 -5393 -6999 -7337 -6325 -4648 -3236 -2077 -1022 270
2389B70J208R31Q97J361J518J120l25j729k078j487n47m35j405k578k490j346
$$ 270 1478 2409 3306 4667 6185 7305 6980 5251 3173 1686 1139 704 -701 -3279 -5769 -7115
2405g115J49R83R18O76R30J280J630J400J261J549J656J372L54j058j576j179
$$ -7115 -6966 -5983 -5065 -4389 -3459 -2179 -549 851 2112 3661 5317 6689 7043 5985 4409 3230
2421C230m19k89j205k456k639j567k75L13K57j12K48P99J205J325J145J357J794
$$ 3230 2811 2522 1317 -1139 -3778 -5345 -5620 -5307 -5050 -5162 -4914 -4115 -2910 -1585 -440 917 2711
2438B711J932J293K97n57n25No5j087k467k872k174j076m42m61o27j36P90J443
$$ 2711 4643 5936 6233 5676 5151 5156 5091 4004 1537 -1335 -3509 -4585 -5027 -5488 -6115 -6251 -5461 -4018
2456d018J447J081J027J237J703J452P04J2l7M86O88j58j446k062j903j284j213
$$ -4018 -2571 -1490 -463 774 2477 3929 4633 4645 4608 5094 5782 5624 4178 2116 213 -1071 -2284
2473b284j510j687j377j34R07J255J082R62J312J905K108J244N26L5M40P02J06
$$ -2284 -3794 -5481 -6858 -6992 -6085 -4830 -3748 -2786 -1474 431 2539 3783 4309 4344 4784 5486 5592
2490E592p98j313j201p44r28j600k157j947r72K7N42L19J69P33J803K414J946
$$ 5592 4794 3481 2280 1536 608 -992 -3149 -5096 -6068 -6041 -5499 -5180 -5011 -4278 -2475 -61 1885
2507A885J104O07P22Q47L88l30q14p01m73n83j149k029k199j535m88j35m82p92
$$ 1885 2989 3596 4318 5165 5553 5223 4409 3708 3235 2652 1503 -526 -2725 -4260 -4748 -4883 -5365 -6157
2525f157k02J135K244K189J654J214J290J289P98Nn01o17m77l25p58j556j862
$$ -6157 -6359 -5224 -2980 -791 863 2077 3367 4656 5454 5459 4958 4341 3864 3539 2781 1225 -637
2542f37j487m43j85q17j504j280j11J099J342J387J317J810J931J833J192L81
$$ -637 -2124 -2567 -2752 -3569 -5073 -6353 -6464 -5365 -4023 -2636 -1319 491 2422 4255 5447 5828
2558E828j07l18j86o90j617k173j786o63j36o20j289j169l67L88M75M18M72R40
$$ 5828 5721 5403 5217 4527 2910 737 -1049 -1712 -1848 -2468 -3757 -4926 -5293 -4905 -4430 -4012 -3540 -2600
2576b600J561J948J756J141O13P11J008M01p43k015j971j248q36j171j596j340
$$ -2600 -1039 909 2665 3806 4419 5130 6138 6539 5796 3781 1810 562 -274 -1445 -3041 -4381
2592d381o70L8K22J56K66O27J277J790J603R84L92O72J585J331K89r57j257j032
$$ -4381 -5051 -5013 -4791 -4635 -4369 -3742 -2465 -675 928 1912 2304 2976 4561 5892 6181 5224 3967 2935
2610B935q47j134j549j570j242q02n46n59l04J47J038J945J798Q36L18P62J837
$$ 2935 2088 954 -595 -2165 -3407 -4209 -4755 -5314 -5618 -5471 -4433 -2488 -690 146 464 1226 3063
2627C063J979J048j20q64q48q68r38j123j247j326j183j011r92j058n78N65J738
$$ 3063 5042 6090 5970 5106 4258 3390 2452 1329 82 -1244 -2427 -3438 -4430 -5488 -6066 -5501 -3763
2644c763J526N42j67N27J856K450J768Q30p0m60n21n53n89r22j306j477j296j449
$$ -3763 -2237 -1695 -1862 -1335 521 2971 4739 5569 5499 5039 4518 3965 3376 2454 1148 -329 -1625 -3074
2662c074j727j247J04J401J341K60l80J68J483K417K150J466M17j22l04pO8k86
$$ -3074 -4801 -6048 -5944 -4543 -3202 -2942 -3322 -3154 -1671 746 2896 4362 4779 4657 4353 4346 4414 4128
2680D128r14j120j156j634k291j822m87Q43P91j94q27k15J079K011K393J995R32
$$ 4128 3214 2094 938 -696 -2987 -4809 -5296 -4453 -3662 -3856 -4683 -4898 -3819 -1808 585 2580 3512
2697C512J41J42N19O68N7o43o71q68j491k339k063p90L01K97n23j000p22L74J341
$$ 3512 3653 3795 4314 4982 5039 4396 3725 2857 1366 -973 -3036 -3826 -3525 -3228 -3751 -4751 -5473 -5099 -3758
2716c758K100K022J051L41N61J217J190N13j69j23l19j159k053k206j303l31k60
$$ -3758 -1658 364 1415 1756 2317 3534 4724 5237 5068 4945 4626 3467 1414 -792 -2095 -2426 -2686
2733b686p50j007j101l36Q65J747J761R64L06Q13J633J595P27K13L45M00n40j369
$$ -2686 -3436 -4443 -5544 -5880 -5015 -3268 -1507 -543 -237 576 2209 3804 4531 4744 5089 5489 4949 3580
2751C580j692j393r42q48j033j164j442j002J54J202J273L41K58J072J964J818
$$ 3580 1888 495 -447 -1295 -2328 -3492 -4934 -5936 -5782 -4580 -3307 -2966 -2708 -1636 328 2146
2767B146Q94N76Q42Q67M17n15q66j125j324j251j053j282j665j486l45N85L40
$$ 2146 3040 3616 4458 5325 5742 5227 4361 3236 1912 661 -392 -1674 -3339 -4825 -5170 -4585 -4245
2784d245k12m2J035J877J679Q37N86P91J067R25Q23K92n19j096j006q48j106j774
$$ -4245 -4457 -4499 -3464 -1587 92 929 1515 2306 3373 4298 5121 5413 4894 3798 2792 1944 838 -936
2802i36j818p73j50n71q78m09R13J907J669R09M49M45O87J170J357R25k10r04
$$ -936 -2754 -3527 -3677 -4248 -5126 -5535 -4622 -2715 -1046 -137 312 757 1444 2614 3971 4896 4686 3782
2820C782p09k72o32j350j342o79n84j352j722j115M73J466J492J090P17L03N99
$$ 3782 3073 2801 2169 819 -523 -1202 -1786 -3138 -4860 -5975 -5502 -4036 -2544 -1454 -737 -434 165
2837A65J476K048J420o9q25n78k89n98r69q43m61o61j612k082j495l29P56J033
$$ 165 1641 3689 5109 5040 4215 3637 3348 2750 1781 938 477 -184 -1796 -3878 -5373 -5702 -4946 -3913
2855c913R69M11j31L46J778K736K154O31l15k18q5l95p77n54j30p43j640k240
$$ -3913 -2944 -2533 -2664 -2318 -540 2196 4350 4981 4666 4448 4363 3968 3191 2637 2507 1764 124 -2116
2873b116j697r63p3O38O92j15p92k45J432K777K389J147M91M73M34j69l21k1O4
$$ -2116 -3813 -4776 -4849 -4211 -3519 -3634 -4426 -4671 -3239 -462 1927 3074 3565 4038 4472 4303 3982 3961 4025
2892D025n71j355j923j844j550o38L41N39l95j442q30Q55K118K029J293R75J060
$$ 4025 3454 2099 176 -1668 -3218 -3856 -3515 -2976 -3371 -4813 -5643 -4788 -2670 -641 652 1627 2687
2909B687P96M13K53M41K91l61q95j312j833j981j251P8M17p23j516j207L29J356
$$ 2687 3483 3896 4149 4590 4881 4520 3625 2313 480 -1501 -2752 -2674 -2257 -2980 -4496 -5703 -5374 -4018
2927d018J255J077J208J226J049P93R30Q28N54J55K1n60j476k105j674l32n2r44
$$ -4018 -2763 -1686 -478 748 1797 2590 3520 4348 4902 5057 5078 4518 3042 937 -737 -1069 -1121 -2065
2945b065j729j342j66M91N25P33J002J074J004J155J329R97O17N61Q89N40p83
$$ -2065 -3794 -5136 -5302 -4811 -4286 -3553 -2551 -1477 -473 682 2011 3008 3625 4186 5075 5615 4832
2962D832j817j503n38l34j035j723j380o47l36j86K12N03P39Q57J397J449Q43
$$ 4832 3015 1512 974 640 -395 -2118 -3498 -4145 -4481 -4667 -4455 -3952 -3213 -2356 -959 490 1333
2979A333M18P52J552J365j55j133j044m66m95j088j436j102j084r05p08l02m6
$$ 1333 1751 2503 4055 5420 5265 4132 3088 2622 2127 1039 -397 -1499 -2583 -3488 -4196 -4498 -4544
2996d544J60N73J503J554O32K3P23J970J831O04m37m86l54n32q86r44r58j159
$$ -4544 -4384 -3811 -2308 -754 -122 -99 624 2594 4425 5029 4592 4106 3752 3220 2334 1390 432 -727
3014g27j328j064p51p17o52L84J483J313L59k08P22J970J960J208L82J62j00n02
$$ -727 -2055 -3119 -3870 -4587 -5239 -4855 -3372 -2059 -1700 -1908 -1186 784 2744 3952 4334 4496 4396 3894
3032C894n02m31n78j154j248j046j099j528j308j34J102J027k1l72M23J570J812
$$ 3894 3392 2961 2383 1229 -19 -1065 -2164 -3692 -5000 -5134 -4032 -3005 -3026 -3398 -2975 -1405 407
3049D07J584J256P50J78k27PP3l65r59r22o64j199k018j809o43P18N99l17n29
$$ 407 1991 3247 3997 4175 3948 3955 4028 3663 2704 1782 1118 -81 -2099 -3908 -4551 -3833 -3234 -3551 -4080
3068d080KQ69J326J685J722J121M70K90M71M99j74n90l74j83r64k219k238r58
$$ -4080 -4078 -3209 -1883 -198 1524 2645 3115 3405 3876 4375 4201 3611 3237 3054 2090 -129 -2367 -3325
3086c325J56J40m67o16l78N9P72J468J766J289O38O17J129Q03k2j45J59M00o05
$$ -3325 -3169 -3029 -3496 -4112 -4490 -4431 -3659 -2191 -425 864 1502 2119 3248 4051 4029 3884 4043 4443 3838
3105C838j887k056j256o10l63n04o48p86o15%J151J518J095N95J132J404J046
$$ 3838 1951 -105 -1361 -1971 -2334 -2838 -3486 -4272 -4887 -4887 -3736 -2218 -1123 -528 604 2008 3054
3122C054Q9J63P10R89m0j255j594j461r95o59n59o20j162j268n08O10R88N88N60
$$ 3054 3143 3306 4016 5005 4965 3710 2116 655 -340 -999 -1558 -2178 -3340 -4608 -5116 -4506 -3518 -2930 -2370
3141b370J332J665J001J89L69J113J206O14m20r36j245j224p90m37n79j397j689
$$ -2370 -1038 627 1628 1817 2186 3299 4505 5119 4699 3763 2518 1294 504 67 -512 -1909 -3598
3158c598q76L0K65n3K75J251J654R88L59N40J142J401J078N41k89r04j199p97
$$ -3598 -4474 -4444 -4179 -4232 -3957 -2706 -1052 -64 295 835 1977 3378 4456 4997 4708 3804 2605 1808
3176A808j60m67j379j779j078m26n15p35j62J025J270Q82M61N93R43J311J426
$$ 1808 1648 1181 -198 -1977 -3055 -3481 -3996 -4731 -4893 -3868 -2598 -1716 -1255 -662 281 1592 3018
3193C018J381N51n49r16m60Jl06j331j554j016p33j105j237n88L95P40O36M90
$$ 3018 4399 4950 4401 3485 3025 3026 2720 1389 -165 -1181 -1914 -3019 -4256 -4844 -4449 -3709 -3073 -2583
3211b583N02N62R76J712J914J128n8m79k5L20k21r57j147p63q60j398j574j039
$$ -2583 -2081 -1519 -543 1169 3083 4211 4153 3674 3649 3969 3748 2791 1644 881 21 -1377 -2951 -3990
3229c990k87K04L98L51K47N9M25J557K191J515M18K6N12N86q3m91n58m73p41j282
$$ -3990 -4277 -4073 -3675 -3324 -3077 -3018 -2593 -1036 1155 2670 3088 3114 3626 4212 4129 3638 3080 2607 1866 584
3249E84j531j402j043m71J35L21o5m86m8J152J936J606O63O10Q86Q79K66j09p9
$$ 584 -947 -2349 -3392 -3863 -3728 -3407 -3472 -3958 -4006 -2854 -918 688 1351 1961 2847 3726 3992 3883 3804
3268C804j14l67q70j320j560j591r76j17K15l47r75n07O30J426J304Q67R86J182
$$ 3804 3690 3323 2453 1133 -427 -2018 -2994 -3111 -2896 -3243 -4218 -4725 -4095 -2669 -1365 -498 488 1670
3286A670R50N38M04L52K01j21k43o84j432j856j434l18M9o00j366q31P2P41Q80
$$ 1670 2620 3158 3562 3914 4115 3994 3751 3067 1635 -221 -1655 -1973 -1924 -2524 -3890 -4721 -4649 -3908 -3028
3305c028Q34J078J149J063P79P82N97M20L64L69Mj080j751j534l93j66p81j471
$$ -3028 -2194 -1116 33 1096 1875 2657 3254 3674 4038 4407 4411 3331 1580 46 -347 -513 -1294 -2765
3323b765j145m49oK93N02Q77R37J013J100R71P24N48P67J001O20n84j418j191
$$ -2765 -3910 -4359 -4365 -4072 -3570 -2693 -1756 -743 357 1328 2052 2600 3367 4368 4988 4404 2986 1795
3341A795n63l04p92j301j299q91n77l54J01M52M97Q45J116J050Q30M41R61J480
$$ 1795 1232 928 136 -1165 -2464 -3355 -3932 -4286 -4185 -3733 -3236 -2391 -1275 -225 605 1046 2007 3487
3359C487J220j0q50q37l53l38o48j130j191j260j015o16l42k47j9M94J063J036
$$ 3487 4707 4697 3847 3010 2657 2319 1671 541 -650 -1910 -2925 -3541 -3883 -4130 -4149 -3655 -2592 -1556
3377a556N15L63R60J746J504O57j43l25j94k45m18p64j021j313j175q53o98q52
$$ -1556 -1041 -678 282 2028 3532 4189 4046 3721 3527 3282 2864 2100 1079 -234 -1409 -2262 -2960 -3812
3395c812n92O4Q72Q78M23M5P09J624J603J151N49J42P4N6j06k92p97j167j013
$$ -3812 -4404 -4340 -3468 -2590 -2167 -2122 -1413 211 1814 2965 3514 3656 3730 3786 3680 3388 2591 1424 411
3414D11q53r44j382j232m22N54N93R1j18L89J155J552J444J061O81L15L02L31
$$ 411 -442 -1386 -2768 -4000 -4422 -3868 -3275 -3184 -3302 -2913 -1758 -206 1238 2299 2980 3295 3597 3928
3432C928J26m51p70o95n32j029j597j611q20M4J46j58m32p3N49J062J497J334
$$ 3928 4054 3603 2833 2138 1606 577 -1020 -2631 -3451 -3407 -3261 -3419 -3851 -3924 -3375 -2313 -816 518
3450E18R66O11N49P82M66o2l70k06j20p85j525j699j109l85o6l99p14n59m3O08
$$ 518 1484 2095 2644 3426 3892 3830 3460 3254 3134 2349 824 -875 -1984 -2369 -2435 -2834 -3548 -4107 -4150 -3542
3470c542J208J325R15O44Q34J037P63K04O3J93K03l13j158j628j259o80l71l37
$$ -3542 -2334 -1009 -94 550 1384 2421 3184 3388 3451 3644 3847 3534 2376 748 -511 -1191 -1562 -1899
3488a899q76r13o24P4Q87J036P71O58R02J185J025M41L26O27N05J45p45j219j213
$$ -1899 -2775 -3688 -4312 -4238 -3351 -2315 -1544 -886 16 1201 2226 2667 2993 3620 4125 4270 3525 2306 1093
3507A093q93m73m43q75j329j084k74L75N13M62M02Q71J227J108P16O45Q80R36
$$ 1093 200 -273 -716 -1591 -2920 -4004 -4278 -3903 -3390 -2928 -2526 -1655 -428 680 1396 2041 2921 3857
3525C857N04q1o89j048q17n78l65q19j469j364p04p1R2l9M6N45J041R91Q13P14
$$ 3857 4361 4280 3591 2543 1726 1148 783 -36 -1505 -2869 -3573 -3644 -3552 -3591 -3545 -3000 -1959 -968 -155 559
3545E59R20J082J018N29j01o36o15l43k52p57j367j453j022l88l59m30l87K44
$$ 559 1479 2561 3579 4108 4007 3371 2756 2413 2161 1404 37 -1416 -2438 -2826 -3185 -3615 -4002 -3758
3563c758O75R03P83O67P90J091J297J064M14j96l07p4o2n20j275j339j093o31
$$ -3758 -3083 -2180 -1397 -730 60 1151 2448 3512 3926 3730 3423 3349 3287 2767 1492 153 -940 -1571
3581a571o84q28q49l45K61O34O46N31M86R22J351J482J050L29J94K37L24k19p96
$$ -1571 -2255 -3083 -3932 -4277 -4016 -3382 -2736 -2205 -1719 -797 554 2036 3086 3415 3609 3846 4170 3951 3155
3600C155j072r39q18q61j156j255q82j74K01L93J39J15N01J140J476J225P08M84
$$ 3155 2083 1144 326 -535 -1691 -2946 -3828 -4002 -3801 -3408 -3269 -3154 -2653 -1513 -37 1188 1896 2380
3618B380O81P49K91k36n47n37n61p54j073j436j250q49j26K3j82k88K5P47J282
$$ 2380 3061 3810 4101 3865 3318 2781 2220 1466 393 -1043 -2293 -3142 -3268 -3245 -3427 -3715 -3690 -2943 -1661
3637a661J191Q34P05P26R07O25J51j49j65j65l46p11j295j380r84m14j65n11p96
$$ -1661 -470 364 1069 1795 2702 3327 3478 3329 3164 2999 2653 1942 647 -733 -1717 -2131 -2296 -2807 -3603
3656c603m24K96Q73J023Q31P39Q67J035R13N77K15N9m1M1m66j101j389j028n84
$$ -3603 -4027 -3731 -2858 -1835 -1004 -265 602 1637 2550 3127 3342 3401 3360 3401 2935 1834 445 -583 -1167
3675a167k55o21r47q30j24M24O92O27N26P68J052J101R28N19L13M43M49l3o07
$$ -1167 -1422 -2043 -2990 -3820 -3944 -3520 -2828 -2201 -1675 -907 145 1246 2174 2693 3006 3449 3898 3865 3258
3694C258j235j040o46n13p56j153j161n49K1L46L51K68M71R14J193J068O71N25
$$ 3258 2023 983 337 -176 -932 -2085 -3246 -3795 -3774 -3428 -3077 -2809 -2338 -1424 -231 837 1508 2033
3712B033O78P89M98k45o42q28m95m49p03j181j280r64m67m3k0j98J56N74J087
$$ 2033 2711 3500 3998 3753 3111 2283 1788 1339 636 -545 -1825 -2789 -3256 -3299 -3319 -3517 -3361 -2787 -1700
3731a700J068P95O07Q07R95R01L06k46m23l48l11m31j051j312j135p82k84m04
$$ -1700 -632 163 770 1577 2572 3473 3779 3533 3110 2762 2451 2020 969 -343 -1478 -2260 -2544 -2948
3749b948m24m08K33O81R40P34N16P53J077J160P58K67j53j8P2j55p09j114j127
$$ -2948 -3372 -3780 -3547 -2866 -1926 -1192 -676 77 1154 2314 3072 3339 3186 3168 3240 3085 2376 1262 135
3768A35q78o15n90q81p68k81L33N46N77M16O36J054J340R84N66K19K07L74J51
$$ 135 -743 -1358 -1948 -2829 -3597 -3878 -3545 -2999 -2422 -2006 -1370 -316 1024 2008 2574 2793 3000 3374 3525
3787C525l26q02r93p42n50o70r37j054p13j30J74J91P8K37P40J213J203Q64N24
$$ 3525 3199 2397 1404 662 112 -558 -1495 -2549 -3262 -3392 -3218 -3027 -2949 -2712 -1972 -759 444 1308 1832
3806A832N76P08O13J29n22p87p10m69o49r70j266r34m45j03m7j72j20M71Q90J002
$$ 1832 2408 3116 3729 3858 3336 2549 1839 1370 721 -249 -1515 -2449 -2894 -2997 -3044 -3216 -3336 -2865 -1975 -973
3826i73Q10N05O69R00R96O91m7k80l47k34l40q19j299j284q35m86m58m55m84P4
$$ -973 -163 342 1011 1911 2907 3598 3551 3271 2924 2690 2350 1531 232 -1052 -1887 -2373 -2831 -3286 -3770 -3696
3846c696O21Q93Q15N37P01Q47J154R56K75j11p6J17L2l89r37j042q73o26o08q60
$$ -3696 -3075 -2182 -1367 -830 -129 718 1872 2828 3103 2992 2916 3033 3065 2676 1739 697 -176 -802 -1410 -2270
3866b270q73n20Q0M87L93L41L87J023J308J236P86L52J53K29L28j37o16r65p86
$$ -2270 -3143 -3663 -3583 -3096 -2703 -2362 -1975 -952 356 1592 2378 2730 2883 3112 3440 3303 2687 1722 936
3885I36o14o31q14r69p36k45J36J16n6k4N38J019J231R30N85N28O06P78L57j59
$$ 936 322 -309 -1123 -2092 -2828 -3073 -2937 -2821 -2877 -2901 -2363 -1344 -113 817 1402 1930 2536 3314 3671 3512
3905C512o06o48n40n95r20j225j048n19j39q5k74k29K22P90J070Q69O17M94P19
$$ 3512 2906 2258 1718 1123 203 -1022 -2070 -2589 -2728 -2813 -3087 -3316 -3094 -2304 -1234 -365 252 746 1465
3924A465Q52P07K59j14k75k76k40o83j068j254q42l38m20n37n62k57L33P34Q22
$$ 1465 2317 3024 3283 3169 2894 2618 2378 1695 627 -627 -1469 -1807 -2227 -2764 -3326 -3583 -3250 -2516 -1694
3943a694O33N34P78J046R51O53J35m1J51N0l97r89j123r28m65m73o54q65o83j30
$$ -1694 -1061 -527 251 1297 2248 2901 3036 2995 3146 3196 2799 1810 687 -241 -706 -1179 -1833 -2698 -3381 -3511
3963c511L42N65N12M62O09Q85J074P83M11L68M25N38kn02j039p26n68m45p24j058
$$ -3511 -3169 -2604 -2092 -1630 -1021 -136 938 1721 2132 2500 2925 3463 3461 2959 1920 1194 626 181 -543 -1601
3983a601j029o78j01K77K66K88L98Q35J112Q99N34N23O48P73L94k92o44o59m40
$$ -1601 -2630 -3308 -3409 -3132 -2866 -2578 -2180 -1345 -233 666 1200 1723 2371 3144 3538 3246 2602 1943 1503
4002A503k71m16r11j152r57m61j45j37j56k1N26Q54P81O26O71R28J142P99L43
$$ 1503 1232 816 -95 -1247 -2204 -2665 -2810 -2947 -3103 -3124 -2598 -1744 -963 -337 334 1262 2404 3203 3546
4021C546k65n16l41k10l75q17j228j034p15k65l06l85j53K09N12N17L22L95P55
$$ 3546 3281 2765 2424 2214 1839 1022 -206 -1240 -1955 -2220 -2526 -2911 -3064 -2855 -2343 -1826 -1504 -1109 -354
4040c54J081J066P39L00n6MK76O0n09j082j209q57o70o58q27n56j06L40M28L33
$$ -354 727 1793 2532 2832 2776 2780 3056 3116 2607 1525 316 -541 -1211 -1869 -2696 -3252 -3358 -3018 -2590 -2257
4060b257L87N91R64J095R62M09J7R6L66M46p6n98p88o04m68p70r65r58o01j93
$$ -2257 -1870 -1279 -315 780 1742 2151 2168 2264 2630 3076 3000 2402 1614 1010 542 -228 -1193 -2151 -2752 -2945
4080b945m5rP3J92P33J187J255P72M80L48O04N26J07m46o49l72l77o97q97r82
$$ -2945 -2990 -2999 -2926 -2734 -2001 -814 441 1213 1693 2041 2645 3171 3278 2832 2183 1811 1434 737 -160 -1142
4100a142o30m02j65r8l38l37J66P05J052Q49N18O10Q91Q42M39Q6j24jk45n07r55
$$ -1142 -1772 -2174 -2339 -2437 -2775 -3112 -2946 -2241 -1189 -340 178 788 1679 2521 2960 3046 2922 2921 2676 2169 1214
4121A214j106j090o23k25j73m28o91k35M79Q57P65N01N23P68P81N42L26L27L10
$$ 1214 108 -982 -1605 -1830 -2003 -2431 -3122 -3357 -2878 -2021 -1256 -755 -232 536 1317 1859 2185 2512 2822
4140B822K53m9n62r95j111p31k29k60o58j200o82l4M65O01M61O50P41P96N83O11
$$ 2822 3075 3026 2464 1469 358 -373 -602 -862 -1520 -2720 -3402 -3436 -2971 -2370 -1909 -1259 -518 278 861 1472
4160A472M87N86N30K95j63q81j010o94j75p4p97j141j078n26O8K46L66M41N07
$$ 1472 1959 2545 3075 3370 3207 2326 1316 622 447 373 -424 -1565 -2643 -3169 -3101 -2855 -2489 -2048 -1541
4179a541M14O67O54O33O70Q72P83K16m86q66m11l8Qn80j262j209q33m40j42R8
$$ -1541 -1127 -460 194 827 1497 2369 3152 3368 2882 2016 1605 1567 1575 995 -267 -1476 -2309 -2749 -2891 -2793
4199b793K11K43K87N69O65O85P47J006R52M84l28p08l33K73J69l08q65j130r70
$$ -2793 -2582 -2339 -2052 -1483 -818 -133 614 1620 2572 3056 2728 2020 1687 1960 2129 1821 956 -174 -1144
4218a144n94l33k13j47k57j23K82N13M08P52J143J349R79J88k79k6K23J39l14
$$ -1144 -1738 -2071 -2284 -2431 -2688 -2811 -2529 -2016 -1608 -856 287 1636 2615 2803 2524 2498 2721 2860 2546
4237B546p10j089j042q40l54k05l89m88k19J97J70J23K31P60J195R26O30K52M93
$$ 2546 1836 747 -295 -1135 -1489 -1694 -2083 -2571 -2790 -2593 -2423 -2300 -2069 -1309 -114 812 1442 1694 2187
4256B187N95O04K13l39p43j094q53o08o29q37r42n09N5J08k3J20M53R45Q66O21
$$ 2187 2782 3386 3599 3260 2517 1423 570 -38 -667 -1504 -2446 -2955 -2900 -2792 -2815 -2695 -2242 -1297 -431 190
4276A90M70N17N34N76N42K01k35m95l30k03n38r79j193p42k53k49n20l65N3M40
$$ 190 660 1177 1711 2287 2829 3030 2795 2300 1970 1767 1229 250 -943 -1685 -1938 -2187 -2707 -3072 -3019 -2579
4296b579O51P34Q98O71N79O02O96L18K8k40r0J03l86j058j149n97j96j87m14o49
$$ -2579 -1928 -1194 -296 375 954 1556 2252 2570 2598 2358 2268 2371 1985 927 -222 -819 -1015 -1202 -1616 -2265
4316b265l56j72J24N70P65N94M89P22P62O34K27K91M24M01k48r72j204q01l65
$$ -2265 -2621 -2793 -2669 -2099 -1334 -740 -251 471 1233 1867 2094 2385 2809 3210 2962 1990 786 -15 -380
4335c80k70m01o76o39p01j8N58P66M68L50N03O81N59K81M10R34P53R2n84r03o46
$$ -380 -650 -1051 -1727 -2366 -3067 -3085 -2527 -1761 -1293 -943 -440 241 800 1081 1491 2425 3178 3270 2686 1783 1137
4356A137l37k44l27o48j115j180n45K25N89L24K01N60N67N69K88O20J109R92L88
$$ 1137 800 556 229 -419 -1534 -2714 -3259 -3034 -2445 -2121 -1920 -1360 -793 -224 64 684 1793 2785 3173
4375C173k73o36m98l83kK5n95j167j431p27j29K08P0Q8K38M42K34K47P12J122
$$ 3173 2900 2264 1766 1383 1381 1406 811 -356 -1787 -2514 -2643 -2435 -2365 -2277 -2039 -1597 -1363 -1116 -404 718
4395G18J070P05J10j45l86k01J95L24l51j162j480r42k57k43l19j84Q2J67J66
$$ 718 1788 2493 2603 2458 2072 1871 2066 2390 2039 877 -603 -1545 -1802 -2045 -2364 -2548 -2466 -2299 -2133
4414b133J83O45J012R91Q93M88O9k63n8L31O28j08r25j094p22m25m82n60m83j42
$$ -2133 -1950 -1305 -293 698 1591 2079 2148 1885 1827 2158 2786 2678 1753 659 -63 -488 -970 -1530 -2013 -2155
4434b155l00k40n3L90O34Q93J025R26M54O2R9O31O28L4p48p60o84m73o02n69m94
$$ -2155 -2455 -2695 -2748 -2358 -1724 -831 194 1120 1574 1636 1735 2366 2994 3028 2280 1520 836 363 -239 -808 -1302
4455a302l93l28l30Rl5Q5M05P76R65N08K01K77Q27R48L44k30k87k54m13p50p52
$$ -1302 -1695 -2023 -2353 -2344 -2379 -2294 -1889 -1113 -148 360 561 838 1665 2613 2957 2727 2440 2186 1773 1023 271
$$ [...]
8191F72
##END NTUPLES=NMR FID
##END=
