##TITLE=1H_LY-propPd240.2
 CDCl3,8 sc, 
 30.9.2021
##JCAMPDX= 6.0         $$ Bruker NMR JCAMP-DX V2.0
##DATA TYPE= NMR FID
##DATA CLASS= NTUPLES
##ORIGIN= UXNMR, Bruker Analytische Messtechnik GmbH
##OWNER= root
$$ XWIN-NMR		Version 3.5
$$ Thu Sep 30 12:26:26 2021 Russian Standard Time (UT+4h)  she@DPX200
##.OBSERVE FREQUENCY= 200.1313468511
##.OBSERVE NUCLEUS= ^1H
##.DELAY= (6, 6)
##.ACQUISITION MODE= SIMULTANEOUS
##.ACQUISITION SCHEME= undefined
##.AVERAGES= 8
##.DIGITISER RES= 18
##SPECTROMETER/DATA SYSTEM= spect
##.PULSE SEQUENCE= zg30
##.SOLVENT NAME= CDCl3
##.SHIFT REFERENCE= (INTERNAL, CDCl3, 0, 15.7039)
##AUDIT TRAIL= $$ (NUMBER, WHEN, WHO, WHERE, WHAT)
$$ ##TITLE= Audit trail, XWIN-NMR		Version 3.5
$$ ##JCAMPDX= 5.01
$$ ##ORIGIN= Bruker BioSpin GmbH
$$ ##OWNER= she
$$ F:/spectra/data/she/nmr/H-F/1/audita.txt
$$ ##AUDIT TRAIL=  $$ (NUMBER, WHEN, WHO, WHERE, WHAT)
(   1,<2021-09-30 12:24:51.45 +0400>,<she>,<DPX200>,
      <created by zg, POWCHK disabled, PULCHK disabled
       configuration hash MD5:
       00 E9 B6 7A A2 85 ED C7 34 08 36 98 17 FE 4E 26
       data hash MD5: 16K
       C7 73 E0 30 29 8F D5 A8 06 8B ED 6C 0C 5B A8 E6>)
$$ ##END=
$$ 
$$ hash MD5
$$ 97 65 F9 01 6A 7D AE D1 55 F2 6F 6E D1 73 43 D7
##$RELAX= 
##$RELAX= 
##$RELAX= 
##$RELAX= 
##$RELAX= 
##$RELAX= 
$$ Bruker specific parameters
$$ --------------------------
##$DU= <F:/spectra>
##$EXPNO= 1
##$NAME= <H-F>
##$PROCNO= 1
##$TYPE= <nmr>
##$USER= <she>
##$AMP= (0..31)
100 100 100 100 100 100 100 100 100 100 100 100 100 100 100 100 100 100 
100 100 100 100 100 100 100 100 100 100 100 100 100 100 
##$AQSEQ= 0
##$AQ_mod= 1
##$AUNM= <au_zg>
##$AUTOPOS= <>
##$BF1= 200.13
##$BF2= 200.13
##$BF3= 200.13
##$BF4= 200.13
##$BF5= 200.13
##$BF6= 200.13
##$BF7= 200.13
##$BF8= 200.13
##$BYTORDA= 1
##$CFDGTYP= 0
##$CFRGTYP= 5
##$CHEMSTR= <none>
##$CNST= (0..31)
1 1 145 1 1 1 1 1 1 1 1 1 1 1 1 1 1 1 1 1 1 1 1 1 1 1 1 1 1 1 1 1 
##$CPDPRG= <>
##$CPDPRG1= <>
##$CPDPRG2= <>
##$CPDPRG3= <>
##$CPDPRG4= <mlev>
##$CPDPRG5= <mlev>
##$CPDPRG6= <mlev>
##$CPDPRG7= <mlev>
##$CPDPRG8= <mlev>
##$CPDPRGB= <>
##$CPDPRGT= <>
##$D= (0..31)
0 1.2 0 0 0 0 0 0 0 0.06 0 0.03 0 0 0 0 0.0002 0 0 0 0 0 0 0 0 0 0 0 0 
0 0 0 
##$DATE= 1632990291
##$DBL= (0..7)
120 120 120 120 120 120 120 120 
##$DBP= (0..7)
150 150 150 150 150 150 150 150 
##$DBP07= 0
##$DBPNAM0= <>
##$DBPNAM1= <>
##$DBPNAM2= <>
##$DBPNAM3= <>
##$DBPNAM4= <>
##$DBPNAM5= <>
##$DBPNAM6= <>
##$DBPNAM7= <>
##$DBPOAL= (0..7)
0.5 0.5 0.5 0.5 0.5 0.5 0.5 0.5 
##$DBPOFFS= (0..7)
0 0 0 0 0 0 0 0 
##$DE= 6
##$DECBNUC= <off>
##$DECIM= 32
##$DECNUC= <off>
##$DECSTAT= 4
##$DIGMOD= 1
##$DIGTYP= 9
##$DL= (0..7)
0 120 120 120 120 120 120 120 
##$DP= (0..7)
150 150 150 150 150 150 150 150 
##$DP07= 0
##$DPNAME0= <>
##$DPNAME1= <>
##$DPNAME2= <>
##$DPNAME3= <>
##$DPNAME4= <>
##$DPNAME5= <>
##$DPNAME6= <>
##$DPNAME7= <>
##$DPOAL= (0..7)
0.5 0.5 0.5 0.5 0.5 0.5 0.5 0.5 
##$DPOFFS= (0..7)
0 0 0 0 0 0 0 0 
##$DQDMODE= 0
##$DR= 18
##$DS= 0
$$ [...]
##$SUBNAM2= <"">
##$SUBNAM3= <"">
##$SUBNAM4= <"">
##$SUBNAM5= <"">
##$SUBNAM6= <"">
##$SUBNAM7= <"">
##$SUBNAM8= <"">
##$SUBNAM9= <"">
##$SW= 18.0517286264689
##$SWIBOX= (0..15)
0 0 2 0 0 0 0 0 0 0 0 0 0 0 0 0 
##$SW_h= 3612.71676300578
##$TD= 16384
##$TD0= 1
##$TE= 0
##$TE2= 300
##$TE3= 300
##$TEG= 300
##$TL= (0..7)
0 120 120 120 120 120 120 120 
##$TP= (0..7)
150 150 150 150 150 150 150 150 
##$TP07= 0
##$TPNAME0= <>
##$TPNAME1= <>
##$TPNAME2= <>
##$TPNAME3= <>
##$TPNAME4= <>
##$TPNAME5= <>
##$TPNAME6= <>
##$TPNAME7= <>
##$TPOAL= (0..7)
0.5 0.5 0.5 0.5 0.5 0.5 0.5 0.5 
##$TPOFFS= (0..7)
0 0 0 0 0 0 0 0 
##$TUNHIN= 0
##$TUNHOUT= 0
##$TUNXOUT= 0
##$USERA1= <user>
##$USERA2= <user>
##$USERA3= <user>
##$USERA4= <user>
##$USERA5= <user>
##$V9= 5
##$VALIST= <valist>
##$VCLIST= <CCCCCCCCCCCCCCC>
##$VD= 0
##$VDLIST= <DDDDDDDDDDDDDDD>
##$VPLIST= <PPPPPPPPPPPPPPP>
##$VTLIST= <TTTTTTTTTTTTTTT>
##$WBST= 1024
##$WBSW= 4
##$XGAIN= (0..3)
0 0 0 0 
##$XL= 0
##$YL= 0
##$YMAX_a= 457178
##$YMIN_a= -406914
##$ZGOPTNS= <>
##$ZL1= 120
##$ZL2= 120
##$ZL3= 120
##$ZL4= 120
##$ABSF1= 10
##$ABSF2= 0
##$ABSG= 5
##$ABSL= 3
##$ALPHA= 0
##$AQORDER= 0
##$ASSFAC= 0
##$ASSFACI= 0
##$ASSFACX= 0
##$ASSWID= 0
##$AUNMP= <proc_1d>
##$AZFE= 0.1
##$AZFW= 0.1
##$BCFW= 1
##$BC_mod= 2
##$BYTORDP= 1
##$COROFFS= 0
##$CY= 11.3945322036743
##$DATMOD= 1
##$DC= 2
##$DFILT= <>
##$DTYPP= 0
##$F1P= 2.36226072786647
##$F2P= -0.459571619588291
##$FCOR= 0.5
##$FTSIZE= 0
##$FT_mod= 4
##$GAMMA= 1
##$GB= 0.15
##$INTBC= 1
##$INTSCL= 1
##$ISEN= 128
##$LB= 0.24
##$LEV0= 0
##$LPBIN= 0
##$MAXI= 10000
##$MC2= 0
##$MEAN= 0
##$ME_mod= 0
##$MI= 1.114404
##$NCOEF= 0
##$NC_proc= 0
##$NLEV= 6
##$NOISF1= 3.799351
##$NOISF2= 2.8
##$NSP= 1
##$NTH_PI= 0
##$NZP= 0
##$OFFSET= 15.70392
##$PC= 1
##$PHC0= -14706.06
##$PHC1= 15.20085
##$PH_mod= 1
##$PKNL= yes
##$PPARMOD= 0
##$PSCAL= 0
##$PSIGN= 0
##$REVERSE= no
##$SF= 200.130013532006
##$SI= 16384
##$SIGF1= 3
##$SIGF2= 2
##$SINO= 400
##$SIOLD= 16384
##$SREGLST= <1H.CDCl3>
##$SSB= 0
##$STSI= 0
##$STSR= 0
##$SW_p= 3612.71676300578
##$SYMM= 0
##$S_DEV= 0
##$TDeff= 0
##$TDoff= 0
##$TI= <>
##$TILT= no
##$TM1= 0
##$TM2= 0
##$TOPLEV= 0
##$USERP1= <user>
##$USERP2= <user>
##$USERP3= <user>
##$USERP4= <user>
##$USERP5= <user>
##$WDW= 1
##$XDIM= 8192
##$YMAX_p= 0
##$YMIN_p= 0
$$ End of Bruker specific parameters
$$ ---------------------------------
##NTUPLES= NMR FID
##VAR_NAME=  TIME,          FID/REAL,        FID/IMAG
##SYMBOL=    X,             R,               I
##VAR_TYPE=  INDEPENDENT,   DEPENDENT,       DEPENDENT
##VAR_FORM=  AFFN,          ASDF,            ASDF
##VAR_DIM=   8192,          8192,            8192
##UNITS=     SECONDS,       ARBITRARY UNITS, ARBITRARY UNITS
##FACTOR=    0.0002768,     1,               1
##FIRST=     0,             0,               0
##LAST=      2.2672688,     0,               0
##MIN=       0,             -406914,         0
##MAX=       2.2672688,     457178,          0
$$ Real data points
##PAGE= N=1
##DATA TABLE= (X++(R..R)), XYDATA
$$ [...]
$$ plain form
2864 -2292 -2948 -3202 -3000 -2413 -1489 -319 879 1974 2783 3153 3133 2637 1724 594 -661 -1783 -2650 -3103
2882 -3103 -3138 -2740 -1977 -926 271 1439 2398 3053 3243 3000 2279 1208 6 -1183 -2219 -2899 -3156 -3011
2900 -3011 -2457 -1532 -386 823 1930 2750 3187 3180 2667 1800 670 -567 -1689 -2580 -3060 -3163 -2830 -2063
2918 -2063 -1040 174 1362 2370 3000 3227 2986 2318 1294 77 -1088 -2123 -2848 -3165 -3077 -2519 -1594
2935 -1594 -407 794 1930 2765 3228 3166 2694 1860 711 -552 -1651 -2569 -3094 -3168 -2866 -2129 -1105 180
2953 180 1338 2333 3011 3232 2952 2290 1319 85 -1078 -2125 -2844 -3215 -3086 -2561 -1646 -500 790 1894
2971 1894 2703 3193 3183 2678 1842 784 -462 -1609 -2498 -3069 -3193 -2836 -2095 -1075 129 1368 2339 2948
2989 2948 3196 2972 2297 1310 197 -1023 -2061 -2831 -3196 -3121 -2553 -1654 -512 729 1874 2694 3137 3173
$$ packed form
2864b292o56k54K02N87R24J170J198J095Q09L70k0m96r13j130j255j122q67m53
2882c103l5L98P63J051J197J168R59O55J90k43p21j071j202j189j036o80k57J45
2900c011N54R25J146J209J107Q20M37pn13q67j130j237j122q91m80j03L33P67
2918b063J023J214J188J008O30K27k41o68j024j217j165j035p25l17Q8N58R25
2935a594J187J201J136Q35M63o2m72q34j149j263j099r18n25p4L02P37J024J285
2953A80J158R95O78K21k80o62r71j234j163j047p19l71J29N25R15J146J290J104
2971A894Q09M90j0n05q36j058j246j147q89n71j24L57P41J020J204J239R71O09
2989B948K48k24o75r87j113j220j038p70l65P5N68Q99J142J241J145Q20M43L6
$$ plain form
3007 3173 2717 1865 787 -435 -1609 -2482 -3047 -3176 -2895 -2126 -1075 109 1286 2330 2961 3173 2964
3024 2964 2362 1354 181 -982 -2030 -2815 -3140 -3072 -2594 -1665 -488 741 1807 2677 3096 3124 2697 1900
3042 1900 769 -423 -1542 -2498 -3060 -3181 -2849 -2152 -1084 123 1357 2274 2947 3167 2931 2310 1396 170
3060 170 -1019 -2048 -2789 -3154 -3071 -2476 -1597 -437 767 1831 2664 3131 3115 2668 1869 784 -480 -1616
3078 -1616 -2510 -3041 -3196 -2867 -2105 -1073 122 1304 2298 2943 3158 2960 2337 1342 170 -1015 -2053 -2774
3096 -2774 -3144 -3066 -2525 -1645 -501 706 1823 2646 3061 3122 2715 1909 792 -374 -1526 -2458 -3021 -3185
3114 -3185 -2862 -2145 -1113 96 1261 2254 2893 3164 3019 2375 1423 205 -963 -2043 -2771 -3172 -3071 -2558
3132 -2558 -1677 -572 644 1778 2639 3071 3171 2753 1971 856 -345 -1467 -2435 -3011 -3191 -2863 -2189 -1175
$$ packed form
3007C173m56q52j078j222j174q73n65j29K81P69J051J184J177J044O31K12k09
3024B964o02j008j173j163j048p85l25O8M78R29J177J229J066Q70M19K8m27p97
3042A900j131j192j119r56n62j21L32O97J068J207J234R17O73K20k36o21r14j226
3060A70j189j029p41l65Q3N95Q79J160J204J064Q33M67j6m47p99j085j264j136
3078a616q94n31j55L29P62J032J195J182R94O45K15j98o23r95j172j185j038p21
3096b774l70P8N41Q80J144J207J117Q23M15O1m07q06j117j166j152r32n63j64
3114c185L23P17J032J209J165R93O39K71j45o44r52j218j168j080p28m01J01N13
3132b558Q81J105J216J134Q61M32J00m18p82j115j201j122r68n76j80L28O74J014
$$ plain form
3150 -1175 15 1197 2200 2899 3182 3035 2459 1502 318 -897 -1985 -2742 -3159 -3095 -2598 -1767 -654 591
3168 591 1724 2559 3102 3150 2777 1973 933 -237 -1444 -2404 -3011 -3182 -2919 -2252 -1226 -43 1130 2162
3186 2162 2836 3168 3053 2470 1511 360 -857 -1918 -2723 -3143 -3118 -2630 -1778 -660 566 1681 2590 3091
3204 3091 3171 2804 2025 950 -232 -1421 -2359 -3018 -3211 -2954 -2272 -1280 -68 1114 2169 2862 3211 3060
3222 3060 2509 1564 413 -827 -1873 -2712 -3159 -3130 -2669 -1845 -724 513 1667 2541 3073 3178 2818 2071
3240 2071 1033 -169 -1332 -2326 -2958 -3203 -2992 -2318 -1368 -153 1015 2074 2840 3164 3112 2562 1658 506
3258 506 -718 -1819 -2683 -3118 -3140 -2754 -1913 -830 390 1567 2477 3051 3192 2889 2187 1152 -56 -1269
3276 -1269 -2242 -2944 -3201 -3013 -2398 -1425 -269 965 2030 2805 3152 3089 2603 1729 552 -682 -1776 -2627
$$ packed form
3150a175J190J182J003O99K83j47n76r57j184j215j088p57m17O4M97Q31J113J245
3168E91J133Q35N43M8l73q04j040j170j207r60o07j71K63O67J026J183J173J032
3186B162O74L32j15n83r59j151j217j061q05m20K5M88Q52J118J226J115R09N01
3204C091Q0l67p79j075j182j189r38o59j93K57O82R92J212J182J055O93L49j51
3222C060n51r45j151j240j046q39m47K9M61Q24J121J237J154Q74N32J05l60p47
3240B071j038j202j163r94o32k45K11O74R50J215J168J059P66L24n2n50r04j152
3258E06j224j101q64m35k2L86Q41J083J220J177R10N74J41l03p02j035j208j213
3276a269r73p02k57J88O15R73J156J234J065P75L47o3m86q74j177j234j094q51
$$ plain form
3294 -2627 -3115 -3164 -2743 -1938 -861 351 1484 2439 3038 3207 2917 2170 1183 -17 -1237 -2233 -2927 -3188
3312 -3188 -3012 -2394 -1435 -270 935 2001 2804 3175 3108 2606 1688 559 -630 -1748 -2607 -3109 -3167 -2800
3330 -2800 -1994 -897 324 1478 2419 3051 3217 2909 2194 1190 -12 -1177 -2204 -2886 -3209 -3051 -2441
3347 -2441 -1522 -352 871 1970 2750 3147 3127 2638 1814 713 -511 -1638 -2538 -3089 -3206 -2818 -2052 -994
3365 -994 198 1383 2340 2989 3189 2975 2319 1318 107 -1112 -2146 -2848 -3196 -3079 -2522 -1560 -431 770
3383 770 1880 2702 3176 3159 2713 1847 782 -451 -1574 -2526 -3088 -3203 -2877 -2157 -1076 123 1278 2319
3401 2319 2996 3232 3009 2392 1373 207 -1002 -2060 -2831 -3206 -3125 -2579 -1670 -533 697 1810 2657 3142
3419 3142 3167 2760 1951 840 -388 -1561 -2491 -3061 -3220 -2885 -2208 -1148 64 1259 2276 2977 3274 3053
$$ packed form
3294b627m88m9M21Q05J077J212J133R55N99J69k90p47r87j200j220r96o94k61
3312c188J76O18R59J165J205J066Q03L71o7n02r18j129j189j118q59n02n8L67
3330b800Q06J097J221J154R41O32J66l08p15j004j202j165j027o82l23J58O10
3347b441R19J170J223J099P80L97k0m89q24j101j224j127r00n51j17L88P66J058
3365i94J192J185R57O49K00k14o56j001j211j219j034p02l48J17N57R62J129J201
3383G70J110Q22M74j7m46q66j065j233j123r52n62j15L26P20J081J199J155J041
3401B319O77K36k23o17j019j166j209j058p71l75Q1N46R09J137J230J113Q47M85
3419C142K5m07q09j111j228j173r30n70j59L35O77J060J212J195J017P01K97k21
$$ plain form
3437 3053 2431 1476 281 -924 -2001 -2809 -3193 -3135 -2636 -1734 -603 626 1752 2625 3126 3209 2787 2002
3455 2002 946 -286 -1485 -2441 -3042 -3232 -2932 -2237 -1261 -74 1147 2180 2886 3180 3076 2460 1547 364
3473 364 -844 -1961 -2803 -3188 -3168 -2686 -1807 -688 536 1711 2585 3122 3229 2841 2066 989 -199 -1391
3491 -1391 -2372 -3014 -3221 -2962 -2304 -1283 -127 1061 2116 2888 3215 3064 2536 1630 440 -783 -1861
3508 -1861 -2723 -3145 -3143 -2701 -1889 -755 441 1587 2499 3085 3211 2902 2122 1068 -139 -1313 -2324 -2984
3526 -2984 -3214 -2992 -2363 -1413 -225 1014 2064 2836 3221 3102 2620 1714 567 -633 -1785 -2646 -3123 -3163
3544 -3163 -2756 -1993 -915 313 1503 2428 3017 3209 2922 2209 1192 7 -1188 -2211 -2911 -3225 -3065
3561 -3065 -2456 -1503 -365 869 1959 2760 3194 3194 2674 1778 663 -525 -1692 -2588 -3086 -3198 -2822 -2056
$$ packed form
3437C053o22r55j195j205j077q08l84N8M99R02J131J229J126Q73N01Q3m22p85
3455B002j056j232j199r56o01j90L00O95R76J187J221J033P06K94j04o16r13j183
3473C64j208j117q42l85K0M82Q79J119J224J175Q74N37J07l88p75j077j188j192
3491a391r81o42k07K59O58J021J156J188J055P72L27j51n28r06j190j223j078
3508a861q62m22KM42Q12J134J196J146R12N86J26l09p80j054j207j174j011o60
3526b984k30K22O29R50J188J239J050P72L85j19m82r06j147j200j152q61m77m0
3544c163M07P63J078J228J190R25N89J92k87p13j017j185j195j023p00l14J60
3561c065O09R53J138J234J090Q01M34%n20q96j115j188j167q96m98j12L76P66
$$ plain form
3579 -2056 -980 206 1384 2372 3024 3232 2993 2328 1309 143 -1048 -2116 -2863 -3209 -3082 -2527 -1630
3596 -1630 -507 734 1841 2691 3169 3148 2712 1922 788 -437 -1547 -2506 -3070 -3212 -2916 -2194 -1148 38
3614 38 1252 2270 2965 3223 3018 2416 1407 238 -991 -2035 -2800 -3153 -3077 -2561 -1730 -568 669 1777
3632 1777 2662 3162 3191 2796 1981 898 -296 -1441 -2403 -3002 -3184 -2932 -2206 -1211 -32 1179 2217 2940
3650 2940 3243 3059 2456 1514 374 -850 -1945 -2777 -3177 -3131 -2677 -1822 -692 516 1674 2559 3088 3206
3668 3206 2814 2051 981 -195 -1390 -2353 -2994 -3222 -2985 -2327 -1322 -147 1060 2129 2867 3223 3081
3685 3081 2530 1636 459 -739 -1858 -2708 -3148 -3170 -2731 -1910 -828 375 1553 2502 3085 3193 2884 2188
3703 2188 1172 -53 -1223 -2246 -2947 -3252 -3030 -2431 -1469 -294 938 2008 2776 3188 3135 2632 1766 638
$$ packed form
3579b056J076J186J178R88O52K08k39o65j019j166j191j068p47l46J27N55Q97
3596a630J123J241J107Q50M78k1m36p90j134j225j110r59n64j42K96P22J046J186
3614C8J214J018O95K58k05o02j009j169j229j044p65l53P6N16Q31J162J237J108
3632A777Q85N00K9l95q15j083j194j145r62n99j82K52P26R95J179J211J038P23
3650B940L03j84o03r42j140j224j095q32m00M6M54Q55J130J208J158Q85N29J18
3668C206l92p63j070j176j195r63o41k28K37O58J005J175J207J069P38L56j42
3685C081n51q94j177j198j119q50m40k2M39Q21J082J203J178R49N83J08l09o96
3703B188j016j225j170j023p01l05K22N99R62J175J232J070P68M12n3n03q66j128
$$ plain form
3721 638 -584 -1724 -2603 -3126 -3204 -2814 -2005 -946 281 1454 2426 3014 3241 2970 2247 1266 91 -1136
3739 -1136 -2166 -2875 -3184 -3039 -2464 -1540 -378 830 1912 2742 3177 3131 2654 1826 720 -513 -1622 -2539
3757 -2539 -3072 -3159 -2804 -2052 -1027 184 1377 2346 2971 3190 2969 2281 1312 141 -1055 -2096 -2816 -3177
3775 -3177 -3052 -2531 -1645 -482 748 1837 2660 3125 3118 2683 1853 761 -425 -1553 -2496 -3036 -3165 -2868
3793 -2868 -2129 -1107 77 1249 2256 2922 3203 2992 2370 1402 229 -957 -2032 -2790 -3174 -3084 -2567 -1671
3811 -1671 -549 683 1790 2659 3147 3181 2735 1983 883 -314 -1501 -2443 -3031 -3225 -2900 -2214 -1186 -29
3829 -29 1193 2190 2893 3175 3066 2438 1516 352 -851 -1952 -2752 -3191 -3131 -2675 -1848 -717 516 1680
3847 1680 2551 3087 3206 2857 2079 1031 -158 -1326 -2322 -2959 -3200 -2983 -2314 -1343 -172 1063 2116 2844
$$ packed form
3721F38j222j140q79n23p8L90Q09J059J227J173R72N88K27k71p23r81j175j227
3739a136j030p09l09J45N75R24J162J208J082Q30M35m6m77q28j106j233j109r17
3757b539n33q7L55P52J025J211J193R69O25K19k21o88r69j171j196j041p20l61
3775c177J25N21Q86J163J230J089Q23M65pm35q30j092j186j128r43n40j29K97
3793b868P39J022J184J172J007O66K81k11o22r68j173j186j075p58l84R0N17Q96
3811a671J122J232J107Q69M88L4m46p52j100j197j187r42n88j94L25O86J028J157
3829b9J222R97P03K82j09o28r22j164j203j101q00m39O0M56Q27J131J233J164
3847A680Q71N36J19l49p78j048j189j168r96o37k41K17O69R71J171J235J053P28
$$ plain form
3865 2844 3209 3115 2546 1661 545 -673 -1803 -2637 -3123 -3187 -2743 -1944 -871 307 1506 2429 3030 3170
3883 3170 2907 2197 1160 -17 -1199 -2188 -2888 -3212 -3024 -2396 -1481 -303 880 1956 2731 3111 3077 2601
3901 2601 1739 657 -550 -1669 -2555 -3036 -3143 -2744 -1997 -951 227 1385 2322 2945 3135 2892 2266 1299
3919 1299 108 -1051 -2080 -2807 -3116 -2970 -2450 -1546 -472 737 1821 2618 3047 3042 2628 1818 746 -432
3937 -432 -1548 -2434 -2962 -3121 -2783 -2071 -1075 108 1254 2199 2889 3124 2920 2309 1378 236 -980 -1971
3955 -1971 -2714 -3094 -3022 -2490 -1666 -530 646 1727 2563 3060 3094 2678 1914 840 -374 -1472 -2396 -2936
3973 -2936 -3120 -2813 -2122 -1144 14 1197 2155 2826 3098 2951 2364 1434 323 -846 -1927 -2688 -3074 -3022
3991 -3022 -2524 -1685 -596 550 1640 2528 3013 3033 2725 1995 946 -237 -1355 -2284 -2907 -3087 -2841 -2229
$$ packed form
3865B844L65r4n69q85j116j218j130q34m86o4M44P99J073J178J199R23O01J40
3883C170k63p10j037j177j182r89p00l24J88O28R15J178J183J076P75L80l4m76
3901B601q62j082j207j119q86m81j07L99P47J046J178J158R37O23J90k43o26r67
3919A299j191j159j029p27l09J46N20R04J074J209J084P97M29nm14q10j072j178
3937d32j116q86n28j59L38P12R96J183J146R45O90K35k04o11r31j142j216r91
3955a971p43l80P2N32Q24J136J176J081Q36M97L4m16p64j074j214j098r24n40
3973b936j84L07O91R78J158J183R58O71K72j47n87r30j111j169j081p61l86N2
3991c022M98Q39J089J146J090Q88M85K0l08p30j049j183j118r29o23j80K46O12
$$ plain form
4009 -2229 -1259 -127 1049 2030 2734 3076 2938 2410 1563 463 -699 -1753 -2572 -2989 -3010 -2585 -1810 -764
4027 -764 379 1475 2357 2914 3051 2740 2068 1047 -84 -1173 -2136 -2769 -3015 -2809 -2254 -1325 -215 931
4045 931 1912 2659 2984 2923 2426 1561 569 -626 -1684 -2498 -2944 -2976 -2582 -1823 -823 335 1441 2307 2845
4064 2845 2992 2716 2046 1097 -15 -1131 -2132 -2723 -2998 -2819 -2225 -1318 -240 871 1889 2607 2954 2897
4082 2897 2433 1599 556 -579 -1665 -2473 -2902 -2978 -2595 -1793 -802 350 1420 2307 2832 2960 2739 2055
4100 2055 1093 -15 -1148 -2091 -2742 -2974 -2833 -2255 -1370 -265 860 1865 2621 2971 2937 2453 1633 575
4118 575 -544 -1617 -2469 -2929 -2979 -2588 -1877 -864 283 1354 2281 2808 3003 2780 2129 1182 58 -1090
4136 -1090 -2037 -2737 -3023 -2877 -2315 -1437 -384 775 1788 2562 2961 2946 2491 1722 710 -460 -1530 -2380
$$ packed form
4009b229R70J132J176R81P04L42j38n28q47j100j162j054q19m17k1M25P75J046
4027g64J143J096Q82N57J37l11o72j021j131j089r63o33k46K06N55R29J110J146
4045I31R81P47L25o1m97q65r92j195j058q14m46l2L94P59J000J158J106Q66N38
4064B845J47k76o70r49j112j116j001n91k75J79N94R07J078J111J018P18L47n7
4082B897m64q34j043j135j086q08m29p6L83Q02R91J152J070Q87N25J28k21o84
4100B055r62j108j133r43o51k32J41N78Q85J105J125J005P56L50l4m84q20j058
4118E75j119j073q52m60n0L91P11J013J147J071R27N27J95k23o51r47j124j148
4136a090r47p00k86J46N62Q78J053J159J013P74L99j5m55p69j012j170j070q50
$$ plain form
4154 -2380 -2885 -2990 -2648 -1945 -994 136 1213 2158 2745 2951 2793 2182 1307 189 -957 -1917 -2644 -2928
4172 -2928 -2854 -2341 -1506 -489 614 1641 2439 2882 2915 2521 1775 776 -379 -1441 -2296 -2800 -2924 -2660 -1992
4191 -1992 -1053 55 1125 2100 2707 2956 2806 2219 1313 254 -865 -1852 -2560 -2903 -2852 -2365 -1598 -542
4209 -542 546 1583 2386 2880 2938 2570 1852 831 -291 -1383 -2257 -2768 -2910 -2659 -2004 -1109 -22 1098
4227 1098 2044 2711 2984 2826 2262 1386 292 -823 -1829 -2538 -2885 -2838 -2435 -1655 -618 548 1569 2409
4245 2409 2892 2970 2600 1881 879 -240 -1317 -2254 -2780 -3007 -2749 -2148 -1208 -110 1018 1986 2664 2980
4263 2980 2820 2263 1419 393 -742 -1772 -2527 -2933 -2929 -2499 -1745 -720 410 1516 2384 2863 3017 2689
4281 2689 2000 1013 -108 -1183 -2097 -2694 -2935 -2775 -2175 -1304 -181 916 1900 2631 2954 2863 2355 1534 492
$$ packed form
4154b380n05j05L42P03R51J130J077R45N87K06j58o11q75j118j146r60p27k84
4172b928P4N13Q35J017J103J027P98M43L3l94p46r99j155j062q55n04j24K64O68
4191a992R39J108J070R75O07K49j50n87r06j059j119r87p08l43N1M87P67J056
4209e42J088J037Q03M94N8l68p18j021j122j092q74n11j42K51O55Q95J087J120
4227A098R46O67K73j58n64q76j094j115j006p09l47M7M03P80J037J166J021Q40
4245B409M83P8l70p19j002j119j077r37n26k27K58O01R40J098J128R68O78L16
4263B980j60n57q44j026j135j030p55m06MM30P54J025J130J106Q68M79J54l28
4281B689o89r87j121j075r14n97k41J60O00Q71J123J097R84P31L23r1n08q21j042
$$ plain form
4300 492 -588 -1595 -2403 -2845 -2927 -2552 -1840 -833 296 1317 2233 2775 2886 2635 2008 1081 1 -1043
4318 -1043 -1958 -2660 -2939 -2791 -2245 -1392 -332 805 1791 2514 2853 2860 2368 1627 626 -460 -1478 -2295 -2781
4337 -2781 -2885 -2544 -1848 -896 205 1290 2152 2695 2880 2648 2063 1190 168 -921 -1875 -2584 -2854 -2799 -2291
4356 -2291 -1463 -419 687 1670 2420 2788 2824 2411 1695 736 -355 -1392 -2231 -2736 -2899 -2610 -1924 -1012 112
4375 112 1157 2057 2647 2834 2700 2137 1273 249 -827 -1822 -2508 -2861 -2812 -2338 -1496 -465 609 1589 2350
4394 2350 2772 2819 2486 1801 874 -238 -1273 -2187 -2699 -2908 -2605 -2001 -1056 -5 1059 1933 2534 2830 2700
4413 2700 2203 1384 369 -734 -1698 -2459 -2823 -2800 -2346 -1596 -613 437 1423 2213 2710 2764 2509 1860 977
4432 977 -137 -1180 -2051 -2622 -2818 -2619 -2043 -1191 -173 879 1764 2447 2789 2707 2247 1480 500 -588 -1594
$$ packed form
4300D92j080j007q08m42q2L75P12J007J129J021R16N42J11k51o27r27j080j044
4318a043r15p02k79J48N46Q53J060J137R86P23L39Pm92p41j001j086j018q17m86
4337b781j04L41O96R52J101J085Q62N43J85k32n85q73j022j089r54p09k70N5N08
4356b291Q28J044J106R83P50L68L6m13p16r59j091j037q39n05j63K89O86R12J124
4375A12J045R00N90J87j34n63q64j024j076r95o86l53M9M74Q42J031J074R80P61
4394B350M22M7l33o85r27j112j035r14n12k09L03O04R45J051J064Q74O01K96j30
4413B700m97q19j015j103r64p61l64K3M54P50R83J050R86P90M97N4k55o49q83
4432I77j114j043q71n71j96J99N76Q52J018J052Q85O83L42q2m60p67r80j088j006
$$ plain form
4451 -1594 -2335 -2723 -2754 -2380 -1646 -710 306 1300 2088 2599 2760 2510 1900 1002 -34 -1103 -1974 -2550 -2754
4470 -2754 -2580 -2035 -1250 -226 809 1675 2357 2711 2692 2227 1468 463 -574 -1548 -2268 -2693 -2694 -2352 -1681
4489 -1681 -772 228 1240 2059 2557 2724 2510 1909 1068 23 -1008 -1870 -2472 -2723 -2563 -2081 -1280 -328
4507 -328 679 1604 2349 2712 2682 2296 1570 628 -455 -1438 -2184 -2607 -2672 -2380 -1786 -885 130 1132 1975
4526 1975 2557 2745 2571 2011 1130 162 -914 -1751 -2430 -2710 -2609 -2154 -1441 -463 554 1513 2233 2641 2713
4545 2713 2348 1634 736 -313 -1297 -2030 -2579 -2696 -2441 -1869 -988 -13 995 1899 2485 2709 2559 2052 1220
4564 1220 238 -770 -1684 -2327 -2664 -2604 -2206 -1472 -544 497 1412 2177 2626 2676 2318 1678 776 -175 -1170 -1982
4584 -1982 -2465 -2673 -2471 -1906 -1124 -115 902 1781 2375 2647 2547 2095 1299 353 -653 -1527 -2239 -2610 -2594
$$ packed form
4451a594p41l88l1L74P34R36J016R94P88N11J61k50o10q98j036j069q71n76k04
4470b754J74N45P85J024J035Q66O82L54j9m65p59j005j037r74p20m25jL42O71
4489a681R09J000J012Q19M98J67k14o01q41j045j031q62o02k51J60M82Q01R52
4507c28J007R25P45L63l0l86p26r42j083r83p46m23o5K92N94R01J015J002Q43
4526A975N82J88j74n60q81r68j076q37o79k80J01M55P13R78J017R59P20M08P2
4545B713l65p14q98j049r84p33n49j17K55N72Q81R75J008R04N86K24j50n07q32
4564A220r82j008r14o43l37O0L98P34R28J041R15P65M49N0l58o40r02r51r95q12
4584a982m83k08K02N65P82J009J017Q79N94K72j00m52p96r46j006q74p12l71J6
$$ plain form
4603 -2594 -2246 -1541 -666 382 1313 2103 2529 2621 2343 1760 890 -99 -1105 -1861 -2408 -2622 -2439 -1934 -1177
4622 -1177 -192 804 1699 2300 2633 2534 2102 1380 452 -563 -1451 -2172 -2545 -2604 -2264 -1632 -686 278 1234 2030
4642 2030 2480 2612 2355 1788 983 -2 -972 -1824 -2359 -2599 -2463 -1979 -1216 -272 751 1622 2256 2572 2540 2132
4662 2132 1442 514 -477 -1404 -2107 -2537 -2585 -2277 -1657 -771 222 1155 1945 2450 2612 2401 1803 1008 21 -913
4682 -913 -1763 -2358 -2608 -2504 -2011 -1268 -304 655 1559 2177 2559 2522 2159 1494 615 -381 -1328 -2058 -2515 -2583 -2283
4703 -2283 -1694 -862 143 1075 1869 2419 2568 2413 1892 1119 128 -845 -1673 -2303 -2575 -2473 -2024 -1318 -355
4722 -355 562 1470 2158 2527 2530 2200 1546 655 -319 -1232 -1987 -2480 -2564 -2293 -1723 -884 77 1016 1822 2338 2548
4743 2548 2408 1898 1130 257 -758 -1610 -2211 -2502 -2473 -2049 -1377 -447 510 1388 2097 2482 2537 2233 1578 737
$$ packed form
4603b594L48P05Q75J048R31P90M26R2k78n83q70r89j006p56n47k14J83N05P57
4622a177R85R96Q95O01L33r9m32p22r28j015q88p21l73n9L40O32R46R64R56P96
4642B030M50J32k57n67q05r85r70q52n35k40J36M84P63R44J023Q71O34L16l2m08
4662B132o90r28r91r27p03m30m8L08O20Q86R93R33P90N05J62k11n98p95r87r34
4682i13q50n95k50J04M93P43R64R59R04O18L82l7l63o65q79r96r47p30m57o8L00
4703b283N89Q32J005R32P94N50J49j55n21p73r91r73q28o30k72J02M49P06R63
4722c55R17R08O88L69Ll30o54q91r74r13p55m93q4K71N70Q39R61R39Q06N16K10
4743B548j40n10p68q73j015q52o01k91K9M24O72R30R57Q78P09L85N5l04o55q41
$$ plain form
4763 737 -254 -1134 -1896 -2395 -2539 -2309 -1771 -944 -8 923 1742 2294 2475 2369 1928 1186 264 -667 -1514 -2142
4783 -2142 -2492 -2446 -2059 -1423 -519 427 1331 2007 2424 2484 2184 1610 777 -167 -1083 -1842 -2322 -2512 -2296 -1784
4803 -1784 -1010 -54 871 1679 2238 2497 2370 1935 1208 344 -619 -1484 -2094 -2466 -2452 -2095 -1418 -541 394 1295
4823 1295 1950 2361 2444 2199 1625 825 -120 -1000 -1755 -2288 -2465 -2283 -1800 -1041 -110 791 1619 2166 2434 2377
4843 2377 1949 1244 396 -543 -1382 -2043 -2410 -2409 -2087 -1443 -639 289 1195 1895 2278 2403 2208 1657 845 -20
4863 -20 -921 -1698 -2211 -2398 -2256 -1812 -1091 -191 728 1534 2093 2355 2337 1965 1299 458 -471 -1335 -1960 -2316 -2384
4884 -2384 -2068 -1481 -656 269 1130 1818 2269 2383 2195 1656 885 31 -857 -1638 -2192 -2377 -2269 -1799 -1108 -205
4904 -205 651 1456 2040 2333 2294 1947 1300 459 -430 -1267 -1931 -2316 -2338 -2038 -1485 -694 183 1083 1770 2199 2353
$$ packed form
4763G37r91q80p62m99j44K30N38Q27R36R31Q19N52J81j06m41p42r22r31q47o28
4783b142l50M6L87O36R04R46R04O76M17O0l00n74q33r44r16p59m80j90K16N12
4803a784P74R56R25Q08N59K59j27m35p27q64r63q65o10l72J4L57O77Q77R35R01
4823A295O55M11Q3k45n74q00r45q80p55n33j77J82M83P59R31R01Q28N47K68n7
4843B377m28p05q48r39q39o61l67JL22O44Q04R28R06P00L83J25j95n51q12q65
4863b0r01p77n13j87J42M44P21R00R19Q06N59K62j8l72o66q41r29q64o25l56o8
4884b384L16N87Q25R25Q61O88M51J14j88n39p71q54q88p81n54j85J08M70O91R03
4904b05Q56Q05N84K93l9l47o47q41q89q37o64l85k2L00N53P91Q77R00O87M29J54
$$ plain form
4925 2353 2142 1676 933 73 -824 -1593 -2113 -2340 -2216 -1803 -1109 -301 597 1402 1992 2325 2330 1954 1354 538
4945 538 -363 -1215 -1863 -2242 -2314 -2058 -1521 -748 102 980 1658 2152 2330 2164 1734 1004 139 -762 -1541 -2070
4965 -2070 -2323 -2235 -1826 -1164 -383 503 1313 1904 2261 2287 2009 1406 608 -288 -1130 -1773 -2210 -2287 -2083 -1563 -853
4986 -853 -3 862 1608 2120 2326 2170 1748 1054 210 -643 -1411 -1973 -2273 -2240 -1867 -1257 -431 425 1231 1856
5006 1856 2254 2277 1976 1401 654 -197 -1058 -1741 -2134 -2257 -2078 -1569 -900 2 857 1545 2041 2298 2172 1725
5026 1725 1046 219 -621 -1391 -1918 -2220 -2210 -1855 -1242 -457 398 1229 1824 2211 2295 1965 1423 644 -180 -1006
5046 -1006 -1667 -2080 -2218 -2095 -1570 -906 -61 797 1528 1996 2218 2158 1722 1060 253 -574 -1305 -1889 -2191 -2189 -1871
5067 -1871 -1285 -461 346 1129 1780 2159 2203 1954 1449 716 -132 -947 -1616 -2056 -2207 -2021 -1559 -872 -99 725
$$ packed form
4925B353k11m66p43q60q97p69n20k27J24M13O94Q08Q98Q05N90L33Nl76o00q16
4945E38r01q52o48l79p2K56N37P73Q50Q78O78M94J78j66m30p30q65r01p79n29
4965b070k53Q8M09O62P81Q86Q10N91L57K6k78o03p98q96q42o43m37p7K04N20P10
4986h53Q50Q65P46N12K06j56m22o94q44q53p68n62l00L3L73O10Q26Q56Q06O25
5006A856L98K3l01n75p47q51q61o83l93j23J79N09O69R02Q55O88M96K57j26m47
5026A725o79q27q40p70n27l02J0L55O13P85Q55Q31N95L87Q4l30n42p79q24q26
5046a006o61m13j38J23N25O64Q45Q58P31M68K22o0m36o62q07q27p31n84l02KL18
5067a871N86Q24Q07P83O51L79M4k49n05p33q48q15o69m40j51J86M62O87P73Q24
$$ plain form
5087 725 1481 1958 2202 2096 1761 1075 344 -520 -1277 -1836 -2137 -2143 -1851 -1291 -532 278 1083 1710 2078 2151 1932
5108 1932 1437 741 -72 -897 -1536 -1991 -2152 -2014 -1623 -929 -178 670 1399 1919 2135 2084 1731 1132 368 -420
5128 -420 -1173 -1807 -2099 -2147 -1870 -1308 -615 229 1009 1643 1995 2151 1968 1463 767 16 -792 -1481 -1969 -2129
5148 -2129 -2027 -1625 -1005 -234 587 1325 1837 2099 2066 1743 1182 439 -364 -1115 -1670 -2037 -2069 -1854 -1327 -636
5168 -636 182 917 1567 1995 2109 1948 1471 837 51 -731 -1399 -1880 -2081 -2007 -1652 -1041 -268 531 1245 1782
5188 1782 2072 2033 1749 1207 482 -301 -1059 -1665 -2010 -2089 -1867 -1374 -677 86 848 1510 1928 2087 1926 1534
5208 1534 880 141 -664 -1334 -1815 -2081 -1994 -1666 -1089 -326 442 1159 1735 2010 2034 1775 1264 547 -210 -972
5228 -972 -1589 -1984 -2081 -1903 -1421 -794 -34 764 1424 1876 2075 1953 1574 989 253 -572 -1247 -1774 -2036 -2002 -1711
$$ packed form
5087G25P56M77K44j06l35o86p31q64p57n59l01oK92N60P59Q10Q05O27L68P3k19
5108A932m95o96q13q25o39m55j61J38L91O94P51Q48P29N20K16n1l53n99p64p88
5128d20p53o34k92m8K77N62O93Q44P80O34L52J56j83n05o96p51q08o89m88j60
5148b129J02M02O20P71Q21P38N12K62l3l23n61p43q03p51n55l67l2K15N27O91
5168f36Q18P35O50M28J14j61m77o34p86p82o68m81k01P4L55O11P73P99P14N37
5188A782K90l9k84n42p25p83p58o06l45p9K22M93O97P63P62O62M18J59j61l92
5208A534o54p39q05o70m81k66Q7L28N77P63P68P17N76K75K4k59n11p17p57p62
5228i72o17l95r7J78M82O27P60P98O60M52J99j22l79n85p36q25o75n27k62L4K91
$$ plain form
5249 -1711 -1144 -421 336 1089 1666 1997 2053 1825 1336 648 -129 -866 -1504 -1910 -2043 -1878 -1484 -860 -99 669
5269 669 1335 1817 2009 1957 1605 1000 292 -483 -1175 -1712 -2010 -2001 -1726 -1224 -504 261 994 1571 1923 2027 1802
5290 1802 1372 718 -64 -811 -1456 -1864 -2008 -1890 -1490 -875 -160 593 1280 1742 1987 1942 1628 1094 384 -384
5310 -384 -1051 -1603 -1932 -1968 -1713 -1254 -579 161 906 1501 1868 1977 1800 1380 762 23 -703 -1374 -1768 -1940
5330 -1940 -1888 -1512 -946 -234 504 1180 1662 1908 1934 1652 1117 445 -292 -996 -1543 -1880 -1947 -1748 -1274 -620 68
5351 68 790 1401 1799 1925 1819 1449 848 133 -586 -1252 -1722 -1919 -1878 -1560 -1011 -352 407 1107 1604 1884 1877
5372 1877 1643 1156 513 -202 -891 -1483 -1797 -1911 -1738 -1324 -684 28 705 1320 1732 1933 1813 1466 882 194
5392 194 -560 -1178 -1663 -1920 -1858 -1581 -1050 -369 334 1001 1546 1801 1866 1662 1186 584 -160 -867 -1419 -1778 -1897
$$ packed form
5249a711N67P23P57P53N77L31N6k28m89o88p77p37o38m06j33J65L94O24P61P68
5269F69O66M82J92n2l52o05p08p75o92n37k98RK75N02P20P65P33N77L52J04k25
5290A802m30o54p82p47o45m08j44J18M00O15P15P53O87M62K45m5l14n34p10p68
5310c84o67n52l29l6K55M59O75P40P45N95L67J09j77m20o18p39p26o71l94j72
5330a940N2L76N66P12P38O76M82K46K6k82n35o72p37p04n47l37o7J99M74O54O88
5351F8P22O11L98J26j06l70o01p15p19o66m70j97M1L18N49O59P59P00M97K80p
5372A877k34m87o43p15o89n92l14j14J73M14O40P12O77O15M12K01j20l47n84o88
5392A94p54o18m85k57O2K77N31O81P03O67N45K55O5k04m76o02p44p07n52l59j19
$$ plain form
5413 -1897 -1735 -1357 -733 -44 679 1265 1691 1888 1817 1467 939 248 -484 -1089 -1578 -1871 -1845 -1567 -1103 -454
5433 -454 250 954 1447 1799 1864 1650 1244 630 -72 -747 -1351 -1717 -1869 -1757 -1397 -821 -129 571 1197 1622
5453 1622 1830 1808 1496 968 342 -385 -1035 -1482 -1814 -1829 -1596 -1147 -513 189 827 1412 1737 1844 1721 1325
5473 1325 713 43 -657 -1244 -1646 -1849 -1752 -1421 -893 -204 472 1048 1555 1806 1764 1524 1033 413 -271 -912
5493 -912 -1446 -1742 -1804 -1595 -1165 -599 119 779 1314 1692 1813 1674 1313 784 121 -560 -1183 -1604 -1792 -1750 -1455
5514 -1455 -945 -294 378 1005 1506 1764 1785 1543 1080 497 -208 -838 -1374 -1699 -1809 -1624 -1225 -661 -21 681
5534 681 1238 1606 1759 1678 1343 821 179 -511 -1089 -1543 -1749 -1712 -1448 -976 -354 307 955 1416 1689 1728 1548
5555 1548 1132 548 -102 -802 -1299 -1630 -1758 -1625 -1243 -729 -47 617 1169 1591 1739 1672 1354 859 210 -440
$$ packed form
5413a897J62L78O24O89P23N86M26J97p1l50n28o91p32o05m89k93K6K78M64O49
5433d54P04P04M93L52O5k14m06o14p02o75o04l66j52J12L60N76O92P00O26M25
5453A622K08k2l12n28o26p27o50m47l32j5K33M49O34P02O38N85L25J07j23l96
5473A325o12o70p00n87m02k03R7L31N28O89O76N76N07K51m2k40m91o20o84o41
5493i12n34k96o2K09M30N66P18O60N35L78J21j39l61n29o63o81o23m21j88M2K95
5514a455N10O51O72O27N01K58K1k42m63n83p05o30n36l25j10J85L99N64O40P02
5534F81N57L68J53q1l35n22o42o90n78m54k06L7K64M72O22O61O48M61K73L9j80
5555A548m16n84o50p00m97l31j28J33L82N14O82O64N52M22J48o7l18m95o49o50
$$ plain form
5575 -440 -1051 -1502 -1734 -1734 -1463 -993 -385 244 915 1377 1698 1725 1563 1169 573 -91 -740 -1248 -1597 -1736 -1601
5596 -1601 -1271 -745 -121 559 1118 1511 1733 1655 1402 896 236 -388 -963 -1440 -1696 -1721 -1464 -1026 -420 191
5616 191 828 1322 1650 1715 1554 1128 583 -50 -703 -1220 -1577 -1710 -1602 -1268 -731 -135 533 1108 1515 1719
5636 1719 1681 1391 889 300 -369 -977 -1405 -1680 -1689 -1453 -1068 -463 175 784 1281 1615 1690 1525 1159 596 -10
5657 -10 -635 -1157 -1519 -1674 -1590 -1273 -796 -162 466 1020 1468 1674 1668 1376 950 332 -293 -896 -1307 -1583 -1636 -1451
5679 -1451 -1059 -498 98 748 1254 1566 1690 1551 1171 669 18 -576 -1118 -1476 -1635 -1579 -1279 -813 -222 410
5699 410 978 1420 1638 1624 1342 913 348 -293 -848 -1282 -1620 -1632 -1465 -1060 -486 90 720 1239 1555 1646 1528
5720 1528 1171 649 36 -554 -1080 -1457 -1609 -1563 -1282 -801 -207 427 981 1409 1614 1623 1370 939 359 -245 -823
$$ packed form
5575d40o11m51k32%K71M70O08O29O71M62L21K7j62l94n96o64o49n08l49j39J35
5596a601L30N26O24O80N59L93K22p8k53n06o60o24n75m77k56k5K57M38O06O11
5616A91O37M94L28O5j61m26n45o33o53n17l57j33J08L34N37N96O68N75M07K04
5636A719l8k90n02n89o69o08m28k75rK36L85O05O38O09M97L34P5j65l66n63o06
5657a0o25n22l62j55Q4L17M77O34O28N54M48K06ok92m26o18o25o03m11k76n3J85
5679a451L92N61N96O50N06L12J24j39l80n02o51n94n42l58j59N6L00M66N91O32
5699D10N68M42K18j4k82m29n65o41n55m34l38j2J67M05N74N76O30N19L16R1j18
5720A528l57n22o13n90n26l77j52M6K81M81N94O34N54M28K05Rk53m31n80o04n78
$$ plain form
5741 -823 -1277 -1588 -1620 -1442 -1078 -532 95 693 1192 1510 1625 1511 1145 684 96 -491 -1043 -1399 -1598 -1561 -1258
5762 -1258 -802 -250 384 919 1336 1552 1567 1344 935 398 -193 -767 -1221 -1503 -1599 -1454 -1093 -541 48 631
5782 631 1122 1442 1584 1463 1165 713 148 -467 -958 -1392 -1582 -1544 -1279 -850 -287 317 862 1254 1516 1552 1337
5803 1337 994 450 -105 -691 -1170 -1487 -1586 -1462 -1073 -612 -21 554 1049 1397 1561 1469 1201 737 205 -383
5823 -383 -947 -1305 -1523 -1517 -1296 -862 -327 258 816 1243 1493 1547 1355 993 518 -62 -659 -1122 -1466 -1560 -1421
5844 -1421 -1103 -617 -30 503 1007 1365 1520 1464 1212 796 245 -351 -889 -1293 -1504 -1484 -1281 -896 -370 195
5864 195 746 1180 1403 1483 1369 1011 543 -16 -601 -1088 -1377 -1520 -1430 -1126 -672 -110 439 929 1297 1505 1470
5885 1470 1215 817 295 -293 -775 -1205 -1446 -1495 -1271 -926 -460 124 630 1108 1407 1489 1387 1065 614 44
$$ packed form
5741h23m54l11l2J78L64N46O27N98M99L18J15j14l66m61n88n87n52l56j99L7L03
5762a258M56N52O34N35M17K16J5k23m09n37n91n74m54k82r6J45L61N52N89N83
5782F31M91L20J42j21k98m52n65o15m91m34j90L8K65M29N63O04N45L92K62L6k15
5803A337l43n44n55n86m79l17r9J24L89M61N91N75M95L48J64r2k68m64n32n88
5823c83n64l58k18OK21M34N35N85N58M27K50N4j92l62m75n80n97m63l44r4J39
5844a421L18M86N87N33N04L58J55n6k52m16n51n96n38m04k11K0K03L85N26N65
5864A95N51M34K23Q0j14l58m68n59n85m87k89j43R0L04M54N62N49M90L68K08l5
5885A470k55l98n22n88m82m30k41m9K24L45M66N84N06M78K99Q2j02l22m51n70
$$ plain form
5905 44 -521 -991 -1314 -1489 -1390 -1136 -721 -173 349 855 1238 1450 1425 1236 882 323 -251 -747 -1185 -1394 -1431
5926 -1431 -1286 -994 -504 22 596 1037 1336 1444 1340 1060 615 77 -487 -934 -1285 -1435 -1364 -1142 -759 -209
5946 -209 306 828 1214 1427 1441 1243 855 381 -179 -677 -1111 -1361 -1399 -1255 -947 -509 48 555 1036 1345 1434
5967 1434 1354 1070 648 115 -420 -892 -1235 -1393 -1382 -1159 -767 -260 265 766 1151 1395 1439 1237 882 418 -157
5988 -157 -671 -1090 -1344 -1428 -1294 -990 -574 -31 526 971 1291 1414 1337 1083 683 138 -400 -846 -1185 -1399 -1388
6009 -1388 -1151 -783 -296 250 777 1140 1354 1391 1252 907 425 -112 -618 -1036 -1315 -1410 -1313 -1022 -568 -50 481
6030 481 958 1264 1420 1336 1077 686 184 -332 -819 -1203 -1369 -1372 -1174 -801 -313 207 689 1101 1330 1395 1239
6051 1239 924 440 -54 -555 -1029 -1288 -1394 -1293 -1002 -587 -82 453 943 1223 1377 1301 1083 699 208 -334
$$ packed form
5905D4n65m70l23j75R9K54M15N48N22N06L83K12k5j89l54n59n74m96m38k09l7
5926a431J45K92M90N26N74M41K99J08j04k80m45n38n64m47l51j50P1K22L83N50
5946b09N15N22L86K13J4j98l88m74n60m98m34k50l8J44L08M38N57N07M81L09Q9
5967A434q0k84m22n33n35m72l43j58J1K23L92N07N25N01L85K44M4k02l55m64n75
5988a57n14m19k54q4J34L04M16N43N57M45L20J23p7k54m00n45n38m46l39k14J1
6009a388K37L68M87N46N27L63K14L7j39l45m82n37n06m18k79r5R7K91M54N18N31
6030D81M77L06J56q4k59l91n02n16m87l84j66lJ98L73M88N20M82M12K29O5j56
6051A239l15m84m94n01m74k59j06J01K91M15N05N35M90K80J54p6k18l84m91n42
$$ plain form
6071 -334 -802 -1166 -1362 -1344 -1157 -795 -338 195 705 1079 1319 1361 1226 890 454 -68 -583 -1002 -1279 -1382 -1289
6092 -1289 -989 -573 -65 434 885 1215 1366 1300 1112 694 220 -301 -768 -1154 -1356 -1331 -1180 -822 -363 153
6112 153 669 1074 1301 1325 1219 899 471 -43 -559 -979 -1269 -1395 -1290 -1030 -609 -119 413 897 1190 1339
6132 1339 1323 1070 713 242 -300 -747 -1127 -1319 -1355 -1184 -825 -374 142 669 1073 1311 1393 1238 944 499 -40
6153 -40 -534 -978 -1250 -1369 -1265 -1039 -594 -123 387 829 1168 1341 1313 1132 717 237 -312 -748 -1109 -1309 -1332
6174 -1332 -1175 -860 -384 101 581 1007 1266 1386 1223 944 525 20 -481 -917 -1200 -1344 -1304 -1032 -625 -144
6194 -144 348 790 1174 1334 1299 1140 770 281 -222 -706 -1063 -1285 -1299 -1143 -867 -423 77 578 974 1249 1327
6215 1327 1236 936 546 40 -470 -861 -1200 -1320 -1271 -1058 -644 -191 337 796 1123 1308 1299 1111 795 323 -172
$$ packed form
6071c34m68l64j96J8J87L62M57N33N10L74K40M2j35l36m36n22n15m19k77j03R3
6092a289L00M16N08M99M51L30J51o6j88m18m74n21m67l86k02K5J51L58M59N16
6112A53N16M05K27K4j06l20m28n14n16m20k90j26J05K60M21M90N32M84K93J49
6132A339j6k53l57m71n42m47l80j92l6J71L59M51N16N27M04K38Q2j55k94m45n39
6153d0m94m44k72j19J04K26M45M71N10M42L39J73k8j81m15m80n49m36l61k00k3
6174a332J57L15M76M85M80M26K59J20j63k79m19n05n01m36k83j44M0K72M07M81
6194a44M92M42L84J60l5j59l70m89n03m84l57k22j4J56K76M44N00N01L96K75P8
6215A327r1l00l90n06n10l91l39j20M9K13M14M53N28M59L27J85rj88l16m72m95
$$ plain form
6236 -172 -689 -1034 -1273 -1308 -1190 -866 -461 38 548 962 1234 1309 1247 974 574 90 -416 -883 -1150 -1305 -1272
6257 -1272 -1059 -696 -232 307 734 1085 1286 1303 1136 786 368 -153 -638 -1021 -1264 -1313 -1177 -900 -453 29
6277 29 523 915 1202 1323 1257 994 579 133 -384 -829 -1114 -1303 -1284 -1101 -703 -250 227 689 1042 1255 1289
6298 1289 1151 825 372 -125 -566 -942 -1196 -1288 -1174 -912 -485 -11 471 863 1168 1276 1252 1003 638 149
6318 149 -334 -751 -1082 -1251 -1277 -1040 -734 -267 188 654 1000 1237 1269 1126 851 451 -39 -545 -923 -1181 -1269
6339 -1269 -1186 -904 -527 -79 418 833 1136 1254 1219 987 619 186 -279 -708 -1036 -1223 -1206 -1074 -740 -328 149
6360 149 600 969 1195 1248 1133 835 424 -29 -476 -884 -1143 -1248 -1168 -934 -543 -99 381 795 1111 1250 1220
6381 1220 1031 673 232 -223 -692 -1039 -1188 -1207 -1047 -760 -316 119 566 942 1187 1222 1111 851 460 -11
$$ packed form
6236a72n17l45k39l5J18L24M05M99N10M14K72P5o2k73m00m84n06m67k67j55L3
6257a272K13L63M64N39M27L51K01J7j67l50m18n21m85l83k43m9J36K77M47M82
6277B9M94L92K87J21o6k63m15m46n17m45k85j89J9J83L98M53M77M62L53K13L4
6298A289j38l26m53m97m41l76k54r2J14K62M27M74M82L92L05J08k4k49l65m89
6318A49m83m17l31j69k6K37L06M67M55M66L46K37L2j43k75m00m90n06l78k58q8
6339a269Q3K82L77M48M97M15L03J18l5k32l68m33m65m29l28j87J7J32L34M12M77
6360A49M51L69K26N3j15k98m11m53m47m08k59j05Q0K34L91M44M80M14L16J39l0
6381A220j89l58m41m55m69l47j49j9J60K87M44M35M47L76K45L5j11k60l91m71
$$ plain form
6401 -11 -464 -841 -1115 -1235 -1216 -947 -573 -129 349 755 1044 1189 1181 1002 669 257 -217 -628 -994 -1174 -1207 -1062
6423 -1062 -796 -362 103 562 903 1131 1199 1124 855 486 56 -403 -802 -1058 -1178 -1161 -957 -580 -142 305 700
6444 700 1031 1174 1173 1011 687 296 -164 -566 -924 -1117 -1190 -1042 -792 -367 50 480 872 1094 1144 1100 855 493
6466 493 83 -384 -718 -1047 -1175 -1104 -927 -588 -153 277 660 975 1130 1148 976 685 309 -180 -562 -916 -1117
6487 -1117 -1153 -1031 -768 -370 68 457 803 1071 1157 1073 839 499 102 -381 -741 -1034 -1134 -1092 -895 -598 -147
6508 -147 261 638 945 1093 1122 977 673 291 -131 -554 -880 -1081 -1137 -1000 -768 -388 0 419 786 1038 1147
6529 1147 1053 846 492 103 -337 -713 -980 -1117 -1087 -898 -597 -195 248 589 925 1094 1095 972 698 314 -117
6550 -117 -493 -836 -1050 -1118 -1018 -760 -401 9 408 759 998 1128 1008 843 514 123 -294 -665 -950 -1083
$$ packed form
6401a1m53l77k74j20J9K69L74M44M78M06K89J45qj79l33m12m74m11l66j80l3J45
6423a062K66M34M65M59L41K28O8p5k69l69m30m59l99k56j20J7K04L77M38M47L95
6444G00L31J43jj62l24l91m60m02l58j93p3J48K50M25M17M30L92K22N0m4k45l62
6466D93m10m67l34l29j28P1J77L39M35M30L83L15J55J8j72k91l76m89l82l54k01
6487a117l6J22K63L98M38L89L46K68Q6q4k34l40l97m83l60k93j00M2J97K97M51
6508a47M08L77L07J48K9j45l04l82m22m23l26k01n6J37K32L80L88M19L67K52J09
6529A147r4k07l54l89m40l76k67j37L0J89L01M02M43L41L36J69Jj23k74l84m31
6550a17l76l43k14o8J00K58L59M10L99L51K39J30j20j65l29l91m17l71k85j33
$$ plain form
6570 -1083 -1077 -891 -598 -249 177 563 877 1055 1087 948 686 327 -104 -483 -813 -1010 -1057 -1005 -770 -443 -51
6591 -51 341 726 958 1087 1012 826 538 130 -273 -622 -888 -1053 -1032 -881 -616 -260 149 520 823 1020 1096
6612 1096 947 710 350 -44 -428 -764 -943 -1039 -977 -784 -463 -82 322 658 910 1059 1038 829 522 132 -266
6633 -266 -597 -847 -990 -1001 -881 -627 -272 141 500 781 992 1020 930 715 350 -34 -407 -726 -933 -1024 -958 -769
6655 -769 -493 -77 306 653 925 1005 989 786 545 176 -186 -548 -808 -967 -982 -855 -633 -257 120 456 793
6676 793 964 1017 901 679 364 -8 -365 -667 -892 -974 -933 -760 -461 -98 301 610 874 981 962 833 538
6697 538 194 -164 -535 -805 -935 -974 -863 -626 -315 83 440 735 877 968 886 701 381 14 -322 -640 -867
6718 -867 -978 -935 -746 -464 -128 275 581 842 938 924 773 523 228 -167 -468 -740 -907 -915 -828 -605 -320 62
$$ packed form
6570a083OJ86K93L49M26L86L14J78L2j39k62l59m31l79l30j97m7N2K35L27L92
6591e1L92L85K32J29p5j86k88m08m03l49k66j65K1J51K65L56M09L71L03J97P6
6612A096j49k37l60l94l84l36j79r6O2J93L21L81M04L36K52J49k1k09l07l90l98
6633b66l31k50j43j1J20K54L55M13L59K81K11K8r0k15l65l84l73l19k07r1O6J89
6655g69K76M16L83L47K72Q0j6k03k41l69l62l62k60j59j5J27K22L76L77L36L37
6676G93J71N3j16k22l15l72l57l02k25q2M1J73K99L63L99L09K64J07j9j29k95
6697E38l44l58l71k70j30l9J11K37L11L98L57K95J42R1q2j85l20l67l36l18k27
6718h67j11M3J89K82L36M03L06K61R6j4j51k50k95l95l01k72j67qQ7K23K85L82
$$ plain form
6740 62 407 676 893 928 849 679 397 19 -311 -624 -842 -932 -905 -730 -490 -120 217 565 764 927 886 760
6762 760 533 231 -108 -468 -714 -871 -913 -832 -585 -303 68 379 674 839 897 849 650 389 29 -287 -588
6783 -588 -811 -907 -874 -717 -466 -127 206 502 760 891 881 752 531 205 -131 -447 -720 -854 -889 -765 -557
6804 -557 -271 48 356 645 798 874 837 669 397 42 -287 -556 -778 -855 -827 -721 -474 -124 202 510 741
6825 741 848 836 719 544 223 -102 -417 -658 -839 -839 -778 -587 -319 22 361 617 795 842 810 609 366 57
6847 57 -257 -541 -722 -854 -816 -649 -450 -109 185 474 720 824 847 730 522 214 -111 -416 -670 -800 -802 -738
6869 -738 -543 -273 33 305 587 773 835 745 590 372 54 -268 -559 -707 -817 -788 -650 -412 -120 198 483
6890 483 679 781 791 677 474 225 -90 -377 -637 -738 -822 -716 -528 -288 52 333 558 753 818 749 572
$$ packed form
6740F2L45K69K17L5p9j70k82l78l30l13k18r0K7J75K40L70L37L48J99J63m1j26
6762G60k27l02l39l60k46j57m2Q1K47K82L71L11K95J65N8m8j99k61l60l16l01
6783e88k23r6L3J57K51L39L33K96K58J31j0j29k21l26l36l16k73j34l5J24K08
6804e57K86L19L08K89J53P6l7j68k72l55l29k69k22p7K8J06K47L50L26L08K31
6825G41J07j2j17j75l21l25l15k41j81%O1J91K68L41L39K56J78M7l2k01k43l09
6847E7l14k84j81j32L8J67J99L41K94K89K46J04K3j17k08l08l25l05k54j30kO4
6869g38J95K70L06K72K82J86O2r0j55k18l18l22k91j48j10K9J38K38K92L18K85
6890D83J96J02J0j14k03k49l15k87k60j01q4J06J88K40L40K81K25J95O5o9j77
$$ plain form
6911 572 332 47 -225 -522 -691 -768 -752 -637 -370 -130 171 442 650 728 761 658 471 202 -92 -376 -586
6932 -586 -732 -753 -707 -516 -250 22 302 520 730 770 727 551 335 57 -209 -476 -693 -765 -741 -598 -414 -136
6954 -136 155 410 610 709 727 643 455 191 -66 -352 -566 -695 -778 -691 -516 -293 -6 272 499 691 732 683
6976 683 574 362 84 -200 -461 -598 -740 -712 -615 -412 -164 123 384 595 702 712 666 450 247 -47 -301
6997 -301 -552 -686 -755 -670 -499 -305 -15 259 480 628 718 701 567 337 78 -204 -445 -604 -726 -709 -582 -424
7019 -424 -161 113 347 559 712 723 650 471 246 -36 -303 -526 -648 -696 -650 -501 -268 -23 220 455 650
7040 650 718 693 552 376 82 -177 -376 -593 -678 -699 -587 -397 -164 98 334 536 643 709 622 468 219 -30
7062 -30 -293 -540 -640 -689 -651 -494 -296 -31 230 452 616 665 688 558 328 82 -153 -394 -575 -673 -663 -567 -411
$$ packed form
6911E72k40k85k72k97j69p7J6J15K67K40L01K71K08P8L3j03j87k69k94k84k10
6932e86j46k1M6J91K66K72K80K18K10M0m3j76k16k78k66k67k17p2K4J43J84K78
6954a36K91K55K00R9J8q4j88k64k57k86k14j29q3Q7J75K23K87K78K27J92M1m9
6976F83j09k12k78k84k61j37j42K8R7K03K48K87K61K11J07J0m6k16k03k94k54
6997c01k51j34o9Q5J71J94K90K74K21J48R0j7j34k30k59k82k41j59j22J7J27J58
7019d24K63K74K34K12J53J1p3j79k25k82k67k23j22m8M6J49K33K45K43K35J95
7040F50O8k5j41j76k94k59j99k17q5k1J12J90K33K62K36K02J07O6q7j54k49k49
7062c0k63k47j00m9L8J57J98K65K61K22J64M9K3j30k30k46k35k41j81r8J0R6J56
$$ plain form
7085 -411 -157 105 347 519 662 680 604 446 218 -42 -240 -461 -604 -650 -607 -476 -277 -35 213 442 581
7106 581 660 653 544 348 113 -143 -364 -555 -645 -646 -555 -374 -172 91 285 511 654 650 592 429 240 22 -264
7129 -264 -458 -601 -661 -591 -482 -275 -27 190 418 552 651 647 515 350 121 -137 -350 -530 -634 -626 -540 -407 -148
7152 -148 86 290 473 627 638 583 443 253 19 -234 -408 -583 -637 -578 -454 -290 -52 164 389 532 640
7173 640 611 503 321 107 -97 -337 -507 -599 -593 -566 -410 -208 38 285 469 588 608 585 431 240 -15 -204
7195 -204 -407 -566 -619 -570 -495 -303 -74 163 385 525 618 600 516 337 154 -114 -316 -494 -593 -591 -508 -357 -168
7218 -168 35 262 446 593 606 533 441 241 55 -213 -376 -553 -575 -568 -470 -281 -57 159 351 542 591 617 464
7241 464 354 147 -91 -290 -471 -587 -589 -543 -383 -174 51 252 414 550 606 538 437 247 15 -209 -402 -502
$$ packed form
7085d11K54K62K42J72J43J8p6j58k28k60j98k21j43m6M3J31J99K42K48K29J39
7106E81P9pj09j96k35k56k21j91r0jR1J81K02K63J94K26J43mn8j63j89k18k86
7129b64j94j43o0P0J09K07K48K17K28J34R9mj32j65k29k58k13j80j04QQ6J33K59
7152a48K34K04J83J54J1n5j40j90k34k53j74j75n4N9J24J64K38K16K25J43J08
7173F40k9j08j82k14k04k40j70r2OK7J56K02K46K47J84J19K0k3j54j91k55j89
7195b04k03j59n3M9P5J92K29K37K22J40R3j8q4j79j83k68k02j78r9KQ3J51J89
7218a68K03K27J84J47J3p3r2k00j86k68j63j77k2PR8J89K24K16J92J91M9K6j53
7241D64j10k07k38j99j81j16kM6J60K09K25K01J62J36N6o8j01j90k32k24j93j00
$$ plain form
7263 -502 -576 -555 -458 -298 -74 141 345 471 560 562 498 355 123 -63 -308 -439 -561 -575 -487 -375 -185 35 235
7286 235 409 514 553 535 411 255 19 -171 -383 -493 -553 -536 -435 -310 -75 146 327 457 534 557 494 364
7308 364 140 -64 -298 -447 -516 -539 -522 -393 -193 -3 232 408 517 562 537 429 246 59 -150 -319 -500 -553
7330 -553 -526 -425 -290 -119 120 336 434 505 517 459 309 150 -59 -254 -400 -505 -490 -466 -342 -184 21 223
7352 223 373 495 545 529 392 250 44 -155 -329 -450 -510 -496 -416 -268 -71 126 279 434 529 521 454 322 138
7375 138 -62 -231 -386 -496 -536 -491 -350 -213 -10 190 367 468 511 476 353 215 45 -137 -312 -444 -503 -483
7397 -483 -425 -246 -76 109 280 405 530 502 450 330 143 -31 -221 -358 -483 -516 -438 -342 -158 13 202 335
7419 335 472 508 475 354 219 34 -130 -296 -428 -513 -477 -378 -297 -99 86 262 400 464 495 434 270 154 -41
$$ packed form
7263e02p4K1R7J60K24K15K04J26Q9Ko4j43k32j86k45j31j22j4Q8J12J90K20K00
7286B35J74J05L9j8j24j56k36j90k12j10o0J7J01J25K35K21J81J30P7K3o3j30
7308C64k24k04k34j49o9k3J7J29K00J90K35J76J09M5k5j08j83j87k09j69j81n3
7330e53K7J01J35J71K39K16R8P1J2n8j50j59k09j95j46j05J5K4J24J58K05K02
7352B23J50J22N0j6j37j42k06j99j74j21o0J4Q0J48J97J97J53J55R5qo7j32j84
7375A38k00j69j55j10m0M5J41J37K03K00J77J01M3l5j23j38j70j82j75j32n9K0
7397d83N8J79J70J85J71J25J25k8n2j20j87j74j90j37j25l3P8R6J84J71J89J33
7419C35J37L6l3j21j35j85j64j66j32q5L6R9Q1J98J85J76J38O4L1o1j64j16j95
$$ plain form
7442 -41 -215 -359 -444 -485 -450 -287 -161 10 159 353 474 490 473 361 216 45 -137 -289 -410 -479 -458 -395 -253
7465 -253 -93 90 259 388 471 442 420 294 149 -38 -232 -353 -471 -469 -422 -282 -167 3 173 329 410 484 447
7488 447 355 198 47 -139 -295 -405 -472 -465 -371 -227 -69 95 266 401 462 462 397 274 129 -63 -227 -341 -452
7511 -452 -453 -404 -328 -153 22 197 337 408 453 450 327 189 44 -150 -293 -396 -438 -418 -347 -223 -53 101 263 384
7535 384 430 452 360 268 133 -81 -233 -364 -425 -475 -408 -309 -134 15 178 316 418 452 431 316 173 21 -154
7558 -154 -283 -406 -458 -427 -352 -229 -69 128 239 368 473 417 363 280 116 -46 -208 -343 -404 -438 -391 -285 -109
7581 -109 15 204 345 421 454 426 323 180 58 -128 -269 -405 -469 -455 -352 -208 -77 98 236 371 425 424 372
7604 372 255 100 -31 -224 -333 -412 -432 -376 -265 -143 15 196 322 423 414 393 322 203 44 -137 -303 -368 -425
$$ packed form
7442d1j74j44q5m1L5J63J26J71J49J94J21J6j7j12j45j71j82j52j21o9K1O3J42
7465b53J60J83J69J29Q3k9k2j26j45j87j94j21j18KM7J40J15J70J70J56Q1P4l7
7488D47r2j57j51j86j56j10o7PR4J44J58J64J71J35O1%o5j23j45j92j64j14j11
7511d52jM9P6J75J75J75J40P1M5lj23j38j45j94j43j03m2K0P1J24J70J54J62J21
7535C84M6K2r2r2j35k14j52j31o1n0O7R9J75J49J63J38J02L4k1j15j43j52j75
7558a54j29j23n2L1P5J23J60J97J11J29J05n6n4q3j64j62j62j35o1l4M7J06J76
7581a09J24J89J41P6L3k8j03j43j22j86j41j36o4J4J03J44J31J75J38J35N4jn2
7604C72j17j55j31j93j09p9k0N6J11J22J58J81J26J01rk1p1j19j59j81j66o5n7
$$ plain form
7627 -425 -391 -338 -202 -24 95 243 387 426 431 349 216 73 -91 -203 -334 -412 -423 -386 -276 -145 58 182 300
7650 300 396 433 376 313 179 32 -158 -305 -377 -442 -394 -326 -189 -28 121 246 370 414 421 330 225 68 -81 -229
7674 -229 -354 -385 -438 -367 -225 -76 72 196 331 387 442 357 282 136 -4 -195 -308 -359 -409 -348 -329 -195 -42 135
7698 135 256 353 422 400 319 205 59 -90 -238 -347 -406 -418 -356 -243 -102 46 212 323 392 404 396 270 143 11
7722 11 -197 -311 -374 -404 -396 -290 -166 -29 113 248 357 431 401 314 212 88 -95 -256 -347 -417 -417 -366 -242 -73
7746 -73 50 208 292 357 381 354 252 126 -54 -169 -292 -387 -432 -384 -297 -158 -8 139 269 386 408 402 321 202
7770 202 36 -117 -248 -375 -391 -381 -330 -239 -76 57 196 318 396 398 378 237 121 -59 -203 -314 -381 -416 -383 -281
7794 -281 -166 -2 149 268 406 373 374 277 168 21 -133 -261 -353 -393 -403 -332 -221 -71 80 216 346 410 414 349
$$ packed form
7627d25L4N3J36J78J19J48J44L9Nq2j33j43j64j12j31p8j1L7J10J31K03J24J18
7650C00R6L7n7o3j34j47j90j47p2o5M8O8J37J61J49J25J24M4Pr1j05j57j49j48
7674b29j25l1n3P1J42J49J48J24J35N6N5q5p5j46j40j91j13n1n0O1J9J34J53J77
7698A35J21R7O9k2q1j14j46j49j48j09n9j2O2J13J41J48J66J11O9J2qj26j27j32
7722A1k08j14o3l0QJ06J24J37J42J35J09P4l0q7j02j24j83j61r1p0%N1J24J69
7746g3J23J58Q4O5K4k7j02j26j80j15j23r5m5M8Q7J39J50J47J30J17K2oq1j19
7770B02j66j53j31j27j6J0N1R1J63J33J39J22P8Kk0j41j16j80j44j11o7l5L3J02
7794b81J15J64J51J19J38l3Jr7j09j47j54j28r2m0j0P1J11J50J51J36J30O4Mo5
$$ plain form
7818 349 236 86 -53 -191 -327 -410 -418 -364 -286 -115 31 177 287 375 403 386 279 147 -13 -128 -267 -346 -404
7841 -404 -382 -311 -181 -62 105 250 349 406 409 353 192 89 -55 -177 -341 -388 -440 -363 -286 -160 10 155 322 371
7865 371 421 399 275 160 11 -119 -273 -361 -380 -406 -325 -229 -68 100 253 366 415 430 344 238 95 -55 -169
7888 -169 -288 -403 -402 -382 -268 -123 26 174 311 386 396 367 313 163 10 -114 -250 -359 -430 -374 -305 -208 -50 83
7912 83 245 347 400 418 322 237 120 -46 -197 -334 -386 -381 -370 -267 -110 37 182 284 376 424 388 291 168 38
7936 38 -142 -270 -355 -400 -409 -299 -207 -59 106 227 338 370 386 349 232 120 -63 -196 -331 -398 -424 -380 -246 -114
7960 -114 19 168 292 381 398 384 309 180 52 -142 -281 -367 -410 -401 -336 -189 -68 93 227 341 386 393 332 251 120
7985 120 -64 -192 -297 -390 -396 -385 -271 -143 -3 173 294 364 396 391 317 195 29 -139 -255 -352 -424 -389 -323 -204
$$ packed form
7818C49j13j50j39j38j36q3qN4P8J71J46J46J10Q8K8j7j07j32j60j15j39p9n8
7841d04K2P1J30J19J67J45R9N7Ln6j61j03j44j22j64m7n2P7P7J26J70J45J67M9
7865C71N0k2j24j15j49j30j54q8j9k6Q1R6J61J68J53J13M9J5q6j06j43j50j14
7888a69j19j15JK0J14J45J49J48J37P5J0k9n4j50j53j24j36j09p1N6O9R7J58J33
7912H3J62J02N3J8r6q5j17j66j51j37n2NJ1J03J57J47J45J02R2M8l6r7j23j30
7936C8j80j28q5m5rJ10R2J48J65J21J11L2J6l7j17j12j83j33j35o7k6M4J34J32
7960a14J33J49J24Q9J7j4p5j29j28j94j39q6m3RO5J47J21J61J34J14M5Po1q1j31
7985A20j84j28j05r3oJ1J14J28J40J76J21P0L2np4j22j66j68j16r7p2L5O6J19
$$ plain form
8009 -204 -35 123 238 328 406 401 330 245 112 -48 -211 -333 -406 -430 -349 -260 -115 21 148 281 365 403 353 271 193
8034 193 13 -140 -231 -339 -396 -426 -318 -210 -63 124 205 313 430 415 337 271 107 -89 -219 -298 -401 -417 -357
8057 -357 -270 -118 12 198 301 387 400 371 283 190 55 -130 -270 -365 -387 -376 -310 -188 -38 101 247 363 417 430
8081 430 341 241 105 -61 -194 -320 -402 -383 -369 -273 -165 29 160 294 377 421 377 308 179 16 -124 -259 -385
8104 -385 -416 -417 -330 -218 -71 93 255 357 436 401 378 267 117 -58 -183 -329 -387 -410 -362 -273 -123 28 173 267
8128 267 380 410 397 291 149 40 -137 -273 -355 -402 -390 -342 -234 -78 80 199 336 404 369 342 231 132 -32
8151 -32 -194 -325 -396 -396 -379 -294 -134 -2 133 266 399 429 405 305 170 35 -110 -238 -349 -387 -400 -327 -252 -96
8175 -96 75 202 307 379 409 370 252 145 -41 -177 -285 -389 -417 -400 -319 -177
$$ packed form
8009b04J69J58J15R0P8np1q5j33j60j63j22p3k4Q1Q9J45J36J27J33Q4L8n0q2p8
8034A93j80j53r1j08n7l0J08J08J47J87Q1J08J17j5p8o6j64j96j30p9j03j6O0
8057c57Q7J52J30J86J03Q6J3k9q8r3j35j85j40r5k2J1O6J22J50J39J46J16N4J3
8081D30q9j00j36j66j33j26q2J9J4R6J08J94J31J34Q3M4m4o9j29j63j40j35j26
8104c85l1jQ7J12J47J64J62J02P9l5k3j11j50j75j25j46n8k3M8Q9J50J51J45R4
8128B67J13L0j3j06j42j09j77j36q2m7J2M8J08J56J58J19J37O8l5k7j11r9j64
8151c2j62j31p1%J7Q5J60J32J35J33J33L0k4j00j35j35j45j28j11l8j3P3P5J56
8175i6J71J27J05P2L0l9j18j07j86j36j08j04k8J7Q1J42
8191a77
$$ Imaginary data points
##PAGE= N=2
##DATA TABLE= (X++(I..I)), XYDATA
$$ plain form
0 0 0 0 0 0 0 0 0 0 0 0 -2 8 -8 8 -8 16 -16 24 -24 32 -34 40 -49 57 -71 80 -94 106 -122 144 -162 187 -211
33 -211 241 -269 305 -340 381 -426 476 -532 588 -653 722 -799 884 -974 1074 -1184 1306
50 1306 -1437 1584 -1744 1925 -2129 2357 -2620 2919 -3267 3678 -4176 4785 -5557 6575 -7971
65 -7971 10029 -13372 19764 -36533 182318 457178 371098 338175 193862 50794 -112810
76 -112810 -225350 -343205 -400316 -405354 -334822 -235095 -90991 59722 210343 316126 376168
87 376168 375912 334014 237083 108028 -30598 -153507 -271128 -353824 -375886 -339104 -271085 -158931
99 -158931 -9636 136214 243226 320099 358151 337419 262113 162131 45799 -82158 -203243
110 -203243 -292167 -337874 -335434 -285956 -193059 -68855 63524 179217 267825 320971 323795 276287
$$ packed form
0@%%%%%%%%%%kJ0j6J6j6K4l2M0m8N6o6P4q9J06j28J51j74K00k28K66l06L49l98
33b11M52n10N74o45P21q07R02j008J120j241J375j521J683j858K048k258K490
50A306k743L021l328L669m054M486m977N539o186O945p854Q961j0342J2132j4546
65g971J8000k3401L3136n6297K18851K74860q6080l2923j44313j43068j63604
76a12810j12540j17855n7111n038P0532R9727J44104J50713J50621J05783O0042
87C76168k56m1898r6931j29055j38626j22909j17621q2696k2062L6782O8019J12154
99a58931J49295J45850J07012P6873L8052k0732p5306r9982j16332j27957j21085
110b03243q8924m5707K440M9478R2897J24204J32379J15693Q8608N3146K824m7508
$$ plain form
122 276287 198633 100084 -19029 -137730 -227852 -285555 -311144 -288376 -214073 -112305 -2360
133 -2360 110063 208418 269844 288378 270091 217938 135493 33180 -74248 -170544 -242674 -282396
145 -282396 -280704 -233553 -152493 -54805 50493 150790 224190 260345 264257 234515 167259 76362
157 76362 -19300 -113884 -198933 -253003 -264424 -239154 -182588 -97224 3024 97861 174681 226817
169 226817 247968 234519 188198 116295 29681 -61752 -147674 -212215 -241546 -235118 -197808 -131066
181 -131066 -43428 45780 123522 186068 224240 227092 197688 145416 72560 -15512 -101576 -169735
193 -169735 -213779 -228525 -207930 -155259 -82594 -1436 79115 148884 196785 215768 205429 168364
205 168364 107062 27620 -56239 -129789 -184458 -213417 -209172 -172365 -113706 -42509 35450 109156
$$ packed form
122B76287p7654r8549j19113j18701r0122n7703k5589K2768P4303J01768J09945
133b360J12423R8355O1426J8534j8287n2153q2445j02313j07428r6296p2130l9722
145b82396J692M7151Q1060R7688J05298J00297P3400L6155L912k9742o7256r0897
157G6362r5662r4584q5049n4070j1421K5270N6566Q5364J00248R4837P6820N2136
169B26817K1151j3449m6321p1903q6614r1433q5922o4541k9331O428L7310O6742
181a31066Q7638Q9208P7742O2546L8172K852k9404n2272p2856q8072q6064o8159
193a69735m4044j4746K0595N2671P2665Q1158Q0551O9769M7901J8983j0339l7065
205A68364o1302p9442q3859p3550n4669k8959M245L6807N8659P1197P7959P3706
$$ plain form
217 109156 164332 195170 201749 181080 132056 63375 -12484 -86874 -150418 -190679 -200236 -180928
229 -180928 -138163 -76598 -4005 67741 128073 170902 191582 185074 150644 94865 26343 -47070
241 -47070 -115047 -164218 -186823 -183267 -155449 -105282 -40082 28384 91524 143436 176162 182679
253 182679 162790 120923 61445 -8532 -77141 -132418 -167288 -178582 -164179 -125999 -71242 -8520
265 -8520 55313 112741 153858 171926 165934 137315 87630 23573 -42704 -100738 -144052 -166848
277 -166848 -164462 -138369 -94689 -39133 22711 82061 128993 157199 163911 147389 108663 53656
289 53656 -8125 -67910 -117801 -149955 -159356 -146282 -114211 -66516 -8516 50586 101723 138749
301 138749 156909 151889 123810 78263 22326 -36953 -90882 -130099 -149526 -148383 -127324 -88062
$$ packed form
217A09156N5176L0838O579k0669m9024o8681p5859p4390o3544m0261r557J9308
229a80928M2765O1565P2593P1746O0332M2829K0680o508l4430n5779o8522p3413
241d7070o7977m9171k2605L556K7818N0167O5200O8466O3140N1912L2726O517
253A82679j9889m1867n9478o9977o8609n5277l4870j1294J4403L8180N4757O2722
265h520O3833N7428M1117J8068n992k8619m9685o4057o6277n8034m3314k2796
277a66848K386K6093M3680N5556O1844N9350M6932K8206O712j6522l8726n5007
289E3656o1781n9785m9891l2154r401J3074L2071M7695N8000N9102N1137L7026
301A38749J8160n020k8079m5547n5937n9279n3929l9217j9427J143K1059L9262
$$ plain form
313 -88062 -36153 20257 73664 117234 144089 149329 132730 97574 48424 -8001 -62679 -106866
325 -106866 -135139 -144808 -134243 -104409 -60048 -7951 45618 93561 127701 142415 136756 111943
337 111943 70754 18947 -34714 -82147 -117633 -136499 -135677 -115580 -79686 -32732 19355 69060
349 69060 108259 131368 135789 120887 88191 42873 -7563 -56195 -96934 -123464 -131743 -121764 -95483
362 -95483 -55476 -6891 42318 84809 115318 129365 124333 101442 64581 18878 -29322 -73052
374 -73052 -105894 -123389 -123494 -106570 -74484 -31265 16259 60810 96579 118812 123292 109649 81123
387 81123 41853 -3942 -48988 -85795 -110520 -119964 -112070 -87873 -51660 -8276 36648 76017
399 76017 103730 116557 112935 93074 60186 19025 -24728 -64610 -94786 -111733 -113108 -97868
$$ packed form
313h8062N1909N6410N3407M3570K6855N240j6599l5156m9150n6425n4678m4187
325a06866k8273r669J0565K9834M4361N2097N3569M7943L4140J4714n659k4813
337A11943m1189n1807n3661m7433l5486j8866Q22K0097L5894M6954N2087M9705
349F9060L9199K3109M421j4902l2696m5318n0436m8632m0739k6530q279R979K6281
362i5483M0007M8585M9209M2491L0509J4047n032k2891l6861m5703m8200m3730
374g3052l2842j7495j05J6924L2086M3219M7524M4551L5769K2233M480j3643k8526
387H1123l9270m5795m5046l6807k4725r444P894K4197L6213M3384M4924L9369
399G6017K7713J2827l622j9861l2888m1161m3753l9882l0176j6947j375J5240
$$ plain form
411 -97868 -68757 -30616 12136 53631 86558 106391 111790 101518 76100 39917 -1088 -42108
423 -42108 -77274 -100592 -109335 -103107 -82040 -48888 -9210 31499 67820 94013 106398 104013 86779
436 86779 56717 19094 -20689 -58054 -86965 -102417 -103525 -90827 -64771 -28824 10252 47293
448 47293 78276 97966 103053 94007 71961 38888 350 -37224 -69612 -92415 -101315 -95613 -77324
461 -77324 -48103 -11384 26510 60098 85482 98731 97297 82466 56265 21276 -16671 -51052
473 -51052 -78097 -94779 -97350 -85603 -62599 -31108 5445 41055 70135 89701 96791 89340 69068
486 69068 39564 4246 -31981 -62609 -83627 -93577 -90548 -74050 -47163 -14007 21455 53924
498 53924 78162 91332 91766 78467 53704 22031 -12575 -45841 -71883 -86870 -90059 -81060 -60154
$$ packed form
411i7868K9111L8141M2752M1495L2927J9833N399j0272k5418l6183m1005m1020
423d2108l5166k3318q743O228K1067L3152L9678M0709L6321K6193J2385k385j7234
436H6779l0062l7623l9783l7365k8911j5452j108J2698K6056L5947L9076L7041
448D7293L0983J9690N087r046k2046l3073l8538l7574l2388k2803q900N702J8289
461g7324K9221L6719L7894L3588K5384J3249j434j4831k6201l4989l7947l4381
473e1052k7045j6682k571J1747K3004L1491L6553L5610K9080J9566P090p451k0272
486F9068k9504l5318l6227l0628k1018r950L029J6498K6887L3156L5462L2469
498E3924K4238J3170M34j3299k4763l1673l4606l3266k6042j4987l189Q999K0906
$$ plain form
511 -60154 -30627 2707 35884 64224 82840 89554 83777 65578 37516 5071 -27303 -56212
523 -56212 -76977 -86384 -84007 -70135 -45781 -14861 17592 47990 71738 84118 84241 73418 51826
536 51826 21850 -10331 -39782 -64005 -79571 -83270 -75263 -57030 -30299 885 31573 58065
548 58065 76402 82750 77002 61130 36433 6138 -23902 -49764 -69636 -79791 -77740 -65225 -44040
561 -44040 -15332 15924 43329 64412 77462 78635 67461 47813 22101 -7507 -35648 -57771
573 -57771 -72436 -77312 -70441 -53792 -30060 -1019 28588 52774 69060 76353 72113 56705 34560
586 34560 8295 -20079 -45294 -63192 -73290 -73576 -61827 -40988 -15541 12561 39723 59804
598 59804 70511 72357 63889 45331 21233 -4938 -31264 -53305 -66802 -71468 -66823 -51454 -28032
$$ packed form
511f0154K9527L3334L3177K8340J8616O714n777j8199k8062l2445l2374k8909
523e6212k0765r407K377J3872K4354L0920L2453L0398K3748J2380J23j0823k1592
536E1826k9976l2181k9451k4223j5566l699Q007J8233K6731L1184L0688K6492
548E8065J8337O348n748j5872k4697l0295l0040k5862j9872j0155K051J2515K1185
561d4040K8708L1256K7405K1083J3050J173j1174j9648k5712k9608k8141k2123
573e7771j4665m876O871J6649K3732K9041K9607K4186J6286P293m240j5408k2145
586C4560k6265k8374k5215j7898j0098k86J1749K0839K5447K8102K7162K0081
598E9804J0707J846q468j8558k4098k6171k6326k2041j3497m666M645J5369K3422
$$ plain form
611 -28032 -1604 24890 48469 64227 70045 66590 53935 33200 8529 -16919 -40955 -59323
623 -59323 -68257 -67992 -58512 -39376 -14218 11598 35495 54971 65954 66795 59071 43284 20596
636 20596 -4592 -28474 -49001 -63045 -67400 -61991 -48067 -26714 -1310 23451 44581 59366
648 59366 65198 61680 50390 31818 8114 -16193 -37883 -55099 -64554 -63656 -53467 -36184 -13296
661 -13296 11570 33838 51093 61595 63085 55360 40449 19980 -3871 -26932 -45742 -58485
673 -58485 -62893 -57535 -43726 -24054 -696 22586 41690 54776 60736 57833 46406 29011 7637
686 7637 -15710 -36866 -52280 -60405 -60010 -50445 -33644 -12814 9701 30841 46981 56279 58212
699 58212 51745 37428 18034 -3651 -25355 -43587 -55148 -58733 -54040 -41214 -22413 -1034 20166
$$ packed form
611b8032K6428K6494K3579J5758N818l455j2655k0735k4671k5448k4036j8368
623e9323q934K65R480J9136K5158K5816K3897J9476J0983Q41p724j5787k2688
636B0596k5188k3882k0527j4044m355N409J3924K1353K5404K4761K1130J4785
648E9366N832l518j1290j8572k3704k4307k1690j7216r455Q98J0189J7283K2888
661a3296K4866K2268J7255J0502J490p725j4911k0469k3851k3061j8810j2743
673e8485m408N358J3809J9672K3358K3282J9104J3086N960k903j1427j7395k1374
686G637k3347k1156j5414q125L95R565J6801K0830K2515K1140J6140R298J933
699E8212o467j4317j9394k1685k1704j8232j1561l585M693J2826J8801K1379K1200
$$ plain form
712 20166 38649 51489 56983 54856 45247 28876 8371 -13064 -32741 -47702 -55430 -54857 -46510
725 -46510 -31506 -12088 8668 28046 43668 53201 55226 49473 36758 18643 -2255 -22764 -39971
738 -39971 -51404 -55288 -51064 -39535 -22651 -2887 17055 34397 46850 52705 51100 42006 26686
751 26686 7495 -12815 -31329 -45148 -52248 -51819 -44096 -30211 -12175 7182 25537 40363 49528
764 49528 51609 46329 34423 17447 -1990 -20931 -36774 -47276 -50768 -46872 -36454 -20981 -2625
777 -2625 16012 32362 44297 50112 48703 40205 25879 7879 -11200 -28454 -41431 -48385 -48422 -41523
791 -41523 -28882 -12443 5721 23185 37312 46094 48360 43611 32424 16618 -1395 -19151 -34069
804 -34069 -43902 -47390 -44253 -34836 -20580 -3603 13816 29452 41027 46677 45617 38016 24864
$$ packed form
712B0166J8483J2840N494k127r609j6371k0505k1435j9677j4961p728N73Q347
725d6510J5004J9418K0756J9378J5622R533K025n753j2715j8115k0898k0509j7207
738c9971j1433l884M224J1529J6884J9764J9942J7342J2453N855j605r094j5320
751B6686j9191k0310j8514j3819p100M29P723J3885J8036J9357J8355J4826R165
764D9528K081n280j1906j6976j9437j8941j5843j0502l492L896J0418J5473J8356
777b625J8637J6350J1935N815j409q498j4326j8000j9079j7254j2977o954l7O899
791d1523J2641J6439J8164J7464J4127Q782K266m749j1187j5806j8013j7756j4918
804c4069r833l488L137R417J4256J6977J7419J5636J1575N650j060p601j3152
$$ plain form
817 24864 8193 -9448 -25509 -37903 -44839 -45296 -39471 -28168 -12910 4153 20598 34156 42946
830 42946 45494 41348 31232 16703 -139 -16835 -30956 -40652 -44584 -42187 -33888 -20989 -5094
843 -5094 11523 26486 37642 43401 42910 36111 24146 8831 -7579 -22810 -34659 -41590 -42624
856 -42624 -37564 -27186 -12948 3141 18897 31964 40463 43160 39532 30253 16791 1091 -14712
869 -14712 -28232 -37619 -41724 -39875 -32271 -20113 -5163 10581 24888 35439 40946 40569 34233 23024
883 23024 8748 -6660 -21235 -32661 -39369 -40658 -36219 -26458 -12990 2090 17046 29610 37640
896 37640 40271 37219 28767 16091 1483 -13289 -26396 -35602 -39573 -38091 -31295 -19676 -5372
909 -5372 9415 23061 33476 38774 38455 32925 22559 8911 -5602 -19202 -30389 -37098 -38261
$$ packed form
817B4864j6671j7641j6061j2394o936m57N825J1303J5258J7063J6445J3558Q790
830D2946K548m146j0116j4529j6842j6696j4121r696l932K397Q299J2899J5895
843e094J6617J4963J1156N759m91o799j1965j5315j6410j5231j1849o931j034
856d2624N060J0378J4238J6089J5756J3067Q499K697l628r279j3462j5700j5803
869a4712j3520r387m105J849P604J2158J4950J5744J4307J0551N507l77o336j1209
883B3024j4276j5408j4575j1426o708j289M439R761J3468J5080J4956J2564Q030
896C7640K631l052q452j2676j4608j4772j3107r206l971J482O796J1619J4304
909e372J4787J3646J0415N298l19n530j0366j3648j4513j3600j1187o709j163
$$ plain form
922 -38261 -34157 -25310 -12573 1944 15767 27559 35513 38049 35152 27630 16052 2006 -11913
935 -11913 -24043 -33170 -37474 -36098 -29798 -19496 -6048 8180 20883 30729 36387 36512 31333 22162
949 22162 9769 -4281 -17397 -27851 -34739 -36607 -32774 -24509 -13050 591 14161 25253 32806
962 32806 36021 33688 26424 15904 3105 -10492 -22294 -30642 -35047 -34428 -28497 -18717 -6578 6728
976 6728 19124 28364 33658 34478 30082 21213 9871 -2812 -15605 -25948 -32243 -34263 -31488 -23791
990 -23791 -12885 -502 12168 23213 30565 33560 32172 25920 15790 3846 -8507 -20034 -28472
1003 -28472 -32638 -32387 -27616 -18622 -7056 5091 16805 26215 31429 32194 28809 21154 10188 -1899
1017 -1899 -13501 -23525 -30140 -32113 -29606 -23115 -13078 -1271 10384 20750 28327 31559 30210
$$ packed form
922c8261M104Q847J2737J4517J3823J1792P954K536k897p522j1578j4046j3919
935a1913j2130r127m304J376O300J0302J3448J4228J2703R846N658J25n179r171
949B2162j2393j4050j3116j0454o888j868L833Q265J1459J3641J3570J1092P553
962C2806L215k333p264j0520j2799j3597j1802q348m405O19N931R780J2139J3306
976F728J2396R240N294Q20m396q869j1342j2683j2793j0343o295k020K775P697
990b3791J0906J2383J2670J1045P352K995j388o252j0130j1944j2353j1527q438
1003b8472m166K51M771Q994J1566J2147J1714R410N214P65l385p655j0966j2087
1017a899j1602j0024o615j973K507O491J0037J1807J1655J0366P577L232j349
$$ plain form
1030 30210 24876 15947 4537 -7225 -17858 -26177 -30665 -30576 -26357 -18444 -7655 4087 14930 23760
1044 23760 29493 30691 27416 20555 10832 -714 -12046 -21436 -27845 -30351 -28283 -22259 -13226 -2276
1058 -2276 9014 18933 26035 29601 28802 23732 15450 5011 -6150 -16374 -24175 -28639 -29035 -25082
1072 -25082 -17599 -7862 3055 13709 22149 27292 28790 26232 19723 10464 -40 -10648 -19848 -25954
1086 -25954 -28330 -26881 -21510 -12963 -2800 7661 17314 24415 27806 27279 23013 15376 5504 -4864
1100 -4864 -14624 -22414 -26837 -27331 -24101 -17372 -8017 2275 11984 20232 25623 27062 24757 19110 10526
1115 10526 441 -9456 -17990 -24149 -26683 -25232 -20486 -12929 -3234 6843 15656 22356 26062 25798
1129 25798 21771 14930 6012 -3962 -13228 -20517 -25110 -25936 -22986 -16830 -8433 1303 10783 18579 23833
$$ packed form
1030C0210n334q929j1410j1762j0633q319m488Q9M219P913J0789J1742J0843Q830
1044B3760N733J198l275o861r723j1546j1332r390o409k506K068O024R033J0950
1058b276J1290R919P102L566p99n070q282j0439j1161j0224p801m464l96L953
1072b5082P483R737J0917J0654Q440N143J498k558o509r259j0504j0608r200o106
1086b5954k376J449N371Q547J0163J0461R653P101L391n27m266p637r872j0368
1100d864r760p790m423m94L230O729R355J0292R709Q248N391J439k305n647q584
1115A0526j0085r897q534o159k534J451M746P557R695J0077Q813O700L706k64
1129B5798m027o841q918r974r266p289m593q26K950O156Q397R736R480P796N254
$$ plain form
1144 23833 25767 23830 18477 10644 1254 -8365 -16620 -22379 -25149 -24266 -19787 -12561 -3705 5762 14493
1159 14493 20929 24340 24375 20863 14389 5991 -3234 -12115 -19154 -23377 -24422 -21852 -16145 -8256 679
1174 679 9695 17244 22250 24178 22719 17794 10373 1671 -7300 -15316 -20949 -23586 -23029 -19112 -12286
1189 -12286 -3871 4936 13191 19553 22882 23000 19995 13995 5965 -2678 -10986 -17902 -22016 -22891 -20655
1204 -20655 -15503 -7986 561 8881 16059 20950 22727 21252 16851 10001 1651 -6692 -14065 -19615 -22307
1219 -22307 -21648 -17994 -11900 -3972 4548 12195 18137 21543 21848 18987 13497 6099 -2193 -10138 -16550
1234 -16550 -20626 -21809 -19766 -14917 -8076 -77 7961 14851 19528 21422 20278 16195 9837 2134 -5816
1249 -5816 -12951 -18229 -20882 -20543 -17294 -11484 -4095 3768 11090 16840 20188 20604 18084 13023 6070
$$ packed form
1144B3833J934j937n353p833r390r619q255n759k770Q83M479P226Q856R467Q731
1159A4493O436L411L5l512o474q398r225q881p039m223j045K570N707P889Q935
1174F79R016P549N006J928j459m925p421q702q971q016n633k637N57L917O826
1189a2286Q415Q807Q255O362L329J18l005o000q030q643q308o916m114q75K236
1204b0655N152P517Q547Q320P178M891J777j475m401o850q350q343p373n550k692
1219b2307O59L654O094P928Q520P647N942L406L05k861n490p398q292p945o412
1234a6550m076j183K043M849O841P999Q038O890M677J894j144m083o358p703p950
1249e816p135n278k653L39L249N810P389P863P322N750L348M16k520n061o953
$$ plain form
1264 6070 -1751 -9240 -15409 -19341 -20503 -18733 -14332 -7877 -308 7262 13763 18304 20217 19164 15388
1279 15388 9527 2315 -5183 -11980 -17000 -19608 -19442 -16406 -11066 -4258 3183 10145 15635 18830 19409
1294 19409 17204 12460 5979 -1242 -8282 -14246 -18041 -19232 -17738 -13633 -7563 -486 6602 12819 17156
1309 17156 18912 18020 14589 9063 2246 -4826 -11184 -15954 -18427 -18194 -15356 -10389 -3974 3052 9549
1324 9549 14737 17843 18324 16153 11733 5655 -1244 -7915 -13438 -16994 -18194 -16707 -12873 -7189 -550
1339 -550 6192 12004 16024 17816 17027 13755 8542 2157 -4532 -10578 -15118 -17452 -17347 -14730 -10050 -3980
1355 -3980 2576 8843 13822 16788 17347 15469 11311 5611 -832 -7135 -12453 -15954 -17117 -15886 -12411
1370 -12411 -7122 -883 5549 11136 15192 17050 16490 13593 8786 2725 -3622 -9475 -13937 -16444 -16542
$$ packed form
1264F070p821p489o169l932j162J770M401O455P569P570O501M541J913j053l776
1279A5388n861p212p498o797n020k608J66L036N340O808P441O962N490L195N79
1294A9409k205m744o481p221p040n964l795j191J494M105O070P077P088O217M337
1309A7156J756q92l431n526o817p072o358m770k473K33K838M967O415P026O497
1324I549N188L106M81k171m420o078o899o671n523l556j200J487L834N684O639
1339e50O742N812M020J792p89l272n213o385o689o046m540k334J05K617M680O070
1355c980O556O267M979K966N59j878m158n700o443o303n318l501j163J231L475
1370a2411N289O239O432N587M056J858n60k897m807o061o347n853m462k507r8
$$ plain form
1385 -16542 -14282 -10015 -4324 1938 7974 12807 15807 16534 14895 11128 5783 -352 -6365 -11539 -15119
1400 -15119 -16461 -15456 -12347 -7422 -1452 4664 10065 14091 16082 15642 13066 8639 2951 -3131 -8698
1415 -8698 -13096 -15667 -15880 -13845 -9875 -4500 1642 7417 12066 15084 15943 14401 10879 5926 79
1430 79 -5803 -10721 -14179 -15694 -14880 -11854 -7279 -1675 4290 9512 13232 15220 15083 12612 8368 3113
1446 3113 -2684 -8167 -12309 -14781 -15277 -13474 -9591 -4500 1087 6793 11403 14215 15091 13968 10739
1461 10739 5947 546 -5011 -9969 -13317 -14793 -14235 -11580 -7065 -1791 3686 8809 12657 14453 14330
1476 14330 12343 8366 3191 -2198 -7394 -11690 -14144 -14547 -13009 -9584 -4660 730 5925 10383 13296
1491 13296 14109 13075 10224 5746 438 -4735 -9423 -12903 -14309 -13596 -11153 -7040 -1816 3499 8193
$$ packed form
1385a6542K260M267N691O262O036M833L000P27j639l767n345o135o013n174l580
1400a5119j342J005L109M925N970O116N401M026J991m40k576m427n688o082n567
1415h698m398k571k13K035L970N375O142N775M649L018Q59j542l522m953n847
1430G9n882m918l458j515Q14L026M575N604N965N222L720J988j37k471m244n255
1446C113n797n483m142k472m96J803L883N091N587N706M610K812Q76j123l229
1461A0739m792n401n557m958l348j476N58K655M515N274N477N123L848J796j23
1476A4330j987l977n175n389n196m296k454m03J538L425M924N390N195M458K913
1491A3296Q13j034k851m478n308n173m688l480j406P13K443M113N224N315M694
$$ plain form
1506 8193 11916 13879 13712 11760 8223 3355 -1987 -6787 -10757 -13261 -13647 -11992 -8795 -4328 921
1521 921 5868 9908 12753 13735 12650 9891 5888 810 -4390 -8736 -11919 -13539 -13031 -10551 -6803 -2126
1537 -2126 2987 7491 10840 12839 12953 11032 7629 3210 -1839 -6696 -10382 -12639 -13195 -11790 -8583
1552 -8583 -4383 405 5200 9158 11760 12820 12062 9415 5512 919 -3958 -8278 -11160 -12508 -12187
1567 -12187 -9966 -6309 -1941 2696 7080 10443 12191 12400 10796 7535 3241 -1382 -5883 -9549 -11762
1582 -11762 -12199 -11041 -8234 -4230 245 4666 8519 11120 12052 11389 9058 5288 836 -3631 -7672
1597 -7672 -10615 -11866 -11443 -9536 -6235 -2036 2381 6417 9670 11562 11611 10061 7162 3108 -1380 -5546
1613 -5546 -8886 -11041 -11560 -10399 -7820 -4153 111 4344 7915 10486 11542 10851 8645 5179 974
$$ packed form
1506H193L723J963j67j952l537m868n342m800l970k504l86J655L197M467N249
1521I21M947M040K845R82j085k759m003n078n200m346l183j620N08K480L748M677
1537b126N113M504L349J999J14j921l403m419n049m857l686k257n56J405L207
1552h583M200M788M795L958K602J060p58k647l903m593m877m320k882j348L21
1567a2187K221L657M368M637M384L363J748K09j604l261m294m623m501l666k213
1582a1762m37J158K807M004M475M421L853K601R32o63k331l770m452m467m041
1597g672k943j251M23J907L301M199M417M036L253J892M9j550k899m054m488m166
1613e546l340k155n19J161K579L667M264M233L571K571J056o91k206l466m205
$$ plain form
1628 974 -3343 -7135 -9815 -11139 -10864 -9089 -6031 -2191 2075 6001 9068 10887 11111 9660 6823 3055
1644 3055 -1101 -5106 -8338 -10343 -10881 -9911 -7496 -4029 -14 4037 7492 9900 10888 10281 8133 4821
1660 4821 846 -3191 -6727 -9259 -10503 -10279 -8592 -5686 -1982 2032 5780 8686 10283 10406 9008
1675 9008 6285 2768 -1134 -4830 -7845 -9721 -10218 -9279 -7007 -3763 20 3831 7106 9373 10261 9597
1691 9597 7590 4461 767 -2918 -6222 -8623 -9831 -9610 -8071 -5333 -1849 1973 5459 8131 9654
1706 9654 9715 8381 5853 2553 -1136 -4626 -7403 -9169 -9657 -8695 -6525 -3493 94 3676 6702 8753
1722 8753 9547 8891 6965 4062 671 -2831 -5878 -8125 -9257 -9047 -7547 -4929 -1597 1983 5251 7737
1738 7737 9050 9112 7861 5483 2352 -1092 -4367 -6986 -8617 -9024 -8106 -6028 -3089 318 3646 6470
$$ packed form
1628I74m317l792k680j324K75J775L058L840M266L926L067J819K24j451k837l768
1644C055m156m005l232k005n38R70K415L467M015M051L455K408R88o07k148l312
1660D821l975m037l536k532j244K24J687K906L704M014L748K906J597J23j398
1675I008k723l517l902l696l015j876m97R39K272L244L783L811L275K267Q88o64
1691I597k007l129l694l685l304k401j208K21J539K738L484L822L486K672J523
1706I654O1j334k528l300l689l490k777j766m88R62K170L032L587L582L026K051
1722H753P94o56j926k903l391l502l047k247j132K10J500K618L332L580L268K486
1738G737J313O2j251k378l131l444l275k619j631m07R18K078K939L407L328K824
$$ plain form
1754 6470 8377 8958 8305 6468 3756 495 -2823 -5669 -7797 -8810 -8601 -7040 -4568 -1390 1945 4983
1770 4983 7288 8589 8603 7404 5163 2246 -1032 -4158 -6689 -8271 -8692 -7803 -5814 -2995 264 3489
1786 3489 6166 7955 8576 7982 6213 3655 522 -2669 -5457 -7491 -8429 -8178 -6705 -4308 -1233 1955
1802 1955 4795 6987 8238 8202 7029 4894 2102 -1099 -4046 -6420 -7908 -8212 -7402 -5482 -2798 276
1818 276 3338 5829 7535 8138 7603 5923 3494 554 -2530 -5190 -7109 -8055 -7821 -6390 -4081 -1252
1834 -1252 1754 4511 6595 7740 7782 6760 4708 2021 -908 -3753 -6027 -7430 -7779 -7006 -5260 -2686
1850 -2686 193 3062 5441 7077 7704 7162 5668 3350 581 -2336 -4872 -6679 -7567 -7320 -6086 -3942
1866 -3942 -1259 1619 4212 6215 7336 7396 6411 4453 1939 -845 -3479 -5672 -7014 -7342 -6644 -4978
$$ packed form
1754F470J907N81o53j837k712l261l318k846k128j013K09J561K472L178L335L038
1770D983K305J301J4j199k241k917l278l126k531j582m21Q89J989K819L259L225
1786C489K677J789O21n94j769k558l133l191k788k034r38K51J473K397L075L188
1802A955K840K192J251l6j173k135k792l201k947k374j488l04Q10J920K684L074
1818B76L062K491J706O03n35j680k429k940l084k660j919r46K34J431K309K829
1834a252L006K757K084J145M2j022k052k687k929k845k274j403l49P73J746K574
1850b686K879K869K379J636O27n42j494k318k769k917k536j807q88K47J234K144
1866c942K683K878K593K003J121O0r85j958k514k784k634k193j342l28O98J666
$$ plain form
1882 -4978 -2604 97 2815 5116 6693 7269 6826 5390 3211 557 -2130 -4526 -6284 -7109 -6901 -5791
1898 -5791 -3809 -1266 1444 3917 5832 6952 6955 6071 4305 1972 -740 -3245 -5278 -6627 -7027 -6320
1914 -6320 -4835 -2647 -14 2586 4713 6233 6909 6525 5183 3191 771 -1831 -4100 -5768 -6696 -6658
1930 -6658 -5587 -3768 -1481 1127 3579 5407 6449 6620 5847 4195 2043 -422 -2818 -4848 -6154
1945 -6154 -6573 -6083 -4674 -2588 -184 2295 4382 5805 6400 6090 4905 3035 768 -1598 -3755 -5399
1961 -5399 -6254 -6196 -5247 -3606 -1355 1048 3244 4993 5979 6096 5385 3916 1932 -349 -2585 -4478 -5738
1978 -5738 -6105 -5634 -4368 -2435 -145 2117 4033 5365 5912 5621 4560 2894 775 -1442 -3485 -5035
1994 -5035 -5888 -5802 -4889 -3270 -1240 1025 3073 4587 5541 5665 5003 3732 1865 -355 -2433 -4218 -5388
$$ packed form
1882d978K374K701K718K301J577N76m43j436k179k654k687k396j758q25K08J110
1898e791J982K543K710K473J915J120Lq84j766k333k712k505k033j349m00P07
1914f320J485K188K633K600K127J520O76l84j342j992k420k602k269j668r28L8
1930f658J071J819K287K608K452J828J042J71p73j652k152k465k396k030j306
1945f154m19M90J409K086K404K479K087J423N95l10j185j870k267k366k157j644
1961e399q55N8R49J641K251K403K196J749R86J17p11j469j984k281k236j893j260
1978e738l67M71J266J933K290K262J916J332N47k91j061j666k119k217k043j550
1994e035q53Q6R13J619K030K265K048J514R54J24o62j271j867k220k078j785j170
$$ plain form
2011 -5388 -5790 -5325 -4048 -2220 -151 1961 3778 5009 5570 5353 4363 2790 815 -1400 -3412 -4798
2027 -4798 -5529 -5491 -4629 -3010 -1069 1004 2945 4424 5290 5436 4832 3505 1665 -389 -2471 -4166 -5224
2044 -5224 -5497 -5003 -3776 -2029 -49 1909 3614 4801 5299 5091 4220 2684 667 -1378 -3253 -4667
2060 -4667 -5335 -5199 -4346 -2923 -1097 892 2659 4177 5079 5226 4609 3501 1727 -383 -2346 -3896
2076 -3896 -4945 -5222 -4667 -3542 -2011 -163 1712 3294 4497 5098 4879 3952 2532 643 -1376 -3141
2092 -3141 -4352 -4970 -4870 -4031 -2742 -1112 773 2526 3847 4697 4972 4384 3190 1552 -358 -2238
2108 -2238 -3685 -4502 -4714 -4274 -3190 -1794 -137 1654 3207 4271 4758 4612 3703 2234 483 -1301
2124 -1301 -2952 -4010 -4466 -4393 -3679 -2458 -938 700 2348 3675 4395 4507 3998 2827 1200 -577 -2216
$$ packed form
2011e388m02M65J277J828K069K112J817J231N61k17r90j573j975k215k012j386
2027d798p31L8Q62J619J941K073J941J479Q66J46o04j327j840k054k082j695j058
2044e224k73M94J227J747J980J958J705J187M98k08q71j536k017k045j875j414
2060d667o68J36Q53J423J826J989J767J518R02J47o17j108j774k110j963j550
2076c896j049k77N55J125J531J848J875J582J203O01k19r27j420j889k019j765
2092c141j211o18J00Q39J289J630J885J753J321Q50K75n88j194j638j910j880
2108b238j447q17k12M40J084J396J657J791J553J064M87j46r09j469j751j784
2124a301j651j058m56P3P14J221J520J638J648J327P20J12n09j171j627j777j639
$$ plain form
2141 -2216 -3523 -4294 -4375 -4017 -3090 -1744 -137 1484 2996 4042 4456 4188 3344 1980 249 -1331 -2737
2158 -2737 -3768 -4195 -4057 -3433 -2349 -887 800 2321 3581 4326 4391 3818 2723 1204 -442 -1922 -3127
2175 -3127 -3901 -4095 -3713 -2929 -1725 -137 1486 2939 3915 4291 4004 3158 1918 355 -1244 -2548 -3517
2192 -3517 -4048 -4012 -3423 -2409 -1031 580 2125 3326 3975 4035 3489 2503 1136 -352 -1785 -2940 -3703
2209 -3703 -3966 -3721 -2959 -1762 -263 1354 2770 3702 4051 3810 3076 1923 551 -901 -2222 -3230 -3775
2226 -3775 -3839 -3317 -2315 -980 616 2089 3234 3840 3832 3350 2419 1190 -210 -1568 -2753 -3503 -3842 -3601
2244 -3601 -2864 -1675 -196 1340 2595 3439 3737 3498 2864 1806 537 -832 -2121 -3087 -3700 -3730 -3248
2261 -3248 -2221 -861 615 1995 3054 3592 3659 3199 2310 1156 -172 -1500 -2636 -3422 -3738 -3486 -2710
$$ packed form
2141b216j307p71q1L58R27J346J607J621J512J046M14k68q44j364j731j580j406
2158b737j031m27J38O24J084J462J687J521J260P45O5n73j095j519j646j480j205
2175c127p74j94L82P84J204J588J623J453R76L76k87q46j240j563j599j304r69
2192c517n31L6N89J014J378J611J545J201O49O0n46r86j367j488j433j155p63
2209c703k63K45P62J197J499J617J416R32L49k41p34j153j372j452j321j008n45
2226c775o4N22J002J335J596J473J145O06qm82r31j229j400j358j185p50l39K41
2244c601P37J189J479J536J255Q44K98k39o34j058j269j369j289r66o13l0M82
2261c248J027J360J476J380J059N38O7m60q89j154j328j328j136p86l16K52P76
$$ plain form
2278 -2710 -1520 -32 1364 2533 3329 3562 3378 2781 1787 542 -831 -2115 -3077 -3626 -3661 -3113 -2095
2295 -2095 -805 668 1967 2955 3476 3516 3116 2316 1212 -95 -1505 -2668 -3464 -3739 -3427 -2571 -1396
2312 -1396 0 1365 2492 3229 3526 3375 2771 1771 534 -840 -2111 -3118 -3637 -3586 -3036 -2027 -699
2329 -699 663 1878 2817 3372 3448 3084 2312 1191 -148 -1494 -2613 -3380 -3628 -3284 -2492 -1380 -24 1275
2347 1275 2330 3051 3398 3283 2723 1809 588 -828 -2065 -2966 -3443 -3400 -2815 -1852 -666 603 1775 2647
2365 2647 3194 3304 2956 2185 1111 -177 -1497 -2555 -3200 -3390 -3075 -2308 -1259 -26 1209 2209 2890
2382 2890 3246 3153 2606 1631 425 -892 -2062 -2919 -3254 -3181 -2649 -1689 -565 657 1752 2604 3114 3208 2882
2401 2882 2075 944 -318 -1548 -2537 -3069 -3172 -2848 -2092 -1063 87 1206 2233 2919 3170 3038 2455
$$ packed form
2278b710J190J488J396J169P96K33j84n97r94j245j373j284r62n49l5N48J018
2295b095J290J473J299R88N21M0m00q00j104j307j410j163p96k75L12Q56J175
2312a396J396J365J127P37K97j51o04j000j237j374j271j007n19N1N50J009J328
2329f99J362J215R39N55P6l64p72j121j339j346j119p67k48L44P92J112J356J299
2347A275J055P21L47j15n60r14j221j416j237r01m77M3N85R63J186J269J172Q72
2365B647N47J10l48p71j074j288j320j058o45j90L15P67J049J233J235J000O81
2382B890L56r3n47r75j206j317j170q57l35P3N32R60J124J222J095Q52N10R4l26
2401B882q07j131j262j230r89n32j03L24P56J029J150J119J027O86K51j32n83
$$ plain form
2418 2455 1471 215 -1035 -2118 -2896 -3185 -3063 -2514 -1624 -492 657 1702 2604 3120 3132 2733 1967 843
2436 843 -415 -1601 -2499 -3034 -3118 -2783 -2106 -1101 110 1261 2199 2917 3208 3053 2394 1429 224 -1015
2454 -1015 -2040 -2775 -3130 -3004 -2451 -1632 -602 642 1770 2592 3083 3185 2744 1930 869 -409 -1595
2471 -1595 -2437 -2953 -3151 -2824 -2108 -1140 -22 1184 2209 2877 3164 3027 2392 1414 257 -952 -1997 -2703
2489 -2703 -3031 -3037 -2587 -1713 -615 554 1674 2563 3061 3111 2755 1963 870 -286 -1455 -2371 -2899 -3076 -2855
2508 -2855 -2217 -1210 -62 1106 2138 2817 3110 2956 2407 1460 294 -808 -1808 -2628 -3024 -2983 -2563 -1785
2526 -1785 -684 475 1552 2461 2962 3052 2737 2034 986 -212 -1270 -2176 -2856 -3041 -2824 -2215 -1323 -106
2544 -106 1048 2049 2782 3090 2931 2366 1536 406 -786 -1766 -2552 -2996 -3023 -2602 -1809 -763 480 1536
$$ packed form
2418B455r84j256j250j083p78k89J22N49Q90J132J149J045R02N16J2l99p66j124
2436H43j258j186q98n35q4L35O77J005J211J151R38P18K91j55o59r65j205j239
2454a015j025p35l55J26N53Q19J030J244J128Q22M91J02m41q14j061j278j186
2471a595q42n16j98L27P16R68J118J206J025O68K87j37o35r78j157j209j045p06
2489b703l28oM50Q74J098J169J120Q89M98N0l56p92j093j156j169r16n28j77K21
2508b855O38J007J148J168J032O79K93j54n49r47j166j102j000q20l96M1M20P78
2526a785J101J159J077R09N01R0l15p03j048j198j058r06o80j85K17O09Q92J217
2544a06J154J001P33L08j59n65q30j130j192r80p86m44k7M21P93J046J243J056
$$ plain form
2562 1536 2389 2954 3078 2731 1989 1030 -88 -1256 -2203 -2840 -3047 -2883 -2276 -1332 -195 1017 2010 2691
2580 2691 3043 2998 2446 1582 466 -657 -1749 -2566 -3013 -3043 -2640 -1849 -764 415 1554 2411 2949 3076
2598 3076 2770 2072 1032 -137 -1265 -2228 -2837 -3086 -2868 -2255 -1316 -196 971 2004 2730 3058 2916 2450
2616 2450 1591 477 -712 -1769 -2567 -3033 -3039 -2635 -1834 -793 414 1524 2367 2989 3116 2754 2047 1067
2634 1067 -103 -1268 -2175 -2849 -3122 -2885 -2286 -1378 -185 940 1987 2719 3075 3016 2457 1617 488 -670
2652 -670 -1751 -2558 -2985 -3047 -2649 -1843 -825 349 1460 2387 2927 3114 2819 2116 1052 -78 -1223 -2178
2670 -2178 -2839 -3081 -2922 -2335 -1377 -269 924 1965 2736 3078 3031 2515 1629 485 -664 -1731 -2550 -3016
2688 -3016 -3062 -2691 -1899 -870 339 1464 2409 2997 3124 2850 2119 1103 -50 -1180 -2154 -2835 -3130 -2937
$$ packed form
2562A536Q53N65J24l47p42r59j118j168r47o37k07J64O07R44J137J212R93O81
2580B691L52m5n52q64j116j123j092q17m47l0M03P91J085J179J139Q57N38J27
2598C076l06o98j040j169j128r63o09k49K18O13R39J120J167J033P26L28j42m66
2616B450q59j114j189j057p98m66oM04Q01J041J207J110Q43O22J27l62p07r80
2634A067j170j165r07o74k73K37N99R08J193J125J047P32L56n9n59q40j129j158
2652f70j081q07m27o2L98Q06J018J174J111R27N40J87k95p03j064j130j145r55
2670b178o61k42J59N87R58J108J193J041P71L42m7n16q86j144j149j067q19m66
2688c016m6L71P92J029J209J125R45N88J27k74p31j016j153j130r74o81k95J93
$$ plain form
2706 -2937 -2392 -1451 -289 924 1958 2756 3138 3062 2577 1678 563 -634 -1693 -2535 -3011 -3131 -2752 -1977
2724 -1977 -929 307 1460 2399 2996 3148 2855 2176 1186 7 -1128 -2132 -2823 -3128 -3043 -2439 -1502 -350
2742 -350 869 1928 2734 3122 3067 2598 1704 617 -572 -1608 -2492 -3061 -3147 -2799 -2042 -973 259 1425
2760 1425 2389 2974 3169 2878 2221 1240 110 -1082 -2080 -2820 -3156 -3048 -2447 -1495 -369 848 1946 2749
2778 2749 3119 3086 2632 1770 709 -471 -1557 -2481 -3020 -3157 -2838 -2085 -983 220 1390 2341 2917 3088
2796 3088 2860 2206 1255 98 -1079 -2136 -2865 -3192 -3075 -2508 -1561 -378 824 1882 2697 3094 3064 2636
2814 2636 1794 708 -468 -1581 -2493 -3044 -3187 -2816 -2032 -980 237 1407 2304 2925 3192 2963 2336 1364
2832 1364 204 -1002 -2039 -2816 -3180 -3069 -2504 -1581 -438 772 1830 2637 3052 3092 2660 1842 772 -461
$$ packed form
2706b937N45R41J162J213J034P98L82p6m85q99j115j197j059q42m76j20L79P75
2724a977J048J236J153R39N97J52k93o79r90j179j135j004o91l05Q5O04R37J152
2742c50J219J059Q06L88n5m69q94j087j189j036q84n69q6L48P57J069J232J166
2760A425R64N85J95k91o57r81j130j192r98p40l36J08O01R52J126J217J098Q03
2778B749L70l3m54q62j061j180j086r24n39j37L19P53J102J203J170R51N76J71
2796C088k28o54r51j157j177j057p29l27J17N67R47J183J202J058Q15L97l0m28
2814B636q42j086j176j113r12n51j43L71P84J052J217J170Q97O21K67k29o27r72
2832A364j160j206j037p77l64J11N65R23J143J210J058Q07M15M0m32q18j070j233
$$ plain form
2850 -461 -1595 -2551 -3100 -3228 -2886 -2103 -1012 207 1326 2288 2919 3201 2953 2312 1356 179 -1048 -2116
2868 -2116 -2885 -3204 -3086 -2497 -1562 -449 772 1834 2680 3143 3164 2733 1919 812 -388 -1567 -2501 -3081
2886 -3081 -3212 -2846 -2120 -1065 94 1271 2249 2972 3205 3025 2416 1429 239 -994 -2109 -2848 -3203 -3111
2904 -3111 -2577 -1664 -534 651 1765 2649 3159 3213 2773 2002 900 -316 -1531 -2476 -3065 -3232 -2896 -2207
2922 -2207 -1175 23 1211 2195 2920 3251 3067 2426 1470 276 -937 -2019 -2835 -3223 -3147 -2620 -1711 -609
2940 -609 618 1756 2601 3167 3214 2809 1977 923 -343 -1552 -2470 -3040 -3229 -2910 -2176 -1159 -13 1190
2958 1190 2228 2940 3237 3122 2464 1481 313 -915 -1992 -2806 -3149 -3113 -2633 -1707 -589 583 1717 2655
2976 2655 3168 3208 2811 1995 912 -295 -1445 -2438 -3043 -3192 -2904 -2237 -1212 -45 1155 2198 2941 3219
$$ packed form
2850d61j134r56n49j28L42P83J091J219J119R62O31K82k48o41r56j177j227j068
2868b116p69l19J18N89R35J113J221J062Q46M63K1m31q14j107j200j179r34n80
2886c081j31L66P26J055J159J177R78P23K33j80o09r87j190j233j115p39l55R2
2904c111N34R13J130J185J114Q84N10N4m40p71j102j216j215r45n89j67L36O89
2922b207J032J198J188R84P25L31j84o41r56j194j213j082q16l88P6N27R09J102
2940f09J227J138Q45N66M7m05q32j054j266j209r18n70j89L19P34J017J146J203
2958A190J038P12K97j15o58r83j168j228j077q14l43L6M80R26J118J172J134R38
2976B655N13M0l97q16j083j207j150r93o05j49K88O67J025J167J200J043P43K78
$$ plain form
2994 3219 3067 2457 1475 308 -881 -1968 -2768 -3195 -3113 -2598 -1752 -656 579 1712 2601 3129 3192 2775
3012 2775 2007 918 -285 -1455 -2376 -3007 -3206 -2893 -2225 -1216 -25 1160 2157 2903 3207 3040 2412 1484
3030 1484 364 -882 -1913 -2700 -3144 -3139 -2624 -1788 -696 562 1720 2574 3106 3194 2793 1977 944 -247
3048 -247 -1445 -2403 -2968 -3162 -2920 -2223 -1198 -64 1150 2215 2870 3159 3040 2441 1463 317 -872 -1937
3066 -1937 -2758 -3147 -3079 -2625 -1736 -584 599 1696 2612 3096 3120 2737 1980 898 -291 -1409 -2384 -3027
3084 -3027 -3184 -2888 -2210 -1180 -14 1110 2175 2885 3170 3026 2422 1544 356 -838 -1888 -2721 -3133
3101 -3133 -3105 -2587 -1739 -652 590 1662 2524 3133 3170 2791 2000 974 -242 -1395 -2343 -2974 -3188 -2892
3119 -2892 -2225 -1274 -72 1119 2121 2870 3174 3026 2457 1545 404 -813 -1904 -2706 -3128 -3126 -2650 -1783
$$ packed form
2994C219j52o10r82j167j189j087q00m27Q2N15Q46J096J235J133Q89N28O3m17
3012B775p68j089j203j170r21o31j99L13O68J009J191J185R97P46L04j67o28r28
3030A484j120j246j031p87m44NN15Q36J092J258J158Q54N32Q8m01q16j033j191
3048b47j198r58n65j94K42O97J025J134J214J065O55K89j19n99r78j146j189j065
3066a937q21l89O8M54Q89J152J183J097R16M84K4l83p57j082j189j118r75o43
3084c027j57K96O78J030J166J124J065P10K85j44o04q78j188j194j050q33m12
3101c133K8N18Q48J087J242J072Q62O09L7l79p91j026j216j153r48o31k14K96
3119b892O67R51J202J191J002P49L04j48n69r12j141j217j091q02m22KM76Q67
$$ plain form
3137 -1783 -719 475 1636 2537 3059 3182 2841 2062 1063 -132 -1354 -2335 -2965 -3197 -2974 -2313 -1316 -186
3155 -186 1040 2073 2844 3154 3098 2501 1614 489 -737 -1850 -2678 -3121 -3163 -2712 -1883 -781 400 1541
3173 1541 2498 3065 3161 2848 2138 1090 -84 -1272 -2274 -2948 -3197 -2973 -2323 -1378 -205 1016 2087 2813
3191 2813 3176 3071 2558 1653 531 -688 -1794 -2621 -3111 -3135 -2698 -1881 -820 419 1590 2488 3030 3186
3209 3186 2876 2146 1113 -104 -1245 -2262 -2958 -3191 -3017 -2390 -1412 -234 964 2011 2809 3184 3109 2568
3227 2568 1664 528 -663 -1796 -2662 -3121 -3157 -2753 -1954 -875 322 1485 2458 3039 3202 2905 2209 1187
3245 1187 31 -1163 -2190 -2917 -3187 -3045 -2425 -1505 -378 867 1941 2750 3149 3131 2644 1762 667 -523
3263 -523 -1712 -2584 -3098 -3161 -2789 -2065 -961 223 1396 2367 3010 3211 2934 2267 1297 106 -1099 -2132
$$ packed form
3137a783J064J194J161R01N22J23l41p79r99j195j222r81o30k32K23O61R97J130
3155a86J226J033P71L10n6n97q87j125j226j113q28m43m2M51Q29J102J181J141
3173A541R57N67R6l13p10j048j174j188j002o74k49K24O50R45J173J221J071P26
3191B813L63j05n13r05j122j219j106q27m90k4M37Q17J061J239J171Q98N42J56
3209C186l10p30j033j217j141j017o96k33J74O27R78J178J198J047P98L75p5n41
3227B568r04j136j191j133q66m59l6M04P99J079J197J163R73N81J63k97o96j022
3245A187j156j194j027p27k70J42O20R20J127J245J074Q09L99j8m87q82j095j190
3263e23j189q72n14o3L72P24J104J184J173R71O43K01k77o67r70j191j205j033
$$ plain form
3281 -2132 -2888 -3201 -3059 -2466 -1558 -398 802 1876 2753 3157 3133 2664 1836 762 -475 -1627 -2534 -3074
3299 -3074 -3209 -2845 -2051 -1028 165 1382 2337 3001 3220 2954 2313 1351 118 -1097 -2154 -2873 -3193 -3067
3317 -3067 -2492 -1556 -441 776 1902 2724 3182 3155 2700 1872 768 -470 -1606 -2522 -3081 -3213 -2851 -2131
3335 -2131 -1074 145 1308 2341 2999 3214 2981 2334 1366 182 -1010 -2109 -2839 -3179 -3073 -2559 -1674
3352 -1674 -528 703 1809 2671 3135 3154 2746 1945 847 -383 -1504 -2449 -3018 -3196 -2870 -2197 -1183 43
3370 43 1239 2211 2960 3218 3036 2404 1468 311 -931 -2003 -2797 -3134 -3112 -2628 -1721 -598 628 1772
3388 1772 2639 3147 3172 2793 1984 939 -301 -1481 -2421 -3028 -3197 -2941 -2267 -1256 -39 1140 2182 2906
3406 2906 3204 3065 2469 1566 375 -846 -1930 -2736 -3146 -3135 -2663 -1802 -692 539 1703 2567 3120 3221
$$ packed form
3281b132p56l13J42N93R08J160J200J074Q77M04k4m69q28j074j237j152r07n40
3299c074j35L64P94J023J193J217R55O64K19k66o41r62j233j215j057p19l20J26
3317c067N75R36J115J217J126Q22M58k7m55q28j104j238j136r16n59j32L62P20
3335b131J057J219J163J033O58K15k33o47r68j184j192j099p30l40J06N14Q85
3352a674J146J231J106Q62M64J9m08q01j098j230j121r45n69j78L26O73J014J226
3370D3J196R72P49K58j82o32r36j157j242j072p94l37K2M84R07J123J226J144
3388A772Q67N08K5l79q09j045j240j180r40o07j69K56O74J011J217J179J042P24
3406B906K98j39n96r03j191j221j084q06m10J1M72Q61J110J231J164Q64N53J01
$$ plain form
3424 3221 2842 2093 1033 -206 -1426 -2354 -3006 -3255 -3000 -2311 -1314 -140 1101 2168 2891 3204 3120 2538
3442 2538 1580 453 -771 -1871 -2691 -3134 -3176 -2714 -1869 -792 457 1597 2510 3054 3187 2845 2143 1100
3460 1100 -112 -1287 -2298 -2972 -3211 -2987 -2380 -1364 -185 1003 2087 2856 3222 3118 2572 1676 516
3477 516 -716 -1806 -2702 -3132 -3167 -2743 -1920 -815 388 1575 2485 3065 3208 2920 2194 1185 -34 -1232
3495 -1232 -2223 -2921 -3215 -3045 -2415 -1481 -314 917 1993 2777 3198 3126 2609 1764 611 -601 -1757 -2634
3513 -2634 -3120 -3193 -2799 -1980 -933 271 1455 2440 3033 3223 2940 2237 1263 51 -1157 -2197 -2902 -3220
3531 -3220 -3060 -2479 -1546 -351 836 1934 2717 3166 3140 2704 1847 707 -462 -1622 -2557 -3069 -3196 -2856
3549 -2856 -2089 -1042 167 1359 2318 2965 3173 3004 2349 1359 176 -1018 -2057 -2854 -3201 -3077 -2538 -1655
$$ packed form
3424C221l79p49j060j239j220r28o52k49K55O89R97J174J241J067P23L13q4n82
3442B538r58j127j224j100q20m43m2M62Q45J077J249J140R13N44J33l42p02j043
3460A100j212j175j011o74k39K24O07J016J179J188J084P69L66j04n46q96j160
3477E16j232j090q96m30l5M24Q23J105J203J187R10N80J43k88p26j009j219j198
3495a232r91o98k94J70O30R34J167J231J076P84M21p2n17q45j153j212j156q77
3513b634m86p3L94Q19J047J204J184R85N93J90k83p03r74j212j208j040p05l18
3531c220J60N81R33J195J187J098P83M49k6m36q57j140j169j160r35n12j27L40
3549b856P67J047J209J192R59O47K08j69o55r90j183j194j039p97l47J24N39Q83
$$ plain form
3567 -1655 -467 730 1845 2679 3137 3195 2736 1948 841 -416 -1524 -2477 -3055 -3222 -2901 -2166 -1135 63
3585 63 1256 2226 2947 3229 3022 2387 1462 294 -953 -2001 -2783 -3185 -3161 -2655 -1761 -643 560 1704
3603 1704 2561 3088 3210 2817 2043 956 -247 -1416 -2429 -3001 -3227 -2954 -2291 -1282 -39 1150 2199
3620 2199 2948 3262 3119 2549 1568 435 -798 -1924 -2729 -3167 -3157 -2691 -1833 -740 493 1683 2565 3121
3638 3121 3227 2884 2115 1066 -181 -1324 -2343 -3048 -3275 -3044 -2393 -1429 -234 985 2070 2820 3202
3655 3202 3147 2601 1651 516 -693 -1807 -2687 -3133 -3206 -2788 -1965 -870 355 1524 2491 3072 3248 2956
3673 2956 2264 1214 8 -1203 -2196 -2927 -3204 -3045 -2455 -1498 -320 886 1958 2768 3193 3119 2624 1810
3691 1810 678 -526 -1665 -2566 -3103 -3211 -2833 -2073 -1030 174 1381 2394 2979 3236 2983 2302 1329
$$ packed form
3567a655J188J197J115Q34M58N8m59p88j107j257j108r53n78j67L21P35J031J198
3585F3J193R70P21K82k07o35r25j168j247j048p82m02K4N06Q94J118J203J144
3603A704Q57N27J22l93p74j087j203j169j013n72k26K73O63J009J243J189J049
3620B199P49L14j43n70r81j133j233j126q05m38J0M66Q58J093J233J190Q82N56
3638C121J06l43p69j049j247j143j019p05k27K31O51R64J195J219J085P50L82
3655C202n5n46r50j135j209j114q80m46p3M18Q23J095J225J169R67N81J76k92
3673B956o92j050j206j211r93p31k77J59N90R57J178J206J072Q10M25p4m95q14
3691A810j132j204j139r01n37j08L78P60J043J204J207J013N85K57k53o81r73
$$ plain form
3708 1329 171 -1077 -2104 -2867 -3179 -3057 -2553 -1600 -464 740 1867 2722 3167 3156 2739 1868 773 -410
3726 -410 -1588 -2519 -3056 -3222 -2886 -2149 -1102 112 1298 2297 2951 3191 3012 2380 1378 214 -974 -2069
3744 -2069 -2820 -3209 -3113 -2579 -1650 -512 679 1783 2605 3109 3142 2748 1949 856 -355 -1516 -2471 -3046
3762 -3046 -3185 -2899 -2227 -1181 21 1188 2204 2914 3208 3027 2434 1477 330 -894 -1962 -2777 -3152
3779 -3152 -3128 -2627 -1804 -651 541 1690 2585 3101 3191 2826 2076 969 -225 -1360 -2340 -2977 -3188 -2920
3797 -2920 -2286 -1276 -127 1049 2117 2843 3176 3050 2488 1611 431 -748 -1878 -2675 -3134 -3148 -2661 -1888
3815 -1888 -770 444 1576 2513 3054 3140 2826 2108 1052 -128 -1261 -2273 -2930 -3166 -2966 -2314 -1357 -213
3833 -213 974 2027 2774 3145 3040 2542 1656 533 -651 -1712 -2578 -3084 -3087 -2718 -1958 -863 341 1472
$$ packed form
3708A329j158j248j027p63l12J22N04R53J136J204J127Q55M45j1m17q71j095j183
3726d10j178r31n37j66L36P37J047J214J186R99O54K40j79o32j002j164j188j095
3744b069p51l89R6N34R29J138J191J104Q22N04L3l94p99j093j211j161r55n75
3762c046j39K86O72J046J202J167J016P10K94j81n93r57j147j224j068q15l75
3779c152K4N01Q23J153J192J149Q95N16R0l65p50j107j194j135r80o37k11K68
3797b920O34J010J149J176J068P26L33j26n62q77j180j179j130p97m59j4M87P73
3815a888J118J214J132R37N41Q6l14p18j056j180j133j012o57k36K00O52R57J144
3833b13J187J053P47L71j05m98q86j123j184j061q66n06lL69P60J095J204J131
$$ plain form
3851 1472 2391 3003 3152 2853 2196 1181 24 -1168 -2160 -2883 -3136 -2996 -2391 -1464 -343 844 1921 2709
3869 2709 3129 3065 2605 1752 637 -563 -1660 -2525 -3060 -3119 -2768 -2026 -968 230 1369 2313 2949 3161
3887 3161 2894 2265 1285 101 -1088 -2099 -2827 -3153 -3040 -2470 -1561 -417 771 1835 2670 3123 3104 2675
3905 2675 1826 770 -439 -1577 -2467 -3010 -3152 -2832 -2113 -1071 116 1261 2254 2887 3164 2972 2313 1400
3923 1400 233 -903 -1953 -2730 -3095 -3050 -2560 -1718 -601 574 1695 2536 3063 3099 2715 1932 899 -274
3941 -274 -1424 -2352 -2965 -3113 -2893 -2241 -1204 -60 1070 2068 2822 3093 2987 2428 1499 379 -795 -1836
3959 -1836 -2641 -3070 -3056 -2589 -1764 -661 482 1611 2495 2974 3071 2728 2003 989 -201 -1331 -2269 -2894
3977 -2894 -3080 -2830 -2202 -1247 -129 1024 2032 2721 3073 2932 2404 1541 426 -741 -1789 -2613 -3011 -3042
$$ packed form
3851A472R19O12J49k99o57j015j157j192r92p23k53J40O05R27J121J187J077P88
3869B709M20o4m60q53j115j200j097q65n35n9L51P42J058J198J139R44O36K12
3887C161k67o29r80j184j189j011p28l26J13N70R09J144J188J064Q35M53j9m29
3905B675q49j056j209j138q90n43j42L20P19J042J187J145R93O33K77j92o59r13
3923A400j167j136j050p77l65M5M90Q42J117J175J121Q41N27L6l84p83j033j173
3941b74j150r28o13j48K20O52J037J144J130R98P54K71j06n59r29j120j174j041
3959a836q05m29J4M67Q25J103J143J129Q84M79R7l43p25j014j190j130r38o25
3977b894j86K50O28R55J118J153J008O89L52j41n28q63j115j167j048q24l98l1
$$ plain form
3995 -3042 -2578 -1781 -704 475 1514 2412 2942 3079 2747 2031 1039 -131 -1242 -2190 -2849 -3067 -2870 -2280
4013 -2280 -1362 -241 929 1941 2682 3044 3029 2491 1645 542 -620 -1695 -2550 -3017 -3045 -2657 -1908 -855
4031 -855 290 1426 2355 2904 3086 2799 2174 1184 18 -1143 -2113 -2787 -3074 -2910 -2375 -1445 -334 834
4049 834 1889 2652 3061 3013 2536 1728 663 -502 -1618 -2459 -2993 -3065 -2738 -1997 -949 181 1327 2261
4067 2261 2887 3077 2836 2224 1286 98 -1009 -2024 -2764 -3067 -2949 -2425 -1547 -423 744 1791 2581 2994
4085 2994 3009 2601 1783 742 -397 -1485 -2354 -2904 -3031 -2739 -2008 -1029 103 1264 2208 2805 3030 2831
4103 2831 2192 1288 168 -954 -1963 -2650 -2996 -2910 -2423 -1555 -483 667 1734 2495 2941 2953 2552 1771
4121 1771 778 -355 -1424 -2298 -2822 -2973 -2706 -2001 -1018 100 1191 2115 2759 2984 2782 2224 1316 230
$$ packed form
3995c042M64P97J077J179J039Q98N30J37l32p16r92j170j111r48o59k18J97N90
4013b280R18J121J170J012P41L62j5n38q46j103j162j075q55m67k8L88P49J053
4031h55J145J136R29N49J82k87o25r90j166j161r70o74k87J64N35R30J111J168
4049H34J055P63M09m8m77q08j065j165j116q41n34p2L27P41J048J130J146R34
4067B261O26J90k41o12r38j188j107j015p40l03J18N24Q78J124J167J047P90M13
4085B994J5m08q18j041j139j088q69n50j27K92P31R79J132J161R44N97K25j99
4103B831o39r04j120j122j009o87l46Q6M87Q68J072J150J067P61M46J2m01p81
4121A771r93j133j069q74n24j51K67P05R83J118J091R24O44K25k02n58r08j086
$$ plain form
4139 230 -899 -1918 -2636 -2965 -2893 -2398 -1570 -499 632 1676 2461 2897 2952 2549 1820 838 -308 -1390
4157 -1390 -2274 -2812 -2977 -2722 -2033 -1057 16 1138 2061 2706 2954 2809 2270 1412 312 -824 -1796 -2567
4175 -2567 -2937 -2890 -2423 -1638 -573 542 1559 2402 2867 2986 2598 1906 918 -211 -1275 -2199 -2782 -2986
4193 -2986 -2754 -2152 -1206 -87 990 1952 2624 2950 2855 2335 1514 457 -684 -1722 -2474 -2893 -2908 -2470 -1684
4212 -1684 -712 402 1447 2285 2813 2928 2664 1986 1026 -80 -1147 -2078 -2697 -2916 -2710 -2144 -1274 -182
4230 -182 865 1839 2539 2890 2837 2352 1522 481 -622 -1678 -2462 -2842 -2880 -2489 -1747 -763 308 1326 2185
4249 2185 2748 2909 2635 1970 1031 -24 -1115 -2033 -2646 -2888 -2714 -2106 -1298 -237 837 1782 2519 2876
4267 2876 2845 2358 1571 534 -564 -1581 -2327 -2776 -2829 -2446 -1767 -801 274 1312 2174 2752 2890 2648 2034
$$ packed form
4139B30j129j019p18l29P2M95Q28J071J131J044P85M36N5m03p29r82j146j082
4157a390q84n38j65K55O89R76J073J122R23O45K48j45n39q58j100j136r72p71
4175b567l70M7M67P85J065J115J017Q43M65J19l88o92r88j129j064r24n83k04
4193b986K32O02R46J119J077R62O72L26r5n20q21j057j141j038p52m19j5M38P86
4212a684R72J114J045Q38N28J15k64o78r60j106j067r31o19k19K06N66Q70J092
4230a82J047R74P00L51n3m85q30j041j103j056p84l80l8L91P42R84J071J018Q59
4249B185N63J61k74o65r39j055j091r18o13k42J74O08Q08J061J074R45P37L57
4267B876l1m87p87j037j098j017p46m49n3L83O79R66J075J038Q62N78J38k42o14
$$ plain form
4286 2034 1078 6 -1060 -1977 -2596 -2830 -2712 -2194 -1378 -351 721 1720 2456 2857 2836 2377 1615 592
4304 592 -508 -1513 -2326 -2775 -2842 -2541 -1868 -936 156 1214 2110 2712 2930 2708 2110 1185 107 -960
4322 -960 -1883 -2535 -2854 -2768 -2288 -1486 -439 665 1689 2467 2860 2887 2481 1726 714 -374 -1381 -2227 -2745
4341 -2745 -2873 -2597 -1992 -1049 10 1121 2034 2673 2902 2725 2153 1309 292 -807 -1764 -2470 -2807 -2818 -2400
4360 -2400 -1624 -642 487 1528 2335 2812 2879 2523 1802 869 -211 -1234 -2111 -2657 -2866 -2646 -2072 -1179 -79
4379 -79 1019 1927 2584 2866 2722 2223 1364 356 -659 -1673 -2402 -2793 -2789 -2398 -1649 -690 432 1446 2243
4398 2243 2723 2818 2515 1823 944 -127 -1165 -2022 -2610 -2827 -2658 -2086 -1226 -181 918 1864 2479 2791 2710
4417 2710 2228 1409 458 -590 -1567 -2300 -2751 -2784 -2442 -1712 -729 333 1370 2171 2628 2799 2541 1921 1040
$$ packed form
4286B034r56j072j066r17o19k34J18N18Q16J027J072R99P36M01k1m59p62j023
4304E92j100j005q13m49o7L01O73R32J092J058Q96O02K18k22n98r25j078j067
4322i60r23o52l19Q6M80Q02J047J104J024P78L93K7m06p55j012j088j007q46n18
4341b745j28K76O05R43J059J111R13O39K29j77n72q44j017j099r57p06l37j1M18
4360b400P76R82J129J041Q07M77O7l56p21r33j080j023q77n46k09K20N74Q93J100
4379g9J098R08O57K82j44m99q59j008j015j014p29l91ML91P49R59J122J014P97
4398B243M80R5l03o92q79j071j038q57n88k17J69N72Q60J045J099R46O15L12q1
4417B710m82q19r51j048r77p33m51l3L42P30R83J062J037Q01M57J71k58o20q81
$$ [...]
8191c67
##END NTUPLES=NMR FID
##END=
