##TITLE=1H_LY-propPd240
 CDCl3,8 sc, 
 24.9.2021
##JCAMPDX= 6.0         $$ Bruker NMR JCAMP-DX V2.0
##DATA TYPE= NMR FID
##DATA CLASS= NTUPLES
##ORIGIN= UXNMR, Bruker Analytische Messtechnik GmbH
##OWNER= root
$$ XWIN-NMR		Version 3.5
$$ Fri Sep 24 09:09:55 2021 Russian Standard Time (UT+4h)  she@DPX200
##.OBSERVE FREQUENCY= 200.1314
##.OBSERVE NUCLEUS= ^1H
##.DELAY= (6, 6)
##.ACQUISITION MODE= SIMULTANEOUS
##.ACQUISITION SCHEME= undefined
##.AVERAGES= 8
##.DIGITISER RES= 18
##SPECTROMETER/DATA SYSTEM= spect
##.PULSE SEQUENCE= zg30
##.SOLVENT NAME= CDCl3
##.SHIFT REFERENCE= (INTERNAL, CDCl3, 0, 15.7039)
##AUDIT TRAIL= $$ (NUMBER, WHEN, WHO, WHERE, WHAT)
$$ ##TITLE= Audit trail, XWIN-NMR		Version 3.5
$$ ##JCAMPDX= 5.01
$$ ##ORIGIN= Bruker BioSpin GmbH
$$ ##OWNER= she
$$ F:/spectra/data/she/nmr/H-F/1/audita.txt
$$ ##AUDIT TRAIL=  $$ (NUMBER, WHEN, WHO, WHERE, WHAT)
(   1,<2021-09-24 09:08:43.23 +0400>,<she>,<DPX200>,
      <created by zg, POWCHK disabled, PULCHK disabled
       configuration hash MD5:
       00 E9 B6 7A A2 85 ED C7 34 08 36 98 17 FE 4E 26
       data hash MD5: 16K
       AF F6 61 61 3A AC C5 8A B7 10 60 48 1D D1 B8 13>)
$$ ##END=
$$ 
$$ hash MD5
$$ C3 45 A4 64 5B C7 C2 6D 09 71 61 9A 65 5D 12 A5
##$RELAX= 
##$RELAX= 
##$RELAX= 
##$RELAX= 
##$RELAX= 
##$RELAX= 
$$ Bruker specific parameters
$$ --------------------------
##$DU= <F:/spectra>
##$EXPNO= 1
##$NAME= <H-F>
##$PROCNO= 1
##$TYPE= <nmr>
##$USER= <she>
##$AMP= (0..31)
100 100 100 100 100 100 100 100 100 100 100 100 100 100 100 100 100 100 
100 100 100 100 100 100 100 100 100 100 100 100 100 100 
##$AQSEQ= 0
##$AQ_mod= 1
##$AUNM= <au_zg>
##$AUTOPOS= <>
##$BF1= 200.13
##$BF2= 200.13
##$BF3= 200.13
##$BF4= 200.13
##$BF5= 200.13
##$BF6= 200.13
##$BF7= 200.13
##$BF8= 200.13
##$BYTORDA= 1
##$CFDGTYP= 0
##$CFRGTYP= 5
##$CHEMSTR= <none>
##$CNST= (0..31)
1 1 145 1 1 1 1 1 1 1 1 1 1 1 1 1 1 1 1 1 1 1 1 1 1 1 1 1 1 1 1 1 
##$CPDPRG= <>
##$CPDPRG1= <>
##$CPDPRG2= <>
##$CPDPRG3= <>
##$CPDPRG4= <mlev>
##$CPDPRG5= <mlev>
##$CPDPRG6= <mlev>
##$CPDPRG7= <mlev>
##$CPDPRG8= <mlev>
##$CPDPRGB= <>
##$CPDPRGT= <>
##$D= (0..31)
0 1.2 0 0 0 0 0 0 0 0.06 0 0.03 0 0 0 0 0.0002 0 0 0 0 0 0 0 0 0 0 0 0 
0 0 0 
##$DATE= 1632460122
##$DBL= (0..7)
120 120 120 120 120 120 120 120 
##$DBP= (0..7)
150 150 150 150 150 150 150 150 
##$DBP07= 0
##$DBPNAM0= <>
##$DBPNAM1= <>
##$DBPNAM2= <>
##$DBPNAM3= <>
##$DBPNAM4= <>
##$DBPNAM5= <>
##$DBPNAM6= <>
##$DBPNAM7= <>
##$DBPOAL= (0..7)
0.5 0.5 0.5 0.5 0.5 0.5 0.5 0.5 
##$DBPOFFS= (0..7)
0 0 0 0 0 0 0 0 
##$DE= 6
##$DECBNUC= <off>
##$DECIM= 32
##$DECNUC= <off>
##$DECSTAT= 4
##$DIGMOD= 1
##$DIGTYP= 9
##$DL= (0..7)
0 120 120 120 120 120 120 120 
##$DP= (0..7)
150 150 150 150 150 150 150 150 
##$DP07= 0
##$DPNAME0= <>
##$DPNAME1= <>
##$DPNAME2= <>
##$DPNAME3= <>
##$DPNAME4= <>
##$DPNAME5= <>
##$DPNAME6= <>
##$DPNAME7= <>
##$DPOAL= (0..7)
0.5 0.5 0.5 0.5 0.5 0.5 0.5 0.5 
##$DPOFFS= (0..7)
0 0 0 0 0 0 0 0 
##$DQDMODE= 0
##$DR= 18
##$DS= 0
##$DSLIST= <SSSSSSSSSSSSSSS>
$$ [...]
##$SUBNAM2= <"">
##$SUBNAM3= <"">
##$SUBNAM4= <"">
##$SUBNAM5= <"">
##$SUBNAM6= <"">
##$SUBNAM7= <"">
##$SUBNAM8= <"">
##$SUBNAM9= <"">
##$SW= 20.0188988654967
##$SWIBOX= (0..15)
0 0 2 0 0 0 0 0 0 0 0 0 0 0 0 0 
##$SW_h= 4006.41025641026
##$TD= 16384
##$TD0= 1
##$TE= 0
##$TE2= 300
##$TE3= 300
##$TEG= 300
##$TL= (0..7)
0 120 120 120 120 120 120 120 
##$TP= (0..7)
150 150 150 150 150 150 150 150 
##$TP07= 0
##$TPNAME0= <>
##$TPNAME1= <>
##$TPNAME2= <>
##$TPNAME3= <>
##$TPNAME4= <>
##$TPNAME5= <>
##$TPNAME6= <>
##$TPNAME7= <>
##$TPOAL= (0..7)
0.5 0.5 0.5 0.5 0.5 0.5 0.5 0.5 
##$TPOFFS= (0..7)
0 0 0 0 0 0 0 0 
##$TUNHIN= 0
##$TUNHOUT= 0
##$TUNXOUT= 0
##$USERA1= <user>
##$USERA2= <user>
##$USERA3= <user>
##$USERA4= <user>
##$USERA5= <user>
##$V9= 5
##$VALIST= <valist>
##$VCLIST= <CCCCCCCCCCCCCCC>
##$VD= 0
##$VDLIST= <DDDDDDDDDDDDDDD>
##$VPLIST= <PPPPPPPPPPPPPPP>
##$VTLIST= <TTTTTTTTTTTTTTT>
##$WBST= 1024
##$WBSW= 4
##$XGAIN= (0..3)
0 0 0 0 
##$XL= 0
##$YL= 0
##$YMAX_a= 162528
##$YMIN_a= -163324
##$ZGOPTNS= <>
##$ZL1= 120
##$ZL2= 120
##$ZL3= 120
##$ZL4= 120
##$ABSF1= 10
##$ABSF2= 0
##$ABSG= 5
##$ABSL= 3
##$ALPHA= 0
##$AQORDER= 0
##$ASSFAC= 0
##$ASSFACI= 0
##$ASSFACX= 0
##$ASSWID= 0
##$AUNMP= <proc_1d>
##$AZFE= 0.1
##$AZFW= 0.1
##$BCFW= 1
##$BC_mod= 2
##$BYTORDP= 1
##$COROFFS= 0
##$CY= 11.3945322036743
##$DATMOD= 1
##$DC= 2
##$DFILT= <>
##$DTYPP= 0
##$F1P= 2.36226072786647
##$F2P= -0.459571619588291
##$FCOR= 0.5
##$FTSIZE= 0
##$FT_mod= 4
##$GAMMA= 1
##$GB= 0.15
##$INTBC= 1
##$INTSCL= 1
##$ISEN= 128
##$LB= 0.24
##$LEV0= 0
##$LPBIN= 0
##$MAXI= 10000
##$MC2= 0
##$MEAN= 0
##$ME_mod= 0
##$MI= 1.114404
##$NCOEF= 0
##$NC_proc= 0
##$NLEV= 6
##$NOISF1= 3.799351
##$NOISF2= 2.8
##$NSP= 1
##$NTH_PI= 0
##$NZP= 0
##$OFFSET= 15.70392
##$PC= 1
##$PHC0= -14153.89
##$PHC1= 9.800879
##$PH_mod= 1
##$PKNL= yes
##$PPARMOD= 0
##$PSCAL= 0
##$PSIGN= 0
##$REVERSE= no
##$SF= 200.130013532006
##$SI= 16384
##$SIGF1= 3
##$SIGF2= 2
##$SINO= 400
##$SIOLD= 16384
##$SREGLST= <1H.CDCl3>
##$SSB= 0
##$STSI= 0
##$STSR= 0
##$SW_p= 3612.71676300578
##$SYMM= 0
##$S_DEV= 0
##$TDeff= 0
##$TDoff= 0
##$TI= <>
##$TILT= no
##$TM1= 0
##$TM2= 0
##$TOPLEV= 0
##$USERP1= <user>
##$USERP2= <user>
##$USERP3= <user>
##$USERP4= <user>
##$USERP5= <user>
##$WDW= 1
##$XDIM= 8192
##$YMAX_p= 0
##$YMIN_p= 0
$$ End of Bruker specific parameters
$$ ---------------------------------
##NTUPLES= NMR FID
##VAR_NAME=  TIME,          FID/REAL,        FID/IMAG
##SYMBOL=    X,             R,               I
##VAR_TYPE=  INDEPENDENT,   DEPENDENT,       DEPENDENT
##VAR_FORM=  AFFN,          ASDF,            ASDF
##VAR_DIM=   8192,          8192,            8192
##UNITS=     SECONDS,       ARBITRARY UNITS, ARBITRARY UNITS
##FACTOR=    0.0002496,     1,               1
##FIRST=     0,             0,               0
##LAST=      2.0444736,     0,               0
##MIN=       0,             -163324,         0
##MAX=       2.0444736,     162528,          0
$$ Real data points
##PAGE= N=1
##DATA TABLE= (X++(R..R)), XYDATA
$$ plain form
0 0 0 0 0 0 0 0 0 0 0 0 0 0 0 0 0 0 0 0 7 -8 8 -8 8 -8 13 -16 16 -16 24 -24 27 -32 35 -40 45 -52 57 -65 71 -81
40 -81 90 -99 109 -122 135 -149 165 -182 200 -220 241 -265 294 -325 358 -397 442 -492 551 -624
60 -624 709 -817 953 -1133 1385 -1762 2389 -3615 6928 -35317 -93500 7917 103330 92254
74 92254 38101 77172 151890 141286 57003 28160 62524 58124 -19548 -75658 -64182 -50446
86 -50446 -91750 -135439 -123330 -79554 -57798 -49113 -23439 12018 35386 57318 85190 99168
98 99168 92400 94463 109519 97845 48580 12160 11579 -1954 -57948 -100179 -82776 -59052 -93018
111 -93018 -139536 -115307 -44573 -22367 -50288 -34368 46983 99182 73200 49305 93671 140903
123 140903 110852 50481 49097 80027 50252 -33245 -74558 -51388 -43974 -90808 -127679 -103870
$$ packed form
0@%%%%%%%%%%%%%%%%%%Pj5J6j6J6j6K1k9L2l2M0m8N1n9O7p5Q5r7J09j22J36j52
40h1J71j89K08k31K57k84L14l47L82m20M61n06N59o19O83p55Q39r34J043j175
60f24J333j526J770k086K518l147M151o004J0543m2245n8183J01417R5413j1076
74I2254n4153L9071P4718j0604q4283k8843L4364m400p7672n6110J1476J3736
86e0446m1304m3689J2109M3776K1756Q685K5674L5457K3368K1932K7872J3978
98I9168o768K063J5056j1674m9265l6420n81j3533n5994m2231J7403K3724l3966
111i3018m6518K4229P0734K2206k7921J5920Q1351N2199k5982k3895M4366M7232
123A40903l0051o0371j384L0930k9775q3497m1313K3170P414m6834l6871K3809
$$ plain form
135 -103870 -63837 -62982 -76881 -53671 -3554 26530 32752 48662 79399 96265 89465 78948 75231
148 75231 68351 53571 35428 10781 -21832 -46017 -51214 -57723 -82726 -100997 -82424 -49358 -44517
161 -44517 -56290 -36352 13372 39472 29230 33642 74917 101045 73857 38327 47047 68141
173 68141 40829 -16016 -33927 -12312 -17115 -63519 -89648 -64873 -39242 -51363 -62997 -32616
185 -32616 9507 16575 5789 22646 59344 71081 53802 44884 55136 55349 31928 6956 -4404
198 -4404 -14871 -32939 -46898 -51043 -55878 -62807 -58690 -43485 -32821 -26560 -7884 20327 34488
211 34488 33537 43840 68498 75236 53029 36258 45698 49174 17221 -21996 -28863 -19929 -36893
224 -36893 -70753 -76722 -53101 -43459 -58328 -57237 -22021 9691 9984 6906 32087 64709 68773
$$ packed form
135a03870M0033Q55j3899K3210N0117L0084O222J5910L0737J6866o800j0517l717
148G5231o880j4780j8143k4647l2613k4185n197o509k5003j8271J8573L3066M841
161d4517j1773J9938M9724K6100j0242M412M1275K6128k7188l5530Q720K1094
173F8141k7312n6845j7911K1615m803m6404k6129K4775K5631j2121j1634L0381
185c2616M2123P068j0786J6857L6698J1737j7279q918J0252K13k3421k4972j1360
198d404j0467j8068j3959m145m835o929M117J5205J0664O261J8676K8211J4161
211C4488r51J0303K4658O738k2207j6771R440L476l1953l9217o867Q934j6964
224c6893l3860n969K3621R642j4869J091L5216L1712K93l078K5181L2622M064
$$ plain form
237 68773 53221 51262 62301 58140 34350 14241 6454 -4886 -26584 -44553 -50338 -53271 -59611
250 -59611 -61804 -54612 -43704 -32582 -17416 508 13820 23639 38268 54561 58776 50765 46609
263 46609 50462 45785 24683 3760 -3728 -10005 -28615 -47561 -49120 -41415 -44016 -52545 -45616 -23086
277 -23086 -7752 -6925 -1198 20452 40538 42068 35825 39342 46653 40653 23949 13763 11879 3270
291 3270 -16043 -31287 -33334 -32276 -38094 -44003 -38916 -25931 -15936 -10516 -2733 9504 21249 29513
305 29513 35779 40166 40474 36905 31417 23746 12933 1647 -7337 -16270 -27690 -37319 -39655 -38108
319 -38108 -39610 -41045 -32589 -15269 -1895 2922 9576 24464 37757 39826 37410 40698 44446 37053
333 37053 21729 11348 6342 -4624 -22473 -34190 -34558 -34402 -40966 -45671 -39772 -28946 -21742 -14990
$$ packed form
237F8773j5552j959J1039m161k3790k0109p787j1340k1698j7969n785k933o340
250e9611k193P192J0908J1122J5166J7924J3312R819J4629J6293M215q011m156
263D6609L853m677k1102k0923p488o277j8610j8946j559P705k601q529O929K2530
277b3086J5334Q27N727K1650K0086J530o243L517P311o000j6704j0186j884q609
291C270j9313j5244k047J058n818n909N087J2985R995N420P783J2237J1745Q264
305B9513O266M387L08l569n488p671j0813j1286q984q933j1420r629k336J547
319c8108j502j435Q456J7320J3374M817O654J4888J3293K069k416L288L748p393
333C7053j5324j0381n006j0966j7849j1717l68J56o564m705N899J0826P204O752
$$ plain form
347 -14990 -2016 13325 22904 27878 34702 41943 42812 37756 33336 30289 23144 10902 -1408 -11692
361 -11692 -22059 -31535 -36274 -36970 -37865 -38330 -33492 -23932 -15473 -8985 710 14041 24262 28668 32403
376 32403 37469 37784 30527 22643 19601 15891 4969 -8671 -16721 -20123 -25778 -33155 -35112 -30274 -24677
391 -24677 -21055 -15399 -5869 3376 9373 14922 22478 29233 31433 29577 26106 21467 15160 7776 44
406 44 -8022 -15591 -20970 -24233 -26987 -29022 -28018 -23142 -16321 -9198 -1347 7089 14211 19074 23044 26929
422 26929 28965 27389 23333 18761 13395 5894 -3100 -11405 -18043 -23238 -26744 -28062 -27692 -26279 -23301
437 -23301 -17875 -10407 -2121 6134 13791 20281 25534 29474 31003 29137 25055 20748 15992 8960 -79
452 -79 -8686 -15745 -22139 -27810 -30638 -29785 -27293 -24717 -20590 -13236 -4483 2645 8416 15159 22511 27506
$$ packed form
347a4990J2974J5341R579M974O824P241Q69n056m420l047p145j2242j2310j0284
361a1692j0367r476m739o96q95m65M838R560Q459O488R695J3331J0221M406L735
376C2403N066L15p257p884l042l710j0922j3640q050l402n655p377j957M838N597
391b4677L622N656R530R245N997N549P556O755K200j856l471m639o307p384p732
406D4q066p569n379l263k754k035J004M876O821P123P851Q436P122M863L970L885
422B6929K036j576m056m572n366p501q994q305o638n195l506j318L70J413K978
437b3301N426P468Q286Q255P657O490N253L940J529j866m082m307m756p032r039
452g9q607p059o394n671k828Q53K492K576M127P354Q753P128N771O743P352M995
$$ plain form
468 27506 29002 28460 26597 22584 16797 10762 4548 -2753 -10387 -16530 -21067 -24924 -27350 -26958 -24281
483 -24281 -20561 -15428 -8175 -364 5803 10638 15988 21583 24954 24994 23306 21075 17195 10896 3796
498 3796 -2357 -8133 -14061 -18575 -20404 -20926 -21540 -20838 -17148 -11578 -6018 -350 5887 11475 15251 17982
514 17982 20144 20645 18838 15779 12528 8498 3059 -3004 -8676 -13717 -17778 -20010 -19991 -18824 -17389 -14840
530 -14840 -10057 -4065 1133 5712 11161 16886 20325 21065 20900 19988 16659 11256 6215 2031 -3137 -9552
546 -9552 -15143 -18689 -20910 -22123 -21571 -19078 -15323 -10429 -4499 1577 6709 11037 15471 19673 22172
561 22172 22336 21026 18726 14575 8493 2393 -2422 -7198 -12944 -17802 -19868 -20402 -21208 -21042 -17835 -12425
577 -12425 -7002 -1768 4028 9660 13758 16636 19033 20529 20153 18011 14801 10794 5846 212 -5434
$$ packed form
468B7506J496n42j863m013n787o035o214p301p634o143m537l857k426L92K677
483b4281L720N133P253P811O167M835N350N595L371M0j688k231l880o299p100
498C796o153n776n928m514j829n22o14P02L690N570N560N668O237N588L776K731
514A7982K162N01j807l059l251m030n439o063n672n041m061k232J9J167J435K549
530a4840M783N992N198M579N449N725L439P40j65r12l329n403n041m184n168o415
546i552n591l546k221j213N52K493L755M894N930O076N132M328M434M202K499
561B2172J64j310k300m151o082o100m815m776n746m858k066n34q06J66L207N410
577a2425N423N234N796N632M098K878K397J496l76k142l210m007m948n634n646
$$ plain form
592 -5434 -10445 -14392 -16903 -17949 -18029 -17581 -16112 -12831 -8164 -3377 1412 6696 11579 14576 15994 17241
608 17241 17717 15813 12227 9069 6160 1688 -4131 -9091 -12369 -14793 -16621 -16854 -15354 -12983 -10150
623 -10150 -6515 -2199 2220 6311 10212 13585 15758 16480 16051 14351 10963 6656 3093 109 -4045
638 -4045 -9321 -13093 -14339 -15225 -16666 -16217 -12574 -8311 -5397 -2045 3320 8414 11023 12568 15180 17493
654 17493 16934 14020 11064 8241 4098 -1222 -5801 -9033 -12075 -15115 -16670 -16244 -15250 -14108 -11301 -6495
670 -6495 -1635 2294 6380 10787 13700 14794 15830 16918 15852 12262 8579 5804 1998 -3576 -8513
685 -8513 -11135 -12928 -15334 -16812 -15580 -12946 -10987 -8945 -4701 999 5341 7781 10510 13978 15882
700 15882 15049 13373 12206 10225 6388 2035 -1602 -5046 -8887 -12126 -13695 -14051 -13795 -12757 -10700 -7854
$$ packed form
592e434n011l947k511j046q0M48J469L281M667M787M789N284M883K997J418J247
608A7241M76j904l586l158k909m472n819m960l278k424j828k33J500K371K833
623a0150L635M316M419M091L901L373K173P22m29j700l388m307l563k984m154
638d045n276l772j246q86j441M49L643M263K914L352N365N094K609J545K612K313
654A7493n59k914k956k823m143n320m579l232l042l040j555M26R94J142K807M806
670f495M860L929M086M407K913J094J036J088j066l590l683k775l806n574m937
685h513k622j793k406j478J232K634J959K042M244N700M342K440K729L468J904
700A5882q33j676j167j981l837m353l637l444l841l239j569l56K56J038K057K846
$$ plain form
716 -7854 -4454 -511 3514 6859 9501 11792 13555 14021 12893 10871 8633 5898 2305 -1685 -5046
731 -5046 -7791 -10410 -12578 -13315 -12515 -11073 -9456 -7055 -3591 282 3646 6279 8726 11120 12754 12809
747 12809 11478 9793 7932 5140 1394 -2115 -4667 -7271 -10396 -12616 -12726 -11708 -10929 -9826 -6994
762 -6994 -2986 509 3152 6085 9499 11865 12570 12670 12659 11435 8474 4972 2093 -927 -4636 -8091
778 -8091 -10301 -11724 -12971 -13237 -11950 -9931 -7858 -4963 -877 3017 5501 7614 10329 12513 12697 11690
794 11690 11001 9879 6780 2626 -432 -2550 -5558 -9335 -11364 -11192 -10977 -11547 -10853 -7840 -4386 -2023
810 -2023 564 4363 7854 9465 10069 11153 11841 10666 8261 6165 4136 1054 -2646 -5528 -7620 -9547
826 -9547 -11001 -11072 -10118 -9142 -7910 -5450 -2197 700 3073 5755 8516 10021 10201 10185 10026 8586 5865
$$ packed form
716g854L400L943M025L345K642K291J763M66j128k022k238k735l593l990l361
731e046k745k619k168p37Q00J442J617K401L464L873L364K633K447K394J634N5
747A2809j331j685j861k792l746l509k552k604l125k220j10J018P79J103K832
762f994M008L495K643K933L414K366P05J00j1j224k961l502k879l020l709l455
778h091k210j423j247k66J287K019K073K895M086L894K484K113K715K184J84j007
794A1690o89j122l099m154l058k118l008l777k029J72K15n70O94L013L454K363
810b023K587L799L491J611O04J084O88j175k405k096k029l082l700k882k092j927
826i547j454p1R54R76J232K460L253K897K373K682K761J505J80j6j59j440k721
$$ plain form
843 5865 3253 1298 -1111 -4390 -7296 -8815 -9519 -10191 -10249 -8889 -6669 -4527 -2425 304 3346 5824
859 5824 7584 9016 10127 10378 9503 7781 5625 3279 799 -1811 -4428 -6795 -8507 -9529 -10072 -9996
875 -9996 -8928 -6972 -4762 -2460 268 3247 5654 7300 8627 9865 10359 9638 8106 6326 4139 1396
891 1396 -1499 -3965 -6110 -8105 -9475 -9886 -9695 -9110 -7784 -5552 -2961 -456 2203 4940 7188 8383
907 8383 9176 9928 9919 8465 6371 4556 2622 -277 -3453 -5616 -7003 -8471 -9768 -9748 -8533 -7308 -6219
924 -6219 -4164 -1110 1747 3682 5496 7590 9028 9162 8673 8126 6966 4779 2352 227 -1953 -4491
940 -4491 -6715 -7895 -8439 -8793 -8529 -7193 -5390 -3709 -1688 1051 3683 5373 6646 8076 9063 8710
956 8710 7466 6241 4899 2762 52 -2252 -3946 -5811 -7749 -8740 -8488 -7876 -7236 -5985 -3791 -1385
$$ packed form
843E865k612j955k409l279k906j519p04o72n8J360K220K142K102K729L042K478
859E824J760J432J111K51q75j722k156k346k480k610k617k367j712j022n43P6
875i996J068J956K210K302K728K979K407J646J327J238M94p21j532j780k187k743
891A396k895k466k145j995j370m11J91N85J326K232K591K505K659K737K248J195
907H383P93P52rj454k094j815j934k899l176k163j387j468j297K0J215J225J089
924f219K055L054K857J935J814K094J438J34m89n47j160k187k427k125k180k538
940d491k224j180n44l54K64J336J803J681K021K739K632J690J273J430R87l53
956H710j244j225j342k137k710k304j694j865j938r91K52O12O40J251K194K406
$$ plain form
972 -1385 731 2793 4936 6718 7812 8352 8543 7963 6503 4706 2883 754 -1689 -3815 -5470 -6999
988 -6999 -8176 -8584 -8036 -7078 -5987 -4250 -1833 645 2591 4307 6135 7680 8307 8184 7816 6978 5267
1005 5267 3009 870 -1097 -3207 -5329 -6868 -7742 -8125 -8113 -7515 -6240 -4548 -2487 -127 2161 4037
1021 4037 5711 7135 7912 8056 7735 6998 5689 3657 1477 -571 -2588 -4649 -6475 -7483 -7706 -7679 -7388
1038 -7388 -6423 -4725 -2820 -853 1319 3541 5325 6669 7504 7886 7613 6773 5605 3974 1932 -145
1054 -145 -1994 -3940 -5955 -7275 -7554 -7390 -7222 -6504 -4795 -2707 -1036 625 2813 5029 6346 6880
1070 6880 7399 7780 7106 5292 3517 2211 510 -1943 -4014 -5206 -6205 -7427 -7868 -7077 -5932 -4913
1086 -4913 -3434 -1083 1202 2731 4153 5909 7150 7307 7109 6993 6158 4137 1861 289 -1259 -3543
$$ packed form
972a385K116K062K143J782J094N40J91n80j460j797j823k129k443k126j655j529
988f999j177m08N48R58J091J737K417K478J946J716J828J545O27j23l68q38j711
1005E267k258k139j967k110k122j539q74l83J2N98J275J692K061K360K288J876
1021D037J674J424P77J44l21p37j309k032k180k048k017k061j826j008k23K7K91
1038g388R65J698J905J967K172K222J784J344Q35L82k73q40j168j631k042k077
1054a45j849j946k015j320k79J64J68P18J709K088J671J661K188K216J317N34
1070F880N19L81o74j814j775j306j701k453k071j192r99j222m41P91J145J019
1086d913J479K351K285J529J422J756J241J57j98j16q35k021k276j572j548k284
$$ plain form
1102 -3543 -5729 -6555 -6522 -7010 -7640 -6771 -4612 -3031 -1995 26 3040 5018 5443 5978 7332 7937 6719
1119 6719 5148 4343 3246 790 -1879 -3452 -4477 -6038 -7451 -7460 -6604 -6037 -5427 -3929 -1588 294 1702
1136 1702 3655 5721 6799 6824 6913 7125 6152 4077 2427 1412 -248 -2883 -4884 -5607 -6178 -7303 -7624
1153 -7624 -6361 -4621 -3692 -2668 -468 2169 3612 4340 5504 7089 7551 6476 5398 4787 3534 1196
1169 1196 -1145 -2391 -3362 -5035 -6625 -6965 -6427 -6072 -5702 -4293 -2161 -160 1335 2835 4569 5808
1185 5808 6307 6430 6536 6149 4783 3076 1610 -89 -2087 -4025 -5138 -5704 -6514 -6864 -6228 -4886 -4040
1202 -4040 -3141 -1258 1397 3229 4019 5022 6574 7188 6169 5030 4780 4188 2076 -550 -1907 -2623
1218 -2623 -4417 -6606 -7017 -5863 -5528 -5780 -4808 -2342 -419 354 1678 4042 5835 6027 5915 6566 6570 4881
$$ packed form
1102c543k186q26L3m88o30Q69K159J581J036K021L014J978M25N35J354O05j218
1119F719j571q05j097k456k669j573j025j561j413rQ56N67O10J498K341J882J408
1136A702J953K066J078K5Q9K12r73k075j650j015j660k635k001p23n71j125l21
1153g624J263J740R29J024K200K637J443P28J164J585M62j075j078o11j253k338
1169A196k341j246r71j673j590l40N38L55L70J409K132K001J495J500J734J239
1185E808M99J23J06l87j366j707j466j699j998j938j113n66q10l50O36J342Q46
1202d040Q99J883K655J832P90J003J552O14j019j139k50n92k112k626j357p16
1218b623j794k189m11J154L35k52R72K466J923P73J324K364J793J92j12O51Mj689
$$ plain form
1236 4881 2834 1837 937 -1161 -3474 -4507 -4834 -5991 -7254 -6659 -4907 -3946 -3521 -1753 931 2613
1252 2613 2939 4111 6169 6924 5904 5167 5523 4722 2060 -431 -978 -1771 -4045 -6117 -5983 -5034 -5641
1269 -5641 -6471 -5143 -2497 -1031 -658 1129 3985 5358 4964 5006 6256 6481 4791 3193 2654 1655 -791
1286 -791 -3076 -3861 -4424 -5646 -6564 -5835 -4609 -4259 -3858 -1955 396 1646 2383 4018 5928 6352 5398
1303 5398 5012 5275 4284 2020 257 -225 -1300 -3606 -5449 -5571 -5241 -5696 -5960 -4483 -2341 -1302 -740
1320 -740 988 3305 4538 4609 5124 6244 6290 4783 3235 2506 1485 -616 -2674 -3486 -3880 -4953 -6159
1337 -6159 -6013 -4963 -4279 -3730 -2243 49 1714 2567 3516 4920 5699 5406 5142 5120 4498 2796 925 -149
1355 -149 -1306 -3225 -4812 -5114 -4845 -5308 -5754 -4788 -2974 -1928 -1435 197 2787 4353 4326 4500 5689
$$ packed form
1236D881k047r97r00k098k313j033l27j157j263N95J752R61M25J768K684J682
1252B613L26J172K058P55j020p37L56q01k662k491n47p93k274k072J34R49o07
1269e641q30J328K646J466L73J787K856J373l94M2J250K25j690j598n39r99k446
1286g91k285p85n63j222r18P29J226L50M01J903K351J250P37J635J910M24r54
1303E398l86K63r91k264j763m82j075k306j843j22L30m55k64J477K142J039N62
1320g40J728K317J233P1N15J120M6j507j548p29j021k101k058q12l94j073j206
1337f159J46J050O84N49J487K292J665Q53R49J404P79k93k64k2o22j702j871j074
1355a49j157j919j587l02K69m63m46R66J814J046M93J632K590J566k7J74J189
$$ plain form
1372 5689 6068 4726 3188 2872 2442 444 -1953 -3003 -3386 -4569 -5978 -5883 -4593 -3948 -3846 -2724 -579
1389 -579 910 1453 2585 4595 5570 5107 4794 5073 4564 2657 842 233 -425 -2354 -4160 -4554 -4414 -5112
1407 -5112 -5764 -4648 -2922 -1907 -1381 189 2402 3447 3460 4128 5463 5674 4459 3513 3382 2359 58
1424 58 -1893 -2400 -2838 -4215 -5492 -5087 -4215 -4178 -4209 -2851 -718 672 1410 2644 4244 4959 4632 4477
1442 4477 4785 4352 2930 1685 778 -459 -2371 -3772 -4166 -4507 -5124 -5156 -4218 -3153 -2588 -1909 -254 1664
1460 1664 2783 3377 4363 5332 5329 4439 3640 3248 2316 778 -688 -1635 -2562 -3848 -4873 -5067 -4733 -4336 -3768
1479 -3768 -2672 -1305 -74 855 2001 3313 4139 4503 4627 4758 4363 3194 1847 801 -211 -1531
1495 -1531 -2819 -3601 -3916 -4335 -4760 -4554 -3602 -2615 -1613 -478 1095 2421 3144 3653 4252 4642 4372 3835
$$ packed form
1372E689L79j342j538l16m30j998k397j050l83j183j409R5J290O45J02J122K145
1389e79J489N43J132K010R75m63l13K79n09j907j815o09o58j929j806l94J40o98
1407e112o52J116J726J015N26J570K213J045J3O68J335K11j215r46j31j023k301
1424E8j951n07m38j377j277M05Q72L7l1J358K133J390P38J234J600P15l27j55
1442D477L08m33j422j245r07j237j912j401l94l41o17l2R38J065N65O79J655J918
1460A664J119N94R86R69lq90p99l92r32j538j466r47r27j286j025j94L34L97N68
1479c768J096J367J231R29J146J312Q26L64J24J31l95j169j347j046j012j320
1495a531j288p82l15m19m25K06R52R87J002J135J573J326P23N09N99L90k70n37
$$ plain form
1513 3835 3345 2575 1128 -450 -1585 -2416 -3448 -4380 -4466 -3990 -3777 -3742 -3047 -1557 -292 550 1632 3187
1531 3187 4235 4306 4014 4021 3948 3067 1890 981 192 -1089 -2521 -3484 -3919 -4353 -4629 -4081 -3140 -2370 -1806 -679
1551 -679 794 1922 2513 3384 4495 4848 4251 3659 3248 2455 1022 -378 -1155 -1889 -2981 -3982 -4293 -4265
1569 -4265 -4260 -3946 -2901 -1572 -493 389 1599 2696 3293 3657 4114 4461 4166 3242 2465 1565 473 -1117
1587 -1117 -2251 -2777 -3376 -3872 -4252 -3986 -3661 -3066 -2304 -1060 239 1429 2416 3258 3814 3916 3913 3715 3368
1606 3368 2586 1659 695 -409 -1726 -2828 -3444 -3754 -3873 -3748 -3367 -2694 -1995 -1157 -162 893 1961 2924
1624 2924 3592 3851 3793 3523 3019 2214 1195 365 -425 -1333 -2440 -3251 -3684 -3879 -3809 -3422 -2647 -1747 -794 133
1644 133 1060 1911 2710 3412 3845 3996 3742 3279 2605 1593 361 -749 -1415 -2180 -3034 -3725 -3801 -3657 -3559 -3237
$$ packed form
1513C835m90p70j447j578j135q31j032r32q6M76K13L5O95J490J265Q42J082J555
1531C187J048P1k92Pp3q81j177r09p89j281j432r63m35m34k76N48R41P70N64J127
1551f79J473J128N91Q71J111L53n97n92m11p93j433j400p77p34j092j001l11K8
1569d265NL14J045J329J079Q82J210J097N97L64M57L47k95r24p77r00j092j590
1587a117j134n26n99m96l80K66L25N95P62J244J299J190R87Q42N56J02lj98l47
1606C368p82r27r64j104j317j102o16l10j19J25L81O73O99Q38R95J055J068R63
1624B924O68K59n8k70n04q05j019q30p90r08j107q11m33j95P0L87P75R00R53R27
1644A33R27Q51P99P02M33J51k54m63o74j012j232j110o66p65q54o91p6J44R8L22
$$ plain form
1664 -3237 -2280 -971 12 959 1892 2816 3300 3483 3634 3684 3319 2595 1825 870 -317 -1486 -2402 -2878 -3387
1683 -3387 -3791 -3757 -3265 -2747 -2391 -1618 -313 869 1672 2500 3355 3816 3727 3438 3231 2729 1845 933 143 -779
1703 -779 -1991 -2946 -3282 -3548 -3772 -3716 -3006 -2099 -1453 -941 67 1441 2253 2645 3199 3790 3873 3276 2469 1911
1723 1911 1176 139 -877 -1574 -2210 -2920 -3375 -3470 -3347 -3033 -2361 -1334 -431 340 1222 2178 2796 2982 3130
1742 3130 3371 3328 2652 1734 912 176 -762 -1856 -2588 -2825 -3058 -3289 -3299 -2750 -2098 -1543 -796 335 1340
1761 1340 2144 2737 3157 3381 3192 2875 2535 1928 1199 244 -753 -1571 -2240 -2973 -3458 -3479 -3147 -2741 -2264 -1637
1781 -1637 -764 222 958 1780 2511 3171 3490 3539 3210 2699 2109 1306 308 -530 -1312 -2116 -2590 -3187 -3577 -3562
1801 -3562 -3077 -2344 -1765 -1070 8 1048 1750 2056 2605 3339 3570 3186 2615 2339 1884 617 -680 -1315
$$ packed form
1664c237R57J309R83R47R33R24M84J83J51N0l65p24p70r55j187j169r16m76n09
1683c387m04L4M92N18L56P73J305J182Q03Q28Q55M61q9k89k07n02q84r12p90r22
1703g79j212r55l36k66k24N6P10R07O46N12J008J374Q12L92N54N91Q3n97q07n58
1723A911p35j037j016o97o36p10m55r5J23L14O72J027R03P71Q82R56O18J86J48
1742C130K41m3o76r18q22p36r38j094p32k37k33k31j0N49O52N55P47J131J005
1761A340Q04N93M20K24j89l17l40o07p29r55r97q18o69p33m85k1L32M06M77O27
1781a637Q73R86P36Q22P31O60L19M9l29n11n90q03r98q38p82q04m74n97l90J5
1801c562M85P33N79O95J078J040P02L06N49P34K31l84n71k76m55j267j297o35
$$ plain form
1819 -1315 -1643 -2234 -3074 -3288 -2843 -2757 -2751 -2254 -1095 -37 588 1359 2242 2805 2779 2735 2946 2822 2117 1340 822
1840 822 145 -1093 -2097 -2365 -2523 -2901 -3103 -2669 -1985 -1647 -1362 -409 754 1383 1752 2523 3234 3088 2490
1859 2490 2163 2265 1559 323 -434 -585 -1173 -2408 -3254 -3005 -2558 -2787 -2694 -1717 -508 11 168 954 2169
1878 2169 2731 2765 2877 3212 3003 2103 1182 625 -9 -1012 -1694 -2070 -2519 -3021 -3220 -2909 -2449 -2119 -1364 -151
1898 -151 848 1238 1660 2473 3005 2897 2625 2715 2751 1900 660 -228 -600 -1382 -2373 -2887 -2666 -2586 -2843 -2861 -2145
1919 -2145 -1226 -638 -122 923 2100 2584 2449 2620 2902 2830 2143 1542 1297 756 -281 -1402 -1970 -2147 -2553
1938 -2553 -2983 -2768 -2190 -1730 -1584 -1049 -96 702 1285 1855 2504 2831 2768 2511 2223 1670 914 228 -99 -767
1958 -767 -1727 -2343 -2415 -2495 -2777 -2741 -1837 -830 -457 -265 630 1790 2146 1959 2219 3017 2995 2031 1154 1023 624
$$ packed form
1819a315l28n91q40k14M45Q6OM97J159J058O25P71Q83N63k6m4K11j24p05p77n18
1840H22o77j238j004k68j58l78k02M34O84L38K85R53J163O29L69P71P11j46n98
1859B490l27J02p06j236p57j51n88j235q46K49M47k29R3R77J209N19J57P86J215
1878B169N62L4J12L35k09r00r21n57o34j003o82l76m49n02j99L11M60L30P55J213
1898a51R99L90M22Q13N32j08k72R0L6q51j240q88l72p82r91n14K21Q0k57j8P16
1919b145R19N88N16J045J177M84j35J71K82p2o87o01k45n41j037j121n68j77m06
1938b553m30K15N78M60J46N35R53P98N83N70O49L27o3k57k88n53p56o86l27o68
1958g67r60o16p2q0k82L6R04J007L73J92Q95J160L56j87K60P98k2r64q77j31l99
$$ plain form
1979 624 -519 -1651 -1780 -1645 -2209 -2869 -2713 -2051 -1709 -1637 -889 328 1081 1292 1784 2507 2745 2451 2236
1998 2236 2308 1983 1061 208 -243 -869 -1887 -2520 -2528 -2429 -2662 -2680 -1967 -1254 -944 -550 553 1630 2045 2030 2615
2019 2615 3148 2795 1899 1556 1675 1001 -282 -1144 -1212 -1568 -2536 -3179 -2753 -2125 -2014 -1935 -1177 -60 524 696
2039 696 1317 2178 2690 2565 2463 2365 2131 1354 582 98 -525 -1206 -1746 -2043 -2319 -2539 -2486 -1967 -1540 -1148 -538
2060 -538 378 1088 1354 1628 2069 2499 2332 1955 1742 1559 954 -51 -778 -1030 -1411 -2047 -2376 -2168 -1824 -1886
2080 -1886 -1774 -1119 -239 379 726 1299 2062 2373 2170 1940 2036 1918 1270 527 61 -336 -975 -1895 -2334 -2196
2100 -2196 -2183 -2272 -2097 -1431 -820 -492 22 804 1438 1913 2251 2502 2537 2269 1840 1454 917 114 -566 -873 -1435
2121 -1435 -2132 -2645 -2546 -2289 -2287 -2045 -1303 -344 260 468 1122 2017 2441 2259 2268 2574 2388 1579 686 341 -41
$$ packed form
1979F24j143j132j29J35n64o60J56O62L42P2P48J217P53K11M92P23K38k94k15
1998B236P2l25r22q53m51o26j018o33qR9k33j8P13P13L10L94J103J077M15j5N85
2019B615N33l53q96l43J19o74j283q62o8l56r68o43M26O28J11P9P58J117N84J72
2039F96O21Q61N12j25j02r8k34p77p72m84o23o81n40k97k76k20N3N19M27L92O10
2060e38R16P10K66K74M41M30j67l77k13j83o05j005p27k52l81o36l29K08L44o2
2080a886J12O55Q80O18L47N73P63L11k03k30R6j18o48p43m66l97o39r20m39J38
2100b196J3q9J75O66O11L28N14P82O34M75L38K51L5k68m29l86n37q03o80l07n62
2121a435o97n13R9K57KK42P42R59O04K08O54Q95M24j82RL06j86q09q93l45l82
$$ plain form
2142 -41 -900 -1722 -1922 -1946 -2163 -2528 -2340 -1747 -1318 -958 -277 626 1145 1416 1702 2110 2312 2123 1889 1650 1283
2163 1283 633 -69 -562 -1127 -1718 -2006 -2010 -1992 -2048 -1862 -1323 -741 -430 96 918 1603 1829 1832 2119 2207 1833 1301
2185 1301 920 675 152 -745 -1329 -1564 -1812 -2138 -2255 -1983 -1415 -1113 -755 -287 415 1005 1413 1672 2019 2187
2205 2187 2109 1741 1353 938 473 -66 -743 -1200 -1573 -1838 -2058 -2168 -1978 -1655 -1261 -768 -212 389 972 1366
2225 1366 1788 2085 2184 2187 1959 1668 1224 668 52 -559 -1097 -1587 -1840 -2157 -2328 -2186 -1864 -1456 -1108 -585 153
2246 153 770 1182 1503 1994 2366 2218 1967 1656 1476 991 207 -431 -702 -1152 -1711 -2077 -2073 -1933 -1855 -1735 -1192
2267 -1192 -517 -73 373 925 1422 1696 1854 1988 1985 1709 1359 954 425 -187 -746 -1151 -1406 -1772 -1953 -1862 -1605
2288 -1605 -1452 -1219 -661 72 528 835 1182 1654 1807 1646 1538 1544 1354 731 274 -136 -555 -1141 -1536 -1676
$$ packed form
2142d1q59q22k00k4k17l65J88N93M29L60O81R03N19K71K86M08K02j89k34k39l67
2163A283o50p02m93n65n91k88mJ8n6J86N39N82L11N26Q22O85K26LK87Q8l74n32
2185A301l81k45n23q97n84k35k48l26j17K72N68L02L58M68P02N90M08K59L47J68
2205B187p8l68l88m15m65n39o77m57l73k65k20j10J90L23L94M93N56O01N83L94
2225A366M22K97R9Lk28k91m44n56o16o11n38m90k53l17j71J42L22M08L48N23P38
2246A53O17M12L21M91L72j48k51l11j80m85p84o38k71m50n59l66MJ40P8J20N43
2267a192O75M44M46N52M97K74J58J34lk76l50m05n29o12n59m05k55l66j81R1K57
2288a605J53K33N58P33M56L07L47M72J53j61j08Oj90o23m57m10m19n86l95j40
$$ plain form
2308 -1676 -1626 -1617 -1582 -1342 -927 -548 -141 362 979 1389 1657 1810 1852 1745 1433 1186 782 302 -225 -678 -1125
2329 -1125 -1602 -1954 -1962 -1839 -1681 -1466 -1011 -488 -29 305 791 1374 1805 1932 1994 1959 1821 1408 854 381 29
2350 29 -485 -936 -1408 -1663 -1881 -1971 -1950 -1692 -1262 -773 -232 311 697 1088 1517 1687 1866 1902 1804 1474 1052 514
2372 514 51 -469 -951 -1278 -1484 -1607 -1703 -1740 -1609 -1296 -876 -420 100 534 948 1287 1473 1481 1520 1564 1524 1181
2394 1181 743 335 -116 -695 -1168 -1337 -1381 -1471 -1586 -1438 -1109 -778 -555 -65 535 1051 1322 1439 1574 1582 1385
2415 1385 1013 819 537 125 -393 -847 -1114 -1506 -1671 -1681 -1413 -1130 -946 -512 -143 204 527 961 1443 1590
2435 1590 1603 1671 1599 1220 724 313 65 -239 -814 -1216 -1366 -1551 -1801 -1857 -1496 -1016 -741 -412 128 674 1006
2456 1006 1168 1422 1791 1857 1610 1420 1120 685 99 -349 -647 -956 -1324 -1565 -1533 -1586 -1667 -1395 -879 -457 -151
$$ packed form
2308a676N0RL5K40M15L79M07N03O17M10K68J53M2j07l12k47m04m80n27m53m47
2329a125m77l52qJ23J58K15M55N23M59L34M86N83M31J27O2l5j38m13n54m73l52
2350B9n14m51m72k55k18r0K1K58M30M89N41N43L86L91M29J70J79L6r8l30m22n38
2372E14m63n20m82l27k06j23r6l7J31L13M20M56N20M34M14L39J86QL9M4m0l43
2394A181m38m08m51n79m73j69m4r0j15J48L29L31K23M90O00N16K71J17J35Qj97
2415A385l72j94k82m12n18m54k67l92j65j0K68K83J84M34L69L47L23M34M82J47
2435A590J3O8p2l79m96m11k48l04n75m02j50j85k50n6L61M80K75L29N40N46L32
2456A006J62K54L69O6k47j90l00m35n86m48k98l09l68k41L2n3q1K72N16M22L06
$$ plain form
2477 -151 347 879 1256 1325 1409 1629 1638 1416 1111 873 555 -119 -704 -1014 -1034 -1293 -1609 -1572 -1300 -1127 -1044 -709
2499 -709 -132 363 704 937 1227 1455 1434 1260 1150 982 729 333 -55 -473 -837 -1169 -1278 -1417 -1357 -1179 -938
2520 -938 -731 -425 -180 278 672 1013 1201 1460 1521 1278 1060 753 527 209 -149 -553 -851 -1086 -1293 -1488
2540 -1488 -1492 -1288 -923 -655 -418 21 404 741 941 1133 1546 1523 1375 1097 1002 653 197 -251 -529 -727 -1117
2561 -1117 -1402 -1508 -1436 -1375 -1305 -928 -445 -124 261 677 991 1246 1380 1458 1560 1424 1136 890 443 -2 -471
2582 -471 -769 -895 -1185 -1396 -1523 -1312 -1210 -1121 -852 -290 333 542 718 1133 1471 1338 1173 1167 1225 902 444
2603 444 12 -139 -416 -1026 -1240 -1189 -1017 -1207 -1111 -861 -549 -341 -128 328 673 947 1076 1163 1248 980 846
2624 846 736 538 193 -248 -434 -701 -1049 -1266 -1230 -1018 -958 -913 -549 -18 194 250 604 1066 1234 1226 1091 1177
$$ packed form
2477a51M98N32L77O9Q4K20Rk22l05k38l18o74n85l10k0k59l16L7K72J73Q3L35
2499g09N77M95L41K33K90K28k1j74j10j68k53l96l88m18l64l32j09j39O0J78K41
2520i38K07L06K45M58L94L41J88K59O1k43k18l07k26l18l58m04k98k35k07j95
2540a488mK04L65K68K37M39L83L37K00J92M13k3j48k78r5l49m56m48k78j98l90
2561a117k85j06P2O1P0L77M83L21L85M16L14K55J34P8J02j36k88k46m47m45m69
2582d71k98j26k90k11j27K11J02Q9K69N62O23K09J76M15L38j33j65oN8l23m58
2603D44m32j51k77o10k14N1J72j90R6K50L12K08K13M56L45K74J29Q7Q5k68j34
2624H46j10j98l45m41j86k67l48k17L6K12O0M5L64N31K12N6L54M62J68qj35Q6
$$ plain form
2646 1177 1048 724 253 1 -144 -568 -962 -1124 -1250 -1176 -1344 -1158 -869 -405 -184 173 454 790 973 1103
2666 1103 1106 1287 1183 1038 766 406 142 -298 -548 -880 -1019 -1129 -1219 -1240 -1105 -964 -653 -356 31 317 554
2687 554 1001 1085 1202 1113 1179 1106 859 552 391 42 -382 -743 -1029 -1013 -1036 -1190 -1181 -957 -628 -415 -319 84 498
2710 498 823 878 1030 1197 1199 904 716 707 443 76 -385 -555 -779 -961 -1188 -1136 -864 -874 -659 -370 -59 217
2732 217 372 717 1032 1014 1038 1031 982 772 393 224 36 -276 -629 -830 -832 -942 -1085 -1032 -695 -396 -353 -219 127
2755 127 684 720 755 998 1114 1016 829 631 552 387 -133 -409 -573 -713 -1072 -1023 -1076 -875 -895 -661 -325 -69
2777 -69 168 479 783 892 1009 992 1140 989 808 450 242 28 -284 -563 -735 -860 -942 -1176 -1059 -956 -735
2798 -735 -543 -286 100 346 428 768 960 1097 1075 1037 927 667 552 146 -77 -325 -671 -802 -972 -992 -893 -929
$$ packed form
2646A177j29l24m71k52j45m24l94j62j26P4j68J86K89M64K21L57K81L36J83J30
2666A103LJ81j04j45k72l60k64m40k50l32j39j10r0k1J35J41L11K97L87K86K37
2687E54M47Q4J17q9O6p3k47l07j61l49m24l61k86J6k3j54RK24L29K13R6M03M14
2710D98L25N5J52J67Kk95j88rk64l67m61j70k24j82k27N2K72j0K15K89L11K76
2732B17J55L45L15j8K4pm9k10l79j69j88l12l53k01kj10j43N3L37K99M3J34L46
2755A27N57L6L5K43J16r8j87j98p9j65n20k76j64j40l59M9n3K01k0K34L36K56
2777f9K37L11L04J09J17j7J48j51j81l58k08k14l12k79j72j25q2k34J17J03K21
2798g35J92K57L86K46Q2L40J92J37k2l8j10k60j15m06k23k48l46j31j70k0R9l6
$$ plain form
2820 -929 -829 -604 -263 -13 184 411 684 822 840 841 803 842 660 479 146 -63 -220 -525 -660 -825 -803 -812 -821
2843 -821 -613 -512 -388 -73 207 440 573 681 957 897 843 628 573 384 195 -54 -234 -465 -630 -926 -933 -779
2865 -779 -783 -557 -506 -107 -33 215 432 646 816 795 820 826 826 559 316 144 -38 -298 -559 -675 -697 -865 -860 -872 -694
2890 -694 -535 -325 -75 216 429 488 727 888 918 821 828 762 442 243 13 -173 -398 -623 -838 -807 -722 -886 -807
2913 -807 -616 -365 -235 -19 245 618 627 749 798 886 826 651 554 365 248 -115 -326 -523 -745 -788 -830 -768 -762 -590
2937 -590 -476 -225 -156 62 378 565 708 772 742 798 671 498 310 138 1 -212 -472 -536 -668 -723 -707 -671 -503
2960 -503 -301 -174 27 248 426 560 575 616 682 754 482 473 312 124 -108 -320 -395 -561 -620 -704 -758 -592 -552 -480
2984 -480 -294 3 181 365 538 601 691 677 643 494 499 241 206 -13 -282 -428 -588 -703 -710 -748 -688 -529 -385 -321
$$ packed form
2820i29J00K25L41K50J97K27K73J38J8Jl8L9j82j81l33k09j57l05j35j65K2rr
2843h21K08J01J24L15K80K33J33J08K76o0n4k15n5j89j89k49j80k31j65k96pJ54
2865g79mK26N1L99P4K48K17K14J70k1K5O%k67k43j72j82k60k61j16k2j68Nj2J78
2890f94J59K10K50K91K13N9K39J61L0r7Po6l20j99k30j86k25k25k15L1Q5j64P9
2913h07J91K51J30K16K64L73RJ22M9Q8o0j75r7j89j17l63k11j97k22m3m2O2OJ72
2937e90J14K51O9K18L16J87J43O4l0N6j27j73j88j72j37k13k60o4j32n5J6L6J68
2960e03K02J27K01K21J78J34J5M1O6P2k72rj61j88k32k12p5j66n9q4n4J66M0P2
2984d80J86K97J78J84J73O3R0j4l4j49Nk58l5k19k69j46j60j15pl8O0J59J44O4
$$ plain form
3008 -321 -172 121 332 538 582 612 845 748 547 485 370 355 -27 -258 -302 -467 -627 -845 -785 -617 -564 -494 -332
3031 -332 -85 7 230 375 575 673 731 791 705 567 417 174 55 -132 -331 -391 -471 -671 -718 -772 -589 -450 -354
3054 -354 -202 74 323 319 424 602 724 649 586 639 500 224 -41 -109 -202 -393 -579 -577 -543 -553 -613 -548 -304 -171
3078 -171 -66 189 329 460 555 588 582 478 499 347 291 129 -56 -260 -376 -480 -611 -698 -541 -461 -397 -329 -113
3101 -113 69 216 280 502 685 737 647 575 503 407 200 16 -106 -189 -398 -607 -680 -683 -663 -629 -516 -326 -111 4
3125 4 107 289 491 541 643 629 746 631 444 289 152 -20 -217 -402 -452 -567 -632 -673 -657 -539 -346 -263 -68
3148 -68 115 270 423 511 571 585 616 587 525 315 162 20 -96 -323 -544 -585 -516 -529 -645 -617 -360 -196 -142 -59
3172 -59 261 505 544 482 559 643 584 358 250 227 121 -133 -343 -423 -485 -614 -658 -555 -432 -364 -275 -90 62 196
$$ packed form
3008c21J49K93K11K06M4L0K33r7k01o2j15j5l82k31m4j65j60k18O0J68N3P0J62
3031c32K47R2K23J45K00R8N8O0q6j38j50k43j19j87j99o0q0k00m7n4J83J39R6
3054c54J52K76K49mJ05J78J22p5o3N3j39k76k65o8r3j91j86KL4j0o0O5K44J33
3078a71J05K55J40J31R5L3oj04K1j52n6j62j85k04j16j04j31q7J57Q0O4O8K16
3101a13J82J47O4K22J83N2r0p2p2r6k07j84j22q3k09k09p3lK0L4J13J90K15J15
3125DJ03J82K02N0J02j4J17j15j87j55j37j72j97j85n0j15o5m1J6J18J93Q3J95
3148f8J83J55J53Q8O0J4L1k9o2k10j53j42j16k27k21m1O9j3j16K8K57J64N4Q3
3172e9L20K44L9o2P7Q4n9k26j08k3j06k54k10q0o2j29m4J03J23O8Q9J85J52J34
$$ plain form
3196 196 293 457 597 596 580 591 496 291 141 28 -72 -258 -455 -512 -527 -603 -680 -552 -345 -229 -159 26 281 421
3220 421 428 471 632 680 591 421 356 313 50 -209 -331 -359 -462 -628 -660 -588 -492 -463 -361 -166 37 213 344 468
3244 468 568 618 624 591 503 399 293 163 -35 -250 -389 -469 -565 -659 -658 -537 -418 -348 -253 -86 136 276 377 491
3268 491 605 673 578 466 401 316 163 -44 -179 -278 -389 -526 -614 -605 -504 -466 -380 -202 -3 118 210 343 491 554
3292 554 548 539 554 468 282 109 -24 -146 -307 -437 -490 -502 -549 -566 -502 -370 -240 -89 101 260 369 449 535 589 524
3317 524 458 427 367 182 -31 -180 -256 -416 -597 -609 -526 -455 -482 -434 -221 -22 52 155 356 563 609 549 547 537 449
3342 449 290 153 56 -100 -268 -405 -488 -577 -620 -571 -456 -365 -277 -130 65 197 272 392 545 619 573 503 468 367
3366 367 171 -7 -103 -194 -346 -482 -523 -521 -544 -548 -423 -247 -105 10 180 339 435 463 504 556 558 463 333 225 104
$$ packed form
3196A96R7J64J40jj6J1r5k05j50j13j00j86j97n7j5p6p7J28K07J16P0J85K55J40
3220D21PM3J61M8q9j70o5m3k63k59j22k8j03j66l2P2R6K9J02J95K03J76J31J24
3244D68J00N0Ol3q8j04j06j30j98k15j39q0r6r4JJ21J19P0R5J67K22J40J01J14
3268D91J14O8r5j12o5q5j53k07j35r9j11j37q8RJ01L8Q6J78J99J21R2J33J48O3
3292E54orJ5q6j86j73j33j22j61j30n3j2m7j7O4J32J30J51J90J59J09Q0Q6N4o5
3317E24o6l1o0j85k13j49p6j60j81j2Q3P1k7M8K13J99P4J03K01K07M6o0kj0q8
3342D49j59j37r7j56j68j37q3q9m3M9J15R1Q8J47J95J32P5J20J53P4m6p0l5j01
3366C67j96j78r6r1j52j36m1Kk3mJ25J76J42J15J70J59R6K8M1N2Kr5j30j08j21
$$ plain form
3391 104 -69 -260 -361 -426 -460 -508 -503 -470 -391 -300 -161 -18 144 296 422 470 488 499 471 411 315 199 96 -28 -178
3416 -178 -347 -451 -509 -517 -499 -448 -370 -232 -113 -9 129 255 409 504 518 534 525 423 312 175 77 -44 -156 -299
3440 -299 -386 -453 -511 -528 -487 -370 -255 -139 -11 147 257 323 397 492 535 482 434 384 258 70 -82 -185 -272 -384
3464 -384 -468 -482 -470 -478 -441 -330 -169 -43 96 264 387 436 453 512 519 434 332 283 210 30 -180 -296 -334 -413 -503 -508
3490 -508 -414 -333 -310 -243 -92 72 166 269 405 484 489 451 399 336 222 111 25 -89 -232 -341 -411 -445 -495 -482 -376
3515 -376 -248 -168 -76 48 198 296 344 412 494 489 430 333 256 132 1 -120 -206 -286 -369 -433 -434 -426 -411 -344 -202 -53 47
3542 47 145 260 346 394 392 401 400 358 268 149 32 -105 -215 -312 -401 -419 -416 -391 -356 -319 -238 -100 21 135 244 357 434
3569 434 447 421 390 327 270 174 67 -50 -160 -272 -355 -424 -451 -423 -346 -294 -213 -130 0 102 184 271 379 447 420 401
$$ packed form
3391A04j73j91j01o5l4m8NL3P9R1J39J43J62J52J26M8J8J1k8o0r6j16j03j24j50
3416a78j69j04n8qJ8N1P8J38J19J04J38J26J54R5J4J6rj02j11j37r8j21j12j43
3440b99q7o7n8j7M1J17J15J16J28J58J10O6P4R5M3n3m8n0j26j88j52j03q7j12
3464c84q4j4J2qL7J11J61J26J39J68J23M9J7N9Pq5j02m9p3j80k10j16l8p9r0n
3490e08R4Q1K3O7J51J64R4J03J36P9Nl8n2o3j14j11q6j14j43j09p0l4n0J3J06
3515c76J28Q0R2J24J50R8M8O8Q2nn9r7p7j24j31j21q6q0q3o4jQJ5O7J42J49J00
3542D7R8J15Q6M8kRjm2r0j19j17j37j10r7q9j8LK5L5L7Q1J38J21J14J09J13P7
3569D34J3k6l1o3n7r6j07j17j10j12q3o9k7K8P7N2Q1Q3J30J02Q2Q7J08O8k7j9
$$ plain form
3595 401 355 264 158 37 -41 -122 -223 -314 -374 -401 -436 -404 -318 -215 -131 -34 90 204 268 296 361 414 404 338 274 220 102
3622 102 -19 -120 -218 -272 -342 -375 -357 -348 -324 -273 -147 -38 41 165 292 339 328 325 358 355 271 168 104 44 -98 -232 -301
3649 -301 -319 -367 -385 -348 -271 -206 -156 -78 36 141 221 302 383 389 336 322 279 199 92 22 -60 -131 -256 -330 -343 -336 -354 -333 -239
3678 -239 -120 -50 17 116 204 271 306 341 373 329 265 193 119 13 -102 -171 -224 -272 -330 -362 -333 -295 -262 -187 -78 47 130
3705 130 186 260 311 331 321 306 286 236 144 59 -46 -128 -212 -278 -315 -317 -299 -272 -237 -182 -108 -25 76 176 237 297 312 313 294
3734 294 239 190 122 60 -23 -121 -202 -253 -289 -337 -311 -268 -204 -149 -86 1 93 150 218 284 324 322 298 258 214 113 16 -46 -96 -161
3764 -161 -235 -278 -286 -284 -294 -246 -147 -40 -6 64 165 236 232 259 291 304 249 173 129 65 -36 -140 -200 -232 -264 -296 -286 -218 -218 -202
3794 -202 -108 5 84 139 211 274 307 283 252 256 222 136 43 -2 -59 -178 -243 -273 -270 -281 -270 -201 -138 -93 -35 44 130 185 229 266
$$ packed form
3595D01m6r1j06j21p8q1j01r1o0k7l5L2Q6J03Q4R7J24J14O4K8O5N3j0o6o4n4j18
3622A02j21j01r8n4p0l3J8RK4N1J26J09P9J24J27M7j1lL3lq4j03o4o0j42j34o9
3649c01j8m8j8L7P7O5N0P8J14J05Q0Q1Q1On3j4m3q0j07p0q2p1j25p4j3Pj8K1R4
3678b39J19P0O7R9Q8O7L5L5L2m4o4p2p4j06j15o9n3m8n8l2K9L8L3P5J09J25Q3
3705A30N6P4N1K0j0j5k0n0r2q5j05q2q4o6l7kJ8K7L5N5P4Q3J01J00O1O0J5Jj9
3734B94n5m9o8o2q3r8q1n1l6m8K6M3O4N5O3Q7R2N7O8O6M0kk4m0m4j01r7o2n0o5
3764a61p4m3qKj0M8R9J07L4P0J01P1mK7L2J3n5p6m4o4j01j04o0l2l2l2J0O8%J6
3794b02R4J13P9N5P2O3L3k4l1Ml4q6r3m5n7j19o5l0Lj1J1O9O3M5N8P9Q6N5M4L7
$$ plain form
3824 266 305 279 231 191 154 54 -22 -99 -126 -188 -259 -259 -282 -258 -209 -197 -122 9 56 107 171 234 221 275 271 273 197 130 63 -9
3854 -9 -86 -162 -218 -234 -245 -257 -256 -200 -169 -123 -43 23 134 202 233 202 261 254 228 185 129 70 8 -68 -155 -196 -240 -259 -261 -239 -197 -159
3886 -159 -111 -44 23 99 149 202 266 270 250 205 179 136 66 -2 -48 -94 -188 -217 -252 -217 -235 -217 -145 -78 -39 18 102 165 187 201
3916 201 239 265 222 158 124 88 0 -89 -129 -154 -189 -251 -251 -221 -193 -180 -120 -40 38 83 127 186 226 217 202 210 198 132 78 17 -42
3947 -42 -103 -173 -187 -203 -217 -227 -186 -132 -102 -62 -3 89 130 162 191 232 219 186 153 110 72 4 -51 -105 -144 -197 -230 -229 -210 -179 -167
3978 -167 -103 -50 6 49 123 175 196 215 230 223 192 135 92 23 -28 -76 -132 -150 -191 -211 -203 -185 -156 -105 -51 7 66 115 154 181 192
4009 192 195 183 170 124 70 20 -32 -101 -139 -170 -180 -206 -203 -145 -162 -119 -17 17 82 103 81 175 209 177 191 176 149 63 53 -38
4039 -38 -16 -138 -149 -181 -211 -201 -165 -155 -183 -12 -52 51 96 136 159 183 206 198 152 116 93 49 -18 -66 -94 -125 -159 -197 -167
$$ packed form
3824B66L9k6m8m0l7j00p6p7k7o2p1%k3K4M9J2P5J31M7N1O4O3j3N4mKp6o7o7p2
3854ip7p6n6j6j1j2JN6L1M6Q0O6J11O8L1l1N9pk6m3n6n9o2p6q7m1m4j9kK2M2L8
3886a59M8O7O7P6N0N3O4Mk0m5k6m3p0o8m6m6r4k9l5L5j8J8P2O7L9N7Q4O3K2J4
3916B01L8K6m3o4l4l6q8q9m0k5l5o2%L0K8J3O0Q0P8M5M4N9M0rj5Qj2o6n4o1n9
3947d2o1p0j4j6j4j0M1N4L0M0N9R2M1L2K9M1j3l3l3m3l8o8n5n4l9n3l3JJ9L1J2
3978a67O4N3N6M3P4N2K1J9J5pl1n7m3o9n1m8n6j8m1k0QJ8K9N1N4N8N9M9L9K7J1
4009A92Lj2j3m6n4n0n2o9l8l1j0k6LN8j7M3J02L4O5K1k2R4L4l2J4j5k7q6j0r1
4039c8K2j22j1l2l0J0L6J0k8J71m0J03M5M0K3K4K3qm6l6k3m4o7m8k8l1l4l8L0
$$ plain form
4068 -167 -153 -143 -130 -48 10 21 69 107 157 158 162 160 165 127 69 35 3 -50 -96 -113 -140 -133 -150 -149 -124 -85 -67 -31 25 83 100 132 148
4101 148 161 154 145 120 96 49 5 -55 -84 -125 -150 -160 -160 -159 -146 -86 -67 -30 1 53 103 134 138 168 142 150 137 97 65 17 -24 -60 -94
4134 -94 -122 -132 -138 -160 -115 -94 -49 -36 -3 51 81 137 138 147 169 161 115 89 78 20 -42 -59 -91 -107 -153 -140 -149 -129 -110 -96 -27 36 54
4167 54 84 101 132 106 118 121 95 110 51 9 -22 -81 -57 -64 -119 -103 -111 -108 -104 -53 -31 15 41 46 51 76 133 112 117 54 123 55 31 -22
4201 -22 -40 -76 -95 -101 -128 -106 -133 -85 -117 -61 -16 8 27 79 107 116 160 101 121 67 53 64 1 -4 -90 -33 -133 -130 -175 -69 -57
4232 -57 -101 -11 1 -14 27 69 107 100 61 75 97 95 58 19 -43 33 -65 -51 -71 -31 -144 -111 -91 -51 -53 -58 -27 -5 15 43 65 92
4264 92 93 51 106 91 57 5 3 -32 -23 -49 -77 -44 -43 -57 -62 -92 -30 -30 24 50 35 61 29 96 57 55 92 71 33 10 -10 -23 -28 -62
4298 -62 -79 -97 -27 -89 -51 -54 2 -15 17 6 52 76 101 89 52 110 32 108 54 -1 28 4 -33 -76 -44 -18 -68 -32 -35 -24 6
$$ packed form
4068a67J4J0J3Q2N8J1M8L8N0JMkNl8n8l4l2n3m6j7k7Pj7JK5L9J8L6N6N8J7L2J6
4101A48J3prk5k4m7m4o0k9m1k5j0%JJ3O0J9L7L1N2N0L1ML0k6Qj3m0l2m8m1l6l4
4134i4k8j0ok2M5K1M5J3L3N4L0N6JRK2qm6k6j1n8o2j7l2j6m6J3rK0J9J4O9O3J8
4167E4L0J7L1k6J2Lk6J5n9m2l1n9K4pn5J6qLMN1K2M6K6NNK5N7k1No3O9o8k4n3
4201b2j8l6j9ok7K2k7M8l2N6M5K4J9N2K8RM4n9K0n4j4J1o3nq6N7j00Lm5J06J2
4232e7m4R0J2j5M1M2L8pl9J4K2kl7l9o2P6r8J4k0M0j13L3K0M0knL1K2K0K8K2K7
4264I2Jm2N5j5l4n2kl5Rk6k8L3Jj4nl0O2%N4K6j5K6l2O7l9kL7k1l8k3k0j3nl4
4298f2j7j8P0o2L8lN6j7L2j1M6K4K5j2l7N8p8P6n4n5K9k4l7m3L2K6n0L6lJ1L0
$$ plain form
4329 6 69 -33 50 93 45 12 58 106 58 31 2 0 40 11 -62 -86 -77 -97 -126 -52 -80 -23 -18 -24 -70 9 -8 96 11 104 85 74
4361 74 29 -28 10 13 35 -49 -69 -81 -13 -63 -39 -42 -90 -63 -38 -33 21 12 6 39 -28 10 31 65 55 29 -38 32 -16 -89 -23 -86 -94
4394 -94 -22 -39 -32 -63 -57 -41 -9 17 56 58 71 69 137 -10 71 55 141 25 -63 -30 -13 -47 42 -82 9 -17 -35 31 -43 -37 -2
4425 -2 61 7 128 -24 1 21 135 33 61 30 -3 15 -53 -61 -85 -20 1 -43 -11 -121 -57 -35 4 -33 -60 5 53 52 49 35
4455 35 4 -6 -22 24 -30 52 -45 17 -84 -77 4 -80 -79 0 -61 -26 -31 -106 -33 68 5 24 -31 102 64 20 132 36 9 40
4485 40 -44 73 -95 -117 -65 -139 -130 -77 0 -67 40 5 69 76 -17 69 90 28 50 -26 58 73 33 5 22 13 90 -10 -45 2
4515 2 -51 -78 -18 -58 -8 26 -2 29 120 72 82 8 38 -25 53 34 -36 20 -10 -26 -21 -117 -100 -36 5 -130 -40 -18 -13 1 -49
4546 -49 24 27 14 56 23 21 82 -1 88 18 -49 -11 16 -78 -18 -36 -37 -72 -44 -104 -29 -35 87 74 78 116 49 0 -20 141 41
$$ packed form
4329FO3j02Q3M3m8l3M6M8m8k7k9kM0k9p3k4Rk0k9P4k8N7Nom6P9j7J04q5R3j9j1
4361G4m5n7L8LK2q4k0j2O8n0K4lm8K7K5NN4roL3o7L8K1L4j0k6o7P0m8p3O6o3q
4394i4P2j7Pl1OJ6L2K6L9KJ3kO8j47Q1j6Q6j16q8L3J7l4Q9j24R1k6j8O6p4OL5
4425bO3n4J21j52K5K0J14j02K8l1l3J8o8qk4O5K1m4L2j10O4K2L9l7k7O5M8jlj4
4455C5l1j0j6M6n4Q2r7O2j01PQ1q4JP9o1L5np5P3J01o3J9n5J33l8m4J12r6k7L1
4485D0q4J17j68k2N2p4RN3P7o7J07l5O4Pr3Q6K1o2K2p6Q4J5m0k8J7rP7j00l5M7
4515Bn3k7O0m0N0L4k8L1R1m8J0p4L0o3P8j9p0N6l0j6Nr6J7O4M1j35R0K2NJ4n0
4546d9P3Lj3M2l3kO1q3Q9p0o7L8K7r4O0j8jl5K8o0P5oJ22j3ML8o7m9k0J61j00
$$ plain form
4577 41 13 21 -7 25 -38 -28 -103 -95 -216 -124 -47 -72 -38 -58 42 0 58 34 112 -17 158 -39 71 26 15 -31 38 63
4605 63 -19 -52 -38 9 -66 -83 -88 -30 62 3 -34 60 88 49 22 63 115 78 78 0 -12 -30 -93 -39 -113 -60 -77 -86 -81 -108 -16 -41
4637 -41 -23 12 32 37 113 91 99 0 9 94 96 161 -25 29 -22 -60 -141 -73 -20 55 -75 -91 -126 -39 -38 73 71 51 59 164 69 44
4669 44 40 31 78 -49 45 4 -24 -53 -88 -70 -163 -62 -94 -55 -15 43 7 37 -13 22 116 61 48 112 39 61 -30 43 30 -78
4699 -78 9 -90 -76 -66 -114 -96 -108 -52 14 59 59 37 85 131 64 71 113 72 22 22 72 -11 -1 -183 -67 -169 -168 -63 -141 -96
4729 -96 -43 -91 -65 26 31 76 120 170 104 142 124 132 38 46 38 -110 -118 -95 -82 -151 -46 -222 -37 -64 -30 7 -20 19 23 127 96
4760 96 144 99 86 74 51 96 -89 -9 -73 -65 -137 -183 -123 -75 -82 -68 -4 4 58 57 89 103 136 159 62 82 175 180 35 27 19 -69 -47
4793 -47 -143 -99 -132 -118 -87 -58 -4 -28 39 95 125 85 74 103 94 82 126 43 4 62 -36 -119 -124 -141 -145 -162 -107 -88 16 -66 -35
$$ packed form
4577D1k8Qk8L2o3J0p5Qj21R2P7k5L4k0J00m2N8k4P8j29J75j97J10m5j1m6O9K5
4605F3q2l3J4M7p5j7nN8R2n9l7R4K8l9k7M1N2l7%p8j2j8o3N4p4N3j7rNk7R2k5
4637d1J8L5K0NP6k2Qr9RQ5KO5j86N4n1l8q1O8N3P5j30j6l5Q7JJ11kk0QJ05r5k5
4669D4mrM7j27R4m1k8k9l5J8r3J01l2L9M0N8l6L0n0L5R4n5j3O4p3K2r1P3j3j08
4699g8Q7r9J4J0m8J8j2N6O6M5%k2M8M6o7PM2m1n0%N0q3J0j82J16j02JJ05p8M5
4729i6N3m8K6R1NM5M4N0o6L8j8Qr4Qqj48qK3J3o9J05j76J85k7L4L7k7L9MJ04l1
4760I6M8m5j3j2k3M5j85Q0o4Qp2m6O0M8pJ4O4QN4jL2J4L3K3r7K0R3Nj45qqq8K2
4793d7r6M4l3J4L1K9N4k4O7N6L0m0j1K9rj2M4q3l9N8r8q3nj7mj7N5J9J04q2L1
$$ plain form
4824 -35 1 31 44 121 135 126 169 69 55 51 44 -4 -28 -38 -59 -84 -84 -130 -109 -83 -111 -66 -21 14 -25 11 104 138 102 173 139 185
4856 185 80 5 -16 -69 -55 -103 -54 -110 -93 -120 -139 -97 -52 -21 52 87 67 137 119 120 66 109 107 151 95 74 24 -39 -149 -70
4886 -70 -125 -108 -112 -82 -92 -75 -19 -44 63 40 141 111 148 185 85 60 129 27 2 20 -113 -92 -146 -174 -128 -136 -85 -78 -73 -70
4916 -70 40 -21 0 133 158 131 171 117 129 115 16 80 -7 -13 -63 -60 -137 -165 -227 -138 -109 -90 -55 33 61 62 94 122 122 131 179 193
4948 193 120 69 41 -15 27 -113 -195 -185 -126 -161 -131 -108 -99 -119 -81 9 83 159 89 216 145 64 84 129 171 116 53 -60 -67
4977 -67 -127 -103 -156 -122 -130 -110 -134 -71 16 7 83 114 123 141 153 163 90 54 75 20 25 10 -89 -130 -196 -117 -56 -161 -114 -134 -58 -36
5009 -36 16 36 94 173 142 141 158 105 154 91 20 79 -2 -29 -33 -65 -90 -149 -143 -124 -78 -100 -36 65 123 83 119 71 134 146 146 139
5041 139 84 54 8 -12 -94 -138 -234 -124 -131 -50 -128 -136 -87 -41 -73 -35 93 166 139 165 87 166 74 111 80 22 24 -80 -168 -77
$$ packed form
4824c5L6L0J3P7J4rM3j00j4mpm8k4j0k1k5%m6K1K6k8M5M5L5l9L6R3L4l6P1l4M6
4856A85j05p5k1n3J4m8M9n6J7k7j9M2M5L1P3L5k0P0j8Jn4M3kM4n6k1n0o3j10P9
4886g0n5J7mL0j0J7N6k5J07k3J01l0L7L7j00k5O9j02k5J8j33K1n4k8M6qN1PNL
4916g0J10o1K1J33K5k7M0n4J2j4r9O4q7on0Lp7k8o2Q9K9J9L5Q8K8JL2K8%RM8J4
4948A93p3n1k8n6M2j40q2J0N9l5L0K3Rk0L8R0P4P6p0J27p1q1K0M5M2n5o3j13p
4977f7o0K4n3L4qK0k4O3Q7rP6L1RJ8J2J0p3l6K1n5Nj5r9m1o6P9O1j05M7k0P6K2
5009c6N2K0N8P9l1jJ7n3M9o3p1N9q1k7ml2k5n9OJ9M6k2O4J01N8m0L6m8O3J2%p
5041A39n5l0m6k0q2m4r6J10pQ1p8qM9M6l2L8J28P3k7K6p8P9r2L7l1n8Kj04q8R1
$$ plain form
5071 -77 -136 -197 -170 -103 -92 -36 -90 -37 68 89 113 90 149 158 236 119 36 -45 -90 -19 -114 -58 -258 -133 -129 -166 -193 -77 -106
5100 -106 -35 78 61 12 141 154 153 181 105 176 187 70 44 -16 16 -121 -90 -86 -176 -119 -55 -47 -126 -95 -41 -49 62 200 156
5129 156 152 189 167 186 115 40 -57 14 -96 -119 -106 -179 -215 -136 -199 -211 -202 -34 -6 44 58 55 187 129 165 101 104 150 55 23
5159 23 77 -4 -59 -44 -135 -135 -162 -166 -96 -19 -36 -71 35 16 63 90 48 199 195 92 130 45 99 -20 -33 -130 -187 -117 -82 -137
5189 -137 -184 -117 -119 -105 -86 -33 53 52 118 123 157 89 47 146 132 75 70 -33 -58 -120 -95 -86 -178 -31 -88 -47 -87 -127 -30 -17 78
5220 78 141 187 60 143 114 141 100 60 5 -25 3 -39 -204 -130 -205 -163 -181 -83 -70 -9 -14 -16 105 113 118 143 148 151 123 109 66 38
5252 38 -19 -66 -82 -91 -119 -179 -208 -136 -106 -62 -31 54 73 94 37 123 123 106 144 77 118 138 62 9 -46 -113 -108 -141 -140 -171 -137 -96
5284 -96 -120 -89 -43 9 31 72 121 126 140 117 105 74 117 128 -23 -36 -79 -93 -124 -127 -127 -166 -167 -48 -103 -55 31 91 91 123 117 180
$$ packed form
5071g7n9o1K7O7J1N6n4N3J05K1K4k3N9RP8j17q3q1m5P1r5N6k00J25Ml7k7J16k9
5100a06P1J13j7m9J29J3jK8p6P1J1j17k6o0L2j37L1Mr0N7O4Qp9L1N4qJ11J38m4
5129A56mL7k2J9p1p5r7P1j10k3J3p3l6P9o3j2RJ68K8N0J4lJ32n8L6o4LM6r5l2
5159B3N4q1n5J5r1%k7mP0P7j7l5J06j9M7K7m2J51mj03L8q5N4j19j3r7n7P0L5n5
5189a37m7O7kJ4J9N3Q6jO6NL4o8m2R9j4n7nj03k5o2K5Rr2J47n7M1m0m0R7J3R5
5220G8O3M6j27Q3k9K7m1m0n5l0K8m2j65P4p5M2j8R8J3O1nkJ21QNK5NLk8j4m3k8
5252C8n7m7j6rk8o0k9P2L0M4L1Q5J9K1n7Q6%j7L8o7M1K0p6n3n5o7Nl3Jl1L4M1
5284i6k4L1M6N2K2M1M9NJ4k3j2l1M3J1j51j3m3j4l1l%l9jJ19n5M8Q6O0%L2oO3
$$ plain form
5316 180 195 155 84 68 31 12 -36 -30 -29 -57 -119 -106 -163 -123 -91 -84 -3 22 53 78 108 102 91 111 134 91 49 -4 2 -27 -72 -75 -57
5349 -57 -107 -118 -83 -71 -47 -152 54 34 45 36 83 127 176 108 84 65 45 70 48 -29 -51 -74 -143 -133 -124 -144 -98 -112 -140 -63
5379 -63 -27 36 22 101 112 141 164 105 59 58 61 82 -3 -48 -59 -62 -149 -123 -136 -109 -83 -71 -32 0 29 24 57 84 159 122 148 82
5411 82 100 18 77 -18 -91 -73 -88 -58 -108 -127 -127 -142 -66 -28 3 13 -10 68 105 122 129 104 110 114 55 47 20 -16 -49 -177 -132 -107
5443 -107 -57 -141 -147 -82 -69 -1 14 83 60 164 106 99 153 106 96 115 9 37 -48 -60 -97 -142 -122 -105 -117 -126 -120 -91 -25 42 92
5474 92 42 97 116 93 126 136 80 57 55 37 -15 -42 -42 -138 -81 -77 -106 -85 -37 -47 -26 2 46 59 65 110 125 148 142 73 98 55 34
5507 34 -10 -34 -61 -131 -101 -94 -98 -128 -138 -95 57 -37 80 102 82 126 83 75 91 160 104 -13 76 -8 -1 -92 -92 -96 -100 -68 -126 -119 -98
5540 -98 -32 48 7 14 73 101 144 66 91 58 75 78 72 -10 27 -77 -38 -74 -136 -174 -136 -124 -91 -91 -43 -43 -2 36 120 130 159 139
$$ packed form
5316A80J5m0p1j6l7j9m8OJk8o2J3n7M0L2PQ1K5L1K5L0oj1K0K3m3m2n3Ok9m5lJ8
5349e7n0j1L5J2K4j05K06k0J1rM7M4M9o8k4j9k0K5k2p7k2k3o9J0Rk0M6j4k8P7
5379f3L6O3j4P9J1K9K3n9m6jLK1q5m5j1lq7K6j3K7K6J2L9L2K9nL3K7P5l7K6o6
5411H2J8q2N9r5p3J8j5L0n0j9%j5P6L8L1J0k3P8L7J7Pk5OMn9qk7l6l3j28M5K5
5443a07N0q4oO5J3O8J5O9k3J04n8pN4m7j0J9j06K8q5j2l7m5K0J7j2rOK9O6O7N0
5474I2n0N5J9k3L3J0n6k3kj8n2k7%r6N7Mk9K1M8j0K1K8M4J3OM5J5K3oo9K5m3k1
5507C4m4k4k7p0L0Pml0j0M3J52r4J17K2k0M4m3qJ6O9n6j17Q9q4Pr1%mmL2n8PK1
5540i8O6Q0m1PN9K8M3p8K5l3J7Loq2L7j04L9l6o2l8L8J2L3%M8%M1L8Q4J0K9k0
$$ plain form
5572 139 105 -13 72 26 -16 11 4 -63 -85 -119 -123 -132 -52 -90 -25 71 67 69 96 111 115 93 150 162 131 34 25 52 -83 -97 -77 -76 -116
5605 -116 -33 -93 -124 -76 -67 -8 33 -7 -6 29 105 104 177 84 26 81 106 51 33 -62 -78 -83 -158 -132 -111 -72 -101 -90 -53 3 -36 52
5637 52 75 99 136 98 79 123 84 27 48 3 -34 -39 -66 -164 -124 -121 -123 -97 -66 -39 5 39 70 61 102 90 102 80 68 106 36 -1
5669 -1 8 -26 -48 -67 -112 -100 -98 -119 -91 -70 -48 -52 -6 43 85 94 69 129 108 96 100 65 29 17 -6 -47 -78 -145 -153 -110 -128 -108 -82 -75
5703 -75 -37 -16 44 73 82 82 110 70 90 92 38 34 15 -7 -26 -64 -85 -76 -115 -108 -94 -105 -62 -15 -15 19 60 78 87 103 100 102 88 77 62
5738 62 32 -2 -23 -56 -76 -91 -95 -111 -106 -84 -68 -46 -1 3 30 67 77 82 100 95 84 59 53 38 -1 -36 -51 -89 -89 -99 -93 -91 -97 -67 -47
5773 -47 -16 11 37 61 86 97 108 112 105 86 70 46 28 -12 -32 -66 -79 -99 -106 -110 -105 -76 -64 -35 -9 17 32 67 70 92 90 89 76 54
5807 54 39 20 -9 -36 -67 -81 -84 -92 -99 -93 -66 -45 -38 -5 12 46 74 78 102 110 107 91 96 71 45 14 -18 -36 -79 -56 -87 -108 -90 -85 -62
$$ packed form
5572A39l4j18Q5m6m2K7po7k2l4mrQ0l8O5R6mKK7J5Mk2N7J2l1r7rK7j35j4K0Jm0
5605a16Q3o0l1M8RN9M1m0JL5P6jP3r3n8N5K5n5j8r5j6np5K6K1L9k9J1L7N6l9Q8
5637E2K3K4L7l8j9M4l9n7K1m5l7nk7r8M0LkK6L1K7M4L4L1rM1j2J2k2j2L8p0l7
5669aRl4k2j9m5J2Kk1K8K1K2mM6M9M2Rk5O0k1j2Ml5l6j2k3m1l1o7qM3j8K0K6P
5703g5L8K1O0K9R%K8m0K0Kn4mj9k2j9l8k1Rl9PJ4j1M3M7%L4M1J8RJ6lKj4j1j5
5738F2l0l4k1l3k0j5mj6NK2J6K2M5MK7L7J0NJ8nj1k5oj5l9l5j5l8%j0OKoL0K0
5773d7L1K7K6K4K5J1J1Mpj9j6k4j8m0k0l4j3k0pmNK9J2K9K6K6J5L5LK2kjj3k2
5807E4j5j9k9k7l1j4lqpOK7K1PL3J7L4K8MK4Qlj6Nk5k6l1l2j8m3K3l1k1J8NK3
$$ plain form
5842 -62 -54 -29 2 33 53 63 79 92 92 80 80 62 36 12 -14 -31 -51 -81 -89 -99 -81 -85 -73 -50 -19 -7 29 43 78 87 96 98 92 81 69
5877 69 42 15 -1 -28 -51 -62 -85 -86 -90 -91 -74 -66 -34 -9 10 32 49 80 84 90 88 80 66 46 36 6 -19 -53 -66 -74 -85 -88 -86 -66 -57 -39
5913 -39 -11 24 44 53 70 86 77 89 88 73 68 39 16 -5 -34 -48 -68 -84 -83 -85 -70 -62 -44 -24 2 26 47 60 81 90 82 86 68 62 35 11
5949 11 -10 -33 -55 -65 -81 -85 -89 -74 -66 -43 -27 9 28 40 69 87 88 94 96 81 63 45 24 -2 -20 -44 -49 -71 -78 -77 -80 -61 -54 -29 -5 10
5985 10 43 49 71 81 81 78 74 60 47 29 2 -15 -43 -60 -73 -80 -68 -85 -72 -46 -37 -17 16 32 67 74 81 103 97 72 65 56 44 19 -6 -36
6021 -36 -63 -64 -83 -88 -81 -69 -73 -29 -14 -14 19 35 54 69 82 85 70 78 38 27 17 -12 -28 -37 -71 -70 -84 -77 -79 -62 -48 -22 6 25 45 81
6057 81 85 77 98 101 71 70 50 38 8 -34 -58 -54 -79 -66 -81 -74 -58 -51 -31 -4 20 47 62 78 77 86 78 74 61 36 22 -1 -18 -57 -64 -86
6093 -86 -88 -81 -75 -67 -55 -29 3 13 39 57 76 91 95 106 82 68 45 29 5 -19 -38 -53 -70 -76 -82 -89 -78 -50 -28 -2 13 31 55 73
$$ packed form
5842f2QK5L1L1K0J0J6J3%j2%j8k6k4k6j7k0l0qj0J8mJ2K3L1J2L6J4L5RRKoj1j2
5877F9k7k7j6k7k3j1k3jmjJ7QL2K5J9K2J7L1MOkqj4k0j0l0k5l4j3qj1lKK0RJ8
5913c9K8L5K0RJ7J6rJ2jj5nk9k3k1k9j4k0j6JkJ5QJ8K0K6K4K1J3K1RqMj8ok7k4
5949A1k1k3k2j0j6mmJ5QK3J6L6J9J2K9J8JOKj5j8j8k1k6j8k4nk2pJlJ9PK5K4J5
5985A0L3OK2J0%lmj4j3j8k7j7k8j7j3pJ2j7J3K6RK0L3J6L5PPK2ok5prj2k5k5l0
6021c6k7jj9nPJ2mM4J5%L3J6J9J5J3Lj5Qm0j1j0k9j6rl4Jj4PkJ7J4K6K8J9K0L6
6057H1MqK1Ll0jk0j2l0m2k4Mk5J3j5PJ6PK0K7K4K7J5J6jRqmj3k5j4k3j7l9pk2
6093h6kPOQJ2K6L2J0K6J8J9J5MJ1k4j4k3j6k4k4j9j5j7oopJ1K8K2K6J5J8K4J8
$$ plain form
6127 73 76 71 82 86 68 44 30 1 -21 -45 -58 -69 -83 -94 -88 -83 -66 -33 -24 19 37 48 79 85 99 90 88 86 80 61 27 -31 -46 -68 -131 -83
6163 -83 -114 -104 -48 -91 -65 -8 -31 59 36 90 82 108 72 69 34 90 23 -52 -4 -25 -16 -59 -80 -140 -95 -75 -102 -17 -24 -17 27 6 33
6196 33 30 105 136 77 28 100 143 36 49 -17 6 -88 -43 -52 -137 -115 -37 -17 -59 36 23 15 33 12 30 110 24 62 79 24 32 10
6228 10 10 -59 -83 -81 -48 -82 -83 -92 -82 -46 -40 27 51 48 76 93 89 80 87 78 73 59 25 -9 -22 -46 -79 -95 -77 -91 -88 -62 -45 -32 -6 17
6264 17 40 70 87 108 107 88 75 56 33 16 -10 -28 -58 -78 -113 -106 -98 -91 -79 -46 -22 15 21 45 74 80 109 110 100 104 85 55 12 -11
6298 -11 -25 -51 -72 -86 -97 -107 -91 -95 -81 -41 1 34 46 70 81 91 106 94 89 99 62 35 -6 -38 -66 -80 -87 -105 -97 -99 -79 -64 -48
6331 -48 -15 19 56 76 100 98 101 99 95 79 75 52 15 -5 -44 -76 -101 -114 -110 -102 -100 -69 -44 -30 6 22 58 88 97 110 112 96 67 48 29
6366 29 18 -16 -45 -76 -84 -111 -124 -113 -107 -70 -54 -14 14 35 69 87 97 96 123 120 105 75 49 21 -23 -30 -63 -83 -87 -96 -111 -106 -89 -66
$$ packed form
6127G3LnJ1Mj8k4j4k9k2k4j3j1j4j1ONJ7L3RM3J8J1L1OJ4rkkoj9l4n8j5k2o3M8
6163h3l1J0N6m3K6N7k3R0k3N4qK6l6ll5N6o7p5M8k1Rm3k1o0M5K0k7Q5pPM4k1K7
6196C3lP5L1n9m9P2M3j07J3o6K3r4M5rq5K2P8K0m2R5j3qJ8k1J8Q0q6L8J7n5Qk2
6228A0%o9k4KL3l4jrJ0L6OO7K4lK8J7mrPrnj4l4l4j3k4l3j6J8j4LK6J7J3K6K3
6264A7K3L0J7K1jj9j3j9k3j7k6j8l0k0l5PQPJ2L3K4L7OK4K9OK9Jj0Mj9l0m3k3
6298a1j4k6k1j4j1j0J6mJ4M0M2L3J2K4J1J0J5j2nJ0l7k7m1l2k8j4pj8QkK0J5J6
6331d8L3L4L7K0K4kLkmj6mk3l7k0l9l2k5j3MQKL1K5J4L6J6L6L0RJ3Kj6k9j9j9
6366B9j1l4k9l1qk7j3J1OL7J6M0K8K1L4J8J0jK7lj5l0k6k8m4pl3k0mrj5NJ7K3
$$ plain form
6400 -66 -33 5 28 56 92 99 103 100 104 90 82 56 25 -16 -44 -80 -96 -107 -116 -117 -105 -80 -61 -39 1 33 65 84 101 128 115 108 84 86 58
6435 58 38 -6 -20 -45 -87 -95 -113 -113 -100 -85 -65 -46 -12 17 40 61 85 98 122 123 102 74 58 34 5 -34 -72 -86 -97 -117 -127 -125
6467 -125 -113 -82 -58 -25 22 56 81 111 104 124 122 124 105 79 52 20 -15 -57 -82 -99 -97 -106 -99 -110 -72 -54 -36 -7 33 73 92 114 119
6500 119 114 111 102 70 46 25 -20 -43 -84 -118 -126 -132 -127 -107 -92 -50 -32 -7 27 61 106 124 137 138 139 112 90 52 19 -12 -32 -53 -76 -103
6534 -103 -117 -110 -122 -106 -69 -37 2 21 45 87 104 116 110 118 114 94 64 28 -4 -60 -75 -85 -101 -122 -126 -118 -109 -96 -62 -30 19 64 102
6567 102 113 130 137 133 119 111 98 60 24 -32 -69 -93 -125 -130 -125 -111 -95 -81 -58 -18 3 46 76 104 119 141 136 106 83 61 46 18 -4
6600 -4 -54 -80 -105 -120 -136 -125 -112 -88 -56 -23 -4 25 62 92 102 123 138 140 125 80 52 23 -12 -54 -79 -90 -103 -126 -129 -125 -110 -69
6632 -69 -18 4 44 80 112 128 115 127 127 124 97 47 15 -19 -52 -98 -121 -110 -110 -115 -118 -116 -70 -41 -21 35 53 96 130 132 125 124 107 88 68
$$ packed form
6400f6L3L8K3K8L6PMlMj4qk6l1m1k8l6j6j1rjJ2K5J9K2M0L2L2J9J7K7j3pk4Kk8
6435E8k0m4j4k5m2qj8%J3J5K0J9L4K9K3K1K4J3K4Jk1k8j6k4k9l9l8j4j1k0j0K
6467a25J2L1K4L3M7L4K5L0pK0kKj9k6k7l2l5m2k5j7KrPj1L8J8J8K9M0M0J9K2N
6500A19nlrl2k4k1m5k3m1l4qoNK0J5M2J8K5L4L4M5J8J3JJk7k2l8l3l1k0k1k3k7
6534a03j4Pj2J6L7L2L9J9K4M2J7J2oQmk0l0l6l2n6j5j0j6k1mQRJ3L4L2M9M5L8
6567A02J1J7Pmj4qj3l8l6n6l7k4l2nNJ4J6J4K3M0K1M3L0K8J5K2nl0k3k2j5k8k2
6600dn0k6k5j5j6J1J3K4L2L3J9K9L7L0J0K1J5Kj5m5k8k9l5m2k5j1j3k3lMJ5M1
6632f9N1K2M0L6L2J6j3J2%lk7n0l2l4l3m6k3J1%nlKM6K9K0N6J8M3L4Kpjj7j9k0
$$ plain form
6667 68 41 0 -31 -58 -86 -123 -137 -111 -100 -99 -67 -49 -5 26 43 80 102 134 143 132 101 80 59 27 -15 -38 -65 -88 -120 -140 -144 -132
6699 -132 -112 -88 -43 -7 29 55 59 100 126 142 140 120 104 85 46 4 -30 -73 -90 -99 -109 -128 -130 -107 -88 -47 -34 19 59 97 108 109
6731 109 132 112 117 104 71 45 7 -31 -77 -111 -131 -126 -138 -120 -106 -87 -53 -30 -5 36 82 104 121 131 145 120 104 72 38 12 -10
6762 -10 -35 -72 -101 -136 -130 -127 -106 -90 -49 -20 8 28 59 89 122 132 129 121 108 75 39 0 -27 -49 -85 -112 -130 -135 -141 -127 -101 -77 -37
6795 -37 10 45 86 94 117 130 127 111 104 98 65 12 -39 -64 -93 -114 -128 -124 -121 -106 -87 -74 -36 6 42 79 100 117 130 133 115 81 60 49
6829 49 38 -32 -63 -92 -113 -151 -142 -130 -121 -88 -56 -32 -8 28 73 93 120 134 134 137 105 78 47 15 -10 -41 -78 -108 -94 -127 -143 -122
6861 -122 -105 -69 -36 9 36 68 83 102 130 129 138 128 92 56 11 -23 -61 -86 -123 -122 -137 -134 -138 -124 -89 -50 -22 16 69 89 117 132
6893 132 122 122 110 91 79 38 -2 -39 -66 -102 -127 -141 -121 -108 -100 -88 -35 -7 11 62 87 115 133 148 127 115 89 50 26 -4 -38
$$ packed form
6667F8k7m1l1k7k8l7j4K6J1JL2J8M4L1J7L7K2L2Rj1l1k1k1l2m2k3k7k3l2k0mJ2
6699a32K0K4M5L6L6K6MM1K6J6kk0j6j9l9m2l4m3j7rj0j9kK3J9M1J3N3M0L8J1J
6731A09K3k0Nj3l3k6l8l8m6l4k0Nj2J8J4J9L4K3K5M1M6K2J7J0J4k5j6l2l4k6k2
6762a0k5l7k9l5OLK1J6M1K9K8K0L1L0L3J0lqj3l3l6l9k7k2l6k7j8noJ4K6K4M0
6795c7M7L5M1QK3J3lj6pol3n3n1k5k9k1j4MLJ5J9J3L8M2L6L7K1J7J3Lj8l4k1j1
6829D9j1p0l1k9k1l8RJ2RL3L2K4K4L6M5K0K7J4%Ll2k7l1l2k5l1l7l0J4l3j6K1
6861a22J7L6L3M5K7L2J5J9K8jRj0l6l6m5l4l8k5l7Jj5LmJ4L5L9K8L8N3K0K8J5
6893A32j0%j2j9j2m1m0l7k7l6k5j4K0J3QJ2N3K8J8N1K5K8J8J5k1j2k6l9k4l0l4
$$ plain form
6924 -38 -63 -95 -113 -135 -144 -143 -114 -93 -58 -23 24 44 72 95 118 141 130 118 109 66 31 -6 -47 -71 -90 -102 -102 -131 -127 -115 -83 -53 -16
6957 -16 8 57 84 91 105 109 108 110 91 60 40 9 -30 -66 -109 -121 -119 -119 -125 -114 -86 -65 -34 5 21 68 113 114 123 115 105 89 66 34 -2
6992 -2 -4 -57 -86 -103 -126 -129 -120 -108 -77 -48 -19 0 40 75 80 125 131 131 123 101 65 33 -9 -26 -79 -85 -110 -135 -143 -130 -126 -125 -70 -35 15 26
7028 26 63 96 98 126 135 117 114 91 64 17 -22 -48 -79 -97 -116 -122 -119 -111 -96 -71 -43 -4 40 63 92 106 130 123 128 92 80 57 19 -4
7062 -4 -41 -78 -99 -117 -123 -130 -111 -98 -83 -55 -29 4 42 70 103 121 127 133 108 99 61 43 -2 -27 -69 -97 -110 -113 -115 -126 -103 -85 -47 -8
7096 -8 20 42 67 99 117 129 127 118 87 70 27 6 -24 -67 -83 -102 -117 -126 -109 -109 -84 -64 -31 8 27 68 92 108 114 116 106 98 71 52
7130 52 26 -7 -47 -73 -93 -112 -117 -107 -96 -86 -62 -31 1 31 66 96 107 117 121 112 101 79 42 10 -7 -49 -83 -106 -118 -121 -139 -125
7162 -125 -96 -75 -46 -13 22 59 61 103 109 107 114 104 91 71 27 -3 -41 -61 -91 -106 -99 -133 -115 -93 -76 -43 -12 16 43 77 102 116
$$ packed form
6924c8k5l2j8k2rJK9K1L5L5M7K0K8K3K3K3j1j2rm3l5l7m1k4j9j2%k9MJ2L2L0L7
6957a6K4M9K7PJ4MjKj9l1k0l1l9l6m3j2K%oJ1K8K1L1L9J6M7M5JRqj0j6k3l2l6
6992bkn3k9j7k3lRJ2L1K9K9J9M0L5NM5O%qk2l6l2m2j7n3ok5k5qJ3MJN5L5N0J1
7028B6L7L3KK8Rj8lk3k7m7l9k6l1j8j9oLQJ5K5K8L9M4K3K9J4K4pNl6j2k3l8k3
7062dl7l7k1j8opJ9J3J5K8K6L3L8K8L3J8OOk5rl8j8m5k5m2k8j3lkj1K3J8L8L9
7096hK8K2K5L2J8J2krl1j7m3k1l0m3j6j9j5rJ7%K5K0L3L9J9M1K4J6OKj0qk7j9
7130E2k6l3m0k6k0j9nJ0J1J0K4L1L2L0L5L0J1J0Mrj1k2l7l2j7m2l4k3j2lj8J4
7162a25K9K1K9L3L5L7KM2OkPj0j3k0m4l0l8k0l0j5Pl4J8K2J7L3L1K8K7L4K5J4
$$ plain form
7194 116 132 121 115 89 66 41 -1 -36 -62 -90 -115 -128 -126 -111 -98 -89 -55 -29 -6 38 76 92 105 115 112 104 89 56 42 27 -23 -49
7226 -49 -81 -85 -113 -115 -108 -105 -69 -59 -26 -13 20 43 84 113 116 124 119 108 74 55 19 -15 -37 -69 -99 -126 -121 -138 -116 -99 -79 -41 -5 21
7260 21 44 68 101 109 115 118 99 96 58 23 1 -38 -51 -77 -100 -108 -103 -110 -99 -80 -40 -5 22 41 73 97 103 94 104 104 90 78 49 5 -28
7295 -28 -55 -85 -103 -116 -120 -118 -113 -94 -71 -43 -2 33 61 90 104 110 115 96 86 65 42 10 -15 -52 -67 -90 -115 -129 -119 -94 -82 -61 -46
7328 -46 -8 18 54 66 100 112 106 97 105 73 43 23 -17 -22 -56 -95 -126 -119 -120 -115 -105 -75 -42 -28 24 41 68 86 90 106 113 107 93 54 31
7363 31 -13 -41 -59 -82 -117 -107 -114 -120 -94 -73 -48 -24 19 33 71 86 103 120 116 101 91 64 37 24 -22 -50 -71 -93 -114 -131 -128 -112
7395 -112 -97 -80 -45 -8 25 45 72 108 108 108 105 89 70 51 30 -18 -44 -65 -93 -109 -113 -114 -103 -91 -62 -45 -7 13 45 80 84 123 120
7428 120 121 95 76 46 25 -9 -16 -51 -83 -102 -120 -113 -111 -98 -67 -57 -16 6 29 61 75 100 109 111 89 75 57 42 -2 -28 -50 -88 -101
$$ packed form
7194A16J6j1ok6k3k5m2l5k6k8k5j3KJ5J3RL4K6K3M4L8J6J3J0lqj5l3j4j5n0k6
7226d9l2mk8kPLL6J0L3J3L3K3M1K9LQnj1l4j9l6l4k2l2l0k7Nj7K2J7K0L8L6K6
7260B1K3K4L3QOLj9ll8l5k2l9j3k6k3qNpJ1J9M0L5K7J9L2K4OrJ0%j4j2k9m4l3
7295b8k7l0j8j3mKNJ9K3K8M1L5K8K9J4ONj9j0k1k3l2k5l7j5k3k5j4J0K5J2K1J5
7328d6L8K6L6J2L4J2orQl2l0k0m0nl4l9l1PjNJ0L0L3J4N2J7K7J8MJ6Poj4l9k3
7363C1m4k8j8k3l5J0poK6K1K5K4M3J4L8J5J7J7mj5j0k7k7j3m6k8k1k2k1j7LJ6
7395a12J5J7L5L7L3K0K7L6%%lj6j9j9k1m8k6k1k8j6mjJ1J2K9J7L8K0L2L5ML9l
7428A20Jk6j9l0k1l4pl5l2j9j8PKJ3L1J0M1K2K3L2J4K5RKk2j4j8j5m4k6k2l8j3
$$ plain form
7461 -101 -120 -125 -128 -108 -77 -48 -18 -2 39 72 87 102 108 107 98 84 67 38 4 -23 -43 -78 -91 -109 -116 -122 -94 -90 -63 -33 -9 24 46 68
7495 68 99 117 112 102 96 77 44 24 -9 -27 -73 -89 -100 -114 -105 -110 -86 -64 -39 -6 24 63 84 99 114 117 109 80 78 53 29 -12 -42 -64
7529 -64 -92 -113 -130 -120 -115 -97 -78 -50 -18 13 38 73 91 111 114 116 100 78 58 23 0 -36 -58 -96 -96 -119 -119 -109 -96 -80 -46 -15 21
7562 21 40 74 96 113 124 110 108 73 62 27 -3 -40 -51 -100 -103 -121 -127 -117 -107 -80 -57 -26 7 27 59 91 108 102 107 109 92 70 42
7595 42 -1 -20 -50 -84 -106 -124 -125 -119 -106 -89 -57 -25 -3 44 73 96 117 120 136 121 104 83 49 25 -22 -47 -78 -109 -127 -132 -127 -110 -91
7628 -91 -70 -39 -9 20 55 84 105 113 119 113 99 76 47 18 -6 -49 -73 -91 -108 -125 -129 -113 -102 -73 -45 -5 22 59 91 102 122 126 122
7661 122 116 93 69 20 -16 -37 -77 -106 -122 -131 -137 -114 -98 -80 -49 -18 25 52 78 100 118 123 111 101 87 64 30 -9 -31 -66 -91 -112
7693 -112 -117 -126 -112 -88 -79 -44 -9 23 38 95 122 125 125 146 117 98 72 31 25 -36 -53 -80 -111 -128 -147 -127 -98 -89 -68 -25 -3 40 72
$$ packed form
7461a01j9nlK0L1K9L0J6M1L3J5J5Ojrj4j7k9l4k7k0l5j3j8poK8MK7L0K4L3K2K2
7495F8L1J8nj0oj9l3k0l3j8m6j6j1j4RnK4K2K5L3L0L9K1J5J5Lqk9kk5k4m1l0k2
7529f4k8k1j7J0NJ8J9K8L2L1K5L5J8K0LKj6k2k0l5k3l6k2l8%k3%J0J3J6L4L1L6
7562B1J9L4K2J7J1j4kl5j1l5l0l7j1m9lj8oJ0J0K7K3L1L3K0L2L2J7oNKj7k2k8
7595D2m3j9l0l4k2j8jOJ3J7L2L2K2M7K9K3K1LJ6j5j7k1l4k4m7k5l1l1j8nNJ7J9
7628i1K1L1L0K9L5K9K1QOoj4k3k9k9k4m3k4j8j7j7mJ6J1K9K8M0K7L7L2J1K0Mm
7661A22ok3k4m9l6k1m0k9j6roK3J6J8L1L1M3K7K6K2J8Nj2j0j4k3l4l9k2l5k5k1
7693a12nrJ4K4RL5L5L2J5N7K7L%K1k9j9k6m1oo1j7k7l1j7j9K0K9RK1M3K2M3L2
$$ plain form
7726 72 99 128 129 125 119 111 75 41 11 -33 -65 -94 -119 -118 -127 -129 -118 -82 -43 -27 15 42 67 101 124 135 138 129 109 93 64 20 -13 -54 -93
7761 -93 -110 -122 -144 -143 -127 -97 -70 -47 -19 31 58 92 114 118 127 123 105 81 51 25 -16 -41 -82 -122 -123 -138 -144 -129 -108 -77 -34 -11 25
7794 25 58 95 112 131 129 141 127 98 61 32 -6 -45 -87 -105 -126 -156 -142 -137 -118 -87 -68 -36 21 52 85 125 126 138 133 132 114 64 42
7827 42 -10 -47 -78 -103 -132 -139 -136 -129 -99 -79 -50 -11 25 61 91 125 134 135 139 125 104 68 42 13 -25 -68 -89 -108 -148 -135 -131 -121 -102 -59
7861 -59 -34 14 47 81 104 124 136 140 135 107 90 39 9 -32 -77 -101 -121 -148 -140 -141 -132 -108 -76 -34 6 54 66 118 123 150 139 138 125 90
7895 90 61 15 -23 -62 -85 -133 -134 -140 -153 -140 -103 -75 -37 -5 31 82 115 131 147 140 137 117 92 59 17 -25 -59 -91 -125 -145 -146 -146 -136
7928 -136 -116 -84 -37 -4 36 82 117 141 151 167 153 128 100 67 25 -2 -58 -89 -122 -146 -154 -165 -141 -118 -92 -40 -15 25 62 84
7958 84 138 136 151 148 132 107 69 21 -30 -66 -83 -121 -153 -154 -163 -151 -122 -90 -61 -12 20 86 111 142 150 159 158 142 109 99 41 -14 -36 -78
$$ packed form
7726G2K7K9Jmoql6l4l0m4l2k9k5JrkJ1L6L9J6M2K7K5L4K3J1Lrk0j6k9m4l3m1l9
7761i3j7j2k2JJ6L0K7K3K8N0K7L4K2MRmj8k4l0k6m1k5m1m0jj5oJ5K1L1M3K3L6
7794B5L3L7J7J9kJ2j4k9l7k9l8l9m2j8k1l0J4NJ9L1J9L2N7L1L3M0JJ2njj8n0k2
7827D2n2l7l1k5k9pLPL0K0K9L9L6L6L0L4RJMj4k1l6k6k9l8m3k1j9m0J3MJ0J9M3
7861e9K5M8L3L4K3K0J2Mnk8j7n1l0m1m5k4k0k7QjRK4L2M2M0M8J2N2NK7j1jj3l5
7895I0k9m6l8l9k3m8joj3J3L7K8L8L2L6N1L3J6J6plk0k5l3m2m2l4l2l4k0j%J0
7928a36K0L2M7L3M0M6L5K4J0J6j4k5k8l3m2k7n6l1l3k4qj1K4K3K6N2K5M0L7K2
7958H4N4kJ5lj6k5l8m8n1l6j7l8l2jrJ2K9L2K9M9L2O6K5L1QRjj6l3j0n8n5k2m2
$$ plain form
7992 -78 -123 -145 -144 -155 -152 -130 -94 -67 -16 19 62 101 140 138 151 141 135 116 72 47 9 -47 -79 -122 -133 -171 -170 -145 -123 -102 -64 -16 20
8025 20 54 96 128 151 156 169 152 121 80 48 6 -28 -79 -103 -139 -146 -163 -159 -137 -111 -68 -32 30 61 92 106 149 147 154 136 116 95 50
8058 50 3 -44 -86 -116 -142 -157 -171 -157 -134 -118 -80 -43 6 58 96 129 147 166 160 144 130 105 68 22 -35 -71 -98 -145 -160 -165 -165 -148
8090 -148 -108 -81 -46 3 45 83 114 143 158 151 152 137 91 54 15 -21 -61 -110 -150 -154 -168 -166 -152 -119 -96 -44 -3 44 88 116 145 168
8122 168 171 162 146 113 61 27 -18 -61 -99 -130 -150 -161 -154 -152 -147 -104 -48 -10 37 83 107 119 148 147 143 126 107 65 19 -18 -63 -98 -126
8155 -126 -149 -166 -160 -151 -121 -106 -47 -16 37 67 111 153 157 164 163 137 118 80 44 5 -53 -88 -137 -154 -173 -158 -154 -110 -94 -58 -10 27 61
8188 61 96 136 149
$$ packed form
7992g8m5k2Jj1LK2L6K7N1L5M3L9L9kJ3j0oj9m4k5l8n6l2m3j1l8JK5K2K1L8M8L6
8025B0L4M2L2K3NJ3j7l1m1l2m2l4n1k4l6pj7MK2K6M3L6O2L1L1J4M3kPj8k0k1m5
8058E0m7m7m2l0k6j5j4J4K3J6L8L7M9N2L8L3J8J9oj6j4k5l7m6n7l6k7m7j5n%J7
8090a48M0K7L5M9M2L8L1K9J5pJj5m6l7l9l6m0m9m0mj4KJ4L3K3N2M1M7M4K8K9K3
8122A68Lrj6l3n2l4m5m3l8l1k0j1PKNM3N6L8M7M6K4J2K9jmj7j9m2m6l7m5l5k8
8155a26k3j7ORL0J5N9L1N3L0M4M2MPjk6j9l8l6l9n8l5m9j7j9J5MM4J6L6M8L7L4
8188F1L5M0J3
8191A49
$$ Imaginary data points
##PAGE= N=2
##DATA TABLE= (X++(I..I)), XYDATA
$$ plain form
0 0 0 0 0 0 0 0 0 0 0 0 0 0 0 -8 8 -8 8 -9 16 -16 17 -24 26 -32 40 -48 54 -60 73 -81 92 -105 121 -135 154
35 154 -171 193 -217 242 -269 299 -334 371 -410 453 -502 552 -609 672 -740 815 -897 990
53 990 -1092 1208 -1337 1485 -1655 1850 -2084 2363 -2706 3139 -3708 4485 -5624 7455 -10903
68 -10903 19694 -92307 -163324 -56818 -108206 -140620 -87489 27715 40677 9488 34313 130693
80 130693 162528 121563 92037 127581 138105 83163 15427 4706 8094 -22388 -75238 -100320
92 -100320 -107376 -115837 -120964 -105167 -87889 -74527 -45759 2856 31646 33214 49113 95912 120717
105 120717 97734 78092 100079 108489 51622 -17958 -22646 3888 -25755 -98606 -117465 -69879
117 -69879 -50334 -94732 -115337 -55399 9903 4372 -18182 24728 94050 96381 48054 44255 92897
$$ packed form
0@%%%%%%%%%%%%%qJ6j6J6j7K5l2L3m1N0n8P2q8J02j14J33j54J73j97K26k56K89
35A54l25L64m10M59n11N68o33P05p81Q63r55J054j161J281j412J555j712J887
53I90k082K300k545K822l140L505l934M447n069N845o847Q193j0109J3079j8358
68a0903L0597j12001p1017J06506n1388l2414N3131J15204J2962l1189K4825R6380
80A30693L1835m0965k9526L5544J0524n4942o7736j0721L388l0482n2850k5082
92a00320p056q461n127J5797J7278J3362K8768M8615K8790J568J5899M6799K4805
105A20717k2983j9642K1987Q410n6867o9580m688K6534k9643p2851j8859M7586
117f9879J9545m4398k0605N9938O5302n531k2554M2910O9322K331m8327l799M8642
$$ plain form
130 92897 105102 50433 2992 10186 19835 -19463 -71401 -79664 -59637 -60523 -79820 -77615 -49654
143 -49654 -28022 -21836 -8484 20542 48211 64126 73353 75967 69261 63365 64227 53980 20592
156 20592 -10877 -15158 -14970 -45122 -86272 -90802 -64636 -58783 -78957 -73617 -26717 8168 -501
169 -501 -5407 37214 86688 84155 54083 61050 95729 90530 38354 5193 16143 16750 -26374 -67567
183 -67567 -64840 -51076 -69693 -96405 -84647 -47441 -31453 -36489 -22812 15636 43744 47142 50071
196 50071 66357 78274 73413 63538 56295 41988 18757 87 -11758 -29521 -51617 -60786 -57730
209 -57730 -62060 -72452 -64310 -36710 -20235 -23009 -12854 24242 52987 46774 35226 52675 76258
222 76258 64973 32169 22262 32779 20715 -18492 -41192 -31592 -27824 -52359 -71610 -55366 -28636
$$ packed form
130I2897J2205n4669m7441P194R649l9298n1938q263K0027q86j9297K205K7961
143d9654K1632O186J3352K9026K7669J5915R227K614o706n896Q62j0247l3388
156B0592l1469m281J88l0152m1150m530K6166N853k0174N340M6900L4885q669
169e01m906M2621M9474k533l0072O967L4679n199n2176l3161J0950O07m3124m1193
183f7567K727J3764j8617k6712J1758L7206J5988n036J3677L8448K8108L398K929
196E0071J6286J1917m861r875p243j4307k3231j8670j1845j7763k2096r169L056
209e7730m330j0392Q142K7600J6475k774J0155L7096K8745o213j1548J7449K3583
222G6258j1285l2804r907J0517j2064l9207k2700R600L768k4535j9251J6244K6730
$$ plain form
235 -28636 -26373 -34812 -20044 12038 29090 27423 31636 47795 55832 47657 38235 35656 29110 12316
249 12316 -5046 -15760 -25091 -36305 -43958 -46240 -48076 -48075 -38837 -23353 -13653 -9021 4300 27100
263 27100 41536 40405 39627 49403 55186 43565 27092 22077 19312 1373 -24087 -35187 -32907 -38570
277 -38570 -55220 -61086 -46845 -31567 -30040 -28818 -11397 12744 24970 28109 38209 53956 58591
290 58591 48973 40318 39743 35275 18132 -2009 -13291 -19515 -30690 -45238 -53248 -52066 -47529 -42633
304 -42633 -34948 -23770 -11785 -16 12565 24750 34019 40927 46598 48278 43396 35579 29399 21835
318 21835 7756 -8313 -17027 -19738 -27146 -40295 -46923 -41088 -33048 -31322 -28280 -14819 1942 10068
332 10068 12923 21858 34816 39174 33998 31414 34527 31643 17120 1776 -5181 -9714 -19749 -30259
$$ packed form
235b8636K263q439J4768L2082J7052j667M213J6159Q037q175r422k579o546j6794
249A2316j7362j0714r331j1214p653k282j836JR238J5484R700M632J3321K2800
263B7100J4436j131p78R776N783j1621j6473n015k765j7939k5460j1100K280n663
277c8570j6650n866J4241J5278J527J222J7421K4141J2226L139J0100J5747M635
290E8591r618q655n75m468j7143k0141j1282o224j1175j4548q010J182M537M896
304d2633P685J1178J1985J1769J2581J2185R269O908N671J680m882p817o180p564
318B1835j4079j6069q714k711p408j3149o628N835Q040J726L042J3461J6761Q126
332A0068K855Q935J2958M358n176k584L113k884j4523j5344o957m533j0035j0510
$$ plain form
346 -30259 -33072 -31287 -32165 -33247 -27420 -16564 -8012 -1741 7987 20356 28358 30313 31061 32186 30313
361 30313 25104 19672 13707 3908 -8101 -16845 -21992 -28082 -34652 -35804 -30835 -26009 -23227 -17065 -5816
376 -5816 4172 9835 16837 28348 37204 36821 31982 30372 29543 22239 9838 116 -5615 -13153 -23891
391 -23891 -32048 -34698 -35330 -36127 -33719 -25751 -15702 -7524 -425 8088 17383 25223 30959 34604 35519
406 35519 33767 30270 24912 16604 6277 -3168 -10599 -17520 -24542 -29965 -32686 -33539 -32778 -28916 -21476
421 -21476 -12747 -4752 3065 11878 20208 25739 28494 29987 30390 28520 24136 17946 10246 1270 -7582
436 -7582 -14732 -20017 -24037 -26745 -27625 -26501 -23273 -18018 -11796 -5627 979 8882 16635 21581 23512
451 23512 24320 24507 22494 18028 12956 8088 1951 -6042 -13427 -17950 -20699 -23667 -25555 -23690 -18529
$$ packed form
346c0259k813J785q78j082N827J0856Q552O271R728J2369Q002J955P48J125j873
361C0313n209n432n965r799j2009q744n147o090o570j152M969M826K782O162J1249
376e816R988N663P002J1511Q856l83m839j610q29p304j2401r722n731p538j0738
391b3891q157k650o32p97K408P968J0049Q178P099Q513R295P840N736L645R15
406C5519j752l497n358q308j0327r445p431o921p022n423k721q53P61L862P440
421b1476Q729P995P817Q813Q330N531K755J493M03j870m384o190p700q976q852
436g582p150n285m020k708q80J124L228N255O222O169O606P903P753M946J931
451B3512Q08J87k013m466n072m868o137p993p385m523k749k968j888J865N161
$$ plain form
466 -18529 -13163 -8554 -3003 3850 10387 15781 20600 24160 24945 23200 20471 16651 10779 3777 -2620
481 -2620 -8384 -14267 -19302 -22123 -23369 -24261 -23805 -19981 -13434 -6882 -1422 4413 11259 17202 20766 22926
497 22926 24646 24744 22138 17982 13509 7675 -214 -8093 -13793 -17969 -21966 -24892 -25416 -24117 -21853 -17816
513 -17816 -11621 -4669 1788 8303 15082 20647 23740 24731 24404 22652 19288 14861 9746 3512 -3920
528 -3920 -10897 -15872 -19278 -22298 -24184 -23097 -19560 -15867 -12306 -7127 -537 5247 9887 14888 19797
543 19797 22117 21313 19412 17342 14011 9041 3617 -1612 -6758 -11570 -15347 -18063 -19973 -20345 -18259
558 -18259 -14138 -9583 -5265 -520 4810 9442 12681 15535 18390 19459 17564 14337 11506 7846 2014
573 2014 -4212 -8362 -11081 -14145 -17038 -18061 -17370 -16001 -13523 -9160 -3724 1385 5958 10374 14272
$$ packed form
466a8529N366M609N551O853O537N394M819L560P85j745k729l820n872p002o397
481b620n764n883n035k821j246q92M56L824O547O552N460N835O846N943L564K160
497B2926J720R8k606m156m473n834p889p879n700m176l997k926n24J299K264M037
513a7816O195O952O457O515O779N565L093R91l27j752l364m427n115o234p432
528c920o977m975l406l020j886J087L537L693L561N179O590N784M640N001M909
543A9797K320q04j901k070l331m970n424n229n146m812l777k716j910l72K086
558a8259M121M555M318M745N330M632L239K854K855J069j895l227k831l660n832
573B014o226m150k719l064k893j023O91J369K478M363N436N109M573M416L898
$$ plain form
588 14272 16886 17963 17814 16650 14475 11298 7146 2009 -3848 -9363 -13414 -16037 -17994 -18954 -18060 -15738
604 -15738 -13134 -9860 -4800 1117 5954 9895 14319 18352 19733 18548 16885 15235 12260 7670 2772
619 2772 -1923 -6775 -11670 -15541 -17923 -19008 -18864 -17189 -14124 -10317 -6090 -1417 3393 7656 11451
634 11451 15358 18600 19184 17187 14949 13186 9732 4078 -1112 -4358 -7736 -12567 -16268 -16890 -16256 -16306
650 -16306 -15213 -11060 -5624 -1676 1344 5436 10182 13319 14528 15345 15958 14814 11661 8041 4668
665 4668 506 -4473 -8380 -10559 -12451 -14552 -15261 -13940 -12066 -10040 -6365 -1273 2891 5476 8508
680 8508 12324 14490 13984 12952 12643 11220 7308 2769 -468 -3466 -7700 -11865 -13498 -13191 -13341 -13865
696 -13865 -12321 -8323 -4405 -1733 1498 6141 10298 12379 13416 14446 14454 12615 9857 7124 4037 23
$$ packed form
588A4272K614J077j49j164k175l177m152n137n857n515m051k623j957r60Q94K322
604a5738K604L274N060N917M837L941M424M033J381j185j663j650k975m590m898
619B772m695m852m895l871k382j085J44J675L065L807M227M673M810M263L795
634A1451L907L242N84j997k238j763l454n654n190l246l378m831l701o22O34n0
650a6306J093M153N436L948L020M092M746L137J209Q17O13j144l153l620l373
665D668m162m979l907k179j892k101p09J321J874K026L675N092M164K585L032
680H508L816K166n06j032l09j423l912m539l237k998m234m165j633L07j50n24
696a3865J544L998L918K672L231M643M157K081J037J030Qj839k758k733l087m014
$$ plain form
712 23 -4262 -7959 -10966 -13153 -14257 -14297 -13650 -12132 -9333 -5587 -1817 1617 5103 8801 11934 13654
728 13654 14193 14164 13342 11116 7798 4418 1238 -2498 -6599 -10088 -12229 -13435 -14200 -14265 -12894 -10081 -6648
745 -6648 -3405 -217 3551 7530 10585 12283 13441 14229 13634 11155 8182 5740 3005 -1110 -5432 -8243
761 -8243 -9863 -11604 -13258 -13291 -11494 -9279 -7264 -4428 -568 3025 5451 7672 10271 12059 12073 11103
777 11103 10030 8275 5211 1857 -1012 -3852 -6994 -9433 -10394 -10866 -11523 -11181 -8802 -5635 -3198 -777
793 -777 2782 6427 8414 9303 10754 12176 11487 8932 6806 5419 2736 -1667 -5311 -6977 -8394 -10626
809 -10626 -11989 -11185 -9618 -8669 -7201 -3947 -57 2753 4878 7581 10218 11260 10946 10477 9793 7930
825 7930 5135 2492 -158 -3461 -6791 -8943 -9981 -10880 -11402 -10563 -8494 -6404 -4387 -1498 2100 5016
$$ packed form
712B3m285l697l007k187j104m0O47J518K799L746L770L434L486L698L133J720
728A3654N39k9q22k226l318l380l180l736m101l489k141j206p65o5J371K813L433
745f648L243L188L768L979L055J698J158P88n95k479k973k442k735m115m322k811
761h243j620j741j654l3J797K215K015K836L860L593K426K221K599J788J4r70
777A1103j073j755l064l354k869k840l142k439r61m72o57L42K379L167K437K421
793g77L559L645J987Q89J451J422o89k555k126j387k683m403l644j666j417k232
809a0626j363Q04J567R49J468L254L890K810K125K703K637J042l14m69o84j863
825G930k795k643k650l303l330k152j038q99n22Q39K069K090K017K889L598K916
$$ plain form
841 5016 6948 8927 11018 11800 10787 9184 7881 6095 3143 -181 -2884 -5126 -7659 -9927 -10953
856 -10953 -10834 -10275 -9294 -7399 -4651 -1812 803 3319 5804 8080 9799 10628 10522 9623 8190 6259
872 6259 3716 835 -1878 -4212 -6456 -8506 -9682 -9903 -9635 -9009 -7442 -4847 -2075 312 2657 5106
888 5106 7289 8629 9306 9583 9155 7782 5820 3741 1322 -1535 -4108 -6006 -7510 -8795 -9377 -8959
904 -8959 -8067 -6962 -5121 -2376 469 2587 4451 6719 8618 9127 8708 8384 7818 5977 3275 1027
920 1027 -959 -3474 -6240 -7988 -8462 -8701 -9078 -8540 -6667 -4451 -2590 -429 2398 4945 6631 7897
936 7897 9057 9521 8743 7351 6006 4257 1780 -972 -3189 -5155 -7241 -8745 -9037 -8726 -8410 -7499 -5426
953 -5426 -2852 -762 1197 3648 6153 7738 8361 8790 8971 8023 6110 4153 2492 305 -2488 -4889
$$ packed form
841E016J932J979K091P82j013j603j303j786k952l324k703k242k533k268j026
856a0953J19N59R81J895K748K839K615K516K485K276J719Q29j06q99j433j931
872F259k543k881k713k334k244k050j176k21K68O26J567K595K772K387K345K449
888E106K183J340O77K77m28j373j962k079k419k857k573j898j504j285n82M18
904h959Q92J105J841K745K845K118J864K268J899N09m19l24n66j841k702k248
920A027j986k515k766j748m74k39l77N38J873K216J861K161K827K547J686J266
936G897J160M64p78j392j345j749k477k752k217j966k086j504k92L11L16R11K073
953e426K574K090J959K451K505J585O23M29J81r48j913j957j661k187k793k401
$$ plain form
969 -4889 -6406 -7561 -8579 -8952 -8256 -6974 -5483 -3597 -1237 1144 3150 5074 6899 8156 8534 8388
985 8388 7808 6507 4522 2506 541 -1716 -4128 -6010 -7114 -7813 -8419 -8375 -7215 -5482 -3708 -1855
1001 -1855 501 2903 4723 6034 7267 8228 8269 7473 6290 4901 2987 718 -1574 -3599 -5321 -6695
1017 -6695 -7525 -7881 -7803 -7086 -5633 -3884 -1992 188 2518 4432 5812 6958 7767 8002 7371 6175 4874
1034 4874 3344 1285 -1243 -3441 -5047 -6388 -7482 -7925 -7593 -6870 -5801 -4229 -2282 -172 1948 3995
1050 3995 5717 6877 7646 8005 7527 6249 4812 3492 1735 -729 -3073 -4648 -5896 -7249 -8128 -7855
1066 -7855 -6773 -5766 -4660 -2732 -238 1791 3191 4751 6735 7875 7718 7170 6760 5665 3544 1404
1082 1404 -222 -2004 -4207 -5967 -6712 -7171 -7712 -7541 -6142 -4419 -2949 -1216 1264 3433 4581 5603
$$ packed form
969d889j517j155j018l73O96J282J491J886K360K381K006J924J825J257L78j46
985H388n80j301j985k016j965k257k412j882j104o99o06M4J160J733J774J853
1001a855K356K402J820J311J233R61M1p96j183j389j914k269k292k025j722j374
1017f695q30l56P8P17J453J749J892K180K330J914J380J146Q09K35o31j196j301
1034D874j530k059k528k198j606j341j094m43L32P23J069J572J947K110K120K047
1050C995J722J160P69L59m78j278j437j320j757k464k344j575j248j353q79K73
1066g855J082J007J106J928K494K029J400J560J984J140j57n48m10j095k121k140
1082A404j626j782k203j760p45m59n41J71J399J723J470J733K480K169J148J022
$$ plain form
1098 5603 7014 7944 7390 6155 5407 4507 2332 -543 -2372 -3296 -4877 -6952 -7575 -6747 -6286 -6477 -5508
1115 -5508 -2885 -462 784 2106 4500 6447 6774 6528 6844 6912 5508 3490 2067 760 -1400 -3914
1131 -3914 -5375 -5963 -6690 -7414 -6929 -5539 -4458 -3519 -1674 795 2680 3655 5146 6981 7630 6730 5950
1148 5950 5596 4511 2237 -32 -1251 -2520 -4620 -6541 -6960 -6531 -6584 -6617 -5291 -2890 -1083 -44 1563
1165 1563 3949 5669 6062 6305 7003 7188 5760 3802 2526 1248 -847 -3119 -4590 -5262 -6014 -6961 -7041
1182 -7041 -6112 -4899 -3734 -2194 -15 2052 3432 4541 5890 6765 6618 6120 5756 4877 3101 959
1198 959 -673 -2023 -3991 -5830 -6417 -6112 -6116 -6456 -5657 -3641 -1808 -878 587 3141 5280 5794 5552 6343
1216 6343 7022 5871 3818 2781 2296 464 -2423 -4216 -4589 -5224 -6756 -7076 -5799 -4430 -4000 -3002 -629
$$ packed form
1098E603J411R30n54j235p48r00k175k875j829r24j581k075o23Q28M61j91R69
1115e508K623K423J246J322K394J947L27k46L16O8j404k018j423j307k160k514
1131c914j461n88p27p24M85J390J081R39J845K469J885R75J491J835O49r00p80
1148E950l54j085k274k269j219j269k100j921m19M29n3l3J326K401J807J039J607
1165A563K386J720L93K43O98J85j428j958j276j278k095k272j471o72p52r47q0
1182g041R29J213J165J540K179K067J380J109J349Q75j47m98l64q79j776k142
1198I59j632j350j968j839n87L05ml40P99K016J833R30J465K554K139N14k42P91
1216F343O79j151k053j037m85j832k887j793l73o35j532l20J277J369M30R98K373
$$ plain form
1233 -629 1623 2547 3355 5094 6804 6635 5634 5470 5122 3379 979 -327 -958 -2823 -5133 -5947 -5572
1250 -5572 -5849 -6698 -5898 -3521 -1821 -1406 71 2879 4669 4511 4798 6373 7156 5605 3732 3382 2876
1267 2876 424 -2574 -3618 -3538 -4728 -6586 -6683 -5160 -4461 -4786 -3702 -852 1424 2104 2948 5069 6378
1284 6378 5934 5263 5474 5302 3545 1561 542 -520 -2754 -4871 -5395 -5293 -5849 -6417 -5382 -3462 -2447
1301 -2447 -2086 -411 2301 3888 4149 4944 6400 6781 5275 3842 3542 2880 716 -1626 -2566 -3150 -4614
1318 -4614 -6269 -6387 -5283 -4730 -4579 -3374 -1014 711 1382 2369 4204 5649 5603 5218 5482 5370 3866
1335 3866 1682 382 -454 -2016 -3907 -4875 -4859 -5172 -5746 -5477 -4207 -2747 -1798 -441 1667 3276 3865
1352 3865 4369 5400 5930 5131 4133 3731 3150 1228 -1152 -2277 -2834 -4148 -5718 -5866 -4723 -4248 -4594
$$ packed form
1233f29K252R24Q08J739J710j69j001j64l48j743k400j306o31j865k310q14L75
1250e572k77q49Q00K377J700M15J477K808J790j58K87J575P83j551j873l50n06
1267B876k452k998j044Q0j190j858r7J523O99l25J084K850K276O80Q44K121J309
1284F378m44o71K11j72j757j984j019j062k234k117n24J02n56n68J035J920J015
1301b447L61J675K712J587K61P95J456L81j506j433l00o62k164k342r40n84j464
1318d614j655j18J104N53J51J205K360J725O71R87J835J445m6l85K64j12j504
1335C866k184j300q36j562j891r68J6l13n74K69J270J460R49J357K108J609N89
1352C865N04J031N30p99r98m02n81j922k380j125n57j314j570j48J143M75l46
$$ plain form
1369 -4594 -3890 -1694 263 980 1804 3826 5591 5437 4689 4902 5122 3868 1884 850 402 -1266 -3526
1386 -3526 -4673 -4623 -5037 -5827 -5485 -3832 -2543 -2109 -1093 1160 2886 3215 3851 5273 6230 5372 4058
1403 4058 3679 3247 1321 -814 -1765 -2191 -3577 -5222 -5543 -4842 -4767 -4933 -3832 -1613 -96 461 1550
1420 1550 3556 4710 4484 4424 5293 5504 3918 2210 1541 772 -1179 -3263 -3954 -3902 -4455 -5350 -5126 -3944
1438 -3944 -3154 -2710 -1411 654 2201 2958 3706 4747 5197 4615 4089 3919 3226 1725 172 -726 -1810
1455 -1810 -3461 -4755 -4816 -4468 -4484 -4460 -3394 -1928 -884 -156 1098 2839 4045 4367 4533 4867 4670 3659
1473 3659 2401 1515 584 -738 -2217 -3184 -3875 -4507 -5028 -4875 -4085 -3185 -2274 -1137 424 1771 2497 3209
1491 3209 4149 4875 4809 4323 3812 3158 1915 313 -1081 -1920 -2795 -3825 -4487 -4538 -4313 -4264 -3744 -2607 -1212
$$ packed form
1369d594P04K196J957P17Q24K022J765j54p48K13K20j254j984j034m48j668k260
1386c526j147N0m14p90L42J653J289M34J016K253J726L29O36J422R57q58j314
1403D058l79m32j926k135r51m26j386j645l21P01P5j66J101K219J517N57J089
1420A550K006J154k26o0Q69K11j586j708o69p69j951k084o91N2n53q95K24J182
1438c944P90M44J299K065J547P57P48J041M50n82n26j70o93j501j553q98j084
1455a810j651j294o1L48j6K4J066J466J044P28J254J741J206L22J66L34j97j011
1473C659j258q86r31j322j479r67o91o32n21J53P90R00R11J137J561J347P26P12
1491C209R40P26o6m86n11o54j243j602j394q39q75j030o62n1K25M9N20J137J395
$$ plain form
1510 -1212 28 1189 2472 3593 4036 4191 4459 4533 3859 2890 1991 1193 -306 -2116 -3251 -3631 -4055 -4675
1528 -4675 -4716 -3853 -2971 -2613 -1918 -351 1268 2291 2993 3975 4760 4691 4065 3565 3081 2165 796 -238 -1116
1547 -1116 -2316 -3658 -4272 -4287 -4295 -4325 -3559 -2259 -1172 -540 315 1805 2988 3396 3830 4350 4567 3812 2758
1566 2758 1885 1064 -180 -1433 -2245 -2741 -3499 -4261 -4279 -3739 -3509 -2805 -1617 -209 932 1650 2585 3445
1584 3445 3858 3775 3800 3845 3266 2171 933 -40 -1207 -2313 -3239 -3625 -3787 -3792 -3654 -3292 -2626 -1845 -752 595
1604 595 1841 2748 3351 3951 4132 3778 3375 2921 2327 1353 106 -1045 -2035 -3060 -3838 -4224 -4135 -3761 -3306
1623 -3306 -2557 -1816 -873 245 1342 2336 3165 3845 4299 4199 3642 2933 2289 1396 308 -773 -1589 -2406
1641 -2406 -3238 -3890 -4113 -3949 -3524 -2789 -1820 -834 120 1073 2025 2711 3183 3612 3932 3847 3106 2178 1451 530
$$ packed form
1510a212J240J161J283J121M43J55K68P4o74r69q99p98j499j810j135l80m24o20
1528d675m1Q63Q82L58O95J567J619J023P02R82P85o9o26n00m84r16j369j034q78
1547a116j200j342o14j5ql0P66J300J087O32Q55J490J183M08M34N20K17p55j054
1566B758q73q21j244j253q12m96p58p62j8N40K30P04J188J408J141P18R35Q60
1584C445M13q3K5M5n79j095j238r73j167j106r26l86j62nJ38L62O66P81J093J347
1604E95J246R07O03O00J81l54m03m54n94r74j247j151r90j025p78l86Q9L74M55
1623c306P49P41R43J118J097R94Q29O80M54j00n57p09o44q93j088j081q16q17
1641b406q32o52k23J64M25P35R69R86R54R53R52O86M72M29L20q5p41r28p27r21
$$ plain form
1661 530 -678 -1869 -2437 -2826 -3351 -3787 -3731 -3301 -2778 -2085 -1111 166 1197 1988 2731 3257 3513 3451 3375 3169
1681 3169 2613 1568 620 -165 -1306 -2418 -3139 -3315 -3376 -3515 -3328 -2665 -1934 -1274 -381 771 1843 2579
1699 2579 3096 3618 3647 3188 2696 2266 1653 624 -513 -1251 -1899 -2867 -3680 -3792 -3325 -3014 -2807 -2072 -805
1718 -805 170 734 1531 2522 3271 3557 3574 3494 3197 2395 1521 634 -341 -1326 -2085 -2633 -3229 -3662 -3737 -3405 -2851
1739 -2851 -2383 -1530 -282 864 1602 2086 2827 3465 3616 3315 3032 2813 2130 1007 -76 -911 -1663 -2646
1757 -2646 -3043 -3384 -3322 -3222 -2898 -2307 -1545 -690 174 1238 2148 2803 3163 3252 3359 3080 2427 1775 1170 423
1777 423 -546 -1580 -2286 -2875 -3153 -3252 -3177 -2700 -2003 -1319 -643 118 925 1853 2402 2900 3258 3223 2960 2437 1764
1798 1764 829 43 -624 -1243 -2062 -2775 -3063 -2907 -2995 -3004 -2288 -1157 -253 207 815 1946 2696 2784 2690 3013 3239
$$ packed form
1661E30j208j191n68l89n25m36N6M30N23O93R74J277J031P91P43N26K56o2p6k06
1681C169n56j045r48p85j141j112p21j76o1j39J87O63P31O60Q93J152J072P36
1699B579N17N22K9m59m92m30o13j029j137p38o48r68q13j12M67L11K07P35J267
1718h05R75N64P97R91P49K86J7q0k97q02q74q87r75r85p59n48n96m33p5L32N54
1739b851M68Q53J248J146P38M84P41O38J51l01k83k19o83j123j083q35p52r83
1757b646l97l41O2J00L24N91P62Q55Q64J064R10O55L60Q9J07k79o53o52o05p47
1777D23r69j034p06n89k78r9P5M77O97O84O76P61Q07R28N49M98L58l5k63n23o73
1798A764r35p86o67o19q19p13k88J56q8rP16J131R04M60O08J131P50Q8r4L23K26
$$ plain form
1819 3239 2658 1627 941 395 -543 -1714 -2445 -2548 -2722 -3221 -3170 -2677 -2123 -1751 -1031 245 1260 1843 2371
1838 2371 3065 3329 3026 2663 2591 2322 1377 276 -428 -1050 -2105 -3031 -3192 -2962 -3055 -3058 -2463 -1433 -896 -587
1858 -587 442 1814 2502 2602 2921 3544 3371 2340 1575 1440 1112 -163 -1344 -1707 -1905 -2745 -3520 -3371
1876 -3371 -2547 -2062 -1925 -1238 -12 806 1074 1577 2441 3016 2962 2781 2695 2220 1309 449 -111 -809 -1621 -2124
1896 -2124 -2283 -2508 -2942 -2974 -2380 -1578 -1124 -602 491 1578 1950 1915 2281 2921 2871 2284 1874 1706 1056 -149
1916 -149 -1210 -1622 -1854 -2469 -2915 -2727 -2243 -2035 -1998 -1375 -241 659 1089 1741 2596 3074 2814 2401 2268 2181
1936 2181 1504 512 -173 -591 -1392 -2363 -3006 -2872 -2727 -2633 -2302 -1616 -923 -383 293 1106 1836 2238 2691 3063
1956 3063 3056 2494 1885 1633 1002 9 -903 -1163 -1420 -2286 -3151 -3078 -2469 -2315 -2394 -1702 -294 556 544 984 2124
$$ packed form
1819C239n81j031o86n46r38j171p31j03j74m99N1M93N54L72P20J276J015N83N28
1838B371O94K64l03l63p2k69r45j101p04o22j055r26j61K30r3lN95J030N37L09
1858e87J029J372O88J00L19O23j73j031p65j35l28j275j181l63j98q40p75J49
1876c371Q24M85J37O87J226Q18K68N03Q64N75n4j81q6m75r11q60n60o98q12n03
1896b124j59k25m34l2N94Q02M54N22J093J087L72l5L66O40n0n87m10j68o50j205
1916a49j061m12k32o15m46J88M84K08L7O23J134R00M30O52Q55M78k60m13j33q7
1936B181o77r92o85m18q01r71o43J34J45R4L31O86O93N40O76Q13P30M02M53L72
1956C063pn62o09k52o31r93r12k60k57q66q65P3O09J54p9O92J408Q50j2M40J140
$$ plain form
1977 2124 2864 2685 2377 2711 2836 1959 743 168 -97 -945 -2014 -2358 -2223 -2438 -2804 -2691 -1915 -1298 -984
1996 -984 -245 916 1685 1814 2040 2567 2715 2221 1855 1733 1394 354 -545 -883 -1304 -2177 -2662 -2406 -1980
2015 -1980 -2077 -2083 -1361 -343 56 163 1026 2156 2561 2139 2132 2522 2313 1317 414 366 100 -884 -1990 -2148 -2050
2036 -2050 -2361 -2754 -2414 -1572 -951 -678 -146 737 1443 1713 2001 2445 2621 2410 2064 1688 1089 275 -429 -873
2056 -873 -1464 -2093 -2454 -2404 -2401 -2487 -2282 -1513 -653 -83 378 1179 2074 2340 2261 2370 2675 2495 1797 1152 785 209
2078 209 -814 -1687 -2015 -2116 -2411 -2700 -2513 -1956 -1505 -1240 -718 241 1208 1566 1817 2302 2727 2528 2002 1731
2098 1731 1577 1046 163 -585 -972 -1470 -2143 -2502 -2399 -2135 -1914 -1572 -1074 -458 41 644 1264 1787 2007 2143
2118 2143 2346 2190 1637 1012 763 406 -444 -1193 -1410 -1515 -1904 -2491 -2336 -1638 -1306 -1194 -701 373 1021
$$ packed form
1977B124P40j79l08L34J25q77j216n75k65q48j069l44J35k15l66J13P76O17L14
1996i84P39J161P69J29K26N27J48m94l66j22l39j040q99l38m21q73m85K56M26
2015a980r7oP22J018L99J07Q63J130M05m22pL90k09r96r03m8k66r84j106j58R8
2036b050l11l93L40Q42O21K73N32Q83P06K70K88M44J76k11l46l76n99q14p04m44
2056h73n91o29l61N0Lq6K05P69Q60N70M61Q01Q95K66p9J09L05j80o98o45l67n76
2078B09j023q73l28j01k95k89J87N57M51K65N22R59R67L58K51M85M25j99n26k71
2098A731j54n31q83p48l87m98o73l59J03K64K21L42M98O16M99O03O20N23K20J36
2118B143K03j56n53o25k49l57q50p49k17j05l89n87J55O98L32J12M93J074O48
$$ plain form
2137 1021 1126 1282 1980 2444 2183 1847 1745 1586 867 -104 -670 -903 -1439 -2080 -2274 -2065 -2020 -2078 -1679 -992
2157 -992 -317 221 789 1505 2018 2121 2155 2297 2172 1737 1263 888 263 -583 -1249 -1582 -1931 -2329 -2483 -2134
2177 -2134 -1849 -1653 -1383 -664 126 655 949 1580 2264 2445 2166 1965 1994 1708 1004 337 -59 -518 -1187 -1864
2197 -1864 -2253 -2233 -2155 -2131 -1916 -1402 -798 -293 218 748 1368 1849 2116 2178 2189 1965 1666 1119 571 58 -452
2218 -452 -1035 -1511 -1892 -2072 -2126 -2035 -1809 -1376 -839 -285 211 738 1234 1554 1863 1950 1886 1748 1501 1049 454
2239 454 -36 -378 -900 -1462 -1809 -1782 -1799 -1864 -1750 -1199 -561 -224 135 740 1338 1686 1708 1812 1957 1856 1311
2260 1311 829 474 56 -609 -1196 -1471 -1673 -1929 -2076 -1908 -1535 -1258 -830 -249 360 842 1231 1666 1883 1988
2280 1988 1975 1889 1661 1167 506 93 -377 -963 -1587 -1779 -1855 -2020 -2110 -1860 -1405 -967 -634 -55 723 1296 1576
$$ packed form
2137A021J05J56O98M64k61l36j02j59p19r71n66k33n36o41j94K09M5n8L99O87
2157i92O75N38N68P16N13J03L4J42j25m35m74l75o25q46o66l33l49l98j54L49
2177b134K85J96K70P19P90N29K94O31O84J81k79k01K9k86p04o67l96m59o69o77
2197a864l89K0P8K4K15N14O04N05N11N30O20M81K67O2J1k24k99n47n48n13n10
2218d52n83m76l81j80n4R1K26M33N37N54M96N27M96L20L09Q7o4j38k47m52n95
2239D54m90l42n22n62l47K7j7o5J14N51O38L37L59O05N98L48K2J04J45j01n45
2260A311m82l55m18o65n87k75k02k56j47J68L73K77M28N81O09M82L89M35K17J05
2280A988j3q6k28m94o61m13m70n86o24j92p6j65r0K50M55M38L33N79P78N73K80
$$ plain form
2301 1576 1802 2071 2180 1911 1630 1351 1015 394 -344 -810 -1231 -1658 -1987 -2073 -1871 -1748 -1572 -1150 -708 -213
2321 -213 293 843 1344 1667 1818 1890 1808 1557 1165 846 552 -8 -622 -1030 -1299 -1603 -1911 -1837 -1526 -1277 -1014
2342 -1014 -574 -72 390 717 1030 1393 1745 1777 1632 1393 1102 695 194 -203 -562 -862 -1221 -1496 -1695 -1691 -1596
2363 -1596 -1365 -971 -548 -29 429 773 1029 1322 1614 1730 1641 1538 1289 900 384 -190 -697 -1064 -1374 -1580
2383 -1580 -1673 -1733 -1618 -1397 -1106 -624 -65 506 1045 1378 1571 1741 1782 1624 1371 1190 919 426 -212 -667 -1084
2404 -1084 -1479 -1787 -1863 -1697 -1528 -1426 -1167 -769 -294 111 557 1115 1568 1726 1797 1750 1677 1360 971 662 365
2425 365 -164 -741 -1110 -1452 -1740 -1865 -1688 -1411 -1116 -890 -468 98 443 726 1065 1590 1804 1540 1352 1329
2445 1329 991 466 -38 -211 -480 -931 -1395 -1462 -1407 -1495 -1537 -1070 -565 -175 112 471 880 1102 1217 1424 1589
$$ packed form
2301A576K26K69J09k69k81k79l36o21p38m66m21m27l29q6K02J23J76M22M42M95
2321b13N06N50N01L23J51P2q2k51l92l19k94n60o14m08k69l04l08P4L11K49K63
2342a014M40N02M62L27L13L63L52L2j45k39k91m07n01l97l59l00l59k75j99MR5
2363a596K31L94M23N19M58L44K56K93K92J16q9j03k49l89n16n74n07l67l10k06
2383a580r3o0J15K21K91M82N59N71N39L33J93J70M1j58k53j81k71m93o38m55m17
2404a084l95l08p6J66J69J02K59L98M75M05M46N58M53J58P1m7p3l17l89l09k97
2425C65n29n77l69l42k88j25J77K77K95K26M22N66L45K83L39N25K14k64j88k3
2445A329l38n25n04j73k69m51m64o7N5q8m2M67N05L90K87L59M09K22J15K07J65
$$ plain form
2466 1589 1448 1205 722 480 -12 -507 -887 -989 -1198 -1482 -1520 -1309 -1156 -1078 -720 -101 364 638 867 1275
2486 1275 1529 1426 1275 1277 1234 956 405 -3 -295 -803 -1235 -1475 -1454 -1394 -1455 -1408 -1051 -680 -361 -32 516 1002
2508 1002 1303 1499 1591 1594 1413 1228 957 603 214 -215 -663 -1080 -1443 -1632 -1604 -1504 -1377 -1173 -793 -389 -12
2529 -12 311 683 1087 1486 1517 1518 1451 1345 956 581 238 30 -393 -853 -1207 -1385 -1428 -1513 -1501 -1147 -688 -392 -200
2552 -200 138 620 984 1078 1195 1390 1518 1230 789 515 344 -81 -566 -829 -902 -1070 -1290 -1297 -1165 -983 -785
2573 -785 -393 7 379 552 808 1117 1209 1101 1154 1211 900 499 149 -17 -410 -902 -1137 -1044 -1114 -1269 -1286 -972
2595 -972 -631 -449 -294 285 903 982 1014 1193 1496 1457 1061 833 670 449 -44 -539 -807 -1069 -1332 -1519 -1366
2616 -1366 -1185 -1102 -843 -528 -83 249 573 928 1261 1353 1388 1334 1284 956 550 299 114 -264 -760 -1021 -1072 -1291
$$ packed form
2466A589j41k43m83k42m92m95l80j02k09k84l8K11J53P8L58O19M65K74K29M08
2486A275K54j03j51Km3k78n51m08k92n08m32k40K1O0o1M7L57L71L19L29N48M86
2508A002L01J96R2Lj81j85k71l54l89m29m48m17l63j89K8J00J27K04L80M04L77
2529a2L23L72M04L99L1Jo7j06l89l75l43k08m23m60l54j78m3q5J2L54M59K96J92
2552b00L38M82L64R4J17J95J28k88m41k74j71m25m85k63p3j68k20pJ32J82J98
2573g85L92M00L72J73K56L09R2j08N3N7l11m01l50j66l93m92k35R3p0j55j7L14
2595i72L41J82J55N79O18P9L2J79L03l9l96k28j63k21m93m95k68k62k63j87J53
2616a366J81Q3K59L15M45L32L24L55L33R2L5n4n0l28m06k51j85l78m96k61n1k19
$$ plain form
2638 -1291 -1505 -1389 -1008 -720 -609 -423 116 455 617 817 1165 1425 1397 1143 972 843 552 168 -256 -377
2658 -377 -669 -920 -1237 -1252 -1155 -1105 -917 -629 -293 78 318 577 839 1088 1164 1098 1127 953 770 493 60 -232
2680 -232 -605 -649 -921 -942 -1188 -1089 -853 -703 -599 -349 27 328 633 871 954 1094 1091 891 808 678 419 83
2702 83 -297 -594 -745 -902 -1145 -1135 -961 -843 -884 -564 -199 162 304 531 1002 1143 1197 1149 1023 966 632 359
2724 359 170 -163 -508 -848 -1064 -1043 -1146 -1248 -1082 -728 -531 -414 -154 289 607 702 984 1290 1271 1125 891
2745 891 806 649 260 -77 -249 -503 -898 -1217 -1090 -1035 -1116 -1008 -697 -335 -156 51 409 696 881 921 984 1056
2767 1056 1014 679 541 344 97 -199 -515 -762 -844 -1019 -1032 -920 -808 -649 -445 -148 134 340 522 736 996
2788 996 942 930 882 735 505 146 -90 -156 -511 -690 -850 -967 -897 -912 -790 -494 -333 -162 115 357 552 736
$$ packed form
2638a291k14J16L81K88J11J86N39L39J62K00L48K60k8k54j71j29k91l84m24j21
2658c77k92k51l17j5R7N0J88K88L36L71K40K59K62K49P6o6K9j74j83k77m33k92
2680b32l73m4k72k1k46R9K36J50J04K50L76L01L05K38Q3J40lk00q3j30k59l36
2702H3l80k97j51j57k43J0J74J18m1L20L65L61J42K27M71J41N4m8j26n7l34k73
2724C59j89l33l45l40k16K1j03j02J66L54J97J17K60M43L18R5K82L06j9j46k34
2745H91q5j57l89l37j72k54l95l19J27N5q1J08L11L62J79K07L58K87J85M0O3P2
2767A056m2l35j38j97k47k96l16k47q2j75j3J12J12J59K04K97K82K06J82K14K60
2788I96n4j2m8j47k30l59k36o6l55j79j60j17P0j5J22K96J61J71K77K42J95J84
$$ plain form
2810 736 810 922 920 809 617 461 181 52 -305 -600 -665 -832 -874 -981 -984 -807 -659 -481 -219 78 419 656
2832 656 796 926 1031 1063 884 726 631 394 73 -236 -492 -706 -913 -996 -1010 -916 -871 -713 -403 -223 -70 221
2854 221 525 807 881 948 982 907 785 529 392 299 68 -350 -518 -659 -824 -1017 -961 -843 -656 -604 -365 -47
2876 -47 170 331 490 737 878 849 745 768 714 458 150 12 -231 -435 -669 -635 -768 -795 -849 -711 -488 -259
2898 -259 -162 82 417 446 538 678 854 776 606 514 510 174 -30 -285 -322 -564 -719 -784 -748 -592 -611 -566 -298 -31
2922 -31 151 303 480 738 772 763 725 649 516 326 187 19 -238 -441 -576 -757 -810 -836 -754 -540 -473 -321 -153
2945 -153 176 393 435 655 761 852 835 757 482 489 283 26 -135 -328 -505 -665 -824 -731 -791 -730 -608 -378 -198
2968 -198 79 261 378 547 676 675 748 787 751 493 313 115 -81 -198 -541 -630 -724 -690 -745 -732 -569 -403 -259
$$ packed form
2810G36P4J12kj11j92j56k80j29l57k95o5j67m2j07lJ77J48J78K62K97L41K37
2832F56J40J30J05L2j79j58r5k37l21l09k56k14k07q3j4R4M5J58L10J80J53K91
2854B21L04K82P4O7L4p5j22k56j37r3k31m18j68j41j65j93N6J18J87N2K39L18
2876d7K17J61J59K47J41k9j04K3n4k56l08j38k43k04k34L4j33k7n4J38K23K29
2898b59R7K44L35K9R2J40J76p8j70r2ml36k04k55l7k42j55o5L6J56j9M5K68K67
2922c1J82J52J77K58L4rl8p6j33j90j39j68k57k03j35j81n3k6Q2K14O7J52J68
2945a53L29K17M2K20J06R1j7p8k75Pk06k57j61j93j77j60j59R3o0O1J22K30J80
2968a98K77J82J17J69J29jP3L9l6k58j80j98j96j17l43q9r4L4n5J3J63J66J44
$$ plain form
2991 -259 -103 135 330 478 570 741 667 703 533 485 327 89 -28 -147 -370 -559 -658 -677 -543 -641 -497 -422 -161
3014 -161 -112 -23 230 496 702 607 617 692 567 385 208 43 -12 -167 -419 -535 -567 -686 -748 -671 -408 -314 -290 17
3038 17 159 276 329 526 659 711 629 590 599 281 113 -41 -175 -314 -522 -634 -585 -650 -784 -687 -405 -263 -109
3061 -109 7 321 517 556 536 660 719 647 465 319 216 76 -294 -420 -471 -605 -650 -715 -643 -523 -518 -378 -193
3084 -193 83 315 383 592 613 688 662 602 521 415 240 171 11 -284 -514 -585 -644 -665 -733 -585 -378 -299 -221 -126 124
3109 124 304 444 519 647 681 592 427 329 242 106 -113 -252 -311 -460 -544 -629 -638 -534 -423 -275 -144 106 243
3132 243 272 383 494 658 593 552 501 390 220 27 -156 -232 -342 -504 -569 -580 -654 -570 -511 -378 -192 -23 207
3155 207 376 461 511 638 653 542 441 386 349 169 -164 -320 -353 -471 -636 -721 -585 -441 -462 -453 -255 44 144
$$ packed form
2991b59J56K38J95J48R2J71p4L6j70m8j58k38j17j19k23j89r9j9J34r8J44P5K61
3014a61M9Q9K53K66K06r5J0P5j25j82j77j65n5j55k52j16l2j19o2P7K63R4K4L07
3038A7J42J17N3J97J33N2q2l9Rl18j68j54j34j39k08j12M9o5j34R7K82J42J54
3061a09J16L14J96L9k0J24N9p2j82j46j03j40l70j26n1j34m5o5P2J20NJ40J85
3084a93K76K32O8K09K1P5k6o0q1j06j75o9j60k95k30p1n9k1o8J48K07P9P8R5K50
3109A24J80J40P5J28L4q9j65r8q7j36k19j39n9j49q4q5rJ04J11J48J31K50J37
3132B43K9J11J11J64o5m1n1j11j70j93j83p6j10j62o5j1p4Q4N9J33J86J69K30
3155B07J69Q5N0J27J5j11j01n5l7j80l33j56l3j18j65q5J36J44k1RJ98K99J00
$$ plain form
3178 144 190 392 631 721 615 546 539 475 295 83 -6 -133 -331 -529 -596 -647 -692 -630 -507 -333 -255 -123 83 255
3202 255 360 447 632 690 621 513 463 385 171 -65 -169 -236 -391 -587 -633 -562 -554 -591 -494 -231 -36 44 122 369 547
3227 547 529 484 598 655 531 338 163 88 -104 -300 -448 -493 -528 -567 -570 -518 -425 -277 -163 10 163 325 471 562
3251 562 568 526 508 467 353 161 13 -71 -204 -413 -555 -575 -558 -545 -526 -422 -230 -77 4 108 306 495 568 583
3275 583 589 606 515 340 167 63 -59 -234 -406 -492 -536 -611 -657 -595 -441 -321 -190 -26 172 322 404 473 577 618
3299 618 583 489 420 310 115 -84 -235 -358 -465 -544 -571 -565 -566 -509 -378 -202 -86 73 291 469 504 497 549 611 515
$$ packed form
3178A44M6K02K39R0j06o9po4j80k12q9j27j98j98o7n1m5O2J23J74P8J32K06J72
3202B55J05Q7J85N8o9j08n0p8k14k36j04o7j55j96m6P1Ql7R7K63J95Q0P8K47J78
3227E47j8m5J14N7j24j93j75p5j92j96j48m5l5l9lN2R3J48J14J73J53J62J46R1
3251E62Om2j8m1j14j92j48q4j33k09j42k0J7J3J9J04J92J53Q1J04J98J89P3J5
3275E83OJ7r1j75j73j04j22j75j72q6m4p5m6O2J54J20J31J64J98J50Q2O9J04M1
3299F18l5r4o9j10j95j99j51j23j07p9k7OjN7J31J76J16J59K18J78L5pN2O2r6
$$ [...]
8191d4
##END NTUPLES=NMR FID
##END=
