##TITLE=1H_LY-Prop
 CDCl3,8 sc, 
 23.9.2021
##JCAMPDX= 6.0         $$ Bruker NMR JCAMP-DX V2.0
##DATA TYPE= NMR FID
##DATA CLASS= NTUPLES
##ORIGIN= UXNMR, Bruker Analytische Messtechnik GmbH
##OWNER= root
$$ XWIN-NMR		Version 3.5
$$ Thu Sep 23 11:16:04 2021 Russian Standard Time (UT+4h)  she@DPX200
##.OBSERVE FREQUENCY= 200.1314
##.OBSERVE NUCLEUS= ^1H
##.DELAY= (6, 6)
##.ACQUISITION MODE= SIMULTANEOUS
##.ACQUISITION SCHEME= undefined
##.AVERAGES= 8
##.DIGITISER RES= 18
##SPECTROMETER/DATA SYSTEM= spect
##.PULSE SEQUENCE= zg30
##.SOLVENT NAME= CDCl3
##.SHIFT REFERENCE= (INTERNAL, CDCl3, 0, 15.7039)
##AUDIT TRAIL= $$ (NUMBER, WHEN, WHO, WHERE, WHAT)
$$ ##TITLE= Audit trail, XWIN-NMR		Version 3.5
$$ ##JCAMPDX= 5.01
$$ ##ORIGIN= Bruker BioSpin GmbH
$$ ##OWNER= she
$$ F:/spectra/data/she/nmr/H-F/1/audita.txt
$$ ##AUDIT TRAIL=  $$ (NUMBER, WHEN, WHO, WHERE, WHAT)
(   1,<2021-09-23 11:14:18.53 +0400>,<she>,<DPX200>,
      <created by zg, POWCHK disabled, PULCHK disabled
       configuration hash MD5:
       00 E9 B6 7A A2 85 ED C7 34 08 36 98 17 FE 4E 26
       data hash MD5: 16K
       A5 10 22 DC 00 F3 28 14 B8 07 93 6E 72 D6 7C B0>)
$$ ##END=
$$ 
$$ hash MD5
$$ F8 FC D4 76 0F 98 E6 7E 0C F4 5D 51 52 D5 59 49
##$RELAX= 
##$RELAX= 
##$RELAX= 
##$RELAX= 
##$RELAX= 
##$RELAX= 
$$ Bruker specific parameters
$$ --------------------------
##$DU= <F:/spectra>
##$EXPNO= 1
##$NAME= <H-F>
##$PROCNO= 1
##$TYPE= <nmr>
##$USER= <she>
##$AMP= (0..31)
100 100 100 100 100 100 100 100 100 100 100 100 100 100 100 100 100 100 
100 100 100 100 100 100 100 100 100 100 100 100 100 100 
##$AQSEQ= 0
##$AQ_mod= 1
##$AUNM= <au_zg>
##$AUTOPOS= <>
##$BF1= 200.13
##$BF2= 200.13
##$BF3= 200.13
##$BF4= 200.13
##$BF5= 200.13
##$BF6= 200.13
##$BF7= 200.13
##$BF8= 200.13
##$BYTORDA= 1
##$CFDGTYP= 0
##$CFRGTYP= 5
##$CHEMSTR= <none>
##$CNST= (0..31)
1 1 145 1 1 1 1 1 1 1 1 1 1 1 1 1 1 1 1 1 1 1 1 1 1 1 1 1 1 1 1 1 
##$CPDPRG= <>
##$CPDPRG1= <>
##$CPDPRG2= <>
##$CPDPRG3= <>
##$CPDPRG4= <mlev>
##$CPDPRG5= <mlev>
##$CPDPRG6= <mlev>
##$CPDPRG7= <mlev>
##$CPDPRG8= <mlev>
##$CPDPRGB= <>
##$CPDPRGT= <>
##$D= (0..31)
0 1.2 0 0 0 0 0 0 0 0.06 0 0.03 0 0 0 0 0.0002 0 0 0 0 0 0 0 0 0 0 0 0 
0 0 0 
##$DATE= 1632381257
##$DBL= (0..7)
120 120 120 120 120 120 120 120 
##$DBP= (0..7)
150 150 150 150 150 150 150 150 
##$DBP07= 0
##$DBPNAM0= <>
##$DBPNAM1= <>
##$DBPNAM2= <>
##$DBPNAM3= <>
##$DBPNAM4= <>
##$DBPNAM5= <>
##$DBPNAM6= <>
##$DBPNAM7= <>
##$DBPOAL= (0..7)
0.5 0.5 0.5 0.5 0.5 0.5 0.5 0.5 
##$DBPOFFS= (0..7)
0 0 0 0 0 0 0 0 
##$DE= 6
##$DECBNUC= <off>
##$DECIM= 32
##$DECNUC= <off>
##$DECSTAT= 4
##$DIGMOD= 1
##$DIGTYP= 9
##$DL= (0..7)
0 120 120 120 120 120 120 120 
##$DP= (0..7)
150 150 150 150 150 150 150 150 
##$DP07= 0
##$DPNAME0= <>
##$DPNAME1= <>
##$DPNAME2= <>
##$DPNAME3= <>
##$DPNAME4= <>
##$DPNAME5= <>
##$DPNAME6= <>
##$DPNAME7= <>
##$DPOAL= (0..7)
0.5 0.5 0.5 0.5 0.5 0.5 0.5 0.5 
##$DPOFFS= (0..7)
0 0 0 0 0 0 0 0 
##$DQDMODE= 0
##$DR= 18
##$DS= 0
##$DSLIST= <SSSSSSSSSSSSSSS>
$$ [...]
##$SUBNAM2= <"">
##$SUBNAM3= <"">
##$SUBNAM4= <"">
##$SUBNAM5= <"">
##$SUBNAM6= <"">
##$SUBNAM7= <"">
##$SUBNAM8= <"">
##$SUBNAM9= <"">
##$SW= 20.0188988654967
##$SWIBOX= (0..15)
0 0 2 0 0 0 0 0 0 0 0 0 0 0 0 0 
##$SW_h= 4006.41025641026
##$TD= 16384
##$TD0= 1
##$TE= 0
##$TE2= 300
##$TE3= 300
##$TEG= 300
##$TL= (0..7)
0 120 120 120 120 120 120 120 
##$TP= (0..7)
150 150 150 150 150 150 150 150 
##$TP07= 0
##$TPNAME0= <>
##$TPNAME1= <>
##$TPNAME2= <>
##$TPNAME3= <>
##$TPNAME4= <>
##$TPNAME5= <>
##$TPNAME6= <>
##$TPNAME7= <>
##$TPOAL= (0..7)
0.5 0.5 0.5 0.5 0.5 0.5 0.5 0.5 
##$TPOFFS= (0..7)
0 0 0 0 0 0 0 0 
##$TUNHIN= 0
##$TUNHOUT= 0
##$TUNXOUT= 0
##$USERA1= <user>
##$USERA2= <user>
##$USERA3= <user>
##$USERA4= <user>
##$USERA5= <user>
##$V9= 5
##$VALIST= <valist>
##$VCLIST= <CCCCCCCCCCCCCCC>
##$VD= 0
##$VDLIST= <DDDDDDDDDDDDDDD>
##$VPLIST= <PPPPPPPPPPPPPPP>
##$VTLIST= <TTTTTTTTTTTTTTT>
##$WBST= 1024
##$WBSW= 4
##$XGAIN= (0..3)
0 0 0 0 
##$XL= 0
##$YL= 0
##$YMAX_a= 162698
##$YMIN_a= -161768
##$ZGOPTNS= <>
##$ZL1= 120
##$ZL2= 120
##$ZL3= 120
##$ZL4= 120
##$ABSF1= 10
##$ABSF2= 0
##$ABSG= 5
##$ABSL= 3
##$ALPHA= 0
##$AQORDER= 0
##$ASSFAC= 0
##$ASSFACI= 0
##$ASSFACX= 0
##$ASSWID= 0
##$AUNMP= <proc_1d>
##$AZFE= 0.1
##$AZFW= 0.1
##$BCFW= 1
##$BC_mod= 2
##$BYTORDP= 1
##$COROFFS= 0
##$CY= 11.3945322036743
##$DATMOD= 1
##$DC= 2
##$DFILT= <>
##$DTYPP= 0
##$F1P= 2.36226072786647
##$F2P= -0.459571619588291
##$FCOR= 0.5
##$FTSIZE= 0
##$FT_mod= 4
##$GAMMA= 1
##$GB= 0.15
##$INTBC= 1
##$INTSCL= 1
##$ISEN= 128
##$LB= 0.24
##$LEV0= 0
##$LPBIN= 0
##$MAXI= 10000
##$MC2= 0
##$MEAN= 0
##$ME_mod= 0
##$MI= 1.114404
##$NCOEF= 0
##$NC_proc= 0
##$NLEV= 6
##$NOISF1= 3.799351
##$NOISF2= 2.8
##$NSP= 1
##$NTH_PI= 0
##$NZP= 0
##$OFFSET= 15.70392
##$PC= 1
##$PHC0= -14153.17
##$PHC1= 12.20088
##$PH_mod= 1
##$PKNL= yes
##$PPARMOD= 0
##$PSCAL= 0
##$PSIGN= 0
##$REVERSE= no
##$SF= 200.130013532006
##$SI= 16384
##$SIGF1= 3
##$SIGF2= 2
##$SINO= 400
##$SIOLD= 16384
##$SREGLST= <1H.CDCl3>
##$SSB= 0
##$STSI= 0
##$STSR= 0
##$SW_p= 3612.71676300578
##$SYMM= 0
##$S_DEV= 0
##$TDeff= 0
##$TDoff= 0
##$TI= <>
##$TILT= no
##$TM1= 0
##$TM2= 0
##$TOPLEV= 0
##$USERP1= <user>
##$USERP2= <user>
##$USERP3= <user>
##$USERP4= <user>
##$USERP5= <user>
##$WDW= 1
##$XDIM= 8192
##$YMAX_p= 0
##$YMIN_p= 0
$$ End of Bruker specific parameters
$$ ---------------------------------
##NTUPLES= NMR FID
##VAR_NAME=  TIME,          FID/REAL,        FID/IMAG
##SYMBOL=    X,             R,               I
##VAR_TYPE=  INDEPENDENT,   DEPENDENT,       DEPENDENT
##VAR_FORM=  AFFN,          ASDF,            ASDF
##VAR_DIM=   8192,          8192,            8192
##UNITS=     SECONDS,       ARBITRARY UNITS, ARBITRARY UNITS
##FACTOR=    0.0002496,     1,               1
##FIRST=     0,             0,               0
##LAST=      2.0444736,     0,               0
##MIN=       0,             -161768,         0
##MAX=       2.0444736,     162698,          0
$$ Real data points
##PAGE= N=1
##DATA TABLE= (X++(R..R)), XYDATA
0 0 0 0 0 0 0 0 0 0 0 0 0 0 0 0 0 0 0 0 0 -5 5 -8 8 -8 8 -8 12 -16 16 -16 21 -24 24 -29 32 -37 40 -46 52 -57 62
41 62 -69 77 -85 94 -105 117 -128 142 -154 171 -188 209 -230 254 -283 314 -350 394 -446 508 -585
62 -585 684 -817 1003 -1286 1757 -2711 5385 -29541 -118868 -124564 -133140 -155940 -161768 -129413 -74343
77 -74343 -9988 31542 60828 108662 160770 162698 132047 112212 86414 34407 -15368 -63768
89 -63768 -114476 -137784 -133497 -133852 -125971 -88411 -38235 11679 62519 92466 106617 136946 155546
102 155546 118768 66192 41453 15930 -35992 -91161 -125814 -131492 -114906 -106579 -106955 -66428 7854
115 7854 49571 61892 91608 126094 134563 118737 85402 46575 18528 -12249 -63520 -106078
127 -106078 -113548 -111760 -111517 -90726 -59385 -29984 15700 64614 84942 92747 109319 114596 94914
140 94914 61552 20931 -14865 -34307 -61848 -106622 -121482 -93972 -73573 -70172 -46856 203
152 203 45530 74593 83720 86515 101712 106170 68728 22034 2445 -17455 -56065 -86848 -99266
165 -99266 -99495 -84346 -63003 -46258 -18428 25177 58037 73842 88269 92975 82858 73694 54326
178 54326 10684 -26671 -40350 -57275 -84578 -97743 -88630 -65776 -38511 -20320 -4479 34116
190 34116 77326 83431 70195 75300 80165 57621 20834 -11880 -34635 -47217 -64160 -88590 -90813
203 -90813 -63923 -42611 -32274 -7087 26973 51167 69695 80242 74529 65473 58457 36850 3199
216 3199 -23850 -45257 -62850 -68914 -73346 -79052 -61295 -24270 -3090 6138 31236 63077 77926
229 77926 74602 61664 49768 44331 25817 -16110 -47369 -48929 -53126 -72329 -77188 -59195 -35257
242 -35257 -12744 5438 21085 45429 69960 71908 60000 54943 45834 22303 -1298 -22666 -47291
255 -47291 -61052 -60188 -62002 -63442 -47988 -22371 965 21836 36388 47254 65539 75607 57265
268 57265 33406 27305 17343 -12622 -42535 -56142 -57519 -55133 -56933 -56792 -35026 26 17435
281 17435 22176 40641 62815 66160 56866 44812 29554 15016 -1549 -27245 -48999 -54290 -55224
294 -55224 -57262 -49261 -34526 -19897 3082 29095 39967 43748 55731 62964 52256 33074 14688
307 14688 -363 -12183 -31050 -56014 -62597 -47960 -41031 -44057 -30602 -1118 22074 33529 40009
320 40009 47378 57674 58171 38038 15689 7384 -3834 -27909 -46236 -51400 -52539 -48418 -38306
333 -38306 -28533 -14071 9025 28232 38132 46266 50611 48086 44281 33445 9279 -10998 -17282
346 -17282 -27616 -47464 -56969 -49580 -37064 -26606 -18593 -6384 18202 41536 43769 38310 45751
359 45751 50983 35706 13087 -2100 -12966 -24091 -37683 -51110 -51671 -38554 -28888 -23685 -8369
372 -8369 12694 26813 37208 45517 44782 39933 36678 26042 6230 -11052 -23031 -32790 -39096 -44800
386 -44800 -48399 -37631 -16931 -6496 -2191 14921 37147 45268 41375 36877 34874 31342 17109
399 17109 -7372 -23344 -24618 -30443 -45108 -48262 -35875 -23013 -13435 -2334 10638 25999 39414
412 39414 41928 37644 35926 30882 17079 2816 -9958 -25207 -35150 -35893 -37782 -40726 -32906 -16432
426 -16432 -2189 8216 17336 27670 40420 45511 34925 23133 21717 15563 -5189 -24388 -30473
439 -30473 -31429 -34771 -38815 -36745 -22502 -3952 4858 9547 23534 38315 39950 34483 30149 23376
453 23376 13077 1270 -13258 -26324 -32037 -34359 -36112 -32598 -24859 -15787 -1564 14329 21720
466 21720 25094 34127 40712 34413 21865 12479 5471 -3891 -18597 -33447 -36407 -29517 -28410 -31435
480 -31435 -21891 -2325 10705 15888 22139 30957 37506 35755 24824 14222 9069 121 -15724 -27071
494 -27071 -30321 -32331 -32360 -27011 -19820 -11084 1921 14751 22707 27868 31232 31858 30183 22735 8144
509 8144 -3494 -7757 -15649 -29741 -36349 -30936 -23836 -20448 -16076 -5321 10999 23271 24651 24498
523 24498 31256 33980 23311 9643 2271 -4128 -14192 -24773 -31458 -31245 -26064 -21802 -17272 -6767
537 -6767 5978 14775 21928 28392 29406 26644 24460 18819 6806 -5238 -12938 -18600 -24360 -29930
551 -29930 -31558 -24283 -13004 -7603 -3869 8431 23131 27696 24978 24466 25796 22200 10827 -3046
565 -3046 -10886 -13558 -20290 -29805 -30722 -23023 -16591 -12100 -4075 6512 16079 22926 25831 25863 24809 20579
581 20579 12484 4054 -4570 -14666 -21564 -22983 -24618 -26899 -22679 -11991 -2707 2911 9036 18002
595 18002 26530 28121 22151 17195 16589 10952 -3035 -14457 -17386 -18968 -23821 -27048 -23367 -13980 -5121
610 -5121 -162 5615 15844 24006 24513 22250 21074 17214 9358 918 -7041 -14737 -20337 -23027 -23291
625 -23291 -21277 -17491 -11470 -1918 7744 12652 15837 22146 26477 22515 14608 9577 5873 -1611 -12494
640 -12494 -20539 -21375 -19301 -20600 -21377 -13894 -2133 4743 7940 13822 21229 24359 21678 16493 12208
655 12208 7756 -88 -9605 -15678 -18479 -21183 -22038 -18570 -13290 -8031 -877 7773 14337 17633 19596
670 19596 21203 20679 15288 6506 -7 -3515 -9786 -18890 -22841 -19707 -16223 -15356 -12254 -3609 6611
685 6611 12478 14113 16980 21723 21763 14973 7941 4071 -998 -9216 -16320 -19145 -19154 -18462 -16607 -11842 -4588
702 -4588 2266 7786 13573 18548 19580 17912 16474 13394 6154 -2257 -7687 -11138 -15659 -20307 -20810
717 -20810 -15914 -10174 -7142 -3193 5550 14266 16888 16115 17344 18672 14950 6766 -467 -4394 -8389
732 -8389 -14786 -19737 -19105 -15432 -12897 -9816 -3296 4462 9922 13481 16803 18727 17428 13469 9008
747 9008 4341 -2016 -9324 -14002 -15382 -16823 -18334 -15832 -9057 -2860 881 5407 12350 17851 18043
762 18043 15160 13615 12462 7065 -1811 -8096 -10368 -13083 -17407 -18839 -15124 -9706 -5844 -2013 4366
777 4366 11343 15018 15553 15965 15973 12621 6515 1022 -3371 -8617 -14002 -16514 -15894 -14570 -13046 -9017 -2081
794 -2081 4332 7840 10868 15359 18056 15743 11071 7966 5077 -914 -8505 -13002 -13711 -14370 -16013 -14880
810 -14880 -9133 -2690 1152 4651 10259 15336 16270 14318 12650 10782 6086 -670 -6014 -9169 -12346
825 -12346 -15651 -16187 -13150 -9464 -6487 -2067 4464 9937 12237 13356 15031 15098 11209 5477 1344 -1893
841 -1893 -7003 -12829 -15193 -13912 -12607 -11999 -8891 -2436 3709 6954 9495 13317 15930 14414 10477
856 10477 7427 4585 -630 -7077 -11074 -12233 -13314 -14530 -12996 -8149 -3159 278 4174 9513 13548
871 13548 13948 12671 11975 10241 5344 -853 -5016 -7531 -10942 -14396 -14655 -11609 -8461 -6150 -2224 3889
887 3889 8939 10884 11848 13519 13660 10150 5063 1429 -1607 -6344 -11410 -13380 -12477 -11615 -11006 -7866
903 -7866 -2050 3053 5794 8486 12291 14393 12687 9339 7027 4478 -541 -6403 -9746 -10737 -11966
918 -11966 -13256 -11751 -7332 -3033 -56 3601 8493 11996 12355 11476 10992 9280 4773 -518 -4000 -6535
934 -6535 -10016 -13024 -12874 -10239 -7985 -6123 -2143 3672 7870 9269 10382 12404 12649 9121 4452 1562
950 1562 -946 -5431 -10257 -12051 -11093 -10355 -9978 -7336 -2167 2536 5186 7546 10771 12644 11406 8784
966 8784 6609 3849 -696 -5350 -8099 -9591 -11252 -12040 -10074 -6268 -3176 -691 3292 8160 10772
981 10772 10436 10028 10387 8753 3988 -951 -3543 -5354 -8788 -12104 -11945 -8949 -6675 -5425 -2262 3117
997 3117 7306 8701 9420 10767 10996 8414 4450 1287 -1455 -5119 -8788 -10386 -10227 -9945 -8913 -5780
1013 -5780 -1608 1588 4111 7354 10433 11116 9395 7686 6643 4000 -1143 -5598 -7008 -7715 -10003
1028 -10003 -11544 -9417 -5194 -2344 -748 2315 7039 10153 9876 8672 8717 7954 4207 -472 -3441 -5326
1044 -5326 -7794 -10053 -10384 -8834 -6691 -4423 -1298 2546 5576 7374 9105 10455 9451 6546 4209
1059 4209 2449 -884 -5394 -8341 -8650 -8320 -9029 -8978 -5665 -750 1973 2914 5557 9499 10770 8630
1075 8630 6379 5506 3932 -19 -4646 -7055 -7394 -8245 -9609 -8752 -5549 -2523 -167 2745 5862 7927
1091 7927 8872 9071 8270 6207 3206 322 -2019 -4740 -8072 -9602 -8322 -6963 -6882 -5325 -942 3410
1107 3410 5175 5728 7459 9826 9635 6054 2692 1755 254 -4051 -8004 -8568 -7547 -7468 -7475 -5606 -1832
1124 -1832 1835 3846 5258 7475 9061 8419 6715 5035 2501 -730 -3194 -5122 -7438 -8947 -8432
1139 -8432 -6570 -4709 -3251 -1060 2899 6627 7316 6529 7582 8806 6528 2058 -731 -1662 -3373 -6696
1155 -6696 -9382 -8702 -5954 -4800 -4780 -2185 2576 5430 5956 6658 7841 8002 6460 3686 882 -1224
1171 -1224 -3363 -5852 -7412 -7731 -7677 -6437 -3677 -1397 0 2640 6208 7844 7227 6401 6262 5714 2985
1188 2985 -1477 -4212 -4132 -4994 -8126 -9246 -6351 -3238 -2216 -1289 1566 5421 7663 7038 5936 6538
1204 6538 6443 3242 -529 -2389 -3750 -5687 -7090 -7517 -7042 -5222 -2843 -862 1237 3565 5485 7130
1220 7130 7874 6376 4306 3859 2809 -1068 -4800 -5647 -5361 -6140 -7399 -6972 -3801 -40 1104 1186 4086
1237 4086 7868 7990 5624 4631 4629 3177 -56 -3552 -5310 -5252 -5748 -7249 -6847 -4115 -1815 -155 2122
1254 2122 4104 5323 6757 7379 5913 3867 2530 993 -1240 -3901 -6371 -6804 -5319 -5111 -6137 -4283
1270 -4283 235 2809 2857 3645 5958 7760 6998 3953 1796 1941 844 -3378 -6400 -5891 -5068 -5735 -5764
1287 -5764 -4149 -1487 1389 3016 3636 5132 6828 6499 5021 3673 1682 -532 -1724 -3410 -6121
1302 -6121 -7036 -5486 -4307 -4110 -3133 -703 2626 4968 4707 4138 6092 7398 4478 720 -117 -240 -2394
1319 -2394 -5381 -6995 -6111 -4034 -3628 -4188 -1938 2263 4032 3845 4716 5921 5883 4966 3061 497 -1024
1336 -1024 -1928 -3864 -5642 -5987 -5651 -4536 -2500 -1423 -843 1974 5351 5601 4355 4684 5467 4535 1821
1353 1821 -1399 -2815 -2288 -3454 -6734 -7143 -3908 -2034 -2411 -1476 1392 4181 5493 4929 4108 4947 5227
1370 5227 2430 -692 -1573 -2432 -4152 -5071 -5457 -5549 -3897 -1562 -664 216 2442 4475 5446 5536 4252 3096
1388 3096 3500 2526 -1452 -4134 -3443 -3239 -5017 -6097 -4912 -2263 87 375 349 3262 6466 5667 3385
1405 3385 3543 4011 2300 -323 -2614 -3888 -3725 -3943 -5453 -5355 -2895 -1074 -183 1460 2894 3708 5204
1422 5204 5852 3959 2265 2284 1427 -1103 -3409 -4649 -4519 -3512 -4011 -5180 -3056 1019 2049 1169 2536
1439 2536 5111 5915 4701 2608 1432 1875 856 -2918 -5061 -3858 -3363 -4567 -4504 -2905 -1088 998
1455 998 2338 2477 3487 5241 5097 3517 2467 1259 -230 -948 -2466 -5024 -5288 -3297 -2931 -3786 -2647
1472 -2647 51 2307 3383 2989 2969 5008 5863 2752 -86 448 513 -2132 -4514 -4929 -4119 -2900 -2837 -3400
1490 -3400 -1426 2100 3048 2426 3430 4654 4335 3612 2344 149 -924 -1027 -2672 -4611 -4657 -3881 -3120
1507 -3120 -1914 -1353 -915 1783 4509 3809 2500 3785 4826 3223 742 -1048 -1601 -1337 -2720 -5499
1523 -5499 -5283 -2249 -1424 -2549 -1369 1516 3204 3747 3507 3065 3807 4151 1790 -754 -1026 -1445 -3083
1540 -3083 -3866 -4052 -4301 -2928 -884 -684 -497 1805 3824 4022 3693 3057 2624 3103 2040 -1505 -3199
1557 -3199 -1813 -1993 -4389 -4990 -3263 -1426 -328 -236 50 2631 5074 3941 2093 2982 3643 1720 -415
1574 -415 -1678 -2632 -2699 -2854 -4197 -4329 -2199 -704 -444 669 1984 2713 4013 4519 2720 1520 2309
1591 2309 1697 -1071 -2863 -3128 -2943 -2729 -3475 -4244 -2159 1101 1160 41 1940 4463 4390 3059 2025
1608 2025 1572 1770 745 -2334 -3806 -2512 -2338 -3823 -3682 -2104 -901 479 1650 1668 2390 4131 4117
1625 4117 2521 1759 1295 252 -521 -1904 -3972 -3867 -2058 -2326 -3635 -2243 480 1737 1924 1925 2472
1642 2472 4178 4487 1775 -115 1009 904 -1933 -3697 -3369 -2825 -2463 -2522 -2751 -1143 1628 2149 1462
1659 1462 2550 3822 3402 2743 1953 232 -568 -384 -1827 -3823 -3657 -2650 -2327 -1885 -1454 -804 1487
1676 1487 3450 2480 1529 3298 4258 2287 208 -402 -556 -910 -2367 -4342 -3832 -1455 -1331 -2597 -1235
1693 -1235 1436 2361 2379 2577 2555 3071 3341 1519 -515 -522 -722 -2248 -3061 -3143 -3350 -2326 -728 -868 -898 1330
1713 1330 3200 2916 2383 2448 2538 2690 1530 -1203 -2160 -807 -1417 -3885 -4044 -2161 -1080 -899 -688 59
1731 59 2122 3777 2769 1515 2643 3250 1362 -373 -948 -1629 -2028 -2246 -3288 -3544 -1811 -587 -638
1748 -638 78 1384 2163 3136 3462 2051 1315 2302 1690 -976 -2295 -1930 -1897 -2416 -3147 -3383 -1557 703
1766 703 350 -429 1634 3809 3248 2026 1830 1814 1597 506 -1716 -2703 -1750 -1820 -3281 -3144 -1672 -838
1784 -838 13 1003 1191 1775 3302 3417 1959 1390 1407 676 -302 -1561 -3023 -2791 -1505 -2144 -3354 -1868
1802 -1868 573 1095 836 1326 2335 3479 3342 1352 304 1350 955 -1657 -2932 -2265 -2044 -2340 -2381
1819 -2381 -2225 -985 954 1381 929 1937 3143 2810 2205 1701 504 -128 -30 -1275 -3092 -2939 -1903
1836 -1903 -1900 -2024 -1539 -602 1148 2372 1597 1217 2960 3663 1711 128 241 169 -755 -2133 -3294 -2779
1854 -2779 -1278 -1490 -2430 -1066 1162 1617 1485 1995 2311 2556 2633 1375 -131 -211 -330 -1646 -2523 -2580 -2610
1873 -2610 -1915 -855 -1019 -960 1006 2585 2101 1597 2139 2524 2243 1047 -790 -1210 -361 -1249 -3332 -3199
1891 -3199 -1458 -967 -1272 -842 246 1719 2637 1982 1381 2354 2722 1092 -255 -457 -981 -1620 -1925 -2595
1909 -2595 -2805 -1591 -603 -699 -246 974 1834 2428 2534 1648 1328 2103 1448 -814 -1704 -1120 -1286 -2213 -2777
1928 -2777 -2479 -1103 167 -198 -442 1417 3017 2334 1401 1718 1907 1319 285 -1088 -1709 -1276 -1533 -2641
1946 -2641 -2522 -1362 -764 -289 517 865 1366 2514 2667 1582 1153 1391 852 -238 -1292 -2107 -1915 -1292
1964 -1292 -1994 -2792 -1459 425 545 187 981 2156 2725 2309 1142 735 1368 754 -1303 -2091 -1482 -1518
1982 -1518 -2125 -2118 -1679 -821 379 772 675 1473 2445 2273 1766 1429 701 209 113 -932 -2322 -2220 -1418 -1576
2002 -1576 -1961 -1484 -397 806 1395 997 1132 2520 2876 1275 262 654 511 -677 -1803 -2297 -1903
2019 -1903 -1259 -1582 -2028 -876 718 976 876 1512 2024 2098 2035 1289 286 78 -78 -1085 -1916 -2046 -1969
2038 -1969 -1577 -1029 -1101 -884 652 1817 1426 1118 1836 2307 1818 727 -273 -408 -142 -1128 -2600 -2342
2056 -2342 -1129 -1047 -1468 -907 249 1196 1610 1399 1359 2044 2133 998 98 -29 -489 -1175 -1544 -1960 -2154 -1460
2076 -1460 -753 -760 -470 536 1387 1778 1759 1382 1401 1850 1215 -421 -1003 -549 -872 -1909 -2314 -1799 -911 -412
2096 -412 -595 -362 1080 2086 1584 1116 1602 1803 1118 261 -489 -901 -937 -1313 -2006 -1953 -1250 -837 -507 91
2116 91 530 992 1798 2024 1368 1087 1326 979 -14 -886 -1299 -1209 -1151 -1786 -2185 -1180 47 20 -170 691 1753
2137 1753 1980 1566 1079 1066 1258 563 -786 -1250 -942 -1211 -1808 -1758 -1307 -783 -148 272 485 1064 1724 1760
2157 1760 1476 1217 811 473 211 -583 -1553 -1566 -1092 -1316 -1717 -1315 -346 413 634 592 1039 1975 2042 1023
2177 1023 502 842 586 -500 -1315 -1440 -1262 -1228 -1519 -1527 -691 227 407 525 1138 1569 1581 1500 1164 572 241
2198 241 -6 -639 -1297 -1543 -1482 -1252 -1062 -1056 -737 342 1103 910 833 1496 1899 1392 604 147 122 -68 -959
2219 -959 -1795 -1576 -967 -1074 -1348 -785 130 674 867 1003 1281 1622 1530 914 418 206 -235 -802 -1124 -1414
2239 -1414 -1595 -1292 -842 -723 -516 179 928 1247 1221 1134 1329 1520 957 -74 -418 -252 -651 -1507 -1758 -1294
2259 -1294 -825 -732 -722 -201 764 1274 1060 1012 1432 1495 907 325 -48 -383 -730 -1105 -1432 -1405 -1148 -876 -563
2280 -563 -108 262 684 1237 1466 1163 995 1122 898 133 -537 -777 -782 -1012 -1498 -1586 -917 -267 -276 -229 532 1288
2302 1288 1364 1085 1028 1149 1025 371 -362 -597 -647 -1014 -1407 -1327 -1003 -751 -414 26 394 764 1130 1301 1266
2323 1266 1033 748 546 259 -327 -985 -1075 -921 -1095 -1362 -1098 -390 93 186 355 896 1431 1369 860 701 849
2344 849 494 -307 -812 -834 -881 -1133 -1293 -1079 -576 -174 29 357 827 1104 1123 1144 1043 686 317 59 -281
2365 -281 -782 -1121 -1137 -978 -938 -953 -617 64 546 551 647 1132 1401 1075 587 401 363 -22 -703 -1082 -990 -868 -1055
2388 -1055 -1089 -631 -49 213 377 718 1067 1167 1041 849 677 370 -75 -452 -676 -920 -1162 -1092 -811 -650
2408 -650 -518 -111 474 814 832 868 1093 1172 778 226 -2 -55 -465 -1026 -1187 -947 -789 -842 -711 -176 369 577
2430 577 639 894 1170 1093 746 486 305 -33 -499 -779 -891 -985 -1041 -895 -561 -242 -19 287 754 1005 948 861
2452 861 933 842 373 -146 -354 -448 -757 -1130 -1135 -784 -546 -511 -286 291 742 809 785 963 1083 817 370 90 -77
2475 -77 -389 -826 -1019 -942 -857 -846 -634 -190 185 384 614 928 1073 935 716 615 430 -16 -490 -674 -705 -875
2497 -875 -1079 -948 -535 -230 -104 146 634 962 925 811 853 832 465 -35 -293 -407 -684 -1004 -1035 -807 -620
2518 -620 -532 -277 203 568 678 762 945 1005 742 389 215 34 -364 -790 -900 -828 -829 -861 -648 -202 133 288
2540 288 504 844 1027 887 677 603 452 44 -407 -604 -660 -838 -998 -884 -549 -303 -165 108 562 846 813
2561 813 757 864 827 451 20 -185 -314 -611 -936 -967 -757 -618 -563 -305 149 493 604 687 886 950 724 441
2583 441 263 62 -315 -664 -784 -753 -826 -857 -597 -198 47 183 456 823 964 795 643 651 517 72 -365 -498
2605 -498 -542 -766 -989 -908 -551 -319 -216 23 455 770 792 735 812 784 500 131 -104 -305 -579 -815 -875 -766
2627 -766 -696 -583 -282 116 350 473 684 937 912 643 439 369 161 -309 -696 -723 -651 -772 -924 -689 -218 50
2649 50 113 331 725 940 837 643 583 508 181 -246 -497 -581 -731 -882 -841 -637 -441 -223 92 423 614 700
2671 700 821 888 747 404 155 47 -182 -633 -898 -784 -641 -691 -688 -345 146 402 407 536 867 987 708 381
2693 381 292 201 -169 -589 -747 -727 -727 -769 -671 -373 -45 172 383 648 783 773 748 685 435 75 -128 -276 -535
2716 -535 -818 -920 -733 -502 -480 -406 12 519 650 547 658 909 863 454 93 -21 -90 -423 -840 -898 -662 -575
2738 -575 -604 -416 -21 304 485 612 715 800 757 561 337 91 -205 -438 -547 -700 -893 -821 -497 -286 -233 -26
2760 -26 391 735 775 617 621 783 631 102 -273 -248 -321 -684 -956 -821 -532 -344 -321 -144 300 660 690 615 728
2783 728 759 556 276 22 -248 -460 -584 -715 -803 -733 -562 -280 -12 105 283 645 907 740 504 545 568 236
2805 236 -261 -520 -492 -486 -730 -938 -674 -200 -55 -99 167 623 831 743 610 586 566 353 -73 -381 -443 -561 -746
2828 -746 -762 -665 -536 -264 66 211 329 601 830 816 631 399 291 263 -75 -595 -765 -549 -549 -793 -773 -350
2850 -350 61 205 222 402 798 965 643 355 409 372 -46 -443 -589 -637 -648 -675 -693 -520 -150 109 250 455
2872 455 629 711 802 743 391 118 101 -70 -492 -786 -754 -608 -531 -594 -529 -31 476 460 334 630 945 808 419
2895 419 179 115 40 -304 -759 -848 -576 -536 -665 -495 -100 178 390 552 609 700 815 681 349 121 -54 -247
2917 -247 -419 -650 -893 -746 -397 -372 -443 -114 412 641 598 542 649 831 655 84 -222 -77 -193 -693 -938
2938 -938 -734 -499 -425 -382 -229 193 615 620 516 668 778 585 315 81 -222 -386 -424 -640 -867 -744 -474 -286
2960 -286 -146 -7 222 648 878 631 440 664 688 208 -271 -379 -363 -472 -751 -956 -668 -185 -127 -245 113
2981 113 632 747 649 607 576 574 412 -15 -378 -404 -461 -694 -772 -682 -559 -273 57 110 186 603 881 755 537 454
3005 454 415 308 -64 -587 -677 -417 -524 -899 -783 -255 33 66 149 389 779 936 606 325 473 444 -38 -441
3027 -441 -511 -594 -638 -642 -688 -599 -168 138 188 349 584 707 792 707 332 130 234 13 -552 -768 -617 -531 -595 -641
3051 -641 -500 -7 428 345 243 660 1001 740 340 253 206 51 -286 -709 -795 -534 -502 -699 -521 -98 152 312
3073 312 510 540 629 835 709 289 103 45 -156 -414 -668 -848 -682 -337 -418 -542 -94 491 564 437 534 719
3095 719 827 610 77 -153 30 -138 -727 -900 -603 -464 -488 -402 -218 151 562 599 454 628 813 598 303
3116 303 101 -185 -344 -345 -615 -922 -733 -370 -294 -274 -46 268 648 803 542 406 729 716 108 -317 -245 -264
3138 -264 -513 -777 -896 -608 -171 -150 -306 131 670 701 576 618 614 535 405 8 -379 -382 -378 -655 -788 -662 -517
3161 -517 -250 56 70 143 632 913 641 422 492 473 233 -146 -562 -594 -337 -538 -945 -712 -136 15 -31 132
3183 132 443 750 843 558 316 477 442 -69 -446 -440 -511 -613 -589 -649 -573 -125 182 147 263 599 736 737 617 311
3207 311 162 272 -9 -615 -729 -467 -477 -671 -640 -391 25 367 263 208 683 979 608 258 299 248 0 -318
3229 -318 -634 -711 -477 -453 -677 -507 -46 174 275 460 509 587 805 669 204 56 117 -107 -467 -669 -743 -574
3251 -574 -334 -439 -545 -23 530 465 314 541 757 750 471 61 -90 56 -168 -729 -831 -503 -423 -511 -384 -167
3273 -167 154 499 543 401 570 783 567 258 84 -133 -269 -296 -562 -859 -638 -257 -291 -320 -29 326 600
3294 600 656 464 421 725 656 28 -300 -134 -211 -543 -766 -750 -521 -192 -190 -285 142 637 603 461 573 611 484
3317 484 353 32 -342 -340 -306 -614 -778 -606 -423 -220 3 22 139 633 853 519 342 540 517 180 -197 -453
3339 -453 -454 -327 -560 -909 -609 -59 -19 -128 149 507 671 710 504 334 464 418 -92 -429 -385 -459 -604 -604 -617
3362 -617 -530 -112 174 94 208 587 745 653 532 310 218 254 -50 -618 -650 -362 -465 -721 -622 -277 55 262
3384 262 197 253 689 917 518 236 359 303 -53 -351 -565 -632 -471 -466 -655 -482 -34 157 234 421 512 583 759
3407 759 617 192 65 165 -99 -516 -667 -641 -495 -376 -472 -471 44 497 374 263 584 807 653 375 104
3428 104 -2 43 -220 -712 -755 -443 -426 -538 -373 -97 161 441 510 417 559 753 546 200 57 -88 -240 -344
3450 -344 -592 -827 -586 -245 -320 -372 -15 397 547 533 445 488 721 569 -20 -233 -53 -195 -614 -755 -628 -464
3472 -464 -267 -244 -215 175 612 562 434 576 635 469 302 35 -291 -322 -311 -592 -770 -586 -382 -237 -64 4
3494 4 192 618 779 470 354 594 532 112 -228 -361 -372 -384 -619 -843 -539 -93 -85 -164 174 544 638 623 531 427
3518 427 482 382 -58 -364 -337 -409 -598 -616 -591 -491 -139 123 82 209 590 743 598 464 366 297 234 -111 -578
3541 -578 -578 -339 -495 -753 -577 -182 38 136 184 337 708 819 474 267 391 301 -92 -345 -484 -560 -504 -511 -616
3564 -616 -448 -58 149 189 370 519 606 709 569 212 107 188 -100 -530 -654 -531 -486 -471 -521 -404 73 406
3586 406 293 263 615 797 560 301 160 77 -3 -281 -651 -670 -446 -438 -550 -360 -42 145 371 478 447 555
3608 555 721 529 209 77 -37 -216 -365 -601 -742 -537 -281 -360 -384 19 414 481 449 470 578 677 456 13
3630 13 -154 -24 -230 -640 -718 -557 -425 -338 -276 -144 193 525 511 421 576 622 434 257 40 -234 -308 -327 -573
3653 -573 -744 -551 -323 -229 -121 32 260 601 669 451 402 607 492 54 -219 -267 -324 -433 -658 -729 -457 -137
3675 -137 -151 -149 201 533 565 535 520 456 433 284 -51 -315 -343 -421 -577 -607 -540 -428 -153 70 68 213 564 708 549
3700 549 421 390 329 173 -157 -472 -481 -340 -523 -734 -506 -150 -8 44 177 398 648 696 459 330 400 256
3722 256 -102 -330 -406 -511 -532 -530 -561 -419 -104 96 166 320 496 602 652 521 251 169 174 -105 -491 -576 -482 -461
3746 -461 -527 -515 -322 60 279 236 306 633 752 529 316 260 153 -36 -302 -548 -569 -473 -499 -548 -347 -75 102
3769 102 285 429 472 557 651 521 242 86 -4 -176 -386 -595 -683 -518 -345 -416 -358 32 367 416 396 503 646
3792 646 633 399 81 -15 -20 -278 -602 -653 -514 -459 -431 -306 -112 166 412 462 463 585 605 450 283 67 -160 -274
3816 -274 -356 -563 -692 -565 -366 -278 -181 -3 272 536 572 446 476 601 448 59 -145 -187 -296 -497 -654 -638
3838 -638 -442 -251 -217 -118 209 479 514 511 578 542 440 266 12 -202 -307 -425 -575 -619 -566 -430 -197 -21 51
3861 51 219 532 651 541 444 441 373 162 -164 -387 -390 -413 -578 -690 -482 -189 -91 -17 201 446 604 601 488 434
3885 434 416 241 -75 -256 -371 -488 -560 -562 -538 -410 -160 50 168 312 489 608 640 520 337 240 167 -128 -440
3908 -440 -531 -467 -511 -590 -525 -282 9 167 203 369 621 679 506 358 318 180 -66 -307 -475 -526 -521 -542 -507 -331
3932 -331 -112 66 251 402 493 560 624 518 287 139 34 -149 -380 -563 -608 -502 -423 -439 -326 22 291 351
3954 351 395 548 658 575 367 171 72 -48 -311 -545 -583 -517 -499 -469 -310 -83 125 300 437 521 577 562 452
3977 452 313 102 -101 -253 -357 -529 -631 -548 -386 -293 -208 -5 282 475 509 481 538 587 406 101 -83 -135 -300
4000 -300 -529 -631 -572 -448 -347 -271 -73 206 380 462 527 591 530 404 244 55 -175 -328 -438 -526 -578 -554 -425
4023 -425 -233 -60 65 247 491 605 545 483 470 370 132 -143 -302 -354 -458 -597 -616 -438 -240 -138 -13 215
4045 215 445 534 532 519 494 377 175 -42 -205 -347 -491 -563 -538 -490 -391 -213 7 179 312 456 575 616 495
4068 495 346 247 114 -135 -382 -467 -468 -517 -555 -451 -225 -19 84 229 419 580 590 480 403 329 150 -106 -283
4091 -283 -390 -485 -561 -537 -439 -305 -163 12 226 389 461 516 553 493 315 140 10 -145 -356 -497 -549 -481 -452 -406
4115 -406 -244 13 209 305 398 539 599 504 346 238 100 -111 -328 -464 -491 -517 -531 -444 -253 -76 74 249 436
4138 436 531 533 493 439 316 109 -110 -242 -350 -493 -575 -533 -410 -305 -194 5 234 395 457 485 532 509 338 134
4162 134 3 -134 -324 -491 -546 -489 -452 -392 -230 -7 178 309 425 534 564 484 355 243 113 -117 -322 -427
4184 -427 -476 -527 -542 -435 -253 -80 50 229 423 517 528 481 451 332 122 -82 -229 -341 -470 -560 -524 -416 -302
4207 -302 -207 -12 221 374 437 482 549 502 339 161 34 -119 -310 -484 -519 -476 -458 -412 -249 -29 159 271 395
4230 395 514 560 480 368 245 116 -97 -309 -414 -473 -528 -533 -411 -259 -106 35 218 417 500 485 495 470 342
4253 342 114 -80 -197 -316 -472 -562 -517 -397 -313 -212 -24 218 382 436 470 527 518 347 157 15 -117 -303 -452
4276 -452 -504 -508 -455 -381 -236 -43 119 272 423 524 532 463 385 289 91 -139 -297 -383 -435 -533 -550 -404 -216 -98 11
4301 11 212 430 515 478 455 455 349 140 -74 -229 -298 -422 -540 -531 -409 -303 -172 -11 184 331 444 501 517 453
4325 453 337 196 57 -137 -342 -438 -457 -462 -505 -418 -197 -3 112 206 387 540 547 420 329 282 147 -104 -318 -391
4349 -391 -417 -481 -512 -437 -252 -72 46 191 365 496 504 479 423 290 139 -19 -190 -356 -471 -496 -471 -422 -356 -212
4373 -212 19 216 294 352 499 566 442 273 157 83 -82 -319 -486 -479 -415 -435 -423 -258 -10 171 248 354 470
4396 470 539 480 354 218 98 -54 -238 -386 -459 -492 -462 -352 -272 -147 53 269 375 416 444 498 471 291 74
4419 74 -61 -113 -286 -506 -554 -452 -345 -314 -236 -28 221 371 383 409 494 507 324 130 17 -102 -268 -403 -488
4442 -488 -494 -411 -319 -220 -73 104 270 420 474 442 405 402 291 50 -152 -236 -299 -413 -535 -513 -333 -169 -128 -44 209
4467 209 426 459 416 409 436 340 129 -93 -222 -260 -373 -516 -501 -372 -259 -150 -6 127 291 445 496 434 389 332
4491 332 226 57 -155 -324 -364 -354 -452 -505 -362 -128 2 53 180 379 516 501 335 281 303 156 -130 -308 -324
4514 -324 -360 -446 -466 -406 -223 -47 54 132 311 470 466 429 360 237 134 23 -177 -377 -426 -382 -402 -417 -332 -154 79
4539 79 206 223 307 497 554 375 209 180 103 -90 -312 -444 -414 -347 -388 -418 -223 34 148 188 301 416 476 447
4563 447 299 149 97 -25 -226 -364 -424 -439 -372 -295 -267 -164 79 279 294 312 409 482 408 226 35 -28 -56 -239
4587 -239 -482 -490 -320 -299 -307 -219 2 207 324 313 334 476 473 273 94 41 -91 -234 -333 -454 -465 -349 -243 -222 -110
4612 -110 88 248 365 404 358 356 409 280 -16 -141 -132 -231 -403 -489 -435 -274 -152 -154 -74 210 430 381 332 388 420 302
4638 302 117 -75 -186 -195 -308 -481 -476 -319 -229 -159 -34 87 244 419 443 346 326 349 223 17 -161 -291 -309 -309
4662 -309 -435 -508 -301 -62 -46 -12 169 380 467 420 309 275 322 173 -144 -284 -235 -307 -418 -440 -361 -211 -28 61
4686 61 94 272 455 446 390 335 237 154 52 -169 -367 -363 -296 -381 -425 -308 -109 61 166 169 268 494 517 282 163 205
4712 205 114 -109 -306 -392 -356 -300 -370 -409 -201 58 123 148 288 403 429 412 289 126 87 28 -199 -371 -379 -364 -349
4737 -349 -290 -264 -179 105 273 224 240 412 469 340 167 34 -8 -40 -255 -491 -424 -245 -287 -329 -191 33 190 274
4761 274 278 299 440 447 224 57 24 -72 -225 -321 -413 -435 -281 -206 -222 -108 138 286 319 351 341 378 391 205 -73 -134
4787 -134 -76 -238 -443 -452 -357 -236 -144 -147 -54 247 399 310 270 378 386 219 68 -84 -196 -190 -287 -462 -429 -248 -178 -141
4813 -141 -5 109 248 420 403 270 280 346 178 -47 -171 -231 -267 -292 -416 -448 -212 -14 -40 -35 221 393 393 342
4837 342 272 252 274 121 -182 -286 -203 -299 -430 -390 -290 -178 -18 53 73 260 436 394 295 270 218 122 22 -181
4861 -181 -359 -307 -241 -363 -421 -232 -34 71 123 172 296 483 443 201 144 224 105 -169 -310 -321 -326 -293 -345 -356 -146
4886 -146 92 107 117 294 397 389 361 232 84 68 13 -230 -387 -350 -318 -320 -276 -240 -111 154 261 192 233 442 441 254
4912 254 123 54 -1 -77 -281 -462 -354 -206 -275 -310 -125 92 186 246 265 295 399 385 159 15 22 -69 -254 -338 -391
4937 -391 -376 -253 -168 -203 -86 187 298 279 307 325 351 336 153 -104 -107 -65 -256 -449 -405 -253 -200 -146 -108 16 259
4962 259 375 276 257 378 353 163 20 -84 -170 -200 -281 -430 -380 -193 -138 -127 -2 142 254 367 347 224 252 320
4986 320 122 -115 -183 -192 -257 -314 -392 -366 -159 -2 -59 -16 261 397 327 287 267 247 220 52 -191 -239 -173 -268 -410 -341
5012 -341 -226 -128 1 77 101 246 419 353 232 237 202 79 -38 -216 -334 -270 -221 -377 -397 -171 14 27 82 184
5036 184 307 424 354 158 131 217 53 -214 -293 -280 -292 -297 -322 -298 -91 114 105 120 294 395 360 295 204 78 50 -13
5062 -13 -226 -378 -308 -264 -307 -278 -184 -54 143 219 174 239 429 392 170 93 72 -3 -135 -296 -411 -312 -198 -269 -305
5087 -305 -80 116 158 211 258 303 371 333 135 6 27 -72 -241 -316 -346 -330 -208 -153 -172 -49 201 285 233 266 329 331
5113 331 257 96 -104 -102 -72 -284 -441 -348 -213 -202 -175 -100 49 253 331 243 233 365 313 116 10 -66 -153 -216 -289
5138 -289 -385 -338 -176 -124 -122 2 166 251 337 323 241 275 295 94 -122 -163 -155 -240 -338 -380 -301 -133 -21 -65 25 261 369
5165 369 282 242 268 234 160 -6 -197 -233 -189 -292 -409 -331 -187 -106 -17 76 138 279 400 332 217 239 203 56 -79
5190 -79 -214 -292 -249 -244 -359 -339 -117 47 30 87 233 335 384 305 162 155 180 0 -234 -269 -244 -287 -314 -289 -228 -69
5216 -69 81 99 128 292 380 311 245 183 77 27 -50 -234 -344 -274 -242 -295 -265 -150 12 147 198 168 275 427 345
5241 345 140 104 87 -18 -165 -290 -342 -257 -207 -261 -243 -31 138 155 200 275 311 343 292 122 16 8 -81 -259 -327 -316
5267 -316 -294 -217 -168 -154 -28 185 260 218 261 344 323 219 68 -64 -74 -108 -299 -403 -289 -185 -196 -174 -29 104
5291 104 240 293 250 267 355 279 94 -15 -60 -157 -230 -290 -359 -311 -171 -119 -122 22 194 279 303 287 256 265 244 54 -126
5318 -126 -144 -153 -265 -344 -345 -245 -118 -55 -45 68 293 334 266 254 279 227 109 -21 -159 -191 -204 -289 -362 -269 -151 -94
5344 -94 -6 78 148 262 355 287 201 205 171 33 -118 -215 -257 -245 -269 -338 -292 -90 26 25 84 242 332 333 272 175 163 136 -39
5373 -39 -215 -225 -206 -273 -311 -264 -162 -49 70 111 171 285 353 298 221 175 92 19 -84 -232 -306 -258 -237 -275 -234 -119
5399 -119 38 127 162 195 284 369 290 132 97 78 -52 -199 -285 -298 -254 -246 -266 -189 -7 111 139 196 289 319 302 251 121
5426 121 30 -5 -89 -237 -296 -291 -255 -211 -166 -112 20 197 240 203 260 320 285 165 44 -34 -69 -149 -298 -360 -266 -183 -185 -152
5454 -152 -7 128 203 229 252 278 306 230 75 -12 -59 -147 -225 -291 -315 -267 -161 -107 -85 46 182 248 270 270 257 260 192 44
5482 44 -101 -118 -159 -267 -330 -284 -209 -117 -78 -27 92 243 275 234 240 260 193 78 -33 -116 -175 -216 -289 -318 -244 -163 -96 -8
5510 -8 74 163 255 295 265 213 198 168 36 -112 -182 -217 -227 -279 -300 -230 -83 4 14 112 235 299 281 231 202 167 101 -59
5538 -59 -177 -210 -221 -280 -293 -246 -160 -66 32 92 165 262 292 271 231 173 101 15 -80 -198 -254 -245 -234 -262 -220 -84 21 103 151
5567 151 202 284 323 249 150 115 63 -51 -194 -241 -249 -250 -258 -225 -157 -17 67 128 195 267 286 268 208 131 33 -22 -124 -231 -285
5596 -285 -271 -252 -226 -165 -97 13 141 198 211 267 306 256 156 56 10 -58 -170 -263 -300 -239 -199 -202 -127 -6 98 165 217
5623 217 252 267 258 188 92 18 -66 -156 -217 -260 -273 -243 -185 -126 -61 50 157 225 243 254 254 223 163 33 -59 -99 -168 -263 -298
5652 -298 -260 -198 -148 -97 -10 128 203 243 247 255 253 182 77 -15 -88 -162 -230 -271 -278 -236 -170 -107 -21 68 159 238 259 258 220 183 127
5683 127 24 -95 -161 -201 -249 -280 -275 -196 -101 -31 21 129 225 287 258 238 219 172 66 -53 -137 -183 -225 -269 -266 -215 -140 -72
5711 -72 19 108 191 244 273 264 214 154 90 6 -89 -184 -232 -249 -253 -247 -195 -104 7 74 132 189 259 265 217 164 122 42 -69 -176 -213
5742 -213 -231 -258 -249 -209 -120 -35 37 126 212 257 262 244 225 141 52 -22 -88 -191 -241 -258 -229 -188 -153 -83 29 115 163 206 235 270
5772 270 213 147 84 12 -75 -173 -245 -251 -249 -222 -184 -105 1 74 142 207 250 254 228 180 120 41 -48 -141 -197 -243 -257 -246 -198 -118 -34
5803 -34 31 138 198 239 242 245 209 143 44 -44 -105 -184 -240 -269 -251 -200 -149 -82 17 97 162 214 249 254 229 153 82 2 -79 -175 -233
5834 -233 -244 -240 -232 -183 -94 -8 71 135 200 259 258 231 180 129 44 -65 -134 -193 -226 -246 -231 -178 -109 -46 29 124 188 227 242 229 196
5865 196 127 37 -40 -107 -167 -240 -263 -234 -205 -139 -94 15 102 161 192 236 259 219 156 77 19 -75 -157 -206 -229 -237 -228 -178 -97 -2
5895 -2 58 128 197 235 236 221 179 107 43 -67 -116 -179 -227 -259 -230 -178 -120 -54 7 118 187 215 213 222 210 142 35 -42 -100 -154 -224
5926 -224 -255 -235 -192 -137 -78 3 91 164 203 241 243 207 151 86 13 -80 -152 -195 -235 -244 -231 -166 -89 -9 45 128 193 241 231 188 168
5957 168 124 24 -78 -134 -183 -215 -247 -252 -177 -111 -41 13 100 183 227 229 214 178 133 51 -32 -108 -175 -226 -243 -226 -207 -150 -65 32
5987 32 85 143 202 252 243 203 133 80 22 -82 -169 -210 -217 -239 -235 -195 -97 -7 64 109 194 237 248 203 152 110 41 -53 -126 -191 -227
6018 -227 -230 -212 -188 -128 -56 39 111 161 200 241 240 198 111 55 -2 -80 -156 -218 -231 -213 -184 -166 -89 22 108 149 175 225 248 201
6048 201 146 75 8 -60 -151 -225 -252 -231 -200 -173 -107 -20 60 147 192 203 233 242 182 97 18 -55 -104 -172 -240 -260 -213 -162 -118 -68
6078 -68 31 123 199 206 207 225 217 144 27 -38 -81 -151 -225 -258 -220 -174 -112 -74 -6 101 174 194 209 219 212 146 82 -5 -100 -147 -186
6109 -186 -229 -259 -218 -145 -72 -18 54 137 228 236 211 201 190 131 32 -76 -140 -150 -201 -245 -237 -176 -85 -43 19 106 172 216 232 201
6139 201 178 146 75 -24 -121 -166 -188 -226 -229 -210 -143 -46 22 56 118 214 240 228 174 139 100 19 -85 -170 -194 -181 -214 -221 -168 -77
6169 -77 19 65 106 173 254 261 199 157 122 63 -40 -134 -191 -224 -210 -218 -198 -136 -30 49 99 153 205 228 240 184 89 56 10 -93
6199 -93 -190 -227 -224 -212 -179 -167 -85 47 106 122 167 248 247 199 133 68 7 -45 -143 -223 -226 -215 -189 -161 -87 -14 65 154 179 197 239
6230 239 247 170 88 14 -45 -107 -172 -246 -246 -187 -142 -138 -72 45 135 167 184 196 220 220 135 17 -30 -61 -152 -214 -247 -209 -169 -118 -72
6261 -72 -9 95 179 202 201 209 203 161 94 -15 -89 -120 -157 -224 -248 -186 -118 -80 -31 44 130 221 223 184 195 191 117 9 -74 -119 -153
6292 -153 -200 -239 -242 -150 -80 -51 7 111 184 214 236 206 176 159 87 -44 -104 -152 -180 -217 -226 -193 -137 -38 26 47 131 226 242 203
6322 203 170 151 97 17 -94 -176 -176 -173 -235 -231 -155 -61 1 55 103 176 241 244 175 132 119 41 -56 -123 -183 -213 -200 -199 -204 -118 -12 53
6354 53 98 144 207 242 239 178 82 69 20 -97 -194 -211 -200 -185 -192 -171 -74 40 101 107 159 242 239 176 115 67 20 -44 -133 -223 -216 -182
6386 -182 -178 -160 -99 -7 70 148 164 181 226 243 156 69 24 -10 -95 -181 -226 -227 -157 -127 -139 -71 50 140 155 176 214 232 209 123
6416 123 28 -9 -44 -145 -241 -238 -195 -165 -132 -88 -33 86 171 185 180 220 214 155 94 -10 -81 -99 -160 -234 -249 -178 -121 -91 -38 44
6446 44 135 209 201 187 206 217 141 4 -60 -103 -147 -209 -233 -228 -147 -76 -63 3 120 191 200 215 197 160 155 83 -31 -113 -132 -171 -228
6477 -228 -231 -189 -117 -37 7 37 136 234 230 184 174 163 107 25 -81 -158 -147 -168 -228 -228 -133 -56 -18 33 103 178 232 231 172 151 129
6508 129 52 -53 -121 -178 -197 -194 -200 -199 -110 -3 39 63 142 212 244 222 162 100 82 35 -101 -204 -184 -179 -210 -187 -148 -64 23 83
6538 83 94 168 256 248 182 138 92 40 -43 -130 -213 -211 -174 -189 -185 -105 -10 55 113 148 191 230 242 146 68 50 -12 -109 -191 -222 -222 -168
6570 -168 -153 -146 -62 62 120 131 185 232 230 205 114 37 -6 -39 -144 -228 -218 -187 -173 -132 -90 -14 95 172 175 184 238 227 158 70
6600 70 9 -63 -102 -154 -246 -231 -151 -122 -107 -55 37 133 180 187 184 204 210 96 -2 -49 -89 -150 -214 -238 -216 -137 -81 -66 -10 115 181
6631 181 199 207 202 181 150 77 -44 -95 -109 -158 -242 -220 -184 -110 -55 1 37 138 227 216 183 190 184 115 5 -67 -133 -153 -184 -239
6661 -239 -222 -145 -66 -42 25 99 164 227 209 175 142 151 60 -57 -117 -146 -182 -202 -203 -205 -124 -17 13 52 138 217 233 200 169 106
6691 106 96 25 -103 -177 -175 -173 -226 -222 -156 -59 19 69 102 163 261 240 162 136 94 28 -55 -129 -203 -194 -193 -208 -190 -105 -2 49 106
6722 106 150 187 242 229 158 84 56 9 -110 -192 -206 -205 -176 -166 -134 -65 65 112 124 174 237 232 199 114 35 15 -47 -153 -241
6751 -241 -213 -176 -188 -158 -90 -15 75 135 154 175 229 239 149 66 16 -48 -94 -161 -233 -222 -151 -143 -137 -51 51 127 178 187 199 217 211
6782 211 105 8 -23 -52 -137 -203 -209 -203 -142 -102 -80 -15 106 165 176 188 199 195 146 74 -30 -96 -114 -175 -236 -232 -175 -134 -67 -27
6812 -27 32 135 210 208 192 208 199 109 8 -75 -116 -151 -181 -235 -215 -142 -72 -51 12 120 164 218 218 194 178 159 69 -45 -103 -144
6842 -144 -194 -211 -217 -195 -124 -37 -4 32 124 214 220 190 162 142 99 14 -92 -154 -166 -177 -223 -208 -144 -62 -9 54 96 175 241 221
6872 221 179 153 111 41 -56 -135 -184 -206 -198 -208 -200 -112 -29 26 74 134 182 222 225 137 92 79 21 -105 -170 -198 -199 -198 -182 -178 -82 26
6904 26 81 100 162 238 225 189 129 75 14 -45 -140 -211 -198 -175 -186 -153 -98 -16 52 128 158 178 226 224 153 86 37 -31 -106 -165 -232
6935 -232 -235 -182 -172 -149 -60 34 98 146 174 204 231 209 120 36 -10 -52 -148 -219 -223 -201 -168 -138 -103 -21 93 149 172 204 223 215 168
6966 168 85 -14 -71 -103 -166 -232 -223 -167 -147 -95 -47 38 126 190 198 183 213 193 101 17 -47 -102 -156 -212 -243 -215 -160 -109 -69 -3 106
6997 106 178 208 213 197 186 163 76 -38 -94 -137 -183 -213 -226 -197 -136 -55 -11 40 137 207 212 200 186 157 108 20 -94 -137 -149 -194
7027 -194 -238 -221 -153 -90 -37 38 94 165 216 216 174 163 133 38 -46 -117 -175 -199 -194 -208 -193 -122 -34 19 72 136 206 235 240 183 128
7058 128 87 9 -94 -164 -192 -205 -211 -200 -165 -79 10 67 97 182 242 226 189 152 94 25 -37 -139 -205 -200 -213 -218 -176 -116 -21 49
7088 49 105 155 206 228 225 163 95 47 -13 -104 -180 -217 -213 -187 -175 -145 -64 43 102 146 188 229 240 196 135 47 2 -71 -157 -213 -224
7119 -224 -211 -186 -149 -98 -27 80 141 172 208 230 222 164 83 -3 -52 -108 -176 -228 -214 -184 -134 -121 -47 38 110 179 199 212 231 202
7149 202 117 24 -26 -87 -146 -195 -227 -211 -162 -113 -81 -1 97 156 191 215 221 196 144 67 -18 -84 -146 -187 -223 -227 -198 -145 -79 -26 38
7180 38 139 190 212 208 210 166 119 37 -69 -123 -158 -202 -218 -212 -148 -106 -38 21 111 170 223 221 205 174 132 57 -25 -97 -156 -182 -215
7211 -215 -224 -199 -136 -57 7 69 160 206 224 211 172 140 94 3 -97 -157 -184 -208 -217 -212 -159 -78 -2 47 112 190 239 232 207 161 113
7242 113 32 -37 -125 -182 -191 -206 -210 -167 -117 -27 40 100 161 212 220 213 168 113 67 -18 -94 -185 -211 -213 -202 -180 -149 -67 23 82 129 179
7274 179 214 232 201 125 77 7 -62 -139 -201 -206 -208 -194 -167 -100 -20 58 125 172 216 233 221 179 104 34 -23 -100 -175 -217 -222 -191 -174
7305 -174 -126 -59 26 109 156 194 214 229 190 115 42 -8 -80 -156 -210 -224 -228 -183 -146 -82 3 82 143 185 217 217 204 161 86 5 -64
7336 -64 -133 -184 -222 -219 -209 -154 -85 -25 36 130 183 220 217 222 185 114 33 -47 -116 -164 -217 -240 -222 -176 -124 -60 17 103 165 195 231 220
7368 220 207 136 72 -18 -81 -151 -194 -216 -219 -189 -145 -68 -3 59 131 194 229 211 189 160 92 6 -76 -139 -184 -213 -222 -214 -160 -105 -21
7399 -21 43 115 172 209 234 202 174 112 48 -48 -129 -176 -213 -226 -217 -182 -131 -55 19 96 155 196 241 230 182 130 68 -7 -86 -154 -194
7430 -194 -224 -219 -190 -145 -75 8 60 124 187 234 221 189 159 95 15 -70 -131 -193 -210 -228 -196 -176 -109 -29 42 113 173 217 240 224
7460 224 173 108 42 -37 -115 -171 -220 -220 -207 -179 -125 -59 23 101 154 212 240 229 199 141 84 -8 -82 -151 -192 -216 -219 -192 -153 -83 -13
7491 -13 68 139 190 229 231 198 144 103 14 -67 -128 -193 -209 -225 -204 -156 -95 -28 51 118 191 207 228 223 176 115 49 -31 -95 -176 -209
7522 -209 -217 -207 -171 -122 -55 20 95 172 209 239 235 189 138 71 2 -86 -146 -192 -213 -218 -206 -149 -78 -9 52 126 181 220 237 207 173
7553 173 96 21 -50 -122 -167 -211 -220 -190 -165 -104 -39 54 130 176 218 234 232 182 130 47 -21 -89 -156 -217 -219 -210 -172 -120 -64 16 101 161
7585 161 208 231 240 198 148 75 -3 -70 -155 -184 -225 -226 -196 -149 -86 -13 56 128 188 218 219 216 176 108 28 -53 -115 -178 -217 -222 -202 -148
7617 -148 -98 -33 43 124 180 214 226 213 185 121 46 -35 -116 -156 -199 -229 -216 -182 -126 -52 21 83 165 217 240 220 183 147 71 -4
7647 -4 -91 -146 -191 -198 -225 -202 -141 -78 -4 59 128 184 228 213 189 162 106 30 -59 -124 -168 -200 -213 -211 -166 -100 -36 31 101 168 206 220
7679 220 219 166 111 57 -18 -103 -176 -195 -212 -215 -186 -137 -58 18 77 133 193 238 226 197 149 82 18 -65 -152 -188 -206 -207 -200 -157 -88 3
7711 3 69 125 186 215 242 209 160 94 46 -41 -124 -187 -209 -205 -190 -170 -130 -43 41 108 146 194 224 223 181 128 48 -18 -98 -174 -209 -216
7743 -216 -197 -175 -138 -66 10 101 157 195 226 225 207 138 89 -5 -60 -126 -187 -231 -207 -171 -141 -100 -20 67 136 185 215 207 222 181 91
7774 91 23 -53 -109 -170 -212 -217 -194 -154 -120 -62 17 109 165 191 204 203 179 121 50 -27 -88 -140 -191 -229 -207 -176 -114 -60 8 71 159
7805 159 211 199 205 190 174 86 -4 -75 -143 -161 -209 -243 -213 -142 -98 -36 34 119 187 228 218 198 165 121 46 -50 -114 -163 -197 -223
7835 -223 -221 -182 -103 -41 6 77 169 213 226 209 174 133 73 -14 -109 -167 -186 -218 -223 -197 -143 -61 15 73 128 201 238 216 179 150 96
7866 96 7 -88 -147 -193 -213 -216 -216 -171 -94 -14 54 113 169 208 239 213 148 106 58 -32 -127 -191 -203 -206 -197 -173 -138 -45 57 98 148 206
7898 206 236 220 186 106 58 6 -79 -171 -209 -217 -203 -188 -146 -74 7 76 130 162 214 230 202 130 82 14 -58 -128 -193 -228 -214 -173
7928 -173 -159 -118 -20 75 126 165 201 227 238 201 95 37 -11 -94 -166 -222 -224 -198 -146 -117 -73 26 112 162 183 217 223 203 142 55
7958 55 -24 -77 -132 -206 -239 -216 -172 -131 -82 -14 58 153 207 189 207 214 166 93 10 -61 -130 -165 -216 -238 -200 -127 -82 -44 43 131 183
7989 183 231 217 194 190 139 31 -62 -93 -157 -204 -224 -221 -173 -112 -57 3 73 160 212 219 208 173 133 74 -21 -109 -148 -172 -205 -230 -188
8020 -188 -130 -60 -2 59 117 198 243 222 166 148 115 20 -63 -140 -176 -189 -205 -220 -162 -90 -2 39 102 177 217 242 196 148 100 63
8050 63 -27 -133 -177 -197 -208 -205 -198 -144 -32 38 68 115 203 251 214 187 127 61 12 -81 -174 -210 -204 -209 -196 -155 -83 4 81 125 154
8081 154 218 253 205 134 83 26 -45 -130 -199 -223 -200 -174 -176 -131 -29 65 115 163 197 217 227 171 94 20 -14 -98 -198 -226 -236
8110 -236 -204 -167 -130 -76 14 110 145 176 213 228 186 139 54 -19 -70 -124 -205 -242 -207 -169 -133 -82 -18 58 146 195 179 195 218 169
8140 169 67 -2 -60 -117 -165 -226 -234 -198 -125 -87 -58 38 126 176 202 194 181 176 127 22 -52 -85 -135 -210 -221 -222 -171 -102 -39 -1 83
8171 83 172 210 205 199 181 145 97 -13 -98 -133 -146 -212 -242 -192 -123 -71 -9 38 110 189
8191A89
$$ Imaginary data points
##PAGE= N=2
##DATA TABLE= (X++(I..I)), XYDATA
0 0 0 0 0 0 0 0 0 0 0 0 0 0 0 -8 8 -8 8 -8 9 -16 16 -17 24 -25 32 -40 45 -50 57 -66 78 -89 98 -113 129 -145
36 -145 162 -182 203 -227 251 -281 312 -345 378 -419 465 -510 565 -621 683 -755 830 -918 1013
55 1013 -1123 1246 -1387 1554 -1748 1982 -2271 2635 -3111 3763 -4719 6259 -9160 16592 -78679
70 -78679 -149187 -63628 -55204 -6960 47915 115697 148985 158494 135645 130003 116221 66085 -13014
83 -13014 -55701 -84761 -121904 -148364 -146188 -138736 -104736 -49937 -5907 26700 76404 120228 140662
96 140662 143486 126722 90211 66086 38625 -26399 -91709 -107818 -109258 -128320 -138284 -114328 -66886
109 -66886 -13058 23848 43196 82428 136831 144149 109089 90609 81618 44742 -8702 -57253
121 -57253 -92518 -106337 -109927 -120514 -116628 -76145 -29412 718 36352 75202 96310 112999
133 112999 123745 102145 65214 42276 16456 -27244 -69252 -96816 -108352 -99759 -89103 -88490
145 -88490 -62670 -2569 39032 48358 67528 100958 115472 101867 71773 40513 21853 203
157 203 -48058 -92253 -94953 -85854 -92848 -88122 -58603 -23029 13128 45515 63937 79553 99406
170 99406 100757 77655 53547 29300 -4120 -31727 -54114 -84972 -100950 -85134 -67848 -62153
182 -62153 -42710 -4232 33678 60361 71469 73223 84587 93254 65253 20345 1495 -8161 -39728
195 -39728 -74439 -87903 -83179 -68740 -55535 -47063 -22357 22295 51605 56809 67789 83242 79728
208 79728 63214 42922 13695 -14037 -31266 -51755 -75390 -82331 -74006 -61765 -41827 -19377
220 -19377 -2149 25776 61994 73780 64484 66050 71337 54758 22226 -8103 -28788 -39325 -53127
233 -53127 -77566 -84601 -58740 -34903 -30518 -15220 19550 48283 61626 65377 63004 61973 57978
246 57978 34104 457 -18485 -31005 -51742 -66350 -67452 -65136 -53416 -28585 -8507 4981
258 4981 28064 53644 65197 65741 59440 47545 38660 24957 -8324 -39672 -45054 -46236 -62447
271 -62447 -71481 -57198 -32978 -12148 1824 14385 38188 64870 67323 51475 47141 47251 27567
284 27567 -1929 -23218 -38456 -48830 -54421 -60858 -59856 -41319 -19360 -4883 12740 33386 46214
297 46214 56228 63557 54201 35657 26107 15565 -9148 -34605 -48046 -52337 -51315 -50957 -51428 -35667
311 -35667 -3603 15846 18686 32033 55535 63293 52751 38919 27942 18629 3096 -24197 -46206
324 -46206 -47407 -45129 -52691 -51784 -34094 -14838 1696 19229 32230 41940 53139 55908 45189
337 45189 32252 19728 2997 -12688 -27255 -45649 -55230 -46906 -38928 -39570 -29875 -5004 17282
350 17282 29148 35246 41363 51347 54947 37886 14584 6922 1501 -20431 -43122 -48736 -45099 -41584
364 -41584 -37846 -31275 -14987 9277 24888 29397 38272 49330 47995 38324 28197 13125 -3845
377 -3845 -15068 -26836 -41953 -48674 -44415 -37112 -27840 -16936 -5591 12698 34002 40540 35986
390 35986 40048 46412 35793 14289 -1533 -10385 -18884 -32036 -47042 -49208 -35117 -24624 -23917
403 -23917 -13471 9891 26955 32787 36703 40044 40595 36410 22890 4989 -6487 -15613 -29205
416 -29205 -39120 -40845 -40427 -35014 -21083 -8797 -996 12880 30478 39079 38661 35880 32535 28400
430 28400 17964 -2646 -20008 -23000 -25869 -39039 -45917 -35670 -21106 -12399 -5438 5861 22860
443 22860 37367 38317 31941 32414 32876 19732 1270 -10180 -18681 -27976 -34449 -37954 -37194 -28378 -16379
458 -16379 -6686 4406 17104 26434 34086 39351 34762 24670 19715 13932 -2026 -19492 -27553 -29434
472 -29434 -31697 -35045 -34628 -23257 -5126 4779 7350 18368 34859 39191 31803 25711 22543 16007
486 16007 3175 -13309 -24723 -26907 -28891 -34794 -33907 -22972 -11946 -2979 8241 18667 25685
499 25685 32057 35069 30621 22652 14582 5260 -4693 -15625 -27718 -33448 -29428 -26275 -27781 -21614
513 -21614 -4906 9154 14902 19252 26883 34574 34601 23902 12452 8800 3336 -12304 -26447 -28893
527 -28893 -27252 -28250 -27638 -21354 -9880 3007 11825 17253 24747 31379 30628 25527 20103 11239 52
542 52 -8099 -15504 -25178 -31094 -29265 -24284 -19595 -14150 -5721 7241 19767 23541 22660 27096 31336
557 31336 23962 10124 1586 -2738 -10286 -21571 -30059 -29560 -22895 -19288 -18202 -9522 5439 15133
571 15133 18496 22789 27425 27664 23272 15614 6580 -1451 -9397 -18036 -23955 -26123 -26766 -23682 -15361
586 -15361 -7559 -2200 6628 18373 24766 24332 22994 22916 20521 11917 -1031 -10078 -12530 -16892 -26156
601 -26156 -29643 -22565 -14362 -10784 -6183 3741 15268 22137 22580 21817 23385 21829 12632 2136 -4212
616 -4212 -10195 -17853 -23033 -24309 -23259 -19518 -12959 -5347 2300 9555 16012 22002 25286 22534 17092
631 17092 14208 10077 -366 -11649 -16587 -17734 -20738 -24310 -22782 -14380 -4810 -15 3582 12520
645 12520 22320 23992 19879 17927 17054 11494 1577 -7603 -13033 -16207 -20145 -23321 -21341 -15249 -9602
660 -9602 -3940 4036 11654 16287 19717 22339 21161 16067 10164 4860 -1223 -9341 -17314 -20502 -18976
675 -18976 -18378 -19205 -14648 -4165 4212 7580 11303 18078 23071 21502 15416 10773 8321 2382 -7954
690 -7954 -15529 -17021 -17637 -19943 -19516 -13964 -6567 -374 5060 11089 16897 19851 19358 17623 14758 8731
706 8731 1156 -4481 -9245 -15460 -20192 -19844 -16439 -13716 -10916 -4756 4366 11577 13984 15287 19055
721 19055 20817 15692 7707 3090 -97 -6649 -14863 -19055 -18006 -15962 -15392 -12976 -5690 2814 7833
736 7833 11028 15558 19225 18562 14952 11137 6687 344 -6585 -11760 -14840 -17276 -18712 -16561 -11094
751 -11094 -6048 -2189 3806 11552 16222 16368 15874 16502 14687 8033 31 -4788 -7536 -12393 -18170 -19204
767 -19204 -15057 -11224 -9229 -4919 2960 10065 13180 14387 16438 17505 14375 8315 3171 -908 -6430
782 -6430 -12588 -15851 -16011 -15636 -14577 -10574 -4225 1378 5486 10027 15083 17494 15695 12695 10830 7458
798 7458 404 -6891 -10501 -12080 -14915 -17485 -15648 -9995 -5026 -2012 2478 9446 14700 15313 14198
813 14198 14242 13083 7913 1010 -3872 -7101 -11289 -15479 -16427 -14025 -11188 -8598 -4008 2616 8003 10748
829 10748 13013 15614 15777 12130 7496 4082 162 -5920 -11649 -13797 -13542 -13892 -13917 -10260 -3750 1398
845 1398 4344 8116 13226 15944 14382 11472 9678 6911 1019 -5529 -9222 -10951 -13356 -15416 -13933
860 -13933 -9377 -5221 -2147 2398 8385 12471 13240 13124 13375 11753 6741 1081 -2655 -5846 -10393 -14240
876 -14240 -14460 -12111 -10234 -8366 -3889 2481 7169 9302 11421 14103 14373 10965 6732 3828 374
891 374 -5199 -10356 -12280 -12180 -12648 -12534 -9138 -3493 882 3713 7433 12022 14095 12649 10474 9160
907 9160 6350 706 -4968 -7893 -9564 -12147 -14069 -12463 -8347 -4897 -2268 1996 7510 11063 11703
922 11703 11798 12178 10620 6128 1251 -2043 -5129 -9341 -12632 -12707 -10953 -9640 -7769 -3387 2214 5952
938 5952 7816 10326 13049 12952 9593 6123 3990 832 -4645 -9425 -10825 -10609 -11376 -11587 -8471 -3216
954 -3216 699 3093 6374 10576 12649 11497 9516 8181 5696 901 -3985 -6832 -8794 -11087 -12305
969 -12305 -10779 -7717 -5052 -2220 2199 6901 9401 9981 10828 11548 9516 4900 1008 -1195 -4219 -8782
985 -8782 -11787 -11196 -9297 -8554 -7436 -3313 2342 5808 6941 8838 11605 11913 8885 5372 3153 473
1001 473 -3911 -8073 -9924 -10085 -10280 -9870 -7228 -3204 114 2962 6482 9671 10595 9864 9195 7994 4691
1018 4691 -14 -3550 -5347 -7494 -10589 -11731 -9260 -6041 -4604 -2820 1724 6772 8878 8669 9121
1033 9121 10274 9143 4843 527 -1605 -3541 -7211 -10419 -10517 -8821 -7525 -6027 -2927 1207 4633
1048 4633 6832 8624 10010 9825 7919 5739 3525 -46 -4342 -6842 -7642 -8912 -10313 -9328 -5786 -2323
1064 -2323 -419 1607 5534 9446 9996 8072 7429 7710 5253 123 -3753 -5035 -6200 -8678 -10496 -9265
1080 -9265 -5938 -3459 -2004 922 5155 7839 8469 8757 8759 7310 4673 1820 -1164 -4247 -6946 -8476
1096 -8476 -8624 -8327 -7902 -5812 -1642 1797 3145 4917 8296 10283 8814 6121 4766 3899 966 -3968
1112 -3968 -7258 -7188 -6888 -8621 -9231 -6061 -1903 335 1764 4361 7582 9288 8528 6819 5786 4312
1128 4312 1043 -2566 -4824 -6611 -8242 -8416 -7349 -6284 -4544 -1310 2289 4682 5900 7030 8618
1143 8618 9067 6477 2791 1262 413 -3063 -7419 -8654 -7281 -6505 -6942 -6111 -2420 2139 4184 4282 6062
1160 6062 9002 9053 6208 3888 2622 593 -2538 -5518 -7344 -7605 -7245 -6870 -5492 -2899 -358 2196
1176 2196 5101 6833 6806 7124 7781 6233 2679 -210 -1705 -3162 -5703 -8471 -8698 -5988 -4109 -4395
1192 -4395 -2931 1837 5557 5906 5661 6867 8088 6961 3434 150 -923 -1987 -5219 -8034 -7736 -6310
1208 -6310 -5651 -4474 -2232 331 3099 5451 6492 6796 6918 6246 4800 2774 -421 -3447 -4257 -4776
1224 -4776 -7103 -8510 -6429 -3414 -2061 -1277 932 4566 7333 6951 5184 5667 6664 3980 -664 -2805
1240 -2805 -3027 -4379 -6700 -7942 -6909 -4277 -2382 -1740 230 3833 5989 6210 6464 6378 5124 3740
1256 3740 2035 -1014 -3819 -4894 -5459 -6300 -6730 -6190 -4008 -656 1140 1301 3393 7093 7874 5504
1272 5504 4071 4287 3507 506 -3381 -5360 -4654 -4595 -6869 -7424 -4096 -937 -161 834 3277 5608 6848
1289 6848 6439 4870 3995 3442 1178 -1911 -3718 -4957 -6035 -5801 -5254 -5331 -3843 -325 2097 2678 3684
1306 3684 5513 6945 6693 4258 1766 1631 1215 -2581 -6251 -5921 -4401 -4976 -5873 -4639 -1531 1702
1322 1702 2798 2532 4268 7128 6857 4125 2815 2394 634 -1747 -3818 -5528 -5809 -4958 -4798 -4529 -2617
1339 -2617 -272 1743 3781 4662 4425 5443 6580 4545 1165 17 -209 -2073 -4759 -6496 -6029 -3869
1355 -3869 -3111 -4101 -2554 2048 4382 3478 3658 5550 6311 4959 2380 118 -402 -978 -3815 -6248 -5573
1372 -5573 -4299 -4233 -3430 -1695 -79 2159 4423 4715 4307 4990 5161 3720 1718 -615 -2434 -2600 -3234
1389 -3234 -5884 -6787 -4008 -1850 -2178 -1684 1025 3932 5328 4615 3470 4520 5536 2713 -1218 -1867
1405 -1867 -1489 -3286 -5358 -5802 -4897 -3065 -1638 -1441 -180 2962 4697 4420 4528 4650 3705 2945 1856
1422 1856 -1047 -3315 -3175 -3371 -4933 -5547 -4422 -2479 -348 459 379 2635 5961 5718 3137 2955 4018
1439 4018 2769 -211 -2746 -3679 -3078 -3327 -5479 -5764 -2577 -311 -552 276 2688 4277 4951 4802 3506
1456 3506 2751 2799 1220 -1594 -3001 -3544 -4218 -4130 -3924 -4347 -2944 392 1724 1165 2379 4717 5450 4469
1474 4469 2690 1400 1716 1192 -2442 -5120 -3803 -2606 -4139 -4941 -3133 -670 1193 1785 1681 3219
1490 3219 5630 5082 2610 2029 2158 517 -1449 -2781 -4183 -4394 -3338 -3381 -3781 -2162 198 1555 2620
1507 2620 3192 3191 4352 5294 3040 218 356 640 -1757 -4225 -4717 -3898 -2711 -2666 -3537 -1870 2080 3279
1525 3279 1837 2503 4736 4865 3283 1678 322 -88 -501 -2855 -4884 -4030 -2893 -3269 -2859 -1337 -177
1542 -177 1533 3496 3405 2747 3855 4472 2833 898 -400 -1339 -1548 -2447 -4820 -5195 -2446 -1182 -2433
1559 -2433 -1805 1208 3240 3542 3047 2725 3795 4448 1892 -1165 -981 -450 -2560 -4389 -4191 -3456 -2464
1576 -2464 -1414 -1321 -502 2146 3682 3139 3134 3599 3059 2482 1636 -825 -2536 -1855 -2043 -4118 -4643 -3051
1594 -3051 -1547 -611 -250 26 2188 4791 4036 1813 2517 3862 2162 -603 -1905 -2179 -2101 -2677 -4399
1611 -4399 -4434 -1757 -239 -942 -181 2154 3278 3514 3615 2756 2097 2425 1323 -1245 -2371 -2351 -2886 -3208
1629 -3208 -3250 -3571 -2247 508 1080 162 1673 4150 4212 2884 1971 1609 1790 945 -2085 -3860 -2336 -1661
1647 -1661 -3654 -4218 -2119 -302 447 917 1236 2556 4352 3833 1836 1667 2089 594 -1142 -2009 -3072
1664 -3072 -3378 -2434 -2605 -3347 -1927 360 1160 1507 2129 2565 3615 4132 2121 73 833 1116 -1516 -3639
1682 -3639 -3273 -2484 -2272 -2584 -2929 -1316 1675 2197 869 1912 4097 3796 2248 1407 727 188 -304 -2119
1700 -2119 -3740 -3045 -2096 -2667 -2565 -1225 -254 1030 2566 2417 1849 3130 3903 2215 446 -20 -394
1717 -394 -982 -2096 -3844 -3827 -1626 -1115 -2567 -1714 1235 2497 2124 2043 2452 3282 3464 1411 -727 -264
1735 -264 67 -2027 -3603 -3094 -2515 -2157 -1436 -1203 -598 1486 2829 2285 2201 2902 2723 2115 1326 -554 -1730
1754 -1730 -1042 -1414 -3525 -3876 -2140 -1112 -1033 -775 7 1879 3603 2782 1274 2371 3538 1667 -667
1771 -667 -1112 -1089 -1574 -2401 -3526 -3386 -1436 -478 -1147 -420 1708 2552 2549 2767 2348 1843 2133 1325 -868 -1807
1791 -1807 -1532 -1998 -2687 -2899 -2891 -1744 216 370 -334 1299 3554 3249 1885 1687 1938 1738 584 -1635
1809 -1635 -2641 -1497 -1381 -3290 -3585 -1542 -310 -221 270 1031 2096 3316 2990 1603 1583 2011 751
1826 751 -788 -1435 -2186 -2542 -1987 -2227 -2936 -1760 240 733 676 1417 2270 3066 3158 1630 401 1191 1181
1845 1181 -1310 -2957 -2239 -1655 -2158 -2605 -2352 -932 1028 1230 454 1614 3467 3020 1627 1332 1083
1862 1083 398 -269 -1546 -2772 -2387 -1713 -2237 -2318 -1197 -241 688 1755 1744 1485 2653 3346 1793 310
1880 310 344 236 -707 -1941 -3024 -2737 -1295 -1290 -2439 -1410 1123 1820 1185 1479 2334 2819 2548 1110 -170
1899 -170 150 141 -1666 -2870 -2323 -1904 -1936 -1469 -1061 -524 996 2102 1753 1654 2381 2445 1806 1013 -270 -1000
1919 -1000 -599 -1149 -2939 -3094 -1523 -907 -1286 -988 154 1609 2498 1876 1175 2228 2948 1262 -512
1936 -512 -504 -410 -1276 -2153 -2690 -2435 -1284 -741 -1108 -435 1239 1897 1824 2072 1991 1648 1765 1152 -503 -1272 -992
1957 -992 -1384 -2229 -2501 -2198 -1279 -132 -110 -380 1125 2825 2397 1297 1534 2038 1512 270 -1115 -1559
1975 -1559 -1001 -1298 -2760 -2766 -1165 -433 -631 -98 871 1671 2331 2204 1467 1463 1699 769 -466 -1008 -1497 -1842
1995 -1842 -1650 -1917 -2412 -1517 35 337 166 939 1974 2472 2261 1302 771 1315 982 -1021 -2129 -1417
2013 -1417 -1156 -2013 -2379 -1777 -653 394 475 303 1409 2674 2258 1316 1295 1241 543 -184 -1025 -1866 -1832 -1475
2033 -1475 -1851 -2001 -1215 -359 343 1024 1138 1224 2180 2622 1467 424 633 602 -472 -1630 -2148 -1815 -1182
2052 -1182 -1456 -2082 -1101 725 1050 580 1125 2090 2308 1831 1015 409 468 124 -1204 -2023 -1698 -1515 -1714
2071 -1714 -1467 -1004 -531 474 1328 1267 1267 1877 2096 1590 858 74 -337 -283 -945 -2252 -2303 -1219 -946 -1413
2091 -1413 -1077 109 1149 1507 1204 1186 2007 2266 1034 -67 38 -2 -966 -1755 -1935 -1749 -1257 -999 -1029
2110 -1029 -435 706 1233 1308 1566 1663 1506 1498 1072 -45 -688 -586 -922 -1747 -2069 -1711 -1038 -522 -540 -397 816
2131 816 1957 1619 987 1415 1890 1287 213 -530 -698 -660 -1208 -2109 -1993 -1020 -662 -804 -288 609 1194 1518
2151 1518 1603 1380 1364 1369 799 -55 -564 -940 -1249 -1316 -1584 -1881 -1279 -249 -22 -104 553 1530 1850 1546 1074
2172 1074 1009 1237 716 -647 -1280 -851 -916 -1724 -1955 -1308 -569 -159 -43 272 1122 1800 1580 1146 1226 1161 559
2193 559 -47 -557 -1124 -1338 -1264 -1439 -1549 -1134 -457 101 515 698 987 1671 1912 1199 579 751 658 -268 -1192
2214 -1192 -1413 -1181 -1096 -1457 -1620 -829 243 407 263 872 1657 1713 1301 937 748 551 42 -766 -1256 -1210
2234 -1210 -1270 -1445 -1263 -889 -526 104 747 922 993 1401 1674 1373 785 307 96 -83 -755 -1583 -1603 -1016 -963
2255 -963 -1301 -951 25 701 812 798 1136 1668 1605 842 307 329 87 -728 -1302 -1328 -1276 -1209 -1086 -859 -376 247
2277 247 687 949 1207 1312 1261 1238 934 212 -295 -357 -651 -1272 -1591 -1321 -868 -680 -653 -299 582 1229 1069
2298 1069 872 1279 1544 1014 251 -98 -188 -489 -1076 -1513 -1344 -921 -853 -781 -286 381 744 951 1168 1247 1166
2319 1166 1026 725 229 -253 -624 -861 -1011 -1262 -1409 -1041 -421 -239 -188 333 1070 1318 1093 939 1055 1070
2339 1070 507 -290 -604 -520 -782 -1353 -1435 -975 -580 -460 -265 239 825 1097 1064 1046 1125 947 505 111 -195
2360 -195 -637 -973 -1031 -1062 -1148 -1022 -580 -101 192 364 711 1206 1340 969 688 751 600 -76 -701 -832 -758 -953
2382 -953 -1258 -1176 -609 -133 -33 122 677 1158 1145 947 914 855 541 50 -344 -597 -827 -1055 -1137 -974 -786 -592
2404 -592 -200 310 588 689 937 1209 1136 731 416 313 78 -470 -996 -1028 -843 -930 -1078 -788 -162 220 308
2425 308 506 950 1233 1074 762 621 535 142 -432 -727 -791 -926 -1088 -987 -690 -406 -140 209 623 885 926
2446 926 953 1023 881 436 37 -134 -349 -798 -1126 -1042 -798 -750 -730 -355 240 592 609 739 1066 1170 832 431
2468 431 280 120 -312 -790 -956 -884 -900 -952 -744 -302 63 234 517 891 1061 955 820 749 525 72 -338
2489 -338 -508 -663 -937 -1110 -937 -591 -427 -310 67 596 843 806 846 976 919 497 80 -109 -279 -656 -1020
2510 -1020 -1013 -808 -742 -694 -381 115 441 562 729 998 1044 795 518 380 159 -287 -689 -790 -791 -907 -961 -714
2532 -714 -290 -34 140 436 817 985 864 770 737 564 121 -280 -442 -590 -856 -1040 -900 -613 -463 -326 27
2553 27 484 724 734 808 961 874 487 139 14 -193 -599 -915 -910 -740 -728 -698 -397 66 352 465 654 935 989
2576 989 773 537 410 194 -204 -576 -708 -758 -868 -907 -673 -331 -118 60 404 773 864 796 765 788 577 129
2598 129 -233 -335 -481 -815 -1016 -858 -569 -484 -400 -53 442 687 671 733 912 897 568 201 38 -145 -493 -792
2620 -792 -852 -783 -747 -662 -382 -35 225 408 656 893 885 701 594 500 203 -257 -523 -560 -679 -911 -960 -654 -294
2643 -294 -157 -62 296 747 877 738 681 765 641 223 -186 -342 -446 -695 -933 -890 -661 -488 -363 -61 310
2664 310 561 685 817 873 760 539 353 142 -175 -559 -743 -703 -722 -855 -758 -336 41 146 248 599 930
2685 930 915 640 497 520 346 -157 -558 -603 -601 -785 -916 -742 -383 -118 21 244 569 800 826 754 699 538 250
2708 250 0 -221 -508 -767 -802 -716 -682 -639 -409 14 346 449 487 763 1017 820 407 266 264 -16 -508 -816
2730 -816 -757 -629 -704 -795 -518 -21 246 277 466 781 882 763 583 420 225 -33 -336 -565 -721 -792 -783 -621
2752 -621 -467 -351 -48 381 619 565 650 840 851 558 139 -59 -66 -299 -760 -952 -699 -495 -590 -555 -144 318
2774 318 505 509 582 816 886 599 230 115 -12 -329 -626 -741 -782 -734 -575 -422 -249 35 346 585 725 699
2796 699 642 703 627 219 -219 -271 -294 -577 -908 -861 -556 -320 -310 -254 173 684 755 538 618 833 704 283 -45
2819 -45 -201 -289 -509 -795 -881 -663 -476 -409 -202 104 358 568 768 734 616 603 529 238 -134 -428 -525 -528 -690
2842 -690 -903 -764 -266 -39 -107 66 564 862 784 570 521 630 481 -68 -461 -416 -402 -699 -894 -724 -442 -224
2864 -224 -62 77 351 676 797 705 629 553 359 174 -70 -464 -691 -604 -601 -781 -756 -399 -20 170 220 349 738
2887 738 993 714 334 381 454 61 -469 -652 -594 -554 -690 -819 -584 -69 164 119 333 712 829 737 618 432
2909 432 265 134 -152 -525 -693 -680 -680 -634 -560 -465 -118 366 470 364 593 924 843 463 181 116 64 -238 -751
2932 -751 -894 -570 -454 -687 -634 -124 269 381 416 534 772 910 646 245 164 116 -221 -549 -683 -757 -709 -513
2954 -513 -437 -408 -68 367 538 572 602 673 761 660 181 -207 -122 -158 -641 -959 -781 -498 -413 -424 -307 136 660
2977 660 655 427 599 895 701 259 10 -106 -245 -434 -729 -886 -661 -422 -416 -270 52 315 542 750 670 516
2999 516 661 647 218 -206 -321 -356 -490 -718 -926 -731 -226 -98 -273 7 621 811 613 521 591 640 469 -48
3021 -48 -441 -344 -315 -713 -918 -674 -430 -288 -100 47 260 641 819 646 558 584 447 212 -67 -440 -635 -466
3043 -466 -532 -857 -771 -292 -7 40 116 368 744 939 642 294 460 549 34 -517 -552 -488 -564 -715 -797 -590 -103
3066 -103 121 46 254 694 800 679 600 444 266 207 -61 -533 -694 -568 -586 -674 -606 -450 -74 354 377 252
3088 252 599 991 776 340 241 252 92 -272 -713 -811 -491 -438 -760 -669 -82 252 265 349 546 736 861 625
3110 625 223 159 170 -168 -557 -654 -719 -690 -498 -444 -485 -78 418 503 445 581 745 787 616 145 -153 -4 -93 -685
3134 -685 -962 -637 -402 -464 -471 -261 180 620 594 365 595 915 652 182 44 -51 -248 -444 -693 -869 -638 -366
3156 -366 -421 -338 38 336 530 685 604 488 685 692 143 -262 -225 -253 -524 -768 -847 -616 -168 -126 -320 48 699
3179 699 762 495 510 667 633 400 -50 -388 -298 -282 -715 -906 -600 -361 -302 -110 66 231 616 803 589 442
3201 442 585 478 158 -130 -424 -561 -409 -523 -878 -731 -175 13 -81 102 447 732 823 558 292 495 541
3222 541 -42 -526 -433 -371 -579 -711 -702 -503 -80 117 24 227 684 773 595 538 418 242 196 -61 -543 -665 -470
3245 -470 -527 -701 -615 -361 -29 296 282 205 614 975 645 221 277 314 43 -336 -657 -693 -445 -445 -749 -608 -3
3268 -3 236 163 315 567 698 755 574 214 161 201 -138 -548 -611 -611 -614 -461 -439 -461 -59 434 434 296 538 768 704
3293 704 468 123 -86 35 -99 -710 -892 -514 -340 -528 -500 -174 206 494 482 355 601 881 587 140 83
3314 83 18 -234 -422 -615 -778 -589 -328 -396 -367 39 366 476 595 555 482 671 633 76 -267 -137 -181 -558 -777
3337 -777 -739 -510 -220 -222 -334 80 662 653 370 500 697 566 278 -50 -305 -254 -293 -691 -857 -538 -329 -330 -147
3360 -147 74 238 574 766 534 416 584 505 132 -161 -357 -453 -391 -554 -853 -646 -106 -9 -162 86 519
3381 519 717 673 486 339 499 479 -95 -498 -351 -315 -617 -733 -629 -435 -122 69 26 227 654 737 540 495
3403 495 444 281 172 -69 -526 -621 -400 -490 -726 -595 -259 14 206 228 256 647 924 559 193 323 370 -8
3425 -8 -396 -570 -567 -447 -506 -731 -531 13 192 88 299 597 669 680 525 241 154 163 -140 -556 -600 -562 -576 -494 -458
3450 -458 -421 -18 421 383 273 582 817 671 387 139 14 53 -173 -697 -810 -445 -368 -597 -486 -85 226
3471 226 396 418 397 617 822 527 123 103 48 -241 -464 -610 -714 -588 -344 -381 -364 29 362 448 506 517 540
3494 540 676 568 55 -215 -67 -155 -594 -784 -640 -438 -286 -286 -270 153 635 567 351 543 741 534 225 -14
3516 -14 -208 -252 -337 -677 -790 -529 -346 -350 -189 58 266 534 691 528 421 589 501 103 -193 -287 -373 -422 -611
3539 -611 -809 -580 -121 -67 -195 123 569 681 580 491 458 531 388 -105 -415 -298 -332 -639 -739 -577 -398 -176
3561 -176 -1 41 258 625 711 533 479 455 301 158 -101 -474 -566 -397 -514 -757 -595 -216 -1 97 172 315
3583 315 665 827 509 238 379 369 -63 -425 -483 -491 -490 -566 -672 -450 -9 137 95 312 610 649 614 512 299
3606 299 182 140 -153 -516 -582 -517 -541 -529 -474 -358 -7 352 316 273 561 792 595 296 172 98 7 -271 -662
3629 -662 -697 -425 -418 -614 -448 -20 214 303 391 466 630 730 471 175 134 58 -236 -458 -551 -639 -551 -371 -370 -331 28
3654 28 368 441 453 518 587 626 464 58 -143 -50 -200 -619 -742 -556 -408 -368 -335 -187 181 526 480 360 566
3677 566 710 476 181 18 -123 -243 -398 -617 -690 -496 -339 -324 -185 83 262 493 607 507 451 565 480
3698 480 93 -168 -245 -302 -452 -627 -714 -493 -178 -157 -199 145 539 590 477 470 522 489 293 -89 -304 -258 -357 -631
3722 -631 -694 -512 -362 -235 -55 75 259 550 651 538 476 456 337 149 -108 -394 -473 -394 -504 -703 -550 -198
3744 -198 -26 19 149 388 642 706 459 325 442 336 -79 -385 -396 -426 -545 -610 -610 -398 -99 34 73 308 562
3767 562 615 558 497 350 216 126 -127 -432 -533 -489 -512 -543 -489 -322 -9 262 278 305 598 769 558 317 249 193
3791 193 14 -304 -567 -574 -439 -492 -612 -417 -53 133 196 359 514 632 637 474 265 175 37 -217 -431 -540
3813 -540 -603 -574 -449 -409 -319 -18 301 390 422 540 631 628 427 115 -12 -19 -215 -581 -664 -500 -418 -442 -363 -129 201
3838 201 416 408 432 604 671 453 223 94 -49 -257 -424 -583 -640 -550 -427 -352 -206 26 248 453 560 527 506
3861 506 578 468 130 -120 -190 -279 -475 -657 -657 -461 -264 -234 -157 182 498 528 464 534 582 488 255 -33 -177 -253
3885 -253 -407 -622 -636 -507 -406 -285 -103 81 273 468 593 559 497 480 359 157 -96 -330 -424 -448 -568 -688
3907 -688 -537 -258 -104 -35 134 414 604 616 482 438 458 294 -58 -288 -327 -414 -559 -623 -524 -369 -174 -28 119
3930 119 327 535 579 577 526 400 247 104 -111 -371 -497 -511 -531 -573 -501 -324 -35 147 226 349 580 696 533
3953 533 349 315 231 -10 -314 -476 -502 -492 -568 -575 -367 -78 53 172 376 549 603 590 499 347 211 30 -183
3976 -183 -370 -499 -593 -569 -486 -400 -294 -37 233 353 401 527 621 600 397 178 61 -52 -277 -555 -601 -510 -481
3999 -481 -499 -368 -85 158 309 399 503 618 600 451 280 152 -28 -259 -406 -508 -575 -552 -454 -328 -179 24
4021 24 235 424 531 521 539 553 422 148 -56 -176 -293 -482 -638 -596 -470 -343 -276 -109 170 402 466 472 563
4044 563 578 421 215 37 -107 -264 -453 -574 -563 -506 -443 -306 -92 91 256 430 566 570 519 443 349 166 -83
4067 -83 -282 -385 -454 -554 -615 -482 -266 -140 -42 175 418 551 539 485 476 410 207 -50 -215 -311 -451 -590 -605 -487
4091 -487 -370 -252 -63 164 334 454 524 556 524 380 240 98 -87 -312 -457 -499 -509 -520 -482 -287 -52 104
4113 104 216 382 557 604 493 397 321 183 -57 -293 -394 -451 -529 -578 -500 -313 -147 0 169 380 514 527 512
4136 512 479 379 172 -16 -172 -314 -462 -569 -539 -454 -386 -256 -46 183 325 414 499 583 532 374 229 104 -58
4159 -58 -279 -448 -501 -492 -497 -453 -292 -80 95 222 368 519 574 510 411 325 179 -37 -256 -361 -443 -534 -569 -469 -312
4184 -312 -166 -26 182 379 483 501 504 498 396 188 -13 -137 -288 -437 -553 -530 -449 -388 -262 -58 168 321 396
4207 396 504 584 537 382 237 113 -54 -281 -442 -480 -490 -516 -471 -306 -82 78 193 348 522 551 492 408 346
4230 346 175 -35 -237 -360 -436 -530 -560 -465 -316 -181 -22 172 363 470 493 528 508 391 187 29 -107 -274
4252 -274 -450 -541 -517 -442 -399 -285 -49 169 300 370 489 571 542 383 229 111 -42 -262 -442 -495 -495 -507 -455 -303
4276 -303 -104 65 212 372 483 540 501 444 336 157 -43 -203 -319 -442 -553 -542 -422 -293 -194 -44 183 397
4298 397 454 463 514 534 398 162 5 -108 -246 -423 -541 -527 -432 -358 -279 -97 132 279 392 472 519 489 395 274
4322 274 102 -88 -264 -378 -458 -506 -532 -434 -257 -95 5 174 390 511 502 461 426 381 198 -66 -235 -279 -375 -532
4346 -532 -558 -434 -272 -164 -55 128 335 477 483 463 461 392 212 11 -131 -287 -419 -481 -497 -485 -398 -229 -48 100
4370 100 224 363 498 551 458 325 281 174 -69 -313 -396 -405 -452 -509 -471 -272 -35 59 149 329 509 540 444 383 316
4395 316 185 6 -216 -346 -421 -472 -496 -456 -318 -188 -8 188 298 376 484 543 451 296 170 62 -83 -291
4417 -291 -479 -501 -414 -418 -439 -294 -4 176 235 329 447 553 519 339 199 121 4 -235 -415 -453 -448 -445 -404 -297 -133
4442 -133 65 237 322 406 493 489 430 303 109 -44 -142 -268 -470 -552 -461 -362 -307 -243 -62 198 369 385 375 478 536
4467 536 344 108 -1 -60 -207 -402 -522 -498 -383 -310 -276 -107 135 298 363 436 469 447 408 261 75 -94 -193
4490 -193 -307 -429 -496 -492 -374 -192 -119 -50 168 424 458 393 408 429 356 151 -95 -223 -223 -326 -525 -543 -362 -236
4514 -236 -169 -65 115 318 442 445 392 407 382 209 18 -128 -260 -355 -390 -452 -484 -344 -136 -30 44 199 365 495
4538 495 495 360 279 291 179 -116 -317 -322 -329 -432 -501 -430 -232 -35 33 85 297 487 477 370 339 299 171 -1 -196
4563 -196 -345 -372 -382 -435 -439 -296 -130 22 170 249 323 463 535 384 222 191 113 -79 -277 -418 -413 -318 -371 -430 -259
4588 -259 36 151 166 268 419 500 449 282 143 131 28 -237 -405 -391 -376 -405 -367 -280 -146 78 230 252 325 446
4612 446 472 371 251 80 -22 -71 -231 -455 -491 -347 -294 -334 -232 -30 195 321 316 324 475 519 280 60 41 -20
4636 -20 -206 -367 -473 -438 -330 -275 -294 -130 129 274 298 358 394 404 390 245 8 -105 -125 -252 -427 -476 -423 -302
4660 -302 -180 -146 -76 190 416 398 311 394 444 332 110 -79 -172 -159 -296 -509 -499 -295 -202 -197 -81 112 293 395
4684 395 404 334 364 381 210 -20 -130 -220 -304 -354 -423 -479 -312 -95 -62 -24 179 380 442 419 317 277 305 191 -137
4709 -137 -300 -229 -270 -425 -477 -354 -183 -25 10 57 288 501 443 302 325 301 167 -6 -162 -317 -326 -304 -414 -432
4733 -432 -268 -99 1 117 194 278 457 493 285 173 203 113 -119 -305 -372 -355 -299 -368 -432 -219 85 119 101 260
4757 260 439 453 370 244 139 130 38 -233 -396 -325 -320 -384 -339 -236 -107 93 230 221 283 441 452 305 182 76 -15
4782 -15 -77 -253 -467 -438 -267 -268 -359 -197 45 196 262 266 302 447 468 200 25 45 3 -223 -368 -397 -388 -286 -239 -251
4808 -251 -99 172 280 272 331 395 373 340 204 -31 -111 -95 -231 -430 -444 -333 -240 -159 -132 -63 214 403 315 234 368
4833 368 421 236 40 -103 -148 -174 -306 -481 -442 -220 -171 -188 -51 157 269 374 369 297 326 356 172 -60 -128 -186
4857 -186 -281 -332 -396 -423 -233 -39 -51 -24 206 404 393 329 294 276 277 110 -194 -285 -191 -256 -457 -448 -276 -139 -33 24
4883 24 78 281 461 376 245 286 279 106 -46 -184 -317 -294 -273 -385 -412 -204 -26 30 112 204 304 444 439 223 143
4908 143 225 110 -157 -316 -304 -293 -290 -361 -363 -141 118 105 62 287 450 393 293 214 125 84 -6 -268 -389 -301 -284 -359
4934 -359 -315 -193 -64 110 233 209 261 446 422 223 122 81 -11 -98 -264 -423 -363 -195 -259 -342 -129 126 191 223
4958 223 249 313 419 394 150 -2 51 -28 -262 -373 -354 -330 -272 -212 -210 -62 183 268 230 286 372 339 268 145 -60 -111
4984 -111 -84 -255 -431 -375 -245 -206 -162 -106 26 246 378 275 223 389 395 162 -21 -67 -127 -191 -306 -438 -368 -171
5008 -171 -138 -169 -25 187 269 311 324 277 281 300 110 -124 -146 -165 -276 -343 -382 -330 -178 -30 -49 -11 243 399 331 269
5034 269 274 272 224 60 -200 -248 -157 -263 -437 -372 -177 -101 -47 29 123 293 426 333 220 266 260 79 -79 -192 -284 -283
5060 -283 -256 -361 -379 -160 8 20 85 216 317 393 358 188 134 200 62 -219 -307 -236 -264 -316 -340 -289 -82 108 107
5085 107 85 294 449 336 238 219 138 77 -36 -236 -352 -270 -251 -338 -296 -143 -31 113 212 188 252 411 375 187
5109 187 101 90 -1 -149 -286 -383 -308 -194 -275 -313 -80 139 168 180 260 346 381 328 122 24 49 -49 -271 -353 -297 -291 -255
5136 -255 -201 -150 -17 200 263 227 287 370 311 227 104 -50 -93 -89 -276 -428 -347 -215 -210 -190 -71 52 240 313 237 227
5162 227 366 328 98 -45 -62 -133 -235 -322 -406 -321 -173 -150 -156 15 217 280 297 312 288 282 269 84 -108 -142 -155 -271
5188 -271 -357 -337 -288 -150 -52 -51 25 265 378 277 237 275 264 171 -18 -188 -220 -174 -290 -433 -343 -164 -99 -61 39
5213 39 157 292 373 300 223 252 221 39 -100 -174 -259 -279 -282 -348 -325 -111 13 23 85 233 342 361 310 192 178 172 27
5240 27 -237 -276 -215 -265 -334 -326 -219 -65 83 62 113 290 405 302 203 199 130 41 -88 -240 -313 -272 -258 -323 -261 -129
5266 -129 -1 104 188 205 288 401 339 162 106 103 -7 -168 -283 -325 -272 -212 -278 -260 -44 137 151 172 277 349 352 265
5292 265 126 38 32 -95 -279 -350 -293 -275 -258 -200 -140 -4 179 226 221 283 352 304 195 91 -30 -86 -128 -287 -389 -296
5318 -296 -190 -201 -181 -48 113 239 287 243 271 360 289 77 -19 -29 -118 -240 -322 -336 -280 -187 -153 -126 36 199 247 264
5344 264 297 281 254 207 49 -95 -143 -168 -272 -351 -319 -243 -140 -64 -40 72 274 348 267 248 302 253 111 -32 -142
5369 -142 -169 -193 -297 -379 -287 -120 -87 -61 67 197 289 324 281 222 240 179 11 -131 -172 -234 -273 -290 -318 -281 -105 11
5395 11 16 87 239 334 323 263 190 167 125 -34 -217 -242 -203 -270 -329 -282 -161 -36 42 81 171 308 377 276 211 193 128
5422 128 11 -107 -225 -280 -255 -268 -297 -241 -100 12 93 161 215 280 351 285 138 94 83 -31 -197 -292 -292 -255 -252 -261 -201
5449 -201 -22 111 135 166 283 334 299 209 114 60 3 -119 -257 -292 -261 -265 -250 -174 -94 20 147 218 223 278 327 278 163
5476 163 65 -26 -90 -154 -290 -341 -280 -206 -201 -164 -36 113 197 228 228 279 309 212 73 5 -24 -128 -251 -308 -297 -246 -189 -143
5504 -143 -82 48 181 234 246 274 271 246 169 44 -70 -123 -163 -264 -312 -290 -209 -141 -98 -24 99 242 275 246 239 271 217
5531 217 70 -50 -122 -159 -222 -305 -325 -231 -148 -101 -56 64 183 246 277 266 246 227 157 20 -92 -155 -217 -257 -277 -289 -233
5558 -233 -105 -16 7 97 240 301 286 236 208 187 91 -43 -179 -203 -218 -280 -315 -251 -148 -66 -2 72 176 266 297 245 219
5585 219 181 109 -6 -107 -202 -249 -260 -263 -262 -200 -104 12 78 149 224 286 315 258 171 118 72 -56 -177 -248 -251 -255 -260 -239 -163 -19
5615 -19 77 100 177 267 311 282 196 144 68 -22 -126 -222 -254 -246 -270 -241 -167 -83 16 114 191 217 273 289 256 173 75 -1 -57 -162
5645 -162 -252 -280 -253 -209 -193 -145 -21 112 173 207 267 303 285 197 93 30 -44 -145 -238 -268 -261 -249 -211 -145 -60 46 135 204
5673 204 253 266 258 230 155 55 -54 -116 -175 -246 -283 -267 -201 -134 -88 -3 110 219 249 258 269 261 209 72 -19 -66 -146 -216 -280
5702 -280 -261 -216 -171 -113 -35 66 162 225 259 279 251 195 117 28 -74 -145 -213 -248 -272 -275 -205 -124 -39 22 108 209 269 265 247
5731 247 209 177 74 -42 -132 -170 -200 -266 -270 -208 -137 -67 3 89 185 256 273 251 223 190 103 -7 -84 -146 -217 -244 -241 -232 -198 -111
5761 -111 -14 72 130 199 245 273 237 164 105 47 -53 -154 -212 -231 -237 -252 -214 -123 -31 39 105 195 264 275 255 215 170 86 -20
5790 -20 -109 -172 -226 -244 -255 -217 -146 -79 -5 108 177 238 255 258 231 158 79 5 -78 -157 -234 -260 -240 -215 -185 -119 -4 78 131 209
5820 209 256 266 242 190 121 48 -47 -133 -198 -222 -230 -222 -195 -118 -33 35 125 195 257 265 244 217 153 67 -33 -120 -175 -214 -254 -245 -210
5851 -210 -143 -87 2 84 175 215 244 248 229 160 68 -1 -86 -168 -228 -246 -237 -209 -169 -100 -9 71 134 192 254 270 234 179 119 56 -53
5882 -53 -145 -197 -217 -226 -232 -192 -108 -41 38 103 193 241 253 234 208 144 59 -24 -107 -177 -226 -242 -246 -202 -170 -96 -17 95 169 204 225
5913 225 249 226 166 69 7 -52 -149 -217 -231 -221 -194 -165 -110 -14 66 140 191 248 259 239 187 118 41 -46 -132 -189 -220 -244 -228 -173
5943 -173 -118 -50 18 106 189 231 221 222 202 151 38 -45 -97 -152 -215 -261 -233 -191 -129 -95 -11 86 176 218 222 236 236 182 83 6 -76
5974 -76 -135 -194 -219 -230 -207 -162 -100 -19 40 137 203 250 238 219 185 128 41 -67 -147 -183 -201 -251 -252 -188 -113 -55 8 86 179 241
6004 241 251 216 192 157 68 -23 -119 -167 -203 -230 -241 -200 -137 -67 7 72 155 222 258 251 212 154 91 27 -65 -161 -208 -194 -221 -231
6034 -231 -193 -115 -6 43 104 172 255 257 208 142 117 43 -43 -147 -205 -222 -226 -229 -209 -134 -39 28 99 166 227 256 248 201 130 69 -10
6065 -10 -83 -170 -221 -230 -205 -183 -152 -90 20 107 154 180 231 262 227 134 57 3 -50 -141 -233 -246 -214 -195 -181 -117 -24 67 148 181
6095 181 214 249 243 174 101 26 -40 -122 -173 -226 -248 -204 -158 -111 -64 21 124 196 222 229 223 226 149 23 -30 -70 -139 -219 -253 -232 -179
6126 -179 -139 -91 -12 81 185 195 205 227 226 150 66 -12 -74 -125 -187 -250 -247 -198 -150 -94 -30 38 131 211 233 216 201 201 131 31
6156 31 -64 -115 -159 -194 -248 -244 -170 -90 -42 -8 100 199 239 224 204 181 156 73 -50 -112 -143 -193 -234 -241 -198 -143 -62 -3 35 139
6186 139 223 251 226 184 155 93 25 -87 -182 -190 -184 -224 -236 -174 -82 -1 52 105 175 256 266 185 146 131 53 -56 -140 -181 -207 -207
6216 -207 -225 -209 -137 -24 45 89 154 220 248 232 188 96 52 0 -99 -194 -216 -224 -211 -189 -164 -90 25 96 118 162 237 255 198
6245 198 130 63 23 -50 -143 -225 -227 -189 -183 -182 -100 -9 73 134 180 214 246 247 169 74 25 -40 -112 -181 -243 -243 -192 -154 -146 -86 28 129
6277 129 169 186 207 222 208 123 11 -37 -53 -143 -240 -246 -206 -173 -119 -98 -14 96 175 197 210 225 228 153 67 -3 -69 -108 -165 -236
6307 -236 -250 -195 -141 -102 -37 43 128 206 212 195 191 207 107 -2 -76 -117 -147 -200 -249 -238 -161 -83 -70 -23 108 217 219 211 196 177
6337 177 147 79 -54 -124 -124 -180 -233 -226 -198 -117 -51 15 51 140 234 228 203 187 155 95 21 -93 -155 -164 -174 -232 -255 -164 -70 -18 30
6368 30 93 176 243 237 162 131 127 52 -74 -138 -168 -181 -200 -209 -207 -119 -10 32 79 157 230 244 223 180 115 81 32 -96 -186 -183 -180 -205
6400 -205 -194 -161 -80 39 96 105 160 252 260 173 98 69 35 -48 -145 -217 -217 -173 -192 -208 -105 -10 54 121 156 199 240 241 152 64 48
6431 48 -14 -109 -170 -218 -214 -177 -155 -147 -81 44 145 144 191 229 236 206 111 26 -10 -35 -140 -238 -221 -191 -174 -158 -97 -22 90 173
6461 173 158 177 234 226 143 63 0 -63 -112 -177 -235 -241 -175 -130 -122 -47 47 139 201 213 181 209 219 125 -3 -50 -75 -141 -201 -234 -226
6492 -226 -139 -85 -80 -15 112 203 200 193 204 196 156 67 -41 -103 -113 -171 -243 -235 -177 -129 -73 -15 31 129 232 215 168 178 177 102 9
6523 9 -80 -135 -155 -175 -235 -234 -150 -59 -31 29 113 189 249 240 174 155 156 67 -66 -128 -147 -190 -215 -212 -206 -118 -17 17 60 147 232 225 205
6556 205 162 107 78 27 -100 -190 -174 -174 -211 -218 -162 -77 20 73 101 180 263 241 168 136 109 29 -46 -150 -200 -195 -165 -191 -191 -98 10
6587 10 63 106 168 211 239 233 152 77 53 -10 -108 -182 -216 -215 -192 -179 -152 -78 47 121 126 168 233 235 191 97 37 1 -30 -147 -232
6618 -232 -196 -169 -175 -150 -91 -13 97 181 180 185 242 236 140 64 11 -63 -103 -162 -242 -229 -177 -143 -132 -61 45 129 176 179 188 204 198 107
6650 107 -16 -45 -75 -149 -217 -233 -213 -162 -108 -92 -14 105 187 184 197 212 201 144 73 -24 -82 -95 -164 -236 -214 -161 -133 -84 -18
6679 -18 43 137 226 217 173 188 182 96 8 -75 -125 -157 -180 -239 -242 -146 -82 -64 -2 99 181 220 219 164 156 144 56 -68 -115 -136 -179 -223
6711 -223 -219 -194 -131 -36 0 28 158 227 225 191 170 127 83 11 -107 -172 -169 -177 -228 -220 -158 -73 -4 46 95 163 248 228 152 118 103
6742 103 38 -71 -153 -204 -191 -190 -213 -208 -108 -3 26 93 163 198 229 230 152 83 65 2 -105 -164 -176 -193 -197 -169 -157 -63 49
6771 49 107 119 160 240 220 173 110 52 13 -53 -153 -227 -201 -182 -184 -181 -110 -20 58 120 144 185 232 214 138 58 18 -38 -117 -167 -233
6802 -233 -231 -179 -142 -137 -68 55 118 173 176 202 221 201 108 13 -26 -55 -152 -211 -227 -205 -161 -126 -86 -22 98 167 152 182 220 201
6832 201 145 64 -22 -80 -115 -164 -243 -238 -176 -137 -107 -40 36 128 205 203 190 207 204 107 13 -47 -108 -137 -186 -228 -220 -135 -79 -76 10 117
6864 117 186 210 215 192 175 161 57 -51 -107 -122 -179 -224 -221 -194 -131 -61 -7 38 139 217 212 182 179 160 99 15 -90 -145 -153 -182
6894 -182 -226 -220 -139 -74 -15 39 96 186 245 218 171 144 140 49 -40 -117 -155 -179 -197 -213 -205 -110 -38 18 64 153 199 226 215 156 105
6925 105 80 4 -102 -180 -180 -207 -213 -203 -166 -75 22 76 96 172 246 245 182 141 89 32 -29 -134 -202 -203 -183 -197 -188 -93 -18 59 120
6956 120 158 195 248 228 152 81 52 -16 -104 -176 -226 -224 -184 -188 -157 -76 25 102 133 174 209 213 191 112 26 -7 -62 -157 -215 -213 -205 -178
6988 -178 -143 -97 -12 86 169 169 192 243 217 157 86 19 -47 -90 -174 -220 -225 -178 -144 -114 -39 38 131 182 187 185 209 194 100 14 -48 -97
7020 -97 -152 -205 -246 -222 -166 -110 -81 -7 95 166 197 200 201 195 157 75 -26 -77 -110 -174 -217 -222 -171 -123 -62 -8 53 153 231 224 209
7051 209 204 172 108 18 -72 -132 -154 -198 -239 -236 -157 -95 -48 26 90 180 235 217 189 166 139 51 -51 -113 -146 -187 -209 -222 -197 -118
7081 -118 -37 6 75 167 219 243 227 182 138 94 13 -86 -157 -172 -206 -226 -211 -161 -84 10 74 106 200 239 229 177 147 100 35 -53
7111 -53 -140 -195 -206 -205 -219 -186 -120 -30 33 98 160 203 236 215 171 109 59 -12 -93 -159 -205 -219 -196 -185 -152 -67 22 97 141 192 235
7142 235 246 206 127 51 17 -49 -134 -212 -221 -212 -193 -159 -110 -24 64 134 155 216 237 219 145 80 23 -36 -117 -175 -224 -228 -199 -169 -131
7173 -131 -49 35 124 176 207 222 231 206 127 38 -19 -76 -143 -201 -230 -211 -173 -117 -85 -11 90 163 189 216 220 200 146 66 -5 -68
7203 -68 -126 -190 -220 -234 -201 -149 -87 -28 58 137 204 213 205 203 180 109 25 -59 -112 -152 -195 -238 -222 -158 -103 -44 17 104 182 224 239 212
7235 212 194 151 51 -29 -113 -153 -195 -222 -229 -198 -136 -69 -9 60 151 201 219 207 190 141 88 16 -84 -149 -184 -210 -220 -205 -169
7264 -169 -88 -20 48 118 185 238 228 191 171 121 50 -42 -121 -166 -194 -213 -208 -170 -108 -36 33 89 167 217 234 213 173 122 60 -6
7294 -6 -99 -155 -198 -209 -223 -195 -158 -77 18 82 130 181 231 234 200 142 82 26 -54 -130 -186 -204 -219 -215 -164 -109 -23 58 126 170 219 256
7326 256 232 173 115 51 -31 -103 -165 -213 -226 -204 -183 -130 -65 24 92 169 202 228 225 196 119 53 -20 -79 -149 -202 -221 -216 -192 -159 -89
7357 -89 -5 69 134 186 218 234 221 159 85 21 -48 -111 -182 -216 -219 -195 -160 -103 -27 48 124 187 205 227 223 187 116 29 -37 -105 -153
7388 -153 -215 -241 -224 -179 -130 -78 11 88 150 198 222 214 192 131 66 -15 -100 -149 -194 -218 -218 -190 -144 -78 -7 63 140 197 229 227 212
7419 212 172 94 22 -62 -129 -167 -200 -222 -216 -167 -103 -33 31 108 191 222 226 219 169 118 38 -45 -112 -170 -207 -232 -214 -186 -133 -57 8
7450 8 91 160 199 238 217 194 145 70 5 -82 -154 -185 -213 -198 -182 -137 -74 -5 76 137 199 228 239 206 159 101 14 -56 -128 -184 -209
7481 -209 -230 -213 -182 -106 -45 16 100 168 210 213 214 181 119 39 -36 -104 -147 -201 -226 -215 -180 -126 -68 22 95 168 208 224 234 206 149
7512 149 90 6 -72 -133 -191 -199 -204 -190 -148 -79 -12 70 140 194 223 240 197 152 95 24 -49 -124 -161 -213 -222 -199 -161 -101 -46 26 106
7543 106 169 225 245 220 174 125 63 -18 -87 -151 -201 -206 -211 -179 -131 -66 26 94 156 213 229 234 198 151 83 0 -72 -145 -195 -219 -219 -199
7575 -199 -156 -99 -20 56 127 183 229 232 207 163 99 25 -39 -130 -185 -214 -218 -194 -171 -118 -41 38 113 181 227 249 239 187 128 52 -15
7606 -15 -82 -149 -208 -223 -196 -167 -127 -66 10 92 168 202 227 227 198 147 67 9 -65 -148 -200 -221 -227 -193 -164 -109 -21 54 132 197 211
7637 211 226 207 166 107 18 -42 -108 -163 -202 -218 -200 -155 -110 -36 34 105 181 203 222 211 190 130 52 -30 -78 -147 -196 -230 -224 -181
7667 -181 -131 -73 -7 70 147 204 216 219 194 141 81 -7 -71 -136 -195 -226 -234 -205 -150 -90 -22 47 125 190 226 217 198 177 123 41 -57
7698 -57 -112 -161 -189 -220 -215 -170 -104 -37 23 102 190 212 230 215 173 137 72 -24 -89 -155 -199 -212 -226 -205 -154 -68 15 72 135 190 224
7729 224 215 176 140 85 17 -73 -136 -187 -193 -208 -200 -158 -87 -3 52 114 186 218 244 209 153 98 42 -33 -116 -181 -204 -218 -195 -183 -142
7760 -142 -53 30 93 132 192 225 215 177 120 42 -18 -89 -165 -216 -212 -206 -180 -150 -80 2 98 146 183 232 247 211 139 87 25 -48 -121
7791 -121 -169 -209 -210 -182 -155 -110 -33 63 129 171 222 221 219 176 101 18 -40 -104 -176 -208 -224 -215 -169 -119 -78 18 110 167 195 219 215 193
7823 193 127 59 -21 -66 -127 -194 -230 -213 -180 -131 -82 -11 70 154 214 206 214 217 167 88 10 -73 -125 -168 -217 -242 -207 -143 -93 -44 33
7854 33 113 176 217 208 187 194 106 31 -61 -121 -166 -203 -223 -224 -185 -117 -39 7 73 174 219 228 215 187 150 77 -10 -93 -144 -176 -204 -225
7886 -225 -201 -136 -64 7 64 132 209 246 227 188 152 112 19 -69 -137 -177 -194 -204 -222 -181 -95 -19 24 102 173 214 240 202 147 113
7916 113 69 -26 -113 -173 -187 -205 -205 -180 -138 -48 44 89 143 207 253 229 189 140 71 16 -63 -159 -201 -197 -194 -200 -157 -94 1 79 128 176
7948 176 212 236 197 139 92 30 -58 -121 -192 -230 -204 -202 -174 -120 -35 61 116 165 206 229 221 187 103 34 -6 -84 -169 -210 -215 -187 -170
7979 -170 -127 -78 17 121 156 190 213 232 197 141 52 -11 -61 -129 -208 -241 -214 -171 -143 -98 -14 62 148 198 186 195 213 164 77 2
8009 2 -49 -113 -165 -210 -233 -208 -149 -96 -50 32 127 195 212 210 199 196 139 27 -49 -89 -138 -201 -230 -223 -181 -111 -62 -7 67 176 216
8040 216 196 205 190 142 75 -20 -95 -153 -171 -214 -252 -206 -134 -74 -20 42 118 198 257 207 176 170 123 19 -56 -123 -165 -188 -202 -222
8070 -222 -169 -75 -21 30 102 191 229 227 214 154 121 63 -28 -129 -165 -185 -217 -225 -196 -151 -57 29 66 113 198 244 205 173 117 63
8100 63 8 -80 -175 -211 -184 -208 -212 -164 -70 2 61 126 175 237 251 211 137 103 46 -53 -128 -180 -208 -213 -185 -172 -121 -35 50 104 156
8131 156 200 224 224 175 87 29 -16 -81 -175 -223 -217 -193 -173 -141 -82 18 112 141 163 210 237 190 132 65 -5 -63 -117 -203 -212 -197 -153
8162 -153 -144 -104 -15 75 149 186 193 213 228 178 75 1 -37 -107 -163 -221 -241 -200 -153 -118 -78 24 123 175 188 202 202 174 128
8191A28
##END NTUPLES=NMR FID
##END=
