##TITLE=1H_LY-nBenz.acid3
 MeOD
 8 sc, 
 6.3.2024
##JCAMPDX= 6.0         $$ Bruker NMR JCAMP-DX V2.0
##DATA TYPE= NMR FID
##DATA CLASS= NTUPLES
##ORIGIN= UXNMR, Bruker Analytische Messtechnik GmbH
##OWNER= root
$$ XWIN-NMR		Version 3.5
$$ Wed Mar  6 16:56:18 2024 Russian Standard Time (UT+4h)  she@DPX200
##.OBSERVE FREQUENCY= 200.1313
##.OBSERVE NUCLEUS= ^1H
##.DELAY= (6, 6)
##.ACQUISITION MODE= SIMULTANEOUS
##.ACQUISITION SCHEME= undefined
##.AVERAGES= 8
##.DIGITISER RES= 18
##SPECTROMETER/DATA SYSTEM= spect
##.PULSE SEQUENCE= zg30
##.SOLVENT NAME= MeOD
##.SHIFT REFERENCE= (INTERNAL, MeOD, 0, 15.7039)
##AUDIT TRAIL= $$ (NUMBER, WHEN, WHO, WHERE, WHAT)
$$ ##TITLE= Audit trail, XWIN-NMR		Version 3.5
$$ ##JCAMPDX= 5.01
$$ ##ORIGIN= Bruker BioSpin GmbH
$$ ##OWNER= she
$$ F:/spectra/data/she/nmr/H-F/1/audita.txt
$$ ##AUDIT TRAIL=  $$ (NUMBER, WHEN, WHO, WHERE, WHAT)
(   1,<2024-03-06 16:55:04.06 +0400>,<she>,<DPX200>,
      <created by zg, POWCHK disabled, PULCHK disabled
       configuration hash MD5:
       00 E9 B6 7A A2 85 ED C7 34 08 36 98 17 FE 4E 26
       data hash MD5: 16K
       29 98 2C 43 49 C1 BA 86 20 B6 0A 67 A2 BC 7A 55>)
$$ ##END=
$$ 
$$ hash MD5
$$ 8A 81 EB A7 B4 FC EE 83 19 46 7C 69 13 34 13 0E
##$RELAX= 
##$RELAX= 
##$RELAX= 
##$RELAX= 
##$RELAX= 
##$RELAX= 
$$ Bruker specific parameters
$$ --------------------------
##$DU= <F:/spectra>
##$EXPNO= 1
##$NAME= <H-F>
##$PROCNO= 1
##$TYPE= <nmr>
##$USER= <she>
##$AMP= (0..31)
100 100 100 100 100 100 100 100 100 100 100 100 100 100 100 100 100 100 
100 100 100 100 100 100 100 100 100 100 100 100 100 100 
##$AQSEQ= 0
##$AQ_mod= 1
##$AUNM= <au_zg>
##$AUTOPOS= <>
##$BF1= 200.13
##$BF2= 200.13
##$BF3= 200.13
##$BF4= 200.13
##$BF5= 200.13
##$BF6= 200.13
##$BF7= 200.13
##$BF8= 200.13
##$BYTORDA= 1
##$CFDGTYP= 0
##$CFRGTYP= 5
##$CHEMSTR= <none>
##$CNST= (0..31)
1 1 145 1 1 1 1 1 1 1 1 1 1 1 1 1 1 1 1 1 1 1 1 1 1 1 1 1 1 1 1 1 
##$CPDPRG= <>
##$CPDPRG1= <>
##$CPDPRG2= <>
##$CPDPRG3= <>
##$CPDPRG4= <mlev>
##$CPDPRG5= <mlev>
##$CPDPRG6= <mlev>
##$CPDPRG7= <mlev>
##$CPDPRG8= <mlev>
##$CPDPRGB= <>
##$CPDPRGT= <>
##$D= (0..31)
0 1.2 0 0 0 0 0 0 0 0.06 0 0.03 0 0 0 0 0.0002 0 0 0 0 0 0 0 0 0 0 0 0 
0 0 0 
##$DATE= 1709729703
##$DBL= (0..7)
120 120 120 120 120 120 120 120 
##$DBP= (0..7)
150 150 150 150 150 150 150 150 
##$DBP07= 0
##$DBPNAM0= <>
##$DBPNAM1= <>
##$DBPNAM2= <>
##$DBPNAM3= <>
##$DBPNAM4= <>
##$DBPNAM5= <>
##$DBPNAM6= <>
##$DBPNAM7= <>
##$DBPOAL= (0..7)
0.5 0.5 0.5 0.5 0.5 0.5 0.5 0.5 
##$DBPOFFS= (0..7)
0 0 0 0 0 0 0 0 
##$DE= 6
##$DECBNUC= <off>
##$DECIM= 32
##$DECNUC= <off>
##$DECSTAT= 4
##$DIGMOD= 1
##$DIGTYP= 9
##$DL= (0..7)
0 120 120 120 120 120 120 120 
##$DP= (0..7)
150 150 150 150 150 150 150 150 
##$DP07= 0
##$DPNAME0= <>
##$DPNAME1= <>
##$DPNAME2= <>
##$DPNAME3= <>
##$DPNAME4= <>
##$DPNAME5= <>
##$DPNAME6= <>
##$DPNAME7= <>
##$DPOAL= (0..7)
0.5 0.5 0.5 0.5 0.5 0.5 0.5 0.5 
##$DPOFFS= (0..7)
0 0 0 0 0 0 0 0 
##$DQDMODE= 0
##$DR= 18
##$DS= 0
##$DSLIST= <SSSSSSSSSSSSSSS>
$$ [...]
##$SUBNAM2= <"">
##$SUBNAM3= <"">
##$SUBNAM4= <"">
##$SUBNAM5= <"">
##$SUBNAM6= <"">
##$SUBNAM7= <"">
##$SUBNAM8= <"">
##$SUBNAM9= <"">
##$SW= 18.0517328524113
##$SWIBOX= (0..15)
0 0 2 0 0 0 0 0 0 0 0 0 0 0 0 0 
##$SW_h= 3612.71676300578
##$TD= 16384
##$TD0= 1
##$TE= 0
##$TE2= 300
##$TE3= 300
##$TEG= 300
##$TL= (0..7)
0 120 120 120 120 120 120 120 
##$TP= (0..7)
150 150 150 150 150 150 150 150 
##$TP07= 0
##$TPNAME0= <>
##$TPNAME1= <>
##$TPNAME2= <>
##$TPNAME3= <>
##$TPNAME4= <>
##$TPNAME5= <>
##$TPNAME6= <>
##$TPNAME7= <>
##$TPOAL= (0..7)
0.5 0.5 0.5 0.5 0.5 0.5 0.5 0.5 
##$TPOFFS= (0..7)
0 0 0 0 0 0 0 0 
##$TUNHIN= 0
##$TUNHOUT= 0
##$TUNXOUT= 0
##$USERA1= <user>
##$USERA2= <user>
##$USERA3= <user>
##$USERA4= <user>
##$USERA5= <user>
##$V9= 5
##$VALIST= <valist>
##$VCLIST= <CCCCCCCCCCCCCCC>
##$VD= 0
##$VDLIST= <DDDDDDDDDDDDDDD>
##$VPLIST= <PPPPPPPPPPPPPPP>
##$VTLIST= <TTTTTTTTTTTTTTT>
##$WBST= 1024
##$WBSW= 4
##$XGAIN= (0..3)
0 0 0 0 
##$XL= 0
##$YL= 0
##$YMAX_a= 15449
##$YMIN_a= -11786
##$ZGOPTNS= <>
##$ZL1= 120
##$ZL2= 120
##$ZL3= 120
##$ZL4= 120
##$ABSF1= 10
##$ABSF2= 0
##$ABSG= 5
##$ABSL= 3
##$ALPHA= 0
##$AQORDER= 0
##$ASSFAC= 0
##$ASSFACI= 0
##$ASSFACX= 0
##$ASSWID= 0
##$AUNMP= <proc_1d>
##$AZFE= 0.1
##$AZFW= 0.1
##$BCFW= 1
##$BC_mod= 2
##$BYTORDP= 1
##$COROFFS= 0
##$CY= 11.3945322036743
##$DATMOD= 1
##$DC= 2
##$DFILT= <>
##$DTYPP= 0
##$F1P= 15.7292609196834
##$F2P= 12.9074282941183
##$FCOR= 0.5
##$FTSIZE= 0
##$FT_mod= 4
##$GAMMA= 1
##$GB= 0.15
##$INTBC= 1
##$INTSCL= 1
##$ISEN= 128
##$LB= 0.24
##$LEV0= 0
##$LPBIN= 0
##$MAXI= 10000
##$MC2= 0
##$MEAN= 0
##$ME_mod= 0
##$MI= 1.114404
##$NCOEF= 0
##$NC_proc= 0
##$NLEV= 6
##$NOISF1= 3.799351
##$NOISF2= 2.8
##$NSP= 1
##$NTH_PI= 0
##$NZP= 0
##$OFFSET= 15.70392
##$PC= 1
##$PHC0= -24855.29
##$PHC1= 6.987311
##$PH_mod= 1
##$PKNL= yes
##$PPARMOD= 0
##$PSCAL= 0
##$PSIGN= 0
##$REVERSE= no
##$SF= 200.130013532006
##$SI= 16384
##$SIGF1= 3
##$SIGF2= 2
##$SINO= 400
##$SIOLD= 16384
##$SREGLST= <1H.CDCl3>
##$SSB= 0
##$STSI= 0
##$STSR= 0
##$SW_p= 3612.71676300578
##$SYMM= 0
##$S_DEV= 0
##$TDeff= 0
##$TDoff= 0
##$TI= <>
##$TILT= no
##$TM1= 0
##$TM2= 0
##$TOPLEV= 0
##$USERP1= <user>
##$USERP2= <user>
##$USERP3= <user>
##$USERP4= <user>
##$USERP5= <user>
##$WDW= 1
##$XDIM= 8192
##$YMAX_p= 0
##$YMIN_p= 0
$$ End of Bruker specific parameters
$$ ---------------------------------
##NTUPLES= NMR FID
##VAR_NAME=  TIME,          FID/REAL,        FID/IMAG
##SYMBOL=    X,             R,               I
##VAR_TYPE=  INDEPENDENT,   DEPENDENT,       DEPENDENT
##VAR_FORM=  AFFN,          ASDF,            ASDF
##VAR_DIM=   8192,          8192,            8192
##UNITS=     SECONDS,       ARBITRARY UNITS, ARBITRARY UNITS
##FACTOR=    0.0002768,     1,               1
##FIRST=     0,             0,               0
##LAST=      2.2672688,     0,               0
##MIN=       0,             -11786,          0
##MAX=       2.2672688,     15449,           0
$$ Real data points
##PAGE= N=1
##DATA TABLE= (X++(R..R)), XYDATA
0@%%%%%%%%%%%%%%%%%%%%%%%%%Lj1J6j6J6j6J6j6J7k5L2l2L3l9M6m9N5o2O6p4
45d0Q2r1J03j11J22j36J50j66J82j99K22k46K72l04L42l88M41n08N96p14Q81j140
67f50J608k704J0793O402j0676m732n281k265l415q66O52N393P285P444K868j557
83A0299m780l218j816k054m274l224N25M723N376L759O91j686k587j251l95j497
99a409l160j883K005N322M674J254j832k332j691j603k172k632k398k57L784O486
115B156M976R89j433j237r03k154m372n123l210M80L761N114M213J901N20R48
131F626J038j524m970n805l087L56K215K253J731J514J908K391J699q24l614m077
147b170j645J078J443j2n99P09K041J852L56j399k610k007L20K036J505k55o46
$$ y = [0, 0, 0, 0, 0, 0, 0, 0, 0, 0, 0, 0, 0, 0, 0, 0, 0, 0, 0, 0, 0, 0, 0, 0, 0, 0, 3, -8, 8, -8, 8, -8, 8, -8, 9, -16, 16, -16, 17, -22, 24, -25, 30, -32, 34, -40, 42, -49, 54, -57, 65, -71, 79, -87, 95, -104, 118, -128, 144, -160, 182, -206, 235, -273, 323, -391, 490, -650, 958, -1746, 9047, 15449, 4773, 41, -5240, -7505, -10920, -11786, -11134, -5741, 1544, 8988, 11856, 10299, 5519, 2301, 485, -1569, -5843, -9067, -8542, -3819, 1557, 5316, 6007, 4321, 1734, 483, 88, -1409, -4569, -6452, -4447, 875, 5549, 6803, 4971, 2639, 948, -655, -2827, -5459, -7857, -8114, -4330, 2156, 7132, 8121, 6688, 5451, 4548, 2394, -1978, -7101, -10311, -9831, -6070, -956, 3257, 5158, 5678, 6626, 7664, 6140, 1170, -4635, -7722, -7366, -5151, -2898, -1167, 347, 2255, 4646, 6345, 5521, 1907, -2170, -3815, -2737, -1294, -1306, -1905, -1196, 845, 2697, 3053, 1654, -956, -2963, -2643, -607, 898, 643, -3]
164cQ05K027R86j554l178k509p22P70J482J179M07N75K035K561O98k307l559k320
182b627k91K83j29l33M06J686K649K381O30j625k445j168L28J7j434j523J95J803
200a197K077J128k49j159r15K02Q38J53j197j294L92J958J356o37j711j127m9
217a431N37N17l8m97kJ401K105Q53j307k251j176J62K48o24q59K3J236J964J838
236B699N78j062j683p01K93k60j469j392J83J776K013J010j32o55n76j43Q7n18
254D8j453j268M98K052J681P3p39m13J19Q1m61j053j156l63J042J940J328k08
272A748r82k15N15k4j326j645p64M91J346J583R13j31m30J03M33m14j777j981
290b557m76J027J502R10M01L72L92L88N0q52j932j848k98J101J257M31J82P54
$$ y = [-3, 802, 2829, 3815, 2261, -917, -3426, -4148, -3378, -1896, -717, -310, 265, 2300, 4861, 5559, 3252, -307, -2627, -2918, -2635, -2764, -3097, -2691, -1005, 1644, 4025, 4655, 3030, 585, -583, -255, -238, -1672, -3195, -3000, -1197, 880, 2008, 1759, 600, -315, -113, 725, 878, -319, -1613, -1221, 737, 2093, 1456, -255, -1382, -1431, -894, -377, -415, -912, -914, 487, 2592, 3445, 2138, -113, -1289, -1127, -879, -1503, -2362, -2339, -1103, 861, 2699, 3277, 2215, 532, -169, 124, -136, -1605, -2997, -2814, -1038, 975, 1985, 1853, 1198, 622, 479, 566, 48, -1405, -2673, -2175, -123, 1558, 1631, 892, 479, 598, 679, 218, -835, -1991, -2354, -1312, 628, 1956, 1748, 766, 551, 1066, 1042, -284, -1929, -2693, -2202, -856, 727, 1640, 1509, 1079, 1182, 1615, 1201, -576, -2557, -3033, -2006, -504, 406, 807, 1179, 1571, 1959, 2009, 1157, -775, -2623, -2921, -1820, -563, -132, 50, 804]
308H04J193P20l79j385j737j340k74O83P66J03J47J076J722R09p30j560j281o15
326a178j42KM1o0L20J175J503P55p48j453p50J19N1m69m61J66P10J074Q90J60
346A705r02j126m47K75J23n24n01M92J343J147L08m13p70p87n49j15k62o69l96
365b068P93J716J321J73m46l35k12l80p89r32q50l01O23J337J109K15k28K24N99
384A569J8r05j163p13r4L00M61K94o3n4L89Q34L17n54q47j33N26L58k22l70l11
405c63r7P2K22L9m48l69L60R98P54j32m94j29J62l1n33o85n60k59K94Q37O50P8
427C66j56L27P27J90o42q56m83j01L4L9j8r1k3L50P55M44k41n31N6N65J96m13
449D94n16l74k13j12PK7j44j16N25J066P62j4l70j76Nm02q20q01n32j44L65Q36
$$ y = [804, 1997, 2717, 2338, 953, -784, -2124, -2398, -1715, -949, -846, -699, 377, 2099, 3008, 2278, 718, -563, -1178, -1320, -1318, -1277, -1337, -1017, 158, 1661, 2416, 1668, 215, -535, -416, -365, -834, -1295, -1129, -419, 655, 1545, 1705, 803, -323, -770, -495, -372, -896, -1397, -905, 438, 1585, 1893, 1480, 710, -77, -626, -741, -1003, -1672, -2068, -1275, 441, 1762, 1935, 1489, 1154, 942, 562, -227, -1159, -2009, -2310, -1687, -350, 759, 974, 746, 970, 1569, 1587, 682, -481, -1194, -1288, -988, -527, -233, -296, -350, 39, 873, 1190, 636, -211, -344, 182, 540, 318, -52, -363, -460, -388, -166, -127, -575, -944, -584, 414, 1168, 1036, 542, 413, 575, 544, 11, -674, -1234, -1493, -1199, -362, 288, 366, 210, 537, 1264, 1454, 812, -44, -527, -628, -594, -555, -573, -664, -687, -337, 418, 862, 621, 90, 146, 711, 907, 494, -22, -396, -609, -721, -714, -687, -831, -947, -422, 644, 1406, 1392, 1022, 846, 851, 449, -371, -1172, -1704, -1848, -1483, -647]
471f47R04M83J76M19N01j26r23j162o57k87j4J03L38M56M50N60O88K57n56q10
491A53l99O1ll12j97K40L82K92R6nl76m90j09L83M72j6k9L88N49J00m58o95o64
514f37n64l18R8M21M57M98Q11J049M74m17r10q21o85p85o29j47L14O82R94J187
534A072R06J49m45n35m97p59j035p37l9N03O24P98P48M68Kj74j74l81q06p02j02
555a116M36M80K34K55K27O3k07k90l04l85l10J55O43O42K72M1J51l3m97p45o91
576i79m21j58J87O70R17O89L64K81J68l31r46j093p20l12j09K72P04Q82P11N57
596A333M35J5n88r92p42m19k56k18J46O87P57N09L04K10j81n35n56k97j12k12
616g12q0L64N80L14L9n8r7l19l90j83P2N5P3L46N77L56p6l79k85l03m47m27k6
$$ y = [-647, 257, 740, 916, 1335, 1836, 1710, 787, -375, -1032, -1319, -1333, -1230, -892, -436, 14, 574, 1262, 1519, 963, 153, -246, -185, -188, -500, -697, -457, -75, 217, 313, 308, -68, -558, -667, -284, 188, 172, 143, 531, 1080, 1180, 722, 27, -637, -1201, -1519, -1421, -1000, -543, -45, 766, 1815, 2289, 1872, 962, 141, -544, -1329, -1958, -2105, -1791, -1109, -115, 1072, 1978, 2127, 1682, 1147, 650, -109, -1144, -1881, -1920, -1417, -793, 5, 753, 1221, 1223, 1049, 875, 494, -312, -1014, -1116, -680, -200, 34, 289, 516, 579, 372, 82, -222, -607, -917, -762, -119, 523, 795, 836, 987, 954, 457, -288, -979, -1400, -1558, -1371, -701, 216, 905, 1269, 1550, 1718, 1387, 441, -652, -1372, -1684, -1793, -1521, -817, 65, 776, 1333, 1768, 1783, 1195, 203, -539, -958, -1214, -1432, -1286, -599, 158, 667, 971, 1181, 1000, 465, -91, -388, -500, -712, -792, -428, 152, 466, 505, 447, 350, 31, -359, -542, -470, -415, -342, 4, 581, 937, 861, 482, 197, -106, -553, -980, -1006]
639a006K47K84M06N89N72P7k43l77k93m39o32l71Q9L45L56M37N13M30k6k24j87
660E47l18n04n17q4K27K40J76K65L87K01j32j86r3k20l03j65J76K31O7L8J54J81
682C68j09k83j34j8r7n6J29L20J49j0J8J15r4l23l35q0R2j3P1K80L21J02o8N0
706C95n4k63l51j82Q9N5j3J69L20K29j9j22j4r1k85k54L2J76K0K5K43K52Lj42
730B18j17l5j70j99p5K02J75j1O7K32O4j70k12n6nj71j19J83K43J08k4R0J14j37
754A95k88j75PMn6Q9L00K66M7q5L2m9l18l52j03O0K9O2K84M01J77pj9j03k68l57
780b27l13k0M0M9J77L94L51J10n3k9j00l65l43j94M9O1K4K34L69K04nj06j2j24
804A71k94k25L1J41J5Q2K36J96m9j67j17o9j83j66K5K04K54J17J40J99pk71l12
$$ y = [-1006, -759, -475, -69, 520, 1092, 1169, 926, 549, 256, -183, -815, -1186, -1097, -752, -396, 41, 554, 984, 958, 734, 547, 229, -275, -792, -876, -649, -409, -233, 32, 419, 620, 488, 302, 209, -11, -314, -479, -303, -72, -5, 33, 187, 368, 259, -24, -158, -176, -273, -329, -200, 120, 269, 259, 277, 392, 298, -25, -360, -440, -348, -361, -290, -10, 311, 413, 345, 395, 341, 78, -273, -455, -366, -311, -324, -155, 165, 394, 375, 253, 239, 148, -137, -391, -359, -183, -163, -138, 105, 357, 360, 218, 101, 66, -104, -303, -378, -176, -1, -12, 55, 287, 351, 181, -31, -87, -92, -263, -382, -199, 44, 152, 128, 218, 332, 195, -93, -268, -261, -257, -313, -224, 76, 342, 389, 304, 336, 287, -31, -383, -486, -426, -397, -335, -51, 350, 527, 520, 501, 398, 130, -227, -540, -560, -520, -471, -294, 100, 451, 561, 508, 479, 379, 14, -329, -523, -474, -413, -389, -155, 214, 418, 413, 307, 295, 171, -123, -348, -317, -176, -161, -79, 157, 353, 304, 137, 20, -49, -232, -398, -373, -169, 85, 202, 342, 541, 534, 263, -49]
827d9j70j82k10r8K14L90K54K19K72J64j43l47l43k13k98k89K8K89L33K34K62
848C17L43J55j87l15k04k26l16j95L1K38J82J46K22K27L9j42k00l8r3j96q4J42
870a54J45lLJ36J2j18j86mN9joJ61K15J23n6r8k6j39l02k41K1O2M7J28L52L11
896D41J14m1Rj00k74l85k27n8n2J5J97L57K66R8Q9J33m6k84l03j61q1j54m6J31
920c62J73J70P3J89J31j3j51j00Ln3j93j18N8R4p1K6J03R3l1k8J35P8k9r4J4Q4
946A81p0j87j20N3m2p8k0K03J35l6P3J76J36j47j19o5o8j44j84n4R4M6J0J81K38
971A92R5j3K3Q3o9k51k22o4n5j15J0J35J66J16J35J34J49n8j97j17k8j30k46o8
995c95P2R6O2J39J75J37l2l7L0l0j82k18m7Q2k5j5O0J53M3koR3l0j17m9J03M2
$$ y = [-49, -219, -401, -611, -709, -495, -105, 149, 368, 640, 804, 661, 314, -29, -242, -540, -829, -801, -512, -179, 55, 317, 660, 815, 628, 313, 109, -117, -433, -628, -597, -359, -177, -31, 191, 418, 457, 315, 115, 77, -16, -212, -296, -154, -9, -12, -9, 127, 139, 21, -165, -169, -110, -111, -117, 44, 259, 382, 326, 228, 202, 63, -239, -480, -459, -397, -350, -222, 130, 441, 555, 514, 523, 423, 149, -236, -463, -521, -573, -558, -361, -4, 262, 360, 449, 582, 536, 252, -51, -212, -293, -447, -493, -362, -189, -19, 54, 243, 374, 361, 210, 110, 113, 60, -133, -251, -193, -99, -170, -144, -41, 52, 21, -7, 128, 206, 177, 83, 97, 181, 111, -76, -196, -143, -185, -263, -283, -80, 55, 19, 92, 268, 404, 257, 138, 73, 5, -139, -323, -377, -283, -237, -227, -46, 192, 287, 274, 297, 380, 311, 60, -162, -226, -281, -396, -386, -251, -85, 31, 166, 300, 449, 391, 194, 77, 49, -81, -327, -395, -323, -227, -165, -26, 149, 286, 254, 217, 247, 217, 35, -183, -230, -148, -173, -188, -128, 25, 68, 66, 60, 153, 123, 6, -43, 60, 102]
1022A02q5p4L0R6j09o9l0J7lj7J23K19M2p7K1M7l1k19k24pl9m1K3K03J67R5R6
1049B56J05N0j58k62j43l6q3j30M5J95J71R5J61J13rj98j46l3n2j72j01N2J87
1072i3R6M8O4J03o7r4l5Nq8j48J0J59J25l5m7N7O2q6p9o0M2n9J6J31J43rj02j6
1100D3J09n4j86q5PP0nL4J58R3l5k5L3rj43j87m6R6K9j1P2J44L8j3mK8q6j73r3
1129b01J01J7l3k8J28J59L1n6k1K9j08j45L1Q3q2n9O6J44J00p0l8L8j4l2p5J6
1155a9j9r4j7Q0J20pr4N0J13L4r7m0J4nn7m7J5Ro7J3J22P0J3q9L5J35m9o5n9j2
1185a4o4m5J3O8Rk9K8J55M0l6j16J5L4p1m0j7M1l9l4N5O4j5q2M8R4O0n5pM8jo6
1216D1q9J1o8j01n1Q3J41K2L2J18J53K4j17j09p8j20j82k2L6M3O9P4K68K08l6
$$ y = [102, 17, -57, -27, 69, -40, -109, -139, -122, -125, -142, -19, 200, 242, 165, 186, 233, 202, -17, -241, -248, -287, -328, -305, -102, 65, 160, 256, 361, 411, 253, -9, -152, -188, -271, -401, -356, -161, 10, 105, 266, 379, 370, 172, 26, -7, -59, -231, -332, -280, -93, 3, 51, 115, 218, 151, 57, 22, 27, -61, -209, -199, -40, 85, 50, 3, 60, 122, 36, -43, -103, -61, -120, -104, 27, 170, 161, 59, 43, 152, 98, -88, -173, -166, -96, -101, -67, 91, 184, 149, 124, 157, 148, 5, -182, -228, -132, -103, -114, -42, 102, 140, 127, 123, 151, 65, -108, -201, -100, -83, -116, -144, -16, 143, 174, 118, 97, 126, 18, -127, -96, -13, -95, -154, -88, 56, 156, 86, 48, 86, 72, 40, -35, -19, -38, -132, -149, -69, 51, 44, -50, 0, 113, 147, 50, 10, 24, 19, -38, -85, -70, -61, -128, -115, 7, 77, 90, 1, 36, 171, 122, 57, -2, -14, -78, -123, -110, -42, -33, -62, -34, 121, 161, 125, 9, 24, 58, -13, -53, -70, -29, -68, -102, -47, 17, 2, -80, -32, 62, 122, 67, 60, 108, 107, 41, -48, -37, -105, -206, -257, -174, -33, -11, 21, 139, 292, 316, 199, 90, 12, -108, -290, -312, -276, -233, -164, -90, 178, 386, 350]
1241C50r9j6p1k01j81j22JL9N2J65K31O6k9K7K7l8j79j69k2K1OQP9R1L0p6R7O
1269I3p6r6KR5P3k9K8M0or6j10n4p3o6lJ91J74J04L7J02Q1j36j74k22j35j21j21
1296d98O0J82K09J42J98J91O0j36k38j73j43j85j70N7J57J45J53K40J62Jj26q2
1318B06r1j31k00j15N9Q6Q5L6J77O1m9p4MRp9j23P2J01L9K1l9L8m7j63q9N5j2
1345a63kO0J95J92N0m8jr4j60k10j57k7qL8J62K48J69J07O5J5q6k66k40j09q7
1370c57n9MJ68K19J39J14J21P1j11j94j34o7j28r0J6J17J23O5O9Q3L9j11p7kj3
1395Em6n7L3J08J4k1o1M3l5q4j9O4M1lO7J00P1p0n4o3p2j36j02QN9Q9P1J40J67
1424B57J6n0l9l6j16j63j31kM5oQ6J69J53L6oK4k4j19j47n8l6k7l7O5J17J25j0
$$ y = [350, 251, 235, 164, -37, -218, -340, -339, -300, -248, -83, 148, 214, 185, 212, 239, 201, 22, -147, -169, -148, -142, -134, -55, 36, 66, -10, 87, 93, 17, -79, -77, 18, 91, 62, 90, 130, 124, 28, -82, -136, -209, -275, -278, -87, 87, 191, 228, 330, 411, 275, 101, -121, -256, -377, -498, -438, -256, -47, 95, 293, 484, 544, 408, 170, -3, -146, -331, -501, -444, -287, -142, 11, 251, 413, 414, 288, 206, 115, -16, -216, -331, -272, -186, -101, -65, 112, 173, 124, 50, 54, 63, -16, -139, -67, 34, 73, 94, 55, 93, 46, -117, -206, -151, -163, -165, -105, 90, 282, 332, 284, 283, 189, 29, -181, -338, -365, -373, -335, -173, 75, 244, 351, 416, 431, 345, 79, -161, -270, -357, -416, -412, -244, -25, 114, 228, 349, 420, 309, 115, -19, -86, -214, -304, -288, -171, -48, 17, 86, 169, 208, 97, 20, 18, 5, -41, -98, -65, 43, 57, 36, -25, 18, -17, -101, -120, -56, -15, -18, 49, 149, 220, 150, 96, 33, -39, -175, -277, -269, -210, -121, -50, 90, 257, 273, 223, 184, 148, 32, -131, -262, -264, -219, -225, -139, 30, 183, 219, 213, 237, 213, 94, -53, -111, -147, -174, -211, -146, -29, 96, 86]
1451H6MN3j1o9r2K2k0m1m8L5O9Pm4J9N1L7q2K8M9rl4k3L2J3m2k5pM4m4l2Q9J2
1483B7K1m6N7O0m8o6j6K0j8p5j4M8K6k1K0N9P4k7o8J8K8o9n6PPJk9K1O3J7j0K5
1515C6M1J2n9p0J2Pm6n9Q9N9J2k5L8P1Oj25j1K2m4o7k1N2P3l0RJ02N3k1o6Ok0
1546C6j13p7%O2J9PO7J16K9o0QMn5j09o2K0M8krQ1J15j9k6Qmn6q2qK1jm1M7O5
1579B9Ml6oK0Rn7k5N4L6mKK5N6q7p5jnk1n5K6J08P8J7L5N5Oj16p4p0n8q3k3O9
1612a67J17M7O7J26P9qj12o2j23j32p8l2N9N8K7J32J55R3j9m5n0n8j07j28o2L9
1638a84M9QJ03J07O6j5j7J6m4q4m1lJ7rLL0J9k3n6MN3j3l7L9O1R6m8J1J1n4q8
1669b3r8l4l5m6N0J21J34J03N6N3J7r5j44j36j09q6n1M8J25J23R5J24J22O0p2
$$ y = [86, 90, 143, 132, 63, -29, -7, -27, -68, -116, -81, -12, -5, -49, -30, 21, 58, -24, 4, 53, 44, 10, -13, 19, 32, -10, -35, -42, 2, -42, -74, 15, 27, 48, 2, 59, 119, 71, 5, -11, 9, -9, -84, -98, -50, -24, -45, -25, 34, 108, 81, 13, 31, 59, -10, -66, -59, -52, -51, -80, -59, 4, 21, 11, 36, 77, 89, 30, -40, -28, -21, -67, -126, -37, 22, 34, 9, 47, 118, 124, -1, -12, 10, -34, -101, -122, -70, 3, -27, -18, 84, 137, 116, 50, 56, 36, -77, -154, -154, -92, -73, -66, 1, 117, 146, 86, 94, 98, 43, -66, -128, -108, -60, -62, -71, 10, 125, 106, 80, 88, 84, 28, -54, -62, -41, -42, -83, -36, 29, 33, -3, -9, 11, 20, -37, -62, -8, 28, 24, 26, 51, 107, 20, -55, -56, -61, -82, -137, -111, -3, 75, 92, 127, 182, 188, 72, -2, -72, -130, -213, -236, -167, -50, -3, 64, 190, 269, 261, 149, 87, -36, -168, -246, -278, -219, -161, -134, -2, 153, 246, 227, 182, 132, 74, -33, -161, -223, -184, -135, -127, -24, 83, 149, 134, 117, 133, 89, 5, -36, -39, -22, -31, -28, 2, 21, -2, -58, -54, -1, -14, -51, -12, 49, 145, 97, 108, 119, 65, -23, -121, -155, -190, -236, -186, -65, 69, 172, 228, 281, 298, 203, 59, -77, -186, -272, -323, -275, -150, -27, 68, 192, 314, 374, 302]
1694C02j86j08o4j48p8k2O2J10R0J45J22K5n3n3n8o1j06p9J2J8L4M4P4L5j7pJ8
1721E1Ll0n8OJ00M3o2j8j4m5n5o7L2j0j3P9J36J28J2j5Lm8j05j67r3q8J4J2J23
1750a46J77R2Q4L4Q6o0j48k01r0p1n9J1J02J16Q4J15J32Q2o1j33j15k7p8j34j3
1775b21N0Q8M0J00O3j2l4k7K6Kp8r2K8Q8Pjn5J8k9m9K3M1k1l2R4J39N6l9o8p0
1805C5j2j01o6m7j6M3R5R7J76O2k9n5J6o4j63j38j16J9N0Q6J01J10O4L8N1K7j38
1832A25j67p6k5J1l1JP8P5R0N9K7l2r9n2M3or7l7J6Q1N6Rl1J1o2J8K6J9l2k7L1
1863BJ07K6o4q3m7K7k7j4l3K3J0Q1J32M0k4j17j9J4m3p2r0kN5P3Q8R2k6l1K1N0
1893A49k6j03j54k5O3M1j1J5N8M8M5M2j1q6j06k0P3Rj4r1J4R4O1k2k2k2j6RN3
$$ y = [302, 116, 8, -56, -204, -282, -304, -242, -132, -42, 103, 225, 250, 197, 144, 86, 25, -81, -160, -148, -130, -96, -52, 22, 57, 40, 33, 51, 54, 24, -34, -28, 72, 115, 53, 35, 21, -24, -79, -146, -114, -124, -137, -58, 78, 206, 218, 203, 206, 158, 53, -114, -207, -295, -281, -269, -146, 31, 123, 207, 241, 327, 267, 119, -82, -172, -243, -302, -291, -189, -73, 11, 126, 258, 340, 279, 146, 31, 4, -74, -208, -221, -171, -83, -43, 57, 120, 108, 74, 47, 73, 75, -3, -95, -67, 21, 28, 27, -28, -10, -39, -88, -65, -24, -45, -77, 17, 156, 212, 173, 105, 35, 23, -78, -144, -191, -207, -164, -69, 28, 204, 266, 237, 182, 198, 134, -29, -167, -283, -264, -214, -128, -27, 83, 147, 185, 236, 263, 125, -42, -118, -143, -132, -163, -162, -84, -9, 81, 140, 167, 135, 36, -16, 27, 21, -76, -113, -97, -16, 40, 49, 18, 29, -33, -15, 11, 30, -2, -29, 2, 109, 135, 71, -12, -59, -32, -59, -73, -106, -83, -73, 8, 140, 180, 156, 39, 20, 34, -9, -81, -171, -173, -118, -45, 43, 135, 109, 78, 99, 149, 123, 20, -134, -159, -96, -55, -66, -51, 7, 55, 100, 142, 131, 45, -61, -81, -8, 1, -13, -104, -90, 4, 65, 43, 21, -1, -17, -8, 45]
1922D5J8p1m6k2J19K7k7q5j0K2O1J8j2k7m1L6P7K9p5r6j1R7O2o5p1k5N0O4PJ4
1952F2n1q4L4P7M8p7j01mQ8O1j9l3k5J4pQ5%m6j01LP7P0n9p8J5Q1K9K2l2k9l9
1983a9J2O0j5n8q0mJ16O7j9n4l8O7L1km5r2o6LJ15N1l0p1L6J30L3Oj19o6kk2N2
2014b3j4n2j7L0J53Q2l7r5l9M5J6j9q5m8k1Q0R4L4o7q2J2J12N6r1q6k4K2R0J4
2043D0j1p7k1J9P1L5p8r1M3Q2J05j4n4o3M0JK7n4r3q4L6J25J23j9k1k7Q5O7q4
2072A08j12j36j5RJ02J0n3J9P9J55N5n4j66p0J1K6j9p8k2MJ06J45M6m1j27K0Q3
2099H5J7p7j04m2N9R3K1mq2l0M6J04mr3p7L5J14Q1l6r7l8l4K2L6m8o8m1P1J58
2128F7R0m1o2j7M4%n0j40q4pO0J21Q9k3pJ9J54M3j39j62r1PJ1K8Rj1QJ28J26L8
$$ y = [45, 63, -8, -54, -76, 43, 70, 43, -42, -52, -30, 31, 49, 37, 10, -31, 5, 82, 111, 36, -60, -71, 26, 88, 23, -48, -73, -23, 41, 48, 62, 11, -73, -39, 38, 86, 9, -92, -96, -8, 53, 34, 1, -24, -10, -17, 68, 68, 22, -79, -76, 1, 71, 12, -66, -51, 30, 59, 81, 49, 20, -19, -7, 53, 38, -20, -100, -104, 12, 79, 60, 6, -32, 35, 66, 64, 19, -73, -139, -136, -21, 30, 0, -71, -35, 95, 128, 134, 15, -51, -53, -75, -23, -37, -89, -106, -76, 77, 159, 122, 27, -12, 33, 49, 30, -55, -103, -124, -44, 50, 84, 17, -65, -53, 59, 115, 24, -62, -86, -64, 26, 40, 29, -48, -69, -50, 21, 56, -22, -113, -70, 12, 117, 103, 49, -14, 26, 27, 54, 0, -93, -177, -141, -16, 107, 88, 67, 40, 125, 192, 108, -4, -140, -155, -146, -44, -34, -87, -68, 11, 166, 221, 167, 1, -69, -58, -32, -51, -129, -151, -147, -41, 104, 150, 109, -18, 2, 85, 102, 25, -79, -121, -62, 31, 52, 48, -34, -64, -18, 86, 82, -11, -88, -53, 61, 142, 106, 9, -29, -63, -41, -5, -53, -121, -162, -91, 67, 157, 116, 54, 37, 81, 81, 31, -109, -193, -200, -140, -19, 70, 47, 40, 59, 213, 256, 117, -45, -136, -129, -118, -90, -81, -92, -84, 44, 170, 208]
2158B08j00j03m5K3O5q2j06QM1R1P3Ql9r6J6R3M5r7r7L8R0Q6k6j28p8J8M2O5p
2187Fk9p1Q8J11O8k5j05p0K2J7l6r3n2k0J35J21N3k3n9J9L9M0j00j51r1L8R1L0
2215d7L8m0L3J08P9L4j14j48m0P4Rm4p0L1M4R9P1qp7q6L1Q8N1j06j02J6O7R5j9
2244F7p8m3k7N9Q6qo3o8L5J37N0r6q9n1K8N6j1k8o0M2P6P4O0m1p6n8P9J4p9j24
2274a37k9L4J06R1Ok1j3L5O3%j15j55J8O2M4Oo2K1L3N9Q4j9j06p1J6P3K2n8o0
2303g3j4J12L6j0l9m4k5N4K3O6q6p3L1J11M2o4j17j8K9O1L0kp8j5N8O6N5q7p3
2332d4k3M4P2o7m7o0N2J01L7K3m9n9LO2K0o4j01j7P3O6M6p6PnL4P7j1j12q1M6
2362e3N1P1p7m7k1O9Q2l3Jp1l6M2L7N5r2l1j3R6L8l4o0l4M3K6J5Mn9k5M4N8L8
$$ y = [208, 108, 5, -40, -17, 48, -34, -140, -132, -91, 0, 73, 81, 42, -54, -38, 55, 100, 3, -94, -56, 34, 120, 94, -34, -112, -94, -52, 13, 6, -23, -94, -6, 105, 173, 148, 43, -27, -5, 12, -24, -117, -169, -189, -54, 67, 120, 97, 38, 57, 96, 136, 36, -115, -206, -168, -77, -47, -9, -49, -16, 92, 171, 205, 91, -57, -97, -23, -14, -58, -128, -97, -53, 46, 117, 109, 32, -54, -23, 65, 116, 10, -92, -76, -9, 86, 67, -11, -54, -81, -22, 64, 56, -7, -75, -40, 97, 147, 51, -38, -89, -61, -5, -16, -44, -104, -62, 14, 88, 148, 107, 31, -27, 52, 66, -13, -137, -166, -132, -26, 65, 71, 50, 37, 72, 135, 135, 20, -135, -117, -55, -11, -5, -67, -46, -13, 46, 130, 111, 5, -66, -50, 23, 45, -13, -73, -87, 25, 61, 51, 12, -32, -57, -3, 20, 86, 0, -73, -42, 69, 111, 47, -70, -88, -59, 2, 32, 30, -48, -63, -5, 61, 116, 29, -44, -67, -23, 49, -18, -65, -125, -73, 28, 65, 88, 39, -20, -17, 45, 65, 1, -100, -117, -44, 22, 68, -8, -1, -6, 28, 105, 94, -18, -99, -53, -2, 69, -8, -55, -76, -7, 75, 42, 43, -28, -64, -22, 15, 70, -22, -53, -66, 30, 68, 34, -26, -60, -17, 9, 24, 28, -31, -56, -12, 46, 84]
2393H4n7j04L1M7K0J3q2jK6K9N2J3o5m9K2O1M8q5p5rR1M3j9k4m7k5O7L8No8p2
2424i2K9O2N7l4n6J2J9K6M7l3l3n8N5M6oj8p6NP0O2l4m3qNK6Oj0o7oJ8O3J0l1
2457A3m0k2N7L9om0l2J3j3M8%l9l7L7P5J2j6o0qN0Rl2jn2J3L6M5J8o3k7qO7oQ
2491C8o2l5L6N6mqm4k4KN7K2m1n1RN6N6j4o3NNJ7Lj3j5n8M3N8N2j3q1j6N8K2m7
2525F%m3k3PP1J1j0m1M7M4Rm4p1j9K0J1rPK2l6M9N1K1k8q2PO0k2J1r8L9J8J5M0
2559D0Nl3l5J2N0Nn1j4j4N4L9l7k9j3pL2j7K3j2o7K6Q5N4l3o4J3jj7j5k7k9J3
2591f4QO7M7l1l0K8M6j6k8o8jkRL7QMrL7J7K4n4k4l2J5Qpn1N1J2J1J9qj1l2K1
2626AK4J3l2m1J7M7J0j6j8k0kMJ4K6Qo4O1K0K3o8nJ1j6lk6K2j7OK3L5J5j6j7j5
$$ y = [84, 27, -77, -46, 1, 21, 34, -48, -49, -23, 6, 58, 71, 6, -43, -21, 40, 88, 3, -72, -81, 10, 53, 34, 10, -37, -62, 5, 43, 48, -20, -92, -63, -1, 56, 22, -34, -22, -3, 23, 70, 37, 4, -54, 1, 47, 41, 23, -53, -48, 22, 84, 50, 7, -1, 4, 30, 36, 26, -41, -47, -29, 34, 44, 13, -27, -49, 8, 47, 41, 1, -31, -18, -31, 17, 17, -22, -59, -22, 53, 65, 49, -11, -19, 31, 40, 8, 7, -45, -32, 4, 49, 67, 4, -23, -31, 36, 30, 38, -24, -59, -23, 33, 29, 21, -23, -47, -45, 12, 34, -7, -58, -49, 7, 63, 49, -14, -9, -4, 13, 16, 3, -12, -70, -27, 31, 83, 70, -11, -27, 31, 53, 6, 6, -37, -60, -53, 18, 29, 19, -22, 25, 69, 78, 34, -37, -56, -36, -25, -34, -27, -5, -41, 8, 59, 80, 52, -30, -23, 37, 15, 26, -72, -33, -15, 0, 40, 45, 12, -23, -11, 39, 44, -7, -21, -35, 19, 58, 21, -8, -21, -28, 4, -13, 10, -2, -69, -43, 42, 96, 63, -1, 12, 11, -6, -21, -48, -77, -64, -56, 11, 58, 27, -3, 25, 71, 55, 27, -41, -42, -44, -35, 2, 10, 14, 5, 42, 59, 83, 29, 5, -27, -12, -4, -11, -62, -11, 1, 12, 31, 23, 12, -20, 1, 25, 38, 6, -35, -18, 29, 39, 23, 5, -15, -17, -13, 1, 27, 35, -29, 32, 52, 75, 7, 2, 13, -3, -6, -32, -10, -27, -21, 2, 37, 52, 36, 19, 4]
2660DJ4K1n0m9jjK4M4J8MJ6lJ4k3l5k1k9L0j3JJ1J8L9j1K1K0m6k2%L1k4j3k1m
2694c6N0OJk3npqN4j8j3l3K1K5rJ4l7rJ7Ol8L5j1L3mK1K4l9k4K7Nm3Pj2J9J0J4
2730B0pL7j3j3qJ4pl7j4j3qN2j6RJ3kQj8M1l6Ok8K4qll0J3L0J7Om4M6m5L0oNJ6
2767C1o3M8L4k4l2qJ9K1m3LL9j0j8J7j3QPk2mK6k8k2J0J8K3l9L4L2l2k1K4j5M
2800Dj2rJ1LrJ3J2k1K1nPk4K7j7PqK1Lk4LK2Ml1Pk1K2l3M6Mn8j4L4J0jJ8j1J4
2837A5lk4J5J2k5nJK1qJ6j5J4lpNJQj0k6J3L8m6J2j8J4M1jl2JJ5k5J8k7K5nqj0
2874a3L4k4l0N7k4J5m3J9LJ7j4K1k8J6nk6MjK0J6QmNlJ2j1Kl0j7K1k3kJ5J7On
2910E%K2J3m8%k2MrrL2J0J3njJ1Rml3K4j0j2m8K9J5mK6KK6%Lk2k8L3l3oMNJ1K
$$ y = [4, 18, 39, -11, -60, -61, -62, -38, 6, 24, 28, 44, 41, 55, 32, -3, -24, -53, -23, -36, -35, -24, -6, 33, 22, 43, 63, 17, -5, -5, 26, 2, -11, -32, -36, 14, 20, 21, -2, -7, -14, -22, 32, 14, 1, -32, -11, 14, 5, 19, -18, -27, -10, -4, -42, -7, -18, 15, 11, 32, 56, 17, -7, 20, 25, -18, -11, -23, -4, 6, 20, 13, 50, 37, 24, 16, 30, 23, -14, -28, -41, -49, 3, -13, -4, 9, 7, 15, -3, 38, 2, 8, -20, 4, -4, -7, -37, -24, 6, 23, 29, -15, 31, -14, 16, 10, 15, 31, -32, 16, 50, 26, -6, -14, 5, 26, -17, -14, 25, 15, -3, 14, 1, 9, 16, -6, -10, 16, -12, -34, -24, -6, 17, -22, 12, 44, 12, -9, 15, 0, 4, -8, -17, -6, -3, -12, 1, 13, -8, 13, 8, 15, -9, 18, 1, 8, 0, 21, 24, 0, 3, 25, 29, -2, 5, -16, 6, -27, 19, 23, -35, -49, -15, -5, -6, 12, 1, 15, 12, -12, 3, 15, -10, -15, -14, 7, -1, 15, 0, 14, 11, 4, 9, 10, 18, 8, -18, -5, 33, -13, -1, -19, -5, 36, 35, 3, 4, 19, -6, 12, -15, 10, 5, -3, -13, 21, -3, -33, 24, 0, 15, -28, -9, -6, 11, -3, 18, -10, 6, 1, -25, -21, -22, -2, 14, 22, 18, 23, 20, 32, 21, 23, -7, -24, -3, -26, -28, -13, 4, 10, 5, 5, 27, 40, -8, -8, -30, -26, -35, -44, -12, -2, 11, 6, 5, 16, 25, 21, -12, 12, 2, -10, -58, -29, -14, -18, 8, 10, 36, 36, 39, 17, -11, 22, -11, -17, -13, -8, 3, 5]
2949EoJ3j8j9L6k6J8qj0L8j4n1K6K3j1k6L8j5qmL9j9%J8j5K5Rm4j8J8j3L0k1m
2983a4L6j6L0j4k7L8m4k1OK0k6J2RoM0KokkJ1l3j8N6l5j2J4LnJ4J7Jj5j4K0%r
3019A0J4rj0LKK3m3LmqM2k2LLRj0Rj9Ooo1L7MpoK0K7K1m%pNJ1o2NpLJ6LL7pk7
3061cL2K0k3j6rOj8J7j9LL1Nj6jmJ6jj4J1k5Oj9MQPJ0rJ0lqNJ6jpjpRk7J5qM0
3102C2l4j1J6rJ1LK4rqnqK0om1k6N3%j4J4Lj2J1j8LJ8k3J3kMnk0K5k0L2KrL9M
3140D7l6k5J4mJ7qK1pJ7l1N0k7Qj1l0K3ql8J1J1J6NmJ6j9J4m6J2L0k2qLqN%PL7
3177C2Rm7ROLj1nL0j9j1oJ0M4k9mJ0%j7j0OoL0k1k5J9L0l5lK3k4J9k2J7j1%mK7
3214A4rJ7l0j4jQmJ7J7qJ4j4J6J6k2l0J3jJ2j5K3k3MJ4LJ3%l7Mlrl0L7l3M7qk0
$$ y = [5, -1, 12, -6, -25, 11, -15, 3, -5, -15, 23, 9, -42, -16, 7, -4, -30, 8, -7, -15, -19, 20, 1, 1, 19, 4, 29, 38, -6, -24, -6, -19, 11, -10, -14, 22, 6, 36, 22, -5, 33, -11, -32, -26, -6, -32, -20, -11, -17, 23, 25, 19, 17, 15, 26, -7, -25, 31, -4, -16, -2, 1, -4, 10, 27, 28, 13, -1, 19, 19, 10, 24, 15, 5, 8, 10, 33, -10, -7, -11, -19, 23, 1, 4, 7, 16, 6, 15, -4, 2, -4, -65, -28, -24, -31, -37, -17, 10, 31, 27, 27, 20, 25, 36, -26, -21, -28, -25, -9, -6, 31, 24, -3, 29, 49, 26, 10, 1, 7, -11, 6, -13, -10, 21, 26, 10, 9, 5, 21, 20, 6, 17, -8, -2, -21, -17, -9, -2, 8, -1, 9, 6, -2, 3, 19, 18, 11, 10, 3, 12, -15, 0, -8, 32, -2, -13, 3, -6, 5, 8, 32, 23, 15, 10, 2, 22, 16, -25, -51, 2, 2, -12, 2, 5, -7, 4, -14, -11, 7, -16, -3, -5, -1, -6, -26, -1, -21, 11, 13, 4, 43, 47, 11, -14, 0, -4, 13, 5, 26, 19, 36, 5, 55, 28, 36, 25, -5, 18, 10, -28, -17, -6, 10, 15, 11, 27, 8, 22, -24, -12, 18, -4, -12, -9, -17, -12, -12, -5, 32, 41, -6, 3, 9, 12, 1, -4, 26, 7, -4, -10, 0, 44, 15, 11, 21, 21, 4, -6, 0, -6, 24, 3, -22, -3, 27, -8, -11, 12, -12, 7, -15, 2, -9, -9, -13, 14, 5, 22, -8, -22, -23, -15, -19, -2, 15, 7, 21, 7, 23, 39, 17, -13, 0, -1, 11, -4, 19, -4, 0, 14, 17, 30, 30, -7, -3, -6, -15, -45, -8, -41, 6, -2, -22]
3251b2M7J2Oj6j1ql3mJ3K1J9l3M1jj3nj9L2j3k2L6oj7RpJ5J0j2k7J4j4nk2M5K5
3286C5m3J2K0k8J5j3l5kLmL1Oj1K2lL3rk5K1k9j5lj1L9j9K3pJ3N5k3k1k4rJ0j
3321Ck1J2Oj8k3P6k1j5QJ9k2K1m9K2mJ6k9J6K2l6J5lJ2j1lqQM2j0qj3K8j4l4q
3356b4J9lj5L1K2j2lL9k5k0k3qM%j8OK3J6k9N4j7jJ7k8k8OQl0J2J7L4k9J6j1K4
3391B4lJ1m9K0nL1o7J6kL9NMlqpk3K1%j8kL3ll3%LlMlj3MJ8K5pKQk0K5l4L4l5
3431a1K0j7J0%J1K1jrj5N3l7l5qj6j1L5j4J7K1rLkJ7k3j4j0RK8m0J1%K4mmj7L2
3467A5J3j7l0J1JK6j1Mj3J7l%Jj2j1K6j0j5K1j4L1j6kj8j8RlK0J0k2JnM3nj1j8
3503ekK1j7m7L6kMK3j1L1j6K2pj6Jnj4lL0kj2LJ2j6J1J1j0qj8J0J4l7MoL4J4j3
$$ y = [-22, 25, 37, 43, 27, 16, 8, -25, -29, -16, 5, 24, -9, 32, 31, 18, 13, -6, 26, 13, -9, 27, 21, 4, 13, 6, 21, 31, 19, -8, 6, -8, -13, -35, 10, 35, -8, 4, 24, -4, 11, -2, -37, -39, -36, -40, -9, -3, -14, 8, 5, 38, 29, 4, 25, -4, -19, -22, -33, 6, -13, 10, 3, 16, 71, 48, 27, 3, -6, 4, 3, -18, -6, 0, -18, -41, 35, 14, -1, 7, 26, 4, 25, -24, -2, -6, 10, -19, -3, 19, -17, -2, -5, 7, -4, -7, -15, -7, 35, 25, 17, 4, 32, 18, -16, -24, -5, -8, -23, 8, 30, 18, 15, 54, 29, 9, -14, -22, -18, -18, -36, -30, -7, 9, -20, 34, 17, 16, 33, 5, -23, -17, -9, -39, -27, -10, 24, -5, 11, 0, 24, 21, 32, -17, 3, -2, 29, -38, -22, -24, 15, 20, 24, 21, 13, 6, -17, 4, 4, -14, -16, 17, 14, -19, -19, -16, -19, -15, -18, -31, -27, -9, 16, 9, 11, 19, -1, 24, -10, 24, -11, 9, -8, 2, 2, 13, 34, 33, 24, 9, 62, 25, -10, -18, -34, -45, -10, -24, -7, 14, 5, 8, 6, 23, 0, -14, -24, -15, 13, -27, -16, -16, 8, 4, 0, -17, 15, 28, 11, -19, -8, -7, 19, 8, 12, -1, 16, 13, 13, 14, 2, -9, 17, 7, -8, 13, -1, 30, 14, 12, -6, -24, -15, -18, 2, 12, -10, -9, -14, 29, 24, 13, -5, -7, 14, -3, -50, -14, -16, -12, 11, 0, 31, 15, 37, 30, 14, 15, 10, -4, -7, 23, 21, 9, 12, 24, 8, 19, 30, 20, 12, -6, 4, 18, -19, -15, -21, 13, 27, 14]
3540A4KJrj2J5rj0Jj4L5l0J2K3l8J5J7k6J6pNJ2kMl4J5J1j0J4J1l0K1J0j0k3K6
3575A6j2Jm8O3l4Pj7Mj0J9jL0Ln2L2j2Qk0J6PRqMOj5OloM5k0j3k5M6l8L0k7MM
3613aRj2JJ6MMj4Ll4LNJ3k8J4K8j5J7pPj8kKLl3K4KK1qK3Qk2mMlj6LJ9J4k5j2
3653g%K2ll6K5j3K6l5L0J7k9j2J0jpk2K3K4J1m1jK1J3K2m4J5J4k2J9k5K9j9jj9
3687a6OkN6j6MMk9k0%KOj9j6L2%J5K4k1J2j7k7J1j1qK7Rj3KQkOj0PrN1l6Rj9p
3726gK5j9j0L0J3k0j6L6k6lj5NL7rm1M1j6K2o6J7J0Qj0KL2Lk7L1k2mll8J5J8k8
3761c5nK3J3J2KKK9k5mj0j6pkK6j8L3j1%J4J5l5k0J2JJk9M1j7Rkj1RQrprnK6j1
3800a2K4jJ6k2%j2J0nQr%NMJ8Oj1j3nMpj5Ll0L9qJ0J1K1j7j5Nj2nk7J8j5J5J8
$$ y = [14, 16, 17, 8, -4, 11, 2, -8, -7, -21, 14, -16, -4, 19, -19, -4, 13, -13, 3, -4, 1, 13, 11, 15, -19, -4, 7, -3, 11, 22, -8, 13, 23, 13, -10, 16, 4, 5, -43, 20, -14, -7, -24, -20, -30, -11, -12, 18, 21, -31, 1, -11, -3, -23, -7, 0, 9, 1, 5, 11, -4, 2, -1, -7, 38, 18, 5, -20, 26, -12, 18, -9, -5, -1, 8, -4, -3, 13, 17, 21, 7, 10, -24, -21, -16, -3, -31, -17, 11, -4, 13, 6, 13, -5, -7, -5, -2, -35, -11, -9, 12, 4, 27, 35, 13, 9, 13, 10, -6, -3, 16, 30, 5, -7, -7, 15, 12, -24, 1, -12, 14, -21, 9, 26, -3, -15, -5, -6, -13, -35, -12, 12, 23, -18, -19, 2, 15, 37, -7, 8, 22, 0, 19, -6, 23, 4, 3, -16, -10, -12, 44, 28, 32, 36, 7, -13, -13, -11, -5, -24, -40, -8, -8, 7, 31, 10, 22, 5, -22, -11, -22, -30, -3, 6, -7, -5, 3, 1, 7, -3, 4, -5, 46, 10, 19, 0, -7, 18, -1, -11, 19, 32, 12, -4, 32, 6, 3, -12, -7, 30, 21, -20, 21, 5, 27, -39, -22, -12, -4, -14, -12, 20, 23, -4, 27, 5, 1, -2, -40, -25, -7, -35, -40, -17, -4, 8, 10, 12, 41, 16, 12, 2, -14, -21, -23, 3, -15, 18, 7, 7, 21, 36, 1, -19, -7, -6, -5, -34, 7, -10, -1, -3, -14, -5, 3, -6, -13, -22, -27, -1, -12, 12, 11, 27, 5, 5, -7, 3, -2, 6, -3, -3, 2, 6, 24, 30, 19, 6, 1, 5, -2, -17, -14, -44, -5, -13, -3, 8, 29, 12, -3, 2, -10, -15, -42, -24, -39, -24, -6]
3838fj1K3JMnJ5j3m5M1j2j7M0n1N2Mk0J9n%J5j0k8J8j2oMmL5m9K3J7k4%rk1L8
3874ARl0L7Ql3oK6j7J9qpj3LJK2jOk2RJ1j4rn%Q%k0M8kj3PporJ3pqJ5j3K0Mk9
3916a2mOJ2l4M8k7J8K1k0k4j2N0k2Nk2K8ok5K8jj2K0l3L3JOj0Nk2PPmlmlK1k0
3953dj6J4J4j6j4K5j3k0J2L1Km2L1Kj0J4jrlJ2mJ3l4%MJ4J0J1Ql3K5l9L3j5PJ7
3989B6m1K5j8K1k4J7Oj2QPl2%jJ7JqLNj5J5moK0%l0J4K0pk5L6ORj4k2K0plJ9%
4028B6j9Mj2J1j7npMMKJ6j8J8k8J5J5j1J1l6kM3j9J0k5J9J2J3k8J7j4j7J2L3j2
4062A5j6RNJpJkKK8o8O2nkj6j4J7J9m0J1k0K6Lk6jj5K3J1J3j3pJ4l8M5ok1NJ0
4099CJ7k1J1k4QnnN2k5lQpJNrrLPqJ0Mk5oRL0j1k1j1J2J0k2K0qj1L1k7M5j6k2
$$ y = [-6, -17, 6, 7, 11, 6, 21, 8, -37, 4, -8, -25, 15, -36, 16, 20, 0, 19, 14, 14, 29, 19, -9, 9, -3, -9, -5, -9, 26, -23, 0, 17, -7, -7, -16, -37, 1, 10, -20, 17, 25, -8, -14, 12, -5, 14, 6, -1, -14, -11, -10, 12, 11, 17, -5, 4, 15, 1, -8, -13, -13, -5, -5, -25, 23, 21, 8, 15, 8, 2, -7, 6, -1, -9, 6, -7, 13, 17, -12, -16, -10, 2, -32, 16, -11, 7, 28, 8, -16, -28, 22, 0, 5, -17, 11, 5, -20, 8, 7, -5, 15, -18, 15, 16, 22, 12, 17, -5, 2, 9, 5, 2, -2, -5, 16, -4, -20, -6, 8, -8, -22, 3, -10, -30, -18, 13, 15, -27, 4, 6, -4, 10, 9, 0, -3, 9, 5, 18, -16, -16, -12, 2, 12, 23, 31, -2, 23, -16, 17, 2, 9, 26, -15, 10, -8, 13, -11, 6, 12, 0, 8, 15, -17, -17, -18, -1, 0, -8, -5, 0, -15, 0, -4, -10, 10, 10, -20, -6, 14, 7, -18, 18, 24, 33, 19, -3, 17, 10, 7, 26, 26, 7, 11, -1, 10, -7, -12, -19, -15, -11, -9, 7, -11, 7, -21, -6, 9, -2, 9, -27, -29, 14, -5, 5, -20, -1, 11, 24, -4, 13, -1, -18, -6, 27, 15, -1, 8, 13, 14, 7, 8, 6, 8, 36, -32, 30, 25, 23, 7, -7, 10, 29, -11, 0, -20, 6, 9, -17, -18, -33, -10, 1, 14, 1, -6, 8, -30, 15, 9, -12, -7, 3, 20, -1, 10, -14, -6, -11, -16, 36, 11, 8, 16, 9, 10, 15, 6, -3, 0, 7, -1, 9, 13, -12, -18, -9, 21, 10, -11, -22, -10, 0, -22, -2, -10, -21, 10, -17, 28, 12, -10]
4138a0K3k5rM2mj5jJ1q%LJ5j0K2l7MMkJ2jL0l1llLjKmj9%NK3jj5nj8N5j5nj0J8
4179B0k2%K0j6k4RL2LK6j0l1mK8j1Nj7Qj5pK5Ok9Rk3J4L6m1M2k9j4K2j1rJJ8l
4215Hj1J2J6j4j9J5JJ0Lj6KNJ3j8l0K1oJ0qK2%j2PqKQQmmKj7J1qj1NKJ8j9k2M4
4255A8k6L7k0j3j0JJJ5k3K6Ok5M4j3k5J3LLLk3J5J2kKRl6J9k1K8oj9J3j1ml0O1
4291B2j7k2j8MN2nl0MnJ1J3j2K0k4J8j3%J0l3J7nK1jK6mm6K8k1L7m8LJ8pNJ3j9
4327hl2L0J6K3k1k3j3J0nK3lKl3M5j4J2k2RMqJ7j4J6l9L3j1K1qLjJ2Nm6L8Kk1
4363al7O8m1njlPL0j2j0k9K4K8j7J4m0MJ6K4oj7j0NrL6Ql6j1OJ0K7j7rpNOL4m2
4401hJ3Rl4M5j1J4j6j9J6J7%l3mK0j6%nJ2opL1J0k7j9M5ll4rL8k0L8m4K0J1l7
$$ y = [-10, 13, -12, -21, 21, 17, 2, 1, 12, 4, 4, 7, 22, 12, 34, -3, 1, 5, 3, 15, 14, 44, 13, 10, 7, 10, 9, 11, 7, -12, -12, -7, 16, 15, 0, -5, -23, 32, 17, 12, 2, 20, -2, -2, 18, 2, -22, -13, 19, 22, 48, 38, 7, 3, 31, 20, 25, 8, 16, 1, -6, 19, 25, -4, 5, -18, -4, 32, -9, 33, 4, -10, 12, 1, -8, -7, 11, 8, -3, 9, 25, 11, -8, 7, 8, 18, 21, 5, 7, 12, 25, 7, -23, -2, -8, 2, -6, 16, 16, 4, 11, 3, 5, 13, 21, 17, 13, 15, -2, 9, 1, -10, -5, -3, 15, -4, -26, 18, -8, 29, 9, -4, -14, -13, -12, 3, -20, 6, 12, -13, 31, 18, -7, 6, 9, 12, 15, -8, 7, 19, 17, 19, 28, -8, 11, -10, 18, 12, -7, 6, -5, -9, -39, 22, 5, -17, -35, -31, 21, 16, -14, -10, -15, -4, 9, -3, 17, -7, 11, -2, -2, 8, -25, -8, -13, 8, 7, 33, 29, -17, 11, -10, 27, -21, -18, 0, -7, -2, 11, -8, -40, -10, 6, 29, 8, -15, -28, -18, -23, 0, -3, -1, -34, 11, -3, 9, -13, -4, 0, -8, 9, -5, 11, -28, 5, -6, 15, 7, 10, 9, 21, 26, -20, 18, 20, -1, -38, 30, -11, -16, -17, -20, -13, 17, 5, -5, -34, -10, 18, 1, 15, -25, -21, -5, 19, 13, -4, -14, -9, -18, 18, 26, -10, -21, -15, -5, 22, 5, -4, -11, -6, 0, 34, -8, 5, 14, -20, 25, 14, 28, 12, -7, 9, 26, 26, -7, -11, 9, -7, -7, -12, 0, -6, -13, 18, 28, 1, -18, 27, 24, -10, -19, 19, -1, 37, -7, 13, 24, -13]
4436a3J1QPj3K2j6po%RK7n8J8PJ0K5l0qj0J4L7l1Om8M7J5l5K6rj2k6L9N%k4qL5
4473A4pJ2k6J1pj7K5L0j2k8mmL2Jk0NOJ8j2j2Qk0K1j5K4j9l5J4Oj0K4j5k0L6K3
4508B7rj3nj2lL7nj3Oj3mK1J7k1Kj6PK7k4j0Pl0Q3m3J6l9j6L1j8L4k5j4J1J5%
4543HJ5k1J0n3M6Qk1PoJ6klpL0k6KL0j2Lk7kL1rPj7K7m5L0Komj9QkK8j9lk1L8
4582B1k2Nk3J3Mjj1J5k5J0OQOOLk2J4NJ4rj3k6J9M3j6Ok9j5J6K2k0LOj4Pj9J8
4619EnJ1k0L3j5k1J3j5L0j6mnK1j4J3lj1K0jl0L4pj6K4Nk5PPMm1K8mK2nOj7j8
4656a0NJ6jl1K9Mqj7Rlj8J3oL1j3k6j0M3k1J9Kj6lK0Nj4JkMK0J6m8lmJ3K9qJk1
4695cmJ1k0K2qj1jJ7j5Mk0K8J0Qk3j8K3qk0L9Rl7J1NoK7j8k1J5KLjJ6Kk8K9k2
$$ y = [-13, -2, 6, 13, 0, 22, 6, -1, -7, -7, 2, 29, -29, -11, -4, 6, 31, 1, -7, -17, -3, 34, 3, 9, -39, 8, 23, -12, 14, 5, -7, -33, 6, 11, 11, -13, -21, 14, 7, 19, -7, 4, -3, -20, 5, 35, 23, -5, -9, -13, 19, 20, 0, 5, 11, 29, 17, 5, 13, -7, 14, -1, 23, 4, -31, -17, -11, -21, 3, -12, -32, 4, 27, 18, 5, 0, -12, -15, 22, 17, 4, 10, -3, -7, 14, 31, 10, 12, -4, 3, 30, 6, -4, 3, -27, 56, 13, 29, -10, -26, 5, -13, 21, -4, -18, -7, 8, 8, 23, 2, 12, -41, 5, 13, -8, -1, -7, 9, 7, 4, -3, 27, 1, 3, 33, 21, 24, -3, -5, 26, 17, 24, 7, 34, -11, 19, 21, 15, 11, -8, 0, -2, 26, 7, 4, -17, 21, -1, 4, -19, -6, -2, -3, -14, 1, -24, -14, -8, 0, 6, 12, 15, -7, 7, 12, 26, 17, 4, -22, -3, 40, 24, 30, 1, -14, 2, 24, 4, 7, 13, -1, 6, -13, 5, 0, 11, -9, 24, 9, -12, 1, -14, 16, 0, -4, -9, 12, -2, 11, 8, -3, 17, 16, -14, 20, 13, -3, 21, 26, 1, 8, 15, 19, -22, 6, 2, 24, 19, 25, 8, -10, -5, 11, 10, -21, 8, 12, 4, -13, -4, -7, -25, -12, -18, 13, 0, -26, -36, 7, -14, 5, 7, -9, -12, 8, 13, -1, 0, -2, 2, 22, 38, -10, -13, -17, -4, 25, 17, 18, -3, -7, 4, -16, 6, -2, -13, -14, 3, -12, -8, -28, 0, 10, 18, -5, -23, 0, -8, -28, 11, 20, -17, -6, -1, -7, 20, 2, -19, -4, -2, 1, 0, 16, 18, -10, 19, -3]
4732cJ3pk2j4K4%K2mlj0J0Nj4Ql8MK8lqJ6k4KK3ok4L1k8K3rK0pj1j4J4RRk3RK5
4771B3Om2K8J9m1J0PMk8J4pK4k4L5m7L4l2J1PpJ0j3j5J3Pj0j5L6j0nJ0j2j4K0
4805dPj0mJ1lJ2kjJ0l3jJ6J3J4l4K8k2oN%Nl4K6jJ4mqnMpj4KK9Lj1l0L2J0j4j6
4845b3M2q%k1J4J0k5RmJJ4mmJ4J4j0l5K6ll6K6j5kRJ2J9j3k7K0nK5j3k4J8Pjm
4882CJ0j4ok1mL7lnqK2j0J5l1K4J3k7J2mlk1J5J8k4%k9K2L8L1l1rj5J8m2J2j1
4917b8MPOJ8l0J4J2Rk0%j3N3l0mj3PjK0J0lj6J2J8j9k4K2k1J8k3K9Kk1J1Ml7M2
4953A5k2mQj1J9k5NJ3opK5k4JpM1k7K2j3j3K0M7n4J7ml6nK2J4k6nK7J7nLqj3K6
4990B7l5j1Lj0K2mJ8k2K7NLk7qLj1K2k9L2J3k9lM9k1k0J5%k2M9m1j8J1N0k8kj1
$$ y = [-3, 10, 3, -19, -33, -9, -9, 13, 9, 6, -4, 6, 11, -3, 5, -33, -29, -1, -4, -12, 4, -20, -18, 5, -1, -25, 6, -22, 1, -8, 12, 5, -6, -20, -6, 3, 12, -11, -2, 23, 29, -13, 15, 34, -7, 3, 10, 14, -14, 0, -7, 17, -7, 28, -19, 15, -17, -6, 1, -6, 4, -9, -24, -11, -4, -14, -29, 7, -3, -8, 2, -10, -24, -4, 3, -7, -11, 0, -3, 9, 7, 6, 16, -17, -18, -2, 11, 25, -9, 19, -3, -9, -4, -4, 1, -33, -7, -8, 6, 2, -6, -11, -7, -14, -28, -26, 3, 6, -5, -35, -3, 7, -7, -23, 19, 11, 11, -10, 4, 14, -11, -2, -6, -5, 9, 5, 1, 15, 29, 19, -16, 10, 7, -29, -3, -18, -20, -11, 1, 20, 7, -20, 0, -5, 20, 7, -17, 1, 8, 7, 3, 13, -1, -7, -28, -32, 5, 2, -3, -11, 11, 1, 16, -15, 9, 22, -5, 7, 3, 0, -21, -6, 12, -12, -12, -41, -19, 19, 50, 19, 10, -5, 13, -29, -17, -28, -24, -17, -11, 7, -23, -9, 3, 12, -8, -8, -21, 32, 2, -2, -15, -8, -9, 11, 21, 18, 2, 14, 32, 13, -11, 11, -10, 8, -15, 14, 16, -5, 6, 10, -27, 15, -7, -11, -3, -14, 5, -20, -15, -2, -8, -15, 10, -14, -13, -20, 21, -6, 16, 3, -10, 10, 57, 3, 20, 16, -20, -25, -3, 11, -15, -20, 7, 24, 19, 22, 14, 1, 27, -8, -19, -16, -26, -4, -8, 10, -12, 15, 20, 23, -4, -12, -9, -20, 2, -27, 5, 18, -11, -14, 35, 14, -6, 9, 9, -13, 36, -5, -23, -12, 38, 10, 8, -3]
5025cMkmj3OL8qk3lRLj0K9k1njpj4K5l8L5rJ7j8%j6K1K8ll7J5Kj3M4k3qJ4MoJ5
5065B4k8J0KnkJ7mnJ2l5J7J1l6NNM7k1k0%k2L3j6J1OKm3K6k0J4NJ1LmmJ2K8l0
5102FQQk4J0jpRl0M6k3kL5k5Jjj0LK1k6KJ8k1k2K7j7K6lJjJ5k4J0j4RJ8k6K2P
5140B5k7NJ2J0Ln0K8J7l4PJ2K0j1m0K0J2J2j3MpPk8L3j6Rj9J9k5K1lj2L1j0j7
5174ePj2RRqJ5Qm5RL1nL2l9j3QL3m3K3jj0k2JJ2J5jmMLj0MK0j4J1k6j7K1kJ6k6
5213a2oK3qJ6kj2J4Pj2K3l5M1l1kL5j2j0J7j5k1K9j5j9M6k6L7j8l8pnPmK8l2K6
5248Gk0J6j3J2mK3n0M4Ok0j3K5j9K4Kj6qK6Kk9K0l2L1l0KJ6K7l6QL5m1j6M0j6
5282CNl3J3L2k6J1j8QKj9K7pJ7k1j3OJ1pK3j1Qj6RnJj0KMqL1J4Kj2Pk5Lj8J4l2
$$ y = [-3, 1, -1, -5, -18, -12, 26, 18, -5, -8, 1, 4, -6, 23, 2, -3, -4, -11, -25, 0, -38, -3, -12, 5, -13, -13, -29, -8, 20, 17, -20, -5, -3, -16, 28, 5, -3, 11, 15, 9, 24, -4, 6, 8, 3, 1, 18, 14, 9, 21, -14, 3, 14, -22, -17, -12, 35, 14, -6, -6, -28, 5, -11, 0, 6, 8, -35, -9, -29, -15, -10, 1, 4, 0, -4, 8, 36, 6, 14, 22, -2, 8, 7, 0, 9, -21, 25, 2, 0, 35, 10, 11, 10, 0, 3, 24, -2, 0, 18, -3, -25, 2, -15, 11, 8, 9, 8, 23, -1, 9, -5, 4, 22, -4, 18, 25, -2, 3, 15, 25, 28, -22, 6, 23, -11, -4, 8, 28, 17, -23, -3, 9, 21, 8, 12, 5, 12, -16, 17, 1, 10, -9, 10, -15, 6, 3, -9, 22, 12, -5, 2, -10, -1, 8, 0, 15, 23, -22, -13, 18, 13, 45, 6, -7, 1, 34, -9, 14, 13, 3, -19, -18, -6, 9, 8, 4, 8, 11, 1, 5, 25, 11, 22, -4, -21, 0, -2, 14, -12, -18, 5, -3, 13, 11, -1, 13, 20, 8, 31, -4, 37, 6, 4, 39, 27, 17, 34, 19, -2, 27, 12, -7, 39, 13, 50, 32, -6, -13, -18, -11, -15, 13, -19, 7, -13, 3, -10, 2, -2, 21, -29, 15, 21, 1, -12, 13, -6, 18, 20, 4, -4, 22, 24, -5, 15, -17, 14, -16, -14, 2, 29, -7, 1, 36, -5, -21, 19, 3, 8, -25, -12, 20, -6, 5, -13, -5, -3, -22, 5, -2, 15, -6, -19, -13, -2, -9, 14, 3, 11, -5, 4, -1, 0, -10, -8, -4, -12, 19, 33, 35, 23, 30, 5, 8, -10, 4, -28]
5321b8M4k5j1M1qJ9k7j0Kj4%J2J4l0j5L6p%j6J7npJ5kL1l3J9j9Kj9L6j2K7nj0
5356A2qJ2j0K1Jn2M8k1jL%k9J6K2k1k1L0j1%Ol0J1J8nj5J1k1N3n5J3K1J6P%j4
5391G%J0LoQj5k1K2K6k7OK8n8N4j0l0Nk1J3Pnj4M5m8J3pqRNokJ0%MqK1Kj6lj1
5431a8kJ3%RK1j4rLj0RJ9qkk3PLJ9j3LQl2L7k6J1kl8K3oK1qMNj5lLjOnJ2JpJ0
5473EmM6l1rk1KM3K1n8L0l0J7l5L3jJjk5mL0j2J0kj1J4k4K0qk2nM3k3kJ0J0nl
5510aoJJ4oj4K1j1j6J8oJ8Kk8L0k0JL6j9j2JJ1lrkj6Kk7O6pm5K6J6j7k2J6j0O
5547a2j4qMK0Jj7J6J8k0nJ3qJ8kj2K2pj5qL0QJ2n1M3l1j0L2k6J6j2J3l2J4K4j5
5582ak2K5j5J4J6l5J7J1%Rml1J7k0L2j4j1RPjNJ8l4K5nj7lJ1J9k1J7j7Pj9J6j6
$$ y = [-28, 16, -9, -20, 21, 13, 32, 5, -5, -3, -17, -17, -5, 9, -21, -36, 0, -7, -7, -23, -6, -11, -18, -3, -5, 26, -7, 12, -7, -5, -24, 12, 0, 27, 22, 12, 4, 16, 6, 27, 28, -24, 24, 3, 2, 5, 5, -24, -8, 14, -7, -28, 2, -9, -9, -3, -33, -22, -4, -9, -24, -13, -34, 19, -36, -23, -2, 14, 21, 21, 7, 7, 17, 20, 14, 22, 7, -14, 8, 34, 7, 13, 41, -17, 37, 27, -3, 2, -19, -6, 1, -4, -18, 27, -21, -8, -15, -23, -14, -9, -15, -17, -7, -7, -3, -11, 10, 12, -4, -7, -18, -20, -7, -7, 2, 23, 9, 0, 3, -7, 2, 21, 13, 11, -12, -5, -2, 17, 4, 7, 15, -17, 20, -6, 5, 3, -35, -12, -18, 3, -5, -1, 4, -11, -14, -11, -12, -6, -11, 1, 2, -5, 5, 1, 47, 16, 7, -14, -12, 31, 52, -6, 24, -6, 11, -24, 9, 8, 9, 8, -17, -21, 9, -3, 7, 5, -6, 8, -16, 4, -4, -26, -31, 12, -11, -13, -3, 7, 2, -1, -7, -6, 8, 2, -12, 9, -2, -18, 0, -6, 12, 14, -14, 16, -4, -3, 33, 14, 2, 3, 14, 11, 2, 0, -16, -14, -41, 25, 18, -27, -1, 15, -2, -24, -8, -18, -12, -26, -34, -30, -10, -9, -26, -10, 8, -12, -17, -4, -12, 6, 4, -8, 14, 7, -8, -16, 14, 22, 34, -17, 26, -5, -15, 17, -9, 7, -5, 8, -24, -10, 14, -1, -23, 2, -13, 1, 17, -18, -1, 10, 10, 19, 15, -16, 1, -19, 13, -1, -12, -3, 4, 3, 8, 26, -8, 17, 12, -5, -8, 3, 22, 1, 18, 1, 8, -11, 5, -11]
5618a1NK0k3J2j4K2ol1L3l6K4L9n0QqPLk2J5L0k3J4JOj%j8J8kQk6lOJ6qK3Mj5
5656A7k4jJ1jJ4m2K5nj3Oj3K5lQj2lPJ2ooK4j3jpK1l5J5K1llJ5j4k6QL6l5K6j0
5694A5rj4LL9k7%pJ1k7K1k6K4nk9J8J1j3Knj5J8JL2jk7JK5j1j2mJ8rj5J4j6J5
5730dM2k1k0K5j6J8k1%Jk2J1NOmNk6L1k2Qlj1PqK8k6QJk3N0j4OolkK7m3J0J4P
5769A5Jl1K8k2J3RnqK6k7K6j5oJ7m1M1k6j8K3Jj2J1K4j6k0K1k6J7j3k6J8J9j0
5802a2LpK4k8JK0Mj2J4jj3J0J2J7k9k5L5mj2K0j3Mj0k0M8k0k0PK2mkj0Ll0J7m
5838a5j0M0j2K1l7L%OKJLK1j2qJ6qj8J4J7l3J3LOj1L3k8rJ9Mj4%lkmL4k1Qk8K0
5877A1l3J2lK5KJ1l6M2j7k6OmK8k1JK1jqoJ4j0KJ9k5J6mNk4K1kjMj6j6J5lPoo
$$ y = [-11, -6, 14, -9, 3, -11, 11, 5, -26, 7, -29, -5, 34, -16, -8, -16, -9, -6, -28, -13, 17, -6, 8, 9, 15, 14, 14, -4, 14, 12, 20, -6, -9, -3, 13, 5, 28, 32, 17, -7, -8, 3, 2, 16, -26, -1, -6, -19, -13, -26, -1, -4, 4, -8, -11, -4, 8, 2, -4, 20, 7, 6, -1, 20, -15, 0, 21, 18, 15, 30, 16, -10, -2, 34, -1, 25, 15, 6, -8, -5, 34, 7, 7, 0, 11, -16, 5, -21, 3, -2, -31, -13, -2, -15, -13, -18, -33, -15, -14, 18, 17, -10, -9, 16, 5, -7, -11, 7, -2, -17, -3, -19, -4, 38, 17, -3, 22, 6, 24, 3, 3, 4, -18, -7, -2, 4, 0, 5, -21, 10, -12, -4, -7, -18, -11, -19, 9, -17, -9, -8, -31, 19, 5, 11, 5, 2, 0, 27, -16, -6, 8, 15, 16, -15, 13, -9, 4, 13, 8, 0, 26, -1, 25, 10, 4, 21, -20, 21, -5, -23, 0, 1, -11, 0, 24, 8, -12, 9, -17, 0, -13, -39, -21, -2, -12, -9, -16, 8, -20, -19, 1, 5, -7, 7, 6, -7, 3, 15, 32, 3, -22, 13, 9, -3, 17, 4, 8, -2, -22, 26, 6, -14, -7, 15, 11, 9, -1, 2, -28, -11, -15, -25, 15, 3, 24, -13, -10, -10, -4, -2, -1, 2, 23, 11, 3, 19, 11, -7, 7, 24, -9, 4, 7, 13, 2, 35, 7, -2, 17, 21, 7, 7, 4, 2, -2, 32, 11, 19, -9, 11, -22, -10, -13, 12, 14, 25, -11, 31, 14, -12, -6, -10, 18, -3, -2, 19, 18, 10, 4, 18, 8, 10, 29, 4, 20, 16, 21, -3, 18, 16, 15, 19, 3, -13, 2, -1, 6, 0, -6]
5916fJ6j2N%j9j2L3Kk5M7m0J2J1k1k4K9j3J2QJ7pk5M3k8o%OPpqJ7J4l3L5j6On
5953A3k6K9J1m1QrJ4j1J1K9j2j1pRrj3OPj5J6J6j4q%K0J0j2pJj2J3J7kJrmj7K5
5991A7j5%JJ3k0K4j3%Mk9K3pNj2K0J4m0L5J1k2J2j7J1j5P%RoJ6k2RlNj2K4j8j7
6028hK8oNj5J6nj1lK0qk0OMJ6k3K1j7Rj9J0k5L4k3kM1Lk2J1m8M0LLpK7k3rK2%
6066B5j0l0J6K0j2Lo%qj%K1k7K2m2K8k1KJ9J2%l6K3mJ5j0j4L4jm5L6j2lL0l5j4
6102b5J6J4jrK0mPj6J3j2J2njJoM%PMpk1L1k5J6o1L1JJ5k0K6k2mLJ9Qj5J2m0M4
6141A0%LJ3rk1OPqllJ0J1Kj1k1Oj3N0m0J1mPk3J9Knj0nK6j0Kj5J2k1J4K4m0J8
6179iPj9PNNlJ8j9j1L9rj6nJ1MJ3l3J3k5K8omJ5J7m2K5pj0KP%lPj9k2KM8Kk7J3
$$ y = [-6, 10, -2, 3, 3, -16, -28, 5, 7, -18, 29, -11, 1, 12, -9, -33, -4, -17, -5, 3, 20, 13, -12, 31, 3, -3, -3, 3, 10, 3, -5, 12, 26, -7, 28, 12, 18, 13, -13, 16, 27, -14, -6, -15, -1, -12, -1, 28, 16, 5, -2, 7, -2, -15, -9, -2, -17, -1, 15, 1, -7, -7, 13, 23, 11, 4, 5, -7, 6, 23, 21, 22, 13, 9, -8, 17, 2, 2, 3, 16, -4, 20, 7, 7, 11, -18, 5, -2, 3, -9, 11, 25, -15, 20, 31, 9, 21, 4, 15, 0, 7, 7, 16, 10, 26, 4, 13, 10, 15, 3, 27, 9, -8, 20, 14, 19, 4, 20, 15, 4, 1, 21, 13, -7, -1, 3, 19, -4, 17, 0, 9, -10, 0, -25, 9, -14, -16, 25, 28, 6, 17, -31, 9, 12, 15, 8, 35, 12, 3, 25, 25, 15, -15, 1, 21, 9, 12, 6, 6, -2, -3, -3, 18, -9, 13, -29, -1, -22, -20, -1, 11, 11, -25, -2, -6, 9, -1, -15, 19, 18, -27, 9, -3, -6, 24, -11, -25, -9, 5, 4, -5, 15, 11, 18, 2, 15, 3, 15, 10, 9, 10, 4, 8, 8, 15, 19, 12, -9, 22, -3, 13, -48, -17, -16, -1, -21, 5, -17, -21, -18, 1, 9, -6, 6, -34, 10, 10, 13, 26, 17, -4, 2, 9, 1, -2, -5, 5, 16, 18, 7, -14, -8, -21, 29, -11, 0, -4, 3, -20, -1, 1, -4, -14, -19, 7, -3, -1, -16, -4, -25, -11, 13, -27, -9, -2, -21, -14, -9, -4, -7, 11, -8, -19, 20, 11, -5, -10, 1, 5, 18, -15, -2, -27, 1, -5, -9, 6, 23, -19, 6, -1, -11, -9, -2, -2, -5, 2, -17, -39, -37, 11, 13, -14, -1]
6219ap%MK1k0%%mONJ2kKk8kK1Pl7J9J0%rjLk7J5qJ8%oLRl8L1OnJ0JrlJ1l9O5m8
6263a5L1k6J2J6j2k3OK3k7K2j2J8kqj2J4PJ7rj1k4J7KpKLj8ROlk2L1Nqk6L5k1
6300a0K7k5j3L8m1K7oKjRlJ7k2oJ5J4k2NL2k6%k8L1k2R%mk4LK2j7K6j4lJ7Rj4
6337Bj1Jj0J9MNl1J4nJ2K0J3k1JNj5j2JK4Lj3pL0j9kJ4j5OJ0j6%nj0J6JJq%rp
6377a4MJ1Nk5J3rJ2mK7l4J3Pk9K1lOk7M1PPk1pk0K8l3L1J3k7QJ0qPK9l9lj0RJ6
6415A2j0nl3M7j2Jj8Q%OJ8J8k4j7K9j9j6KK0oLj0J2oPK1j5kMJ2l4K3j9k3J3L6
6451B3ll3K4l0LK5j0Mj5lk9L7J2k9PlQJ8rRrQj8L4lQk0J9k1j7K4K6l3K1j6j7J7
6488IOJ8l2JPj4%rK7Lj6k2K7j1k7J9J1J2j1LqK3m5J3j4L2K3l5J7J2k0k2NL8lJ9
$$ y = [-1, -8, -8, -4, 17, -3, -3, -3, -7, -1, 4, 16, 14, 16, -12, -14, 7, 14, -23, -4, 6, 6, -3, -4, -1, -28, -13, -21, -3, -3, -9, -6, 3, -35, -4, 2, -3, 7, 8, -1, -4, 7, -32, 33, -15, 16, -10, 2, 18, 6, -17, -11, 12, -15, 7, -5, 13, 11, 3, -9, 5, 12, 29, 20, 9, -15, 2, 4, -3, -1, 2, -16, -7, -1, -4, -26, 5, 10, 2, -24, 11, -10, 17, -8, -21, 17, -24, 3, -3, -1, -2, 7, 4, 21, -1, -7, 8, 22, 0, 5, 37, 11, 11, -17, 14, -8, 1, 1, -3, -27, -24, -2, -19, 7, -7, -10, 7, 16, 2, -9, -8, -18, 1, 5, 10, -21, -7, -12, 0, 20, 33, 12, 13, 18, 3, -9, -8, 16, 19, 6, -1, 29, 10, 8, 22, 7, 13, 23, 7, 7, 2, -8, 8, 9, 10, 2, 2, -7, -14, -10, 1, 6, -19, -6, -15, -3, -7, 20, -14, -1, 6, -23, -2, -5, 1, -26, 15, 22, 29, 8, 1, -19, 9, -24, 7, 20, -7, 1, 11, 3, 10, 39, 0, -3, -13, -4, 12, 2, -3, -36, 11, -1, 0, -18, -10, -10, -4, 14, 32, 8, -9, 20, 1, -15, -13, 7, 1, 4, -6, 6, 0, 7, 28, 13, 11, 15, 27, -7, 16, -3, -26, -13, 23, 20, -13, 11, -19, -16, 9, -1, 3, -12, -15, -44, -7, 5, -24, -17, -20, -12, 6, -3, 6, -3, 5, -13, 21, 18, 26, 6, 25, 4, -13, 11, 37, 4, 25, 9, -8, 9, 15, 33, 1, 2, 9, -5, -5, -14, 13, 16, 0, -22, 5, -6, -33, -14, -3, 9, -2, 1, -7, 16, -29, -16, -30, 2, 25, -10, 7, 19, -1, -23, -18, 20, 17, 36]
6524C6m0J5lJ2oJ0k4j%kK3ll3QlOKJrJ1j0j7L7j2j2J6jJ2rKoj8K0%k4J5JK3%k0
6564cJ3lk0K7Jj5mQ%Rk3NJ0l5N8l2ljqJ0Ol5L6j8J2KQJ9k7rj5PJ8j6NK1k7N4j2
6603B3l5K8nqJ6qknK2k3%jJ1j8J7l0L3%j7K0pPj1k0ojK1nQk5L5k8jJ3pK5k4K3
6641A5k1L6m4K9j0jJ9Lk8K7k2K8%Qk9Jj9RK1k1Mj4K8pkj8lJ0j7K6k4P%j9J9J1
6677Bj0K3j9k1K7lJ9k7OJ6k5J7Nk8K5J1Rj5j8J9pPJ1m1M6l4k6M5kj3j2Jk6L7J3
6712A2k8PP%j8K2Nj2J7nl5J1L6k1Mj2RJj0KK1l2K9n%J1m1L5j5J2j8%R%pk0M0k7
6750a6M2j6j0Jk4PLRRl9M5j1pj7K5L1j2j2J2k1pRJNpJ5nmJ4Lk8loJ6J5J6j8j0
6788EJ8j0j7mk1OK0k2M7l4J3Nk5PKnJ9Mk4M1rk2K3Lj6J3rnPrJ6lpokK8n1L3j8
$$ y = [36, -4, 11, 8, 20, 14, 24, 0, -1, -1, -3, 20, 17, -16, -8, -11, -5, -3, -2, -11, 0, -10, -27, 10, -2, -14, 2, 1, 13, 4, 6, 0, -18, 2, 2, -22, -7, -6, 17, 17, -3, 10, 7, -13, 14, 15, 0, -4, 4, 4, 13, -10, -5, 5, -30, 28, -4, -7, -8, -16, -6, 0, -35, 1, -17, -5, -3, 5, 24, -3, -12, -27, -20, -2, -18, -13, 8, -19, 35, 23, -12, 16, 11, 3, 19, 11, 9, 4, 26, 3, 3, 2, 13, -5, 12, -18, 15, 15, -2, 18, 11, 18, 7, -13, -19, -20, 1, -4, 4, -21, 14, -14, -15, -2, -9, 16, -8, 15, -6, 30, -14, 15, 5, 4, 23, 26, -2, 25, 3, 31, 31, 39, 10, 11, -8, 1, 22, 1, 5, -9, 19, 12, 10, -8, -11, -1, -18, 8, -16, -9, -9, -28, -9, 2, -8, 15, -4, -25, 2, -1, 18, -9, -3, 13, -12, 5, 10, -18, 7, 18, 27, 12, -6, 13, 6, 13, 24, -17, 29, -5, -31, 14, 12, -1, -13, -12, -38, -1, 12, -16, -9, -2, -2, -20, 2, 7, -5, 12, 7, -28, -17, 19, -2, 2, -10, -1, 0, -10, -8, 13, -19, 10, 5, 5, 16, -25, 10, -5, 7, -11, -11, -2, -2, -9, -29, 11, -16, 26, 10, 0, 1, -23, -16, -13, -4, 5, -34, 11, 0, -7, -24, 1, 32, 20, 8, 20, -1, -8, 1, 2, 7, 0, 15, 10, 6, 20, 23, -5, -8, -14, 2, 17, 33, 15, 5, 23, 13, -4, -8, -29, -23, -3, -25, 22, -12, 1, 6, -19, -12, -10, -15, 4, 8, -16, 25, 16, -6, 17, 20, 4, 17, 8, 3, 10, 1, 17, 14, 7, 1, -1, 27, -24, 9, -9]
6827iJ0Kj0k5K4mKpMpJ7noJ8qrJ0k8K4%K2j7jNRMk0J2K8m0RKj9M5Pl0J4kk8K2
6867A5j8J3nj4J8qJ9j7qK2l2J2j2JK7j5nJ8kNj2MmPqJ0j1K1lm9L2KPJ8j0l1K7
6904A4j3jK1j3mj%K2ql0J9lqJ6rj8K2lqJ3k2J0Kj6OJ3lJ6k6M4k5KLOj3Oj4nL0
6943B2j8j4j1K0k5L7rj4K2pqk4L2oLr%j5L2jl1L7k4j0J2j2J2PK6m2K1j1M8l2J4
6978B2jk7RJ0j3j1RK4j0plL3k7j3J2Mk2RJ6j3Oj8o%L6j6j8J6Opj3mK0J0Pj9nk1
7016b5M5k2J8j6KL0k9jk5J2Lj2L0pJ8j9JLrQj0Kk4K7j6K1k2J6j6%L4k4Kj8L3k8
7052a8nK8jj4N5k5qj2mjK5Lj5l4N0j8L2k4l2KL9k0kJ8nJ0l0J6l2mJ7j9J3pK5q
7088eN%J8j2k3K3LJj0qK7k4J1Kj5J4J5l2K1qj2K3kJK1l0J1j8J7J0l6L3k1Orj8
$$ y = [-9, 1, 3, -7, -32, -8, -12, -10, -17, -13, -20, -3, -8, -14, 4, -4, -13, -3, -31, -7, -7, 15, -2, -3, 2, 11, 15, -5, 7, 35, -5, 4, 6, -13, 32, 39, 9, 23, 21, -7, 15, -3, 10, 5, -9, 9, 1, 20, 3, -5, 17, -15, -3, -15, -14, 13, -2, -7, 11, 9, 14, 2, 6, 2, 9, 1, 11, 0, 21, 18, -31, 1, 3, 10, 28, 18, -13, 14, 1, 0, 21, 8, 4, 3, 3, 25, 17, -13, 6, 3, -5, 11, 2, -16, 6, 3, -5, 8, -14, -4, -2, -18, -12, 1, -2, 14, -12, 32, 7, 9, 12, 18, 5, 11, -3, -8, 22, 4, -10, -21, -1, -26, 11, 2, -12, 10, 3, -5, -29, 3, -3, 0, -9, -9, -24, 8, 7, -24, 13, -11, -21, -9, -21, -9, -2, 24, -18, 3, -8, 40, 8, 22, 21, -6, 3, 13, 0, -11, -2, 22, 12, 5, 2, 35, 8, -5, 7, 11, -11, -2, 14, 1, 7, -11, -17, -17, 19, 3, -15, 1, 7, 0, -13, -17, 3, 13, 20, 1, -4, -25, 20, -2, 16, 0, 2, 32, 3, 2, -23, -11, -8, -20, 10, 3, 21, 2, 3, 6, -3, 5, -5, -3, -27, 0, -16, 5, -17, -1, -17, -17, 17, -7, -5, -23, 10, -18, -23, 5, 4, -10, 45, 20, 12, 0, -4, -5, 20, 23, 8, -26, 24, 6, 38, 14, -18, -16, 23, 3, 1, 19, 14, 24, -6, 10, -22, -26, -9, -28, -15, -22, 3, -5, 0, 0, 18, 6, -17, 6, 9, 10, 0, -8, 19, -5, 6, 8, -7, 7, 22, -10, 11, 3, -9, 14, 12, 13, 34, 4, 15, -3, 14, 24, -12, 21, 0, 6, -3, -21]
7124b1QjKlj4N2l6kK9j4K0l4K3kJ3l4K1llrM6j5j2MnpnK4j2j0oJ7l5J8k1NM9k7
7162@J4l0K4l7K6qJ5lJ0j4j7j2J8M1l6J1%j3L3j2jnPjJ1Pj0oJ5m1K8J0l6J0J6
7197A4j9j1K5Lk4nL1lj1j1J3jj4J9jjj4K0l2L4k3kj2MK8k7J6mmL5k7J0j3M1j3
7232B1qj0LJ3j2l2L3j9J7K2k6K0k2K4k3%L6l5RNmj1J5l3PK6j1J1l1L3rj7K5l7
7266b0L8j4K6k9kjJ9j3jlmJPmOnrK0j9jrK5k9L7j7%k5rK5LllJ3k1K3JmLj3POp
7308epJ8L1n1J6j0K5j5K8oj5%Kk4K3J8rJ5m4J6j4kL2k6jj5J4QJ6kl9K3loLJ2j8
7345a2JL5k3j4L1mpPRj8J1pk2J6J4j3j3K1k1MJ1kj3J6l7L8k0J8%J1k3oJ2j0j0
7380b0j8K6K1jNrj8RK8qj4pM9m5J0oKRpK4l7J3JJ1j8mJ5j4PJ2j1Llj8OkJ6k0j
$$ y = [-21, -13, -14, -12, -15, -29, 23, -13, -15, 14, 0, 20, -14, 9, 7, 20, -14, 7, 4, 1, -8, 38, 23, 11, 15, 10, 3, -2, 22, 10, 0, -6, 11, -24, -6, -27, -22, 27, 0, 14, -16, 8, -29, -3, -11, 4, 1, 11, -3, -20, -32, -14, 27, -9, 2, 2, -11, 22, 10, 9, 4, 11, 10, 21, 28, 18, 12, 27, -14, 14, 24, -12, -2, 14, -5, -16, 9, 12, -12, -17, 14, 11, 0, -11, 2, 1, -13, 6, 5, 4, -10, 10, -22, 12, -11, -13, -25, -21, 7, -20, -4, -8, -12, 23, -4, 6, -7, 34, 21, 13, 3, 6, 19, 7, -25, 8, -11, 6, 28, 2, 22, 0, 24, 1, 1, 37, 2, 11, 16, 12, 1, 16, -17, -10, 16, 5, 16, -15, 18, 9, -8, 17, -20, 18, 4, 30, 1, -1, -2, 17, 4, 3, 0, -4, -3, 4, 0, 6, 1, -8, 12, -7, -8, -17, 8, -21, 16, -1, -1, -26, -35, -10, -7, -10, -13, 0, -21, 2, 3, -1, 2, -11, -4, 2, -5, -12, 6, 37, -14, 2, -8, 17, 2, 30, 24, 9, 9, 11, -13, 10, 28, 19, 34, -10, 6, -8, -10, 22, -4, -5, -20, -6, 2, 18, 16, -23, 0, -3, -9, -6, 6, -12, -11, 24, 1, -13, 18, 14, 7, 14, 23, 5, 16, 9, -13, 3, 17, 4, -9, 12, -9, -5, 6, 4, -9, 7, -30, 8, -12, 6, 6, 17, -6, -12, 0, -10, -20, -38, -12, 9, 8, 13, 4, -14, -5, 23, 15, 1, -6, 43, -2, 8, 2, 4, 13, 6, 30, -7, 6, 7, 18, 0, -4, 11, -3, 4, 16, 5, 8, 5, -13, -7, -9, 7, -13, -14]
7419a4Rjk8LJ9L1qMk4K3j8PLJ2m7L5JrJ2J1l4rK3j2J5jj1J9L1n0j1L4j3qJ4Ok2
7456hj3L6rl3J9n%J2mkK8l1J8qPj1L8k0nj9J4j3J2j2K0j4L3k4Ml5O1k6Rk8J7J8
7492B6l7J1K2j1K0k4j6kKJ9m4M2k0M2k1nop%J7ORj3MprJ4Lk2QOlK2j1j5K4J3l2
7530EPMqJ1k2J9ok1Lk8L1qK1j2k4K6K9l6Lj3J8j3L2k7L8m2K4Jl7K5pL0j1pl8N2
7566A9k9PJ6mLJj4J5qk4J7LJ7j1qPj8pJ9mPj1pPJ4m2J5K0J3l4L0NPk1J7K6m0J0
7604A3mk0J6PkK8m5J6nnlNQPk5MJ8j8Pl2J4PK6k7QjJ2Om0j7K5Qk3K9JJ1J8j5N
7643A7j9K2k1J9k0J8Nm5K8qJ7oj5K2kJ8j3k5j2K3K9o0J2K0Jj2j1J9qk6K5Rj1q
7677a8K0J2J4k1J2l9L0MNj5MK1lj9koJ0qL8m1J0mMj0Kloj4j5L7j9J4rk1J5oM0
$$ y = [-14, -5, -6, -34, -31, -12, 19, 11, 15, -9, 14, -4, 3, 6, 18, -29, 6, 7, -2, 10, 21, -13, -22, 1, -11, 4, 3, -8, 11, 42, -8, -19, 15, 2, -6, 8, 14, -8, -21, 15, 6, -27, -8, -13, -13, -1, -5, -7, 21, -10, 8, 0, 7, -4, 34, 14, 9, -10, 4, -9, 3, -9, 11, -3, 30, 6, 10, -25, 36, 10, 19, -9, 8, 26, -11, 0, 22, 11, 31, 7, -9, -11, -9, 10, -34, 8, -12, 30, 9, 4, -2, -9, -9, 8, 14, 23, 10, 14, 7, -2, 12, 15, -7, 1, 7, 4, 26, 15, 0, 24, 37, 5, 12, 16, 8, 19, -3, 16, 10, -11, -8, -36, -5, -13, 8, -4, -28, -2, 27, -9, -6, -19, -1, -14, 18, -9, 29, -13, 11, 12, -25, 0, -7, 23, 12, 5, -33, 19, -10, -3, 13, 9, 12, 13, -1, 14, 6, -18, -1, 2, 19, 8, 0, 7, -11, -18, 1, -3, 4, -7, -14, -7, 7, -35, -20, 0, 13, -21, 9, 14, 21, 0, 17, 43, 3, 13, 9, -11, 5, 12, 10, 38, -7, 9, 4, -1, -4, 1, 9, 16, -9, -5, 13, -5, 2, -30, -16, -9, 17, -10, -2, -3, 9, 15, -25, -42, -17, -9, -32, -3, -2, 9, 27, 12, 17, -2, 20, -1, 18, -2, 16, 21, -24, 4, -4, 13, 7, -8, 14, 12, 30, 17, -8, -20, 3, 32, -28, -16, 4, 5, -7, -18, 1, -7, -33, -8, 1, -10, -18, 2, 14, 28, 7, 19, -20, 10, 14, 19, 4, 8, 29, 26, 7, 5, -1, 9, 1, 39, -2, 8, 4, 8, -2, 0, -3, -9, -23, -38, -1, -20, -6, -15, -36, -21, -27, 13]
7714A3j0J7j5J5j0oqJ5j0%jjM4n3lK2Oj1qj3L9okj6J4Qok6J4K9j9J6l8MJ0j2j
7751iJ4Jk0QrJ2j3K3l6J5K2J7ok4K2jmj5MQPk0J9j3MMNj3J8opJ9omj1k2LJ7qJ3
7791Hj0K3k8%%J8j9j2J2j%j0QJ5j3JPK7l1j0K1NK5Kk7k8L5pjJ6l1J6J5k5J3j2
7827B%MLK4k5Pj2j0J1lj3jok1L4Jl3K1L0j5j8J3NK0K3n8L4k8j4N2k8K4k3J2j8
7862fPlK7k3J2qj6NLRj1j0j1J5J2j9j6J7JL2j2mnj0QrjRJ1Jk0ORQ%%krRk4L9L
7904B4k2Kj8J8qROOj7J4rpQQk5j0K8%Mlj0LJk0MJ4OK0k0pK8rj6K6j9j3LRonj6
7945a9J5M0k7j4K6J0j6Kj6jJj9LJ7mj2M1l3j3kPJ3j6MK3rj8J1J1J5j9K4lj5j2
7980eK5k8LM3l1pOJ7j1J2m0LOmK5J1j3lk6j0J9k3L1MmK0m1J1KK0k6M%QOnJ0mL7
$$ y = [13, 3, 20, 5, 20, 10, 4, -4, 11, 1, 1, 0, -1, 43, -10, -13, 9, 15, 4, -4, -17, 22, 16, 14, -2, 12, 20, 14, -12, 2, 31, 12, 28, -10, -6, 4, -8, -9, 5, 6, -14, -6, -15, -3, -16, 7, -29, -14, 8, 25, 19, -5, 17, 16, 12, -3, 1, 9, 16, -4, 15, 2, 6, 10, 15, 2, 20, 14, 7, 26, 20, 16, 5, -17, -14, 3, -5, 8, -2, 21, -7, -7, -7, 11, -8, -20, -8, -9, -9, -19, -11, 4, -9, -8, -1, 26, -5, -15, 6, 11, 36, 38, 11, -17, 18, 11, 10, 26, -5, 11, 26, 1, 14, 2, 2, 6, 9, 33, 8, 15, 3, -7, 4, 1, -12, -13, -19, -40, -6, -5, -38, -17, 13, -2, -20, -7, -2, 18, 41, -17, 17, -11, -25, 27, -1, 23, 0, 12, -6, 1, -2, 25, 2, 14, 6, -10, -5, -2, 7, -4, -14, -25, -10, 2, -17, -33, -16, -15, 17, 5, 1, -4, -14, -6, -15, -16, -7, 4, 5, -15, -9, 0, 8, 8, 8, 6, -3, 6, -18, 21, 24, 2, 4, -14, 4, -4, 5, 11, 17, 0, 14, 5, -2, 6, 14, -11, -21, 7, 7, 11, 8, -2, 1, 2, -18, -14, 0, 6, 26, 6, -1, 27, 18, 2, 28, 9, -4, -1, 8, 2, -3, -19, -4, 36, 9, -5, 21, 31, 15, 17, 1, 0, 1, -18, -15, 2, -2, -14, 27, -6, -19, -21, -14, -1, -17, -13, 10, 1, -17, -6, 5, 20, 1, 25, 22, 7, -5, 20, -8, -5, 38, 7, 0, 6, 23, 12, 24, -16, -13, -7, -11, 14, 25, 12, 9, -17, -27, -8, -31, 0, 4, 0, 20, -21, -10, -8, 12, -14, -10, -10, -2, 4, -1, 9, 5, 42]
8019D2o4L0j3PJ2Pk7J8J7l0K7onnP%l8M9m5J0J1Rk3J4j3k1K7k1J5J2j6J9j4kK5
8054A5J1k7j8K9k8K0LJ6joJ6k0j3J8j1J8k2NpLL4lm0PPj6J9j0Mk8J4mKK3l6M8
8090B2lk3j8K7Ok5L3k2PJJ6k3K2j4jK2j7LRj5L2j5j2J3j7NJ0kl6NJ8rNK9k9k9
8126b5K6rJ1J5l3L7l0lJ8rJ7jjk9K2l1O3k6NpJ4k8J3rkK9j1Qj1k2K0kj2J4Rpl8
8163b5K8KJ3l5J7Njk6J6k3K9j7K5k2mM4j4k3Qj5K3K1j9kk1L2j4J0
$$ y = [42, -22, 8, -5, 2, 14, 21, -6, 12, 29, -1, 26, 20, 15, 10, 17, 17, -21, 28, -17, -7, 4, 13, -10, 4, -9, -30, -3, -24, -9, 3, -13, 6, -8, -10, 15, 26, -1, -19, 10, -18, 2, 5, 21, 20, 14, 30, 10, -3, 15, 4, 22, 0, 5, -2, 1, 35, 32, -8, -1, 6, -10, 9, -1, 3, -25, -11, -15, -13, 10, -26, 22, 19, -4, -22, 5, 11, -14, 19, -3, 4, 5, 21, -2, 20, 6, 5, 27, 10, 13, 22, 7, 39, 24, 12, 25, 8, 13, 23, 21, -15, -10, 8, -1, 4, 33, 4, -25, 1, -8, 3, 18, -15, 22, -8, -11, 7, -2, 15, 14, 13, -16, 6, -25, 38, 12, 17, 10, 24, -4, 9, 0, -2, 27, 16, 24, 13, -9, 11, 9, -3, 11, 20, 13, -25, 3, 5, 18, -17, 0, 5, 4, -22, -6, -29, 0, -17, 8, -14, -18, 26, 12, -11, -3, -18, 5, 26, 7, 5, -16, 16, 2, 12]
8191A2
$$ Imaginary data points
##PAGE= N=2
##DATA TABLE= (X++(I..I)), XYDATA
0@%%%%%%%%%%%%%%%%%%%%%%%%%%%%%%%%%%%%%%%kMpJ3j6J6j6J6j6J6j6J8k0K2
53A2k8L2l4L6l9M7n2N8o6P4q9J08j34J78k58M51j709l580K663M400K969o6j457
76C516j483k45J41j102l513m071k055K332M940L750N86j7J806K545K24l107m943
93f96m478k130R60K539J513P1J054L598M124J112k848m247k574j59N02k05p39
110b603m52Q23K791L011J21l033k901l1J978J330m95r44L33J882J773Jk256l668
128b340k735R8K142J428j55M42K937L877J961j294l500l832k716j034j51m10l26
145e608J464M227N184K798r31k864k249j409j829k507k237q84J402L801M327K179
161D864n73j364l86P0j292l031k831m03J973K756K114O14o32q16J25L10j267k816
$$ y = [0, 0, 0, 0, 0, 0, 0, 0, 0, 0, 0, 0, 0, 0, 0, 0, 0, 0, 0, 0, 0, 0, 0, 0, 0, 0, 0, 0, 0, 0, 0, 0, 0, 0, 0, 0, 0, 0, 0, 0, -2, 2, -5, 8, -8, 8, -8, 8, -8, 8, -8, 10, -10, 12, -16, 16, -18, 18, -21, 26, -26, 32, -34, 40, -49, 59, -75, 103, -155, 296, -1413, -4993, -2330, 2070, 5039, 4973, 3516, 2033, 1788, 1929, 827, -2686, -6757, -8812, -6480, -1540, 2210, 2796, 2779, 4585, 7130, 7354, 4247, -696, -5174, -7304, -6344, -3805, -2292, -2221, -1167, 2431, 6555, 7667, 4819, 572, -2002, -2161, -1659, -1864, -2603, -3055, -2232, 559, 3570, 3691, 658, -2243, -2274, -296, 1034, 539, -405, -72, 1810, 3583, 3584, 1328, -2340, -5075, -4977, -2835, -1407, -1562, -1120, 1817, 5694, 7655, 6361, 2861, -971, -3687, -4721, -4872, -5282, -5608, -4144, 83, 5267, 8065, 7134, 4270, 2021, 612, -1217, -3724, -5961, -6845, -5443, -1642, 2685, 4864, 4291, 2927, 2541, 2611, 1319, -1712, -4543, -4946, -2973, -217, 1897, 2511, 1879, 1063, 1188, 1498, 231, -2585]
179b585j806R59L001K652Q76l83m95k51m86j271k357k563j105J729L540K840P32
196C027J39P00O64q47k694l496k751p93J392K510K092J063J052J837J733m26l078
213B124l676k116l14N65P65P89R65J568K286J681m39k570k783j126M21L23l71
230a908j84J110J946J772O20r65k122j922l24O96K17o46j5J546K367J337n04j666
248A355j723j078l17O4k13l66M34K007K633J083r86j782j105m63n33q96q32j60
266b878J068K082K126P72q86j358n24J17o62j594j253K92J484J765J220K68n71
283A468o72r3J14q21j653j131O08J729J471K64k95j19Q5l7l66r25j281o42Q54
302a442J700R45k90n69J41M82k8q76j168o55K37R87J246N85m14n66J92N09l80
$$ y = [-2585, -4391, -3432, -431, 2221, 3097, 2714, 2219, 1968, 1482, 211, -2146, -4709, -5814, -4085, -545, 2295, 3027, 3166, 3866, 4530, 3683, 989, -2507, -5258, -6051, -4659, -2149, -57, 1006, 2058, 3895, 5628, 5202, 2124, -1552, -3668, -3982, -3417, -2652, -1863, -898, 670, 2956, 4637, 4198, 1628, -1155, -2281, -1860, -1537, -1908, -2092, -982, 964, 2736, 3356, 2391, 269, -1653, -1977, -1281, -1064, -1710, -1725, -179, 2188, 3525, 3021, 1355, -368, -1446, -1763, -1699, -1912, -2278, -1844, 163, 2796, 3879, 2893, 1111, 6, -457, -990, -1886, -2718, -2878, -1810, 272, 2398, 3170, 2284, 926, 402, 519, -143, -1737, -2990, -2698, -1214, 551, 1771, 2039, 1468, 796, 703, 817, -4, -1657, -2788, -2180, -451, 1020, 1284, 989, 870, 955, 918, 552, -373, -1654, -2296, -1442, 258, 1203, 913, 344, 485, 967, 939, 63, -1105, -1760, -1523, -536, 710, 1295, 881, 315, 507, 1016, 636]
321F36j443j232m5R83J166Q35L10o6q4J83nq24j712j342J87J312J125L72K33N95
341A184O60J82m72j125j569j078J53J007O73N6J49Q94J077K98q37j244r11l91
359a294J71N61L77n8R0P93R50j28j165j335m05L36M61K99L33M30O40O33L17n96
379A410j559j576m57M16L89J35M86J184J462R02Q1q48j478j499q60k50j25k02
397b389L51J530J985J268L0n84p73r43r38q08o93n16J77J166J714J071K3m04j99
416A068r8o12r85p50j98M01Q78J075N13k81n74k11l5n40r53n08M26J060J134P22
436A532L45j90n38o21o25r86j239o54O02J472J364Q38O53N54M2n62j075j461j485
455b034r68N8R48J128P97P90J141R15k0j001j294j171q45m00J50M16M24N69J009
$$ y = [636, -807, -2039, -2084, -1101, 65, 900, 1210, 1144, 1060, 1243, 1238, 414, -1298, -2640, -2453, -1141, -16, 356, 589, 1184, 1844, 2026, 1554, 429, -1140, -2218, -2065, -1058, -385, -329, -180, 714, 1791, 2089, 1252, 8, -903, -1294, -1123, -562, -185, -243, -153, 640, 1590, 1462, 297, -1038, -1443, -1107, -646, -347, -14, 416, 1056, 1689, 2006, 1410, -149, -1725, -2182, -1766, -1377, -1242, -756, 428, 1890, 2792, 2873, 2025, 547, -952, -1812, -2062, -2187, -2389, -2038, -508, 1477, 2745, 2775, 2191, 1418, 475, -463, -1271, -1964, -2480, -2303, -1137, 577, 1648, 1671, 1267, 1068, 970, 358, -627, -1377, -1575, -1174, -296, 779, 1292, 1011, 437, 226, 191, -349, -1302, -1810, -1384, -324, 810, 1532, 1877, 1687, 1149, 528, -97, -1083, -2322, -2976, -2374, -902, 462, 1300, 1953, 2507, 2549, 1987, 912, -549, -2034, -3002, -2944, -1996, -868, -71, 719, 1860, 2775, 2755, 1754, 460, -711, -1556, -1956, -1806, -1390, -966, -397, 612]
474F12J024J99o52q41m92j89k33j76K8L30L71M60M33n3p06q08j89K35J70q4K62
495b99P08P72L57p7m71q21r31o52r3K5k3L61J078J310P51O1l32m73p63r16p86
516a214m95l30P0P75J276R35L39K5P1oo05q96p36m40j48J19N84N73K03J43L25
537E68L89l2n57m90o0J32n1o6P2Nj23l3J67M4l07k06L20N32K95n3qP1n4l23l89
562a57l30l55k67J54N23M77J98J67M18L48j14n06m91l80l35k39OK07J28J54M32
583C8N90K64j60k46n3k7k86m07j71p7q4RK87K84L1j1K79L65J27k84k55l8j06l26
607b57k47o2n0JJ88M04M17M6oJ04J59k12m46l54o3j36j02J14L06K07M5J61K98
630E15N7k99k70k7M7r4j91M7J59Ln6P6J18j31j97N7K79J24n5qJ67R0j77k77j67
$$ y = [612, 1636, 1835, 1183, 342, -150, -339, -572, -748, -720, -390, -19, 441, 874, 821, 115, -693, -882, -647, -477, -561, -299, 409, 1181, 1538, 1461, 990, 169, -762, -1414, -1507, -1482, -1505, -1144, -66, 1244, 1995, 2056, 1724, 1251, 488, -428, -1214, -1709, -2039, -1969, -1194, 82, 1017, 1356, 1381, 1452, 1446, 841, -55, -791, -1231, -1379, -1260, -676, -103, 100, 243, 568, 957, 925, 368, -122, -182, -50, -101, -167, -95, -90, -213, -246, -79, -35, -342, -548, -228, 304, 599, 546, 538, 609, 555, 232, -157, -487, -842, -1109, -955, -432, 45, 243, 410, 828, 1176, 1062, 556, 65, -315, -650, -889, -883, -676, -548, -394, 38, 628, 892, 732, 486, 433, 406, 120, -287, -458, -535, -619, -610, -323, -39, -8, -19, 260, 625, 752, 468, 213, 175, 69, -257, -504, -566, -616, -615, -427, -23, 394, 440, 434, 538, 697, 485, 39, -315, -378, -514, -616, -502, -196, 11, 56, 217, 515, 572, 273, 3, -24, 23, -71, -262, -215, -56, -53, -109, -33, 85, -46, -243, -186, 93, 217, 162, 154, 321, 411, 234, -43, -210]
655b10j18k50q3K53L32J80J18K97K57k9l50l80k10k38k62j00K45K84K43K73L87
676F39K72k26l42k40j81l41k77M2K25K68J48L07K80J6k43k34r4j64k93j01J78
697c61L01J25J19J58J34j66k77j35o3j70j30J41L44J98L8P3J27q5l14k80o3m5
719c31r9J9L12L51J08n0J03Pk33l66j89j2nj4J56L50K55J9pPq6l33l16r4J15k2
745c55N8K66L42R8o5J0j3j97l91j63LQ8NJ13L11K62jo7Lk0k55k95j4N6l6l8J69
772a26K50P7p3PO0p6j66p2N8O7q0o9J43R3r8j52Q8R1n4m3O1K18K8j27j8K7k3k24
800a33j32L0P0m3L2K23K01nk5M6J6j91k29o7L1mj32Q4K27P9k3RJ39K9j28r1P4
827H7K6j53j04L6O9q4j53J03J30K4j4J45K02Q0j11q6Lj68k78k17J2Q7j6J12L30
$$ y = [-210, -328, -578, -661, -408, -76, 104, 222, 519, 776, 747, 397, 17, -193, -431, -693, -793, -548, -264, -21, 252, 639, 911, 685, 343, 103, -78, -419, -696, -654, -429, -161, -13, 294, 574, 590, 347, 113, 19, -145, -438, -539, -361, -60, 65, 184, 342, 476, 310, 33, -102, -165, -335, -465, -324, 20, 218, 256, 329, 456, 371, 57, -223, -286, -331, -430, -411, -99, 252, 360, 310, 413, 420, 187, -179, -368, -380, -385, -399, -243, 107, 362, 381, 374, 381, 295, -38, -354, -448, -333, -355, -297, -31, 311, 409, 344, 354, 341, 144, -247, -410, -407, -319, -314, -201, 110, 372, 371, 304, 307, 287, 32, -263, -277, -221, -257, -295, -126, 124, 201, 128, 135, 195, 119, -47, -119, -61, 6, -74, -143, 0, 93, -5, -157, -69, 22, -32, -75, -14, 204, 232, 105, 87, 114, 91, -133, -265, -235, -165, -208, -176, 47, 248, 243, 218, 264, 280, 89, -140, -207, -176, -180, -312, -228, -1, 78, 55, 64, 203, 232, 104, 13, 87, 113, -40, -144, -108, -39, -123, -276, -173, -43, -19, -33, 112, 314, 394, 283, 197, 200, 32, -246, -463, -451, -364, -380, -268, 62]
852F2L34O3J1K8n7k60l51k22j02nm1J52L79K62J00O9R0l8k75l05q5p9r0m7J94
877b13K60M5MO0Q2q3k05p2Q7M8j1j1K09L1j20j93l1o2j82j08J62K29J94J28J68
902D16K30j04k48l02j79k33l39l0K82L16K36K59L36J85r7k75k80l09l38k66l0
923g70K24J96K40L18L60J45j42k29j46j79l19k04L7J26Q6J50K47J86k4j67p3k3
945C9q9j73qK04J30K1K6O6k5k49k46Mj4m3P6K77L22J69RK0q5k71l72k45o9p7O
972e97J91M41L67J15R6N7r3l48l80k31j95j13N6K65L43K49J00J61J22j26l21k43
994h4j03j26j05J5J97K00Q5P5J13M9j83j93n4O3qm1P3J38L0m4n0qj00k14l4J31
1020a78J24J4P7K31J33m0j63j35r8k42j50kJ49R7P0K28K93P7j00j62p3j14k54
$$ y = [62, 396, 459, 470, 498, 441, 181, -170, -392, -494, -499, -540, -388, -9, 253, 353, 422, 512, 474, 199, -106, -191, -270, -360, -407, -213, 47, 92, 96, 156, 238, 155, -50, -122, -35, 13, 2, -9, 200, 231, 111, -82, -113, -175, -357, -465, -303, -74, 120, 248, 416, 646, 542, 294, -8, -187, -420, -759, -789, -507, -191, 45, 304, 640, 825, 728, 453, 173, -136, -474, -740, -770, -546, -350, -110, 208, 568, 713, 571, 342, 196, 17, -302, -506, -469, -343, -257, -107, 140, 326, 302, 135, 62, 39, -50, -223, -231, -27, 103, 124, 150, 216, 191, -58, -304, -300, -314, -357, -281, -4, 318, 487, 496, 516, 431, 160, -212, -457, -526, -603, -597, -406, 35, 402, 517, 613, 670, 577, 229, -151, -382, -577, -690, -634, -369, -26, 223, 323, 484, 606, 480, 159, -84, -187, -313, -418, -403, -206, -6, 79, 154, 267, 316, 133, -60, -114, -51, -59, -100, -27, 111, 141, 97, 47, 39, -61, -275, -309, -178, -54, -40, 37, 268, 401, 361, 198, 63, -35, -277, -427, -429, -280, -183, -113, 115, 408, 485, 385, 223, 150, 36, -218]
1043b18j65L3M9M9J27K22J92qm3n9L5j38j99j15J8M0J9P5J30N0p1J0Q1K7j27j35
1069a21O3J23j3r2j2P1l0p7J5M3K0j05O1J59R9j07n4K1J9r8r2oK1k9KJ45R6j1
1097A11q4P0M6m2j74r1R2K3MMP5M1l8m9J00%r7j02K3J21K7r1JN6ol2k9M5j5q5
1127i6M3J21P3p9n8L0M0m6j14k7M5QJ4Q0J26j4j15RP4r5j46r4M7R3J6M6J22Q8
1155A91j8l3J3j9j98j98kJ30J3jJ16J40J15J4m7m3j15j73j14L1L7k6kJ60K07P6
1181B54r6k3k1o6j54j8J3pk5M1J92L8n0r1J6Pm9p4L8P0RK3J18N6r5j24r3K4n0
1210a37p0l6J59J60R6M4P5J1j40j78o9q7j40q8Q9K35J35O6J19J42j2j12j43j38
1234a9j76j70n5J35J18P2O9K07J70K2j15j03r6j30j31l3O1QK7P2J84Q0o5o1K9
$$ y = [-218, -383, -350, -301, -252, -125, 97, 289, 281, 238, 179, 214, 76, -123, -238, -220, -180, -161, -86, 44, 94, 23, 33, 114, 141, 14, -121, -58, 65, 52, -40, -52, 19, -11, -88, -73, -30, -10, -115, -54, 105, 204, 97, 43, 64, 83, -15, -107, -113, -92, -121, -119, 26, 122, 111, 27, 97, 143, 101, -73, -164, -72, -49, -45, -41, 34, 75, 37, -12, 88, 88, -9, -111, -88, 33, 60, -31, -30, 26, 20, -12, -41, 4, -11, -96, -53, 68, 141, 62, 4, 34, 74, 28, -86, -113, -68, -60, -46, 34, 160, 146, 31, 40, 114, 19, -127, -221, -174, -81, -65, -19, 103, 191, 173, 140, 153, 134, -64, -262, -264, -134, -121, -122, -6, 134, 249, 263, 216, 173, 58, -115, -229, -198, -161, -187, -189, -29, 178, 254, 158, 135, 114, 48, -106, -124, -111, -118, -143, -102, 90, 128, 78, -13, 3, 10, -39, -113, -75, -5, 4, 27, 145, 201, 106, -18, -111, -87, -137, -207, -243, -84, 76, 172, 216, 291, 302, 162, -16, -85, -172, -312, -400, -311, -76, 59, 125, 244, 386, 374, 262, 119, -19, -195, -365, -420, -285, -167, -95, -26, 181, 351, 373, 258, 155, 59, -71, -202, -235, -174, -166, -139, -67, 117, 197, 132, 71, 100]
1259A00k1m4o9mM7l7K5K9M8q8j22lO4K6j1J5J59J13J6n2k5o8j66j30l6j6m7lJ75
1288a25K45J43L7M0J1p5j75k06j32j12j09P8J91J64J22J16J62O7j12j61j36j12
1310g9j39j24K9Q0N5O9J47J88P3q1q3K1q4j29o5j6K7l2K5P4J01m1m3M7O9k2l0
1337C7lO2M9o5l7j1n2j53n7N1L1OK9J84J57L7j0l4k1j46j89r9m8m6rR0K19J91
1365A63O8P4N7Nj50k24j18q8j03r1J27J46J20J02J35J47l8j17j22q4q7j38p1Q6
1389b01O4L0Q1J20P6j3p6KJr0o7PP8k6l4M5j1Mn8l7M8N6k8K0J08R8j5l6l1k4j22
1420c1j67j8J2M1L5R2J74J11J4l9J2o6j99j46n4k7k2J3J52J82P4O0L5M1j21j29
1446B9j27l5n4n7O5J01R9M1J4R8L4o7j46pj3p5o1N2J04M4j7K4K8j3o0l4K7Pm7
$$ y = [100, 79, 35, -34, -38, 9, -28, -3, 26, 74, -14, -136, -139, -75, -49, -60, -45, 114, 227, 243, 191, 166, 98, -68, -198, -234, -250, -297, -300, -125, 120, 263, 300, 340, 351, 276, 101, -105, -237, -349, -458, -380, -189, -25, 97, 213, 375, 442, 330, 169, 33, -79, -218, -342, -313, -233, -178, -109, 38, 226, 299, 218, 135, 156, 72, -57, -122, -138, -111, -143, -118, -44, 57, 16, -27, 20, 89, 67, 37, 34, 96, 145, 80, 43, 32, -20, -173, -230, -179, -148, -142, -113, 71, 228, 265, 255, 221, 200, 54, -135, -234, -282, -328, -337, -247, -28, 163, 231, 305, 362, 367, 217, -7, -125, -213, -316, -407, -280, -134, -14, 88, 223, 370, 332, 215, 93, 9, -78, -216, -287, -201, -137, -107, -26, 94, 170, 157, 81, 83, 84, -6, -73, -66, 12, -14, -48, -3, -14, -10, -68, -105, -57, -1, -29, -9, 99, 197, 182, 146, 115, 91, -31, -198, -216, -204, -163, -128, -36, 138, 249, 263, 224, 236, 170, -29, -175, -229, -256, -278, -265, -113, 69, 143, 203, 238, 279, 158, 29, -98, -133, -187, -244, -179, -78, 21, 62, 76, 174, 208, 141, -5, -12, -25, -100, -161, -109, -5, 39, 22, 46, 74, 61, 1, -33, -6, 1, -46]
1475d6k7Q3Q8o3k2Qpp3m8K8L5K6j8N5J10K0r2k6Lj6j05l9J8L9l0N0J12P8Nm4l5
1506F7Rp6p1m0K5J6oMJ16Q6r1JN1qj09p1M6lk0k4N3R7J4j2j9N7j2p1o1KJ4o9m
1539a09R1L9j6KO9M7m2m4J5ln8q9rO4K1m1L4R2L0Kl5O1l9p7p6K0ml1LK9R2J4l
1572D9L6K0n3l2l2L0l9m9l5R7K8m2NL9L8m9l0K8L9Ll4L1M5n3n8k6ol9j8%R8L1
1604B2N4J0J08j0n9q8n4m6j24n0J3O3R2O6J19J24K6n5m8r3r6j77n7RM8N8O3J57
1632G5J46L8m2l2n1j13j35n5J8pqN0J72O2k9MKQq2r3L5J4qj3P0L0n9o0j2M6l4
1663f3pJJ05Q8J7L2K5m2j07j49o1l9r7K3J03J63J46P8Q9N3o3j64j04j33j56p8
1689c40k3J20J63J17R5J45J12n0j16j15j43j51j08PO8R4O9J03J38L6j0q7k0n8
$$ y = [-46, -73, 10, 98, 35, 13, 21, 14, -59, -107, -79, -44, -18, -36, 19, 129, 149, 57, 31, 34, 18, -87, -126, -108, -69, -99, -49, 63, 141, 146, 102, 67, 76, 0, -71, -111, -86, -70, -76, -72, 44, 130, 39, 40, 91, 83, -26, -97, -51, -54, -74, -98, -45, 52, 66, 54, 35, 92, 80, 9, -52, -50, -36, -105, -109, -18, 21, 5, 7, 76, 123, 81, 37, 52, 49, -9, -98, -107, -43, -22, -63, -29, 63, 93, 95, 60, 121, 82, 5, -71, -51, -55, -86, -83, -54, 38, 52, 49, 85, 105, 52, 20, -12, 18, -21, -70, -105, -8, 20, -22, -17, 22, 60, 11, -19, 9, 48, 51, 17, 48, 93, 40, -18, -44, -50, -89, -107, -107, -9, 22, 76, 86, 194, 184, 125, 37, -17, -63, -187, -237, -224, -161, -69, -3, 116, 240, 266, 211, 163, 70, -26, -203, -260, -251, -203, -145, -82, 75, 221, 259, 217, 185, 134, 21, -114, -169, -151, -158, -166, -116, 56, 118, 89, 93, 95, 103, 21, -72, -37, -23, -31, -44, 26, 56, -3, -63, -75, -29, -63, -70, -69, 36, 124, 141, 173, 198, 156, 49, -100, -161, -200, -297, -274, -171, -8, 138, 216, 305, 358, 295, 131, 27, -106, -262, -340, -363, -243, -80, 37, 132, 277, 389, 339, 223, 108, -35, -186, -294, -287, -219, -125, -56, 47, 185, 221, 211, 124, 104, 46]
1713D6r1o7J1K2L4K9N6J1m7m6l0R5n5pK7Q2O5qLl2j04j08p7k7M0J2K6J46J93O6
1743B65pj7l2j33j31j11r2l9k3J10J76J71R8L8M8Lj12j81j38j41m2l5R6J57P7
1768EO3J08Q3Nj12r6p6m1n5j0NP3k2M2J09J1l7n9PL1K7p0j0O2L2l8j0n0k8j01
1798a52oN4O2J2M3J14Q9nn1r4n1j40n7k7jK7qJ66J85J08k7o2k5m5j20j00j02l6
1826b49J4M1J77J03L0KM1P8n2j22j67l5LQL2L6K7J0N8Q2K2l9j18kO9k1o0oj0L5
1856a3QnK8o5k1J7P4M7l2l3M8L5J9l8r5o3l0J4N0M2l0NR2J07K4o3j00nrm5m9l2
1888a18JKO4J55N6o5o5M1K6nr9r2k3J2O2N0J8k3NP4M0L7j22r7MM8K3k5m0KL8M5
1920B9L0J7p0n4K7Q1qn2p4oP7O3m4k8k8j1N8O8k4n4q1M3R0K1n2o5%L5L5j0k0m7
$$ y = [46, -45, -112, -101, -79, -45, -16, 40, 51, 4, -42, -72, 23, -32, -39, -12, 70, 135, 127, 130, 98, -6, -114, -191, -218, -178, -166, -140, 6, 199, 265, 258, 241, 209, 76, -55, -166, -258, -297, -320, -210, -34, 137, 235, 273, 321, 324, 212, 31, -107, -248, -290, -325, -229, -72, 5, 68, 176, 259, 264, 152, 56, -20, -61, -116, -126, -121, -48, -70, -28, 81, 92, 55, -4, 3, 34, 61, -9, -19, 43, 75, 37, 27, -23, -51, -152, -158, -104, -42, -30, 13, 127, 216, 211, 160, 66, 15, -125, -182, -209, -210, -183, -191, -25, 160, 268, 241, 179, 154, 109, -11, -111, -213, -249, -235, -194, -17, 86, 116, 118, 159, 237, 185, 63, -104, -139, -136, -128, -96, -60, -33, -23, 35, 117, 139, 100, -18, -20, 49, 28, -32, -38, -48, -13, -5, -10, 18, -47, -68, -51, 23, 70, 38, 5, 53, 88, 107, 69, -26, -89, -119, -105, -55, -13, -43, -38, 54, 161, 185, 122, 22, 17, 8, -37, -86, -118, -117, -115, -51, 104, 160, 95, 30, 71, 97, 92, -7, -99, -122, -110, -48, 2, 20, -3, 2, 76, 116, 153, 31, -66, -62, -14, 9, -16, -56, -54, -16, 29, 59, 76, 6, -48, -21, 60, 52, 0, -74, -80, -3, 60, 16, -12, -40, -51, 7, 75, 51, -3, -84, -41, 49, 70, 18, -47, -47, -12, 23, 13, -7, -54]
1952e4J6L1R7J1p5r4O5P0J6o8o1l4O0J1P3k1k0n2L1P9Lr2p3kP8L0k1l8mL1O1N0
1984A04j5q7r0K8Q8J5q1o4L9R3N1K9k8p3l9K3P7rj37j03N0J32M0j0m7L1L9N5J4
2013A25o9j24o8L7Q0M5j11k5O5R8Q3o6m6m8J4J0L0m0j03j6O0J34M4r1p3J6O2Q3
2041A06n7o9j9J9K5Q7kr8j06K3J03J2m2m8L9N0R4L0p0p1o8J4N9n4q8p7J01J36
2069B9Q1Ll3j3L7lor3j30r9M1J35N5k7j0O0J31M1r1o0j04o5N4N6o0n3RR4J19P0
2099A68q7j02jM7L8m3l0o9JP4P6J2q4j06J5J29L0m6o0nQ9M1L5m2r2j02J6M4L8
2128a6r3o1R8J72Q2Jo9o2lk6k6p6j05m1P7J68Q8m2jK2O3K8j04j20j04k2K1J14
2156c7K3m8l7J32J25J8o8j29k6K6J6j0m3l8k8R6J13M1j07p9K6J02K0n1m6l6M2
$$ y = [-54, -38, -7, 90, 101, 26, -68, -3, 67, 83, 15, -46, -80, -20, -9, 64, 43, 23, -29, 2, 81, 84, -8, -81, -83, -5, 25, 4, -34, -38, -7, 54, 104, 89, 2, -88, -60, 28, 43, -38, -102, -63, 30, 81, 110, 82, 9, -30, -7, 70, 61, -76, -179, -129, 3, 43, 33, -14, 17, 56, 111, 125, 56, -68, -136, -99, -19, 26, -85, -110, -45, 53, 136, 70, 24, -24, -10, 0, 30, -10, -113, -129, -69, 65, 109, 18, -55, -39, 23, 106, 49, -20, -39, -20, 5, 92, 90, -8, -114, -91, 12, 24, -18, -66, -27, 23, 117, 147, 77, 6, -62, -48, 11, -43, -131, -208, -107, 29, 110, 113, 80, 67, 104, 101, 95, 2, -128, -227, -186, -51, 4, -23, -33, 27, 158, 199, 108, 48, -56, -121, -67, -11, -71, -124, -115, -21, 98, 168, 81, -21, -22, 25, 63, 20, -10, -79, -78, -4, 72, 84, 0, -106, -91, 38, 68, 22, -38, -43, 46, 87, 122, 80, -12, -114, -98, -54, -16, -109, -170, -72, 100, 182, 183, 114, 52, 49, 23, -3, -79, -184, -225, -148, 20, 108, 66, 65, 87, 150, 178, 74, -46, -150, -172, -151, -37, -14, -62, -99, 33, 158, 176, 108, -21, -47, -21, -5, -15, -58, -96, -124, -28, 85, 126, 19, -60, -34, 68, 88, 37, -9, -45, -3]
2183cJ00k8m6j07q1N6R5M7o2m0O1J42N0m4r6r1JrJ5l7r5L1R0J66O5j9j06JL7l1
2213F2l5j22r2j2J05J17O1o2l9O0J20J4r0j75k2K5N9L0l3n6J2J02J08l6j10p9
2239h8N6P3L0l7n9k9K9O6L4o5p6o8P2J19M1q0m0M4R3J1j9j03j27K2L0N1no6j6
2268a07R1J75M7j15r2m6M4l7J6n4q6%J28J02N9n6n3K5N1L9j46r9PK4N4N0Oo1j1
2297d5Q5Q2k5r0r6K1R9%k3m3l2M1L7P6m9p3p0O7J04J4o0n9j7P8M6j2q1n3n6Q8
2327d6N6M0p1pL7R7M8r2q9n3N7j3L2m2k1J9O1J00J3p5r1L6J2M6n2m8n0L3N9N5
2357E1mn6k4K8Q7Mj12l7J5L5O3l8l2l0L4L6N8j7q0m8L7P3L9q1m9JL2L1K3l0p0
2388f1mR0M6j9o4l6j0J03J9n2p4M0QK7O4p0n5j6Q0N5j0q2j4j9M9N5l4o1l9M0P8
$$ y = [-3, 97, 69, 23, -84, -165, -109, -14, 33, -29, -69, -8, 134, 184, 140, 44, -47, -46, -55, -40, -77, -172, -141, -51, 115, 180, 161, 55, 56, 93, 62, 27, -95, -187, -199, -94, 23, 84, 22, -17, 43, 163, 177, 87, -88, -110, -85, -26, 4, -29, -85, -73, 29, 137, 101, -9, -88, -32, 41, 71, 34, -25, -54, -25, 41, 75, 10, -66, -134, -62, 57, 98, 18, -22, 22, 115, 126, 107, 4, -123, -101, -71, -20, -25, -91, -107, -16, 159, 206, 91, -1, -47, -3, -40, -24, -78, -164, -164, -36, 66, 125, 69, 16, 41, 92, 131, -15, -114, -107, -83, -29, 21, 27, -34, -45, 40, 122, 97, 7, -89, -68, 31, 31, 8, -35, -67, -26, 11, 87, 38, -35, -105, -38, 66, 80, 20, -39, -56, 22, 68, 56, -25, -78, -134, -46, 10, 50, -21, -28, 9, 106, 154, 62, -27, -80, -23, -36, -4, -46, -67, -48, 13, 113, 126, 51, -40, -4, 8, 54, 2, -46, -96, -63, -4, 51, 47, -9, -33, -5, 82, 86, -26, -63, -48, -13, 50, 12, -20, -50, -16, 20, 78, 61, -19, -67, -30, 43, 82, 1, -48, -47, -15, 16, 39, 9, -61, -65, 25, 71, 52, -12, -48, -58, 45, 64, 12, -62, -22, -14, 13, 77, 7, -48, -64, 16, 71, 61, -21, -35, -54, -5, 50, 16, -45, -84, -44, 34]
2419C4L1nq3m2N5M9J6p0m5J0O1J8Nl5Mj9M3K3mr5j4J2N1N1n3n9NO3K5M0o8k8j4
2452c8M8M3Mq6k7L2M0L7k0m2k6M5K4K7o6k0n8M2P3J3m8j9l2O8O4n9mn1jJL4Rn9
2485e2j7P3J8L0l0q2L9L3L4l4l2l6J0RP5J0n3o1J1O6K5j7m0QM2J5Ml3l9n6M8N1
2517A9j3l6m5K2Q2K5om4mK1kLk8n1l9O2O6K5l4j8J8K4L9m9l7n7kL0K8mk3m1P5
2550FP7j7o1j5j9L1K5j9%l1j8M3M1j5l0m8K7L6n%m1kO0oK2j3l3m3L7J4J0k3oK
2584a4N0J7%l6%pj2j1Kl9k4M4P5K5l4k0pK5K6o7k6pl2L0L3K0k1k4N8L0Jj1n6j0
2618b2K7k5rL9m0KL6L4Pm5m0NL3M0k2l5L4lJj9j9mj5J1M2j8kk0M0L2K6o2j5jk7
2653c4LNqJ7mJ2O9nLk1k6j3l6K4j0l7pM6L6L5j3j5kK8%m6j8j4KK7J1jj0J5RQJ7
$$ y = [34, 65, 60, -23, -65, -10, 39, 55, -15, -60, -50, 11, 29, 34, -1, 3, -16, 27, 50, 46, -49, -63, -51, 0, 51, -2, -61, -56, 7, 32, 72, 4, -24, -38, 10, 53, 57, -29, -56, -24, 16, 53, 33, -9, -35, 10, 34, 61, -5, -25, -83, -41, 32, 45, -3, -22, -54, 14, 78, 19, 15, -36, -37, -36, -2, 7, -52, -69, 4, 22, 52, 22, -60, -21, 12, 46, 12, -20, -56, -46, -37, 38, 48, -5, -66, -55, 11, 36, 19, -21, -13, 29, 44, 48, 15, -24, -80, -32, 19, 6, -30, -75, -53, 29, 54, 48, 4, 0, 21, 19, 22, -6, -57, -96, -34, 32, 57, 23, 5, 23, 47, 86, 37, 0, -57, -59, -29, -1, -5, -28, -69, 6, 83, 66, 5, -10, -29, 2, 27, 8, 8, -23, -41, 2, 43, 28, -2, -50, -23, 13, 8, 8, -33, -35, 25, 19, 41, 28, -5, -48, -11, 3, 13, -10, -16, -14, 36, 53, 53, 17, 17, 10, -2, -13, -11, -50, -74, -30, 45, 70, 36, 16, 9, 34, 60, -7, -33, -40, -72, -42, -9, 11, -10, -34, 24, 54, 55, 44, -12, -22, 5, -20, -29, 10, -30, -28, 8, 42, 49, 4, -36, -31, 2, 42, 20, -15, 19, 16, 17, -2, -21, -25, -40, -29, 13, -5, -7, -27, 13, 45, 71, 9, -6, -7, -34, -31, -26, -34, -17, -21, -9, 60, 55, 58, 37, 11, -2, -38, -14, -24, -61, -68, -22, 14, 49, 36, 21, 19, 47, 47, 1, -17, -31, -29, -2, 9, 8, -2, 13, 22, 30, 47]
2690D7m6l3L4j7L2k3j0j3K7MLJ2m0K4j8K6J0k1NMJ7Qrl1ql3L0M0pjj4J4M7kn2
2725Fojqk0jJ5opL5J9K6k7%rnj4km1J6K3k4M9Lj3nKM0Pm1m8QL2%l2L0J1J0l7J2
2764cJ9k4krJ5L5n0J2L0j3k4RlkMj4L0J4j5j5nM1k3nj1lK2n3L4Pkj0J6K5Qol2
2801cnRk4QRPj4PJ6jk0J5LoJ9n2J7j1K8j0j5K4kK8m2J8Lj1Nl5L2j7m%K5nK2Kj1
2840Il0J4KrJ1j7Rk1QJ9NK6oj6oRPj1l4J8L2Nl6lNM1k3j1K5J1l2oQK2qj0Qj1K2
2879B6k6j0L2j2pJ3J4j2l0LpL4j5k7mL4%j0J1KJ0J2pk8J5j7Ok2MqK6QjMk6M0J4
2916C9l1j7k%k1J1PJ1J2Mj0K4mj2jm0J6Pj7K2k1J9j4L5J2qkj0MNm9rL6j0J1oK3
2953A4p%j8K5k6okL1J1l1J6k3K4kk8OnL4k3J0K5J5k3LpKj1o0PkM0pKJM4Llk5j5
$$ y = [47, 1, -32, 2, -15, 17, -6, -16, -29, -2, 2, 5, 17, -23, 1, -17, 9, 19, -2, 3, 7, 24, 32, 23, -8, -16, -49, -19, 21, 14, 13, -1, 13, 60, 58, 6, 0, -1, -9, -29, -30, -15, -21, -28, 7, 26, 52, 25, 25, 16, 11, -3, -5, -46, -30, -7, -31, 18, 21, 8, 3, 5, 45, 52, 11, -37, -29, 3, 3, -29, 1, 12, 22, -15, -3, 16, -8, -10, -19, -4, 31, -19, -7, 23, 10, -14, -5, -8, -10, -6, -20, 10, 24, 9, -6, -11, 30, 7, 2, -9, -12, 10, -43, -9, -2, -4, -14, 2, 27, 35, 29, -3, -8, 1, -23, -15, -6, 1, -13, -6, 10, 9, -11, 4, 7, 1, 20, -32, -15, -26, 2, -8, -23, 1, -1, 27, -15, 3, 6, -5, 0, -35, -3, -20, -24, -24, 1, -4, 18, 20, 9, -21, -7, -5, -14, -3, -20, -11, -32, -24, -5, 0, 26, 20, 4, -2, 7, 14, 3, -31, -13, 19, 24, -12, -15, -10, 31, 8, -3, 22, 33, 1, -5, 3, 25, 17, 7, 15, 4, 26, 0, -10, 22, 10, 3, 16, 30, 18, -12, -9, -16, 18, 3, -24, -28, 6, 6, -4, 7, 9, 19, 31, 24, -4, 11, -6, 0, -22, -18, -26, 0, 8, 7, 11, -15, 25, 39, 8, -9, -11, -11, -32, -21, -14, -3, 9, 13, 3, 27, 23, 11, 10, -30, -14, -7, -24, -2, -23, -4, -18, 17, 29, 21, 19, 9, 13, 18, -31, -40, -4, -14, -3, -9, 14, 7, 7, -11, 14, -12, -18, -20, 11, 22, -9, 7, -16, 8, 6, -22, -16, -21, 13, -10, 0, 25, 40, 17, 20, 13, 15, 4, -56, -49, -51, -11, -18, -16, -15, 29, 32, 29, 4, -11]
2992a1J1j0MLrnpK1kk6N0%Pj4Qlk1j7J1Rj2j1K0%J8k1j2J9j1M5k5OnOj9qJ1J3
3030A3j2rPKmk5P3oj1j5LK4n2k7M5j0k5K5NL0j6ONMk8ll9oJ9QpJ9K6LOJ0k6j7
3068eNMj3k2RJ5MmK0j6MK4ql2PmK5j5jJ0k1J2j2K8Ll2KJ8NOk1J9Ql5J7j0joqK7
3108Fl1L9pMlQk9oJ4J9l8J2LJ5Pm0O4J0m6%MNMk1j0LkQj6K9J0k2J5klRk9Mpk7
3148d7%N0qJ4j1pL5qk5pJ6j5nJ1J2j7OK5j5K7k9lj3QRk3K9oJ5k5L0K%l1Jj6L0
3185ILl2RJ2Nj1K1j6jkKJ1j3MJJ1k1QNMK0k7k0J3K1k7PK5K9k4k5J9j8J2k6J7j4
3222iJ0rJ6lqJ8KJ5j2l5OJ0nk4j2L2pPj1L0J4k3%K6j3Qm9Npj0M3k0L9kl%j3L4
3260D0k3l7J0JK1l3j0M3m5J4K0k5J8L4m2NOmJ%L0k7lj8N8m2%J4jJ7NRk3pRk6j
$$ y = [-11, 0, -10, -6, -3, -12, -17, -24, -3, -5, -31, 19, 19, 26, 12, 20, 17, -4, -21, -10, -1, -13, -24, -4, -4, 14, -7, -19, 0, -11, 34, 9, 15, 10, 16, -3, -11, 0, 13, 1, -8, -1, 1, -3, -28, 45, 39, 28, 13, 16, 40, -12, -39, 6, -4, -29, -4, 1, 31, 15, 21, 26, 30, 2, -1, -40, -46, -27, -19, -26, -7, 19, 22, 28, 38, 12, -5, 0, 4, -9, -31, -22, -7, -3, -7, 13, -3, 1, 25, 17, -15, -8, -12, 13, -2, -3, 7, -14, -2, -14, 14, 17, -15, -13, 5, 10, 16, -5, 14, 22, -13, 4, -6, -7, -13, -21, 6, -25, 14, 7, 11, 8, 16, -13, -19, -5, 14, -24, -12, -9, 6, 13, -27, 37, 47, 1, 1, 5, 10, 14, -7, -17, -14, -16, -8, -24, 5, 15, -7, 8, 6, 3, 12, -17, -13, -20, -47, -47, 3, -5, 9, -2, -9, 26, 18, -7, -14, 2, -13, -18, -7, 5, -12, -6, 19, 4, 31, 2, -1, -14, -6, 3, -20, 9, 3, 18, -7, 23, 25, 25, -6, -5, -21, 9, 12, -20, -11, 1, 6, -5, 16, 0, -1, -3, -1, 10, -3, 1, 2, 13, -8, 0, 5, 9, 29, 2, -18, -5, 16, -11, -4, 21, 50, 26, 1, 20, 2, 14, -12, 5, -9, 1, -8, 8, 5, -3, 15, 17, 32, 20, -15, -9, 1, -4, -28, -40, -8, -15, -8, -19, 11, 25, 2, 2, 28, 15, 23, -26, -21, -28, -38, 5, -15, 24, 22, 19, 19, 6, 40, 17, -20, -10, -9, 12, -21, -31, 12, -33, -19, 1, -24, -6, 28, -14, -9, -3, -7, -6, -6, 24, -3, -6, -24, 34, -8, -8, 6, 5, 22, 27, 36, 13, 6, 15, -11, -12]
3297a2qlrN1j6L7Qj4mKok9jk5j4J0J2OJ7L0j6MLk9J1qj6OJ0k1LPL3JJ6l3J6l3
3335a4L2mqj3RmMnJ1pj5J6oJ8k7K8K4l0Nk7N1m0k9K3k7J1j1L4k0N2J7k6Jj7J9
3370B5j6jPl1j6J5M1k4MlJ3K7l2l4J3mprJ8J2%J3J2rPkn0L2jpj1J4J1j6K6j0n
3407Bmj7MK4kOnj1RJ1j5qJ4j1j2RJ1j0J1k2L6%oqrl1J6qJ4Lj7PL2qK6J2k9oj8
3446a0qk6NK6K2J3l0K5j5K3jj5LlMmk8RL4l4OPoK0mj3j6K5k2ORJ3k7j2L5pj9n
3484b0rK3k8K1J5kj0K5j4Kj3rMK5mj7J5rNJ1mj4K9l3j9J7J3kj7J4PKjJ8nm0K6
3521BmJ4l6K1k2j0M9j3L4j7Qk5J6j6j5OJ4oRoKQj4J8k5J1j4K6qJl4LJ7K5nOqk5
3559a3OK4j7J2mj0JJ5Ll5J7J3j8lL6k7l0J8J4pP%j8N9m6KJ8k2K6j7Mpj2JMNPl
$$ y = [-12, -20, -23, -32, 19, 3, 40, 48, 34, 30, 32, 26, -3, -4, -29, -43, -33, -21, -15, 2, 32, 16, 20, 23, -6, 5, -3, -19, -13, -3, -24, -21, -14, 19, 20, 36, 3, 19, -14, 18, 14, 6, -7, 2, -2, 2, -3, 8, 1, -14, 2, -4, 14, -13, 15, 39, 9, 14, -13, 38, -2, -31, -8, -35, -24, -35, -1, -21, 31, 48, 22, 23, 6, 25, 9, 8, 15, -16, -32, -17, 24, 0, 4, 1, 14, 41, 9, -25, -12, -16, -23, -32, -14, -2, -2, 11, 23, 14, 21, 19, -31, 1, 0, -7, -18, -4, 7, -9, 17, 7, 2, -2, -19, -15, 9, 7, 13, 8, -3, 6, 17, 2, -6, 8, -3, -15, -6, 5, -5, 6, -16, 20, 20, 14, 6, -3, -34, -18, -26, -12, -9, -26, -19, 13, 5, 31, 43, 14, 8, -10, -18, -44, -39, -13, 9, 22, -8, 17, 2, 25, 24, 9, 12, 9, 13, 9, -19, -10, 24, -10, -4, 3, -3, 17, 13, 0, -16, 9, -13, -7, 2, 15, -12, -24, 11, 4, -15, -20, -29, -6, -34, -13, 2, 0, -10, 15, 1, 3, -10, -19, -15, 10, 6, -11, 4, -5, 0, 11, 7, -7, 22, -11, -30, -13, 0, -2, -19, -5, 2, 4, 3, 21, 16, -24, 2, -2, 12, -24, -3, -25, -35, 14, 1, 35, 18, 26, 1, 17, 1, -14, -8, 6, 0, 9, 3, 5, 13, -1, 17, -8, 3, -11, 15, 7, 8, -26, -23, -6, 19, 14, 20, 12, -13, -7, 17, 0, 12, 8, -2, -1, 14, 17, -18, -1, 12, -6, -9, 27, 0, -30, -12, 2, -5, 2, 2, -16, 43, -3, -1, 17, -5, 21, 4, 8, 1, -11, -10, -6, -1, 6, 3]
3597Ck7J7j1lJ8JK9j0o2M0K3k5k8L2L%k5PK1Pj5RPJ5k7J2k9L1l4J3PqQkJ2J1j5
3634E%lkJ2k6jJ4j1OOj1K0j1j8J7J6%l2lJ0RK0n8O2j6j6LK6j5j9j2J4J7jQj3%
3671cjj0kJ2qrJ0L0J4j4j8J8k6j0J0j2J7l6J8QK3nj0K3lLk8K7l0j6j0L5l2M3k2
3706a4K1mJ6j7K0j2k2J8pPj6k4oK4K1pmOrJ6j5LJ3j5JpK1m4J5Oj7K4pkJ2J7J1
3743B3j7J1%rm0J7j0L4J0j8pJ2J8Mk6K0J1l8j1K1k9K8j9L5KnJ3j1J1k0m3J8K0
3776Ek6L0j5jK5k4L2lk7p%K4j8QqK5j9MqpKJ6j5mrK1L1jk4j%j3l0L5J2m6M6l6
3814b6L5k3qL1j9kL6j0j7JOk1nK8K6k4j0J4PJk0j2J8J8m7qJ9J5K7j3k0K5nj3O
3849A0omj3J7j7PJ2k7l4M4L0l3j1J8M6m7Rj8K1k6kJ5J3k4jJ1k5M0qQK9l7%j7K6
$$ y = [3, -24, -7, -18, -21, -3, -2, 27, 17, -45, -5, 18, -7, -35, -3, 0, 0, -25, -18, 3, 10, -5, 4, 11, 26, -1, 11, -18, 13, -21, -8, -1, -9, -1, -3, 9, 20, 5, 5, 2, 0, 12, -14, -15, -1, -12, -6, 0, -11, 9, -2, -20, -3, 13, 13, -19, -22, -12, -3, 17, -41, 21, 5, -11, -8, 18, 3, -16, -28, -14, 3, 2, 10, -3, -3, -4, -14, -16, -4, -12, -21, -11, 19, 33, 19, 1, 19, -7, -17, -7, -19, -2, -38, -20, -12, 11, 6, -4, 19, 16, 19, -9, 18, -12, -28, -38, -3, -35, 8, -14, 7, 3, 19, 2, 22, 10, -12, 6, -1, 6, -10, -34, -40, -16, 5, -2, -6, 0, -9, 7, -8, -5, 8, -7, -6, -13, 8, -36, -21, -15, -32, -8, -15, -17, -5, 12, 23, 6, 17, 17, 8, -32, -15, -25, 9, 19, 1, -6, 6, 24, 28, 2, 22, 33, -5, -16, 5, -24, 4, -15, 20, 22, 17, 30, 19, 30, 10, -33, -15, 5, -21, 9, -6, -7, 18, -6, 26, 23, -4, -11, -11, 13, -5, 3, -5, 20, 1, 5, -3, -10, -8, 8, -7, -11, -20, 1, 32, 31, 7, 6, 6, -7, -37, -2, 10, -36, 10, -26, 9, -14, -22, 9, -10, -12, 24, 14, -3, -2, 4, -17, -22, 6, 32, 8, -2, 12, 19, 20, 0, -12, 6, 24, -23, -31, -12, 3, 30, 17, -3, 22, 17, 4, 10, 4, 0, -13, 4, -13, -6, 6, -21, -55, -11, 19, -14, -25, -7, 39, -8, 1, -17, 4, -22, -24, -9, 4, -20, -21, -10, -35, 5, -3, 5, 34, -3, -3, -20, 6]
3884FL7p8jL2Mj6J7oJ7k2mK3qk5J0nL9j3krJ6j4PjJ2k0k6L7l1J7K0nJ6k0mLj3
3921a0Q%NrOJ9j8jNnrL1Nj5l8JK5Olj4kmL3k5JJJ9k1k6K2K3Pk5K0Rl4K6j1l0N5
3961B7n4J6K2ll8K6L1J1l4LmjK3l5RrJ0J6m0k2M1kJL2m8J9oqJ2K4k6j2PJ6j9K7
3997A2JJ2k3j7K7J8l0Rk5NLJ3J5l0l8L2K3OpqPPk6J7mKooJ6j5Nj0L9j0Mk8JMK3
4036A8qqQqJ2%q%J3k1j7O4l0ml8J6L9k8J1l3J9K1m2K0mJ7k5kL3j7j1k5N0j8RN
4072HK3k9%J0JK3k3k5QJ5klj6K5nj9M2l8j7kmJ2OJ7qQNJ7j8j2J5ojJ7m2K9l5J9
4110eJ5mrqOK3Nk6j6K2j4K5j4L3n1J0NJ0qrl0N3mRJ5j9qnlK7%j7mJ1k4L6j9J7
4148B5Km7LJ1L7l3Rk3kOL4m0K4K5l3oJ9j7q%J1RPk0K4j1J0k5j1K3J0nm%k9K8p
$$ y = [6, 43, -35, -36, -4, 0, -16, 1, -5, 12, -10, -14, 9, 1, -24, -14, -19, 20, 7, 5, -4, 12, -2, 5, 4, 16, -4, -30, 7, -24, -7, 13, 8, 24, 4, 0, 3, -10, -2, -2, 3, -6, 0, 19, 1, 0, 5, 0, -9, 22, 27, 12, -26, -25, 0, 6, 3, -11, -13, -17, 16, -9, -8, -7, 12, -9, -35, -13, 10, 17, -8, 12, 21, -13, 13, 2, -28, 27, -27, -11, 11, 8, -30, -4, 27, 38, 4, 7, 3, 2, 25, -10, -1, -10, 0, 16, -24, -46, -5, -7, -6, 26, -22, -3, -9, -17, -5, 19, -7, -19, -12, 4, -15, 12, 13, 25, 2, -15, 12, 30, 0, 9, -16, -11, -8, 5, 20, -10, -48, -16, 7, 13, 6, -2, 5, 12, -14, 3, -1, 1, -5, -11, 5, -10, -5, -15, 24, 14, 18, -10, -9, -5, 18, 10, 2, 10, 2, 14, 14, 6, 6, 19, -2, -19, 45, 15, 11, -27, -11, 28, 0, 11, -22, -3, 18, -24, -4, -8, 9, -16, -18, 15, -2, -13, -38, 12, -6, 3, 8, 31, 2, 2, 12, 13, 36, 13, -12, -4, 11, 9, 6, -10, 15, 10, -9, 33, -5, -22, -24, -28, -16, -10, 7, -1, 7, 12, 29, 11, -1, 14, 8, 7, 24, -18, 11, -24, -5, 10, 6, -3, -11, -5, 18, 23, -3, -19, 3, -11, 14, 0, 33, -18, -8, -3, 7, -1, -10, -40, 13, 9, 18, 33, 14, 6, 1, -2, 25, 25, 8, 4, 15, -9, 27, 8, 25, 27, -20, -17, -6, 31, -2, 7, -16, -18, -12, 22, -18, 6, 31, -2, -8, 11, -6, -14, -14, -3, 6, 13, -7, 17, 6, 16, -9, -20, 3, 13, 8, 4, 4, -25, 3, -4]
4185dK1J5k4l9K2K8l3K1n1M3jpJ4qqj1K8k8M6l2PnJ0%K3k5k7K7k0J0NJ4j5MJ9
4220A9k1OkJ2qkJ3k0nl5M6J1kk5nJ4K5Lj7l9J0K2j1K8j1l2J6RJ7Nl6j0K5j1QK5
4256B2k2oj0L0j1Pj3j3k6M4j2K5k7QmRKj5j0J8J3Orkj1MK4rNk5J2J4Jqk2jK3k9
4294a8L6J2j8k2mJ7noJ4k0oM0jk5j7J1k2O5l3Ql9M0j1%J4Ml2K9l0jQj8J4RRNk1
4331a4L2k0J9Nl1MRj4K5J9j0l2j5K9j3K4j3qj0K3l4J9Lj2qOK5J8j2k3lK9nj6n
4366ij0J9Mk4K1pJpL5j5j4j1LK9j3lj4J3j2K1k3L6j2k7mJ9j5J8l3lK6K0Mj9j0
4401a6j3L2J8k4j4J9j9L7Jj6l4K5J5Kj8L1m9L2JJ6n4M6m7M8Ol7K7Jk5K1j7j5M1
4434B1lk1j8M4j3rj6j1M3k1J2kJj9Jj7L5l5RPK6j1oJ8l0kRK6nj6j0J1J8Pk8%j0
$$ y = [-4, 17, 32, 8, -31, -9, 19, -14, 7, -44, -1, -2, -9, 5, -3, -11, -22, 6, -22, 24, -8, -1, -6, 4, 4, 27, 2, -25, 2, -18, -8, -3, 11, -4, 0, 19, -2, 4, 2, 14, 6, 4, 17, -3, -8, -43, 3, 14, 12, -13, -18, -4, 21, 24, 7, -32, -22, 0, -11, 17, 6, -26, -10, -1, 16, 21, -15, -25, 0, -11, -3, 22, 0, -6, -16, 14, 3, 10, -3, -16, -42, 2, -10, 15, -12, -4, -8, 1, 3, -12, -22, -4, 9, 15, 6, 4, -7, -3, 21, 12, 17, -8, 4, 18, 19, 11, -11, -12, 11, -18, 18, 30, 12, -10, -14, 3, -2, -8, 6, -14, -20, 20, 19, -6, -23, -12, -34, 31, -2, 6, -33, 7, -4, -4, 10, 14, -18, 11, -19, -20, -12, -30, -16, -7, 2, 7, -14, 18, -2, 17, 22, -9, -5, 4, -10, 15, 34, 24, -8, -23, 6, -7, 17, 4, -4, -14, 9, -25, -6, -3, -15, -23, -17, 8, 26, 14, -9, -12, 17, 12, -4, -9, -19, 0, 4, -20, 1, -6, -5, -12, 23, 8, -6, -17, -14, 15, 2, -1, -15, -2, -14, 7, -16, 20, 8, -19, -23, -4, -19, -1, -34, -37, -11, 9, 13, -6, -16, -29, 3, 21, -3, -17, 2, -17, 20, 21, 5, -29, -4, 11, 13, -5, 26, -23, 9, 10, 26, -28, 18, -29, 19, 25, -12, 15, 16, -9, 12, -5, -20, 21, 18, -3, -21, 23, 10, 1, -15, -26, 17, -4, 8, 6, 7, -12, -11, -28, 7, -28, -19, -12, 14, 3, -3, 15, -15, -17, -8, 18, 13, -3, -13, -2, 16, 23, -5, -5, -15]
4471a5J6%j1OLjj9K9K1n9JK5J1J3l3nJ1qJ2klpNL3k2K1l9OL9l0mJ1j3QpL0mqm
4510GLnJ0qj2jRpj8K2J5j3lM4l1K3m5qKNL5j7J1mlj0J7k8K6m0K9Okqk7JM0rk0
4549a4j6J5kM0j7j4LPKjj4K4j3rnKJ8n6O2rk6K3Jj5L2oj0J1k4J8qnK0rMjmoJ1
4588INj6J0j7L3j1Ml3J5MRk5j9K9J0j6K5l4L0j8j6L1j0Pl0nPK8k0Mj4K4LK8j1
4623B0k0mpK5j5J2j6jrK5J1k7Jj1J5J1j1nJ0Lk2K1Lj4J1rj2J2J1mJ4m3M9k9qK1
4659Hj9L6j5Pj0k0NK2k0K4k9Jk2J9QJ8qlJ0k3J8kk4%J2J9Rj4jj7JRQk2lK0Jk6
4697b3J9Ol1LK4J0k1K5j0j0NoJ0jj9M3j4k5kLM2l0J3prJ6J9j5j9j0J6ok1J8J5
4732H%l2J8k2N3l5J4k9M0Qm0J3JJ0j1j9M0j5J0%lMk1JMj5K3%k0J3oMOPj7K2j9
$$ y = [-15, 1, 1, -10, -4, -1, -2, -21, 8, 29, -30, -29, -4, 7, 20, -13, -18, -7, -15, -3, -5, -8, -15, -10, 23, 1, 22, -17, -11, 28, -2, -6, 5, -8, 0, -7, 23, 19, 11, 7, 10, 5, 15, 7, -5, -6, 3, -4, -22, 0, 15, 2, -1, 43, 12, 35, -10, -18, -16, -11, 24, 7, 18, 14, 11, 1, 18, -10, 16, -24, 5, 11, 9, 1, -26, -25, 15, 6, -14, -30, -15, -17, 23, 6, -8, -5, 2, 4, 3, -11, 13, 0, -9, -14, -12, 6, -50, 12, 3, -23, 0, 1, -14, 18, 12, 2, 13, -11, 7, -1, -6, 14, 5, 9, 8, 4, -2, 9, 14, -2, 8, -9, 24, 13, 17, -16, -1, 3, 12, -13, -32, -3, 7, -9, 16, -18, 12, -6, -22, 9, -1, 6, -24, -29, -22, 6, -14, -10, -24, 0, 3, 31, 20, 0, -4, -11, 14, -1, 11, -5, -6, -15, 10, 21, -6, -5, -16, -1, 10, -1, -6, 4, 7, -15, 6, 9, -5, 6, -3, -15, -3, 8, 4, 18, -25, 24, -5, -13, 8, -11, 25, 10, 17, 7, -13, -8, 14, -6, 18, -11, -10, -32, -13, -5, 13, 5, 2, 12, -11, 7, 5, -19, -19, -7, 12, 21, 7, 6, -11, -10, -1, 7, -15, -18, 2, 3, -23, -4, 2, -29, -26, -2, 8, -13, 12, 2, -8, -3, -9, 1, 0, -19, 24, 10, -15, -17, -14, 28, -2, 11, 4, -5, 11, 30, 15, -4, -14, 2, -4, -25, -7, 8, 8, -24, -6, -28, 25, -10, 4, -25, 15, 23, -17, -4, -3, 7, -4, -23, 17, 2, 12, 12, 9, 13, -8, -7, -3, -18, 5, 5, -15, -2, -8, -4, 2, 9, -8, 14, -5]
4769e%kJ0j2J4j3mJ4j2J6k4J6J4rRl1QJNK2l2JPK8kmrj3QOnJLk2KLK9k0nJ5Ml3
4811b1J0jkoL7Kj8j6J0k0J2L3m2PK5l1K5Pk0J8k4J6mL8k6rj9J5J6k5J9l4K3k8
4845c3L7Ml6J9lMJ4%knj2LLoj5j1K2J5j1J3K4j1nj3J7j6k4M1j5j2j1M1k4%J8J2
4881B2Mn0KrK7J5j6J2j8K4j3l2M2j5k5L2LrMJJ1lk3K7j3koJ3j3J5j3j5K2Q%l9
4917c0N2o5K5KoL2nQk0J0OK6l9k2J3nJ4qj1NJ4j9J6jJ4J2m9Nj5N7J0l1Nk4J1K4
4953A1j2%lKQJ4l0j0N3l4Oqj2NnK2J3l7RJ2k2Rj3MJ1J4l1MMK7k7LOL9k3Mj9NJ3
4992A2l6J3LlLnL3k2K9m0J6K8l2Nl3K6JrJOj5L2k3jJ9mj5Mk3L1k0L9k8oqK5j2
5029ij0L8l4J1J8j3J5m1J2j2K9kk5J9qPJ8j7JQlOJ0l5JJ7k3J9pj2K6kj3K5ll7
$$ y = [-5, -5, -7, 3, -9, 5, -8, -12, 2, -10, 6, -18, -2, 12, 3, 12, -19, -11, -10, -5, 17, -15, -14, -7, 21, 19, 15, 6, -7, 1, 7, 2, 3, 6, -16, -14, -11, 18, -2, -7, 8, 12, -21, -11, -12, -14, -20, 17, 19, 1, -15, -5, -25, -13, 20, -22, -15, 10, -21, 4, 11, -9, 9, -15, 1, -3, 35, 9, 0, -19, -4, 12, -13, 6, -28, -5, -33, 4, 8, -28, -9, -12, -8, 6, 6, 4, -1, -13, -10, -7, -13, -28, -39, -17, -2, -13, 0, 24, 13, 8, -5, 12, -4, -28, 13, -2, -14, -25, 16, -8, -8, 10, 22, 26, -24, -22, -31, -4, 11, -5, 7, -11, 13, 0, -32, 10, -5, -30, 2, 5, -4, 0, 1, 12, 9, -14, 13, 0, -2, -8, 5, -8, 7, -6, -21, 1, 9, 9, -30, 22, -43, -18, -16, -22, 10, 5, 13, -7, 3, 9, 35, -4, -26, -13, -18, -4, -12, -23, -18, -4, -23, -7, -8, 6, 18, -31, -26, -41, 16, 26, -5, 0, -24, -13, 11, -1, -1, -4, -2, 6, 20, -10, -20, 33, -1, 5, -3, -15, -10, -15, 7, 20, -17, -8, 4, -18, -9, -22, -18, -7, 7, -24, -20, -16, 11, -16, -13, -7, 32, 9, 13, -6, -1, 12, -24, -11, -8, -11, -8, -13, 20, -2, 27, -13, 3, 31, -1, 4, -29, -3, -2, -11, -10, -4, -19, 13, -10, -11, 8, 4, -11, -7, -30, 1, -19, 20, -8, -14, -22, 3, -9, -19, 19, -15, -4, 14, 1, 16, -25, -13, -25, 4, 2, -23, -4, -12, -5, 13, -4, -3, 5, 2, 8, 18, -17, -16, 1, -22, -3, -10, -22, 4, 2, -11, 14, 11, -26]
5065b6K1K0k7MJ6j4M%Pj2L5j2k6NmLloJ3L3o1PJ8jRpJJ2j5j1MNK1k2qK3j4Nj8
5104b1Nj4K1j4LrQOK9j9KlkJ2qJ7Nj2k0nJ4Qoj6L2Ok8LJKLnJ0j7j0K8k6jL1j6
5144fkK1j7JmrOJ0Pl8L2Qk3J9pJ3j2J2l3J8RmK7nJj8j6J0jNj5PJmK3J2l4j2L3
5183A5kl5K5Ml7M5n2K4lJ5koJ5J0nKm5J4j1K3j0j0J4L7j9Nrl6N8m5K1j8K1k5K4
5218B%mpJ1lJ4k0pJ6RrQk4K4j5QnJ0jmJ0j7Oj1J7K9j7Kk5MnJ0lj4K1j3LJ2j4q
5258a0J0j3k1K7jJ4j2NjnJ0J1J7l0qK1Pj4k1J1rK9mqJ3l8K0Mqj1J2nnJ1j9QLL8
5296B8k5k4K6k8OJ3K2l5JJ1JmrJ5PJ4k5%JloK1Ok1j3QPmjJ0J0k4J2j7J7jK2ll2
5335a7J4j1j2jK9LqlmJ4oJ2qNk6J2qnJ2j8N4k2jrk8K5J2oK5j3KopjK0j6%Mk4J7
$$ y = [-26, -5, 15, -12, -8, 8, -6, -2, -2, 5, -7, 28, 16, -10, -5, -9, -6, -9, -15, -2, 31, -30, -23, -5, -6, 3, -4, -3, 9, -6, -17, -13, -8, 13, -9, -17, 6, -8, -3, -21, -16, -30, -9, -23, -20, -29, -21, -15, 14, -5, -3, -6, -8, 4, -4, 13, 18, 6, -14, -19, -5, 3, -3, -19, 13, 19, -9, -6, -5, -3, 0, -5, 5, -12, -22, 6, -20, -21, 10, -6, -8, 13, -4, -3, -7, -16, -10, 0, 7, -31, 1, 9, -14, 5, -2, 11, -1, 11, -22, -4, 5, 1, 28, 23, 24, 6, -10, 0, -1, 4, -11, -4, -3, -7, 16, 28, -6, -18, 15, 13, -22, 3, 7, -30, 15, -37, -13, -16, -1, -3, -9, 6, 16, 11, 13, -32, -18, -29, -6, -16, -26, -12, 25, 6, 11, 2, -34, 24, -21, 0, -18, 3, -22, 2, 2, -2, -9, 2, -1, 13, -7, -14, 2, 11, 2, 10, -14, 10, -5, 3, -2, 8, 7, 3, 13, -4, 2, -9, 8, 37, 20, 22, -3, 1, -4, 6, 3, -11, 10, -3, 0, 12, -2, -10, 0, -13, -34, -7, -8, 6, -6, -1, -2, -7, 3, 14, 31, 1, -7, 14, 21, 7, -14, -3, -12, 17, 13, 5, 18, -20, 0, 4, -4, -15, -3, -8, -13, -2, -21, -13, -10, 28, 3, -21, 5, -23, -17, -4, 18, -17, -16, -5, -4, -8, -17, -2, 5, 19, -6, -6, -5, -8, -14, 7, 13, -8, -21, -13, -6, -10, -11, -1, 9, -15, -3, -20, -3, -4, 18, 15, -17, -3, -14, -26, -27, 2, 5, -3, -6, -10, 4, -2, 10, 2, 7, -19, -7, -15, -20, -8, -26, 28, 6, 5, -4, -32, -7, 5, -1, 24, 11, 13, 7, 0, -1, 19, 3, 3, 7, -17, 0]
5375@j0L2j7rJ5qj0K9j4j2k6L0JkQPNj3l1M2j9Ok6j1K3J2jKPk5jJ8qj1omK0J9
5413A2j0J0k9mLjOnK5j4K5j5OMk5j4K9nj6L0j6JJ2J5Kl0K2ok7J2j1J9j8j6K3L
5449clPM2n1J2j9K4ml4L9oKk1%oK1jNroJ9j4L1k0k0OlL5k4qLJ1k1NJ0J1J1k3j0
5488a2J6nj3NRMmj5Pj5N5k9pJ8j1%rPjQRMk4j0L3j6oJ3l0j3K1L2k6J3k0K1l7L1
5526CKk5K4j7J0ljmpM1l1K0j7oNj8L4MJj9Ql7M3j9nJ3l5RjL6k0J1K0j7oj6L7j7
5564@j2J2j4L5m2L3kj2kJ0kk9L7l5M9m4PN2m5Qj5J2mk3K0Nj0oK5pmk6PMRnRJ9
5602A4l0K0k5ORKKk2L1J5k1j7kJ1K2k1OLK1j7Rkk2RK0j7lmL4k1%j9K0j3j5K7j9
5639ij2J8J5k1jj2j0L3j5j2K0j3K6k7%K2n1L8nqL3j6K0jk3rNnJJ0Jmj3L2K3j6
$$ y = [0, -10, 22, 5, -4, 11, 3, -7, 22, 8, -4, -30, 0, 1, -1, 7, 14, 19, 6, -25, 17, -2, 4, -22, -33, -10, 2, 1, 3, 10, -15, -16, 2, -6, -17, -23, -27, -7, 12, 2, 12, -17, -21, -18, -19, -13, -18, 7, -7, 18, 3, 9, 13, -12, -26, 3, -2, -18, 12, -4, -3, 9, 24, 26, -4, 18, 12, -15, -3, -14, 5, -13, -29, -6, -3, -6, 1, 43, -8, 4, -15, 9, 5, -29, 10, 4, 6, -15, -15, -21, 0, -1, 4, -5, -11, 8, -6, 25, 5, -15, -9, -12, 23, -1, -9, -6, 5, -16, -11, -1, 10, 21, -2, -12, 4, -1, -14, -9, 0, 4, 0, -15, -8, -23, 32, 3, -4, 14, 3, 3, -6, 1, 0, 8, 17, 21, -3, -13, 20, 4, -2, 11, -19, -32, -11, 21, -5, 8, -12, 9, -28, 3, 5, -20, 4, -13, -3, -6, -7, -11, -18, 23, -8, 12, -5, -11, -6, -24, 10, 14, 15, -4, 4, -33, 10, -9, -14, -1, -36, -27, -28, 8, -12, -1, 19, 2, -4, -20, 17, 0, -12, 0, -14, 21, -21, 12, 10, -2, -4, 6, 4, -25, 12, -23, 26, -18, -11, 41, -4, 4, -11, 1, -3, -26, -6, -1, -11, -17, 8, 1, -3, -29, -22, -18, -9, -14, -5, 14, -16, 4, -21, -15, -6, -4, -2, -24, 7, 22, 1, -16, -18, -7, 15, -6, 0, 3, 24, 7, 16, 14, -8, 1, 21, 4, 1, -3, 31, 10, 10, -9, 11, -2, -17, 10, -9, -21, -3, 12, -9, -10, -22, -32, 1, -14, -26, -6, -19, 7, -20, -20, 2, -49, -11, -16, -24, 9, -7, 13, 12, -11, -20, -15, -20, -19, -9, -8, -12, -25, 7, 30, 14]
5675A4k6JOnLonJ8k1J5lpK8n2N8j4%k0L8rJk7K2nK3k2jJ4pLk9M2k5J4j6L2l6r
5713a3L7k2K2k3Pnl8K4J7Lj9J4j0k4M0l5K0j4L3qj8Qj4J4K1rPok1K6k3L3k4rJ4
5748E%Pjj1nK7k6kNnL0l2Qk3J3J6j6J0LJpJ7j6Kj4OJ0plKK7j6j0J3%j6LRlj2P
5789dOMk4M5l2rpJ3J3lJ7lmMj3rJ5nkOj4KRj5J1oJ1qK3l2J7J6k3J6K2n9J8mk9
5828c7L4J7pj3J0Pj5%NK4k7Oj6J1RJ6j9k1K3k9K7jl5L4pO%j1mK1LJ2l2j3mK2L
5865aK4j8pmjKPQln%Kj1JJnj5L3j3Rj5J3Rj0J7k4KJ3j4M2m8JM4o8P3n8K2Lmlj3
5906a4Lj4J0RK3k2mJ2Moj1J0Nk4J8Mj2k4J9jPQppJ0J3j4jJ8qj0K8l5J5oK0j9j3
5944a6J0K0Pj8ooQk0N2l0KK5l3PqNj2K4l7qJ5K4k8LL8qj9J3lOjlJ4mj8r%J6j4
$$ y = [14, -12, -11, -5, -10, -7, -13, -18, 0, -21, -6, -9, -16, 12, -40, 18, 4, 4, -16, 22, 13, 14, -13, 9, 4, 27, 5, 4, 18, 11, 14, -15, 27, 2, 16, 0, 32, -4, -13, 24, 2, 24, 1, 8, 3, -35, -11, 6, 9, -10, 4, -6, -30, 10, -25, -5, -19, 14, 6, -12, -4, -18, -4, 17, 8, 15, 9, -12, 14, -9, 24, 0, -9, 5, 5, 12, 11, 0, -5, 22, -4, -6, -1, -6, 24, -8, 0, -23, -10, 6, -10, 0, 3, 4, -3, 14, -2, 0, -14, -8, 2, -5, -8, -6, 21, 5, -5, 8, 8, -8, -5, 4, 1, -11, -4, 2, 6, -18, 27, -5, -14, -21, -8, 5, 2, 19, 16, 12, 16, 3, -6, 9, 4, 2, 8, -6, -4, 5, -10, 1, -5, 6, -2, 21, -11, 6, 22, -1, 15, 37, -22, -4, -8, -37, -3, 14, 7, -6, 4, 11, -4, -4, 1, 25, -2, 4, -12, -1, 8, 24, 5, -16, 7, -22, 5, 4, -31, 3, -4, 2, 2, -9, -13, 8, 11, 23, -9, -22, -26, -4, -1, 23, 5, -2, -6, -7, -5, 2, 10, 7, 2, 2, 4, -7, -6, -5, -10, -25, 8, -5, 4, -11, 2, 11, 1, 18, -6, -4, 9, -5, 37, -11, -10, 34, -34, 39, -19, 3, 6, 2, -1, -14, -11, -25, -15, -6, 17, -5, -9, 3, 7, 1, -10, 0, 5, -19, -1, 3, -9, -33, -14, -15, -8, 0, -7, -14, -4, 9, -5, -6, 12, 4, -6, 22, -13, 2, -4, 16, -3, -16, -6, 14, 21, 3, -3, -9, -1, -21, 31, 1, 3, 28, -5, 2, -6, -1, -13, 11, -26, -34, -19, 5, -23, -20, 18, 10, -9, 4, 1, 7, 6, 3, 17, 13, -5, -14, -14, 2, -12]
5983a2NPj4j5M8j0j%qj5J4j6K6K7l1J2j4J3k7lmK8%Nk6L4ok2J9Lqj5J2rQj7Km
6021a4j1L5Nj2Jk7OL8j2J9k6nj2oK2j6K5k6Qj1M1n0L0j1k6M8j2oj2J8J0J3k7K4
6055B1k8PJ3k0KNnK2l5J7NOj1J2nLml5M7j9j4M2nj9j8J0K8k3QJ0j9Oj8J2jj2J
6092a4J8J%j0RKk2K4Om1J4K6k0J3rj2Pk6K1LlroJ4NJL0k3%J1k1J9kj8k4L2PJ1
6130A4%J0l1J4noL%QmQk3lL2j9Lj5K0J2rk7K0k4kRlOJ1oJ6k4mJ2K8l1J8Rj6J3
6169A4l0oK3%k4J1OJ7l1RJ6l4J3jK9l1K8k8qRL0n0L3J5qJ8j6j8oK8K2k3j7PMJ5
6205A6k6JlKj9L5r%mRPpj4K6k7J4J2J7l0kq%k0L8l4PMkL5k5Ol0J8pJ2mNJ8j2l
6245dpL7j0l7JL9n1M1j7NlLJ6j8j3NK2Kk5LP%J3j2j0rL2l3J7j1J8k5K2j7K0L9
$$ y = [-12, -7, 0, -14, -29, 19, 9, 8, 8, 0, -15, -1, -17, 9, 36, 5, 17, 3, 16, -11, -14, -18, 10, 10, 15, -11, 23, 17, -5, 14, 17, 9, -6, 6, -3, 5, -12, -10, -14, -25, 10, 15, 3, 4, -23, -17, 21, 9, 28, 2, -3, -15, -21, 1, -15, 10, -16, -8, -19, 22, -28, 2, -9, -35, 13, 1, -5, -17, 1, 11, 24, -3, 21, -7, 0, 13, -7, -5, 0, -5, 17, -18, -1, 4, 10, -1, 11, 6, 9, 5, -30, 17, -2, -16, 26, 21, 2, -16, -6, 22, -1, 7, 17, -2, 4, -14, -2, -3, -15, -14, 4, 5, 5, -5, 4, 6, -16, 8, 14, -27, -13, 13, -7, 6, -3, -15, -8, -34, -13, -10, -13, -22, -28, -14, -9, -8, 22, -1, -1, 10, -11, 8, 6, -12, -36, -4, 3, 14, 14, 24, -7, 7, 2, -4, -1, -1, 7, 3, 11, -12, -15, 17, -2, 1, -14, 6, 18, 9, -18, 2, -22, -24, -15, -18, -12, -1, -7, 9, -15, -19, -7, 21, -10, 8, 17, 1, 14, -16, -22, 1, 1, -23, -12, -6, 11, -20, -11, 5, -29, -16, -17, 12, -19, 9, -19, -27, -18, 12, -38, -5, 10, 2, 20, 4, -14, -20, 8, 30, 7, -10, -3, 1, 16, -10, -9, -12, -10, -29, 6, -3, -3, -7, 2, 9, 2, -12, 14, -13, 1, 13, 30, 0, -2, -10, -10, -30, 8, -26, -19, -15, -17, 18, -7, -1, -31, -13, -20, -8, -12, -7, 11, -1, -4, -11, 26, 16, -21, -20, 19, -32, 9, -8, -3, -6, -3, 13, -5, -18, -13, 9, 11, -14, -11, -4, -4, 9, -3, -13, -22, 10, -23, -6, -17, 1, -24, -2, -19, 1, 40]
6281D0l9j0J1jQrj8QJQRk9M7k1Kk3J5K9j6j6Mk1pL9%J7k5kj8RmJ3k3J0OJNj6M
6320a2jQK0ppMj3J9Llk5j4K2J6%j8PMLJLk4%jJ8Rl2J2J3Jj3j2K5k5L9n3K4MOR
6360A0k1j3J8K0l5J6JONj6RMl1M7j1nJ2m6k2K0JJ9LJ4K7m0nNMK4l5PL0l1k4M3
6396A0k4J7l3M1j1k6J9LJ4l9M3k7L1Nk1%Pj3J6PQj7j3J6j1l7L6J2l9O4n2J3K8
6429B7k5J3Ll8%L1j8J5j1L4j0%J%k4rLkoJ2J8l5J4K4J0l7Qrj2L4k1Kqj0N2k3J
6466Dj3Mk2L5j7K2k3J4j2J9j0j9NJ1J8k7K0j1j2LJ0Kk2J6j8M2j3j7NrJ5QJ6k0
6500DkLojjQj6j0LJ9k0%J8Qjj1K9m3K3qnK8n4K2L9l5k9K5qJ3l0K9ojJ4j8K2l3
6538c1j1L2oJ0Rrlj7K7k7J9LnL9j2k7j8L0mJ2k2NrNJ1J5j5Rl7K2K1m1J5mK1k1
$$ y = [40, 1, -9, 2, 1, 9, 0, -18, -10, -9, -1, 8, -21, 26, 5, 7, -16, -1, 28, 12, -4, 0, -21, -28, 11, 11, 28, 3, 1, -17, -8, -12, 1, -22, -12, -6, -5, 0, -16, -12, -13, -5, 15, 8, 1, 5, -8, 11, 14, 11, -14, -28, -6, 10, 10, -8, -1, 3, 6, 7, 10, -14, -14, -15, 3, 12, -20, -8, 5, 6, -7, -19, 6, -19, 20, -33, -9, -5, 1, 10, -11, -24, -6, 14, -21, -5, -4, 2, 7, -9, 0, 4, -27, 20, 9, 4, 16, -30, -52, -32, -31, -12, -9, 5, 32, -8, -13, -8, -4, 20, -15, -8, 22, -9, -33, 10, -14, 3, -30, 11, 0, -26, -7, -4, 10, -29, 14, -13, 18, 23, 2, 2, 9, -4, 12, 19, 27, 10, -3, 13, 2, -35, 1, 13, -26, 38, -14, -1, 27, 2, 15, 18, -20, -20, 11, -7, 8, -3, 31, 21, 21, 22, 22, -2, -11, -8, -10, -16, -4, 14, -21, -7, 17, 27, -10, -2, -11, -23, 11, -10, -8, -16, -26, 26, 3, 4, -9, -5, -27, 8, -9, 13, -10, 4, -8, 11, 1, -18, -13, -2, 16, -11, 9, -2, -14, -11, -1, 1, -21, -5, -23, 19, 6, -11, -6, -15, 0, 8, 24, 4, 2, 5, -1, -2, -3, 5, -11, -21, -18, 1, -19, -19, -1, 7, 6, -5, 24, -19, 4, -4, -9, 19, -35, -13, 26, -9, -38, -13, -21, -8, -38, -9, -15, -16, -2, -20, 2, -31, -42, -10, -16, -6, 3, -6, -9, -26, 1, -26, -7, -4, -9, 30, 18, -9, -27, 3, -1, 11, -11, -6, -15, -10, 1, 16, 1, 10, -27, -5, 16, -25, -10, -14, 7, -14]
6574a4L1k5j5J3j6J7J0KPk2LJ8rj3nK2j0j6L1kPjpJ0j4JJ5j3j0K3n0K6J7%j8O
6610aQOj1Pl8J4K8j2jmK1Jj5O%j2J0loomNJ0nj0K6l0J7Qjk2j2M6l8J1nK3rqj0
6650a6J4j1K7k9J7j4Qk0ROj2K9qj9OLPPkqJ6nk4L3kj5J0ol8L0Lk1K8pnk4M3k8
6688a8LL6l4kQJ5l0L2j4j5PJ7oK8l5PoJ6pj6K1%Lnj5J3j4K5k1pM3k9K8j8oKJ8
6725B4l3KjmL0j4%j1J0qJ1j9k4M1j5JK0l6K1J3mnpJ3qOk5K9J9j4j9J6k6NJ2Kj5
6762a3J0opK4%loRk2J7njJ2k6K3k0K6j4lL3l7%K2j9J6p%j8J9KllRqnJ5Ml0J2P
6802DJk9J0k0L6Jj0J7m6K1kQnMpJ1J2k8J1rL0Jpk3oK9lJ2qqj9J4J9k3RK2nJmj0
6842Ak5L5j0j1J6j6LPqQj5PK1j2JOnk5j0L1J3j1M2m9J6Jj9K3l7MJ3K1k4K3RKn4
$$ y = [-14, 17, -8, -23, -10, -26, -9, 1, 3, 10, -12, -9, 9, 0, -13, -18, 4, -6, -22, 9, 7, 14, 13, 6, 16, 2, 3, 18, 5, -5, 18, -32, -6, 11, 11, -7, -1, 7, 13, 2, 9, -29, -15, 13, 1, 0, -4, 17, 18, 3, 9, 9, -3, 7, 4, -2, -8, -12, -7, 3, -2, -12, 14, -16, 1, 9, 8, -14, -26, 20, -18, -7, -12, 11, 2, -6, -16, -2, -13, 14, -15, 2, -12, -4, -24, -15, -9, -21, 8, 0, -19, -13, -10, -3, 4, 2, -6, 10, 5, -19, 14, 12, -3, 7, 1, -37, -7, -4, -25, 3, -4, -9, -33, 10, -18, -15, 21, -13, -15, -7, 8, -22, 10, -4, -19, -12, 5, -1, 27, -8, -1, -7, 9, 2, -14, 7, 7, 10, 5, -10, 3, -11, 14, -7, -14, 29, 0, 28, 10, 4, 6, 24, -9, -7, -8, -12, 18, 4, 4, -7, 3, -5, 6, -13, -37, 4, -11, -10, 10, -26, -5, 8, 4, -1, -8, 5, -3, 3, -22, 7, 26, 12, -7, 9, -17, -12, 0, 2, -13, -3, -9, -16, 8, 8, 5, -1, 8, -14, 3, -2, -3, 9, -17, 6, -14, 12, -2, -5, 28, -9, -9, 13, -6, 10, 3, 3, -15, 4, 6, 3, 0, 9, 1, -4, 11, 15, -15, -3, 4, 5, -24, -14, -34, 2, 3, -7, 10, -36, -15, -17, -9, -14, -10, -17, -6, 6, -22, -11, -20, 10, 11, 4, -19, -25, 4, 1, 13, 5, -3, -22, -8, 11, -12, -3, 19, 14, 15, 11, 1, -24, 11, 1, -10, 6, -10, -7, 0, -8, 0, -15, -8, 13, 1, 2, 8, 3, -22, -32, -1, 12, 1, 43, -6, 10, 11, -8, 15, -22, -18, -5, 16, -8, 15, 24, 26, -28]
6879b8L3k0JJ7k1QppK6k9J4J3J6k0OlMk9QK1j8J2j2j1L3J5j8kMQNk2JlJ2J6n7
6916c4M7k5NmJ1J4k4KnK2kl3J8J6Opl1jK3K1l2%KM2n5PNnK5Ork6J2J4Jj9L1k8
6954a0k7M5qMk2K3jK4k5JOk4L2l4K0rNj2LJ0m1L7J6mk2Oj7K9qk2K4lmj6K2Kj6
6991a6J1k3M1j0j8k0M9pL2n5J8Mj1MkK7l8J8j2j4L7jj8j0k5L9kLk6N%K4j7j2K9
7026Dj1pRLJ1j2l1M3j9J8m7O0l5K5j5nJ3Kj5LJ5j0mRpkj9K7Lolk8L6rJ8m5L6k2
7064a7J2ok5K6K6j4J0l5lL5oj5KLJ2j5Rl1J8rK1Mj3K5j6L4k2Jk7K7Mkl3JK7m7
7100c9L1jJ0k9L0j6%K1j0mJ0J0l3M7pl1L3k1K3k2jPk2nJ6jk7M6j8j5RNk1L1j5
7135iJ8Rrj5%J9j3jJ4k1J9k5KlJ9rkLRk4L3Lk7J6Rl2mj0L4koPL0l7Lj2K2jK0l2
$$ y = [-28, 5, -15, -14, 3, -18, -10, -17, -24, 2, -27, -13, 0, 16, -4, 2, -1, 3, -26, -18, 3, -15, -3, -15, -26, 7, 22, 4, 2, 6, 14, 19, -3, -2, -5, 7, 23, -34, 13, -12, -7, -11, 0, 14, -10, -8, -13, 9, 7, -26, -8, 8, 14, 7, -24, -25, -2, 19, -13, -13, -11, 31, -24, -17, -12, -17, 8, 14, 5, -21, -9, 5, 6, -13, 18, -10, -37, 8, 0, 4, -18, 5, 4, 28, 3, 4, 10, -14, 18, -16, 4, -5, 0, -12, -9, 1, -40, -3, 13, 9, -13, -7, -24, 5, -3, -25, -1, -4, -8, -24, -2, 0, -16, -5, -28, 13, 3, -15, -35, 14, 7, 39, -16, 2, 6, -5, -1, -3, 24, -14, 4, -8, -22, 15, 14, -4, -14, -39, 0, -2, 1, -25, -20, -20, 4, -13, -25, 4, -7, -14, -5, -2, 9, -3, -34, 9, -10, 8, -39, 21, -14, 11, -4, -9, 4, 6, -9, -6, 9, -1, -5, 4, -3, -5, -24, 3, 6, 0, -3, -31, 5, -4, 14, -31, 5, -17, -5, -11, -36, -10, 16, 2, 12, -23, -26, 9, 3, -12, -10, -7, 5, -10, -1, -32, -14, -23, -2, 2, -11, 14, -2, 32, 10, 11, -16, 11, 15, 13, -20, -19, 8, -39, -8, -9, 1, -28, 2, -14, -14, 7, -3, -7, 3, 13, -20, 27, 20, -11, 22, 1, 24, 2, 1, 8, -14, -19, -3, -4, -31, 15, -3, -18, -9, -4, -25, 6, -9, 9, 18, 9, -6, -6, 13, 0, -1, 13, -8, 11, -14, -12, -15, 4, -5, -7, -4, 5, -19, 14, 17, -10, 6, 15, -17, -21, -31, 3, 1, -5, 2, 32, -5, -2, -14, 8, 7, 27, -5]
7175eJ5Ok5qJ4MJ3k3k9L6j4L7l1J6k7K2j1j5L5j5mmRK9k1k3qK1J2k4RK9j6J2J0
7210B6l4J5j2J9jJ1l7NMJ1QJ2k5k5pL3RJ3l0j1kK4KKml5L1j2J9j5J5K4j6l2K0
7245Ejj5K1j4RqK0pqJJ8l4NK3k1J6k9L0j8J%J9pl3J5J4K0l4K5j1oJ1rorK9l5J8
7283ej7L1nOj1K3m0K6mJj2K2j4QpKJ1j0Kk0QJ4k6J8%J4j7nJ8NJ8m3pRrK6l9K5
7321dJ0k7L3%l5K9oL0l8j8M4k3KrNJ0Pj1PmJ4j8j1pj5K5RQqK3k6k0K7mnJqnL0
7360A2nk0PmJ2K3j2PqkqRj0K3k5JJ1j6LK3lj4lpJ8Nj5j7K9k7J1j7J0L0jj1j1M
7398BrrJ3lj9NK3j1j0K8n%Lj2Pj7K0j6J3Kk1J1Pj2J2j0K0oJj3QmK4m3K0%j0J8
7436Gk9QK3j0PlnJ1Nj6M7l5j3Nk3K1kjjK3j9kK6k3PJOk8K2K2l5lK5j8%Jl5ONN
$$ y = [-5, 10, 16, -9, -17, -3, 1, 14, -9, -38, -2, -16, 21, -10, 6, -21, 1, -10, -25, 10, -5, -9, -13, -4, 25, 4, -19, -27, -6, 6, -18, -9, 20, 4, 16, 26, -8, 7, -5, 14, 13, 24, -13, -8, -4, 7, 15, 27, 2, -23, -30, 3, 12, 25, -5, -16, -18, 6, 8, 10, 6, -29, 2, -10, 9, -6, 9, 33, 17, -15, 5, 4, -11, 10, -4, 5, -3, 17, 10, 2, 3, 21, -13, -8, 15, -6, 10, -19, 11, -7, -6, -6, 13, 6, -27, -12, 2, 22, -12, 13, 2, -4, 7, -2, -8, -17, 12, -23, -5, -22, 9, 4, 10, -1, 22, -18, 8, 4, 5, -7, 15, 1, 9, 2, 4, 15, 5, 7, -13, -5, 9, -17, 1, 1, 15, -2, -7, 11, 16, 34, -9, -16, -7, -16, 10, -29, -4, 6, -21, 12, 12, -23, 6, 0, 30, -8, -26, 18, -5, -3, -12, -7, 3, 10, -1, 6, 2, 16, -2, -13, -20, -35, -10, -1, 7, -1, 22, -4, -24, 3, -1, -6, -5, -13, -18, 12, 7, -13, -6, -10, 2, 25, 13, 20, 12, 10, 2, 11, 1, 24, -1, 0, 11, -5, -2, 21, 18, 4, 1, -6, 12, 17, 2, -15, 14, -13, -2, -19, -9, 21, 20, 9, -2, 2, -7, -16, -3, -6, -25, -20, 3, -8, -18, 10, 5, 5, 8, -4, 3, -14, 6, -10, 3, 5, -16, -5, 2, -10, 2, -8, 12, 6, 7, -6, 2, -2, 22, -21, -1, -1, -11, 7, -22, -14, 9, -1, 6, 3, -2, 9, 14, -2, 45, 10, -3, 2, -21, 0, -2, -3, -4, 19, 0, -2, 24, 1, 8, 9, 15, -13, 9, 31, -4, -7, 18, 0, 0, 1, -34, -28, -23, -18]
7476a8J8k1nM5m1J8j8J2J8qj4JRkK3Lj9K3l3nKj5M9onk3QMj6J4k1J2j6K9Oj9%
7513a1J1Kj0Rj8%J2k6L6Lk7J6%PJ9l3pJ2K0j6j6J7kPRjk6k2P2k5m7M1l4N0qj8
7549dK4j0k4J0Qm6N7kLk8J9oJ0j4j5J0J0j7J5j4J4j4QJ6j0nJ9k1PJ3l0OK5J2j4
7584A2j5j2RL2l0qJ2JJ2Qk1J2j1J7j4j0J1prJ2ljK0m1L0Lm%J6k3J4k3J0MRk3L0
7621A9j7j6J8pj3lJ0L0l0KK0l5K9J2k3j4K8JJ3m7J5j7M3j3kJ5l0J2kjJl1K3J8
7655HNk5LkPJ4j9LOj8J7kj3L2Jj5mrK2j0j2qJ1LJ3l3lJ5K0rj6J7L0m7jJRnPMj1
7696a4kj4KO1j9j5Q%mLk4J9j3K9k0qK4j2qK1j8%oK7l7kK1Jj0K2j4QnJ3j6jlKj
7735ej5J2J1rOj6rnN3k6J8mj2RLk0J8rJ4k4J7Lkk0NLJ7k4J2J1kmqrJ2k1J1oL6
$$ y = [-18, 0, -21, -26, 19, -22, -4, -22, -10, 8, 0, -14, -13, -4, -6, 17, 20, 1, 24, -9, -14, -12, -27, 22, 16, 11, -12, -4, 0, -16, -2, -23, -11, -27, 2, 8, -11, -11, 0, 2, -8, 1, -17, -17, -5, -31, 5, 8, -19, -3, -3, 4, 23, -10, -17, -5, 15, -1, -17, 0, -2, 5, 14, 13, -13, -35, 37, 12, -35, 6, -28, 22, 14, -4, 20, 10, -14, -4, 4, -42, 15, 13, 16, -12, 7, 1, 11, -3, -18, -8, 2, -15, 0, -14, 0, -14, -6, 10, 0, -5, 14, -7, 0, 13, -17, -11, 14, 26, 12, -3, -15, -6, 26, -4, -12, 0, 1, 13, 21, 0, 12, 1, 18, 4, -6, 5, -2, -11, 1, -2, -3, 17, -24, 6, 9, 5, 5, 21, -2, 12, -11, -1, 3, 12, -11, 19, 2, -14, 4, -3, -16, -19, -9, 21, -9, -7, 13, -22, 7, 19, -4, -18, 10, 11, 24, -23, -8, -25, 18, 5, 3, 18, -12, 0, -2, -3, -2, -33, -10, 8, 13, -12, -9, -11, -4, 10, -9, -6, 0, -18, -1, -3, -16, 16, 17, 2, -2, -11, 11, 1, -11, -19, -8, -5, 8, -25, -28, -13, 7, -2, -18, -1, 29, -18, -19, -18, -9, -14, -7, -3, -14, -16, -30, -28, 33, 14, -1, 7, 7, 3, 6, -18, 1, -12, 17, -3, -11, 13, 1, -7, 14, -4, -4, -10, 17, -20, -22, -1, 0, -10, 12, -2, 6, 1, 14, -2, -3, -6, -4, -5, -20, -8, 3, -6, 0, -16, -25, -30, 23, -3, 15, 11, -1, 8, 11, -9, 9, 0, 14, -10, 7, 10, 8, -12, -7, -4, 13, -11, 1, 12, 10, 6, -2, -11, 1, -20, -9, -15, 21]
7774B1j9rkJ6J5j6j9PKkjKJ7j5%Jj2K4k6k5L7jJ6nJj8J0k8J1J4Jk5K3oL5Mn3K6
7812AlpJqR%K3j0l2K0kqQp%%J0LmJ4Kk9M4j8mpJ4LMk9J6Lk6NJ4%j1K1j4j1L9j0
7854A4k3Nj1LJ2LqK1l0Lj0K7Pj3J2pPmj0oJK6k7J0Lj1MK5k8j7K2l6K3OkokRk6
7893c4J8KJ3rJ9mnJ1j5k3L1j2KJ5kMLj3j1J8pJ4l4J2L0j1k0qJ0oM6l3%lJ1j0O
7930EqLk4j1M2nJPj0l0L5%J4Ql0J7nJ3k9oJ9mK3k9j1OJ9j9J9Qk2J2k0j4L2jJ0
7967A5j3Pj3j3J7mKj7L1rj4JK1J5j9JPoj8JJ0KNOj7mKNpK1l0J3MK4k0KMqrNpq
8009a5J1J7j0Jqk1J8J1j1j1J1J8j5ooOJ7j5%MK3j7knj5K8pJ8j1j7mnJ2j2K6j3
8045eqMJ1%k4LK5j2jJ7l4L3j3kk6QJ1J4KORk3qL1j0l5M3l9J9JoMOmj8J5J0j9M3
$$ y = [21, 2, -7, -9, 7, 22, 6, -13, -6, -4, -6, -7, -5, 12, -3, -3, -2, -14, 10, -16, -41, -4, -5, 11, 6, 7, -11, -1, -29, -18, -4, -3, -28, -5, -11, 24, 28, -25, 1, -2, -9, -8, -16, -7, -7, 16, 6, -26, -6, -8, -16, -8, -15, -15, -15, -5, -2, -6, 8, 10, -19, 25, 7, 3, -4, 10, 13, 17, -12, 4, 7, -19, -14, 0, 0, -11, 10, -4, -15, 24, 14, -9, -4, -15, -12, 0, 3, -5, 16, -14, -11, -21, 6, 13, 0, 12, 5, 12, 8, -2, -8, -7, 19, -8, 2, 5, -6, -2, 23, -5, -22, 0, -36, -13, -7, -9, -15, -17, -8, -34, -16, -14, -1, -10, 9, 5, 0, 11, -4, -27, 4, -8, -6, 9, 7, 11, 14, 1, -10, 8, 1, 15, -19, -7, 23, 12, -8, -16, -6, -12, 34, 1, 1, -2, 9, -1, 5, -3, 0, -24, -35, 7, 2, 3, 10, 0, -30, 5, 5, 19, 27, -3, 14, 9, 22, -7, -13, 6, 2, 25, -4, -15, -9, 10, -9, 10, 18, -4, 8, -12, -26, 6, 5, 15, 2, 9, -4, -17, 0, -4, -2, -19, 12, 3, -11, -10, 11, 26, 7, 8, 15, 9, -9, -8, 2, 4, 9, 15, -2, -6, -4, 1, -6, 15, -15, -2, 2, 26, 6, 8, 12, 4, -5, 0, -7, -15, -4, 13, 3, 4, -4, -25, -7, 4, -7, -18, -7, 11, -4, -10, -16, -10, 7, -8, -8, -4, 19, 2, 0, -5, -20, 8, 1, 19, 8, -9, -13, -18, -6, -18, 8, -5, -13, -9, 2, 2, -22, -19, 6, -6, -7, 10, -24, 9, -4, -6, -32, -24, -13, 1, 3, 9, 18, -5, -13, 18, 8, -27, 16, -23, -4, -3, -9, -5, 1, -3, -21, -6, 4, -15, 28]
8084B8%l1j8J4JJ4k7J1jK4k4L1j1j4PMk2MJ5J1l2N%J9qj6L6j7nJ4j8k4L3Qk2j7
8120b8M1Ok2j4PJ3Qlj4nJ1j2KmRLj0LpL0j3mj3J2KJ2j8K2j8jJ7m1K0K4k7J5Pk2
8158a2J5olkLpM3k6j6kOJ4k4L3l5J9JkJ8l7pK8j9K5j3m%J8k5qQK3j9
$$ y = [28, 28, -3, -21, -7, -6, 8, -19, -8, -9, 15, -9, 22, 11, -3, 4, 8, -14, -10, 5, 16, -16, -11, -11, 8, 0, -16, 20, 3, -2, 12, -6, -30, 3, 11, -11, -28, 13, 19, -3, -17, -10, 3, 11, 8, -6, -11, 0, -12, -10, -14, -5, -2, -12, -9, -16, 14, 1, -3, -16, -4, -2, 10, -8, 14, -4, -5, 12, -29, -9, 15, -12, 3, 10, -12, 3, -3, -6, -8, -5, -12, 31, 5, -11, -13, -7, 7, -17, 16, -19, 0, 1, -1, 17, -20, -27, 1, -18, 7, -6, -10, -10, 8, -17, -25, -17, 6, -13]
8191a3
##END NTUPLES=NMR FID
##END=
