##TITLE=1H_LY-n-BrBenz.acid2
 aceton-d6
 8 sc, 
 6.3.2024
##JCAMPDX= 6.0         $$ Bruker NMR JCAMP-DX V2.0
##DATA TYPE= NMR FID
##DATA CLASS= NTUPLES
##ORIGIN= UXNMR, Bruker Analytische Messtechnik GmbH
##OWNER= root
$$ XWIN-NMR		Version 3.5
$$ Wed Mar  6 14:03:54 2024 Russian Standard Time (UT+4h)  she@DPX200
##.OBSERVE FREQUENCY= 200.1313
##.OBSERVE NUCLEUS= ^1H
##.DELAY= (6, 6)
##.ACQUISITION MODE= SIMULTANEOUS
##.ACQUISITION SCHEME= undefined
##.AVERAGES= 8
##.DIGITISER RES= 18
##SPECTROMETER/DATA SYSTEM= spect
##.PULSE SEQUENCE= zg30
##.SOLVENT NAME= Acetone
##.SHIFT REFERENCE= (INTERNAL, Acetone, 0, 15.7039)
##AUDIT TRAIL= $$ (NUMBER, WHEN, WHO, WHERE, WHAT)
$$ ##TITLE= Audit trail, XWIN-NMR		Version 3.5
$$ ##JCAMPDX= 5.01
$$ ##ORIGIN= Bruker BioSpin GmbH
$$ ##OWNER= she
$$ F:/spectra/data/she/nmr/H-F/1/audita.txt
$$ ##AUDIT TRAIL=  $$ (NUMBER, WHEN, WHO, WHERE, WHAT)
(   1,<2024-03-06 14:02:47.18 +0400>,<she>,<DPX200>,
      <created by zg, POWCHK disabled, PULCHK disabled
       configuration hash MD5:
       00 E9 B6 7A A2 85 ED C7 34 08 36 98 17 FE 4E 26
       data hash MD5: 16K
       29 A0 E3 B4 12 76 74 F4 0F C7 89 91 1A B1 A8 6F>)
$$ ##END=
$$ 
$$ hash MD5
$$ 4B 41 6B 32 13 BD 60 0C DD D3 71 97 02 A0 48 06
##$RELAX= 
##$RELAX= 
##$RELAX= 
##$RELAX= 
##$RELAX= 
##$RELAX= 
$$ Bruker specific parameters
$$ --------------------------
##$DU= <F:/spectra>
##$EXPNO= 1
##$NAME= <H-F>
##$PROCNO= 1
##$TYPE= <nmr>
##$USER= <she>
##$AMP= (0..31)
100 100 100 100 100 100 100 100 100 100 100 100 100 100 100 100 100 100 
100 100 100 100 100 100 100 100 100 100 100 100 100 100 
##$AQSEQ= 0
##$AQ_mod= 1
##$AUNM= <au_zg>
##$AUTOPOS= <>
##$BF1= 200.13
##$BF2= 200.13
##$BF3= 200.13
##$BF4= 200.13
##$BF5= 200.13
##$BF6= 200.13
##$BF7= 200.13
##$BF8= 200.13
##$BYTORDA= 1
##$CFDGTYP= 0
##$CFRGTYP= 5
##$CHEMSTR= <none>
##$CNST= (0..31)
1 1 145 1 1 1 1 1 1 1 1 1 1 1 1 1 1 1 1 1 1 1 1 1 1 1 1 1 1 1 1 1 
##$CPDPRG= <>
##$CPDPRG1= <>
##$CPDPRG2= <>
##$CPDPRG3= <>
##$CPDPRG4= <mlev>
##$CPDPRG5= <mlev>
##$CPDPRG6= <mlev>
##$CPDPRG7= <mlev>
##$CPDPRG8= <mlev>
##$CPDPRGB= <>
##$CPDPRGT= <>
##$D= (0..31)
0 1.2 0 0 0 0 0 0 0 0.06 0 0.03 0 0 0 0 0.0002 0 0 0 0 0 0 0 0 0 0 0 0 
0 0 0 
##$DATE= 1709719366
##$DBL= (0..7)
120 120 120 120 120 120 120 120 
##$DBP= (0..7)
150 150 150 150 150 150 150 150 
##$DBP07= 0
##$DBPNAM0= <>
##$DBPNAM1= <>
##$DBPNAM2= <>
##$DBPNAM3= <>
##$DBPNAM4= <>
##$DBPNAM5= <>
##$DBPNAM6= <>
##$DBPNAM7= <>
##$DBPOAL= (0..7)
0.5 0.5 0.5 0.5 0.5 0.5 0.5 0.5 
##$DBPOFFS= (0..7)
0 0 0 0 0 0 0 0 
##$DE= 6
##$DECBNUC= <off>
##$DECIM= 32
##$DECNUC= <off>
##$DECSTAT= 4
##$DIGMOD= 1
##$DIGTYP= 9
##$DL= (0..7)
0 120 120 120 120 120 120 120 
##$DP= (0..7)
150 150 150 150 150 150 150 150 
##$DP07= 0
##$DPNAME0= <>
##$DPNAME1= <>
##$DPNAME2= <>
##$DPNAME3= <>
##$DPNAME4= <>
##$DPNAME5= <>
##$DPNAME6= <>
##$DPNAME7= <>
##$DPOAL= (0..7)
0.5 0.5 0.5 0.5 0.5 0.5 0.5 0.5 
##$DPOFFS= (0..7)
0 0 0 0 0 0 0 0 
##$DQDMODE= 0
##$DR= 18
##$DS= 0
$$ [...]
##$SUBNAM2= <"">
##$SUBNAM3= <"">
##$SUBNAM4= <"">
##$SUBNAM5= <"">
##$SUBNAM6= <"">
##$SUBNAM7= <"">
##$SUBNAM8= <"">
##$SUBNAM9= <"">
##$SW= 18.0517328524113
##$SWIBOX= (0..15)
0 0 2 0 0 0 0 0 0 0 0 0 0 0 0 0 
##$SW_h= 3612.71676300578
##$TD= 16384
##$TD0= 1
##$TE= 0
##$TE2= 300
##$TE3= 300
##$TEG= 300
##$TL= (0..7)
0 120 120 120 120 120 120 120 
##$TP= (0..7)
150 150 150 150 150 150 150 150 
##$TP07= 0
##$TPNAME0= <>
##$TPNAME1= <>
##$TPNAME2= <>
##$TPNAME3= <>
##$TPNAME4= <>
##$TPNAME5= <>
##$TPNAME6= <>
##$TPNAME7= <>
##$TPOAL= (0..7)
0.5 0.5 0.5 0.5 0.5 0.5 0.5 0.5 
##$TPOFFS= (0..7)
0 0 0 0 0 0 0 0 
##$TUNHIN= 0
##$TUNHOUT= 0
##$TUNXOUT= 0
##$USERA1= <user>
##$USERA2= <user>
##$USERA3= <user>
##$USERA4= <user>
##$USERA5= <user>
##$V9= 5
##$VALIST= <valist>
##$VCLIST= <CCCCCCCCCCCCCCC>
##$VD= 0
##$VDLIST= <DDDDDDDDDDDDDDD>
##$VPLIST= <PPPPPPPPPPPPPPP>
##$VTLIST= <TTTTTTTTTTTTTTT>
##$WBST= 1024
##$WBSW= 4
##$XGAIN= (0..3)
0 0 0 0 
##$XL= 0
##$YL= 0
##$YMAX_a= 8701
##$YMIN_a= -9054
##$ZGOPTNS= <>
##$ZL1= 120
##$ZL2= 120
##$ZL3= 120
##$ZL4= 120
##$ABSF1= 10
##$ABSF2= 0
##$ABSG= 5
##$ABSL= 3
##$ALPHA= 0
##$AQORDER= 0
##$ASSFAC= 0
##$ASSFACI= 0
##$ASSFACX= 0
##$ASSWID= 0
##$AUNMP= <proc_1d>
##$AZFE= 0.1
##$AZFW= 0.1
##$BCFW= 1
##$BC_mod= 2
##$BYTORDP= 1
##$COROFFS= 0
##$CY= 11.3945322036743
##$DATMOD= 1
##$DC= 2
##$DFILT= <>
##$DTYPP= 0
##$F1P= 15.7292609196834
##$F2P= 12.9074282941183
##$FCOR= 0.5
##$FTSIZE= 0
##$FT_mod= 4
##$GAMMA= 1
##$GB= 0.15
##$INTBC= 1
##$INTSCL= 1
##$ISEN= 128
##$LB= 0.24
##$LEV0= 0
##$LPBIN= 0
##$MAXI= 10000
##$MC2= 0
##$MEAN= 0
##$ME_mod= 0
##$MI= 1.114404
##$NCOEF= 0
##$NC_proc= 0
##$NLEV= 6
##$NOISF1= 3.799351
##$NOISF2= 2.8
##$NSP= 1
##$NTH_PI= 0
##$NZP= 0
##$OFFSET= 15.70392
##$PC= 1
##$PHC0= -24856.38
##$PHC1= 13.58731
##$PH_mod= 1
##$PKNL= yes
##$PPARMOD= 0
##$PSCAL= 0
##$PSIGN= 0
##$REVERSE= no
##$SF= 200.130013532006
##$SI= 16384
##$SIGF1= 3
##$SIGF2= 2
##$SINO= 400
##$SIOLD= 16384
##$SREGLST= <1H.CDCl3>
##$SSB= 0
##$STSI= 0
##$STSR= 0
##$SW_p= 3612.71676300578
##$SYMM= 0
##$S_DEV= 0
##$TDeff= 0
##$TDoff= 0
##$TI= <>
##$TILT= no
##$TM1= 0
##$TM2= 0
##$TOPLEV= 0
##$USERP1= <user>
##$USERP2= <user>
##$USERP3= <user>
##$USERP4= <user>
##$USERP5= <user>
##$WDW= 1
##$XDIM= 8192
##$YMAX_p= 0
##$YMIN_p= 0
$$ End of Bruker specific parameters
$$ ---------------------------------
##NTUPLES= NMR FID
##VAR_NAME=  TIME,          FID/REAL,        FID/IMAG
##SYMBOL=    X,             R,               I
##VAR_TYPE=  INDEPENDENT,   DEPENDENT,       DEPENDENT
##VAR_FORM=  AFFN,          ASDF,            ASDF
##VAR_DIM=   8192,          8192,            8192
##UNITS=     SECONDS,       ARBITRARY UNITS, ARBITRARY UNITS
##FACTOR=    0.0002768,     1,               1
##FIRST=     0,             0,               0
##LAST=      2.2672688,     0,               0
##MIN=       0,             -9054,           0
##MAX=       2.2672688,     8701,            0
$$ Real data points
##PAGE= N=1
##DATA TABLE= (X++(R..R)), XYDATA
$$ [...]
271H0O00o14o09N10O04n15p11L63P08k45o75K05P99m0p25m5O78P5q10k16P01K62
$$ 80 680 66 -543 -33 571 56 -655 -292 416 171 -504 -299 500 460 -265 -310 368 443 -367 -583 118 380
293C80o48k86P16M46n60m49N28M58n23o11L33N26k92n62K45P54o2o26Q5O76l9
$$ 380 -268 -554 162 608 48 -401 127 585 62 -549 -216 310 18 -544 -299 455 393 -233 -148 528 489
314D89q22k11N85J15o83j82P86M30m53k14O21M20o32p14K43L31n63o18M24R24
$$ 489 -333 -544 41 156 -527 -709 77 507 54 -160 461 881 249 -465 -222 109 -454 -1072 -648 276
334B76Rm03M54Q60j97r91k15L59l24r42j51R05M80l16J54J008M87p33o78K31M1
$$ 276 285 -118 336 1196 999 8 -207 152 -172 -1114 -1265 -360 120 -196 -42 966 1453 720 42 273 314
355C14j009q21N13Q15j52k34Q84J038k88p67O5L93o50j156k9P67O9n30K99J119
$$ 314 -695 -1516 -1003 -188 -340 -574 310 1348 1060 293 358 751 101 -1055 -1084 -317 -248 -778 -479 640
375F40L34p23k60O37Q8r97n35P11M57o93m06Q26O08o54o89N48O56m81o28N63R03
$$ 640 974 251 -9 628 716 -281 -816 -105 352 -341 -747 79 687 33 -656 -108 548 67 -561 2 905
396I05k88q39J82O29m62j189o9R20P6o34L54J401M50p88k91O12k06j450q74N35
$$ 905 617 -222 -40 589 127 -1062 -1131 -211 -135 -769 -415 986 1436 648 357 969 763 -687 -1561 -1026
416a026M09n53rJ400J197j56m79M81L45j216j517j09N01m71n79Q85J601L71m64
$$ -1026 -617 -1170 -1179 221 1418 1262 783 1264 1609 393 -1124 -1233 -732 -1203 -1782 -897 704 1075 611
435F11L94P91m85j517o35L93j78r47L6J339Q21l91q4J009L56j127q70M12L33q79
$$ 611 1005 1796 1311 -206 -841 -448 -626 -1573 -1537 -198 623 232 148 1157 1513 386 -484 -72 261 -618
455f18o64P96R61m15n87N41Q30m81r67K90R42j45q57K66R27j44j142k36O87p1
$$ -618 -1282 -486 475 60 -527 14 844 363 -604 -314 628 483 -374 -108 819 675 -467 -703 -16 -87
475h7r61n2J218O50m97l6J021L06j130r96J76J14r70o43Q82J235P8j28R35R71
$$ -87 -1048 -1100 118 768 271 235 1256 1562 432 -564 -388 -274 -1244 -1887 -1005 230 308 180 1115 2086
495B086o01j273l10J41q21j258J75J227M75j70O87J336K50j058n86K48l85j362
$$ 2086 1485 212 -98 43 -778 -2036 -1861 -634 -159 -329 358 1694 1944 886 300 548 163 -1199
513a199o18Q36O78l15M5J250Q45n79p37L09K88r48j007L30Q13k63n43N45J028
$$ -1199 -1817 -981 -303 -618 -573 677 1522 943 206 515 803 -145 -1152 -822 -9 -272 -815 -270 758
532G58j80q31Q3P63j59q96rR30J35q17k03P09R3r76m08P35N08n41j16R44P51n31
$$ 758 578 -253 -170 593 434 -462 -471 459 594 -223 -426 283 376 -600 -1008 -273 235 -306 -422 522 1273 742
554G42o51L10K34r25j045K59O99j26l35P96J240R3o91nM46o15j353m04N70J22
$$ 742 91 401 635 -290 -1335 -1076 -377 -503 -838 -42 1198 1291 600 595 1041 426 -927 -1331 -761 -639
574f39n10K60J341P34l93k76N87L6j168r37K58L49n88l00R11J031j14m01M51N57
$$ -639 -1149 -889 452 1186 793 517 1104 1140 -28 -965 -707 -358 -946 -1246 -335 696 582 181 632 1189
594A189n71j071j4N31k89p15K32R81J96o46K6P68O7q66k75O43K49o56l04O87L84
$$ 1189 618 -453 -467 64 -225 -940 -708 273 469 -177 -151 617 684 -182 -457 186 435 -221 -525 162 546
615E46o56n20M89M54m96n35N86P63k43n49L60O38m18r42K3N21k45p09K26R81K49
$$ 546 -110 -630 -141 313 -183 -718 -132 631 388 -161 199 837 419 -523 -500 21 -224 -933 -707 274 523
636E23m75J27P36M7r12n04M16N6p78l32P82P10l36k03P20N48n95p90J97L06n70
$$ 523 48 175 911 958 46 -458 -42 14 -764 -1096 -314 396 60 -143 577 1125 530 -260 -63 243 -327
657c27p27L79Q32p5m59L89P83n8p72j07M97j08q24j37O85K66n43p2P23L27n89
$$ -327 -1054 -675 157 82 -377 12 795 737 -35 -142 355 247 -577 -714 -29 237 -306 -378 345 672 83
678H3m05N26K96o00m95M90N07m10m91M47N81l58o25K90O46k51o76J69O82r7o59
$$ 83 -322 204 500 -100 -595 -105 402 -8 -499 -52 529 171 -454 -164 482 231 -445 -276 406 309 -350
699c50K5O37Mp12p9O64J93o19j85O52L15n68l77N37L51n84m50M41N02m05m70M06
$$ -350 -325 312 316 -396 -475 189 382 -237 -422 230 545 -23 -400 137 488 -96 -546 -105 397 -8 -478 -72
721g2N62k90n29K48N47k35o48Q9O30q7n92L7O65Q6n75j35O22J33o70k49N49K49
$$ -72 490 200 -329 -81 466 231 -417 -328 302 215 -377 -340 325 411 -164 -299 323 456 -214 -463 86 335
743C35n69k65N58M27m66m04M66M71m52n33K53M85k71n93K66O74j24n29J89O48
$$ 335 -234 -499 59 486 20 -384 82 553 101 -432 -179 306 35 -558 -292 382 258 -271 -82 566
763E66r6o97p2N37m4o72o1N93K53m39j25O32K91n15m00L29K45n57m64M09N04k66
$$ 566 470 -227 -299 238 194 -478 -539 54 307 -132 -257 375 666 151 -249 80 325 -232 -696 -287 217 -49
785d9l14M14N84k18n43J21M16k79o83M3N55J0m42J19O70J57n17j40M39P8o24l38
$$ -49 -363 51 635 417 -126 -5 411 132 -551 -508 47 57 -385 -266 404 561 44 -96 343 421 -203 -541
807e41M79K67l93k71N14M14l48l92L08M09l31n03K49M72j75m97J64N11j60n43
$$ -541 -62 205 -188 -459 55 469 121 -271 37 446 115 -388 -139 333 158 -339 -175 336 176 -367
827c67KN13K8m83N7N97K04m99j86M26Q0o40l57L60K90l50j52N46N88k13l40K36
$$ -367 -365 148 176 -307 -250 347 551 52 -134 292 372 -268 -625 -265 25 -325 -477 69 657 444 104 340
849C40K80m42p23N9L70j80l92L15P51J76l88Q0M48j37p61k80K87N2n26n7O67M59
$$ 340 620 178 -545 -486 -116 -296 -688 -373 378 554 166 246 694 557 -204 -484 -197 -145 -671 -728 -61 398
871C98k46j20M54K69n52n53K06K33l76m22L91N39r4l39K74M90j75n63k3M60o9
$$ 398 152 32 486 755 203 -350 -144 89 -287 -709 -318 221 127 -212 62 552 377 -186 -209 251 182
892A82n27J2N59Q5n06j29M69R8m59j94N25K84l59j92M24K64m33m82J87K91l61
$$ 182 -345 -333 226 311 -195 -324 145 243 -216 -410 115 399 40 -152 272 536 103 -379 -192 99 -262
913b62m49L28O28k8k77K81N32j59o65j40K51k16n78j2O30K91k44J22O55J82n22
$$ -262 -711 -383 245 217 -60 221 753 594 -71 -211 40 -176 -754 -766 -136 155 -89 33 688 870 348
934C48m22J96M8o46l94M11M60j61j14N22N22k29m96J13K12l88n98O3N09pl65K19
$$ 348 -74 122 170 -476 -870 -459 1 -160 -274 248 770 541 45 158 370 -18 -616 -553 -44 -51 -416 -197
956a97O20O2m81p6M03rn74k05M91K02m23j96M73L11m75k97L66L29k95l40L60M20
$$ -197 423 485 4 -72 331 322 -252 -457 34 236 -187 -383 90 401 -74 -371 -5 324 29 -311 49 469
978D69k27m27J45L66l03n61J18M88l9l69J99O29J00m83j12L62p9o35k63L85J79
$$ 469 242 -185 -40 326 23 -538 -420 68 29 -340 -141 488 588 105 -7 355 276 -359 -622 -237 -58
999e8l34m4O19M41l20k45L00J76n34n31J38L33k50l02M12O31n3l18J51L74k16
$$ -58 -392 -436 183 624 304 59 359 535 1 -530 -392 -59 -309 -611 -199 432 379 61 212 586 370
1020C70o23p9L20l1m18lN77K61l88r6M58J55n20l14L13K24l84k99L88L73k57l29
$$ 370 -253 -332 -12 -43 -461 -464 113 374 -14 -110 348 503 -17 -331 -18 206 -178 -477 -89 284 27 -302
1042c02K80L93k76m19K12M09j62l95J38L87n0m92OM24Rm69KM74J50l49q3M08J48
$$ -302 -22 371 95 -324 -112 297 135 -260 -122 265 215 -277 -271 153 162 -307 -305 169 319 -30 -113 295 443
1065D43m63l01L08J76l73k50L52M24k44k62L16L62k64m56J37K80k06m53J28M71
$$ 443 -20 -321 -13 163 -210 -460 -108 316 72 -190 126 488 224 -232 -95 185 -21 -474 -346 125
1085A25L5l56R6M73M3m75j10L59Rm81j39M20K22l37j57M03L25l21l25K66K52l40
$$ 125 160 -196 -100 373 416 -59 -169 190 199 -282 -421 -1 221 -116 -273 130 455 134 -191 75 327 -13
1107a3l60K37L52j82l26K01M31j06m06P4M06j00m36j8L60M0l83o6M59J39l58j41
$$ -13 -373 -136 216 34 -292 -91 340 234 -172 -98 308 208 -228 -246 114 154 -229 -295 164 303 -55 -196
1129a96L28J75l60k52K74K70l11k58K72L55k15l08K30L50k11l93J06L75j50l69
$$ -196 132 307 -53 -305 -31 239 -72 -330 -58 297 82 -226 4 354 143 -250 -144 231 81 -288
1149b88O1M10J7l53kM13L7m19r0L47J04m06j36L57K14l24j97L17K33k84k80K40
$$ -288 -227 183 200 -153 -155 258 295 -124 -214 133 237 -169 -305 52 266 -58 -255 62 295 11 -269 -29
1171b9L03k27k97J65L62j90l52J41L20q5l90P8L94K1l65N2M06L4m26j46K96Q8
$$ -29 274 47 -250 -85 277 87 -265 -124 196 111 -279 -201 193 214 -151 -99 307 341 -85 -231 65 153
1193A53l95j59L77K36k41j12L55K54k86l40J48J61k93l75J87L84l5k65K83M43
$$ 153 -242 -401 -24 212 -29 -141 214 468 182 -158 -10 151 -142 -517 -330 54 19 -246 37 480
1213D80l9m27l6K32j24n08p2L79J24k26K2M66K37l00k00K38L6m36l01K51K43j88
$$ 480 441 14 -22 210 86 -422 -494 -115 9 -217 -195 271 508 208 8 246 282 -154 -455 -204 39 -149
1235a49j76L26L73j63k62J43K33j99l98K5L52o6l14P9L75K7l46n5L50N5l50p6
$$ -149 -325 1 374 211 -51 92 325 126 -272 -247 105 39 -275 -196 179 206 -140 -195 155 210 -140 -216
1257b16L72J74l00j83K39J52l31k93K18J94j60j75L40M07j38k17J16J63k57m68
$$ -216 156 330 30 -153 86 238 -93 -386 -168 26 -134 -309 31 438 300 83 199 362 105 -363
1277c63l1K41l3k37K26M64J80k20j0K58r1m64l22J43N9k38q6M37M01q2r5K79J56
$$ -363 -394 -153 -186 -423 -197 267 447 227 217 475 384 -80 -402 -259 -200 -438 -524 -87 314 232 137 416 572
1300E72l51m27oJ57k14k79K05M39P3j62J37L22j16l78r0J79n6l08k5L36J52k13
$$ 572 221 -206 -212 -55 -269 -548 -343 96 169 7 144 466 350 -28 -118 61 5 -303 -328 8 160 -53
1322e3q1K97J06k78j76K36J85k36j76K24K39k24k71P7J87j49k83J39L88J9j51
$$ -53 -134 163 269 -9 -185 51 236 0 -176 48 287 63 -208 -131 56 -93 -376 -237 151 170 19
1343A9Q0L05m3l70j92J68p5l29n1L46K70p4J4L63J61k87l16K6jl42k74K16L23
$$ 19 99 404 361 -9 -201 -33 -108 -437 -488 -142 128 54 68 431 592 305 -11 15 14 -328 -602 -386 -63
1366f3K5k9K61L50l0l70p0O7j78m07m9K98J43j55J19L68J59k51j57J52Ol46k11
$$ -63 -38 -67 194 544 514 144 74 141 -37 -444 -493 -195 -52 -207 -88 280 439 188 31 183 189 -157 -368
1389c68J97J93j35j30K57K68j47k54J20K04j53k31N9K77j6k67K6K40j5l05n9K75
$$ -368 -171 22 -113 -243 14 282 135 -119 1 205 52 -179 -120 157 141 -126 -100 140 125 -180 -239 36
1411C6Q2k36k3L03J75k31j82J60Q7l02k55J47K32r4j52L00L25n9k82O8J94k29
$$ 36 118 -118 -141 162 337 106 -76 84 171 -131 -386 -239 -7 -101 -253 47 372 313 31 99 293 64
1433F4l71m3K72Lk43J41M05J56k56m0K10K8l97k59J84J39k33j03L35L10j29j86
$$ 64 -307 -350 -78 -75 -318 -177 228 384 128 88 298 326 -71 -330 -146 -7 -240 -343 -8 302 173 -13
1455a3J63K18k58l46P7K43j55k57J26L98n9k68R7L00l2l72l7K76L9l39o0L24J38
$$ -13 150 368 110 -236 -159 84 -71 -328 -202 196 137 -131 -34 266 234 -138 -175 101 140 -199 -259 65 203
1478B03k83j30L04J70k96j92K44K40k37k78K68K46k00k98J74K96j68l21J36L47
$$ 203 -80 -210 94 264 -32 -224 20 260 23 -255 13 259 59 -239 -65 231 63 -258 -122 225
1498B25r3l14N1L76m2l83rL18N1m04o2L85J30l20j04L37J87l66k10K82J96l08
$$ 225 132 -182 -131 245 203 -180 -189 129 180 -224 -286 99 229 -91 -195 142 329 -37 -247 35 231 -77
1520g7k35K56L14k04k72K08L30k07l18J18L26j58l68Q5L70l5l20L6L80L0l80l8
$$ -77 -312 -56 258 54 -218 -10 320 113 -205 -87 239 81 -287 -202 168 133 -187 -151 229 259 -121 -159
1542a59L61K1m06j46L43J59l18j34L57K54k52k50K76K03l05l51J91K85k28k47
$$ -159 202 223 -183 -329 14 173 -145 -279 78 332 80 -170 106 309 4 -347 -156 129 -99 -346
1562c46K39M23j18l23J48L81j77m23n9L65q5l70L0M45J40l05n2M03N9m20k24K86
$$ -346 -107 316 198 -125 23 404 227 -196 -255 110 25 -345 -315 130 270 -35 -87 316 375 -45 -269 17
1584A7J05l42j93L37K88j98j95L08K86k95l32J30L03k26l51J81L54p1l45J44L48
$$ 17 122 -220 -413 -76 212 14 -181 127 413 118 -214 -84 219 -7 -358 -177 177 106 -239 -95 253
1605B53p8l63M8L50n2l01n0M01M1l47j37L18Q1l42j46L29K40k42j37L44K02l03
$$ 253 175 -188 -140 210 158 -143 -193 208 249 -98 -235 83 164 -178 -324 5 245 3 -134 210 412 109
1627A09k91J74J58l35k90K05L52o2k07K66M03j13l37m1K13j92m28m7L59P0j89
$$ 109 -182 -8 150 -185 -475 -270 82 20 -187 79 482 369 32 -9 204 12 -416 -463 -104 -34 -223
1648b23J12M55J56k88j36J49j2m38k11J91J82j57o5L73K91j33k13J32J84l02l58
$$ -223 -111 344 500 212 76 225 213 -225 -436 -245 -63 -220 -285 88 379 246 33 165 349 47 -311
1669c11Q2K42j05j98J45L82m8k63M2K77o3l38OK32L5k45o3L00N6k88j02K01J64
$$ -311 -229 13 -92 -290 -145 237 189 -74 -32 245 182 -156 -150 82 117 -128 -191 109 165 -123 -225 -24 140
1692A40k36r2K75K31j58j52J28J29k69k92N3J66j10j25K11L45O3j36M3J71j66
$$ 140 -96 -188 87 318 160 8 136 265 -4 -296 -243 -77 -187 -312 -101 244 307 171 214 385 219
1713B19l72j32P4m4j50P7L38K28o7NK36j2l22k06k4l0j92l8K16K87M3n3J96J58
$$ 219 -153 -285 -211 -255 -405 -328 10 238 171 176 412 400 78 -128 -152 -182 -374 -412 -196 91 134 81 277 435
1737D35j35k78n8K3j45j53M9K59M3p7O1J83J3j88o3R8k2j69pJ24O8j14l4R7L9
$$ 435 300 22 -36 -13 -158 -311 -262 -3 40 -37 24 207 220 32 -31 67 45 -124 -131 -7 61 -53 -87 10 49
1762D9j13q4R0J19j3n0Q1J42r5j66k1Kr1j20K8J87J05j6J05J53L9j35j67m3r4
$$ 49 -64 -148 -58 61 48 -2 79 221 126 -40 -61 -59 -150 -270 -242 -55 50 34 139 292 331 196 29 -14 -108
1787a08j53j21J15J83L6P8K03J07kj47j13o0j97j51k1J28R1K6J26J93P8o6p2l6
$$ -108 -261 -382 -267 -84 -48 30 233 340 338 191 78 18 -179 -330 -351 -223 -132 -106 20 213 291 225 153 117
1811A17r6j38j18M6P6oN3Q7J75m7n5j4J6m8j40l3J27J3p6K3R2K0q7o9Q7N3r3l1
$$ 117 21 -117 -235 -189 -113 -119 -66 21 196 149 94 80 96 48 -92 -125 2 15 -61 -38 54 74 -13 -82 5 58 -35 -66
1839f6J10O6l9r1L1N6j09j41J8J40j7m8J02J53O1j26m7M6p3k05m9J21NnK2J91
$$ -66 44 110 71 -20 11 67 -42 -183 -165 -25 -42 -90 12 165 226 100 53 99 26 -179 -228 -107 -102 -107 -85 106
1865A06J23o7o1N6%j76j74JJ13o4n2J18K27K4j18O6Q6j00k15n6J11m9q8K6K03
$$ 106 229 162 101 157 157 -19 -193 -192 -79 -143 -195 -77 150 174 56 122 208 108 -107 -163 -52 -101 -189 -163 40
1890D0O2r8j5J80lj74j17J05R0j32r5J59R5r9q2J04J33j12j28N6J36o2j74R3J39
$$ 40 102 4 -11 169 166 -8 -125 -20 70 -62 -157 2 97 -2 -84 20 153 41 -87 -31 105 43 -131 -38 101
1915A01j7j77K4J67k8j73PJ73K6j48m2J80M1j63j05J45Q2j69n9J15J55j36q8J31
$$ 101 84 -93 -69 98 70 -103 -96 77 103 -45 -87 93 134 -29 -134 11 93 -76 -135 -20 135 -1 -89 42
1939D2J33j37j59Q1J49j17j86J15K05k6k16P9J76Mk13KJ55j3j99k1J91P3k17k
$$ 42 175 38 -121 -40 109 -8 -194 -79 126 100 -116 -37 139 143 -70 -68 87 74 -125 -146 45 118 -99 -101
1963a01K07Q0k11n7J36O8j73j31J54J18j21j21J41J69j08j23Q3J44r9k19O8J45
$$ -101 106 186 -25 -82 54 122 -51 -182 -28 90 -31 -152 -11 158 50 -73 10 154 55 -164 -96 49
1985D9l7j71N5K49mj62J4J60J4k39q7J39O6j62k5J78J54j70q8J70J03k05j33Q5
$$ 49 12 -159 -104 145 141 -21 -7 153 167 -72 -159 -20 46 -116 -141 37 191 21 -67 103 206 1 -132 -47
2009d7R5j06j74J79J43l5j31P2J74n8j76jJ52m9k07L4J98J9j26m9K33K4j97q5
$$ -47 48 -58 -232 -53 90 55 -76 -4 170 112 -64 -65 87 38 -169 -135 63 82 -44 -93 140 164 -33 -118
2033a18J63N9j57q6J54J46j62j16J14J28j39j20R2J60q8j33R9J51p5j48MJ60p0
$$ -118 45 104 -53 -139 15 161 -1 -117 -3 125 -14 -134 -42 118 30 -103 -4 147 72 -76 -72 88 18
2056A8k14L4J56Q2j27qK34K4j85o8Q0oj82r2J67J09n8n4K13J25j11j37M8P6j59
$$ 18 -196 -162 -6 76 -51 -59 175 199 14 -54 26 20 -162 -254 -87 22 -36 -90 123 248 137 0 48 124 -35
2081c5j99P5J46qr0P3K29J1j36JO6n4k28m3J12P8j33J1J94J16j51o1J04N7j60
$$ -35 -234 -159 -13 -21 -111 -38 191 202 66 67 133 79 -149 -192 -80 -2 -135 -124 70 186 35 -26 78 135 -25
2106b5r9R6Q2q8j00R7J54o4j39O0J33n4j40M2J55k1j32M6P3K0j98n7J52J1r0k1
$$ -25 -124 -28 54 -34 -134 -37 117 53 -86 -26 107 53 -87 -45 110 89 -43 3 76 96 -102 -159 -7 4 -86 -107
2132a07J74R2q3o4P8O7j83k10Q2J04n0j09J63J89J1r6O6R0j11j83o5Q7n3r6M1
$$ -107 67 159 76 12 90 157 -26 -236 -154 -50 -100 -209 -46 143 154 58 124 214 103 -80 -145 -58 -111 -207 -166
2157a66J94Q7l3lJ17K7j95j55J12rj49l0J68R7n0k9J13J01j08j43J1J04j17r1
$$ -166 28 115 82 79 196 223 28 -127 -15 -24 -173 -203 -35 62 12 -17 96 197 89 -54 -43 61 -56 -147
2181a47M9J53m1o8J6J26j9j47J7J14K4j32j6J43K4j14p1P4P5j42n0J06J46q9o0
$$ -147 -98 55 14 -54 -38 88 69 -78 -61 53 77 -55 -71 72 96 -18 -89 -15 60 -82 -132 -26 120 31 -29
2206b9J27J04j03j39rN8r2j13P3J42J3n3P3J38k6j36m0L2n9j30q8J66P6k8jJ72
$$ -29 98 202 99 -40 -49 9 -83 -196 -123 19 32 -21 52 190 164 28 -12 20 -39 -169 -257 -91 -15 -43 -44 128
2232A28O7n6j11J8L4j30j53N3J29l1k5Q6J47l3r3J8N5m7j70MJ19kr4oJ60L0j10
$$ 128 195 139 28 46 80 -50 -203 -150 -21 -52 -77 9 156 123 30 48 103 56 -114 -110 9 7 -87 -93 67 97 -13
2259a3k9R1L3j30o1J25R2j35n4Q2O0p6j12O2J32o0q4P1J34l8q4J5P4o8j35j9J39
$$ -13 -42 49 82 -48 -109 16 108 -27 -81 1 61 -15 -127 -65 67 7 -77 -6 128 90 6 21 95 27 -108 -127 12
2286A2k6o5K6J57O0j17k0P4J9j62r2M8R3q8kQ2J22j9j07Q0P2p8j62k1R0m2p8L9
$$ 12 -14 -79 -53 104 164 47 27 101 120 -42 -134 -86 7 -81 -83 -1 121 102 -5 75 147 69 -93 -114 -24 -66 -144 -105
2314a05J72L1j08j1J27%j25l1N4K8j22l8J29P2p8m1R3M8q9q1J14M5j07n8R5Q6
$$ -105 67 98 -10 -21 106 106 -19 -50 4 32 -90 -128 1 73 -5 -46 47 95 6 -75 39 84 -23 -81 14 100
2340A00n5j47P1Q9k5j02K4J19j2r9K2J01Nj17o7J07J2j15jQ8O2n3n1J04Q3q2j37
$$ 100 45 -102 -31 58 33 -69 -45 74 62 -37 -15 86 91 -26 -93 14 26 -89 -90 -2 60 7 -44 60 143 61 -76
2367g6M4Q1n9r9P2Q1Qj05N5J08l0j13L3N4j3j36J0R8L4j00K1P5M9j12j5N3L5j05
$$ -76 -32 49 -10 -109 -37 44 52 -53 2 110 80 -33 0 54 41 -95 -85 13 47 -53 -32 43 92 -20 -35 18 53 -52
2395e2r4J20O9n5p4P7P8l0q9L9R1l3j52O6Q8j1j01K7J02j6q0nP5L7j14j9O9K9
$$ -52 -146 -26 43 -12 -86 -9 69 39 -50 -11 80 47 -105 -39 49 38 -63 -36 66 50 -30 -35 40 77 -37 -56 13 42
2423D2o6k1M6P1p5l2J6Q3p2n4M0P6l3q0K3Q8k3q9L7N0Nq7j9J28Nj24mJ05K4r3
$$ 42 -24 -45 1 72 -3 -35 -19 64 -8 -62 -22 54 21 -59 -36 52 29 -60 -23 27 32 -55 -74 54 59 -65 -69 36 60 -33
2453c3m0J10M1r6m9N6R6r4o9Q4Q1r3o1N4J03j02o4N5Q8l7p5L0O5L5j52QJ16k8
$$ -33 -73 37 78 -18 -67 -11 85 -9 -78 6 87 -6 -67 -13 90 -12 -76 -21 67 30 -45 -15 50 85 -67 -59 57 29
2481B9q6k7J18L1r9kQ1J7o8q6R2O7q1n0O7L6n0m6O6Q5l0r4M0O2l9j17J2J18k8
$$ 29 -57 -84 34 65 -34 -36 45 62 -6 -92 0 67 -14 -64 3 39 -11 -57 9 94 64 -30 10 72 33 -84 -72 46 18
2510A8p2QJ42L2j23m0J06j9j02o2Q9O1r1j9Q9P9o1j04O7J07j09r4L3J33o5j04
$$ 18 -54 -46 96 128 5 -35 71 52 -50 -112 -23 38 -53 -72 17 96 35 -69 -2 105 -4 -98 -65 68 3 -101
2536a01N6J24l3r9K4R3j4r0rO1L8r1j0O2N1r5l7P4L8q3l5R7O5q2m4K6J09p8j08
$$ -101 -45 79 46 -53 -29 64 50 -40 -49 12 50 -41 -51 11 62 -33 -70 4 42 -41 -76 21 86 4 -40 -14 95 17 -91
2565i1K3Q6m0n2L5J11qj11L5J06l6j47J2O9Jp4lJ16M0o0k2P9L5j00m7J9M1o8q0
$$ -91 -68 18 -22 -74 -39 72 64 -47 -12 94 58 -89 -77 -8 -7 -81 -84 32 72 12 -10 69 104 4 -43 -24 17 -51 -131
2594a31R2J06l4n9Q2N6n6j11L3P2p2o1L0O2L6r6K7R3pq3m3Q2K2o8l8O8K9k6p7
$$ -131 -39 67 33 -26 56 112 56 -55 -22 50 -22 -83 -53 9 45 -51 -24 69 62 -21 -64 18 40 -28 -66 2 31 5 -72
2623g2P8M6o2o1N4J08p5k9M0O0l6q7OO0j7r3L8P9ln3k0J15Qr1l7M9Oq9k0P0N7
$$ -72 6 52 -10 -71 -17 91 16 -13 27 87 51 -36 -30 30 13 -80 -42 37 34 -19 -39 76 84 -7 -44 5 11 -78 -98 -28 29
2654B9k7n7Q0R5q8k8L9j0l8j14O2J00m1n8M9J05j1r9jP5k5j05k1P9L3n9j1J03
$$ 29 2 -55 25 120 32 4 43 33 -5 -119 -57 43 2 -56 -7 98 87 -12 -13 62 37 -68 -89 -10 23 -36 -47 56
2682E6K8o1q9J11J1o6p0P4N6n3o9O6M7j9r0M9O1l6m6j2R8j5p6M2O0l5o6k6P1K0
$$ 56 84 23 -66 45 56 -10 -80 -6 50 -3 -72 -6 41 22 -68 -19 42 6 -40 -52 46 31 -45 -3 57 22 -44 -70 1 21
2712B1m8n4J07L3n5k4M1L1o0o2O1L7l0m6O0N5m5l5L1O8n0j15L1P3m3p8N0N0K6
$$ 21 -27 -81 26 59 4 -20 21 52 -8 -70 -9 28 -2 -48 12 67 22 -13 18 86 36 -79 -48 25 -18 -96 -46 4 30
2741C0l4j9Q1%q3m4M7M2p7j5Q0M9m8k1N2K8l1r2L9N6l2p8M6N8Lp3PP2j8n7j8Q2
$$ 30 -4 -23 58 58 -25 -69 -22 20 -57 -72 8 57 9 -12 40 68 37 -55 -16 40 8 -70 -24 34 37 -36 -29 43 25 -32 -50 32
2773C2K7p9l7J14k2o3k2N7J3m1j7M1N2o2n9N8L9k0l1K9L7n6k5J6P8or8M5N5k3
$$ 32 59 -20 -57 57 35 -28 -50 7 20 -21 -38 3 55 -7 -66 -8 31 11 -20 9 46 -10 -35 -19 59 53 -45 0 55 32
2803C2n4m4J12Lm9n6P5Ml1o3P1P0q0m4N2M0k4p6M3P0o2p1O5P7l1r0M0M7ko1K2
$$ 32 -22 -66 46 49 0 -56 19 23 -8 -71 0 70 -10 -54 -2 38 14 -62 -19 51 -11 -82 -17 60 29 -61 -21 26 24 -37 -15
2834a5O3m3l7K0O6lo5oO7M2j07m3P0L5p9rN3N1m4n2M9O3n1p7pP1Qr5J6P6J9q3
$$ -15 48 5 -32 -12 54 51 -14 -20 47 89 -18 -61 9 44 -35 -44 9 60 16 -36 13 76 25 -52 -59 12 20 -75 -59 17 36 -47
2866d7L6N7kp6j4O1L3q1k2P6M5o9l4N1P9p2q8P1O3p8o6M9M5oo6K6J07n0m4oM9
$$ -47 -11 46 44 -32 -46 15 48 -33 -55 21 66 -3 -37 14 93 21 -67 4 67 -11 -77 -28 17 11 -55 -29 78 28 -16 -22 27
2897B7Rp6kO4J1p6j6O7K7n1k8O3J8n2k3O6J5n9k5N6K6l0n3L3J5Lk3KJ01o7k9j6
$$ 27 36 -40 -42 22 33 -43 -59 8 35 -16 -44 19 37 -15 -38 28 43 -16 -41 15 41 11 -42 -9 6 9 -14 -12 89 22 -7 -23
2929b3N3j7n8l4O9J0l7K1N2L5p3j5M9Op8n4M1N1m3rN8M7ro5M0L4o5n4j0R0Kr1
$$ -23 30 13 -45 -79 -10 0 -37 -16 36 71 -2 -17 32 38 -40 -94 -53 -2 -45 -54 4 51 42 -23 17 51 -14 -68 -78 12 14 -77
2961g7J5J03K3r0J6O8oq7J3M8L2n6l3N4L0q4j1M0O1l9p2J4R3l2p5L9L9oo6MP5
$$ -77 -62 41 64 -26 -10 58 52 -35 -22 26 58 2 -31 23 53 -31 -42 -2 59 20 -52 -38 55 23 -52 -13 26 20 -46 -42 33
2992C3j6n0kQ4J0o3j4M4L5j06l2N6K2k5k9O4P3m5l2J0O4n8o7L5L4l9o0M3P9k3
$$ 33 17 -33 -35 49 59 -4 -18 26 61 -45 -77 -21 1 -24 -53 11 84 39 7 17 81 23 -44 -9 25 -14 -74 -31 48 25
3022B5j2%N4j6r1j8N8j4n8j2P8M4o8J5O5J5p0m5O0L3n9l2K5N6l0n3N0Q8n3q8O2
$$ 25 13 13 67 51 -40 -58 0 -14 -72 -84 -6 38 -30 -15 50 65 -5 -50 10 43 -16 -48 -23 33 3 -50 0 88 35 -53 9
3053IO3m8o7K9O9j4q4QO0ln7lM0M1o0m4R6J7o5j6K8M9o6n6P5L8m6n3P7O3q2l4
$$ 9 72 24 -43 -14 55 41 -43 -35 25 22 -35 -38 2 43 -17 -61 35 52 -13 -29 -1 48 -18 -74 1 39 -7 -60 17 80 -2 -36
3085c6L9K3k1o7pP9Kn1J9R5j7o4oN2k4o5mL5J9po3R6N6q0n4O3M9p1m6J4O0k6m2
$$ -36 3 26 5 -62 -69 10 12 -39 -20 75 58 -6 -12 40 16 -49 -53 -18 1 -6 -69 27 83 3 -51 12 61 -10 -56 -42 18 -8 -50
3118e0L4O0l1l8J7L8J0o9OP4m6m2QM4K1n1J1O0l3o1j0O5K7n1m9N6O2o0m3L3O3
$$ -50 -16 44 13 -25 -8 30 40 -29 -23 51 5 -37 -29 15 36 -15 -4 56 23 -38 -48 17 44 -7 -56 0 62 2 -41 -8 55
3149E5m0l5J4P0o0p5N3N8po9jR5l4n9pN5M5p9PRM5n6k3O5J5p1k4R1K5p7pL4L1
$$ 55 15 -20 -6 64 4 -71 -18 40 33 -36 -37 58 24 -35 -42 13 58 -21 -14 -5 40 -16 -39 26 41 -30 -54 37 62 -15 -22 12 43
3182D3m0m2L4L6on9JO0J7o0JO3ln8pL9j2l0j2N2j5n5L3O2kn3lL4K8n3m7L6M3l6
$$ 43 3 -39 -5 31 25 -34 -33 27 44 -16 -15 48 45 -13 -20 19 7 -23 -35 17 2 -53 -20 42 40 -13 -16 18 46 -7 -54 -18 25 -11
3216a1l2N8K6Qp1M5M4n4p1N2j1L7p4K3P0l3k4L1L2l0l3k4NN5l8j9L4L3k2l7K8
$$ -11 -43 15 41 49 -22 23 67 13 -58 -6 -17 20 -54 -31 39 6 -18 13 45 15 -18 -42 -37 18 -20 -39 -5 28 6 -31 -3
3247cL5k4l9J7K0k6lK4L7nn6K3J9Mk8lM5m7J7lL6Qn7rmRkj3J8M3k5L2k5K8j4m1
$$ -3 32 8 -31 -14 6 -20 -23 1 38 33 -23 0 19 23 -5 -8 37 -10 7 4 40 48 -9 -18 -22 -13 -15 -28 -10 33 8 40 15 43 29 -12
3283a2j9k1K7l4J9R4m0JRPQl1k3p%l5J3M5L3k5K2K8J0m3l2kJ8Ll0j0K5J7lj1M2
$$ -12 -31 -52 -25 -59 -40 54 14 15 24 31 39 8 -15 -22 -22 -57 -44 1 34 9 31 59 69 26 -6 -8 10 13 -17 -27 -2 15 12 1 43
3318D3l4k3K3j2jj1j7K1J4J1j8j1M1l7lJ2J0%l5N7qk7k7M4J4l4k1K6J4L4l3Lj
$$ 43 9 -14 9 -3 -4 -15 -32 -11 3 14 -4 -15 26 -11 -14 -2 8 8 -27 30 22 -5 -32 12 26 -8 -29 -3 11 45 12 15 14
3351A4J7Km5J4J3o0j3M5K7k8J3J2N2j0n3%Nn1Kk2Q1l3k9M7O7j0m1KpOm1l6L3K5
$$ 14 31 33 -12 2 15 -45 -58 -13 14 -14 -1 11 63 53 0 0 5 -46 -44 -66 15 -18 -47 0 67 57 16 18 11 17 -24 -60 -27 -2
3385bl3L2L1J0j5k3J7L1n7k5%N3k5k4M9J8Pm4J0J6J0n5j5M9ql7ML0K1n1PK5K8
$$ -2 -35 -3 28 38 23 0 17 48 -9 -34 -34 19 -6 -30 19 37 44 0 10 26 36 -19 -34 15 7 -30 -26 4 25 -26 -19 6 34
3418C4n7%L7M4o1k3N8%l3j8oJ4L0n4J2O7Ml9QL2l7m6j2M3K8m8j7M5M0m7J2lN6
$$ 34 -23 -23 14 58 -3 -26 32 32 -1 -19 -25 -11 19 -35 -23 44 48 9 17 49 12 -34 -46 -3 25 -23 -40 5 45 -2 10 7 63
3451F3q0n8P2Rn0KK0M7k8l6O5K5k7o2K0PJ6p4N4K6J3m0K4O5l4l9lK3J5p6K0M8
$$ 63 -17 -75 -3 6 -44 -42 -22 25 -3 -39 26 51 24 -38 -18 -11 5 -69 -15 11 24 -16 8 73 39 0 -3 20 35 -41 -21 27
3483B7K9q2KN3J0l4o2P8L3o8j3K4M7k8m8L6L4k4o1K4M8k4l5K3M3j0m4l1O5j3l1
$$ 27 56 -26 -24 29 39 5 -57 21 54 -14 -27 -3 44 16 -32 4 38 14 -47 -23 25 1 -34 -11 32 22 -22 -53 12 -1 -32
3514c2k1M5O0o1OK6L5o1j7M4K5o5l1N0L5n3l3N1M9j0p2K3Rl0KJO1k0n3J9M4mn9
$$ -32 -53 -8 52 -9 -3 23 58 -3 -20 24 49 -16 -47 3 38 -15 -48 3 52 42 -30 -7 2 -28 -26 -25 36 16 -37 -18 26 22 -37
3547c7K0M1J6o3J6L5jk7j5L6J4k5l2L6K3l5m0K8M4k8%k9N9Kn0NM5k0n6K0L5k8
$$ -37 -17 24 40 -23 -7 28 27 0 -15 21 35 10 -22 14 37 2 -38 -10 34 6 6 -23 36 38 -12 -7 38 18 -38 -18 17 -11
3579a1k5K3K5K1m1k1M9L4o5j7K6J7j0l4L3M1n2j7J8M1k2l4RN1k8k9kM8jo0L2J9
$$ -11 -36 -13 12 33 -8 -29 20 54 -11 -28 -2 15 5 -29 4 45 -7 -24 -6 35 13 -21 -12 39 11 -18 -20 28 27 -33 -1 18
3611A8J2n5K2J9Rn2oM8LPn7K3J5n7J2L9K6m3j9M3K5k4n0L0M6l7j5j2J5L0k7J8
$$ 18 30 -25 -3 16 25 -27 -33 15 18 25 -32 -9 6 -51 -39 0 26 -17 -36 7 32 8 -42 -12 34 -3 -18 -30 -15 15 -12 6
3643FK3J2ll8P4m3n0k9L7N6o3MK4L3qm1PK0j2l5J4L6m5nNM4K8p5K6K9J5q2J5L5
$$ 6 29 41 38 0 74 31 -19 -48 -11 45 -18 -14 10 43 35 -6 1 21 9 -26 -12 24 -21 -26 -21 23 51 -24 2 31 46 -36 -21 14
3677A4j1l1j1N1J6j8l2N5J2p0k1N1L7m6KK5nj7n%K0pk5M2J8m2ljL1j1j6jm%l6
$$ 14 3 -28 -39 12 28 10 -22 33 45 -25 -46 5 42 -4 -2 23 18 1 -4 -4 16 9 -16 26 44 2 -1 -2 29 18 2 1 -3 -3 -39
3712c9L8K7K3l4j5N1mm8j6J4j0J4m8M2K0Lj1QL6j7m0NJ6k8j7oM5nOLN1m2j8jk
$$ -39 -1 26 49 15 0 51 47 -1 -17 -3 -13 1 -47 -5 15 18 7 15 51 34 -6 -1 15 -13 -30 -36 9 4 10 13 64 22 4 3 1
3747AJ0k5j9M7km6mM6K5m3J3NK0k0n2L4K8nl0NL6l4jqM8nj5m3M3L2m2nPKl1J3
$$ 1 11 -14 -33 14 12 -34 -38 8 33 -10 3 8 28 8 -44 -10 18 13 -17 -12 24 -10 -11 -19 29 24 9 -34 9 41 -1 -6 1 3 -28 -15
3783a5K6qRm5M8L2l4k8J1%k2l1M1J7J8l4JK8Rm0PO5m0l2LL9nm3J7M0K7k4l4K7
$$ -15 11 3 12 -33 15 47 13 -15 -4 -4 -26 -57 -16 1 19 -15 -14 14 23 -17 -10 55 15 -17 -14 25 20 -23 -6 34 61 37 3 30
3817C0J3m2k3J3Kqj2J7M3J3o1K1J5j1k1J5qNl8J7O4j7k7rO5m1l0rNQJ7j7K0Nj5
$$ 30 43 1 -22 -9 -7 -15 -27 -10 33 46 -15 6 21 10 -11 4 -4 1 -37 -20 44 27 0 -9 56 15 -15 -24 -19 -11 6 -11 9 14 -1
3852al1J2M7m1j0L4oK3l5K7Lj3k6J0L5k8l4J8KL6m2qM3Pl3rJ8Pk0PK3K6n0J2M8
$$ -1 -32 -20 27 -14 -24 10 4 27 -8 19 22 9 -17 -7 28 0 -34 -16 -14 22 -20 -28 15 22 -11 -20 -2 5 -15 -8 15 41 -9 3 51
3887E1j1k4l0lM3k3qoL1nk4J0L4Qo6NM3k7j8RJ9Rj4LJ2k9jk1jN7kk9NL8l4m1J3
$$ 51 40 16 -14 -17 26 3 -5 -11 20 15 -9 1 35 43 -23 -18 25 -2 -20 -11 8 17 3 6 18 -11 -12 -33 -34 23 21 -8 -3 35 1 -40 -27
3924b7L0nnm0P3qm1K6L1pl4J4J1J2m0QJ9jk2j1M1Pj8k9K6K1l8l5L3M3m8l3L4K7
$$ -27 3 -2 -7 -47 26 18 -23 3 34 27 -7 7 18 30 -10 -2 17 16 -6 -17 24 31 13 -16 10 31 -7 -42 -9 34 -14 -47 -13 14
3958A4J8p6J6M5m1kJ2L6l6kj0L3j3J6MK1j9k8JMJ9k1j9J8J8mkk2L3k2nJ2J0K2
$$ 14 32 -44 -28 17 -24 -26 -14 22 -14 -16 -26 7 -6 10 14 35 16 -12 -11 -7 12 -9 -28 -10 8 4 2 -20 13 -9 -14 -2 8 30
3992C0l2J5K6l6%j8J1Qjm0M6Jj9nL8Ok1l0RK7k0j2J6M2l0rrK0J0k0k2P2l9j2j
$$ 30 -2 13 39 3 3 -15 -4 4 3 -37 9 10 -9 -14 24 30 9 -21 -12 15 -5 -17 -1 41 11 2 -7 13 23 3 -19 53 14 2 1
4027AK0Rn2K7J2J9m1k6M9rk0J0J3J6j3l5J0K6n7L1J3Ml6M0Mrkk1K8J2lk0j3J7
$$ 1 21 30 -22 5 17 36 -5 -31 18 9 -11 -1 12 28 15 -20 -10 16 -41 -10 3 7 -29 11 15 6 4 -17 11 23 20 0 -13 4
4061DJ0j9l0L1J8ok2K4J6qk6K8k3J0k8L4Mlk4J4M7n5j1J3lj1j8lM5K9k9n2N8k5
$$ 4 14 -5 -35 -4 14 8 -14 10 26 18 -8 20 -3 7 -21 13 17 14 -10 4 51 -4 -15 -2 -5 -16 -34 -37 8 37 8 -44 14 -11
4095a1j2K4M1l6k2QROJk0lM7n3%jL7k9j7M2J2jk3nL2k7j3jL3J8l9j4JK3j4k7L3
$$ -11 -23 1 42 6 -16 -8 1 7 8 -12 -15 32 -21 -21 -22 15 -14 -31 11 23 22 -1 -6 26 -1 -14 -15 18 36 -3 -17 -16 7 -7 -34 -1
4131aJj8JOK6k4k0N1j5l2J1nL6l2pRN2k2ok9J3K7k3J2J2j3l0M1Pl5j3%K6RMlK6
$$ -1 0 -18 -17 -11 15 -9 -29 22 7 -25 -14 -19 17 -15 -22 -13 39 17 11 -18 -5 22 -1 11 23 10 -20 21 28 -7 -20 -20 6 15 19 16 42
4168D2k5Pl6J2J9k7j%L4l7j3J7j1K2oj1O5l9k5NK6pk2J7J3nj2Pj3K5%n5N8k9O
$$ 42 17 24 -12 0 19 -8 -9 -9 25 -12 -25 -8 -19 3 -3 -14 51 12 -13 -8 18 11 -11 6 19 14 2 9 -4 21 21 -34 24 -5 1
4203AnL4l7n%K6k6K0j7NL1k8k9J5K5Om4J1L0j2oQJK0l1J0NOl6K1J6oLk0M5%n3
$$ 1 -4 30 -7 -12 -12 14 -12 8 -9 -4 27 -1 -30 -15 10 16 -28 -17 13 1 -5 3 4 24 -7 3 8 14 -22 -1 15 9 12 -8 37 37 -16
4240a6K5j8L2J3o1K4Jrj2K0rJ3qoK6j0j3PlK4l6%K3K1l1j1K3ork0K5%K1k1Mj7
$$ -16 9 -9 23 36 -25 -1 0 -9 -21 -1 -10 3 -5 -11 15 5 -8 -1 -4 20 -16 -16 7 28 -3 -14 9 3 -6 -26 -1 -1 20 -1 3 -14
4276a4klK3K2lm8J2L6k1k5K3L3mj3j6J7klj9K7l3L8k2K4j0km1J1L7k6J5%j0Km0
$$ -14 -16 -19 4 26 23 -25 -13 23 2 -23 0 33 29 16 0 17 15 12 -7 20 -13 25 3 27 17 15 -26 -15 22 -4 11 11 1 3 -37
4311c7K2M1j4n1K5N0Jl2oJ5J4k5%K5K8m8j6K4j9PKJ0Qqk2PN0m2j5QL9l7j6L2m
$$ -37 -15 26 12 -39 -14 36 37 5 -1 14 28 3 3 28 56 8 -8 16 -3 4 6 16 24 16 -6 1 51 9 -6 2 41 4 -12 20 16
4346A6j7Rmk1L4j1k5J1L6j8m4N6ok8ROK0j9j9J8J8ooJ1J6j1k9KM8n1j3K6K2l5
$$ 16 -1 8 4 -17 17 6 -19 -8 28 10 -34 22 16 -12 -3 3 23 4 -15 3 21 15 9 20 36 25 -4 -2 46 -5 -18 8 30 -5
4380ej5J7J5kl0K3LkJJl6L7nrJK4Jj6pL7k9j8M3j1j3pnOK8m5J8L0k2k1K2Rj1k4
$$ -5 -20 -3 12 10 -20 3 6 4 5 6 -30 7 2 -7 -6 18 19 3 -4 33 4 -14 29 18 5 -2 -7 -1 27 -18 0 30 8 -13 9 18 7 -17
4418a7j2O6l1Mk4K7nj0j4K2J6m5OJ2j0jJ7j1M0l8j8L0N0m2m3K2L0ll0J0N1k3j6
$$ -17 -29 37 6 10 -14 13 8 -2 -16 6 22 -23 -17 -5 -15 -16 1 -10 30 -8 -26 4 54 12 -31 -9 21 18 -12 -2 49 26 10
4451A0NqOj1LNJ3k7j5M4nk7pJ0N5n9Lj4M6n1kL9k1K7j7qK7k5j7JL7Qk1RK6j8l0
$$ 10 15 7 13 2 5 10 23 -4 -19 25 20 -7 -14 -4 51 -8 -5 -19 27 -24 -26 13 -8 19 2 -6 21 -4 -21 -20 17 25 4 13 39 21 -9
4488iJ5K0l3mJ0k7N1j9j0NNj1j5LN2m0KJ0%J8m6J4L2j5k3J5kqqLK0Qk1J7kJ8k0
$$ -9 6 26 -7 -11 -1 -28 23 4 -6 -1 4 -7 -22 -19 33 -7 -5 5 5 23 -23 -9 23 8 -15 0 -2 -10 -18 -15 5 13 -8 9 7 25 5
4525EqKM1m6k8N2M0o3LoN7m9%J7mL6n6LqN1m8NK2jj8KJ8j9J5mk7L0qqK0pj1k2
$$ 5 -3 -1 40 -6 -34 18 58 -5 -2 -8 49 0 0 17 13 49 -7 -4 -12 39 -9 -4 18 17 -1 1 19 0 15 11 -16 14 6 -2 18 11 0 -22
4563b2K0L2l7Rk5M4kj9J3J%ok3J5K5l4L6m%nk4K8j6J0k5NRj0L5m2L2j8opmL0o4
$$ -22 -2 30 -7 2 -23 21 19 0 13 14 14 8 -15 0 25 -9 27 23 23 18 -6 22 6 16 -9 -4 5 -5 30 -12 20 2 -4 -11 -15 15 -49
4600d9N4j0K9l6L6pLj8J0Lk0J5j0jK7j8j9L0jJ7l2J3K1l3k0L9j6j2qN6jl6k8J9
$$ -49 5 -5 24 -12 24 17 20 2 12 15 -5 10 0 -1 26 8 -11 19 18 35 3 16 37 4 -16 23 7 -5 -13 43 42 6 -22 -3
4634cJ4Nj8J2n%l5L7j1Jj8qL6Jj4KJ7pj2J8J6j0j0l4M8Pl2j7L1J9j8jk7QOj2Q
$$ -3 11 16 -2 10 5 5 -30 7 -4 -3 -21 -29 7 8 -6 -4 13 6 -6 12 28 18 8 -26 22 29 -3 -20 11 30 12 11 -16 -8 -2 -14 -6
4671fJ4J2k2kJ3J6j0m0N9n1K3j1M0n5K3nPJlj6J8PQl8K6J5k0OK5kk3j3J4MJ2k7
$$ -6 8 20 -2 -4 9 25 15 -25 34 -17 6 -5 35 -20 3 -2 5 6 3 -13 5 12 20 -18 8 23 3 9 34 32 9 -4 10 14 26 -1
4707aKQj5J8ljRj1j4K0k4rJ9jRRnJ9pl1k6K1L2l3RM2l6J4m0L5pJ0j7PJ9%j0Mk
$$ -1 1 9 -6 12 9 8 17 6 -8 12 -12 -21 -2 -3 6 15 10 29 22 -9 -35 -14 18 -15 -6 36 0 14 -26 9 2 12 -5 2 21 21 11 15 13
4746A3MJ6k2Rk4lLK1j1oJ6K1j6k3Rj1K2j0nJ9Lj5k9oJ2L5l9K2qK7n1K8K0qrjJ4
$$ 13 17 33 11 20 -4 -7 -4 17 6 0 16 37 21 -2 7 -4 18 8 3 22 25 10 -19 -25 -13 22 -17 5 -3 24 -27 1 21 13 4 3 17
4783A7j7J4l9J5L0j5j5J8j4OKMj6QlmJ6K5j5k6M5j0l7J4Mj0j1JL0j4qpN0k9k0
$$ 17 0 14 -25 -10 20 5 -10 8 -6 0 2 6 -10 -2 -5 -9 7 32 17 -9 36 26 -11 3 7 -3 -14 -13 17 3 -5 -12 38 9 -11
4818a1K0pk7J3j3J8K9k4K1j1K5j5j0qK2ml5J4J8Ll8J7rK6j5%J3Nk3%K0k0NmJR
$$ -11 9 2 -25 -12 -25 -7 22 -2 19 8 33 18 8 0 22 18 -17 -3 15 18 -20 -3 -12 14 -1 -1 12 17 -6 -6 14 -6 -1 -5 -4 5
4854Ej5qJK7Pj1jNqk6M9m2J8j2J0QK1k5j4L1jj1oJ7j0ok1J5kONmJ2Rk7pJ4Pm4
$$ 5 -10 -18 -17 10 17 6 5 10 2 -24 25 -17 1 -11 -1 7 28 3 -11 20 19 8 2 19 9 3 -18 -3 -5 1 6 2 14 23 -4 -11 3 10 -34
4893c4MK3KKj1J5Nj1K1k1k5KQL3j0j9KqK3j0J7OOj4k1J5J1kOn0M4j2k8L0mJ1p
$$ -34 -30 -7 -5 -3 -14 1 6 -5 16 -5 -30 -28 -20 13 3 -16 -14 -22 1 -9 8 14 20 6 -15 0 11 9 15 -35 9 -3 -31 -1 -5 6 -1
4930aoOK7m0J3MJ5k9mJ3K7k0j8RK3nj4J0j6Njl2L2k1K6K3MLm7M8Pk7m8K9L4ol3
$$ -1 -7 -1 26 -14 -1 3 18 -11 -15 -2 25 5 -13 -4 19 14 0 10 -6 -1 -2 -34 -2 -23 3 26 30 33 -14 34 41 14 -34 -5 29 23 -10
4967a0NML8n1J5K4j4k6J9J6k5jk4K1K0J7l1l%j6L5qqL1l6kJ6K3o3K6OJ4k6NPK3
$$ -10 -5 -1 37 -14 1 25 11 -15 4 20 -5 -6 -30 -9 11 28 -3 -6 -6 -22 13 5 -3 28 -8 -10 6 29 -34 -8 -2 12 -14 -9 -2 21
5003B1Ll9J8L6m5nK5j9j8K0J7J1j7k7L9J7l8j0KjJ3l1J0QL4k1J1jJ5l5oJ3QJ8
$$ 21 24 -15 3 39 -6 -11 14 -5 -23 -3 14 25 8 -19 20 37 -1 -11 -9 -10 3 -28 -18 -10 24 3 14 13 28 -7 -13 0 8 26
5037B6m7K0nL5j9KNpl3M7J8k1j8j0PRJkK0l2Oj5K5l5K2pJ9J6l1MN%j8kLJ5qK0
$$ 26 -21 -1 -6 29 10 12 17 10 -23 24 42 21 3 -7 0 9 10 8 28 -4 2 -13 12 -23 -1 -8 11 27 -4 0 5 5 -13 -15 -12 3 -5 15
5075A5j1Qj4j3L2Ll6L5l2K0j9PRK6m3J1K6Ql1J0Lo%j2MK3rj6NL1k6pQqK1m2J0
$$ 15 4 12 -2 -15 17 20 -16 19 -13 7 -12 -5 4 30 -13 -2 24 32 1 11 14 8 8 -4 0 23 14 -2 3 34 8 1 9 1 22 -20 -10
5112a0L0j8J0k8K6J4l5J5qL3k0m8J8L0Kk9K0J5Jpj2%J5j1LK6Mn7J2pL8Ok3OjK
$$ -10 20 2 12 -16 10 24 -11 4 -4 29 9 -39 -21 9 11 -18 2 17 18 11 -1 -1 14 3 6 32 36 -21 -9 -16 22 28 5 11 10 12
5148A2k9J7NJlQrOk2L3jk3RLmJ1l2K0rK1k8J7%J1l9K5J7j0j5J0L6k5%lKrj0jr
$$ 12 -17 0 5 6 3 11 2 8 -14 19 18 -5 4 7 3 14 -18 2 -7 14 -14 3 3 14 -25 0 17 7 -8 2 38 13 13 10 12 3 -7 -8 -17
5187a7L8k0nJ9k9j0MKkJ2k9K8K3oj2oP%J5j1J8k4PmJ7oJ2j5mJ5Lk0mlK7lj0kL
$$ -17 21 1 -4 15 -14 -24 -20 -18 -20 -8 -37 -9 14 8 -4 -10 -3 -3 12 1 19 -5 2 -2 15 9 21 6 2 17 20 0 -4 -7 20 17 7 5 8
5226Hj1MJ1nk9K1qpkK4oOk7M9k8Qj4m%j5J9k2K1kK1K3n9L0J6j8j3N%%j4K5j1J6
$$ 8 -3 1 12 7 -22 -1 -9 -16 -18 6 0 6 -21 28 0 8 -6 -10 -10 -25 -6 -28 -7 -9 12 35 -24 6 22 4 -9 -4 -4 -4 -18 7 -4 12
5264A2j5K0j3l5L4%J5l8KQQmJ0kMLk4ML3k1kPJ2Jj1Kj9j2J3K9k0K0k9J1J2Lnk1
$$ 12 -3 17 4 -31 3 3 18 -20 -18 -10 -2 -6 4 2 6 9 -15 -11 22 1 -1 6 18 19 8 10 -9 -21 -8 21 1 21 -8 3 15 18 13 -8
5302hK0j1j1KnK5Ljk6K1kJ0l7K1j0nJKLj3mL2MQj1JNJ5l2Kpj1OM4j2j8j3oM2o
$$ -8 12 1 -10 -8 -13 12 15 14 -12 9 7 17 -20 1 -9 -14 -13 -11 -8 -21 -25 7 11 19 8 9 14 29 -3 -1 -8 -19 -13 31 19 1 -12 -18 24 18
5342A8l5K1J6k5J5k1K4k1PJ7%j8k8L1J9jk3J0Rk2p%L8j4J3l7J7J5Pj6j0K5j5j1
$$ 18 -17 4 20 -5 10 -11 13 -8 -1 16 16 -2 -30 1 20 19 -4 6 15 -7 -14 -14 24 10 23 -14 3 18 25 9 -1 24 9 -2
5376bj6K9J6j2j2K7j3jk2K5j3k7ML0Pk1lj3L8k5K5k3Lj9JL2m5J9k6K6K5jl8J9
$$ -2 -18 11 27 15 3 30 17 16 -6 19 6 -21 -17 13 20 -1 -4 -17 21 -4 21 -2 1 -18 -17 15 -30 -11 -37 -11 14 13 -25 -6
5410fK0k9%OJ5j2J5%j4K1pj4L3j0%rM%Pn3N9k4J5l9PM1o5M6k2J4OLk9K0L2l2r
$$ -6 14 -15 -15 -9 6 -6 9 9 -5 16 9 -5 28 18 18 9 13 13 20 -33 26 2 17 -22 -15 26 -39 7 -15 -1 5 8 -21 -1 31 -1 -10
5447a0Rj3j1K7Kj6PK7j5qJ7k1JJ4j1Mj7L8k7J9J4k4j2K6Oj7okK1KJ0k0j4J0j8
$$ -10 -1 -14 -25 2 4 -12 -5 22 7 -1 16 -5 -4 10 -1 3 -14 24 -3 16 30 6 -6 20 26 9 3 1 22 24 34 14 0 10 -8
5482hoJ9KrK8n3M9jm2RL7k9j4L9l7L7l0LNRlK3k4nMj2J9pmJ3j7M2k5jJJ0Kk5l
$$ -8 -14 5 7 -2 26 -27 22 21 -21 -12 25 -4 -18 21 -16 21 -9 -6 -1 8 5 28 4 -1 3 -9 10 3 -1 12 -5 37 12 11 12 22 24 -1 -4
5521dJ0J5nj6NNjpPPl0L1j9K6j5j5J0LLk6K3NmJKkMk8L3mK8n1J0j1L6Lk6QNj9
$$ -4 6 21 16 0 5 10 9 2 9 16 -14 17 -2 24 9 -6 4 7 10 -16 7 12 8 9 11 9 13 -15 18 14 42 -9 1 -10 26 29 3 11 16 -3
5561c%J0RLj0opj3K3j4K7l1mLK5k8J3L2m5K3j3K4k4LpJ7l2L0jRj5oJ9k0K9j3J2
$$ -3 -3 7 16 19 9 3 -4 -17 6 -8 19 -12 -16 -13 12 -16 -3 29 -16 7 -6 18 -6 -3 -10 7 -25 5 4 13 -2 -8 11 -9 20 7 19
5598A9Jjpk7ML5lk3OL3k7j7kk3L0j2mJ9OLkl4J8oMk0J7K0prnNpL8k2onJ0K3l7
$$ 19 20 19 12 -15 -11 24 21 -2 4 37 10 -7 -9 -32 -2 -14 -18 1 7 10 8 -26 -8 -14 -10 -30 -13 7 0 -9 -14 -9 -16 22 0 -6 -11 -1 22 -15
5638a5L3j3J2MOj0nk6OLJj6J9j4kL3lj9MJ4j3j6J8l1M7k3j1L0k0PQj2J9ok5K0
$$ -15 18 5 17 21 27 17 12 -14 -8 -5 -4 -20 -1 -15 -17 16 13 -6 -2 12 -1 -17 1 -30 17 -6 -17 13 -7 0 8 -4 15 9 -16 4
5674DJ3l4K8j0jJ4j2Lj2J0J0l7L8J7n2PK0rrJ4j4Oj0OrL5l3j6K5K7l5J2pK3j0
$$ 4 17 -17 11 1 0 14 2 5 -7 3 13 -24 14 31 -21 -14 6 -3 -12 2 -12 -6 -16 -10 -19 16 -17 -33 -8 19 -16 -4 -11 12 2
5709Bqlj3L2j7K5L%j1k1L2j2Mj5PJ6k3j1L4j1Kk3J5j7L2l3K9NJ4l0Lll2J5jK0
$$ 2 -6 -9 -22 10 -7 18 21 21 10 -11 21 9 13 -2 5 21 -2 -13 21 10 12 -11 4 -13 19 -14 15 20 34 4 7 4 -28 -13 -14 6
5745Fj2Qnj7K0J1l0K5j2mmJ5Nk5K9porK7k3J8m4M1k4L9j1m4L0J3Rk2kJ7j1j5J7
$$ 6 -6 2 -3 -20 0 11 -19 6 -6 -10 -14 1 6 -19 10 3 -3 -12 15 -8 10 -34 7 -17 22 11 -33 -3 10 19 -3 -5 12 1 -14 3
5781CJ8qj3pMplJ3J6k7K9k2j3K4mk0MK9l2OJ6Mj6KJ5K2j2lLPj6poJ2JL%j4M0k6
$$ 3 21 13 0 -7 -3 -10 -13 0 16 -11 18 -4 -17 7 3 -17 -13 16 -16 -10 6 10 -6 -4 11 33 21 18 21 28 12 5 -1 11 12 15 15 1 41 15
5821A5qj3QPj6KL5o2K0K2%Rm1J3Qj8K8k0K9Jj1m5M6nloK4J2l7J4mJ4j7j2J0K3
$$ 15 7 -6 2 9 -7 -5 30 -32 -12 10 10 19 -22 -9 -1 -19 9 -11 18 19 8 -37 9 4 1 -5 19 31 -6 8 4 18 1 -11 -1 22
5857B2j9k9J2J4L0n5K7rQj4J7J4Kj5l4M2j3k1L4k1mML1j7Kj0j5J7L2l9J1%j4J1
$$ 22 3 -26 -14 0 30 -25 2 -7 1 -13 4 18 20 5 -29 13 0 -21 13 -8 -12 -8 23 6 8 -2 -17 0 32 -7 4 4 -10 1
5891Aj8L1oqjJNj2J5opK4k6JK5j1k2JK5k2j1j5K1NRQj1Qj5J9j7J6Jl1M1k1Jj3
$$ 1 -17 14 8 0 -1 0 5 -7 8 2 -5 19 -7 -6 19 8 -14 -13 12 -10 -21 -36 -15 -10 -1 7 -4 4 -11 8 -9 7 8 -23 18 -3 -2 -15
5929a5LM0l1j0RJ2J9k4l0L9j2qJ2K5k7Pj8Qk7ML7Pj1rK2k4jPK3k9qJ8roK0k8K3
$$ -15 -12 28 -3 -13 -4 8 27 3 -27 12 0 -8 4 29 2 9 -9 -1 -28 -24 13 20 9 0 22 -2 -3 4 27 -2 -10 8 -1 -7 13 -15 8
5966HNj5L0jk7K7k7mrL1nk6J8j5M3l7pQJ8l2K0k0ORJnPj6jK3Rj3j0J2mK9j5J2
$$ 8 13 -2 28 27 0 27 0 -4 -13 18 13 -13 5 -10 33 -4 -11 -3 15 -17 3 -17 -11 -2 -1 -6 1 -15 -16 7 16 3 -7 5 1 30 15 27
6004B7k9kj%J6j7opK0j3pJ3j1RRQlJ5l7J9rL3l0K5j5POj0mMjLQj9K0l7J8j1J6
$$ 27 -2 -4 -5 -5 11 -6 -12 -19 1 -12 -19 -6 -17 -8 1 9 6 21 -16 3 -6 27 -3 22 7 14 20 10 6 10 9 12 20 1 21 -16 2 -9 7
6043Gnl4J7LK6l3J6K8m7J4J9J9j6nJjoll%L%j1LK9Jl1K8j3j1j0M2m4J9K5l4L5
$$ 7 2 -32 -15 -12 14 -19 -3 25 -22 -8 11 30 14 9 10 9 3 0 -3 -3 0 0 -11 -8 21 22 -9 19 6 -5 -15 27 -17 2 27 -7 28
6080B8m7L2k0J7J4l2J0j7J9j1rj2qJ9J2J2j8oL9j7j9J4L5l1pJ0nk3L0j1j0K7k4
$$ 28 -19 13 -7 10 24 -8 2 -15 4 -7 -16 -28 -36 -17 -5 7 -11 -17 22 5 -14 0 35 4 -3 7 2 -21 9 -2 -12 15 -9
6113ikQK9l4J5k7J8L4m0k0J6LLj7L4lj6j2L0j6J2rK8l5kl2J8M0pMl1L1J0j9j6
$$ -9 -11 -3 26 -8 7 -20 -2 32 -8 -28 -12 -9 -6 -23 11 8 -8 -20 10 -6 6 -3 25 -10 -12 -44 -26 14 7 11 -20 11 21 2 -14
6148a4JJ6j5K4k1kMj1K7j2j4J4kJ5lPl6K4onKPPj3PnL1m8J5J1Oj3MLj0lNMOJ2
$$ -14 -13 3 -12 12 -9 -11 -7 -18 9 -3 -17 -3 -5 10 7 14 -22 2 -4 -9 -7 0 7 -6 1 -4 27 -21 -6 5 11 -2 2 5 -5 -8 -3 1 7 19
6188A9k2QrK5k4Oj9L9k0lJ4rJ3m4K9lKj1nL4j7PJ4pk7JJ8j3llJ3mK4k6K0J0l3
$$ 19 -3 5 -4 21 -3 3 -16 23 3 0 14 5 18 -26 3 0 2 -9 -14 20 3 10 24 17 -10 -9 9 -4 -7 -10 3 -1 23 -3 17 27 -6
6225fL8k5Rjk6jK2JJ1%k1K5k8nL3k9QpJ0j9L2oj6JJ7k8jJ3kmj9L8j7oKP%J0Kj5
$$ -6 32 7 16 15 -11 -12 10 11 22 22 1 26 -2 -7 26 -3 5 -2 8 -11 21 15 -1 0 17 -11 -12 1 -1 -5 -24 14 -3 -9 -7 0 0 10 12 -3
6265ck%%j5M1k4j7K9%j7L6j5oK4l7JJ4Ol2Nj0K0Ol0RMJPmJ0J5k9MN%j4J0J8j9
$$ -3 -5 -5 -5 -20 21 -3 -20 9 9 -8 28 13 7 31 -6 -5 9 15 -17 -12 -22 -2 4 -26 -17 -13 -12 -5 -9 1 16 -13 -9 -4 -4 -18 -8 10 -9
6304ik6K9RNj2NJ1ooLOkmPOk4J8j7J1lk3J8j3jJ4Pj3KJJ2Jj4KjjNkoJ5pM7l5m
$$ -9 -35 -6 3 8 -4 1 12 6 0 3 9 7 3 10 16 -8 10 -7 4 1 -22 -4 -17 -18 -4 3 -10 -8 -7 5 6 -8 -6 -7 -8 -3 -5 -11 4 -3 44 9 5
6347Ej0j6J5pM0j2j5j4%QJ0j0Mj2J2J5nJ4m0MJ0JLJj3L2k2k6J6%KjJ3j2JLJ3q
$$ 5 -5 -21 -6 -13 27 15 0 -14 -14 -6 4 -6 -2 -14 -2 13 8 22 -18 -14 -4 -3 0 1 -12 20 -2 -28 -12 -12 -10 -11 2 -10 -9 -6 7 -1
6385aMj2RK9k7j6%J1mkJ2QOj8MqJ0k3L1j4KL1l1J5j0M%k3J2lLKJ2j7J1j0Lj6J
$$ -1 3 -9 0 29 2 -14 -14 -3 -7 -9 3 11 17 -1 3 -5 5 -18 13 -1 1 32 1 16 6 10 10 -13 -1 -4 -1 1 13 -4 7 -3 0 -16 -15
6424a5lOK0k6K9k1L0mj6oL8k8k7M3%llrK2k6RrlJ2nk5K0Rk9J0J1O%k3K1Lj9J3
$$ -15 -18 -12 8 -18 11 -10 20 16 0 -6 32 4 -23 20 20 17 14 5 27 1 10 1 -2 10 5 -20 0 9 -20 -10 1 7 7 -16 5 8 -11 2
6462BLJ0l8PJ4jJ9k9LK1k6K0j6J6j8j2L9j%j7K4l0j4M5m0M6J1m0mK0Pk1jJ1j7
$$ 2 5 15 -23 -16 -2 -3 16 -13 -10 11 -15 5 -11 5 -13 -25 14 13 13 -4 20 -10 -24 21 -19 27 38 -2 -6 14 21 0 -1 10 -7
6497gjk2K7mMK7n7J4Rj0M2Lj2mpqOl5M0J1kl5L3k2J4PqnK1k3K0rj0QL5m7j5K8
$$ -7 -8 -30 -3 -7 -3 24 -33 -19 -10 -20 22 25 13 9 2 -6 0 -35 5 16 14 -21 12 -10 4 11 3 -2 19 -4 16 7 -3 5 40 -7 -22 6
6535Fj0J5j8K5l4K7jQl4RJ2PJj9%j6RkLJ5oOj5J7j5%lM6l4j6M6m5K6l1J4K5rk3
$$ 6 -4 11 -7 18 -16 11 10 18 -16 -7 5 12 13 -6 -6 -22 -13 -15 -12 3 -3 3 -12 5 -10 -10 -13 33 -1 -17 29 -16 10 -21 -7 18 9 -14
6573a4J1K7nj1k8N7n1J6J3k7J1J6jj2Ok4K4Lk8J1pLj0JK3NJjJ3Rl2j0L4%j6j5
$$ -14 -3 24 19 8 -20 37 -14 2 15 -12 -1 15 14 2 8 -16 8 11 -17 -6 -13 -10 -20 -19 4 9 10 9 22 31 -1 -11 23 23 7 -8
6609hJ3j8K9k1M0k4l8J8J1jk2J2QplK3lJ0j2qqL%Pj8pL0J%j9J8J7l4J7Qk0J5j9
$$ -8 5 -13 16 -5 35 11 -27 -9 2 1 -21 -9 -1 -8 -11 12 9 19 7 -1 -9 -6 -6 1 -17 -24 6 7 7 -12 6 23 -11 6 14 -6 9 -10
6647a0M9k6J2j0ljlJ6qj1j4K0J1j9mL4m4J4Rj2RJ2pj6JKj6MK6l4RJ3%Pj3NPnL1
$$ -10 39 13 25 15 12 11 8 24 16 5 -9 11 22 3 -1 33 -11 3 12 0 9 21 14 -2 -1 1 -15 -11 15 -19 -10 3 3 10 -3 2 9 4 35
6686C5m4%L0ok4L1j8j2L0k3J3Pj2jKj1MK0l8K4K0l7j6M7oJ0k1jj9KK7j8oj4jL5
$$ 35 -9 -9 21 15 -9 22 4 -8 22 -1 12 19 7 6 8 -3 1 21 -17 7 27 -10 -26 21 15 25 4 3 -16 -14 13 -5 -11 -25 -26 9
6722Ijj9K1j3J7j9K8l6J2pkKKJ7j1J0jlj4QJ2Jj1KPk7NJ9J7Ol9PJONm1NJ8J0n
$$ 9 8 -11 10 -3 14 -5 23 -13 -1 -8 -10 -8 -6 11 0 10 9 6 -8 0 12 13 2 4 11 -16 -11 8 25 31 -8 -1 0 6 11 -30 -25 -7 3 -2
6762bmJ6j4J1mKj4MNK0j3j8LRqK4ol1N8l6JlJ3Ql5J5L%kMpK1j1qj1J7mkj6R%L
$$ -2 -6 10 -4 7 3 5 -9 -5 0 20 7 -11 -8 1 -7 17 11 -20 38 2 3 0 13 21 -14 1 4 4 2 6 -1 20 9 1 -10 7 3 1 -15 -6 -6 -3
6804ck4K4j5K6rkNj8K3Pn0L0K7l0O0k8j4J8k5oL5nRl5%J7j6j1M%M0j9%j4J8lj3
$$ -3 -27 -3 -18 8 -1 -3 2 -16 7 14 -36 -6 21 -9 51 23 9 27 2 -4 31 26 35 0 0 17 1 -10 -6 -6 34 15 15 1 19 16 3
6841Cj3J7jMoKJ0l3J7rRJ8j4j3k3M0j4k7M6l0pJ7L0j4K3k0lj7L2k4k2M0m1J8l
$$ 3 -10 7 6 10 4 6 16 -17 0 -9 0 18 4 -9 -32 8 -6 -33 13 -17 -24 -7 23 9 32 12 9 -8 24 0 -22 18 -23 -5 -8
6876hRk2K8J7l3J7pjk0OJ6Nj5JJ1J1k4nkK9MrQj4k5K4k9NM5j4j0MJQpqK3j1j9
$$ -8 1 -21 7 24 -9 8 1 0 -20 -14 2 7 -8 -7 4 15 -9 -14 -16 13 17 8 16 2 -23 1 -28 -23 22 8 -2 2 3 11 4 -4 19 8 -11
6915a1K8nRk1nj0K2lkKlJ8lol4J5LRJkk4QK8j0mJ0qNj2K0k3kK3Lk1J1rK4j2l1
$$ -11 17 12 21 0 -5 -15 7 4 2 4 1 19 16 10 -24 -9 -6 3 4 2 -22 -14 14 4 0 10 2 7 -5 15 -8 -10 13 16 -5 6 -3 21 9 -22
6955b2J0J6lk7M1l0L4Mj5qQK9l8J0qJ1k4J7Roj3K4k3NK5m0KK0k9K7qJ4nj1rM4
$$ -22 -12 4 1 -26 15 -15 19 23 8 0 8 37 -1 9 1 12 -12 5 14 8 -5 19 -4 1 26 -14 -12 8 -21 6 -2 12 7 -4 -13 31
6991C1l3k2N4j6J6j2J2l3J3j2J9rOj4Qj6L0m4L0k0K9Jqj4j6L3m1L1J0k0K2k3N
$$ 31 -2 -24 30 14 30 18 30 -3 10 -2 17 8 14 0 8 -8 22 -22 8 -12 17 18 10 -4 -20 13 -28 3 13 -7 15 -8 -3
7024cJ0Oj4j2nmL0l2pN9o4N2L1l0l7M8l1k5M0j2LmJ5l0L3n6P0jm9K6J2j3L1l6
$$ -3 7 13 -1 -13 -18 -22 8 -24 -31 28 -36 16 47 17 -20 28 -3 -28 12 0 3 -1 14 -16 17 -39 31 30 -19 7 19 6 37 1
7058AK7j1J3m6K1j7J8j0J6l2N2k6%nnL1k7J0k1J2K0ol1L7k9NK3k9K5j8K1k5J9
$$ 1 28 17 30 -16 5 -12 6 -4 12 -20 32 6 6 1 -4 27 0 10 -11 1 21 15 -16 21 -8 -3 20 -9 16 -2 19 -6 13
7091A3oj9J6J9k3Pj2J9l7RJ1L2k8pjj5PJ3k3N6j6Mj2Jkj7J9J3mJ6k5MJ1j5j0k
$$ 13 7 -12 4 23 0 7 -5 14 -23 -14 -3 29 1 -6 -7 -22 -15 -2 -25 31 15 19 7 8 6 -11 8 21 17 33 8 12 23 8 -2 -4
7127dQ%j9L3K4l2J2k7K5j6j0J5lJ2k2kNpj4L4kJ7l4j8L5lLJ1oqKoJ8nKqRLj5M
$$ -4 4 4 -15 18 42 10 22 -5 20 4 -6 9 6 18 -4 -6 -1 -8 -22 12 10 27 -7 -25 10 7 10 21 15 7 9 3 21 16 18 10 19 22 7 11
7167A1k9K7Mnj0K1rk2J8j9RJ8Om0M2l1K7l1JL1k8J6jpMj4kj0JK9Jj8K8l4J3j6
$$ 11 -18 9 13 8 -2 19 10 -12 6 -13 -4 14 20 -20 22 -9 18 -13 -12 19 -9 7 6 -1 3 -11 -13 -23 -22 7 8 -10 18 -16 -3 -19
7203a9jnN6j8Oj2Mj0j2K0Nk0K2K8n3K7pK1m5KmK2j2J8LOk9k0J7mJ1j0OmK4oJ4
$$ -19 -20 -25 31 13 19 7 11 1 -11 9 14 -6 16 44 -9 18 11 32 -13 -11 -15 7 -5 13 16 22 -7 -27 -10 -14 -3 -13 -7 -11 13 7 21
7240B1l7L2Kpj4L%K5k4ML5l7K3Pk2K1qk2K2%k0J2ok8K3Oj6MpK1j5KjRJ0l5J7k0
$$ 21 -16 16 18 11 -3 0 0 25 1 5 40 3 26 33 11 32 24 2 24 24 4 16 10 -18 5 11 -5 -1 -8 13 -2 0 -1 8 18 -17 0 -20
7278b0J7OLj5OK6Qk6JRmk1J7lj9L9j8RPj0nK6k2j5J6j6J4j4J9j4j5J9J1k6M0m2
$$ -20 -3 3 6 -9 -3 23 31 5 6 15 11 -10 7 4 -15 24 6 15 22 12 7 33 11 -4 12 -4 10 -4 15 1 -14 5 16 -10 30 -12
7314a2J7J1l1j1K3Kk0K6j9J8J8k1Oj2L3l7OJ7j9J6njJ2Jk7OKJ8j7J8j8pjpJ9p
$$ -12 5 16 -15 -26 -3 -1 -21 5 -14 4 22 1 7 -5 28 -9 -3 14 -5 11 6 5 17 18 -9 -3 -1 17 0 18 0 -7 -8 -15 4 -3
7350cK3j4j5MNRNk1J9j4%%JRJk1pK7J%ll0N7l2J4jPNj7K6m0NkNMJ8l0J3jj6J3
$$ -3 20 6 -9 -5 0 9 14 -7 12 -2 -2 -2 -1 8 9 -12 -19 8 9 9 6 -24 33 1 15 14 21 26 9 35 -5 0 -2 3 7 25 -5 8 7 -9 4
7391DOj0nK1j7L7l7j1J8j0k5K9k2K0Rj3L0l9OJ9j2mJ0K2qk0K2j3rpK8k7K7j4l
$$ 4 10 0 -5 16 -1 36 -1 -12 6 -4 -29 0 -22 -2 7 -6 24 -15 -9 10 -2 -6 4 26 18 -2 20 7 -2 -9 19 -8 19 5 2
7426Bj2J6NnNQM9l1k2m1N5m2N0P7j10J2L7m7j8L0l7K1j3J8j0%j6j5l8Q9m8P8n0
$$ 2 -10 6 11 6 11 19 68 37 15 -26 29 -13 37 114 4 16 53 6 -12 18 -19 2 -11 7 -3 -3 -19 -34 -72 17 -31 47 -3
7459cjj2n3R8m0J7pMmOJ1LMj2jPrPl5L7l9L6j3ROK1n3L6r1J53N9k07m5J66K0q8
$$ -3 -4 -16 -69 29 -11 6 -1 3 -1 5 16 19 23 11 10 17 8 15 -20 17 -22 14 1 10 16 37 -16 20 -71 82 141 -66 -111 55 75 -13
7495a3On2J32n6m0J7lK7%nMJ1k2Nrj0RK2k7J6J2l8K7pJ4j4j1K1j1j7J6j1qJ2J6
$$ -13 -7 -59 73 17 -23 -6 -9 18 18 13 17 28 6 11 2 -8 1 23 -4 12 24 -14 13 6 20 6 -5 16 5 -12 4 -7 -15 -3 13
7530A3j0Rpj0M1l6kj3MK6j9ML6k8j9NjL3Pj1lJ6k0k6L9l8KMlK4m8N6K2l9J2Nl4
$$ 13 3 12 5 -5 36 0 -2 -15 -11 15 -4 0 36 8 -11 -6 -7 26 33 22 19 35 15 -11 28 -10 -8 -4 -7 17 -31 25 47 8 20 25 -9
7567iML7n2J0M4l6J7M7m9mJ1j15Q1K6m3MK0M6j5J4l5JMJ1oNm0K4k2L7mpK2J51
$$ -9 -5 32 -20 -10 34 -2 15 62 13 9 20 -95 -14 12 -31 -27 -7 39 24 38 3 4 8 19 13 18 -22 2 -20 17 13 6 28 179
7601A79k84l9K35m4o8L7M8m5Lj0j4j2J1J5kk9RKqL8k4J7mj3oJ2K1qQk7j3J0OR
$$ 179 -105 -144 91 47 -21 16 64 19 22 12 -2 -14 -3 12 10 -19 -10 -8 -16 22 -2 15 11 -2 -8 4 25 17 25 -2 -15 -5 1 10
7635A0Nj8lRj4K1k2NK2j4K5l0Lj3K8J8j4j0J0j1qj6PJ3k2J9jK9k6kk0J4Rj1QM
$$ 10 15 -3 -6 3 -11 10 -12 -7 15 1 26 -4 -1 -14 14 32 18 8 18 7 -1 -17 -10 3 -19 0 -1 28 2 0 -20 -6 3 -8 0 4
7671DJ5oJ0k9M3l2j1%%lPj0L0rj8OK9Jj8pJM0k0l6L2lk5K6l0J8ooJMJ0k4QjL0
$$ 4 19 13 23 -6 37 5 -6 -6 -6 -9 -2 -12 18 9 -9 -3 26 27 9 2 3 43 23 -13 19 16 -9 17 -13 5 -1 -7 -6 -2 8 -16 -8 -9 21
7710B1k7J4J9j6Pj6J1l5K4OJ0j0lj0j2KL1mJ2l0j0J6Oj2K9m1J6mMJ3K5k6J7j8
$$ 21 -6 8 27 11 18 2 13 -22 2 8 18 8 5 -5 -17 -15 16 12 24 -6 -16 0 6 -6 23 -18 -2 -6 -2 11 36 10 27 9
7744IrljJj1M5k4k7K0JnQRk2K5mPj3kJ9ll6K5Ql2J9mqqRJK0j2Qk3K6j4J8Lj0l1
$$ 9 0 -3 -4 -3 -14 31 7 -20 0 1 -4 4 13 -9 16 12 19 6 4 23 20 -16 9 17 -15 4 0 -8 -16 -7 -6 14 2 10 -13 13 -1 17 20 10 -21
7785b1K5qK5k7J7K5k7RJ6j8k7MJ0J0Kj6lQpK2l4M0qJm0L9J0j8kK3Kk9j3QPJ4p
$$ -21 4 -4 21 -6 11 36 9 18 34 16 -11 -7 3 13 15 -1 -4 4 -3 19 -15 25 17 18 -22 17 27 9 7 30 32 3 -10 -2 5 19 12
7822A2rk3J0J9k3K4k2J9j2RpPOmLm5K2%J0K6rLj2Kj7K1J8l1NJ3lRj6kk1JK4jo
$$ 12 3 -20 -10 9 -14 10 -12 7 -5 4 -3 4 10 6 9 -36 -14 -14 -4 22 13 16 4 6 -11 10 28 -3 2 15 12 21 5 3 -18 -17 7 6 0
7861@j9J2lOqJK8m1J6LJ2JLoJJ5L%mk1J1j9j0K7j3j5j3J5L7j3J4Jj4o%j1NOkJ7
$$ 0 -19 -7 -10 -4 -12 -11 17 -24 -8 -5 7 8 11 5 6 21 24 24 20 -1 10 -9 -19 8 -5 -20 -33 -18 19 6 20 21 7 1 1 -10 -5 1 -1 16
7901A6j5lj8L6k3K7rQj4pj6K5j0K4l2J3Jj4L6m0L6j3J4nl8K9J3Kj9%K8rnj9PJ5
$$ 16 1 -2 -20 16 -7 20 11 19 5 -2 -18 7 -3 21 -11 2 3 -11 25 -15 21 8 22 17 -21 8 21 23 4 4 32 23 18 -1 6 21
7937B1k2K1j8Ojj1K1k7K0j4j5J5RPKk8J0K6qj0L6n4L1Lk2LK2j4l2K6oL2k5JL5
$$ 21 -1 20 2 8 7 -4 17 -10 10 -4 -19 -4 5 12 14 -14 -4 22 14 4 40 -14 17 20 -2 1 23 9 -23 3 -3 29 4 5 40
7972D0l1j0QJ8jj6k9J7J6k7J7qK5l6J3JNJ2m3N0JKm7L0rJ7llk8K6njk3L5Qj6J2
$$ 40 9 -1 7 25 24 8 -21 -4 12 -15 2 -6 19 -17 -4 -3 2 14 -29 21 22 24 -23 7 -2 15 12 9 -19 7 2 1 -22 13 21 5 17
8009A7j9j6oJ8nJ5J4lJ%j4lJ0J0K0l2j1pJ3m%L0l7J9J2j5j8K7k2J2j9OJKK4j7
$$ 17 -2 -18 -24 -6 -11 4 18 15 16 16 2 -1 9 19 39 7 -4 -11 2 -2 -2 28 -9 10 22 7 -11 16 -6 6 -13 -7 -6 -4 20 3
8045Cj0J3J7k4kJ5%j6J1LmOllk9K2M4n5K1OpK6l5J9j0j2LJ0Pk1K0Lj6k4K9K0j5
$$ 3 -7 6 23 -1 -3 12 12 -4 7 10 6 12 9 6 -23 -1 43 -12 9 15 8 34 -1 18 8 -4 -1 9 16 -5 15 18 2 -22 7 27 12
8082A2nMJj4mmK0j0j%J1j5j0K6K2j1Jj1j2K3l0JL1mLNk5%jJ4j6MnJRjj1J0rj0
$$ 12 7 11 12 -2 -6 -10 10 0 -1 -1 10 -5 -15 11 33 22 23 12 0 23 -7 -6 25 21 24 29 4 4 3 17 1 5 0 1 10 9 -2 8 -1 -11
8122a1oL6l3K5j8J6j1j0K9l6M4k8MK1j3J0kj0J0Pj4J1J3j9j7J0K1rmj4QmjrJ8
$$ -11 -17 19 -14 11 -7 9 -2 -12 17 -19 25 -3 1 22 9 19 17 7 17 24 10 21 34 15 -2 8 29 20 16 2 10 6 5 -4 14
8157A4m3K3K2nk7L6l4J5k0L0nj4J0rK7qk2J9j7L3ok4qK1Ol3M2kk8k3L1m0N0R
$$ 14 -29 -6 16 11 -16 20 -14 1 -19 11 6 -8 2 -7 20 12 -10 9 -8 25 19 -5 -13 8 14 -19 23 21 -7 -30 1 -39 11 20
8191B0
$$ Imaginary data points
##PAGE= N=2
##DATA TABLE= (X++(I..I)), XYDATA
0@%%%%%%%%%%%%%%%%%%%%%%%%%%%%%%%%%%%%%%%%%%%kMmMoJ0j3J4j4J5j6J7j9
$$ 0 0 0 0 0 0 0 0 0 0 0 0 0 0 0 0 0 0 0 0 0 0 0 0 0 0 0 0 0 0 0 0 0 0 0 0 0 0 0 0 0 0 0 0 -2 2 -2 2 -4 6 -7 7 -7 8 -8 9 -10
56a0K0k0K2k9L4l6M2n0O1p6R9j44K45o68n09N385M335k500m812K5R44m406n666
$$ -10 10 -10 12 -17 17 -19 23 -27 34 -42 57 -87 158 -510 -1019 4366 8701 6201 1389 1414 2358 -2048 -7714
79g714J128M732M93j969L096O036M35m464r07K668j571n738j464L920J411l028
$$ -7714 -6586 -1854 -1361 -3330 -234 5802 6237 1773 866 3534 1963 -3775 -5239 -1319 92 -2936
95b936q0M919K228l424j973K969J478l679k574K857K753k389k688K224K781k405
$$ -2936 -3016 1903 4131 707 -1266 1703 3181 -498 -3072 -215 2538 149 -2539 -315 2466 61
111F1l637J514L512j036k811K157M287m95l506K9K373j597m587q37L040Q68k113
$$ 61 -3576 -2062 1450 414 -2397 -240 4047 3552 46 75 2448 851 -3736 -4573 -1533 -665 -2778
128b778Q44M743K188k428j390J947j25m509l178J557J581j697o89L907L902o41
$$ -2778 -1934 2809 4997 2569 1179 3126 3001 -1508 -4686 -3129 -1548 -3245 -3934 -27 3875 3234
144C234j635J506J270k974m100k36J586j084j899J804L988J010j613O15K403p32
$$ 3234 1599 3105 4375 1401 -2699 -2935 -1349 -2433 -4332 -2528 1460 2470 857 1472 3875 3143
160C143l666j347J590j69k518j57L004J567j501m81K212J024k272j765J356J238
$$ 3143 -523 -1870 -280 -449 -2967 -3124 -120 1447 -54 -535 1677 2701 429 -1336 20 1258
176A258j729j533J568J906j184j821J025J743j034j911Q76K214k04j627N43J890
$$ 1258 -471 -2004 -436 1470 286 -1535 -510 1233 199 -1712 -836 1378 1174 -453 90 1980
192A980m72k340n31J302j84j836j12K240J241r64j47J830O60j969j607N81L25
$$ 1980 1508 -832 -1363 -61 -245 -2081 -2193 47 1288 324 177 2007 2667 698 -909 -328 -3
209cj733j111J478J786k01m24J414J477q57j779j66O00j028j744K28J670M21p28
$$ -3 -1736 -2847 -1369 417 216 -208 1206 2683 1826 47 -119 481 -547 -2291 -2063 -393 28 -700
227g00O51J830K79j452o13Q09k59j656o95J105P28o88j96J337R64p18q80N22O24
$$ -700 -49 1781 2060 608 -5 804 545 -1111 -1806 -701 27 -661 -857 480 1444 726 -154 368 992
246I92r32j182M46R84l66q46N23J139j31j014J49Q88j02j002j19Q64K15q26l04
$$ 992 60 -1122 -676 308 -58 -904 -381 758 627 -387 -238 650 548 -454 -573 291 506 -320 -624
265f24Q45L66p68m73O85N83o29n91O14P13n10o98L95O49l90p72K36P00q7p16J12
$$ -624 221 587 -181 -654 31 614 -15 -606 8 721 211 -487 -92 557 167 -605 -369 331 244 -472 -360
286c60Q03Q9p30j59O60K04p51l55O34L71n97l87O32N26m52n12M37N09l98o63J72
$$ -360 443 532 -198 -357 303 507 -244 -599 35 406 -191 -578 54 580 128 -384 53 562 164 -499 -327
307c27O02j89o60J69P84Q3o34rP30R0q27l30N31J11o28l12P25N64l31k77N94N02
$$ -327 275 86 -574 -405 379 462 -172 -181 549 639 -188 -518 13 124 -504 -816 -91 473 142 -135 459 961
329I61n44p68Q9L41m73p46L11R68J29l96M08Q87m0r52l51L64k84j002k82Q42N65
$$ 961 417 -351 -262 79 -394 -1140 -829 139 268 -128 280 1167 1127 175 -176 188 -96 -1098 -1380 -538 27
350B7k92Q2J035O42o39p55K17J27r26r55L83Q15j27l09P97J069o1q27j8N13n05
$$ 27 -265 -183 852 1494 855 100 317 444 -482 -1437 -1054 -239 -366 -675 122 1191 1130 303 285 798 293
371B93j156j92P45J45n56J23J063M72p28l52O43K49r18n76O73N53n98n37O35O07
$$ 293 -863 -1055 -310 -165 -721 -598 465 937 209 -143 500 749 -169 -745 -72 481 -117 -654 -19 588
391E88n92p93M22P72l13o49N02J111j44q98M6O39m20j278k83Q81J66o37L15J418
$$ 588 -4 -797 -375 397 84 -565 -63 1048 904 6 52 691 271 -1007 -1290 -409 -243 -880 -565 853
411H53O50o42l55N90j20j441j051L61M64n40j93J338J421q5n07N00M65j064j559
$$ 853 1503 861 506 1096 976 -465 -1516 -1155 -691 -1231 -1424 -86 1335 1250 743 1243 1708 644 -915
430i15k60M78m26p09O84J576N44m15K57R05k46j458p36L91q5r52j72J215Q78m28
$$ -915 -1175 -697 -1123 -1832 -1148 428 972 557 814 1719 1473 15 -721 -330 -415 -1367 -1539 -324 554 126
450A26j73R40N27r91r16M37M56p21p61O34R52l61p75L90Q36l67r23K14J063M1
$$ 126 -47 893 1420 429 -487 -50 406 -315 -1076 -442 510 149 -626 -236 600 233 -690 -476 587 628
470F28q25J73R70o1j207m61O58p3r71j49J171Q37l37o7R80N01j051j111M1J33
$$ 628 -197 -24 946 885 -322 -783 -125 -198 -1169 -1318 -147 690 353 286 1266 1767 716 -395 -354 -221
490b21r89q15P69J281J92j57R11J100l48j343l31J46p92j296n3J160N85k49N40
$$ -221 -1210 -2025 -1256 25 217 60 971 2071 1723 380 49 195 -597 -1893 -1946 -786 -201 -450 90
509I0J368M34r27o49K77k21j317p69P23O98l09j13J118R33m88p33K72M45p62j010
$$ 90 1458 1892 965 316 593 372 -945 -1714 -991 -293 -602 -715 403 1336 848 115 387 832 70 -940
529i40K44Q36k15o88M04R64r7r08L3Q14L1q39n7R67K59p85l67O54J01r73o03O41
$$ -940 -696 140 -75 -763 -359 605 508 -400 -367 447 478 -361 -418 549 808 23 -344 310 411 -562 -1165 -524
551e24N80l98j98R59R05l86p08K18K94q62j144M6P31p1m20P26J329K80o44o5M78
$$ -524 56 -342 -540 419 1324 938 230 448 742 -120 -1264 -1218 -487 -558 -978 -252 1077 1357 713 648 1126
572A126m79j311o03M93J61n55J26J284Q47l35k83N76J71j045r84J78L64n26m49
$$ 1126 647 -664 -1267 -774 -613 -1168 -1042 242 1089 754 471 1047 1218 173 -811 -633 -269 -795 -1244
591a244P45J070m9m78L79O46l88j040j16O10k07o97N7R26K40o47j12P30K10p90
$$ -1244 -499 571 522 44 423 1069 681 -359 -475 135 -72 -769 -712 214 454 -193 -305 425 635 -155
611a55l17O21M26o28l62N66M73o11o30L79M74m38n88N13Q87j66n39K90O68k97
$$ -155 -472 149 575 -53 -415 151 624 13 -617 -238 236 -202 -790 -277 610 444 -95 195 863 566
631E66r79r9N04j58p56R1R63L71m23J9P49J98q68o01L60J19p47m09O83P36k41
$$ 566 -413 -512 -8 -166 -922 -831 132 503 80 99 848 1046 178 -423 -63 56 -691 -1100 -417 319 78
652G8k87O77O35n06p65J19L63m62p42K22P49L3n05K87Q04L4p36j82N61l2q03k82
$$ 78 -209 468 1103 597 -168 -49 314 -148 -890 -668 81 114 -391 -104 700 734 -2 -184 377 345 -458 -740
674g40O93L01n26j92O85M27n66m57M93L97n43n18M19N69l56n93L45O54k64o96
$$ -740 -47 254 -272 -464 221 648 82 -375 118 515 -28 -546 -127 442 86 -507 -162 492 228 -468
694d68K10O66j16o81J10O87J8o53j31O24Q6o90j72O15K88n69k58O09L83n47m25
$$ -468 -258 408 292 -389 -279 408 426 -227 -358 266 352 -338 -510 105 393 -176 -434 175 558 11 -414
715d14M92M01m88n54L73N32k87n79L57O55k09n84J21O19j46o66MO16J4n73n5O44
$$ -414 78 479 -9 -563 -190 342 55 -524 -167 488 279 -305 -184 435 289 -377 -373 243 257 -316 -371 273
737B73J72o00j84O19J90o24l09N11K96m96l76N00M95m01m22M10M98l30o06J76
$$ 273 445 -155 -339 280 470 -154 -463 48 344 -152 -528 -28 467 66 -356 54 552 222 -384 -208
757b08N20k84n56J65O40j5m95R0O25M3o87j41M65L7o10k03N95K93l81j70N77M00
$$ -208 312 28 -528 -363 277 262 -233 -143 482 525 -162 -303 162 199 -411 -614 -19 274 -107 -277 300 700
779G00m56m57K64K86m69n39K94N33j98l57L54O75j58n40M8M24j93o86p2N28J19
$$ 700 244 -213 51 337 -132 -671 -377 156 -42 -399 -45 630 472 -68 -20 404 211 -475 -547 -19 100
800A00m82J3O43K96n44j90M36J94n84l94M11L55l89l27M20M73l15m33K50M78k63
$$ 100 -382 -369 274 570 26 -164 272 466 -118 -512 -101 254 -135 -462 -42 431 116 -317 -67 411 148
821A48m84J79N29j09m95N6M83o2o16q8N17R2m19p7O80K54m41j99L56J14o12m77
$$ 148 -336 -157 372 263 -232 -176 307 245 -371 -459 58 150 -269 -346 334 588 147 -52 304 418 -194 -671
843f71L46L30l07k62N26O21r9l70K12L35m17p13o1L70j47l80K27P69J89l21L9
$$ -671 -325 5 -302 -564 -38 583 484 114 326 661 244 -469 -530 -160 -307 -687 -460 309 498 177 216
864B16M93o9o97l95K74P9m74j63N87N19k22j86M22L50m27n76J15L00l03m87K60
$$ 216 709 640 -57 -452 -178 -99 -573 -736 -149 370 148 -38 384 734 307 -269 -154 146 -157 -644 -384
885c84N62l5l66J42N22j23n23k2M63J6m63r1N38J18n02k32M10J68m46k27M66M37
$$ -384 178 143 -223 -81 441 318 -205 -227 236 252 -211 -302 236 354 -148 -380 30 198 -248 -475 -9 428
907D28l03k33L88L52l68o01J37K59l30m67K36O75N1k82K67N77r3o54k44K59j63
$$ 428 125 -108 280 632 264 -337 -200 59 -271 -738 -502 173 224 -58 209 786 693 39 -205 54 -109
928a09o35r6N88L53k23O1O39L34n19m20J81N3n63m98L49M79j13k01M64N81j22
$$ -109 -744 -840 -252 101 -122 -61 578 912 393 -27 154 207 -356 -854 -505 -26 -139 -340 124 705 583
949E83n25N9K90l09o28J7M77M6l69O0O33J24m52j54M24Q8n06k61M24K85m16k76
$$ 583 58 117 407 98 -530 -513 -36 10 -359 -299 334 458 6 -148 276 364 -142 -403 21 306 -110 -386
971c86M15L15m05l75L15M01k77l13L06M98j44m83R1L67k42n82qM94K8l62J08O57
$$ -386 29 344 -61 -436 -121 280 3 -310 -4 494 350 -133 -42 325 83 -499 -507 -13 15 -347 -239 418
993D18K10m39j62L43l3n99l58L22K45l07j35O01M79k08l04K64K37m64n71Q0L17
$$ 418 628 189 27 370 337 -262 -620 -298 -53 -360 -495 106 585 377 73 337 574 110 -461 -381 -64
1014f4j97l32K91N98P9l28O7M40j56n73j75L72Mm65m5N30K75l55j39M43J97m42
$$ -64 -261 -593 -302 296 375 47 114 554 398 -175 -350 22 26 -439 -484 46 321 -34 -173 270 467 25
1036B5l17K89K56l26l53L49M06k76l71K10M46k41m19J62M59p9m25P3M40o8m83
$$ 25 -292 -3 253 -73 -426 -77 329 53 -318 -108 338 97 -322 -160 299 220 -205 -132 308 240 -243
1057b43p5M24J1m07q4M95K24l47j81M24K21m28l29K30K26l15l29L07M70j74k94
$$ -243 -318 106 117 -290 -374 121 345 -2 -183 241 462 34 -295 -65 161 -154 -483 -176 294 120 -174
1078a74K12M52k01m78M4L49j80m45P2M50Q2l80M4N03O3m38j80L33J17m56k17L71
$$ -174 38 490 289 -189 -145 204 24 -421 -349 101 183 -197 -153 350 413 -25 -205 128 245 -211 -428 -57
1100e7K58l00j92L59L57l16l11K36K72k65m11J81L88j37l62J77M15n1l73kL75
$$ -57 201 -99 -291 68 425 109 -202 34 306 41 -370 -189 199 62 -300 -123 292 241 -132 -134 241
1121B41J5m69n8L86O2l50j33M11K21l56j86L43K00l25l34K64L01k61l15K58L58
$$ 241 256 -213 -271 115 177 -173 -306 105 326 -30 -216 127 327 2 -332 -68 233 -28 -343 -85 273
1142B73j69l32J54M27j63m41R1L52n7m25L0M34O8l84l0L97R1m06j64L52J42l48
$$ 273 104 -228 -74 353 190 -251 -160 192 135 -290 -260 174 242 -142 -172 225 316 -90 -254 98 240 -108
1164a08k37L88K29k83k52K72K97k45l30K15L33j67l55J56L54j28l70O2L53p6l85
$$ -108 -345 43 272 -11 -263 9 306 61 -269 -54 279 112 -243 -87 267 139 -231 -169 184 108 -277
1185b77pM22R5l36l9M32O3l95k05K76Q6l75j92L59K85j66j75L23L60k66l94J20
$$ -277 -284 138 233 -103 -142 290 353 -42 -247 29 115 -260 -452 -93 192 26 -149 174 534 268 -126 -6
1207fJ82k64m22J23L95J5k33J97M62M0l93j10K56j08n04j49L25J91k57K1M49K59
$$ -6 176 -88 -510 -387 8 23 -210 -13 449 489 96 -14 242 134 -370 -519 -194 -3 -260 -239 210 469
1229D69k62k32K09J45l98l69K16K61j68k17L07L79r7l24J13L05j42m17K1L21%
$$ 469 207 -25 184 329 -69 -438 -222 39 -129 -346 -39 340 243 -81 32 337 195 -222 -201 120 120
1250A20l50J6L86L7l69j01L33R8l02j11L96J81k30j89K08J40l80l12J74K35j35
$$ 120 -230 -214 172 209 -160 -261 72 170 -132 -243 153 334 104 -85 123 263 -117 -429 -255 -20 -155
1271a55j85L24M20l8k81J13K20k60m97r7K43l2k50J55N15K04j59j0K56k0m84l38
$$ -155 -340 -16 404 366 85 198 418 158 -339 -436 -193 -225 -475 -320 195 399 240 230 486 466 -18 -356
1293c56J13N0k58r5M03L87k7j04K38K30l24m14j9J50j96k80J46M24O0j67Q5L65
$$ -356 -243 -193 -451 -546 -143 244 217 113 351 581 257 -157 -176 -26 -222 -502 -356 68 128 -39 46 411
1315D11m1l83j27K12K4l33q1L56J38k22j40K34J92k82j74J98K54j56j70J69K16
$$ 411 370 -13 -140 72 96 -237 -318 38 176 -46 -186 48 240 -42 -216 -18 236 80 -90 79 295
1336B95j68l18L6J99j73k77J13L87R8j94J52K86Ol88k20J11m7l33j27L27L02n0
$$ 295 127 -191 -155 44 -129 -406 -293 94 192 -2 150 436 442 54 -166 -55 -102 -435 -562 -235 67 17
1358A7K1L14K56k82l29K4J8l28l07J46L49L8o0K61L46J4l16j18J54j79m04j01
$$ 17 38 352 608 326 -3 21 39 -289 -596 -450 -101 -63 -123 138 484 498 182 64 218 39 -365 -466
1380d66K67J34j43P2L63J80k09k07J36J16l37k31J30K37r7j69J80K86j04k82Q3
$$ -466 -199 -65 -208 -136 227 407 198 -9 127 243 -94 -325 -195 42 -55 -224 -44 242 138 -144 -61
1401f1K41r0k64N4K86M1k89m9K64ml19j10K66J22j81p5L01K42k03j99J31J17l06
$$ -61 180 90 -174 -120 166 207 -82 -131 133 129 -190 -300 -34 88 -93 -168 133 375 172 -27 104 221 -85
1424h5l32J28K46q2j18K15M00m9k52RK47j87m15r2K34M8k55O1M29J82k06j07K67
$$ -85 -417 -289 -43 -125 -243 -28 372 323 71 80 327 140 -275 -367 -133 -85 -340 -279 150 332 126 19 286
1447B86L6l77k86J98J45k26j60L00L32p7k12J73K29j90l51L0K55j24k97J01L69
$$ 286 322 -55 -341 -143 2 -224 -384 -84 248 171 -41 132 361 171 -180 -150 105 -19 -316 -215 154
1468A54K4l05KL52J5l39j00K97J05l49j20L11J84k80k10K89K10k62k34K30K66
$$ 154 178 -127 -125 227 242 -97 -197 100 205 -144 -264 47 231 -49 -259 30 240 -22 -256 -26 240
1489B40j87k92J93L23j90l31R7L19j00l33R2L58j9l22K2L58J2l58q6L03P9l32
$$ 240 53 -239 -46 277 87 -244 -147 172 72 -261 -169 189 170 -152 -130 228 240 -118 -204 99 178 -154
1511a54j58L51J93l00j48L05J96k64k74K50K35k62k84J72L74j91k77J65L53j01
$$ -154 -312 39 232 -68 -216 89 285 21 -253 -3 232 -30 -314 -142 232 41 -236 -71 282 181
1531A81l63O9L52j21l93J8L68K6l29k7M18Q5l28j01L30Q4m15j97L23J92l07j57
$$ 181 -182 -113 239 118 -275 -257 111 137 -192 -219 199 284 -44 -145 185 269 -146 -343 -20 172 -135 -292
1553b92L49K83k45k59K49K67l09l90J46L26j88l06J79M18ll35Q6L83r6m58p3L38
$$ -292 57 340 95 -164 85 352 43 -347 -201 125 -63 -369 -190 228 225 -110 -24 359 263 -195 -268 70
1575G0Lm17k6M72J55k93p7L95J27l89k68K89J48l53k38L26K97j96k20K49L26k46
$$ 70 73 -344 -370 102 257 -36 -113 282 409 20 -248 41 189 -164 -402 -76 221 25 -195 54 380 134
1597A34l31J13L19j74l42R6L51n8l27Q6L35j9m13KL82M5l15q6L69J27l54j88K88
$$ 134 -197 -84 235 61 -281 -185 166 108 -219 -133 202 183 -230 -228 154 199 -116 -202 167 294 -60 -248 40
1620D0J31l68j91L09K84k02j53L21K99k51l66J29J95k71l93J57L45oj64K06M27
$$ 40 171 -197 -388 -79 205 3 -150 171 470 219 -147 -18 177 -94 -487 -330 15 9 -155 51 478
1641D78m1l84n1K00j35m63o7K95J27k11Q8M36K11k47k13K08K4l99l00K09K11j80
$$ 478 437 53 2 202 67 -396 -463 -168 -41 -252 -164 272 483 236 23 231 255 -144 -444 -235 -24 -204
1663b04j19L26L50j21k10J05K17k43l67L1K66r7j90R0L43J0k79mK52L4l04o5K78
$$ -204 -323 3 353 232 22 127 344 101 -266 -235 31 -66 -256 -166 177 187 -92 -96 156 190 -114 -179 99
1686I9P5k49m8K17Q2k89j52J86J21j60r2K69K50q9j78J37J07k13l58K4J55q0j87
$$ 99 174 -75 -123 94 176 -113 -265 -79 42 -118 -210 59 309 220 42 179 286 73 -285 -261 -106 -186 -373
1709c73J90L70J28j08K6J84j21l51j94P1l8j84K9L41K12j6K3K04M0k84k53l6k
$$ -373 -183 187 315 207 233 417 296 -55 -249 -178 -216 -400 -371 -30 182 166 189 393 433 149 -104 -140 -142
1732a42j87j23K05K90okJ70J72j00k31r9M2q2j89L9J90Q0p1M0J64M4j81p5J23
$$ -142 -329 -452 -247 43 37 35 205 377 277 46 -53 -11 -93 -282 -243 -53 27 -44 -4 160 204 23 -52 71
1756G1Kj23k6Q8R2q6j09N8N2r5j11R2J41jk2J04R5j6j64j11K6r0j96N9J46J48
$$ 71 73 -50 -76 12 104 18 -91 -33 19 -76 -187 -95 46 45 23 127 222 206 42 -69 -43 -133 -329 -270 -124 24
1782B4qJ01J64M7j27j33n4o6j88j28Q7J20J08O0J74K00m8j10p6o1j74j80o8Q5
$$ 24 16 117 281 328 201 68 14 -52 -240 -368 -281 -161 -53 7 181 381 333 223 147 86 -88 -268 -336 -251
1806b51J39JR7J93J24p5p4m7k9j78j02RQ7k2L4R3J47Kj13j5L9j6j17j9J18j5n2
$$ -251 -112 -111 -14 179 303 228 154 107 78 -100 -202 -193 -106 -128 -94 -1 146 148 35 20 59 43 -74 -93 25 10 -42
1833d2pN3O2j10n0Q4M6n7j3R4J01m9j04oM3p5j42l7J33L4o6J13J54L1p9o6N0k6
$$ -42 -49 4 66 -44 -94 -10 36 -21 -34 60 161 112 8 2 45 -30 -172 -209 -76 -42 -108 5 159 190 111 45 95 69
1861F9j94r6M8P1m3L7J76J16or1O0L8j70j90K3Q2o8q3J38K12J1p1L4R8o5k21l2
$$ 69 -125 -221 -173 -102 -145 -108 68 184 178 87 147 185 15 -175 -152 -70 -138 -221 -83 129 140 69 103 201 136 -85 -117
1888a17Q2Lj47K5J88P1o6p4J47N1j58j25P6J27j52r5J02J65p1j19N9J53o0j75
$$ -117 -35 -32 -179 -154 34 105 39 -35 112 163 5 -120 -44 83 -69 -164 -62 103 32 -87 -28 125 65 -110
1912a10P1J47m7j58N0J49j7j72J3J45Nj54l0J69K5j31m6J62P1j56j10J32Q4j57
$$ -110 -39 108 61 -97 -47 102 85 -87 -74 71 76 -78 -108 61 86 -45 -91 71 142 -14 -124 8 92 -65
1936f5j10J47J49r7j22J26J47j22j74Q3J40q1j75L0K01k3j44M0J93mj98J4J25
$$ -65 -175 -28 121 24 -98 28 175 53 -121 -38 102 21 -154 -124 77 54 -90 -50 143 139 -59 -45 80
1959H0K5k14n7K11M1j31n6J90R3j78r7J32J08j50j54J00J50p2j63J13J97q9j59
$$ 80 105 -109 -166 45 86 -45 -101 89 182 4 -93 39 147 -3 -157 -57 93 21 -142 -29 168 79 -80
1982h0P6J32n3k35K7J91k4k06M2K14O4j94L7J56j0j96p8J36N3j72n6J83J43j23
$$ -80 -4 128 75 -160 -133 58 34 -172 -130 84 148 -46 -9 147 137 -59 -137 -1 52 -120 -176 7 150 27
2006B7q8J37J14j24j83Q2J20j19j65Q9K17l3j72J10J85o8j91LJ35j0k13k0K20
$$ 27 -61 76 190 66 -117 -35 85 -34 -199 -110 107 74 -98 12 197 129 -62 -59 76 66 -147 -167 53
2029E3K9j51l1J82R3j88j00J52Q9j50j10J09J62j36j22J00J15r4j41Q1J75o2j35
$$ 53 82 -69 -100 82 175 -13 -113 39 128 -22 -132 -23 139 3 -119 -19 96 2 -139 -58 117 55 -80
2052h0R6J47l2j85lJ00n0j75J0J76O9j12qK17M7j51j06R9j0j90j18J32J37m6p3
$$ -80 16 163 131 -54 -57 43 -7 -182 -172 4 73 -39 -47 170 217 66 -40 59 49 -141 -259 -127 10 -36 -109
2077a09J95J58n5j52J1O3j33j99K2J81n4o9R1K08K7j23m4J32m0k24o4J10N6j18
$$ -109 86 244 189 37 48 111 -22 -221 -199 -18 -72 -141 -50 158 185 62 18 150 110 -114 -178 -68 -12 -130
2101a30j6J64J26r5r9J22N4j30j35J02J15r2j06R0J39o9j71N7J51l0j48K0K01
$$ -130 -146 18 144 49 -50 72 126 -4 -139 -37 78 -14 -120 -30 109 40 -131 -74 77 47 -101 -81 120
2124A20j5j01k1J22j4k02n9J06O2r8k1J86J15p3q6J00L3j40j84L1Q9n4j28J37
$$ 120 105 4 -17 105 91 -111 -170 -64 -2 -100 -121 65 180 107 21 121 154 14 -170 -139 -50 -104 -232 -95
2148i5K02O5r8L5J24r2j98o3M4l8j36N0J96J13q1K4J37L9k09j15M8K0q7r5J33
$$ -95 107 172 74 109 233 141 -57 -120 -76 -114 -250 -200 -4 109 28 52 189 228 19 -96 -48 -28 -115 -210 -77
2173g7J16j7p0J15J23o9j85K6J01n9j38M9J27Mj31L3J06K1j46j1J36L0j25j9J19
$$ -77 39 22 -48 67 190 121 -64 -38 63 4 -134 -85 42 46 -85 -52 54 75 -71 -82 54 84 -41 -60 59
2198E9P7j57n7K5P5j13r0J45J20n6o7J32J10p4j61k9P2p8j48M4J43O2p9P2J72
$$ 59 136 -21 -78 -53 22 -91 -181 -36 84 28 -39 93 203 129 -32 -61 11 -67 -215 -171 -28 34 -45 27 199
2223A99K0j61o5P7l3j88p5J23P6j9j6J59J22q2j18L1J6j16j44O3J03k1n1O1J64
$$ 199 219 58 -7 70 37 -151 -226 -103 -27 -46 -62 97 219 137 19 50 66 -50 -194 -131 -28 -49 -100 -39 125
2248A25Kj14J2O9Lk04j1J25M4j26MJ28K9p0r8R7N2q0o9R9J14j22o8O3Q0p8j32
$$ 125 127 13 25 94 97 -107 -118 7 51 -75 -71 57 86 16 -82 15 67 -13 -82 17 131 9 -59 4 84 6 -126
2275a26M6J15m4n7L6J29J2r3k0Q7k5j78k2J04J0j14L9J71P3r9k3O3M5j22j49P5
$$ -126 -80 35 -9 -66 -30 99 111 18 -2 85 60 -118 -140 -36 -26 -140 -101 70 143 44 21 84 129 7 -142 -67
2301f7O1r5m2J19J40m4r8Q9P3o7j63j3J04n0p6M9J26P0j21j2J20Nj37l0O4M1j29
$$ -67 -6 -101 -143 -24 116 72 -26 63 136 69 -94 -107 -3 -53 -129 -80 46 116 -5 -17 103 108 -29 -59 5 46 -83
2328h3m4J18O9o5p2Q9R8j14q5R2R0p2q5N3R7l8j02lJ31j8j12KJ24K5j18OO8K5
$$ -83 -127 -9 60 -5 -77 12 110 -4 -89 3 93 21 -64 -11 86 48 -54 -57 74 56 -56 -54 70 95 -23 -17 51 76
2356G6r3o9R9J4p8o3J27N6o8m3Q8O8n1j29N1Q1p8r6N0R4l9l6J0J26Qj08m2Q4%
$$ 76 -17 -86 13 27 -51 -114 13 69 1 -42 46 114 63 -66 -15 66 -12 -108 -58 36 -3 -39 -29 97 105 -3 -45 39 39
2385C9j22rJ10Mo1m0J37L4q0o8P6O4r8p5O3P0n0o5M8P1Mj40N6J04m2r9nJ25Qj34
$$ 39 -83 -92 18 22 -39 -79 58 92 12 -56 20 84 -14 -89 -26 44 -6 -71 -23 48 52 -88 -32 72 30 -69 -74 51 59 -75
2415g5J0J05J3q9l0Q7L6r0l1O9O0p4n6N6R9r2o0P5N7m7q6P0O9m2q5JJ34k7j24
$$ -75 -65 40 53 -36 -66 21 57 -33 -64 5 65 -9 -65 -9 90 -2 -62 13 70 23 -63 7 76 34 -51 -50 84 57 -67
2444f7L1R1jj01k7J01J2r4j7Q0N8j26j1Q3L7n6o1Q1L9o5o7R4O7p7p4M3J06m7r5
$$ -67 -36 55 54 -47 -74 27 39 -55 -72 8 66 -60 -71 12 49 -7 -68 13 52 -13 -80 14 81 4 -70 -27 79 32 -63
2473f3M2P7k9n9J0O6Rj05KP2Op1l1J04M9p3n1O1Q1r8m5L7Q1r8p7R6M0k5o8N3J10
$$ -63 -21 56 27 -32 -22 44 53 -52 -50 22 28 -43 -74 30 79 6 -45 16 97 -1 -46 -9 72 -26 -103 -7 33 8 -60 -7 103
2504A03k6j09NN7j4r4pJ09Nn6k8J40K4j05k8Q6K5j21p4R1P6j22l1J08O4l5r3L5
$$ 103 77 -32 -27 30 16 -78 -85 24 29 -27 -55 85 109 4 -24 62 87 -34 -108 -17 59 -63 -94 14 78 43 -50 -15
2532a5J07p8r2K2R1l5p2OJ21oj08N4K0M9j26k0J25K3r6l3R7L0j01m4R5L4l2q2
$$ -15 92 14 -78 -56 35 0 -72 -66 55 49 -59 -5 15 64 -62 -82 43 66 -30 -63 34 64 -37 -81 14 48 16 -66
2560f6Q7Q7q5o4P4O3o9j05K0Q5n9n5K7J50Mj12J9P3pj40j9J08j4r1LQ7Q1l1p8
$$ -66 21 108 23 -41 33 96 27 -78 -58 27 -32 -87 -60 90 94 -18 1 74 67 -73 -92 16 2 -89 -86 1 82 51 -27
2589b7Q6P9j19p5M9L5o2o7N1J08l6n8P2P6l9j06QN9k1p1l0J25j2m6k2Q6N3j28
$$ -27 59 138 19 -56 -7 28 -34 -101 -50 58 22 -36 36 112 73 -33 -25 34 13 -58 -88 37 25 -21 -43 43 96 -32
2617c2l4P6M4o4m8M9O8o6o8Q9K4p4n2O8Q9l7n6K1J15p3j07K7P3k6r0J1Q1N2o4
$$ -32 -66 10 54 -10 -58 -9 59 -7 -75 14 38 -36 -88 -20 69 32 -24 -3 112 39 -68 -41 32 6 -84 -73 8 60 -4
2646dj9J20j4n2o8L3N0r9o0P2P3l7n0R1Q3q0k8k3P3q2j03M3O6pn6N0J10j5n3j4
$$ -4 -23 97 83 31 -37 -4 46 -53 -113 -41 32 -5 -55 36 119 39 11 -12 61 -21 -124 -81 -15 -22 -78 -28 82 67 14 0
2676@M7Pj26J2P8J0p3JN5Q2r7mL7L5l2q5M7N6n2p2L7J17m8q9J1Q3l0l9J3P8Nr0
$$ 0 47 54 -72 -60 18 28 -45 -44 11 93 -4 -8 29 64 32 -53 -6 50 -2 -74 -37 80 32 -57 -46 37 7 -32 -19 59 64 -26
2708b6QM8mq3nN1N2q3k1J04L0m3n5M9J5l8n1K1O9m9m3O2O9l3l3K4L9j6j11k6P3
$$ -26 -18 30 26 -57 -62 -11 41 -42 -63 41 71 28 -27 22 37 -1 -52 -31 38 -11 -54 8 77 44 11 35 74 58 -53 -79 -6
2739fj3n3J7P2M2n3k5P1L3j22l0M0M7n8m7M7Q0j6o5L7N6j9o9LN7Qp4PO9j3l0j1
$$ -6 -19 -72 -55 17 59 6 -19 52 85 -37 -67 -27 20 -38 -85 -38 42 26 -39 -2 54 35 -34 -31 26 34 -40 -33 36 23 -7 -18
2771a8M6Po3j4O6K9r2%Q3Lo1m8P1O4j02l3O4L9m1o3P0L9l7o9L8N8m1n1M4K3L0
$$ -18 28 35 -28 -42 24 53 -39 -39 44 47 -14 -62 9 73 -29 -62 2 41 0 -63 7 46 9 -60 -22 36 -5 -56 -12 11 41
2802D1p2J7P4l1l6k7O5jq0J9P0Oq9MN9M5m9o9N0L0k4q1M7P1l5n3NR0l2l9j6O0
$$ 41 -31 -14 60 29 -7 -34 31 30 -50 -31 39 45 -44 -40 19 64 15 -54 -4 26 2 -79 -32 39 4 -49 -44 46 14 -25 -41 19
2834A9%n2j6M1L9q5J1O0J9m3m1Q3J3p2mN3Qm9n2M9J02o5m1K9O3m7n5l6Q8k4p6
$$ 19 19 -33 -49 -8 31 -54 -43 17 36 -7 -48 35 48 -24 -28 25 33 -16 -68 -19 83 18 -23 6 69 22 -33 -69 19 -5 -81
2865h1L1M3P3p8j4K8K3n4j9M3L9n9l8P3ok7j4M1O9m9n9K9L6l1o9M3Q3n8j9J8N6
$$ -81 -50 -7 66 -12 -26 2 25 -29 -48 -5 34 -25 -63 10 4 -23 -37 4 73 24 -35 -6 30 -1 -70 -27 56 -2 -21 -3 53
2896E3kp9pN3K6o6lP3J6o9n0Q4J8r0jN3L5p1OK1N9n1n5K9L5j6p9M1N8j9l8J9P5
$$ 53 51 -28 -35 18 44 -22 -25 48 64 -5 -55 29 47 -43 -44 9 44 -27 -21 0 59 8 -47 -18 17 1 -78 -37 21 2 -36 -17 58
2929E8mn2j3K6%n4n3O2O7r5J2P1L8n2l4N7jl3o7J9O3k3n0O9M5k1l4j5N9l4p2j2
$$ 58 54 2 -11 15 15 -39 -92 -30 37 -58 -46 25 63 11 -23 34 33 0 -67 -48 15 -8 -58 11 56 35 1 -14 45 11 -61 -73
2961g3O6L6p6pP7L0p4m3J15on5k9K2O9p6pM0K8l9l7M0L7l4l5K0N9k6m7J4Q3l4
$$ -73 -7 29 -47 -54 23 53 -21 -64 51 45 -10 -39 -17 52 -24 -31 9 37 -2 -39 1 38 4 -31 -11 48 22 -25 -11 72 38
2992C8q0kL4J2m3lO6K3k6l6O4mp7m1O9J9l6p6J01O2l1n2L1O3m8o9J7L7k2p1K4
$$ 38 -42 -44 -10 2 -41 -44 22 45 19 -17 47 43 -34 -75 -6 13 -23 -99 2 64 33 -19 12 75 27 -42 -25 12 -10 -81 -57
3023e7R6j2ml3P1J1p0n9Q6l5l5j9P3M1m9l0L8M2n3m6M9L1o9k1L8L6j5o0L6O7j0
$$ -57 39 27 23 -10 61 72 2 -57 29 -6 -41 -60 13 54 5 -25 13 55 2 -44 5 36 -33 -54 -16 20 5 -55 -19 48 38
3054C8q0K7O9j7q4J6R5k6p6j4R3jp6k0P9K6m4k6O7M8p9p2M6P3j04j4L9M0m2m4
$$ 38 -42 -15 54 37 -47 -31 64 38 -38 -52 41 40 -36 -56 23 49 5 -21 46 94 15 -57 -11 62 -42 -56 -17 23 -19 -63
3084f3N2Q8k7j00JO0Jo7KQ5m8j1qR5Lj01j7M9M9r0l0P2L4o7l8Q9M8n1k9M0K6m7
$$ -63 -11 77 50 -50 -49 11 12 -55 -53 32 -16 -27 -35 60 63 -38 -55 -6 43 -47 -77 -5 29 -38 -76 13 61 10 -19 21 47 0
3116@m8jP3m2m0K9Q1k6m9kN2J8r0lO7on4rO6L2q3%O8L2p5k4N7K7n9l2O2J7k0l6
$$ 0 -48 -49 24 -18 -58 -29 52 26 -23 -25 27 45 -45 -48 19 13 -41 -50 16 48 -35 -35 33 65 -10 -34 23 50 -9 -41 21 38 18 -18
3150a8J6K7J4p0RP2m8k2jN4Qq4oP0nn7jR3k3n6MK2J9k9m9N6J8k8l1O4mOo2L7N4
$$ -18 -2 25 39 -31 -22 50 2 -20 -21 33 41 -43 -49 21 16 -41 -42 51 28 -28 -24 -2 17 -12 -61 -5 13 -15 -46 18 14 20 -42 -5 49
3185D9l8l2J8L9j8o0K4L5oj7J3L2Jm3JL5J2r4j7O3J6l7lN2M8n9l7M6J3n5n1K5
$$ 49 11 -21 -3 36 18 -42 -18 17 11 -6 7 39 40 -3 -2 33 45 -49 -66 -3 13 -24 -27 25 73 14 -23 23 36 -19 -70 -45
3217d5Q3n0l0K7O3Mm4RL1m0m6K1JJ3n1K8N2N5n1m0O6j2o2oJ1L9o2oM2L6jn9L9
$$ -45 38 -12 -42 -15 48 52 8 17 48 8 -38 -17 -16 -3 -54 -26 26 81 30 -10 56 44 -18 -24 -13 26 -36 -42 0 36 35 -24 15
3250A5K7n7kj0K3Nk2j2N1k0j5ML8j9n4N0L3J5n1J7l2M5l3oJ5k5J8l5L4K7j4LN
$$ 15 42 -15 -17 -27 -4 1 -21 -33 18 -2 -17 -13 25 6 -48 2 35 50 -1 16 -16 29 -4 -10 5 -20 -2 -37 -3 24 10 13 18
3283A8L1n1j2j4L5l4okN1K5m6L4K4j0m2mj5nm6rN6J6J9oK5K6k7k6k7K0j7mlL0
$$ 18 49 -2 -14 -28 7 -27 -33 -35 16 41 -5 29 53 43 1 -3 -18 -23 -69 -78 -22 -6 13 7 32 58 31 5 -22 -2 -19 -23 -26 4
3317DKj9K7L5j3k0n%J0l0MJ0J4j8rRoKpJ2J5k1J3l1L8j3j6%K0jm1qM1L1j6pJ8
$$ 4 6 -13 14 49 36 16 11 11 21 -9 -5 5 19 1 -8 1 -5 -3 -10 2 17 -4 9 -22 16 3 -13 -13 7 6 -35 -43 -2 29 13 6 24
3354B4N1n3l0J8Jj0n1K6J6pL2J3M4Pn2j0K1m3m1j5M1kL7j1M0J8l6rJpm2n0L9M1
$$ 24 75 22 -8 10 11 1 -50 -24 -8 -15 17 30 74 81 29 19 40 -3 -44 -59 -18 -20 17 6 46 64 28 19 20 13 -29 -79 -40 1
3388Ak8KK9K6J0n7rO0l3m3K5K2Nl0J3M6j3l0oN3Pp2j3O2j6k2j3L6K1p5ML2L2m4
$$ 1 -27 -25 4 30 40 -17 -26 34 1 -42 -17 5 10 -20 -7 39 26 -4 -10 43 50 -22 -35 27 11 -11 -24 12 33 -42 -38 -6 26 -18
3422a8l0O8L9l9l2J9L6m6m2J3L5k3k1K2O9on2M2K5l4m9k4L1J4l5k8Q6L3k1l0M1
$$ -18 -48 20 59 20 -12 7 43 -3 -45 -32 3 -20 -41 -19 50 44 -8 34 59 25 -24 -48 -17 -3 -38 -66 20 53 32 2 43
3453D3j2k0n5K8K6k1j3lP4m2k2L2J9mn6j2O2mo6J3N5%p7K4O3%k6k6M3Kn1j0N1
$$ 43 31 11 -44 -16 10 -11 -24 -27 47 5 -17 15 34 30 -26 -38 24 20 -46 -33 22 22 -55 -31 32 32 6 -20 23 25 -26 -36 15
3486A5K2n3J0L0K1o8rK3M8l5l4M3J7rm1L2J6n4kk2R3j9m5kN3om1j8L6J9q5J8O5
$$ 15 37 -16 -6 24 45 -23 -32 -9 39 4 -30 13 30 21 -20 12 28 -26 -28 -50 43 24 -21 -23 30 24 -17 -35 1 20 -65 -47 18
3519A8J1o4JP1K6q4j1M2L0m5l7J6M6k3k8L0M2ro7K9M4l3l1lO2pn3k5N1J9k4l9
$$ 18 29 -35 -34 37 63 -21 -32 10 40 -5 -42 -26 20 -3 -31 -1 41 32 -35 -6 38 5 -26 -29 33 26 -27 -52 -1 18 -6 -45
3551d5M9K6m2m7N4J9m8j7K5N4l9qK2K4k6l8K4M7l5n5M7L9j7p2L0O4k5l9J8M8j2
$$ -45 4 30 -12 -59 -5 14 -34 -51 -26 28 -11 -19 3 27 1 -37 -13 34 -1 -56 -9 30 13 -59 -29 35 10 -29 -11 37 25
3582B5l5j8L9%j3k6N8Pm0l6K0K1j6OJ9Mj4k1L7J1n6j1L5K5Mn6K3J6K9o5kM4kk7
$$ 25 -10 -28 11 11 -2 -28 30 37 -3 -39 -19 2 -14 -8 11 15 1 -20 17 28 -28 -39 -4 21 25 -31 -8 8 37 -28 -30 14 12 -15
3616a5j6K2M2o5J4M6ll2j6N1ok0rJ6npn7P5K9m7J2%Mj7l8K5J9kk3J7L4J6n6OK2
$$ -15 -31 -9 33 -32 -18 28 25 -7 -23 28 22 2 -7 9 4 -3 -60 15 44 -3 9 9 13 -4 -42 -17 2 0 -23 -6 28 44 -12 -6 16
3651A6Jm4LK4Kj7j0M2J0j5nJ6M9p9lj0K4jl0K3L1k7lQL2o3J5PkpKj2L4j8l8K8
$$ 16 17 -27 -24 0 2 -15 -25 17 27 12 7 23 72 -7 -10 -20 4 3 -27 -4 27 0 -3 5 37 -26 -11 -4 -6 -13 -11 -23 11 -7 -45 -17
3687a7K0J9j8l9L7J9jl4L1M3l6m1J7K4j6k9pP3j7m3M3J4l0j3l4L3Lk3k3K7L3l1
$$ -17 3 22 4 -35 2 21 20 -14 17 60 24 -17 0 24 8 -21 -28 45 28 -15 28 42 12 -1 -35 -2 1 -22 -45 -18 15 -16
3719a6J2J7L7o8k1K0Jj9k3L7N0j8k7M8%J0m9J8k6J1k6J5L5Nm1N8J5k7prRNn3j9
$$ -16 -4 13 50 -18 -39 -19 -18 -37 -60 -23 27 9 -18 30 30 40 -9 9 -17 -6 -32 -17 18 23 -18 40 55 28 21 12 21 26 -27 -46
3753d6L5J7j5j1K3L4m3jJ3mll2L1j0Rk2K3L6m1l0K2K7Ol2k9N9J0m8J0J7K9l8m5
$$ -46 -11 6 -9 -20 3 37 -6 -7 6 2 -1 -33 -2 -12 -3 -25 -2 34 -7 -37 -15 12 18 -14 -43 16 26 -22 -12 5 34 -4 -49
3786d9P4kk0j4M2K0k9m1K0oL1n7JM0j0k7J5M5k1J3l8J7J3k9l%J9k9RN4J3l4k9
$$ -49 25 23 3 -11 31 51 22 -19 1 -5 26 -31 -30 10 0 -27 -12 33 12 25 -13 4 17 -12 -15 -15 4 -25 -16 38 51 17 -12
3819a2L4L2n0l5L6j6Lj4J2K0jrJ6Qrl3ML3Ol0QK1l5Rk0M2J4qn9L0mrJ8j2K6k5
$$ -12 22 54 4 -31 5 -11 -8 -22 -10 10 9 0 16 24 15 -18 -14 19 25 -5 3 24 -11 -2 -22 20 34 26 -33 -3 -7 -16 2 -10 16 -9
3855il8L2L0l2OMJ0L8m1LM1k5m2kK8Jl6mK3M6on9N7Mk7k4J3Kj7kJ3J5%k3M8RK
$$ -9 -47 -15 15 -17 -11 -7 3 41 0 3 44 19 -23 -25 3 4 -32 -36 -13 33 27 -32 25 29 2 -22 -9 -7 -24 -26 -13 2 2 -21 27 36 38
3892C8p3J6PRj7lK5J3m2J3M4Km0J6J2qrk6L8Lj3j9L6j5Jj3J8oj5k0K5K8rj9K1
$$ 38 -35 -19 -12 -3 -20 -23 2 15 -27 -14 30 32 -8 8 20 12 3 -23 15 18 5 -14 22 7 8 -5 13 7 -8 -28 -3 25 16 -3 18
3927A8Jk3j8j2J3L8noK8k6l5J9J7onl9M9J4l5QJ3Knk5L0L1m7k4K8N0m5m0OM2J7
$$ 18 19 -4 -22 -34 -21 17 12 6 34 8 -27 -8 9 3 -2 -41 8 22 -13 -5 8 10 5 -20 10 41 -6 -30 -2 48 3 -37 -31 11 28
3962B8n1K1L0J0p3J1L7J2m9K1J0K0k8rPK8m2j0KL4j0qLK0mm2K0K2j9k7M5Mj2k
$$ 28 -23 -2 28 38 -35 -24 13 25 -24 -3 7 27 -1 -10 -3 25 -17 -27 -25 9 -1 -9 -6 14 10 -32 -12 10 -9 -36 9 13 1 -1
3996aJL8m3k0QL1KRk9J7J8l8j5K2Lk0j5K8L2m4nK4L2Jn0J7%lk4rJ8K6l2M1k9M7
$$ -1 0 38 -5 -25 -17 14 16 25 -4 13 31 -7 -22 0 3 -17 -32 -4 28 -16 -21 3 35 36 -14 3 3 0 -24 -33 -15 11 -21 20 -9 38
4032C8m9LM3j5l5oN5k1k2MJ4Rj6nK3j1ml7RM5j9k3%L2K1o0L2L1k9j2qK8mm7J8
$$ 38 -11 -8 35 20 -15 -21 34 13 -9 -5 9 18 2 -3 20 9 5 -32 -23 22 3 -20 -20 12 33 -27 5 36 7 -5 -13 15 11 -36 -18
4067a8J1J7j8k5L5J7l6J0RK0j1k1J8Mj5k8N0%km4K1J1J5m2RJ1J5k1j1K5K9n7L
$$ -18 -7 10 -8 -33 2 19 -17 -7 2 22 11 -10 8 12 -3 -31 19 19 17 -27 -6 5 20 -22 -13 -2 13 -8 -19 6 35 -22 -19
4100a9K2L2n3LNJ9k1jK4kk7j3M6k7K3k8K1J3j8k3K2LNk6J4L8m2jK6kJ3jm4L4q
$$ -19 3 35 -18 -15 -10 9 -12 -13 11 9 -18 -31 15 -12 11 -17 4 17 -1 -24 -2 1 6 -20 -6 32 -10 -11 15 13 26 25 -19 15 7
4135Gr%RK1n0QL0J4m2j1L5jk3mlK2K9l4j5L2mk1OL4j5qkJ0Lm1rK2L6l1J6k4L9
$$ 7 -2 -2 7 28 -22 -14 16 30 -12 -23 12 11 -12 -16 -19 3 32 -2 -17 15 11 -10 -4 30 15 7 5 15 18 -23 -32 -10 26 -5 11 -13 26
4172B6k4j3L1%j7k1K9J0j8j0nkJ4l1M0Jl3L2l2L4Pj9NjNj8j1OK7j5j4j2N5k8q
$$ 26 2 -11 20 20 3 -18 11 21 3 -7 -12 -14 0 -31 9 10 -23 9 -23 11 18 -1 4 3 8 -10 -21 -15 12 -3 -17 -29 26 -2 -10
4207a0J9k0K3k2NJ7J5k4k7N0Qk6LPkm0mL7j4k5J0N2j8l0j1N0Ll9LK5jook4N5l9
$$ -10 9 -11 12 -10 -5 12 27 3 -24 26 34 8 11 18 16 -24 -28 9 -5 -30 -20 32 14 -16 -27 23 26 -13 -10 15 14 8 2 -22 33 -6
4243flJ6J0qJ2k4M4l0j5qL5mm8L5L1j1l3jK9j1j8oL0J0l0k5J8J0j1j1J8M7m7l
$$ -6 -9 7 17 9 21 -3 41 11 -4 -12 23 19 -29 6 37 26 -7 -8 21 10 -8 -14 16 26 -4 -29 -11 -1 -12 -23 -5 42 -5 -8
4277hJ6Lk5j5K0j0K2knK7J7m1j6M3ql7M5Qj0k4Rj2M5m5nL7j6lj4qJ9l7KL5Mm3
$$ -8 8 11 -14 -29 -9 -19 3 1 -4 23 40 -1 -17 26 18 -19 26 34 24 0 9 -3 42 -3 -8 29 13 10 -4 -12 7 -30 -28 7 11 -32
4313c2J7NN1k4n3M7Kj4j2JK1p%k9M4j1Kj5J1j4j8K0L7pj8qJMlJ1l1J7Kk9J9K5
$$ -32 -15 -10 41 17 -36 11 13 -1 -13 -12 9 2 2 -27 17 6 8 -7 4 -10 -28 -8 29 22 4 -4 -3 1 -2 9 -22 -5 -3 -32 -13 12
4349A2oj5l2M3jpJ2pj0poJ3J8Ok4K7qj8J5mK3Mj9nnK%mK4Kl8JM3l7j8K6J7%m2
$$ 12 6 -9 -41 2 1 -6 6 -1 -11 -18 -24 -11 7 13 -11 16 8 -10 5 1 24 28 9 4 -1 1 1 -3 21 23 -15 -14 29 -8 -26 0 17 17 -25
4388b5qM8K1n5L1Nj8J0k7L1Mj7m2L3K9l4kJ5K2k0j0QK8k2k4J3K1Kk1j8K3N1o8
$$ -25 -33 15 36 -19 12 17 -1 9 -18 13 17 0 -42 -9 20 -14 -16 -1 21 1 -9 -1 27 5 -19 -6 15 17 -4 -22 1 52 -16
4421a6MM1j4ml9K8oM%mK0k2m2L5K3kj2MQj1k1L0K8n0MJ6J2j4j9LM5j2k7JK7m1
$$ -16 -12 29 15 11 -28 0 -6 -2 -2 -6 14 -8 -50 -15 8 6 -6 -2 6 -5 -26 4 32 -18 -14 2 14 0 -19 -16 29 17 -10 -9 18 -23
4457b3RJ5l1M4m0RK6k1K5pj4JK3l5K8jPl1%K0OpkKOj9NJ7j0l1K0J2lj7K2j2K3
$$ -23 -14 1 -30 14 -26 -17 9 -12 13 6 -8 -7 16 -19 9 8 15 -16 -16 4 10 3 1 3 9 -10 -5 12 2 -29 -9 3 0 -17 5 -7 16
4494A6j1k9J8NQj6j1N8l2k4%K7%l6M2mJ5k2k2M0K7o2kK8Jl3oK8J1j9oJ5KRo4N6
$$ 16 5 -24 -6 -1 7 -9 -20 38 6 -18 -18 9 9 -27 15 11 26 4 -18 22 49 -13 -15 13 14 -19 -25 3 14 -5 -11 4 6 15 -49 7
4530Gj1j1J7j0L9j6j5MM6m7qJ1J9l9L0j8mKJ1kJ3L4k5m7O2m8%k3L2Lnj2J3J0P
$$ 7 -4 -15 2 -8 31 15 0 4 50 3 -5 6 25 -14 16 -2 -6 -4 7 5 18 52 27 -20 42 -6 -6 -29 3 6 1 -11 2 12 19
4565A9k8K5Ll0RmJ7jn5K1J8K0k4mM2oj0jL0k9j1QJ1RrkLJ5l7kK2j3Qk1RLj5rL2
$$ 19 -9 16 19 -11 -2 -6 11 10 -45 -24 -6 14 -10 -14 28 22 12 11 41 12 1 9 20 29 20 18 21 36 -1 -3 19 6 14 -7 2 5 -10 -19 13
4604A3J8l2k1L2J3k5pK0J9m8RlK3j1j5K9k6K0lj4J2J1n7N0j0J6l1J3J0pJ1k8L6
$$ 13 31 -1 -22 10 23 -2 -9 11 30 -18 -9 -12 11 0 -15 14 -12 8 5 -9 3 14 -43 7 -3 13 -18 -5 5 -2 9 -19 17
4637A7%oLj8j1M9l8J7J9l9j1J4Oj2OL4jm1J3k9K5K6l1j8K2nQnM4j9ol0OM7l6k0
$$ 17 17 11 14 -4 -15 34 -4 13 32 -7 -18 -4 2 -10 -4 30 29 -12 1 -28 -3 23 -8 -26 -4 -9 -1 -6 38 19 13 -17 -11 36 0 -20
4673b0K0Pj0L3k3J5rjk4L1J2l0Oj9L3m1jj5L4J3k7kL1j4k6L8Ql0j7L2j8pK2Mk
$$ -20 0 7 -3 30 7 22 13 12 -12 19 31 1 7 -12 21 -20 -21 -36 -2 11 -16 -18 13 -1 -27 11 19 -11 -28 4 -14 -21 1 5 3
4708CPlJ1j4J2l7OJ2K5j2j4J0K7l6qOK3k8MLJmj5K7Npj6nK4J8k9K1j3k1L0pkO
$$ 3 10 7 18 4 16 -21 -15 -3 22 10 -4 6 33 -3 -11 -5 18 -10 -6 -3 -2 -6 -21 6 11 4 -12 -17 7 25 -4 17 4 -17 13 6 4 10
4746A0qOoJ9l0j2L0J8l6OlK4Lj2J4Jk1k%J3nKj5%J2Lj2L7k5j8j9J5K2k7J6j4J6
$$ 10 2 8 2 21 -9 -21 9 27 -9 -3 -6 18 21 9 23 24 3 1 1 14 9 11 -4 -4 8 11 -1 36 11 -7 -26 -11 11 -16 0 -14 2
4783Bl1L6oJ3l5K4lK0l0J9J0Plj5J6j8pmmO2l3k5L5j0J6l9NPj0MkLJ0Jkk1J1k
$$ 2 -29 7 1 14 -21 3 0 20 -10 9 19 26 23 8 24 6 -1 -5 -9 53 20 -5 30 20 36 -3 2 9 -1 3 1 4 14 15 13 -8 3 1
4821Aj9K9oqk4J8J0j2JKJ2lkrJ5nJrK3q%k0L2k1LOJ6Jj8Jk4L6mml4J5j9L0%pk4
$$ 1 -18 11 5 -3 -27 -9 1 -11 -10 -8 4 1 -1 -10 5 0 1 -8 15 7 7 -13 19 -2 1 7 23 24 6 7 -17 19 15 11 -23 -8 -27 3 3 -4 -28
4862b8J2K6Jmk2JK1k0j6K4qK7j9J3J4Ok5k3K0j1j0%K9J2j3J1LkK8l3J9lj7l3L6
$$ -28 -16 10 11 7 -15 -14 7 -13 -29 -5 -13 14 -5 8 22 28 3 -20 0 -11 -21 -21 8 20 7 18 21 19 47 14 33 30 13 -20 16
4897A6p%j6nK7k7LnK6jk5joM1l4lL2j3l7M4JLQl3K8J2j8k3K0Nj7QlJ1Pj5j0N0
$$ 16 9 9 -7 -12 15 -12 -9 -14 12 11 -14 -15 -21 20 -14 -17 15 2 -35 9 10 13 21 -12 16 28 10 -13 7 12 -5 3 0 11 18 3 -7 43
4935D3k5j2J2j3Qk3J5%Oj4j3L8j5K0l7K8qj9j0J9M2o8J0J7J3Nk4OK7rl0OJ4J6
$$ 43 18 6 18 5 13 -10 5 5 11 -3 -16 22 7 27 -10 18 10 -9 -19 0 42 -26 -16 1 14 19 -5 1 28 19 -11 -5 9 25
4969B5j0JJ8nrk2K7K2n4KJ6Qk0J4Qj0Qk1nL7l8N%J5j6j3J7LLj0JKK0l4J0J9J5
$$ 25 15 16 34 29 20 -2 25 47 -7 -5 11 19 -1 13 21 11 19 -2 -7 30 -8 -3 -3 12 -4 -17 0 3 6 -4 -3 -1 19 -15 -5 14 29
5006B9k6J6J5j3k5pJ4RNk1K6lJ1j2L0k5J3l6lJ4l8J6J7rJ4Nj2Ql5L3k3K7j6k0
$$ 29 3 19 34 21 -4 -11 3 12 17 -4 22 19 30 18 48 23 36 0 -3 11 -27 -11 6 -3 11 16 4 12 -23 10 -13 14 -2 -22
5040b2J4K2RPl6J9%k5K2pjJ3k8K4J2Mm2K5K0k9%LMkj3j5N2l0k1J7L4J9l1k5L4
$$ -22 -8 14 23 30 -6 13 13 -12 10 3 2 15 -13 11 23 27 -15 10 30 1 1 4 8 6 -7 -22 30 0 -21 -4 30 49 18 -7 27
5075B7l5poK8pj2j7M2j0Mj6kJ5oPNNj2lmL3Jl6PK9k0k0nK0Lk2L8j7J9m7jJK9j0
$$ 27 -8 -15 -21 7 0 -12 -29 13 3 7 -9 -11 4 -2 5 10 15 3 0 -4 29 30 -6 1 30 10 -10 -15 5 8 -14 24 7 26 -21 -22 -21 8 -2
5114bkRQMk9j3M8k2POj2ojoQM2l1mJ8Jjk5L0jk3jmlKJM2j6k0rlJ5J3m7OK1k1N
$$ -2 -4 5 13 17 -12 -25 23 1 8 14 2 -4 -5 -11 -3 39 8 4 22 23 22 -3 27 26 3 2 -2 -5 -3 -2 40 24 4 -5 -8 7 20 -27 -21 0 -21 -16
5156a6OK5J2l4J7rRnjOm%j1LK6j3Moj4J1j9K2j0K2l2j2O7j0j2j3kK1k4JJ3Rl3
$$ -16 -10 15 27 -7 10 1 10 5 4 10 6 6 -5 -2 24 11 15 9 -5 6 -13 9 -1 21 -11 -23 44 34 22 9 7 28 4 5 18 27 -6
5193fJ7kk0J4j3J8l1J0%M7m5K3l7L2Qj5Ll9M5lk5L3j8LLJ7%j9qJ7pmRlPnPnJ9
$$ -6 11 9 -11 3 -10 8 -23 -13 -13 34 -11 12 -25 7 15 0 3 -36 9 6 -19 14 -4 -1 2 19 19 0 -8 9 2 -2 7 4 11 6 13 8 27
5232B7j6m2L2J8k2RMj1J4j4NjrL6l3mJJ3j4J0J7Lk6L5j5j6lmJ3J0JoJ3Pj7JJJ6
$$ 27 11 -31 1 19 -3 6 10 -1 13 -1 4 3 -6 30 -3 -7 -6 7 -7 3 20 23 -3 32 17 1 -2 -6 7 17 18 12 25 32 15 16 17 33
5270C3n7K6j9RlJ0J3Lj3j0J0llJ9k5K9J1j8OQl3Jj4K0rj0mK1ooJ5JPpqRJ6k9K
$$ 33 -24 2 -17 -8 -11 -1 12 15 2 -8 2 -1 -4 15 -10 19 30 12 18 26 -7 -6 -20 0 -9 -19 -23 -2 -8 -14 1 2 9 2 -6 3 19 -10 -8
5309hMoK8j8M0j6j0Rj0k5L3j4k2K8j7j0K2qK1l2NL8mn6j2K8K4j0k9M8j8jPjk4
$$ -8 -4 -10 18 0 40 24 14 23 13 -12 21 7 -15 13 -4 -14 8 0 21 -11 -6 32 28 -28 -40 -12 12 2 -27 21 3 2 9 8 -16
5344a6j%KL5j0MJ1k1Pj3K6k8J7J2nM3m0mj1%lj5lnLNj7pK7L9k6kok4J8LJ5%k5
$$ -16 -17 -17 -15 20 10 14 25 4 11 -2 24 -4 13 25 20 63 23 19 8 8 5 -10 -13 -18 -15 -10 -27 -34 -7 32 6 4 -2 -26 -8 -5 10 10 -15
5383a5L2%rQj9KJ2j1j0POPl7N8j9j5J5J9j4j5j4J0J0krKL9n1Kj3L5kl0K2KRnj
$$ -15 17 17 8 16 -3 -1 11 0 -10 -3 3 10 -27 31 12 -3 12 31 17 2 -12 -2 8 6 -3 -1 38 -13 -11 -24 11 9 -21 1 3 12 7 6
5421FpK2k8K7k3KOkJ3RNk9J4K1k9KKJ2lj8KkK2k0lqPJj5KJ6j9J5J2Nj3MlRNMj1
$$ 6 -1 21 -7 20 -3 -1 5 3 16 25 30 1 15 36 7 9 11 23 20 2 4 2 24 4 1 -7 0 1 -14 -12 4 -15 0 12 17 4 8 5 14 19 23 12
5463A2Jk0OlJ8j6%K8l1J8rJ4j1r%RpnL8k7j1J2J8k5J0Mk4NM7j4j7J7j8oKk4J8
$$ 12 13 -7 -1 -4 14 -2 -2 26 -5 13 4 18 7 -2 -2 7 0 -5 33 6 -5 7 25 0 10 14 -10 -5 42 28 11 28 10 4 6 -18 0
5500@PjpkJ5Pl2J6lNk2K3J1jk9K7MNm2L2J1j0j7LNLJ4Lk0j9K1%RK3nk7NJ3Mok9
$$ 0 7 6 -1 -3 12 19 -13 3 0 5 -17 6 17 16 -13 14 18 23 -19 13 24 14 -3 0 5 8 22 25 5 -14 7 7 16 39 34 7 12 25 29 23 -6
5541fK9j1kj0K4nrmJ1j7j0L7Mk0rJ1k9K7j7J1L3l0j0PKJ2km5K4RJK4j4kkk6J6
$$ -6 23 12 10 0 24 19 10 6 17 0 -10 27 31 11 2 13 -16 11 -6 5 38 8 -2 5 7 19 17 -28 -4 5 6 30 16 14 12 -14 2
5578BkKk1JJ6J4j2J8k2J9k7JNJ1J1j5K4qk6K2nJ5l7K7j6J6Pk2J1j3KlNkL2lk0
$$ 2 0 2 -19 -18 -2 12 0 18 -4 15 -12 -11 -6 5 16 1 25 17 -9 13 8 23 -14 13 -3 13 20 -2 9 -4 -2 -5 0 -2 30 27 7
5615GJ8lm1J9J5Rk6jJ0J6mm9N0j6l6L1K0j5J5qj1M8o1J2JL2J3n2MJ4Kj2J4j4l
$$ 7 25 22 -19 0 15 24 -2 -3 7 23 19 -30 20 4 -32 -1 19 4 19 11 0 48 -13 -1 0 32 45 -7 -3 11 13 1 15 1 -2
5650bk0L7j6K6m1QJJ3j5%J2J8j6k6OL4l3J9jJ1kk3J2kk2ONJ7PJ3j0k5M3l1NJ0
$$ -2 -22 15 -1 25 -16 -8 -7 6 -9 -9 3 21 5 -21 -15 19 -14 5 4 15 13 -10 2 0 -22 -16 -11 6 13 26 16 -9 34 3 8 18
5686A8mj6j0K0J1j1rRM0m0J1Lk4J7m9K9K5KkMk2j4j8K7L1l1JqJ8Pk7J2Okj5J6
$$ 18 14 -2 -12 8 19 8 -1 8 48 8 19 22 -2 15 -34 -5 20 22 20 24 2 -12 -30 -3 28 -3 -2 -10 8 15 -12 0 6 4 -11 5
5722EPj0rK3OJk7K3om9K3L2j8QJ6j2QJ7k9Lrj9J2j3KJ3j7%J8j3J3oqJ1kj9oM3
$$ 5 12 2 -7 16 22 23 -4 19 13 -36 -13 19 1 9 25 13 21 38 9 12 3 -16 -4 -17 -15 -2 -19 -19 -1 -14 -1 -7 -15 -4 -6 -25 -31 12
5760A2kj2K8j5k9K3j6J0K8J1j7Qk9J0jL5k9k5L9l7K3OrqJ0mKqkL0m3JJ8K1l3L0
$$ 12 10 -2 26 11 -18 5 -11 -1 27 38 21 29 0 10 9 44 15 -10 29 -8 15 21 12 4 14 10 12 4 2 32 -11 -10 8 29 -4 26
5796B6j7pk7K7k5QM7n1K3J3j0mJ0jPqqnLPj2LjkJ9j5kOj1lMJ0J4j8lJJpJ2K0j5
$$ 26 9 2 -25 2 -23 -15 32 -19 4 17 7 3 13 12 19 11 3 -2 1 8 -4 -1 -2 -4 15 0 -2 4 -7 -10 -6 4 18 0 -3 -2 -1 -8 4 24 9
5837InnRj1%K4j5j5K5jqRk9M4k3jLK8k0j9J8J2nl1J0ML5k5J8k7%J9k1Qrj2J3n
$$ 9 4 -1 8 -3 -3 21 6 -9 16 15 7 16 -13 31 8 7 10 38 18 -1 17 29 24 -7 3 7 42 17 35 8 8 27 6 14 5 -7 6 1
5875Aj2nJ6jQQpoK9k5poL8l1j9J2J1j4J4K2J1ql9J2L3l1Lj6K0K3k7K8l0rK9j2
$$ 1 -11 -16 0 -1 7 15 8 2 31 6 -1 -7 31 0 -19 -7 4 -10 4 26 37 29 -10 2 35 4 7 -9 11 34 7 35 5 -4 25 13
5911A3jJ6j7Nk5J5JLj7JOjjL0m7J9LJ0J5k5mJ0kNjQrj7K2Nnj7K6K1k4lj7K2j5
$$ 13 12 28 11 16 -9 6 7 10 -7 -6 0 -1 -2 28 -19 0 3 13 28 3 -1 9 7 12 11 19 10 -7 15 20 15 -2 24 45 21 18 1 23 8
5950HJ1Mj3j8J6J0Jl4K9k8Pj2K6Rk4K8K1k1k2oJ2J3l6J0POjj0J8QmrpK4l7L2j2
$$ 8 19 23 10 -8 8 18 19 -15 14 -14 -7 -19 7 16 -8 20 41 20 -2 -8 4 17 -19 -9 -2 4 3 -7 11 19 15 6 -1 23 -14 18 6
5987Fkj8J7ojMj6L3Ppjj4k3N0k7oNl1L9Jj4J1Qk2QpnnK6j0PJ3j5J7j1rj1K3rp
$$ 6 4 -14 3 -3 -4 0 -16 17 24 17 16 2 -21 29 2 -4 1 -30 9 10 -4 7 15 -7 1 -6 -11 -16 10 0 7 20 5 22 11 2 -9 14 5 -2
6027bL1k0J6ok0L2lj8j0K1k2j%J9k0K2j4Rnk6nL9k9J7Pk4J5mpJ1J8pqQRj8l8L2
$$ -2 29 9 25 19 -1 31 28 10 0 21 -1 -2 -2 17 -3 19 5 14 9 -17 -22 17 -12 5 12 -12 3 -1 -8 3 21 14 6 14 23 5 -33 -1
6065aL0o1jK4M2j5Ll3J5LJ1j4Ql0PK1mk4N0l7J5Ll5L5j4J1j6mJ8Pl6QLJ2rj9K7
$$ -1 29 -32 -33 -9 33 18 21 -12 3 6 17 3 11 -19 -12 9 5 -19 31 -6 9 12 -23 12 -2 9 -7 -11 7 14 -22 -14 -11 1 -8 -27 0
6102@lPJ2oK1l0K3j3nkJ1jOj0Qk9K4k0J0j2oK5mL2l6Qj6rKK1k2J9lj0K2m7K4M
$$ 0 -3 4 16 10 31 1 24 11 6 4 15 14 20 10 18 -11 13 -7 3 -9 -15 10 6 38 2 10 -6 -15 -13 8 -14 5 2 -8 14 -33 -9 -5
6140emkJ5j8L2J1m1M8m8L3j8K3j5J4j1nJlj5J5Ok2K7l1J5qL0j4pK9l8mJ6j1J1
$$ -5 -9 -11 4 -14 18 29 -12 36 -12 21 3 26 11 25 14 9 10 7 -8 7 13 -9 18 -13 2 -6 24 10 3 32 -6 -10 6 -5 6
6175Fl5J9PPk1K3j2j1L8pj7QjK4k4j0qJ2J9J8k3J2j1jjK5k2j1k0MK2K4m6j2K5
$$ 6 -29 -10 -3 4 -17 6 -6 -17 21 14 -3 5 4 28 4 -6 -14 -2 17 35 12 24 13 12 11 36 14 3 -17 -13 9 33 -13 -25 0
6210@j5JJ4j1rK2j5K7kn%oqJ7Mk5J2J1K2l5KJ7j8oKjJ2koJ3MmJj5Jj1M7l2koL9
$$ 0 -15 -14 0 -11 -20 2 -13 14 12 7 7 1 -7 10 14 -11 1 12 34 -1 1 18 0 -6 -4 -5 7 5 -1 12 16 12 13 -2 -1 -12 35 3 1 -5 34
6251C4j1j0%m7L8lNj0K7l2KJ1J5Ml5L2k0k0L7k4K6Nk1j4L6Jk6rL6k3k2J3J0Nj9
$$ 34 23 13 13 -34 4 1 6 -4 23 -9 -7 4 19 23 -12 20 0 -20 17 -7 19 24 3 -11 25 26 0 -9 27 4 -18 -5 5 10 -9
6286iJ0kJ3j4mK6jQl2J9l4J1Rj8L1j9J9j4j4NpNJ0jNK4l2K9j9Joj7QK6j5k2L1
$$ -9 1 -1 12 -2 -6 20 19 27 -5 14 -20 -9 0 -18 13 -6 13 -1 -15 -10 -17 -12 -2 -3 2 26 -6 23 4 5 -1 -18 -10 16 1 -21 10
6323A0k5J7oj5L6qQk1OOj9PK4l1K1Pj5%jj2Pk2j1P1k9jj3J1nJ8k6L3pnk4J5Mn
$$ 10 -15 2 -4 -19 17 9 17 -4 2 8 -11 -4 20 -11 10 17 2 2 1 -11 -4 -26 -37 34 5 4 -9 2 -3 15 -11 22 15 10 -14 1 5 0
6361@mKJ2j4J2pOk0L0kJ3n2K9oRj7Nmj1J1oM4k8J3Mm5K5J4j3LNK0m5K7Pj9lQm
$$ 0 -4 -2 10 -4 8 1 7 -13 17 15 28 -24 5 -1 8 -9 -4 -8 -19 -8 -14 30 2 15 19 -26 -1 13 0 3 8 28 -17 10 17 -2 -5 3 -1
6400aKj3K3J3k2qJ1K2nm1QL5olk9LJ0J1j0J1jll1M0nrk2KkJL7j2k9K0j2QPQJ1
$$ -1 1 -12 11 24 2 -6 5 27 22 -19 -11 24 18 15 -14 -11 -1 10 0 11 10 7 -24 16 11 2 -20 -18 -20 -19 18 6 -23 -3 -15 -7 0 8 19
6439A9m3OJ2j%L4j0oJ6m7kK1K8k2Rk1pNK0k0J0rJ9K0l4koK0pj6QpNMJ5rK3k5k0
$$ 19 -24 -18 -6 -7 -7 27 17 11 27 -20 -22 -1 27 5 14 -7 -14 -9 11 -9 1 -8 11 31 -3 -5 -11 9 2 -14 -6 -13 -8 -4 11 2 25 0 -20
6478b0K2Rk2K3j2j7M1j1nllLJ0ll1L7l8L9Mk3K0j9KNJ0k2J0k3J7NlK0n1J8K1N
$$ -20 2 11 -11 12 0 -17 24 13 8 5 2 5 15 12 -19 18 -20 19 23 0 20 1 3 8 18 -4 6 -17 0 5 2 22 -29 -11 10 15
6514A5k2J0Rk5K8j0j4J1pj9K7K3j7j5j6J3j4L6mQj5J4jm6M5j3J7k9MK9J1rj5J
$$ 15 -7 3 12 -13 15 5 -9 2 -5 -24 3 26 9 -6 -22 -9 -23 13 9 17 2 16 15 -31 14 1 18 -11 -7 22 33 24 9 10
6548A0J7k5rJ8kj2k2J9J8J0rrkkj7k1N0j3lMk3J5mPK0j4RkJ0J7j5k2MQPj2J6k6
$$ 10 27 2 -7 11 9 -3 -25 -6 12 22 13 4 2 0 -17 -38 12 -1 -4 0 -23 -8 -12 -5 15 1 10 8 18 35 20 -2 2 10 17 5 21 -5
6586eK3j7jL4Ll4RPkl9mJ1Pnj9L4J0j6j0J7rK1j8RJ6k8J1NJ0k1J6Jj6MlK2Mk0
$$ -5 18 1 0 34 37 3 12 19 17 -22 -26 -15 -8 -13 -32 2 12 -4 -14 3 -6 15 -3 6 22 -6 5 10 20 -1 15 16 0 4 1 23 27 7
6624GK5n0J8M0o2K1MkOj3J6j2j8K4j8MJ3J2j3Npj0K4l6K2J3qj5M4l7J0J4k7K5
$$ 7 32 -18 0 40 -22 -1 3 1 7 -6 10 -2 -20 4 -14 -10 3 15 2 7 0 -10 14 -22 0 13 5 -10 34 -3 7 21 -6 19
6658A9pK7l7NqJ1Kk2kJ5J7j1MpK8j6k9j0J5J5k7K0k0MmjJ1jmM4l2krpL4j3j8k
$$ 19 12 39 2 7 -1 10 12 -10 -12 3 20 9 13 6 34 18 -11 -21 -6 9 -18 2 -18 -14 -18 -19 -8 -9 -13 31 -1 -3 -12 -19 15 2 -16 -18
6696a8L8j3l3L0J3rj9OJ8pJ2l7J6KjJ9J7j1l4K7jm1K7pqMK4k3RJj%k3J4J2Jj6
$$ -18 20 7 -26 4 17 8 -11 -5 13 6 18 -19 -3 -1 -2 17 34 23 -11 16 15 -26 1 -6 -14 -10 14 -9 0 1 0 0 -23 -9 3 4 -12
6733a2JK2j7j2M7k6J3j8L9j1m5N0k5lKlK0m2J4%qJ5J4j7j1LK3k6lk5M3Nj4Jor
$$ -12 -11 11 -6 -18 29 3 16 -2 37 26 -19 31 6 3 5 2 22 -20 -6 -6 -14 1 15 -2 -13 -10 13 -13 -16 -41 2 7 -7 -6 -12 -21
6769b1J4k0K2njJ9oJ6j7J8jj9K2k9JLj1J9J3nRKkpnpK8l8PJ3%Krj0K4j4j3K2j9
$$ -21 -7 -27 -5 -10 -11 8 2 18 1 19 18 -1 21 -8 -7 -4 -15 4 17 12 21 23 21 14 9 2 30 -8 -1 12 12 14 5 -5 19 5 -8 14 -5
6808eJ3Pj6K3n3K6K0jJ5j6l0nM4k7j4L8mk4L2k6K3ok5L1prrJ2nkPoNPnj4J8j1
$$ -5 8 15 -1 22 -31 -5 15 14 29 13 -17 -22 22 -5 -19 19 15 -9 23 -3 20 14 -11 20 13 4 -5 7 2 0 7 1 6 13 8 -6 12 1
6846AN%j3K8j3j8QplQOl5K9lj2J9j3NJ2j7J9%K0kj4J6k5lJLLKPj6JQJ4nj4j0M0
$$ 1 6 6 -7 21 8 -10 -2 -9 -12 -4 2 -33 -4 -7 -19 0 -13 -8 4 -13 6 6 26 24 10 26 1 -2 -1 2 5 7 14 -2 -1 7 21 16 2 -8 32
6887C2j2oj8jJ3Mk4J0nK1Nk7J9Kj5k0J7K2k7PK2rK0l4OPpK3k1%KnJ5Mk1K4Ll0
$$ 32 20 14 -4 -5 8 12 -12 -2 -7 14 19 -8 11 13 -2 -22 -5 17 -10 -3 19 10 30 -4 2 9 2 25 4 4 6 1 16 20 -1 23 26 -4
6925dJ5Kj4Lmj3KnJ8j3J5K6m3qJ7%oJ5K6j8nOkk6J1K2j9LKj7K3QNMl0JMpL1k3
$$ -4 11 13 -1 2 -2 -15 -13 -18 0 -13 2 28 -15 -23 -6 -6 -12 3 29 11 6 12 10 -16 -5 17 -2 1 3 -14 9 17 22 26 -4 -3 1 -6 25 2
6965BJ5j1mJ4kOj0%K4l5K7j9j2j2KK7j6Mj5OJ2k4L2Nk5L%JjK0k8J3k5J9K8pJ2
$$ 2 17 6 2 16 14 20 10 10 34 -1 26 7 -5 -17 -15 12 -4 0 -15 -9 3 -21 11 16 -9 -6 -6 -5 -6 14 -14 -1 -26 -7 21 14 26
7002B6m2K9Kk6K5Oj5%J7j0j5j8L3mm1K9Pj7J2J1Oj4l1K8J0Jj4pJ7j5k%K2j6NJ0
$$ 26 -16 13 15 -11 14 20 5 5 22 12 -3 -21 12 8 -33 -4 3 -14 -2 9 15 1 -30 -2 8 9 -5 -12 5 -10 -12 -12 10 -6 -1 9
7038Ik1K8LJk1J4pJ8j4J1J1l8nRPMkKRk6K5j5k1K8lj0kKJ1Joj3J6j1L4l2MJQj9
$$ 9 -12 16 19 20 -1 13 6 24 10 21 32 -6 -11 -2 5 9 7 9 18 -8 17 2 -19 9 6 -4 -6 -4 7 8 2 -11 5 -6 28 -4 0 1 9 -10
7078a0J1NK0kn1L9J3Nk4K3l1J1kk0M0l0J4j2pJ7nJ8j6mK6j7k4J7J2k4K5j5k6L4
$$ -10 1 6 26 24 -27 12 25 30 6 29 -2 9 7 -13 27 -3 11 -1 -8 9 4 22 6 2 28 11 -13 4 16 -8 17 2 -24 10
7112A0k5RL8l6j3lL2mk1Rj0J1KJ2J4Lok9MKK9l7J2Qj7K5l0J4pJ2k3J2j4K0k3L4
$$ 10 -15 -6 32 -4 -17 -20 12 8 -13 -4 -14 -3 -1 11 25 28 22 -7 -3 -1 28 -9 3 11 -6 19 -11 3 -4 8 -15 -3 -17 3 -20 14
7148A4j7j5jKL2k2QK2%m0K1J3j1j9L3J0pj4j0lK3j0nj5k8L9JRj4L1l1JJ6Jj4O
$$ 14 -3 -18 -19 -17 15 -7 1 23 23 -17 4 17 6 -13 20 30 23 9 -1 -4 19 9 4 -11 -39 0 1 10 -4 27 -4 -3 13 14 0 6
7184Fj1Pj2Oj4LJ3pK6k1Jj7RK2k8J8%rj3J1K0j6P%JLnRJ7nj9K9j8omPrk6J5J9
$$ 6 -5 2 -10 -4 -18 -15 -2 -9 17 -4 -3 -20 -11 11 -17 1 1 -8 -21 -10 10 -6 1 1 2 5 0 9 26 21 2 31 13 7 3 10 1 -25 -10 9
7224Ij0K2l8L2Ql5J1j7J0PPl7K9JJ6noj2kQOj9NNJ9J1j6rLL8j5n1RPL8j1k0Oj
$$ 9 -1 21 -17 15 23 -12 -1 -18 -8 -1 6 -31 -2 -1 15 10 4 -8 -10 -2 4 -15 -10 -5 14 25 9 0 3 41 26 -25 -16 -9 29 18 -2 4 3
7263CPk7oL8k5OJ8Rl1K9k8lJ0j4mQJ2m2J6LNK1k9K6nj6L4k7kQL1j5j9J1j7KJ3
$$ 3 10 -17 -23 15 -10 -4 14 23 -8 21 -7 -10 0 -14 -18 -10 2 -40 -24 -21 -16 5 -24 2 -3 -19 15 -12 -14 -6 25 10 -9 2 -15 -13 0
7300@lJ9j5RJk2K4jkqJ8k3K2k6Pj0J1l3QL4Ml6L6%k1J3k7O2k4J3l6J3Qj4mJ0L
$$ 0 -3 16 1 10 11 -11 13 12 10 2 20 -3 19 -7 0 -10 1 -32 -24 10 14 -22 14 14 -7 6 -21 41 17 30 -6 7 15 1 -3 7 10
7337A0LlPolmj6L4l7jM3l8K5j1Lj3Rnknj7JK6Qm0J9mK8k7J2k4K0oJ0QK4j0k7%
$$ 10 13 10 17 11 8 4 -12 22 -15 -16 27 -11 14 3 6 -7 2 -3 -5 -10 -27 -26 0 8 -32 -13 -17 11 -16 -4 -28 -8 -14 -4 4 28 18 -9 -9
7376iJ0lPpoPJ6PqJk1J9k3M0m7K5%j3rnK1J0%qQn0M8nj2LRRk5OJ9j9%J9l4rL3
$$ -9 1 -2 5 -2 -8 -1 15 22 14 15 -6 13 -10 30 -17 8 8 -5 -14 -19 2 12 12 4 12 -38 10 5 -7 -4 5 14 -11 -5 14 -5 -5 14 -20 -29 4
7417DK2l7K6k6JJ0J9%j8MJ5rJ1j2m1O5j8l9L6k3j2RJ6Ll7O8k6l3NNNKj4j9L0j8
$$ 4 26 -11 15 -11 -10 0 19 19 1 5 20 11 22 10 -31 34 16 -23 13 -10 -22 -13 3 6 -31 37 11 -22 -17 -12 -7 -5 -19 -38 -8 -26
7453b6P7q1PK4QJq1R2l6J0JJ5k5mRJ6r%kOK0qRj4k9LQJ6j6pkK4j6L2l6Q0q5J45
$$ -26 51 -30 -23 1 9 10 -71 21 -15 -5 -4 11 -14 -18 -9 7 -2 -2 -4 2 22 14 23 9 -20 -17 -9 7 -9 -16 -18 6 -10 22 -14 66 -19 126
7491A26k27K16p9l8K3n9R4k3Mp0Q7m1Kj5OKMMl2J1Orj3L1j9LJ1J1k8NJ2l1K3J5
$$ 126 -101 115 36 -2 21 -38 56 33 37 -33 54 13 15 0 6 8 12 16 -16 -5 1 -8 -21 10 -9 -6 5 16 -12 -7 5 -26 -3 12
7525A2K0k0k1kj3K4j0JrK2kj0K2l9K0j1QJ9j4K9J3n2J6J5k2PJK2Jn7K9L3n4J9
$$ 12 32 12 -9 -11 -24 0 -10 -9 -18 4 2 -8 14 -25 -5 -16 -8 11 -3 26 39 -13 3 18 -4 3 4 26 27 -30 -1 32 -22 -3
7559cK8l1J4j7L6j9j6KL1pl2L5J0k6kk3Kl2P5j13Q6J46k09R1pn9M0J8k1qJ8j7
$$ -3 25 -6 8 -9 27 8 -8 -6 25 18 -14 21 31 5 3 -20 -18 -50 25 -88 -2 144 -65 26 19 -40 0 18 -3 -11 7 -10
7591a0J9J2rommJ4K6l1J44j88J03N6j61J5K3j8M0%m0K8J9nk2QlmK5l7K0J2k0l
$$ -10 9 21 12 6 2 -2 12 38 7 151 -37 66 122 -39 -24 -1 -19 21 21 -19 9 28 23 1 9 6 2 27 -10 10 22 2 -1
7624aj3oL9n1M8k3K8j6kJ7j2rQj5Jj4ML4lroJ0JRk0J2j9mjK4j6mj0lM3m0QJ6J1
$$ -1 -14 -20 19 -32 16 -7 21 5 3 20 8 -1 7 -8 -7 -21 -17 17 14 5 -1 9 10 19 -1 11 -8 -12 -13 11 -5 -9 -19 -22 21 -19 -11 5 16
7663A6m5j4M0MmPQMj5jNL0j1k9K7j6pK2k5K7k1rJ8j1K3l3K2j6K0Jk3lK7j4J1l1
$$ 16 -29 -43 -3 1 -3 4 12 16 1 0 5 35 24 -5 22 6 -1 21 -4 23 2 -7 11 0 23 -10 12 -4 16 17 -6 -9 18 4 15 -16
7699a6K1J8l9PL2m8L5J9k0kl5J3J0j3J7K3k8J8k4J7j0oL0pkJ2Qn2J4j6L2LRk5
$$ -16 5 23 -16 -9 23 -25 10 29 9 7 -28 -15 -5 -18 -1 22 -6 12 -12 5 -5 -11 19 12 10 22 30 -22 -8 -24 8 11 20 -5
7733ej0QK6m3M2Nk3Nk0J7J9k4KrQj6L3J3j9k6LJ3k3J8J3j1NK5k4J7j6J5J1m1L9
$$ -5 -15 -7 19 -24 18 23 0 5 -15 2 21 -3 -1 -10 -2 -18 15 28 9 -17 -14 -1 -24 -6 7 -4 1 26 2 19 3 18 29 -12 27
7768B7k7J8l6jL1Ll0MK9lj7mQj8J9Qj1J4m4K3J7rMJ2m0K1j2nK1j9K1j2rL2nk1
$$ 27 0 18 -18 -19 12 15 -15 -11 18 15 -2 -6 2 -16 3 11 0 14 -30 -7 10 1 5 17 -23 -2 -14 -19 2 -17 4 -8 -17 15 10 -11
7804a1J0J8k7M8m7OOJ7j7qJ8k0J4KJ4k7MmpJ4j7K3k3K9j3k2J2j5J7J6rPk9J8%
$$ -11 -1 17 -10 38 -9 -3 3 20 3 -5 13 -7 7 9 23 -4 0 -4 -11 3 -14 9 -14 15 2 -20 -8 -23 -6 10 1 8 -21 -3 -3
7839cProJ6k5L1j9J7J5Mk3Ql2K9J6l0K3k3M3l6JoMj9J3j5M8l8mjj4L3l3J6PnJ4
$$ -3 4 -5 -11 5 -20 11 -8 9 24 28 5 13 -19 10 26 -4 19 -4 39 3 4 -2 2 -17 -4 -19 29 -9 -13 -14 -28 5 -28 -12 -5 -10 4
7876Dnk3K7k9L0jj2J2j5M6m0L1j7oPK4m4K7j8L1k5oJ2Nj1pJ4J0k4LJ7k3jpJ1l7
$$ 4 -1 -24 3 -26 4 3 -9 3 -12 34 -6 25 8 2 9 33 -11 16 -2 29 4 -2 10 15 4 -3 11 21 -3 0 17 -6 -7 -14 -3 -40
7912d0O3n4N3k3k2L1j9K0j3LOnrJ2qJ7j4J7JRk0LJj6K0j3k0J7OJ0j6J9k0Lk1J2
$$ -40 23 -31 22 -1 -23 8 -11 9 -4 -1 5 0 -9 3 -5 12 -2 15 16 25 5 8 9 -7 13 0 -20 -3 3 13 -3 16 -4 -1 -22 -10
7948a0J8nJ6m0PK8k9K7k0MJ5k6L2k5Oj0j5J8K4J1k0kpLMPLOpK2j7J1ql2%LLK2
$$ -10 8 3 19 -21 -14 14 -15 12 -8 -4 11 -15 17 -8 -2 -12 -27 -9 15 26 6 4 -3 0 4 11 14 20 13 35 18 29 21 -11 -11 -8 -5 17
7986A7Qj4j1J6k7RLjrRj5LLJ3MqmrL2j0l1L7k8L7j4jRk5JK2J6l4K4knj8J5k7L8
$$ 17 25 11 0 16 -11 -2 1 0 -9 0 -15 -12 -9 4 8 0 -4 -13 19 9 -22 15 -13 24 10 9 18 -7 -6 16 32 -2 22 20 15 -3 12 -15 23
8025B3j9Pk2OnMK2J7l1j5J2lJnNK1m0j3N0k6K5j3J9j1moJ1Lj2J6k3N%J3Jj1K5
$$ 23 4 11 -11 -5 -10 -6 16 33 2 -13 -1 -4 -3 -8 -3 18 -22 -35 15 -11 14 1 20 9 5 -1 10 13 1 17 -6 -1 -1 12 13 2 27
$$ [...]
8191b
##END NTUPLES=NMR FID
##END=
