##TITLE=1H_LY-n-BrBenz.ac
 CDCl3
 64 sc, 
 6.3.2024
##JCAMPDX= 6.0         $$ Bruker NMR JCAMP-DX V2.0
##DATA TYPE= NMR FID
##DATA CLASS= NTUPLES
##ORIGIN= UXNMR, Bruker Analytische Messtechnik GmbH
##OWNER= root
$$ XWIN-NMR		Version 3.5
$$ Wed Mar  6 13:54:07 2024 Russian Standard Time (UT+4h)  she@DPX200
##.OBSERVE FREQUENCY= 200.1313
##.OBSERVE NUCLEUS= ^1H
##.DELAY= (6, 6)
##.ACQUISITION MODE= SIMULTANEOUS
##.ACQUISITION SCHEME= undefined
##.AVERAGES= 64
##.DIGITISER RES= 18
##SPECTROMETER/DATA SYSTEM= spect
##.PULSE SEQUENCE= zg30
##.SOLVENT NAME= CDCl3
##.SHIFT REFERENCE= (INTERNAL, CDCl3, 0, 15.7039)
##AUDIT TRAIL= $$ (NUMBER, WHEN, WHO, WHERE, WHAT)
$$ ##TITLE= Audit trail, XWIN-NMR		Version 3.5
$$ ##JCAMPDX= 5.01
$$ ##ORIGIN= Bruker BioSpin GmbH
$$ ##OWNER= she
$$ F:/spectra/data/she/nmr/H-F/1/audita.txt
$$ ##AUDIT TRAIL=  $$ (NUMBER, WHEN, WHO, WHERE, WHAT)
(   1,<2024-03-06 13:53:09.92 +0400>,<she>,<DPX200>,
      <continue with go, POWCHK disabled, PULCHK disabled
       configuration hash MD5:
       00 E9 B6 7A A2 85 ED C7 34 08 36 98 17 FE 4E 26
       data hash MD5: 16K
       9D FC 9F 04 2D 0C 47 80 45 D9 7F 56 AE 70 A8 57>)
$$ ##END=
$$ 
$$ hash MD5
$$ 69 E2 03 AA BC 10 DF 90 89 BD 28 FF 0A B4 3D C9
##$RELAX= 
##$RELAX= 
##$RELAX= 
##$RELAX= 
##$RELAX= 
##$RELAX= 
$$ Bruker specific parameters
$$ --------------------------
##$DU= <F:/spectra>
##$EXPNO= 1
##$NAME= <H-F>
##$PROCNO= 1
##$TYPE= <nmr>
##$USER= <she>
##$AMP= (0..31)
100 100 100 100 100 100 100 100 100 100 100 100 100 100 100 100 100 100 
100 100 100 100 100 100 100 100 100 100 100 100 100 100 
##$AQSEQ= 0
##$AQ_mod= 1
##$AUNM= <au_zg>
##$AUTOPOS= <>
##$BF1= 200.13
##$BF2= 200.13
##$BF3= 200.13
##$BF4= 200.13
##$BF5= 200.13
##$BF6= 200.13
##$BF7= 200.13
##$BF8= 200.13
##$BYTORDA= 1
##$CFDGTYP= 0
##$CFRGTYP= 5
##$CHEMSTR= <none>
##$CNST= (0..31)
1 1 145 1 1 1 1 1 1 1 1 1 1 1 1 1 1 1 1 1 1 1 1 1 1 1 1 1 1 1 1 1 
##$CPDPRG= <>
##$CPDPRG1= <>
##$CPDPRG2= <>
##$CPDPRG3= <>
##$CPDPRG4= <mlev>
##$CPDPRG5= <mlev>
##$CPDPRG6= <mlev>
##$CPDPRG7= <mlev>
##$CPDPRG8= <mlev>
##$CPDPRGB= <>
##$CPDPRGT= <>
##$D= (0..31)
0 1.2 0 0 0 0 0 0 0 0.06 0 0.03 0 0 0 0 0.0002 0 0 0 0 0 0 0 0 0 0 0 0 
0 0 0 
##$DATE= 1709718568
##$DBL= (0..7)
120 120 120 120 120 120 120 120 
##$DBP= (0..7)
150 150 150 150 150 150 150 150 
##$DBP07= 0
##$DBPNAM0= <>
##$DBPNAM1= <>
##$DBPNAM2= <>
##$DBPNAM3= <>
##$DBPNAM4= <>
##$DBPNAM5= <>
##$DBPNAM6= <>
##$DBPNAM7= <>
##$DBPOAL= (0..7)
0.5 0.5 0.5 0.5 0.5 0.5 0.5 0.5 
##$DBPOFFS= (0..7)
0 0 0 0 0 0 0 0 
##$DE= 6
##$DECBNUC= <off>
##$DECIM= 32
##$DECNUC= <off>
##$DECSTAT= 4
##$DIGMOD= 1
##$DIGTYP= 9
##$DL= (0..7)
0 120 120 120 120 120 120 120 
##$DP= (0..7)
150 150 150 150 150 150 150 150 
##$DP07= 0
##$DPNAME0= <>
##$DPNAME1= <>
##$DPNAME2= <>
##$DPNAME3= <>
##$DPNAME4= <>
##$DPNAME5= <>
##$DPNAME6= <>
##$DPNAME7= <>
##$DPOAL= (0..7)
0.5 0.5 0.5 0.5 0.5 0.5 0.5 0.5 
##$DPOFFS= (0..7)
0 0 0 0 0 0 0 0 
##$DQDMODE= 0
##$DR= 18
##$DS= 0
##$DSLIST= <SSSSSSSSSSSSSSS>
$$ [...]
##$SUBNAM2= <"">
##$SUBNAM3= <"">
##$SUBNAM4= <"">
##$SUBNAM5= <"">
##$SUBNAM6= <"">
##$SUBNAM7= <"">
##$SUBNAM8= <"">
##$SUBNAM9= <"">
##$SW= 18.0517328524113
##$SWIBOX= (0..15)
0 0 2 0 0 0 0 0 0 0 0 0 0 0 0 0 
##$SW_h= 3612.71676300578
##$TD= 16384
##$TD0= 1
##$TE= 0
##$TE2= 300
##$TE3= 300
##$TEG= 300
##$TL= (0..7)
0 120 120 120 120 120 120 120 
##$TP= (0..7)
150 150 150 150 150 150 150 150 
##$TP07= 0
##$TPNAME0= <>
##$TPNAME1= <>
##$TPNAME2= <>
##$TPNAME3= <>
##$TPNAME4= <>
##$TPNAME5= <>
##$TPNAME6= <>
##$TPNAME7= <>
##$TPOAL= (0..7)
0.5 0.5 0.5 0.5 0.5 0.5 0.5 0.5 
##$TPOFFS= (0..7)
0 0 0 0 0 0 0 0 
##$TUNHIN= 0
##$TUNHOUT= 0
##$TUNXOUT= 0
##$USERA1= <user>
##$USERA2= <user>
##$USERA3= <user>
##$USERA4= <user>
##$USERA5= <user>
##$V9= 5
##$VALIST= <valist>
##$VCLIST= <CCCCCCCCCCCCCCC>
##$VD= 0
##$VDLIST= <DDDDDDDDDDDDDDD>
##$VPLIST= <PPPPPPPPPPPPPPP>
##$VTLIST= <TTTTTTTTTTTTTTT>
##$WBST= 1024
##$WBSW= 4
##$XGAIN= (0..3)
0 0 0 0 
##$XL= 0
##$YL= 0
##$YMAX_a= 16321
##$YMIN_a= -3303
##$ZGOPTNS= <>
##$ZL1= 120
##$ZL2= 120
##$ZL3= 120
##$ZL4= 120
##$ABSF1= 10
##$ABSF2= 0
##$ABSG= 5
##$ABSL= 3
##$ALPHA= 0
##$AQORDER= 0
##$ASSFAC= 0
##$ASSFACI= 0
##$ASSFACX= 0
##$ASSWID= 0
##$AUNMP= <proc_1d>
##$AZFE= 0.1
##$AZFW= 0.1
##$BCFW= 1
##$BC_mod= 2
##$BYTORDP= 1
##$COROFFS= 0
##$CY= 11.3945322036743
##$DATMOD= 1
##$DC= 2
##$DFILT= <>
##$DTYPP= 0
##$F1P= 15.7292609196834
##$F2P= 12.9074282941183
##$FCOR= 0.5
##$FTSIZE= 0
##$FT_mod= 4
##$GAMMA= 1
##$GB= 0.15
##$INTBC= 1
##$INTSCL= 1
##$ISEN= 128
##$LB= 0.24
##$LEV0= 0
##$LPBIN= 0
##$MAXI= 10000
##$MC2= 0
##$MEAN= 0
##$ME_mod= 0
##$MI= 1.114404
##$NCOEF= 0
##$NC_proc= 0
##$NLEV= 6
##$NOISF1= 3.799351
##$NOISF2= 2.8
##$NSP= 1
##$NTH_PI= 0
##$NZP= 0
##$OFFSET= 15.70392
##$PC= 1
##$PHC0= -24851.16
##$PHC1= 10.98731
##$PH_mod= 1
##$PKNL= yes
##$PPARMOD= 0
##$PSCAL= 0
##$PSIGN= 0
##$REVERSE= no
##$SF= 200.130013532006
##$SI= 16384
##$SIGF1= 3
##$SIGF2= 2
##$SINO= 400
##$SIOLD= 16384
##$SREGLST= <1H.CDCl3>
##$SSB= 0
##$STSI= 0
##$STSR= 0
##$SW_p= 3612.71676300578
##$SYMM= 0
##$S_DEV= 0
##$TDeff= 0
##$TDoff= 0
##$TI= <>
##$TILT= no
##$TM1= 0
##$TM2= 0
##$TOPLEV= 0
##$USERP1= <user>
##$USERP2= <user>
##$USERP3= <user>
##$USERP4= <user>
##$USERP5= <user>
##$WDW= 1
##$XDIM= 8192
##$YMAX_p= 0
##$YMIN_p= 0
$$ End of Bruker specific parameters
$$ ---------------------------------
##NTUPLES= NMR FID
##VAR_NAME=  TIME,          FID/REAL,        FID/IMAG
##SYMBOL=    X,             R,               I
##VAR_TYPE=  INDEPENDENT,   DEPENDENT,       DEPENDENT
##VAR_FORM=  AFFN,          ASDF,            ASDF
##VAR_DIM=   8192,          8192,            8192
##UNITS=     SECONDS,       ARBITRARY UNITS, ARBITRARY UNITS
##FACTOR=    0.0002768,     1,               1
##FIRST=     0,             0,               0
##LAST=      2.2672688,     0,               0
##MIN=       0,             -3303,           0
##MAX=       2.2672688,     16321,           0
$$ Real data points
##PAGE= N=1
##DATA TABLE= (X++(R..R)), XYDATA
$$ [...]
104a891N91j98K04R63K33q1R48P73j40J77O74m11o82K24l27j136n70j26q10m79
124b064M12N2j26M51P24J98L82O69L14j69M67J88k23k25Q4k57n54j75j55n29n73
145a109P0r2l34K04L93qJ91O30K50M9M58M21k28pK99j62m15k3q7o80k38o2m13
168h93k63N1R7j22K21M66K44J70M77L23%K00J17k12k11J1k30l43k22o8k77j80
190f44p6Pj41M2K88j1K09K95K63O1K17K48k3L4O6j95l51k8j46k92j80r9j01j90
214g47qJ79o9J70K84R4J46K75K85k9P0Q1p9j44n9j32k81j84n8j92j52j3l8L7N3
239e11J91O6J04K00J33O3J86N1J3k9jk6k59J5j78j88j08p7j16K1QO6n1K14J20
264i3J61O4R2J73j10J06J88j61j43K1j13j70j3j85m4j98N3m2O3J7J25PR0K00N9
$$ plain form
104 -1891 -1300 -1498 -1294 -331 -98 -179 769 1542 1402 1579 2253 1842 1160 1384 1057 -79 -649 -775 -1585 -2064
124 -2064 -1652 -1600 -1726 -1275 -551 -353 29 698 1012 843 1310 1498 1275 1050 1134 877 323 148 -7 -536 -1109
145 -1109 -1039 -1131 -1465 -1261 -868 -876 -685 -55 195 244 702 1123 895 888 1187 1025 610 587 500 -180 -418 -480 -893
168 -893 -1156 -1105 -1008 -1130 -909 -443 -199 -29 448 771 771 971 1088 876 665 676 446 103 -119 -187 -464 -644
190 -644 -720 -713 -854 -812 -524 -535 -326 -31 232 293 510 758 735 769 835 640 289 261 115 -177 -357 -456 -557 -747
214 -747 -755 -576 -645 -475 -191 -97 49 324 609 580 650 731 652 508 449 317 36 -148 -206 -398 -550 -563 -601 -564 -511
239 -511 -320 -254 -150 50 183 246 432 483 496 467 466 440 181 196 18 -170 -278 -355 -471 -450 -442 -376 -427 -213 -93
264 -93 68 132 224 397 287 393 581 420 277 298 185 15 2 -183 -227 -425 -372 -414 -351 -334 -209 -202 -112 88 147
289A47K8J45L3k4k5L9k4j96j05jj49m4m1j15j9J17L0l7R2J48O9M9Q3jK9Q0K4j06
317B26r3l2p8Jj59m2K1r8M2l4LK7P0L2O3Q9K1P5Q1N8p6JN2j16q4k6n1j02j6m0
347a85pl1M4j4Q8J7J39o5Q8O7Nj2L2L6p4N1j30L7j68M0m2m1p4K6n9k2J72L0P5
376B3K1OO4P6m7K9P3r0k7j4l3r5K8j05K0K5p3l1ML8M2L5Q4l6M4M2L6k5M1k4k8
407A03M2j31k2n3K2p7J8p1kO5k3mP2N3M0nQ6l7j3N7J01j44p0K2J0l5n4k4K2J7
437c5n2mj08J46P7M3n6qlJ20or9J37o8m5Mo1l2M9j11R6j0o5op5J45k1K9P4r5J1
468b9J23j5Q7j12J7Jr1R6p9Jk3j6l7J2J8p7K7M1J5J0M3M0J3M9j01L3K6n6kn5L3
499hNm8JJk4l1L6o4J02l3N9o2J40m8PN3Kk1o0L3p8P8k5m9PJ0Qj4K7m6pM0k4O1
$$ plain form
289 147 175 320 353 329 304 343 319 123 18 17 -132 -176 -217 -332 -351 -234 -204 -241 -149 -1 68 117 200 199 228 308 332 226
317 226 133 101 23 24 -135 -177 -156 -254 -212 -246 -243 -216 -146 -114 -51 38 59 134 215 273 197 198 250 134 50 24 -27 -129 -145 -185
347 -185 -192 -223 -179 -193 -105 -88 51 -14 74 141 146 134 166 202 128 179 49 86 -82 -42 -84 -125 -199 -173 -232 -254 -82 -52 23
376 23 44 50 114 190 143 172 245 155 128 114 81 -14 14 -91 -71 -46 -119 -150 -146 -108 -66 -31 53 17 61 103 139 114 155 131 103
407 103 145 14 -8 -61 -39 -116 -98 -169 -171 -106 -129 -133 -61 -8 32 27 113 76 63 120 221 77 7 29 39 4 -50 -74 -52 -35
437 -35 -87 -91 -199 -53 24 67 11 3 0 120 114 15 152 84 39 43 -18 -50 -1 -112 -16 -26 -91 -97 -172 -27 -48 -19 55 -40 -29
468 -29 94 79 166 54 71 72 -19 77 -2 -1 -24 -40 -77 -65 -47 -124 -97 -56 -41 -31 12 52 65 114 13 46 72 16 14 -41 -8
499 -8 -3 -51 -50 -49 -73 -104 -68 -132 -30 -63 -4 -66 74 26 33 86 88 67 7 40 -38 40 15 -34 -27 -17 -9 -23 4 -42 -49 -9 -33 28
533B8k6J5k2J7O8n7L3k5n3J08r2p8L4j3m8L5K3j9R9j3k3K1P0j3k6J7p1L3J8K4
563F4l1r3R0r8J23r3L3om6J17j49M4K9prkR8j27P2j1N7p9J11j08Qk9NN4M6m5k3
594ek3LlK4Jj3R1q0N6l6N8o4P3%m4o3O4k2l3J7M7o3K4qm1K9j8M7j9R1o4k7j8L7
628A8l3k9J7N4o5M7K7o5lO7r6J07o5j5M4L8n6J8%J7K2j7M4j43J43j05Q3q0L5k7
658a8K6o4K6m7N1N6J2j16N2j1l1Q2o8LQ2m4L7Nm9o7M0J08j18L1L3J2J3J3j25O8
688hP4m6nm1jL4K5Oo8k4M1k2k9J07l0j1r8N5M1k2K7p9J37j06L9n4Q0l0k7Q6m8
719Cl2M0o7J34r2K8J5p5L4O0k7m6O6n7K7l8K8J2n0J8P6k9n6pL8N9j47N5Nj7l3
750g5N6k4J6J1ql2N2l3M3m0j9Q7mm3M4k6J8k3m9J18Kl2K1J6l6r4P2l3N6lo3p2
$$ plain form
533 28 2 17 -5 12 80 23 56 31 -22 86 -6 -84 -50 -63 -111 -76 -53 -72 27 14 -9 12 82 69 43 60 -11 22 40 64
563 64 33 -60 30 -68 55 -38 -5 -11 -57 60 -89 -45 -16 -23 -32 -34 64 -63 9 -2 55 -24 87 -21 -13 -42 -37 17 63 18 -5
594 -5 -28 -25 -28 -4 -3 -16 75 -5 51 15 73 9 82 82 38 -25 39 17 -16 1 48 -15 9 1 -40 -11 -29 18 -1 90 26 -1 -19 18
628 18 -15 -44 -27 27 -38 9 36 -29 -32 35 -61 46 -19 -34 10 48 -8 10 10 27 49 32 76 -67 76 -29 54 -26 9 -18
658 -18 8 -56 -30 -77 -26 30 42 -74 -22 -33 -64 18 -50 -47 35 -9 28 33 -16 -83 -43 65 -53 -22 11 23 36 49 -76 -8
688 -8 66 20 15 -26 -27 7 32 38 -30 -54 -13 -35 -64 43 13 2 -96 -41 0 -22 5 -74 63 -43 -4 -58 22 -8 -35 51 3
719 3 -29 11 -56 78 -14 14 29 -46 -12 48 21 -25 41 -16 11 -27 1 13 -37 -19 57 28 -28 -35 3 62 -85 -30 -25 -42 -75
750 -75 -19 -43 -27 -16 -24 -56 -4 -37 6 -34 -53 34 30 -13 31 5 23 0 -49 69 71 39 60 76 40 -54 18 -15 41 38 -25 -97
782i7M4M0L7K7l6J1l5M0%pp2J1J9l8K8j7j3M3M1Lnqk5K3m9o3J02k5L5n4lJ7L9
815A3M4j00RKQ6j10O5J8l2j5NN6k4n1Q8p2JL5j5jrN1o9K2P6j15oL2p2R8m5J5K2
848Bl8m6L8M1M0j3pJ08r5r7P9J20j38Rk8j3rP9kM1j16j4P7m1M0pnJ2n8M8j9L3
880B1q6N9l3N5MN8k0j08j3Q8J7Qq3K6k3J4l8qO9lMM3K4n6K7l3jj2K8j4j5PJ6j18
914i6L6M0j3L4n6N2Rj04J62j00m4R9m8K6j3K3p6Q6m1K3l1KJ37j56Q6p7O0P2j12
943b0j8J17o7K3l3k2J0lk1R1j47R3k1J9k6J2n9N9LMM4k7l8p6Q6Lk4M2n4P5p2Q3
975C6j16M1J3NL5qK0m6jP7l4n8M1N6kj4Oj02K6J9m5j3J26k7n5j7N7o8L3J0oP0
1007E9j06L2J0%k6K1%RM4rj5j2K3q9M3Q5q7L7j9jM2Mn2p7Q3K3nn7M1k2J7L9j04
$$ plain form
782 -97 -53 -13 24 51 15 26 -9 31 31 24 -48 -37 -18 -56 -28 -45 -58 -15 26 29 24 16 -9 14 -35 -98 4 -21 14 -40 -43 -26 13
815 13 57 -43 -34 -32 54 -56 9 27 -5 -20 -15 41 17 -34 54 -18 -17 18 3 2 -7 44 -25 -3 73 -42 -48 -16 -88 10 -35 -20 2
848 2 -36 -82 -44 -3 37 24 17 125 30 -67 12 132 -6 3 -25 -38 -47 32 30 71 -45 -59 18 -23 17 10 5 17 -41 7 -12 21
880 21 -65 -6 -39 16 20 78 58 -50 -63 25 42 50 -33 -7 -30 -16 -54 -62 7 4 8 51 75 19 46 13 12 0 28 14 -1 6 22 -96
914 -96 -60 -20 -33 1 -55 -3 6 -98 64 -36 -80 19 -29 -3 -16 7 -69 17 -24 -1 -32 -30 107 -49 37 -40 20 92 -20
943 -20 -38 79 12 35 2 -20 -10 -13 -34 57 -90 3 -18 1 -25 -13 -72 -13 -10 -6 38 11 -27 -103 -17 -14 -38 4 -50 25 -47 36
975 36 -80 -39 -26 -21 14 6 26 -20 -21 56 22 -36 5 61 59 45 51 -51 -25 -6 -51 -64 62 35 -20 -37 20 -48 -15 -5 -11 59
1007 59 -47 -15 -5 -5 -31 -10 -10 -1 43 34 19 7 30 -59 -16 69 -18 19 0 -1 41 45 -7 -84 -1 22 17 -40 1 -21 -4 35 -69
1040f9J05n6m6P4o5L9r%m9K9om0R8l4M0m8R4r3qM5oM3n2N5m2K9Nl2L3m3N5K8k
1073G2p7L4K4K9q5ml2N2l9M7n3O6m5n7L0N6j2l6j9L5n1N8M7j03O4L8j9jJ9q1R3
1104E0o0J6KL0Nk0M1n8L3k0nO1l9p5J75p8l3kk3J3P8m6q6N1n2P4k2P7r5KPk0o9
1137h8J8N8J3o5O2Q0k1m3M9j9rl3l0N7L6m3Km8J08n7l1M4j4m0p0N0kJ12n3oj25
1168a08O7J7M5l1jJ9Q%k7kr8M5N5%N4q6j1N7k2j7M9r8N1O8Lq9N0O7K1o9k3O3o8
1201a1M4K7l5O1j04O4p0P3l6n1M1k4LO3l7q9J9J02m5k6O2n1N9q6M5K5m2P6o3L6
1231C0j01J22m3K0K9r9M4O8j53K5O9L9J4q3L8m4J7N3j06LP2k7L2mj3j3K0p8K4
1260d5K6l9K9L0o8L9MJ02o4J0J6j05L3P1j7n1MK8Mk3O8q6%O4o7R0p6M5m0Kk9J2
$$ plain form
1040 -69 36 -20 -66 8 -57 -18 -27 -27 -76 -47 -53 -93 5 -29 11 -37 57 -36 -44 1 -5 38 -14 41 -1 28 33 1 34 -9 46 74 72
1073 72 -5 29 53 82 -3 -7 -39 13 -26 21 -32 34 -11 -68 -38 18 6 -30 -49 -14 -65 -7 40 -63 1 39 20 19 38 -43 50
1104 50 -10 6 8 38 43 23 64 6 39 19 14 75 36 -39 136 58 25 23 0 13 91 45 -41 10 -42 32 10 87 -8 -6 1 -19 -88
1137 -88 -70 -12 1 -64 -2 78 57 14 63 44 35 2 -28 29 65 22 24 -24 84 27 -4 40 26 -14 -84 -34 -36 76 23 17 -108
1168 -108 -41 -24 21 -10 -11 8 16 16 -11 -13 -111 -66 -11 -11 43 -43 -54 3 -19 -36 13 -85 -34 34 37 -52 -2 65 86 17 -6 57 -11
1201 -11 33 60 25 86 -18 46 -24 49 13 -38 3 -21 -18 45 8 -81 -62 40 -5 -31 31 -20 39 -47 -2 23 -19 57 -6 30
1231 30 -71 51 8 28 57 -42 2 70 -83 -58 11 50 64 -19 19 -25 -8 45 -61 -58 14 -13 19 15 2 -11 9 -69 -45
1260 -45 -19 -58 -29 1 -67 -28 -24 78 14 24 40 -65 -32 39 22 -29 -25 3 7 -16 52 -34 -34 30 -37 53 -23 22 -18 -16 -45 -33
1292c3P2k2k4j6M5r6M2nJ6MJ1j1L7nk1j7N1rm0O6Kn3L3L5o5n9K7kQ0k1p0K5J2
1325a1j5P2k2J0j6K1j0k3O8j6n2%m8J9K5Po5K9m8O6J6m4n1J05l0qqnO0pM0m7L
1358A5m1M5k6m9M8k0R9m4l8RrJ0l0M7m5OP1r9M6O0o6M0m6lJ6J5l2k6O4o2M6p3
1390g2R7kl4O4j00M1M1j8J5k0J3n2M7k8j5n5Q3qj5O1rl5L5Pp0P5KRm9L6p5M3k9
1423a7jK7n6L0n7K8O7j1oj6p7P1j6P3l5L7k8J6np3J07l9k9O4j21J06jl8L7o3N2
1454B6q1M3L8LL3n8M4j1Q3j15K9r7M8k3Q7j1p5L8o3Q1Jm6l1J17n9Ln8Q3L0l3o0
1485c4K6N2m5M2%rL8n4J7j2R6l0j15M8j4k8O1Ok9K4k0j3l1K5j5O8o2J3m8O8J7
1516D2q3O0K9m4J5m1P4k0o1P1j8m7J4K6qj1J2j1lj7K0m2J0L4R1q7K7p4R6j2j9
$$ plain form
1292 -33 39 17 -7 -23 22 -74 -32 -37 -21 -17 -6 -17 20 15 -6 -23 28 19 -21 45 47 -6 27 62 -3 -62 -35 -37 43 22 -48 -23 -11
1325 -11 -26 46 24 34 18 39 29 6 74 58 6 6 -42 -23 2 9 -56 -27 -75 -9 7 -37 -88 17 -13 -21 -29 -34 26 19 59 12 15
1358 15 -26 19 -7 -56 -8 -28 71 27 -11 -2 -11 -1 -31 16 -29 -23 48 -51 -5 55 -11 29 -17 -20 -4 11 -21 -47 17 -45 1 -72
1390 -72 25 23 -11 53 -47 -6 35 17 32 12 25 -27 20 -8 -23 -78 5 -3 -18 43 34 -1 34 41 -29 46 48 57 8 44 -31 12 -17
1423 -17 -18 9 -47 -17 -74 -46 21 10 4 -12 -89 -18 -34 39 4 41 13 29 24 -49 58 19 -10 54 -67 39 38 0 37 -26 26
1454 26 -55 -12 26 29 62 4 48 37 120 5 34 -63 -15 -38 49 38 -37 1 -62 19 20 -26 -57 60 1 4 -54 29 59 26 -34
1485 -34 -8 44 -1 41 41 32 70 16 33 21 117 87 -28 20 6 -22 39 45 16 40 20 7 -24 1 -14 54 -8 5 -43 25 42
1516 42 -41 19 48 4 19 -22 52 32 -29 42 24 -23 -9 17 9 -2 10 -1 -4 -21 -1 -43 -33 1 92 5 32 -42 54 42 23
1547B3P4j48J5N4q5M4N4Kp5n1J22mj0l7J8k1K3K3n7j1R9m4Oo6O4J7l4M9K2j09
1577d3K7K6k6K4k6O1n8M4r7M8j6J09J1m9rr1M8p4O8L0q5J06q0O5k9m2Q6q4P8m8
1607b6%L6k3l0J7L6j1p4J07l3K2oN1o5J24r1p3N5Kj6O6r3n2J8R4m9mJ02o3q3M9
1638a3nN1o0j6L0J8k4n5kkK5L0R2n3l1pL3J7rL0p6J7J6O1r4J32j12L7O6m4l4L1
1670D9j9qKL6o8m4L0k0R1m2q0J21n1K1Jn%r4J57o1l8J7R7j70N7k7J07j2pJ6k9
1701B7Mj21R1L3K1n3k0n4O6M7M2j9op0J4K4l0nJ7m2J6n6Q1N2j38L0k0L4k4P6k6
1732iM8lo2q7N7J10q8k5J60j39O6mk2L0m1M1n4N8n2J01r5l2K3J29j71M4M2J2p5
1761c8J8k9O5ljLjj7q0J03o2L1j5P6m7r9J10m6O2l2mMJ3kJ9Mn9M2lJM7j4p3R4
$$ plain form
1547 23 97 -51 -36 18 -67 -23 31 33 -42 -93 29 25 15 -22 -4 -25 -2 21 -36 -47 52 8 14 -52 12 29 -5 44 66 -43
1577 -43 -16 10 -16 8 -18 43 -15 29 -68 -20 -36 73 84 35 26 -65 -17 -91 -23 7 -78 28 -52 13 -16 -58 28 -56 22 -26
1607 -26 -26 10 -13 -43 -26 10 -1 -75 32 -1 21 15 66 1 125 34 -39 16 18 2 68 -25 -77 -59 35 -14 -18 84 21 -62 -13
1638 -13 -18 33 -27 -43 -13 5 -19 -74 -76 -78 -53 -23 69 16 -15 -22 11 28 19 49 -27 -10 6 67 -27 105 -7 30 96 52 18 49
1670 49 30 22 24 60 -8 -52 -22 -42 49 7 -73 48 -3 18 19 14 14 -80 77 16 -22 -5 92 -78 -21 -48 59 47 40 56 27
1701 27 31 -90 1 34 55 2 -18 -72 -6 41 83 64 58 -12 2 26 -4 -9 8 -34 -18 -74 7 59 -79 -49 -69 -35 -59 17 -9
1732 -9 39 36 -26 -113 -56 54 -34 -59 101 -38 28 24 2 32 -9 32 -22 36 -16 85 -10 -42 -19 110 -61 -17 25 37 -38
1761 -38 -20 -49 16 13 12 15 14 -3 -83 20 -42 -11 -26 50 3 -96 14 -32 30 -2 -6 -2 11 9 28 32 -27 15 12 13 60 46 -27 67
1795F7n4k5K1j7l8K5L0j2M5j6lk7n4N1n2N9O3j24K6O1KQ4j15o3O6Ol5j1Q1q6N2
1826GNL5n2M7lp6L6j6lN9J1k2Ml1K5k8K0j08P8K0L3j26P4m9JP3m7K2M7r3M3l9
1858e3N6Nlk2j8RJ3O5m1J1j3J5K7jn6P6q3L6j0J1K6m1K4j08L7J12j04L1lK7M2
1889F7p7K3p2O3K5k3m0O8n0Mrq2P2J5Nl1L6QJ2m2J3QL0K6Lm8Q1l9p5jk4M7N8m4
1923GJ0k1L4kp9M3L1p5O0m6j2N2k6J9P3j8n0nj5j9M9j9J4nnJ1p9J31n1j4j1J0
1955hJ00l9L8o6rJ4l7k1L4k3k1n7J73p1J06j17j2l8P2p7M2O4n7K4q0j0J3R6j26
1984i3J11lj9l5N3k7l9J10q3k7M2K7kPo4k9K8M4l3K8K8j0o9K4P7n2J9Qm9P0L0
2015G2o7k5J2J4Ko2R3j18M5Rl7M1J6Mm3N2Kn1j8L9l6RN0J4n7O2k8M0l4p4Q1J0
$$ plain form
1795 67 13 -12 9 -8 -46 -21 9 -3 42 26 23 -4 -58 -7 -59 0 63 -61 -35 26 28 112 -3 -66 0 6 -29 -40 41 -45 7
1826 7 12 47 -5 42 39 -37 -1 -17 -20 39 50 28 32 1 26 -2 18 -90 -12 8 41 -85 -11 -60 -59 14 -33 -11 36 -57 -14 -53
1858 -53 3 8 5 -17 -35 -26 -13 52 11 22 9 24 51 50 -6 70 -13 23 13 24 50 9 33 -75 -38 74 -30 1 -2 25 67
1889 67 -10 13 -59 4 29 6 -34 34 -16 -12 -21 -103 -31 -16 -11 -42 -6 2 14 -28 -15 -7 23 49 52 4 85 46 -29 -30 -54 -7 51 7
1923 7 17 -4 30 28 -51 -8 23 -52 8 -38 -50 2 -24 -5 68 50 0 -5 -20 -39 10 -9 5 0 -5 6 -73 58 7 -7 -18 -8
1955 -8 92 53 91 25 16 30 -7 -28 6 -17 -38 -95 78 7 113 -4 -16 -54 18 -59 -17 47 -10 14 -66 -76 -63 33 -93
1984 -93 18 15 -4 -39 14 -13 -52 58 -25 -52 -10 17 15 22 -42 -71 -43 1 -32 -4 24 14 -55 -31 46 -6 13 21 -28 42 72
2015 72 5 -20 -8 6 8 -54 39 -79 -34 -25 -62 -21 -5 -1 -44 8 10 -41 -59 -20 -56 -47 3 17 -40 22 -6 34 0 -74 7 17
2047A7J2L6q5k4M7j6MJ4j6M1p5NJ5K8RRk8o7J07m2L4m3M5J2o7j0J6oL9n1j3N3
2079@l4L5j3NlO5k9q5J56m7k2m4N7K8j2r2O4o6M5L8K4kl9M9o4L7p7M0n8L1j8J7
2111a4Mk7L5n5j3M9M4j08Q2J5k6K2l3M5JLk9K7k5j4PJ8K6M0p5M4kO6r0j7m9M8
2143ak8pK8n5P9Lj7m5pJ9K4N1j02M3N3q1K0K6O0n1j4n8J6P2m5J8Qk9rLJ01p9J2
2176HjLM0L3p0j8m%l6O3M4o8N2p4M4m3mJ1L8l5mq1J01j6O1l7j0Lm1O1q3p0R7O
2210c0kM6l8P4On1n7L3j4J13k9j9J1J1l2o0M6K1lK9o6jNlRqL9L1q6j3J04m2o6
2243d2J5j1N6n8N4p5J28o2k4K1J07o8J3J4m6j4L4L1o5K6jJ4L3Jl9qp5M4l2J3K8
2274A2J1k8M8q5k9J03J8m2Jk2M9l1j1K2K9O3j57L2J5L9j9k2j4L2Ok6K9M0%L2j02
$$ plain form
2047 17 29 65 -20 -44 3 -13 -9 5 -11 30 -45 -40 -25 3 12 21 -7 -74 33 -9 25 -18 27 39 -28 -38 -22 -28 11 -40 -53 0
2079 0 -34 1 -12 -7 -10 55 26 -59 97 50 28 -16 41 69 57 -35 29 -37 8 46 70 68 29 78 14 51 -26 14 -44 -13 -31 -14
2111 -14 -10 -37 -2 -57 -70 -21 23 -85 -3 12 -14 8 -25 20 21 24 -5 22 -3 -17 -10 8 34 74 -1 43 41 107 17 0 -49 -1
2143 -1 -29 -36 -8 -63 16 19 2 -43 -50 -31 -7 44 -58 -15 38 -43 -23 3 63 12 -2 -60 -44 28 -17 1 9 -20 -29 -26 75 -4 8
2176 8 7 10 50 83 13 -5 -9 -9 -45 18 62 -6 46 -28 16 -27 -31 -20 18 -17 -21 -102 -1 -17 44 7 -3 0 -41 20 -63 -133 -36 -30
2210 -30 -32 14 -24 50 56 5 -52 -19 -33 80 51 32 43 54 22 -38 8 29 26 55 -11 -12 -7 -10 -1 -9 30 61 -25 -38 66 24 -42
2243 -42 -27 -38 18 -40 14 -61 67 5 -19 2 109 41 54 68 22 8 42 73 8 34 33 47 80 81 42 34 -41 3 -29 -16 12
2274 12 23 -5 43 -42 -71 32 50 8 9 -13 36 5 -6 16 45 108 -49 -17 -2 37 18 -4 -18 14 20 -6 23 63 63 95 -7
2305go8P9Qp0P2J2J2m4N7j35M6J02n8ok2M2J1%q7O1l5QJ0j4N4n4j8O4mj9%M3j3
2338B7rL1k3L0P9j24K3n8J24j06J5N5p8K0J8kq0L6l1O4q3N4L3j1l6J30j21N3j6
2367A4l5k0M5K2j2m3L3P4r3Po9J55j02P8l5Ll4M4l1JL2MLj14L6M4L1J2j1q0P8
2398C7n8l3JJ17r4j5L1Nl7J5L5Pq6M3L9MN2n0Q5r1j8K7M3o4R1j22K6M0R0r6m3
2429a9O7j20J27Ml5K9Kq0P5k9l7N4n7K2p4N7mn5O4N3j35J36l9k1N1j33J08n1O
2458c4K1J9m3M0J6K5l3m2N8q2K5p6Q1J6J7K8j16J01j8k8L8K7K2n4M9k7l7l0mJ3
2488b8M9l1jm4JM7J5J1n5P4n7J9K3l3K8r0R8p1O9N7m4L3k0n3Oon3R3n1J0O1m9
2520Hnj7M1K4j6p0%Q0o7J6rL0m5N9l4k2O5Mj93R3k2J21o0J5J5l8k5O5koP6rm9
$$ plain form
2305 -7 -75 4 12 -58 14 26 38 -6 51 -84 -38 64 6 0 -22 20 31 31 -56 5 -30 -22 -12 -26 28 -26 -44 20 16 -3 -3 40 27
2338 27 18 49 26 56 135 11 34 -24 100 -6 9 64 -14 6 24 22 -58 -22 -53 11 -72 -18 15 4 -32 98 -23 30 14
2367 14 -21 -41 4 26 14 -29 4 78 -15 -8 -77 78 -24 54 19 22 -12 32 1 2 34 38 41 -73 -37 7 38 50 39 -41 37
2398 37 -21 -54 -53 64 -30 -45 -14 -9 -46 -31 4 11 -75 -32 7 11 63 13 98 7 -11 16 59 -5 86 -36 -10 30 120 24 -19
2429 -19 48 -72 55 59 24 53 55 -25 50 21 -16 38 -19 3 -71 -14 -18 -73 -9 44 -91 45 6 -15 36 -97 11 -40 -34
2458 -34 -13 6 -37 3 19 44 11 -31 27 -55 -30 -106 -25 -9 8 36 -80 21 3 -25 13 40 62 8 57 30 -7 -37 -41 -28
2488 -28 21 -10 -11 -55 -54 -7 8 19 -36 38 -19 0 23 -10 18 -72 26 -45 24 81 37 70 50 -3 3 -3 -56 37 -14 -4 57 8
2520 8 3 -14 27 51 35 -35 -35 45 -22 -6 -15 15 -30 29 -5 -27 38 42 -151 -58 -80 41 -19 -4 11 -27 -52 13 11 5 81 72 23
2553B3k1J6O2k9kp1l0L5K6O7j34R8n4L6k3J5J3n6l7K8K1N6n1N9p8M6ln3O3j04
2583h2P8m7M9N7j08Kj4P8K4L0r8KQ2qm8nR8l8oq1Q3qM0r1Q0j01K8K0J4o2L0n4
2615e6QL4L7m1K9pl3O9p8O0K3l7m1O3l0oK3p2J08k8j7O0j17J1P9K7r4N8N5l2j00
2646d5J9O9l7l0K4MJ3J4r0L3M9p1L7j2k2N4K0j24P1l0K5P2n8J0K7Rq9Q4l2rK6
2677A1l4nM9J3J7n2k6P5K6p1K6n0J2Q6q7O5n6K2Kn5K8K6r2K6nM2j6n4M2L8K4j42
2709a15O4Q5n0j3j5O7p1O4m4l3N9N2j05K1M0M0p3J8L5j2J1m0L2J8n1K9k9L1k9
2738a4j8M1L6o2K1K5m4M4m1n0M5L9n7M7P1j14n0P6K4Rn5kK6P2p8J21o9l1L6r0
2768d2J45j06J7L4q5QN1K4n9M4k5l7%K8k1LL8k1k2K4qn2J44q4Ko1O7L9j5lmm1
$$ plain form
2553 23 2 18 80 51 49 -22 -52 -17 9 76 -58 40 -14 22 -1 14 27 -29 -66 -38 -17 39 -12 47 -31 15 12 -41 22 -82
2583 -82 -4 -51 -2 55 -53 -51 -65 13 37 67 -31 -29 53 45 -3 -8 90 52 46 -35 48 40 80 -11 69 -32 -4 16 30 -32 -2 -56
2615 -56 -48 -14 23 -18 11 4 -29 40 -38 22 45 8 -33 30 0 -6 17 -55 53 25 8 68 -49 -38 41 68 -26 32 87 55 -45
2646 -45 -26 43 6 -24 0 4 17 31 -59 -26 23 -48 -11 -23 -45 9 29 -95 -24 -54 -29 43 -15 -5 22 31 -58 26 -6 -15 11
2677 11 -23 -28 21 34 51 -1 -27 48 74 3 29 -21 -9 77 -10 55 -1 21 23 -32 -4 22 -70 -44 -49 -7 -23 -77 -35 3 27 -115
2709 -115 -51 34 -16 -29 -44 23 -48 16 -28 -61 -2 50 -55 -34 6 46 -27 -9 26 14 25 -15 17 35 -16 13 -16 15 -14
2738 -14 -32 9 45 -17 4 29 -15 29 -12 -62 -17 22 -35 12 83 -31 -81 -5 19 28 -27 -29 -3 69 -9 112 43 12 48 -42
2768 -42 103 -3 14 48 -37 -29 22 46 -13 31 6 -31 -31 -3 -24 -21 17 -4 -26 -2 -10 -62 82 -2 0 -61 6 45 30 27 23 -18
2800a8Q0o0nJ1m2j1J15m1K7o8N6l6N3j6j3J2r0L4N6j3Mo9M0Rl5K9J7q7k9Q5n0
2831e5j9O7pKj4L2L9r8J22r9OM0k6nn6O8M5o4M9j7k7J7KO2o7M4j8l5nK8qj3j4
2864b4J06j12L0m0M8m1O8l8J0m7j7Q8j23K7L2l3N2o2P6j9K7M3k8j8N2l7O8q3j2
2893gjQlJ8o1N1K2O9p2Jl5k6J8Jj5n5R6J9l1N4o3j1n9P8LM9p6n4j7Q3j7Q6j36
2926h3P6P3j16J6lL4n3L4MPO9Pn8j4m0O1qK5mm2L4q0M5J8n6P0l2%j20Q4QL8Oj3
2960a3Nj12K8P3n4oO0Q4o5l9N2jk7l8L9kr4P9k6J24m5N9m6Loj7j09O3L1n4J04
2991E0o4m2P8j2k2j2j7N9Kj5j12J04nm3Jk2K5Q0l6L9jK0p0L7J0j17O0On0R5n4
3022b8Kj1Q5m9pK2K7J5m1L6n5lk3J9O1r2Q6n5Pn5K7L9n7J7L7o0L1j3P9q6N8o0
$$ plain form
2800 -18 62 2 -3 8 -34 -45 70 29 56 -12 44 8 61 45 32 44 -46 -12 44 31 35 -34 6 15 -20 9 26 -61 -90 -5 -55
2831 -55 -74 -7 -14 -12 -26 6 45 -53 69 -30 -24 16 -10 -15 -71 -3 42 -22 27 10 -17 0 2 64 -3 41 23 -12 -17 11 3 -10 -24
2864 -24 82 -30 0 -40 8 -33 35 -3 7 -40 -57 31 -92 -65 -33 -66 -14 -76 0 -19 8 51 23 5 57 20 88 5 -7
2893 -7 -8 0 -3 15 -46 5 27 96 24 25 -10 -36 -18 -17 -32 -87 9 28 -3 51 -12 -23 -82 -4 -1 48 -28 -82 -99 -16 -33 53 -83
2926 -83 -7 66 -50 -34 -37 -3 -56 -22 -18 -11 58 65 7 -7 -47 14 6 31 27 -15 19 -61 -16 2 -54 16 -16 -16 -136 -52 -44 -6 0 -13
2960 -13 -8 -120 -92 -19 -73 -79 -19 65 0 -39 13 12 -15 -53 -14 -16 -110 -31 -57 67 22 81 35 38 32 15 -94 -31 0 -54 50
2991 50 -14 -56 22 10 -12 -24 -41 18 20 5 -107 -3 -8 -51 -50 -72 -47 33 -3 36 35 55 -15 22 32 -85 -25 -19 -69 26 -28
3022 -28 -26 -37 48 -1 -8 14 41 56 15 51 -4 -7 -30 -11 50 -42 44 -11 -4 -59 -32 7 -50 -33 4 -56 -25 -38 41 -45 13 -47
3054d7J00L4o3l5Q5n1J7KKO8q3J5OL2m8J9rOn1N9J9j27J4L5n8Q8J6k8l7M2J5j18
3086h1P6l2J34r7n6P7o2J4l2O9l3M2Rp0N3Nl8NkK2J4j7J8n1O1kl5k3N9j09J26
3117D4j8J9j43J2R9p1J2K9J7k7Q0l8n2N8p8j1M6J6L7p1Q2q1K0N3j08Q1m9P6oL3
3147F1ok1q4N2PJ7j6m7Q2K1n3K5j9r2P8o6J07om7Km5J1o6O9Q0m7lj9K2J0q2L1
3179d4NM4m6M2N3p1P2lq6Q6L2q9K4l6M0L9j27Q2Qn5N5o8J15q2l0Ql1O2P8l0m8
3210al3lj6M2nR4j4j5r3l2L7LK9K8m6j1M2M2j07P2om3J39j74J11k7j7L3p0J45
3240A04p2J9o7J13j06P5j6m7k6L7mJ2r1K7J0m3J37n5l5M0p4j3N2j8O6Mj1pN9p5
3270eO5k6ql5L2O3o7Pl3J2O0m0o4N0j6K3j9jn1P6n2J11p0l7J6J9r4L8j7R5o1k8
$$ plain form
3054 -47 53 87 24 -11 74 23 40 42 44 112 29 44 50 82 34 53 44 50 -1 58 77 -50 -36 -1 -59 29 45 17 -20 22 37 -81
3086 -81 -5 -37 97 0 -56 21 -41 -27 -59 10 -23 19 28 -42 11 16 -22 -17 -19 3 17 0 18 -33 28 26 -9 -32 27 -82 44
3117 44 26 45 -98 -86 13 -58 -46 -17 0 -27 53 15 -37 21 -57 -68 -22 -6 31 -40 42 -39 -19 34 -74 7 -42 34 28 61
3147 61 55 34 -50 2 9 26 10 -37 45 66 13 38 19 -73 5 -61 46 40 -7 -5 -50 -39 -105 -36 44 -3 -6 -25 -3 7 -75 -44
3179 -44 -39 5 -41 1 54 -17 55 52 -34 52 84 -5 19 -17 23 62 -65 17 25 -30 25 -43 72 -10 -40 -32 -63 -1 77 47 -1
3210 -1 -34 -37 -53 -11 -16 78 64 49 -44 -76 -39 -36 -7 21 -25 -36 6 48 -59 13 7 -36 103 -71 40 13 -4 29 -41 104
3240 104 32 51 -16 97 -9 66 50 3 -23 14 10 22 -69 -42 -32 -75 62 7 -28 12 -62 -75 -23 -41 25 29 18 11 70 -5
3270 -5 60 34 26 -9 23 86 19 26 -7 5 65 25 -39 11 -5 18 -1 -2 -53 23 -29 82 12 -25 -9 10 -84 -46 -63 32 -29 -57
3302e7J19j01M0L3j29nJ25j8m6L9P3J7n8qJ5J0n0L8K0l9k2K9j3m4pR6p0P6l1m2
3332a0L0n6QL7Rm6o5J35mp8K7K3n9R7K3j04N1k5J2o5J0J08p0oJ14p7K0j5J4m5
3362gmO3l3q0N7K4N2q3O9k8k5J34j37LnO8m8J6J1lJ7m9l2K9m5ON5k8R1q5M3q2
3394c6R3o4P6k8r2P0k9L9n5kl2J54r3K6j6m2J7M8k5nk1P8q4m3J01l8Pj2j06J06
3424hj3L4r2P1J6n0Qk4L3M2m3M2k9l3N2no6J23q6P3k4no4R3l5L0j3l5L1LMPK6
3457F3j04M7p4R2o1K3LmLl3n5R8L8o0l0K3K1O0r2J0K5M6l5m0jJ0L8k1R4n8J3l6
3489Cj3M4J0n2%N9O5m3m2o1lP6k2j1Qk7k3J8n9Q4k2k1Ql4J9k1Pj5N8j5O9r1l1
3522g8J50n5m8oL0L3M5q0J05m6l8J2K7J5j41Q1M2Nk5m6K5K2p4MrL7m6RM0no2O9
$$ plain form
3302 -57 62 -39 1 34 -95 -100 25 7 -39 0 73 90 32 24 39 49 -1 37 57 18 -4 25 12 -32 -39 57 -13 63 32 -10
3332 -10 20 -36 -28 9 18 -28 -93 42 38 -40 -13 10 -49 48 71 -33 18 -7 5 -60 -50 58 -12 -18 96 19 39 24 38 -7
3362 -7 -11 52 19 -61 -4 20 72 -11 58 30 5 139 2 5 0 68 20 36 47 44 61 12 -20 9 -36 -30 25 -3 88 3 46 -36
3394 -36 57 -7 69 41 -51 19 -10 29 -26 -28 -60 94 1 27 11 -31 -14 34 9 4 -17 61 -23 -66 35 -3 4 -8 -114 -8
3424 -8 -21 13 -79 -8 8 -42 -34 -58 -25 17 -26 16 -13 -46 6 1 -65 58 -28 45 21 16 -48 45 10 40 27 -8 23 26 30 37 63
3457 63 -41 6 -68 24 -37 -14 -11 -15 -12 -45 -100 -2 36 -24 -54 -31 -10 50 -42 -32 -7 39 4 -36 -37 -27 11 -10 84 26 39 3
3489 3 -10 34 44 -8 -8 51 116 73 31 -30 -33 43 21 10 18 -9 -32 -14 -73 11 -11 -32 -24 -58 -39 -60 -53 -68 -10 -25 44 -47 -78
3522 -78 72 17 -31 -37 -7 26 71 -9 96 50 12 24 51 66 -75 6 48 53 28 -18 7 29 -45 -41 -50 -13 -59 -50 -10 -15 -77 -8
3554hl2j7J8j1J28l6p2L7PJn5M8jL2J21j19L1o9LK0J0k8PL8n5Np6J1P0J5n1L1
3586CL3l8l3N6j9N4o3j4L0N4q0p%jJ8r2J18p5O1k7K7K7J8%j1j3j0m1J08o7M8m4
3618B0m9O0mj7KK4M2p3kj3M1Qk8k5Qk9M2m7J5K2P3Jj13J08m3l7M6K6l0p1M5M4
3650D6k5L0k1k8M4j4k7M7o4K3M0p6J7R1p7L4L4k7p1M7J9j12J8K1j3P8j1J3j8m0
3680b2J1q2R6K1L6j08j5J29o7jR1p0L2j8RKm7L5n2J7j7J5Q0o2j2rLJ7Ko9J3M8
3712FoO4q2l2L6J0L4K9j03O9o7k4J1OM6K8j7o5N8J8N9m4%J8k4RN2k0L6j25J1K5
3744A6%orO2n5k9N1o7J07k6k7lL7j60O1N8n9K3j4N6o2J3k4J5R1l6n9J06p1MK4
3775A7J8p2J8M6M1Km4oMm2OQ2k0l9L7lK0n2LM4OJ1j01j4J0R5r4L1k3m3MR6j16
$$ plain form
3554 -8 -40 -57 -39 -50 78 42 -30 7 14 15 -40 8 7 39 160 41 72 3 6 26 36 8 15 53 -2 3 -73 -62 8 23 -28 3
3586 3 36 -2 -35 21 2 56 -7 -21 9 63 -17 -24 -24 -25 -7 -99 19 -56 5 -22 5 32 50 50 39 26 16 -25 83 16 64 20
3618 20 -29 31 27 10 12 36 78 5 3 -10 31 39 11 -14 -6 -35 7 -40 -25 -3 70 71 -42 66 23 -14 32 58 28 -43 2 46
3650 46 21 51 30 2 46 32 5 52 -12 11 51 -25 -8 83 6 40 74 47 -24 23 42 -70 -52 -31 -44 34 23 36 18 -22
3680 -22 -11 -93 3 24 60 -48 -63 66 -1 -2 89 19 51 33 42 44 -3 32 -20 -3 -20 -5 75 13 1 -8 -5 12 14 -55 -42 6
3712 6 0 64 -18 -50 -14 -4 30 59 -44 25 -42 -66 -55 -49 -3 25 8 -57 1 19 78 34 34 52 28 37 89 69 105 -20 -9 16
3744 16 16 10 1 63 8 -21 30 -37 70 44 17 14 51 -109 -48 10 -49 -26 -40 16 -46 -33 -57 -42 49 13 -46 60 -11 -7 17
3775 17 35 -37 -19 27 68 70 26 20 24 -18 -12 70 50 11 48 45 65 13 16 60 66 77 -24 -38 -28 67 -27 4 -19 -62 -58 38 -78
3808g8L4N9j09N8n7J49m8l0M7n3k5O8K5m3LJ8k0K6J5J1l0j6j7L7k1ML9j0k6j0
3838@l5N2ml7K7k5%Pq6N2J3JM6j8J1m3N3L5n9rM0k8J9p0J25J3j5Pom2K0oN4l6
3872E6m4J5M3p5K7K2mp5MrP0j1l1p2R6J2n2j3k3Q7mq0J9ML1o2N4M2m3M5l2N2m1
3905HRK5L6l0lQk5lQOoo6j7Q8k0JJ4J7o2M4J0j3j9l1lM7pp5J01j28O7LMj2o3Q5
3941bl1k5M5N5m6L9L9r4k1Q1pN4o1K4k8m1M6jJ2j8m5L1o2Q5q7nQ5l5L1r1J25l4
3973A8k3j02P6M5k5pk3N3o5JK9j9L3L7j%kM2j7m7L6P6l9J1q0P1q5R2r0Ojk9Q0
4006E1j2J4q3M2QKj05J07m8K0k8P0n2m3K3j4rN1l5j9O9Mm4PL9m7N6Kn7M3L7n1
4038bL2J5J0o1L8N8q7N2%n5Pj9J9M2lm3k0J4J0K6K6l8l8K0k5J2L6rk0L9o4P2K7
$$ plain form
3808 -78 -44 15 -94 -36 -93 56 8 -22 25 -28 -53 15 40 -3 0 18 -2 24 39 50 20 4 -13 24 3 7 46 36 10 0
3838 0 -35 17 13 -24 3 -22 -22 -15 -101 -49 -36 -35 11 -7 4 -39 14 49 -10 -19 21 -7 12 -58 67 80 65 72 66 24 44 38 92 56
3872 56 12 27 70 -5 22 44 40 -35 -31 -40 30 19 -12 -84 12 24 -28 -41 -64 23 19 -61 -42 -38 -7 -69 -15 27 -16 29 -3 49 8
3905 8 17 42 78 48 45 53 28 25 33 39 33 -33 -50 38 18 19 33 50 -12 32 42 29 10 -21 -24 23 16 -59 42 -86 -19 -16 -12 -24 -87 -2
3941 -2 -33 -58 -13 42 -4 35 74 -20 -41 40 33 87 26 50 22 -19 27 26 38 20 -25 6 -56 29 -58 -63 22 -13 18 -73 52 18
3973 18 -5 -107 -31 14 -11 -18 -41 12 -53 -52 -23 -42 -9 28 27 27 25 67 50 3 39 115 76 87 7 78 -7 85 -5 1 0 -29 51
4006 51 39 53 -30 12 20 22 -83 24 -24 -4 -32 38 -14 -57 -34 -48 -57 -6 -41 -60 9 13 -31 -24 15 -32 24 26 -31 12 49 -2
4038 -2 30 45 55 -6 32 90 3 55 55 0 7 -12 7 49 46 3 -17 -3 7 33 59 21 -17 3 -22 -10 26 17 -3 36 -28 44 71
4071G1j12L0N2K7l4n4J07p3L1jk6rJ1K2j8L1n1J4Rn4Q3l0q8R0mM2n6N6o7k9L2
4102BK0%l0p0O2N3o3j0O6k9RK0L5r3M3ll9K2R2l5k2M2j6K4Qn8P7n8l1M2m9Rj7
4135CM4j6J8l4j4l1J02o1Ln0L3j34J14kL5o5J7N6K4m7n0J7K3K1N5l6pJ4L3p5R1
4166H1l5J2m6k3J6M8p6PJ5n2pP4l6O7p1Q1n6l7N7l0M1q3O6j03R3j08N0O2N7n9
4196Ej1L6k2M9k7K8k7Lk5M3k0M8n7l5L9JO0r0L9m7O3l5nk6qP3l1k9k2M7k5oM5
4229C1l9J2qo2P2oJj02Q2PjQ%kL0k4JN9j6k8k8K9m1P7K4l5p2Q6j00O6O0p6N3m7
4263A1k8m5j2M1J18j02J8j9j1j5NP6m6J9m8k4R9p7l6O4N3o1n2J8M9k8R1J4o8J
4293EnN2N8j04k2N9m3NJ3l7L7o4M5j6P2j07O7l4L9n5k8J19p9Mj5L8k7J4L8n2M3
$$ plain form
4071 71 -41 -11 41 68 34 -20 87 14 45 44 18 9 20 42 24 55 4 18 27 -27 56 26 -62 28 24 66 10 66 -1 -30 2
4102 2 22 22 -8 -78 -16 37 -26 -36 30 1 10 30 65 -28 15 12 -27 -5 87 52 30 72 56 80 88 30 107 49 18 60 11 20 3
4135 3 47 31 49 15 1 -30 72 11 14 -36 -3 -137 -23 -25 10 -55 -38 18 42 -5 -55 -38 -15 6 61 25 18 32 65 -10 81
4166 81 46 58 12 -11 5 53 -23 -16 -1 -53 -60 14 -22 45 -26 55 -1 -38 19 -11 30 -53 13 -90 3 -105 -55 7 64 5
4196 5 -6 30 8 57 30 58 31 34 9 52 32 80 23 -12 27 28 88 -2 37 -10 53 18 13 -13 -21 52 21 -8 -30 17 -8 -14 31
4229 31 -8 4 -4 -66 6 0 1 -101 -19 -12 -13 -5 -5 -7 23 -1 0 59 43 15 -13 16 -25 52 76 41 -31 55 -45 21 81 5 58 11
4263 11 -17 -62 -74 -33 85 -17 1 -18 -29 -44 -39 37 -9 10 -38 -62 37 -40 -76 -12 41 -20 -72 -54 -5 -33 58 72 4 5
4293 5 0 52 110 6 -16 43 0 5 18 -19 18 -46 -1 -17 55 -52 15 -19 20 -35 -63 56 -23 -19 -34 4 -23 -9 29 -23 20
4324B0L6r7K9O0o1R1r0N6l2N8o1k0O8q6N6J0l1J8j2oj6K3l9Mj2N9p8K7kQM1j20
4356i9N5m4N5J01n4j8K5l5mn8J02j4K4m6m0M0J4O7J6k6j0q7L4L5r4K6K5j4P0j6
4386C0o8J06o5r4J32m9K8J9q8Pj1O5K1o8N3j06N5m5M1K3p6R2m3k1kP4J0m5j3N3
4416A5Qp0M6M2j4l0k7M6o6N6J2JN6q0M4m0k4N1l3m0rJ34m5q3L7K0qp5J2Q5o4N2
4448Ij5l1NK3pL0m0K4l1J03M1j25M7Rp9J24j31J49j44M0L1K3k7kp0M9Q6j16K6
4477Aj3j1n8R4n8N4r3K6P2k2pL3j8K1N9q3j5j4J3P3q9J4O1q3O6Qp5J37p6M1n7
4508AL1n7P3p0Q6k4n9O5m7L3k5Nlj5m3N0q0J54p5K1Om8J9K7j0n1J5J1m2mR1r0
4540e5j8N3R3o6kl0O8l1O8k7l2M6oj09M7K9j4L3Jl4L9j07K8m9K4O8p6P0n9K7P
$$ plain form
4324 20 56 -41 -12 48 -13 78 -12 44 12 70 9 -11 57 -29 27 37 6 24 12 6 -10 13 -26 -22 -34 25 -53 -26 -28 -20 21 -99
4356 -99 -44 -88 -33 68 14 -4 21 -14 -18 -76 26 12 36 -10 -50 -10 4 71 87 61 51 -36 -2 33 -61 -35 -10 -24 46 30
4386 30 -38 68 3 -91 41 -8 20 39 -49 -42 -53 12 33 -35 18 -88 -33 -78 -37 -14 -90 2 -41 -62 -64 10 20 -25 -38 15
4416 15 23 -47 -1 41 27 -3 -30 16 -50 6 18 19 75 -5 39 -1 -25 26 -7 -47 -56 78 33 -50 -13 7 -1 -76 -64 21 -43 9
4448 9 -6 -37 -32 -9 -16 14 -26 -2 -33 70 111 -14 33 42 -37 87 -44 105 -39 1 32 55 28 26 -44 5 91 -25 1
4477 1 -12 -23 -81 13 -45 9 -84 -58 14 -8 -15 18 0 21 80 -3 -18 -32 -19 54 -35 -21 40 -43 23 31 -44 93 17 58 1
4508 1 32 -25 48 -22 64 40 -19 46 -1 32 7 12 9 -6 -49 1 -79 75 0 21 27 -21 -2 25 15 -36 -21 -10 -52 -56 35 -55
4540 -55 -73 -20 73 7 5 -25 43 12 80 53 21 67 61 -48 -1 28 14 47 48 14 53 -54 -26 -75 -51 17 -59 11 -48 -21 -14
4571a4nL1Pnl9JL5N0k6q6M0N4L9j11K1R4n4j9K3M0l5k4n4O9l5J07m6l8Nk4K9M3
4603G3j8oRn4k8K6r2J36n4j2k0r2R0J2pO5l6L0k0J8K2o7j4M8Nj7ol6J04J2m5R
4635C5jl3n9O5K6QJ8j5l6ol2N6m0kj5K7n0l5Q2o7%NK8JL6l7O5p2K0o9M8N7K1N0
4669G9j24k0L6N3k5P5j7k0r7J70o6o3J0j4m7L5Q6j05O0m5n0N8P1Pj43Q2M1p8K2
4698b9Qr0M4RK6K8l2K5O6n4L5q8N4P1r4O4k6K3k2K7k0L8n7j3m6Q2k3lk8mO9J0
4730E0o0k3M8k2jm0L8PkL2%l2k8QM4m8O7l3J2o2L6L5j1J8Jl2m7M5O4mm3M4Jj4
4764D8l8l9LL3k7M3p4K7M3r8Q0k6L7l1l4mL9m5K3j6R0o6N3k1KM2j35P4J5j8K7
4795Gj5J5RM6j08J40q1Nj6J6J7J6r6lM1J3M5j23R0k3L4q6k1P5k3M0l1M1r6M1K3
$$ plain form
4571 -14 -19 12 19 14 -25 -24 11 61 35 -51 -11 43 82 -29 -8 86 32 13 36 76 41 17 -37 32 -3 104 58 20 25 1 30 73
4603 73 55 49 58 4 -24 2 -90 46 -8 -20 -40 -132 -42 -30 -37 28 -8 22 2 20 42 -25 -39 9 14 -3 -9 -45 59 71 26 35
4635 35 34 1 -58 7 33 41 59 44 8 2 -30 26 -14 -16 -31 -4 -54 -89 -7 -74 -74 -69 -41 -40 -4 -41 24 -48 -28 -97 -49 8 29 79
4669 79 -45 -65 -29 24 -1 74 57 37 -60 110 44 -19 -9 -23 -70 -35 51 -54 6 -39 -89 -31 40 47 -96 -14 27 -51 -29
4698 -29 -21 -111 -67 -58 -32 -4 -36 -11 55 1 36 -52 2 73 -21 43 17 40 18 45 25 63 6 -7 -53 29 6 3 -25 -29 40 50
4730 50 -10 -33 15 -7 -8 -48 -10 -3 -5 27 27 -5 -33 -25 19 -29 38 5 17 -45 -9 26 15 33 34 2 -45 0 64 60 17 61 62 48
4764 48 10 -29 -26 7 -20 23 -51 -24 19 -79 1 -25 12 -19 -53 -57 -18 -63 -40 -56 34 -32 21 0 2 44 -91 -17 -2 -20 7
4795 7 -8 7 16 62 -46 94 13 18 2 18 35 51 -45 -48 -7 6 51 -72 18 -5 29 -57 -78 -3 -26 14 -17 24 -72 -31 -8
4826hmN5q5nl3K8K6JQ5K2j44J0L9L2Lkj6R1j23P2n7K7k1j1L0L0m5n3R6J0l2l9
4858b1R8m5j13R5k6M0k7l9K5m4J4k0j6J7L1l7N8p3J08PO1p4L6k1J4K2l5Kk5J4
4888B6m1N7k7n3nJ36o6L9n8K8l1p6O4kj6J4m4J9M5o1L5L0K5k4j0n7R9n5k4K5M7
4919C9J2K3l6N2q0k5L6KM9m7m3L1R0p5NJ5l7L7mK0o9J0Lj8m0PN1q8J33r0K5lL5
4952B0Rp9P7om0M3J1ol8R3r1j1k0R6o8K4N8j00R7q5L2M4o0PM4p0RQ1j4m5o3J14
4984F3m3m1K3n4K7k7K5j2K7JL2n2O6n3L6l7K0p1J1J19j07O2k3k7L7M4l0O3p0M
5014A3j7L8M8o6J4q4J02k4M1k0n3m1N3j1J3OmK4J2r9l4O4L8m7Qj4j3N6n4O3j23
5045a11R4P8j51J21q7Q8lJ7k8J1O3n2o7M9j1OL5k9n0O5L3p1MJ7J1k1K6n3Ol4K4
$$ plain form
4826 -8 -12 43 -42 -47 -80 -52 -26 -25 60 82 -62 -52 -13 19 22 20 4 95 -28 44 -13 14 -7 -18 12 42 -3 -56 40 50 18 -21
4858 -21 77 32 -81 14 -12 28 1 -38 -13 -57 -43 -63 -79 -62 -31 -68 -10 -83 25 32 93 19 55 34 48 70 35 37 12 26
4888 26 -15 42 15 -38 -43 93 27 66 8 36 5 -71 -7 -9 -25 -11 -55 -36 9 -52 -17 13 38 14 4 -53 46 -9 -33 -8 39
4919 39 51 74 38 90 10 -15 21 23 72 25 -18 13 103 28 33 48 11 48 44 64 -5 5 8 -10 -50 -43 8 -80 53 -37 -12 -15 20
4952 20 29 -50 27 21 -19 24 35 29 -9 84 -7 -18 -38 58 -10 14 72 -28 69 -16 16 60 0 7 51 -19 -10 71 57 12 -51 63
4984 63 20 -21 2 -52 -25 -52 -27 -39 -12 -11 21 -31 35 -18 18 -19 1 -70 -59 60 -47 15 -8 -35 2 46 16 79 9 13
5014 13 -4 34 82 16 30 -54 48 24 65 45 -8 -49 4 -7 6 12 8 32 44 -55 -89 -25 13 -34 -26 -40 -53 3 -51 12 -111
5045 -111 -17 61 -90 31 -56 32 29 46 18 29 92 40 -27 22 11 17 52 23 -27 38 71 0 4 21 32 11 37 -16 -10 -44 -20
5076b0l4O8L8m0L0m5r3L8l0nJ02j9l7P9n3N1K5k8j2J9k7K0l0OK3O1j34N5l6n5
5106h3P8N3l4N5l0k0j3q0R8q2N4qm2M9n3L7NJm3NN6L1mr1P0j8n1P6J2K7K3m0N7
5139I5n6o1M9Pp5J7L2J6n7L0KJ7j1M4L2j8qj50J09lK1p0L3l3RNl4J2J3M7l3Pm6
5172e8P7q3Q8l9O9m7oN0m6J8j8J7K8p5N6j1j6kn3N8np0pK6M2O7L3j26k9O9n2m8
5204i3M5P5K7j21j7J9O6l8k3O3m1j9J5J3L5Q1j24P0N0k4k7k6P7j42N7j6J6L2L3
5233F3j6j15J19M0j17m6M5k1K8j2K6m1k1k5Q5J6j17J3R0n8N2qm3Q2j5J07j10L
5261Dk4l3M4K1M5j5J5k2ml1R4j8q1nLK1M5o3k2l8N7K3p2Q0n3k1n2k4O7P4j10O8
5293b7Qk8m1KO4K9k0O2j4K8ll4l8j3K8j7Q6o7o3J06m5j0k1J04p7L8m1o6J03j19
$$ plain form
5076 -20 -54 14 52 12 42 -3 -96 -58 -88 -93 9 -10 -47 32 -21 30 55 27 15 34 7 27 -3 3 26 87 -47 8 -28 -83
5106 -83 -5 48 14 69 39 19 6 -74 24 -58 -4 -12 -54 -5 -58 -21 -16 -15 -58 -53 3 34 30 -61 9 -9 -60 16 28 55 78 38 95
5139 95 39 -22 27 34 -41 -24 8 24 -33 -3 -1 16 5 49 81 63 55 -95 14 11 32 -38 -5 -38 -29 -24 -58 -46 -33 14 -19 -12 -58
5172 -58 19 -64 24 -15 54 7 1 51 5 23 5 22 50 -25 31 20 4 2 -51 7 2 -68 -75 -49 -7 60 93 -33 -62 7 -45 -93
5204 -93 -48 27 54 -67 -84 -65 1 -37 -60 3 -38 -57 -42 -29 6 87 -37 33 83 59 32 6 83 -59 -2 -18 -2 30 63
5233 63 47 -68 51 91 -26 -72 -27 -48 -20 -32 -6 -47 -68 -93 -8 8 -109 -96 -6 -64 -12 -20 -63 19 4 111 1 4
5261 4 -20 -53 -9 12 57 42 57 35 31 0 94 76 -5 -10 -7 14 59 -4 -26 -64 -7 16 -56 24 -29 -50 -102 -126 -59 15 -95 -27
5293 -27 -19 -47 -88 -86 -22 7 -13 49 35 63 60 26 -12 -25 3 -14 72 5 -58 48 3 -7 -28 76 -1 37 -4 -70 33 -86
5323h6R6k9n5J42l3n3N6m2k0JO3j26K9O3K9m5NK9m8M6j4k4K5O2L0n1j0o4M7j1
5353A2n1P7Rm6l4M7k7oO2lo9o0O5jK6l2L3K8jj3p0Lj9K7N6O5k9j05O7rl4P0p1
5386c3k3Q0m0J16r4L5r1K12j22jj5j9K6l8l0M1k0L4m0M6k3l4K4L7L0q8MoN9k5
5416BJ1l1J0kK2k9qj0k6oJ4O3j2j7j7K0R8p8M1k7K5j3k4J00j24L1J0m5K5K2q0
5447e5J2L8J9J5p7J4n4L4O7j2k0nn4R0q9lQ5o8R5lL0o2N1n4k2J9pJ2KjK7qJ8k
5481C2j3o2K7Q4o0KN2j23N9j8l9L1N4n4L3j3j1J4L9r2J4RN3l6%k1j8l7P2j3P9
5512D4LK1l9qL3m1L6n5L9O1l5q9K2no6O7K4l5L6n7k2L1k1Q7Lj08M7l1Q2p7K8L0
5544EKr1M4o5O7O5q0L5L8k8J5J8m1l4N0L7k9OM8onl9N6j31N6N2J0m0L1M9r7Q7
$$ plain form
5323 -86 10 -19 -74 68 35 -18 38 -4 -24 -23 40 -86 -57 6 35 -10 -5 24 -24 22 8 -16 9 71 101 50 40 -24 23 12
5353 12 -39 38 47 1 -33 14 -13 -19 43 40 -29 -89 -24 -25 1 -31 2 30 29 16 -54 -51 -70 -43 13 78 49 -56 11 2 -32 38 -33
5386 -33 -56 24 -16 100 6 41 -50 162 40 39 24 5 31 -7 -37 4 -16 18 -22 24 1 -33 -9 28 58 -30 -26 -32 27 2
5416 2 13 -18 -8 -10 12 -17 -25 -35 -61 -67 -53 10 -2 -19 -36 -16 82 4 45 18 43 30 6 106 -18 13 23 -22 3 25 -55
5447 -55 -43 -5 14 29 -48 -34 -88 -54 13 1 -19 -24 -78 12 -77 -80 5 -63 32 29 59 -3 48 -6 -28 -9 -16 -4 -2 -3 24 16 34 32
5481 32 19 -43 -16 68 8 10 62 -61 -2 -20 -59 -28 26 -28 5 -8 -19 -5 34 -58 -44 -35 18 -18 -18 -39 -57 -94 -22 -35 44
5512 44 47 68 29 21 54 13 49 -6 33 94 59 -30 -8 -13 -79 -12 12 -23 13 -44 -66 -35 -56 31 34 -74 -27 -58 24 -53 -25 5
5544 5 7 -84 -40 -105 -38 27 -53 -18 20 -8 7 25 -16 -50 0 37 8 14 62 56 51 12 68 -63 -7 45 55 15 46 95 -2 85
5576H5j16K3n4OJ7m7M5O7K1j28N9L2mkq9L7O2o6M1J7l0j7O1m3L4L4o0M5J7%Mj11
5608f0M2N5o3N4M7j15L5o0O8lK6on0K7L6k5N2m9l5o1J7N5m5m6O3P1r2J0j1M0N8
5639C5n8Qj2J4j3P8j8J6l6MJ1J0j9l5Q9m7k6p5Q2M5q0j3O0k0m6P2n2K9j5l0K7
5670a5L9j7j2O4j15L3N8q4J1K7j6PL1J9nl8O2r8J01o0J19o5J1K2n5J1l8J0O9k4
5700E2m4Qm3N2l5J7n6M8J3m5N6l1p6Q9L7j1K3o0j4l2m0L6M2qQQ4j00J34j20J4
5730bmK6Rn0OPqN7jm9J10j55Q0K6mo0nQ0j05N0J2qP3l5n0n3l1L9JP0o6Q8o4l3
5764d9N0m3k1P1k4M6J6q9O4j8j2m2L9P7l3l0L5K4p0O4j2n8O3k8l0o0R1l5n0P6
5794A2l7O1r6N6q0R2o5J4JJ15j47P2l6P5n3L9%p7L7oO2m4j2J2L8o3L3J00Kl2n1
$$ plain form
5576 85 -31 -8 -62 -56 -39 -86 -41 26 47 -81 -22 10 6 4 -85 -48 14 -52 -11 6 -24 -41 20 -23 11 45 -15 30 47 47 51 -60
5608 -60 -18 37 -26 28 75 -40 -5 -65 3 0 26 20 -30 -3 33 8 60 11 -24 -85 -68 -13 -58 -104 -41 30 -62 -52 -63 -23 35
5639 35 -23 -15 -27 -13 -26 52 34 50 14 18 29 39 20 -15 74 27 1 -74 8 53 -27 -40 20 0 -46 26 -26 3 -12 -42 -15
5670 -15 24 7 -5 59 -56 -23 35 -49 -38 -11 -27 -20 11 30 25 -13 49 -49 52 -8 111 46 57 79 24 35 -3 7 76 52
5700 52 8 16 -27 25 -10 7 -49 -1 12 -33 23 -8 -84 5 42 31 54 -6 -20 -52 -92 -56 -14 -22 -14 70 -30 104 -16 -2
5730 -2 -6 20 29 -21 -15 -8 -16 41 40 -9 101 -54 26 52 48 -12 -17 63 -42 8 20 12 85 50 0 -53 -84 -45 -44 26 -40 48 -16 -49
5764 -49 1 -42 -63 8 -16 30 46 -43 21 3 -9 -51 -12 65 32 2 37 61 -9 55 43 -15 48 20 -10 -70 21 -14 -64 12
5794 12 -25 36 -60 -4 -84 8 -57 -43 -42 73 -74 -2 -38 37 -16 23 23 -54 -17 -23 39 -5 -17 -5 33 -30 3 103 105 73 22
5825B2n8O2l8L4k6J8L2j05Pj7N5m2L1J4n8M4nJ6L3K0pn6M8Rj59R3J09j02j8J51
5855A07p8l1qL4l6L8j4m8j2J28l3Pq2M3lk8K2p6J34q1R2q2L1p3P8j42M2J4Q7j02
5885g2O5M5o0j7N9m7NJ8n5P0L7j3j1l7M7J5k1o8P6l4L6m1N3j7m9J05r6L1m1n6
5915g3P4j7mlk9J23q6N0o2O8o9j0l5N4lP7l1M3j05M5k9J7MoP2o1j0N8j5l9J3L1
5947D2m8qK7R6r5j1O5p3K7n1j5P8m8qn1N6L2%n5rkM8Jkl9M2%m2O0j1qJ1O7p5L0
5982C1m4l5P3l4L0j3oJ9nk9lK1pQm4Q2r6O9%l6L3k9Pk2N4l5k1P2p8lK5Mr3L9L4
6017c2R2o7P3r8J1K2m0N4k9N6J1P1j40P3M1q9L1l1J0J2Kl4kJ3L7r5O5rmJ3J7p3
6049c9O4o3O2r4M8L8o0L6kj0rL2k9PM6p4O9PkJM3q2N5jk9N8n2llnJ7L0ql8L1L6
$$ plain form
5825 22 -36 26 -12 22 -4 14 46 -59 -52 -69 -14 -56 -25 -11 -69 -25 -30 -14 19 39 32 -24 24 33 -126 -33 76 -26 -44 107
5855 107 29 -2 -10 24 -12 26 12 -36 -48 80 47 54 -28 15 12 -16 6 -70 64 -17 75 -7 24 -49 29 -113 -71 -57 30 -72
5885 -72 -7 38 -22 -39 20 -27 -22 -4 -59 11 48 35 24 -13 34 49 28 -40 36 2 38 -3 50 33 -16 89 -7 24 -17 -73
5915 -73 1 -16 -20 -23 -52 71 -15 35 -27 41 -28 -38 -73 -19 -22 55 24 67 -38 7 -22 -5 -1 -7 65 4 -6 52 37 -2 11 42
5947 42 -6 -14 13 109 14 3 68 -5 22 -29 -44 34 -14 -22 -73 -17 15 15 -40 -49 -51 -3 -2 -4 -43 -1 -1 -43 17 6 -2 9 76 1 31
5982 31 -13 -48 25 -9 21 8 2 21 16 -13 -16 5 -2 6 -38 44 -52 17 17 -19 14 -15 -8 -30 24 -11 -32 40 -38 -41 -16 -12 -105 -66 -32
6017 -32 60 -7 66 -32 -21 1 -39 15 -14 42 53 124 -16 57 98 9 40 9 19 31 33 -1 -3 10 47 -48 17 8 4 17 34 -39
6049 -39 25 -38 24 -70 -22 16 -44 -8 -10 -20 -29 3 -26 -19 27 -47 22 29 27 28 71 -11 44 43 14 72 20 17 14 9 26 56 48 10 41 77
6085G7r5J0p0O5m9J10o1L1r7L2O6j3mn0N2m5Q2q1M2m7R0n7J7j3N3K0p1N5Rq2O3
6116C9p7Q4l0q0J38%q1j6l3M1m0J23j05n1J09k6o4J04r7m5M8L0k0O1r6P9k0OL9
6145B0Lo2Q7m9m5R3p6J08o2k4J4J7r1Q6L9n8K3K5j2o6L3JJ7K3k1rj1l8K7J3p8
6176g3n9Q5J5M4r8O7m5O1m5O0l3N4pj16J45p8L7m5O7j3J6L8n8M6o5J12j95K1J30
6205F8n0mm2k8j0R7k4LM4q1Ml3L3oK7j8k9NM8l8mQJ2O7m4J1K2n2k6M6L8p2P4M5
6239I1r4J24j25J1l3J21j11O3K7j15J7k7R7Qj52N2J01j39J40o5p4N5l9L0l3Q0
6265A0o5M8J5j03N1jM3J6r7P5O8J6l1oJ4m0m8O7k9L4M2j27J09q9L3J7jl8PK5k7
6296a2o7N6LK6n3k0L2N8l4j7m4M7Mj7J7OK9j6nm7L2N8j41J02N9M2j14l2Q2K2l
$$ plain form
6085 77 -18 -8 -78 -13 -62 48 -13 18 -79 -47 19 6 2 -48 4 -41 41 -40 2 -45 45 -12 5 -8 45 65 -6 49 58 -24 39
6116 39 -38 46 16 -64 74 74 -7 -23 -56 -15 -55 68 -37 -88 21 -5 -69 35 -62 -107 -59 -29 -49 12 -84 -5 -25 -19 20
6145 20 23 -39 48 -1 -46 47 -29 79 17 -7 7 24 -67 19 58 0 23 48 36 -30 3 4 21 44 23 14 3 -35 -8 5 -73
6176 -73 -132 -47 -32 12 -86 -19 -64 -3 -48 12 -21 33 26 -90 55 -23 14 -31 36 23 39 77 19 65 0 112 -83 -62 68
6205 68 18 14 -28 -56 -66 31 7 10 54 -27 -23 -56 -23 -29 -2 -20 -49 -44 4 -34 -38 -30 -18 49 5 16 38 -14 -40 6 44 -28 46 91
6239 91 -3 121 -4 7 -26 95 -16 47 74 -41 -24 -51 46 54 -98 -46 55 -84 56 -9 -83 -28 -67 -37 -70 10
6265 10 -55 -7 8 -95 -44 -45 -2 14 -83 -8 60 76 45 39 53 13 -35 32 3 37 79 -48 61 -28 5 22 21 -17 -10 15 -12
6296 -12 -79 -23 -20 6 -47 -67 -35 23 -11 -28 -72 -25 -21 -38 -21 -15 14 -2 -7 -54 -22 36 -105 -3 56 98 -16 -48 34 56 53
6327E3j3oq7J22Pr5LJ0K6k1M5n4O5kj53P3K0n4P5q6M9m5K6Q0%p8k7N9j9J1l8P
6359d7Kj6J06oj22J80o1l9n0J40p8kL3j7kl5M8N7m3q4P7m2M7p1j9M6rK0l8p4O5
6390c4j33P8P8Lr0J5J20l1J7l6K5J00k7q7%O2j5nL4J2np5Q8j33Q1l2N3K8k4j1
6420E6m4kL3k7QMk4q0Q6J8p0K9K9q4N8J2j6k3J7ON5j9l6RL9m0kJ0J5L9M0l1l0
6453C5n2K1oM2l8M2k3j6m5O5N1j1l5j16J20r7R7j3q6P4l4j4O1M6q5n3Q0j11N3
6482d8OL9J9r2J15J7l6k1L5l5N0o7RMOK7l3O4k9l5P4p2o1J1K6N7l2j9o8N9p%P
6515c0K5j0o0O7q1K9P9k4%L6p9M4j3n3J20o2l0M5L0r0K1R8j25R5M1q9O3p9M4j
6545A1m8J00j07O9K7l0m8N4k8nL6j5r6kR5n1j6R4j16PN2N2l0K3r5J50q0np8M6
$$ plain form
6327 53 40 34 -53 69 76 -19 -16 -6 20 -1 44 -10 55 53 -100 -27 -7 -61 14 -72 -23 -68 -42 38 38 -40 -67 -8 -27 -16 -54 -47
6359 -47 -45 -61 45 39 -83 97 36 -3 -53 87 9 7 40 23 21 -14 34 91 48 -36 41 -1 46 -25 -44 2 -7 13 -25 -99 -34
6390 -34 -167 -89 -11 -8 -98 -83 37 6 23 -13 12 112 85 -2 -2 60 45 40 74 86 81 6 94 -39 42 10 63 91 67 56
6420 56 12 10 43 16 24 28 4 -76 10 28 -42 -13 16 -68 -10 2 -14 -37 -20 -14 41 22 -14 -5 34 -6 -8 2 17 56 96 65 35
6453 35 -17 4 -2 40 2 44 21 5 -40 25 76 65 30 -86 34 -63 34 21 -65 9 -25 -39 22 68 -17 -70 10 -101 -48
6482 -48 -42 -3 16 -76 39 56 20 -1 34 -1 49 -18 -9 -5 1 28 -5 59 30 -5 69 -3 -64 -53 -27 30 -2 -21 -89 -30 -37 -37 -30
6515 -30 -5 -15 -75 -8 -89 -60 19 -5 -5 31 -48 -4 -17 -70 50 -12 -42 3 33 -57 -36 62 -63 32 73 -16 47 -32 12 11
6545 11 -37 63 -44 25 52 22 -26 28 0 -5 31 16 -80 -82 13 -38 -54 40 -76 -69 -17 35 5 28 -67 83 3 -2 -80 -34
6575c4J8oj1K0O4l8K3j7O0n0m5O8mj6ml5j2J11j25N7j03M9M2J2L1q1n5J5N8q7
6605i5J24k5k0nj2K9Nj3k2lJ18j20O9n1K2M3p4mJ8N1l5k3mj4J1J5M5m4p9J41n8
6636a0o3J25m9o6P0j9l7M9m8M6p1P6k7k8M4lj2m3k2R3L9j3l6J5N8r3J3K5N3r1
6666b5L8k0n0J22J5j53N8M9m5k5M2OLo3Nl1O1l1k5K2JQL0q2J15n1o9l1P5K2l2
6697f1%J36Kq4rM7q9O1l5J5N9p6O5J5m4m3Q4p4Jm0P0K0l7NK5J3m6J06o3n4l6R1
6729B4j02J02k9mjq7K3P4r2R2qPM2q1O9l6M7k1k4M4j3nRl6k6J2L6Lj9J2n9J4J0
6762b3nL6o4RJ2N2j0j8qo4K1LK4NJ5l5L2k2O8p2J7N9k1J5%q9J36m9j8kQK9n5J04
6796I0o9k5K9kj9l3m3J32r0l7R0k9K4j8n0O9n6L9n5Kl8M6P4L0q7PrJQn1J14j25
$$ plain form
6575 -34 -16 -22 -33 -13 51 13 36 19 79 29 -16 52 48 32 28 -7 -19 92 -33 24 -79 -30 12 24 55 -26 -81 -66 -8 -95
6605 -95 29 4 -16 -21 -33 -4 1 -12 -34 -37 81 -39 30 -21 1 44 -30 -34 -16 35 0 -23 -27 -41 -30 -15 30 -14 -93 48 -10
6636 -10 -73 52 3 -63 7 -12 -49 0 -48 -2 -73 3 -24 -52 -8 -11 -23 -66 -88 5 44 31 -5 10 68 -25 -12 13 66 -25
6666 -25 13 -7 -57 65 80 -73 -15 34 -11 -36 6 12 15 -48 -43 -74 -13 -44 -69 -47 -46 -38 -8 -90 25 -26 -95 -126 -51 -29 -61
6697 -61 -61 75 77 -7 -16 31 -58 3 -32 -17 42 -34 31 46 2 -41 43 -31 -30 -70 0 20 -17 -12 13 26 -20 86 23 -31 -67 24
6729 24 -78 24 -5 -9 -10 -97 -74 0 -92 0 -8 -1 41 -40 29 -7 40 19 -5 39 26 21 30 -6 -32 -20 16 19 0 12 -47 -33 -23
6762 -23 -28 8 -56 -47 -35 17 7 -11 -19 -83 -62 -59 -35 -30 -15 -50 -18 -40 28 -44 -27 32 11 26 26 -63 73 24 6 4 12 41 -14 90
6796 90 21 -4 25 23 4 -29 -72 60 -30 -67 23 -6 18 0 -50 19 -37 2 -53 -51 -89 -43 31 61 -26 -19 -28 -27 -19 -70 44 -81
6828h1L1P6k9M4RPj5j9p9Q5j5J1L1q5NL5K7L4j17qN5n3P5n9k6J10j04j3P2o8L2
6859c2O8r9M8K8m1N5j4j5M9Jj23L5KL6J3k4QmL5N0p5J0N7k1K4p2lk7N6o4J1m4
6891g2N7J3Nm1P8r2N9J2q0N7n7P5n7MP1j29R6k9L6J8l9L3O8o5j8R3r5Pj9j8NP3
6923D9o7P1j0n3M8lMo8M3J8k4l0Qj3k6M7j00l0J40j4j1L7m9M6k7M6m7n9K5J6M5
6954A2l8M3J1m7kj3kL1p5Q1M4k6K6n8j8k3O7M7k3q4N6K9r5J24o4j3j4K0o3RN0
6985hk4L6n5O1ol9J6J4ljK3q1J14j9k7M3o8M9J9j12P6kK6p2K0jM1m0N0K9r9j0
7017e0%L0Pk1J3m9k1J05j4K4k9no5R9k8m6O1JO2r0m5R1r0J6N8l9m7N6P5j2k2M7
7049G2o1m7L3k0Pm1j2P5r5J36L6j06n6N7j3M8k6l5L9o9mJ25p7J4k0Q4j6k5J5m3
$$ plain form
6828 -81 -50 26 -3 41 50 57 42 23 -56 29 14 25 56 -29 -24 11 38 72 -45 -53 2 -51 24 -35 -61 49 -55 -68 4 -64 -32
6859 -32 36 -63 -15 13 -28 27 13 -2 47 48 -75 -40 -38 -2 11 -13 -5 -9 26 76 1 11 68 47 71 -1 -4 -31 25 -39 -28 -72
6891 -72 -15 -2 3 -38 40 -52 7 19 -61 -4 -61 14 -43 -39 32 -97 -1 -30 6 24 -15 18 86 21 3 96 1 8 -11 -29 -24 49
6923 49 -18 53 43 -10 38 35 39 -29 14 32 8 -22 -14 -27 -53 -6 -106 -136 4 -10 -21 16 -33 13 -14 32 -15 -74 -49 -33 12
6954 12 -26 17 28 -19 -21 -34 -36 -5 -80 1 45 19 45 -13 -31 -54 13 60 37 -47 9 38 -57 67 3 -10 -24 -4 -67 -58 -8
6985 -8 -32 4 -51 10 4 -35 -19 -5 -8 -9 14 -67 47 28 1 44 -24 25 44 -68 8 6 32 -40 -20 -21 20 -20 30 59 -40 -50
7017 -50 -50 -20 -13 -34 -21 -70 -91 14 0 24 -5 -10 -75 24 -4 -50 11 12 74 -16 -61 30 -60 -44 14 -25 -72 -16 59 47 25 72
7049 72 11 -36 -3 -23 -16 -57 -69 6 -89 47 83 -23 -79 -22 -35 13 -13 -48 -9 -78 -82 43 -34 -20 -40 44 28 3 18 -25
7079b5L8l0Pk0M4QMj08P0M8n2O8o5j9N8m1rK7k9j2mM6Pl9J03n8k6l7PP8j00o2
7111a23J39j1m5llmR0j42N0N6m6L6K9l6m7J4O3m4N5rn8K9K1LnL2k6k7N9n0r7Q9
7143a1J6j02P5M6k8r8R8n8M0k6l1P9r2L7M5qj3j1j7j5K4M6O3m4%j0m1M8k4J7L2
7174C7m7m4Q8n4j1PJ0P0l5ONn8l1M9k7OQ4r0O3j06K4L3jM0n4o2N3Q5p3J4P2q8
7206c5P0Ko0M7L6k8m7N5M3p2l0oJ2R%K2J8o1J34j37n9O2K4QL6j03k0NR5kl8l3
7238e3K7rLJ9k5O0K5o2J7O4l1o0n2M1K9K5K9n2%rK9n9M5n5K8K5L0J7q6J1j4M8
7270En1M8l3L7q7P5j0o4R9r1prJLN4qJ1k3oO1M8j9o4Qj1J13n5m8O4P0j41P4r6
7303e2O2p7N0O6l1l7M1l6J2oJ9J5q2R5r9k0K5p2J34Ko2L7j8K3N9r0N6n0K9l8P4
$$ plain form
7079 -25 13 -17 -10 -30 14 22 26 -82 -12 36 -16 52 -13 -32 26 -15 -24 3 -26 -38 -42 4 11 -28 75 17 -9 -46 -39 39 -61 -123
7111 -123 16 5 -40 -43 -46 -50 40 -102 -52 4 -42 -6 23 -13 -60 -46 17 -27 28 19 -39 -10 11 14 9 41 15 -12 47 -3 -100 -11
7143 -11 5 -97 -22 24 -4 -102 -4 -62 -22 -48 -79 0 -92 -55 -10 -18 -31 -42 -59 -74 -50 -4 59 15 15 5 -36 12 -12 5 37
7174 37 -10 -54 34 -20 -31 -24 -14 56 21 27 32 -26 -57 -8 -35 -29 55 -35 28 -78 -54 -21 -22 18 -36 -98 -45 40 -33 -19 53 -35
7206 -35 35 37 -23 24 60 32 -15 40 83 11 -19 -25 -13 -4 -4 18 36 -25 109 -28 -87 -25 -1 7 43 -60 -80 -75 20 18 -20 -53
7238 -53 -26 -35 -32 -13 -38 22 47 -15 2 66 35 -25 -77 -36 -7 18 47 -5 -5 -14 15 -44 1 -54 -26 -1 29 46 -40 -29 -43 5
7270 5 -46 2 -31 6 -81 -6 -16 -80 19 -72 -79 -88 -87 -84 -30 -38 -27 -50 -56 5 53 34 -30 -22 -33 80 25 -23 41 111 -30 44 -52
7303 -52 10 -67 -17 49 18 -19 22 -14 -2 -8 11 26 -56 39 -60 -80 -55 -127 7 9 -53 -16 -34 -11 48 -42 14 -36 -7 -45 29
7334B9q1j6M8J9M7KK7r8R0n7L9p2O1l0k7N1nk6n3K2P2j37J20n9O1p3N8l2j4J39
7364A05q3Qm0j1Lnn5J08o8K7O9k0o3M0J4K1l6m0JP1m6P6j6l1m5qpj0Rm6J17k0
7396A9nM3l5m3j4J18o4q1P2j2k6L8Nm7n1N6k0j1J2oJ2J10l3L8q5nK8j9N7m6m9
7427d4K9M1k3K0LP5p0j1m8P2m5P3n1m3kjOk0N8ko5M1l7M9m9k5K9K7p4O3Om2M4
7460a6l6N7lQ7l3m7m5M6P7q3j9mj4P0Oq2ON2kj0j2K3j3MRq1j3M5L2jK2l5Qm9r
7495f3N6j0j8L8n1K1L7l9L4J7j9l2J8K9l3M8kJO3n5n7RM8j11Q7j3kNj9M6o3O3
7527C3m1P9r1m9m5O5M4j10Q5J6k7Oj3o1J16o7k6O7J9L3p6NJ8J7n3N1LJ7j6O4n9
7558DpmN2p2k8J7P1P3j12j0p3O4l4J9p1J00J6L7p6J2k5K4L2o8LkJ22j26O1n6M7
$$ plain form
7334 29 -52 -68 -20 -1 46 48 75 -23 67 10 49 -23 38 8 -19 32 27 1 -52 -30 42 -95 25 -34 27 -46 12 -20 -34 105
7364 105 22 30 -10 -21 -18 -23 -78 30 -38 -11 58 38 -25 15 29 50 14 -26 -25 46 0 76 60 29 -16 -24 -31 -41 -32 -78 39 19
7396 19 14 57 22 -21 -35 83 19 -62 10 -2 -28 10 15 -32 -83 -27 -47 -58 -46 -52 -40 70 37 75 -10 -15 13 -6 51 5 -44
7427 -44 -15 26 3 23 26 101 31 20 -28 44 -1 72 21 -22 -24 -25 -19 -39 19 17 -48 -7 -44 5 -44 -69 -40 -13 -87 -24 -18 -60 -16
7460 -16 -52 5 2 89 56 9 -36 10 87 4 -15 -19 -33 37 43 -39 -33 19 17 7 -5 18 5 9 18 -63 -76 -31 1 0 22 -13 -5 -54 -63
7495 -63 -7 -17 -35 3 -48 -27 10 -29 5 22 3 -29 -11 18 -15 33 31 32 95 40 -17 -8 40 -71 16 3 1 6 -13 33 -30 33
7527 33 -8 71 -20 -69 -114 -49 -5 -115 -30 -14 -41 -35 -48 -109 7 -60 -86 -19 0 33 -43 -38 -20 -3 -56 -5 -2 15 -1 63 4
7558 4 -3 -7 45 -27 -55 -38 33 106 -6 -16 -89 -25 -59 -40 -111 -11 5 42 -34 -22 -47 -23 9 -59 -56 -58 64 -62 -1 -57 -10
7589a0p0J15o8L1j4k0L8l9L6M3l5j4L4J1l4lJ9k1mm8K0J9MK5j11O6k4K9j5q8P0
7620e8M6L5q5K6m0M0PKk5Pm7R9j6M9o5L9nM1o8j2m5M9P0p4J7K1K7J0k1l8N6r3
7652e1M1K0Km0K5J1r8R7q9L3O6r7O5m4N2Lrm0O6p7J12j6J9j20R3r8M8jN6Pm6M5
7684C5j10O5J1n7L4M3Pm9lj6Q5j6r6j6J03lj5k3ml2L4n9J09n2k0Rl3P7k7OP6q1
7716a8Q8n2j09R4K5q9P1P6j28lR0pK0j17L5J6j8P4l4Pr5R7k1k1l7kL9kk9M1j4
7747b3n9K4P5n5j0J5m5J9Q4Nm9J4k2N4pklR6j99Q2lQm2J11p8j7N8p7ORM0k1n6
7780f8R3%nj5q8J4Q6o6jk2J8k9N7JL3j9L1j7K7k4L4m0jkm3P2p3O9n0O6k8p0R4
7813C4m9Pj8o8K9K1K5o7J52o9J2q8l6N6O4op0O6mK4k0J3q6N0O0n0l2L5K7J3m2
$$ plain form
7589 -10 -80 35 -33 -2 -16 -36 2 -37 -1 42 7 -7 27 38 4 1 20 -1 -5 -53 -33 -14 -10 15 -96 -30 -54 -25 -40 -128 -58
7620 -58 -12 23 -62 -36 -76 -36 -29 -27 -52 -45 -92 7 -9 40 -25 14 9 50 -18 -30 -75 -26 44 -30 -13 8 35 45 24 -14 42 -51
7652 -51 -10 10 12 -28 -3 8 -90 7 -82 -49 17 -80 -15 -59 -7 -4 -13 -53 13 -64 48 32 51 -69 24 -74 -26 -27 29 36 -10 35
7684 35 -75 -10 1 -56 -22 21 28 -21 -24 -40 45 29 -67 -83 20 17 2 -21 -25 -57 -23 -82 27 -25 -45 -36 -69 8 -19 -13 63 -18
7716 -18 70 18 -91 3 28 -61 10 86 -42 -45 45 38 58 -59 -24 -8 -26 48 14 21 -74 23 2 -19 -56 -58 -19 -21 -50 -9 -23
7747 -23 -82 -58 17 -38 -48 -33 -78 -59 25 30 -19 -5 -27 27 20 18 15 111 -88 -6 -9 -1 -43 68 -10 -27 31 -46 -40 -31 9 -12 -68
7780 -68 25 25 20 5 -83 -69 17 -49 -50 -72 -54 -83 -26 -25 8 -11 20 3 30 6 40 0 -1 -3 -46 26 -47 22 -28 38 10 -60 34
7813 34 -15 -8 -26 -94 -65 -44 -19 -86 66 -3 9 -79 -115 -59 5 -1 -71 -5 -9 15 -5 8 -78 -28 32 -18 -50 -15 12 25 -17
7844a7pJ0p0O7LM7r8K9N4p2RQ0k6kqn0M9n6J04j33J44j47Q8m0NK7j3k6l8Q1Ql2
7876c0mM5p0pR1n3L2l5j4K9l2Q5m0p7J3J50j79J10J3l9M5o1LJ05p1ML1r3L6mm4
7907f1J33p8J0m8lM9j8j0k8J02j21M2Rj8O9q4Ro5J29K0p3N5l8N1o3Qk3Q4Jo9L3
7938DO2j8q3J5rN7m0N5%n2pl6J5pk3J1J4J9l1O6JM5j43N2K4L2km3j2J1K1m3K4
7971b1k6Jj2jm9J3J13o7N4q0J3J06k6Oj3k7L3L3o5k7N2k5j6k3J3J1L9p7Q5mp7
8002f4J1N3M8j01o4N8Q3j14O3l5PP6%o8k5L8ojnO2k4P4m8l8qN4kl2pm3K3l5J04
8035C4j19L3L1jj6NN7j65J02j6K0K8n6nL9RJ4mRk8N1n4K4J0l1K9M5Om8mj3K1M5
8068E2O4j09k2K7M1l4lL0q0Oj0OK3l3j3RP9r9M2q1J06pmJ7m8L6j2k6M9n3mP6L3
$$ plain form
7844 -17 -24 -14 -84 -17 -14 33 -65 -36 18 -54 -45 35 9 7 -1 -51 -2 -58 46 -87 57 -90 -2 -42 -37 -10 -23 -49 -87 -6 2 -30
7876 -30 -34 11 -59 -66 25 -28 4 -31 -45 -16 -48 37 -3 -80 -67 83 -96 14 27 -12 33 -28 -25 80 9 13 44 -49 -13 -17 -61
7907 -61 72 -6 4 -44 -47 2 -16 -26 -54 48 -73 -31 -22 -40 29 -55 -46 -111 18 38 -35 20 -18 33 -30 -22 -45 39 40 -29 4
7938 4 66 48 -35 -20 -29 28 -12 43 43 -9 -16 -52 -37 -44 -67 -56 -42 -23 -54 12 13 58 -85 -33 -9 23 21 -22 -34 -23 -2 -45 -21
7971 -21 -47 -46 -58 -59 -108 -95 18 -49 5 -75 -62 44 18 24 11 -16 17 50 -15 -42 10 -15 -31 -54 -41 -30 9 -68 17 13 -64
8002 -64 -53 0 48 -53 -117 -59 24 -90 -27 -62 -55 21 21 -47 -72 -34 -40 -41 -46 16 -8 66 18 -20 -28 26 24 -8 -15 -58 -35 -70 34
8035 34 -85 -52 -21 -22 -38 -33 24 -141 -39 -55 -35 -7 -63 -68 -29 -20 -6 -10 -1 -29 22 -32 -8 2 -29 0 45 51 3 -1 -14 7 52
8068 52 116 7 -15 12 53 19 16 46 -34 -28 -38 -32 -9 -42 -55 -46 33 -66 -24 -105 1 -6 -10 7 -41 -5 -17 -43 6 -47 -51 25 58
8101E8j17R9k8K2O3m9o6L5K9M4j44N4k1PO8r2J9pJ2M6L4j05N0n3N8kN8mq8J9J8
8132A7J0r1oK5M5ll1K6PK2O6p4J5%m1p5R0rrR6J8j30oO9Rm7l5J0J9j6N3ok2%m2
8167d6j6Q5o5k0Q9l0K9o4k2OM1k5L1L3l7n3R7N2j15OmK3O1l3
$$ plain form
8101 58 -59 40 12 34 97 48 -18 17 46 90 -54 0 -21 -14 54 -38 -19 -26 -14 32 66 -39 11 -42 16 14 72 68 -20 -1 17
8132 17 27 -64 -70 -45 0 -3 -34 -8 -1 21 87 13 28 28 -13 -88 2 -7 -16 80 98 -32 -38 31 40 -7 -42 -32 -13 -29 24 18 -4 -4 -46
8167 -46 -62 23 -42 -62 27 -3 26 -38 -60 -54 -13 -38 -7 26 -11 -64 33 85 -30 -24 -28 -5 56 23
8191B3
$$ Imaginary data points
##PAGE= N=2
##DATA TABLE= (X++(I..I)), XYDATA
0@%%%%%%%%%%%%%%%%%%%%%%%%%%%%%%%%%%%%%%%%%%%%%%%%%JkKnOnOpOlJmJ0j4
63hJ2rJ1oMkK581n886N044L414k651l94J869j098k450K84L00j402q38P4o30l45
85b126M03M0m43M18N36J28O04J061N18J3O06N69k82k88K03n84r96k95pr01o25
106a448K54l04o40L73O12l21Q4J078L56J17J115O70k26J5M76n02p45o7n10j083
126f96l35j7l90l45M04J33l2L85O42N1K03N31K93L3L08L38j63l15M5j48o85l12
148g2j02n67l85Q7M0l82K62M26l9J49O42L13Q0K73L78p6j21K11r7m69o4k45n66
171c24k59j44j77l69J91J77K5K27L84K61J60L10L07o3J28P0j74j01m9j10l74j02
193fk26k71j80J0j04j07J16K34J62M4L97K18P2J44K77j34K5Q4k80k61m4j31k08
$$ plain form
0 0 0 0 0 0 0 0 0 0 0 0 0 0 0 0 0 0 0 0 0 0 0 0 0 0 0 0 0 0 0 0 0 0 0 0 0 0 0 0 0 0 0 0 0 0 0 0 0 0 0 1 -1 1 -4 2 -3 3 -4 2 -1 0 -4 6 -8
63 -8 4 -5 6 0 4 2 2583 -3303 1741 5155 2504 2110 3979 2881 431 715 1015 -387 -1225 -1151 -1781 -2126
85 -2126 -1723 -1683 -2126 -1708 -1172 -1044 -440 621 1139 1152 1758 2327 2045 1757 1960 1376 380 85 78 -823 -1448
106 -1448 -1194 -1498 -2138 -1765 -1153 -1474 -1390 -312 44 161 1276 1946 1720 1735 2211 1709 964 897 387 -696
126 -696 -1031 -1048 -1438 -1783 -1379 -1246 -1278 -893 -251 -200 3 534 827 860 1168 1506 1343 1028 1073 925 240 -72
148 -72 -174 -741 -1126 -1039 -999 -1381 -1119 -693 -732 -583 59 372 452 725 1103 1027 906 1117 1020 551 487 242 -324
171 -324 -583 -727 -904 -1273 -1082 -905 -880 -653 -269 -8 152 462 769 706 834 904 730 629 580 470 96 -6
193 -6 -232 -503 -683 -673 -777 -884 -768 -534 -372 -328 69 287 359 503 780 646 671 755 475 214 170 39 -169
216a69l52O7j05j82J08J21r1J40K78J89J44K44J32O7L6M1o5j68q9j34k46j22L
239a53k54j33K2m4l0J53J26M9J08K38J59J44m3J85o8k7R9k00r3j64j59p7k24K0
263c66k3r7L6J06L5R9J38J72M1R9J32K3Q7k7q5j23j11r9q5j71Q2k27j9pJ16p2
289c46J3J72K5J56J17N1O9N7M8o9l3J3l4j51r2k1q7j20j7j5r0J7R9N8J1J28J01
316F0J17J0R8K3q9P2o9j09M3j33k8q9j14o9M6O0l1m3R6j3J11O0R8R6q3J08m1L
344A90k3J5Mm6j58p0q2P4j57J41o3O6M6J0j4R4N9O8j1P2L1k6p5K5Nj15m4q4j7
373h5N6j18p2L1Q3j7QM8J51k2o9J43q0J30l6L5j2o4o1J1n1r7p4L6l2N6k9M4j2
402i9M7L3lJ75o1k3L0K5oK1q7J1p3j1j11L4k9RJn1j2K8R2mk8J35M1M1k2N4q3M4
$$ plain form
216 -169 -521 -454 -559 -741 -633 -512 -603 -463 -185 4 148 392 524 591 627 668 603 435 346 212 -34 -156 -153
239 -153 -407 -540 -518 -562 -592 -439 -313 -264 -156 82 241 385 342 527 459 432 531 331 238 74 -85 -162 -386 -366
263 -366 -389 -486 -450 -344 -309 -210 -72 100 141 240 372 395 482 455 370 247 136 37 -48 -219 -137 -364 -383 -390 -274 -346
289 -346 -333 -161 -136 20 137 188 257 314 362 293 260 273 239 88 -4 -25 -112 -232 -249 -264 -354 -337 -238 -180 -169 -41 60
316 60 177 187 285 308 219 291 222 113 156 23 -5 -94 -208 -277 -231 -171 -202 -245 -149 -162 -51 9 107 203 120 228 187 190
344 190 167 182 186 140 -18 -88 -170 -96 -253 -112 -175 -109 -63 -53 -67 27 86 154 143 215 246 220 145 170 175 60 16 -68 -85
373 -85 -29 -147 -219 -188 -105 -122 -114 -66 85 63 -6 137 57 187 151 186 174 110 49 60 9 -88 -162 -126 -158 -102 -131 -87 -99
402 -99 -52 -19 -22 153 92 69 99 124 118 139 52 63 -10 -21 -132 -98 -127 -118 -117 -168 -180 -152 -60 -64 -92 43 84 125 103 157 74 118
434A18l4q7O9j5m0l8M3q1m1l9K9j0Q4MN4M6o9P1L2M3j15J04r8o6M3J9m6n9oN5
464c0l6J3k5J2n5Q9j5Q3J5k5K8M0K6O9q8J3n9lj8l2n0L5l4o3Q4k3o8Q1L6K4L1
495E5O2q6K9nn2O3K2k1o9j7m1L1K8j03J01q5N3QK6r3N5K3m0R2l0L7OLJ00p3n3
526B6l4Q2j40J6J1LL1n4P7q8M1oPL7M3l5j8MO8m5k0m2m5L6J15r1K9p2J0o2J00
557a6m6M9JJP4m2j6K0Lj9RK6l3L2J0m7%oL1j15J23p2O4n8lk7P5l7J05o3P9p5n1
590b4J07r4O2mk9r6J02Kl3j0J9J8l8n1N8Q3m6j3J5M9j5l4rknj0KK4n4Q9k7k2p
623Gk7nm9J03K8k2Pok1%k7L7M3mp6N1j1j6j7l2M0L1l5P9j6m3l3LN3K1Nn4M3k1
657C6o5N4n6j0K5J9qK5l4p%K2N1n9O9m5no2M6qP8l6m1J3N6m1n4J47q2j7K1r9J
$$ plain form
434 118 84 -3 66 51 11 -27 16 -65 -106 -145 -116 -126 -42 -38 16 62 -7 64 96 139 24 128 30 -36 7 26 -20 -79 -85 -30
464 -30 -66 -53 -78 -66 -121 -32 -47 36 51 26 54 94 120 189 101 114 55 52 34 2 -48 -13 -47 -110 -26 -49 -117 -36 0 24 55
495 55 117 31 60 55 3 66 88 67 -2 -19 -60 -29 -1 -104 -3 -88 -35 -27 -1 -94 -39 -16 -56 36 6 43 49 52 152 79 26
526 26 -8 74 -66 -50 -39 -36 -5 -59 18 -70 -29 -35 -28 9 52 17 -1 3 71 26 6 -36 -81 -45 70 -21 8 -64 -54 -116 -16
557 -16 -62 -13 -12 -11 63 21 5 25 28 9 18 44 11 43 53 6 6 0 31 -84 39 -33 31 -27 -30 -57 18 -19 86 23 102 27 -24
590 -24 83 -11 51 47 18 -78 24 26 -7 -17 2 20 -18 -69 -11 72 26 13 28 77 62 28 19 17 12 2 4 28 -26 63 36 14 7
623 7 -20 -25 -74 29 57 35 42 36 15 15 -12 25 68 64 -12 39 28 12 -5 -37 3 34 -1 78 62 19 -14 -11 42 63 68 14 57 36
657 36 -29 25 -31 -41 -16 3 -5 20 -14 -21 -21 1 52 -7 62 17 12 -50 -4 -12 66 30 -11 2 58 17 -37 110 28 11 32 -67 -66
690f6Q9k1L4k4q1J22j9o5L0N2j0m7l8L6J52j51l7MK3K4n0L9K5p1OL9QM5j05O6
720IM2o2MK8no1K3K7jM0m6l8M3j6p0Q6j3K4MO6n7J9L8j05O2pK1Lq5N2kl7o1L5
754d0Q0j7m2M4o2R1j13O2N2n2J3l0o4P3M3n2L1M3r2K5M9q8N4n3P2j5%j6M3j2M0
785F7l7OK4k2n4k1J1J3Pj3N4n2l4O3l7l0R5p2L5m8J32k7j01K7L7p1J39j12L9%
815A8k6M6Rn8Q8p0k3P6k5Om4N2l5pl0P5o2j4R7n6J9j6j5j3kJ2k8Q1j4j6k7Nj4
848a1m1LL9J8p4N3Ro6P7O2l3k2m4Q8o6J5J4p8P7j5N6J7j02M6j6J7q2m4M8J01J8
879F4q2m3J3O3o3P2k2jq8M8J1K9l7J6j6M2M5K2n7j3J2l2O0j7l4R5kr5O6Rn2l0
911a7N1qJ8m7jL4n0j4K6l7N4nl4j7P2j8l8J2O8k8lp7M9M9q3k4J8M5o5N5N8pn0
$$ plain form
690 -66 23 2 36 12 -69 53 34 -31 -1 51 41 -6 -44 -8 144 -7 -44 -40 -17 7 -43 -4 21 -50 -44 -5 3 48 -57 9
720 9 51 -11 -7 21 16 -45 -22 5 4 44 -2 -40 3 -13 -83 3 -10 14 18 84 27 46 84 -21 41 34 55 58 -27 25 23 -14 -75 -40
754 -40 40 23 -19 25 -37 54 -59 3 55 3 16 -14 -78 -5 38 -14 17 60 -32 -7 42 -46 8 -45 27 12 12 -4 39 27 67
785 67 30 36 60 38 -16 -37 -26 -13 -6 -19 35 -17 -51 12 -25 -55 40 -32 3 -45 87 60 -41 -14 23 -48 91 -21 18 18
815 18 -8 38 47 -11 77 7 -16 60 35 41 -3 49 14 7 -23 52 -10 -24 73 17 36 20 5 -8 -10 2 -26 55 41 25 -2 3 -11
848 -11 -52 -49 -10 8 -66 -13 -4 -70 7 69 36 14 -30 58 -8 7 21 -57 20 5 61 78 -24 22 6 23 -59 -103 -55 46 64
879 64 -18 -61 -48 15 -48 24 2 1 -87 -39 -28 1 -36 -20 -36 6 51 73 16 3 15 -17 43 26 -8 87 85 -10 56 65 13 -17
911 -17 34 26 44 -3 -4 30 -20 -34 -8 -45 9 4 -30 -47 25 7 -31 -19 49 21 18 -59 -10 39 -44 -68 -50 -5 -70 -15 43 36 -14
944a4M0m0N8m8J25o4j2l3K5k0K3j17J16k0k9M2q9K7N4Lo6l1K8l0O2MJ4l8M0j7
974gj7N3L5j04j3kJ0pJL4J7k4KJ01p4J1jL6j2J4m1J22j48j6J6Om2jj0M4l6J4P
1007c2n0J10%l9l8nJ7j7Lj1k4O0No1J27n6oL6O8n0j3QM2n4nJj5Q1p5n3M%kK4Q2
1042F2r1k0P4m4l5j5RrO3r4P9P1K6k6n8Ooj1J6nL1l6M2r6ON8l3N4m4N9m6j9O4
1075C2r4K1M4O3qm0q8O5N4j6M9n7k2k2Mk2N0J4n2J1K0n7J04J1q8rK2K5j9K1l4
1106a8LR1l5p0L4J9p0M8L7J7o9K9m0J6l4M4j7j0O4n5pN4k1j2j6Mm5K7Q0j7p1m5
1138h5Q8J5l8l3K9l3P3n1nK8l8P5j0j2j0j4N1k7M6j03O0K6k0J9ml2jK2j5RKL3
1170D5o8NRqJ2Mk5R4q5qJR2o3P0q1J3l8M8J5l9MJ0N3m9j4K3K2m8P5l0k8L5p5R
$$ plain form
944 -14 26 -14 44 -4 121 57 45 12 37 17 40 -77 39 19 -10 32 -57 -30 24 27 -39 -70 -42 -72 -10 -6 8 -30 10 -7
974 -7 -24 29 64 -40 -53 -55 -45 -52 -51 -17 0 -24 -22 79 5 16 15 51 39 53 12 134 -14 -30 -14 -8 -50 -51 -61 -17 -53 -39 -32
1007 -32 -82 28 28 -11 -49 -54 -37 -54 -51 -62 -86 -26 -21 -82 45 -11 -17 19 87 37 24 32 74 20 15 16 1 82 7 -46 -42 -42 -44 -20 62
1042 62 -29 -49 25 -19 -54 -69 -60 -69 -6 -100 -21 50 76 50 -8 -2 -8 -19 -3 -8 23 -13 29 -67 -61 -3 -36 18 -26 33 -13 -32 32
1075 32 -62 -41 3 66 58 18 -70 -5 49 33 82 25 3 -19 -15 -37 13 27 -25 -14 6 -51 53 64 -24 -33 -11 14 -5 16 -18
1106 -18 -15 76 41 -29 5 24 -46 2 39 56 -13 16 -24 -8 -42 2 -15 -25 39 -16 -23 31 10 -2 -18 -14 -59 -32 48 31 -40 -85
1138 -85 3 18 -20 -53 -24 -57 16 -35 -40 -12 -50 25 15 3 -7 -21 30 3 49 -54 6 32 12 31 27 -5 -6 16 1 10 12 45
1170 45 -23 -18 -9 -17 -5 -1 -26 68 -17 -25 -24 68 5 75 -6 7 -31 17 32 -7 -3 7 60 11 -3 20 42 -6 69 39 11 46 -29 -20
1204b0K9L7m7j7k2j6J15j21M2L7lL6p5o9J18o0J17j08P0r0O4r3MJ53r2M7OK7q7
1233a8O0j3r1j4J29J5j13j9Q5j3ON6j14J4K3O6n9O9p7qJ9k9lJ04p2Pk9n8J17l1
1263Il1k2N3r7J23m4QL5o7Mj1Q1j14N3QJ3O4p2M4n2O5jk2oPjJ1p8M7K7l0k5k1
1296d2M1p9N5m8P0n8P5l7OJ5QPj4p4MM9Jk8K0O8l0nK6L1m8l0Q6PMJ3n3qm3n9j4
1331h4J46m5J9o6K2l1J3N6l2mM1K2q7JL0O7j15M7k4k9M5J4o4K7M0O1r1l6O9jm6
1362c5K5n0J03j41Q0mN6j1l3O5o6L7kn1O8n0k9J0o0K0Q2o4O7J3n9M1k9M2K3p5
1392b7l2J18n1o9L1%K6J0j2ln6N5j7L9k4lJ8M3l7M2Jm7rM0l3J9j1M2K9m2j11J02
1424C1k5l5O7l0j1M1k9j1m4O3j5l6N7p1K4L1P6q2JM6m6nO5pm7M4jm1p7Q6m4L0
$$ plain form
1204 -20 9 46 -1 -18 -40 -56 59 -62 -20 17 14 50 -25 -94 24 -36 81 -27 43 -47 17 -76 -72 81 -11 36 42 69 -18
1233 -18 42 29 -62 -76 53 68 -45 -64 21 8 14 70 -44 -30 -7 59 0 69 -8 -16 3 -26 -29 75 3 10 -19 -77 40 9
1263 9 -22 -44 9 -88 35 -9 -1 34 -33 -29 -40 41 -73 -20 -12 1 65 -7 37 -15 50 49 27 21 28 27 38 -40 7 34 4 -21 -42
1296 -42 -1 -80 -25 -73 -3 -61 14 -23 -17 -2 6 13 -1 -75 -71 -22 -21 -49 -29 39 9 4 30 61 13 -17 69 76 80 93 40 32 -11 -70 -84
1331 -84 62 17 36 -30 -8 -39 -26 30 -2 -6 35 57 -30 -29 1 68 -47 0 -24 -53 -8 6 -58 -31 9 70 -21 -57 12 11 -35
1362 -35 -10 -60 43 -98 -18 -22 34 23 -10 55 -11 26 24 -27 41 -9 -38 -28 -88 -68 14 -50 17 30 -29 12 -17 25 48 -27
1392 -27 -59 59 8 -61 -30 -30 -4 6 -6 -9 -65 -10 -27 12 -12 -15 3 46 9 51 52 5 -4 36 3 22 11 53 82 40 -71 31
1424 31 6 -29 38 8 -3 38 9 -2 -46 17 2 -34 23 -48 -24 7 83 1 2 48 2 -3 62 55 8 52 51 10 -67 19 -25 5
1456EM4m0%N5j8p6O2l4K4J1m0M2k6q3M9k3K2j9N2m7N4n9O0k8jp8J16O2j69L5L5
1487a3M3J2k0j4nk6R7j02R1m6n7K0QK8N3p1Pj5O2kn1o3M5R0j05Kk5J19o5k1O5
1518D1nm0l1L0m5K2L3j4j3Q1Op1P7Jj43J35q1N5L8j0n0L4Qk2k0Q5j53J25p6n7
1548f0Q4rl4j8M6m3M6mr3O1L6o0J2L1K2n9j9P7n4L0M7o5L5j1l9J9K7k6K5O1Po3
1580IPj5O8m0o0N3jl8j9O3j8r%k8qN0k8M2n6pm2j0N8m2M5Q7j02K4J9J8k6J3J7
1613B4O0q0K4Jk5l3J0j6O5L7j15P4J2p8O9j6l9Q1o4N5k8l3RL0j0o4J42j80O7N6
1643C5m4Qq2N9M3J5r3L5N3l5j2j7KN9J6rm4jN1Ml4P7n9p8j7L4O6l7L3k8l6N0k9
1676a5j5JR8r2K2N6o3M6n8j1J9%nM4q2J8K3n7Q3p7J16km0L0l7j8L8L7m0k6jR4
$$ plain form
1456 5 49 9 9 64 46 -30 32 -2 22 33 -7 35 9 -74 -25 -48 -26 -45 7 -40 14 -45 15 -13 -14 -92 24 86 -83 -48 -13
1487 -13 30 42 22 8 3 -23 74 -28 63 17 -40 -20 -12 16 69 -2 5 -10 52 50 -1 -64 -19 71 -34 -32 -57 62 -3 -24 41
1518 41 36 -4 -35 -5 -50 -28 5 -9 -22 59 65 -6 71 72 -71 64 -17 38 76 66 16 50 58 36 16 101 -52 73 -3 -60
1548 -60 24 15 -19 -37 9 -34 12 8 -85 -24 12 -48 -36 -5 17 -42 -61 16 -38 -8 39 -26 9 -2 -41 -22 5 -21 4 65 72 9
1580 9 16 1 69 29 -31 22 21 -17 -36 27 9 0 0 -28 -36 14 -14 28 -28 -35 -77 -87 -29 -71 -26 61 -41 -17 2 20 -6 7 24
1613 24 84 4 28 29 4 -29 -19 -35 30 67 -48 26 38 -40 29 13 -26 55 -9 46 18 -15 -6 24 14 -50 92 -88 -21 35
1643 35 -9 -1 -83 -24 19 34 -59 -24 29 -6 -18 -35 -33 26 42 33 -11 -12 39 43 9 86 27 -51 -68 -34 32 -5 28 0 -36 14 -15
1676 -15 -30 -29 69 -23 -1 55 -8 38 -20 -31 -12 -12 -17 27 -55 -37 -14 -71 12 -65 51 49 9 39 2 -16 22 59 19 -7 -8 86
1708H6j05K8J4rj2K6k7m8R1km3l1L5L2j4l4k5O7n2K7j9J6L0k9K1k0PL3no9QLK6
1741Fl0PL6j7k8M9L1o7mJ4Jk1Q6r2Q2r7NO8Mk2k2P0q4M6o8rP9l9QJ6J6p1K5n4
1775g6L0K8K5N8r6N7k3r5R4k4J6n0K1J30o1p7K8k9N0%Ro1J20p4j5J2n7P5J1o9
1805d3J8n3J5J0Lk9P7l9k2L8j7M3o1L7oK1k8n0P7p8J09M7n6kJq3L0K7J4K4l4%
1837a0NN6m4l4J1K7N3lj15Q8o2L5m2KP3p4M3l6l0L1M2J3j15J10o4L1Q4j37O0L9
1867C7Kn8rK5M2l7J1Nl3m9O4RjO4l5m7J3L1n4n1J07l9j4j0N5r9J02k1l8L0m1j5
1899e4J22r6J13j23P2oj9k6L4m3R6q1k5J07j05L8o9J0M6jj6J7k8Q6p9L6rm2Q9
1928D4r8R7l0J5q4P6J1K1j22J32n5q9L9J19j38J05oo8L5k5k7N7P9j74J14m3Q9
$$ plain form
1708 86 -19 9 23 14 2 28 1 -47 44 42 -1 -32 3 35 21 -13 -38 29 -23 4 -15 1 31 2 23 3 10 43 38 -31 -23 -20 6
1741 6 -24 -17 19 2 -26 23 54 -13 -17 -3 -2 -23 63 -29 53 -44 -39 29 33 11 -11 59 -25 21 -47 -56 23 -16 -8 8 24 -47 -22 -76
1775 -76 -46 -18 7 65 -31 26 3 -92 2 -22 -6 -56 -35 95 34 -43 -15 -44 6 6 15 -46 74 0 -15 -3 -60 15 26 -43
1805 -43 -25 -78 -63 -53 -50 -79 -2 -41 -63 -25 -42 1 -60 -23 -29 -8 -36 -86 -9 -87 22 69 13 11 12 -71 -41 -14 0 24 -10 -10
1837 -10 -5 51 7 -27 -16 11 64 61 -54 34 -28 7 -35 -33 40 -34 9 -27 -57 -26 16 29 -86 24 -40 -9 75 -62 -2 37
1867 37 39 -19 -28 -3 39 2 13 18 -15 -64 0 9 8 72 37 -10 3 34 -20 -71 36 -3 -17 -27 28 -71 31 10 -28 2 -39 -54
1899 -54 68 -28 85 -38 34 28 9 -17 17 -26 70 -11 -36 71 -34 4 -65 -55 -9 -10 -26 -9 -37 49 -30 6 -3 -45 44
1928 44 -54 43 13 28 -56 20 31 52 -70 62 7 -82 -43 76 -62 43 37 -31 4 -21 -48 9 88 -86 28 -15 74
1955G4j16n1J10j20J04L7k2p5L1j3O4Pj31J63n2K2j5J3M4p5L3m6l8K1M6n4k1Q8
1983B8l3k4M0Q4j57R9n7j9j7k5J02m9O9j6k8J04p8p9j1Q5Mk2J8kK2q9P5m4N5n9
2013b4k3N7n3N8n3P7j2j5Q4n2J5j5l4m1J9l0rM5%j34J51L5m9L0r0RM7L4L4o2o7
2044f8R5Om0J9%J9L9k4J2n5k1J4J5Lo1N8p7OP1L8r5J03p9k0N0o1L0K1m9k8J33
2075E4j07J00l3Pk8k4M7l9L0L7n7OM4K2o6M2l7m3J03o6K9l8J8m9J23k2j07L1J6
2104gj0o2oJ45j28Q6l1J0k5Q7j9n7l2P2j9k1P6k1k6K0L2mr2J8O3kK0oo3QJ7L2
2136E5p8J12p5K1k0RJ3j06P0k3nK1l0L2r4N1J9R1q5M2k1N4l8l9L2OMo5O0m3J9
2167a1P3K1j11M7Ok1M8k1m9N5p3PP1l0J9k3n2nQ4l9L5n8J7J7Ll0qQm8R8m2n8m0
$$ plain form
1955 74 -42 -93 17 -103 1 38 16 -59 -28 -41 23 30 -101 62 10 32 17 30 74 -1 32 -14 -52 -31 15 -39 -60 28
1983 28 -5 -29 11 95 -62 37 -20 -39 -56 -81 21 -28 41 25 -3 101 23 -56 -67 18 22 0 18 16 38 -51 24 -20 35 -24
2013 -24 -47 10 -43 15 -38 39 27 12 96 44 59 44 10 -31 -12 -42 -51 -6 -6 -140 11 46 -3 27 -63 -54 -7 27 61 -1 -68
2044 -68 27 33 -7 12 12 31 70 46 58 3 -18 -4 11 14 -47 11 -66 -60 11 49 -46 57 -22 -42 8 -53 -23 -2 -51 -79 54
2075 54 -53 47 14 21 -7 -31 16 -23 7 44 -13 -7 37 59 -7 35 -2 -45 58 -8 21 -17 1 -48 75 53 -54 -23 -7
2104 -7 -17 -79 -85 60 -68 18 -13 -3 -28 59 40 -17 -49 23 4 -17 59 38 12 32 64 60 -32 -14 49 47 67 61 -2 6 23 55
2136 55 -23 89 14 35 15 24 37 -69 1 -22 -27 -6 -36 -4 -98 -47 -28 63 -22 20 -1 53 15 -24 8 14 18 -47 13 -30 -11
2167 -11 62 83 -28 19 25 4 52 31 -18 37 -36 -29 42 12 31 8 -44 -49 35 -4 31 -27 -10 7 10 -20 -28 -20 -68 30 -12 -70 -110
2200a10M8N2Mj8j7J1K2j7Q5j11N1J1K0j7j4l9Q0j31R1J5rM5j0j0k8jJ1r6J70o6
2230B2ll3m0J06r8K1L2lo0O1n5M6O5q3M1j5j4K9m5mJ9M3%M6j44J04lp0Q5l4mj9
2262gqJ1P9Oj02J9Q8l6q7K0RMp5P0nM7j8n5J4j0R2L1n9m5J4j6NK8m2M1J5rK7r4
2296d8R2j17J24K0l6n2N6j02O1PM7o1Q9p6r1P1QrM0o3K8m5J0QP3ok5m3j0K6J7
2327gn6jO0l6P4m6Q2j25L6K8o8J20l9M1p9P2n9j2J7J2J8o2O3m8j2KK8l7kO6l6
2358frl0JPk1J07l1k8nQQj1k7K8L4jj71J49m0J8K2K4j1k4l3R3O8j14KK8J7l9Q
2391B1m3L3ql2O4n2nO7r9J5M5j0K8k3M7j42Q6K2j2J4qJ0nLj04N7j6N2N7K9j13
2422b2P1q6M7K3j5O4r0j1M1L8o7k1PL5j18J22NKJ6j28J36No2M3o1J6PP0j07K4
$$ plain form
2200 -110 -62 -10 -6 -24 -41 -30 -8 -25 60 -51 0 11 31 14 0 -39 41 -90 1 16 7 52 42 32 4 3 14 -82 88 22
2230 22 19 -14 -54 52 -46 -25 7 4 -56 5 -50 -4 61 -22 19 4 -10 19 -26 -30 -11 32 32 78 -66 38 35 -35 50 16 12 -7
2262 -7 -15 -4 75 81 -21 -2 86 50 -37 -17 -8 -4 -79 -9 -14 33 15 -40 -26 -36 56 87 28 -17 -3 -19 -14 14 -28 13 28 19 46 -48
2296 -48 44 -73 51 71 35 -17 39 -63 -2 5 52 -9 80 4 -87 -16 -8 -17 23 -40 -12 -57 -47 -39 34 28 3 -40 -50 -24 -7
2327 -7 -63 -64 -4 -40 34 -12 70 -55 -19 9 -59 61 22 63 -16 56 -3 -15 2 14 32 -30 33 -15 -27 -25 3 -34 -36 30 -6
2358 -6 -15 -45 -44 -37 -58 49 18 -10 -15 -7 1 -10 -37 -9 25 24 -147 2 -38 -20 2 26 15 -9 -42 51 119 5 7 35 52 13 21
2391 21 -22 11 3 -29 35 -17 -22 45 -54 -39 6 -4 24 1 48 -94 -8 14 2 16 8 18 13 16 -88 -31 -47 5 62 91 -22
2422 -22 49 -37 10 33 18 82 -8 -19 22 60 -7 -28 -21 14 -104 18 23 25 41 -87 49 54 -8 35 -26 -10 -3 67 -40 -16
2452a6j6P1Po9N0lN4r6l1J3O5m7l0Q4j2pRL0k8k6K5M4p9L9l9rm6R4Qm3K0j1l3
2485b8O8qRp9J2K7N9q2j2O9n7J3K4J7l2L0k7J1N1o2L4n4M4jmm4n1J06K9p2J2J8
2517B0q9J2L7M4m0J8k0Ml5O4P6n5r4m1J65j14j1N3k3L3JK0j2J6L7q7M8M5q2O0
2547E0o2l6Q7j0M0m0k9N6Np1lN4j1m5M3Mo7K8Op4M1qlL0jkj8L4l3L4MK2l9L1Q
2582B5l5L9m2P7r1MJqL0J6MK7k8n4M4K2l1Q2k3r0O5l1L0l8J2n9L0j6k8P6o4P6
2614B2j8K1q3Q3k7j5K9M4n5NN1l2m9L0M0r6O2m3M8J3Kn9J5O8l4L5p4k1M0J8M8
2645F8j04L4J2%p6O8K6o0JO1ol1rlN5l7N1n5j1R6r2J9J5o8k1Q6l1M7o1P2j09P9
2677A6j9PpL1K1l6j9L2l0M6NRLl8m7rO8q5K8M9r5K9J7r1K7N7L1J2pj2Mk0K9J8
$$ plain form
2452 -16 -32 39 46 -23 27 24 78 -18 -49 -36 29 -18 -48 36 24 17 26 56 28 2 27 71 -8 31 -8 -17 -63 31 39 -4 16 5 -28
2485 -28 40 32 41 -38 -26 1 60 -22 -34 35 -22 -9 15 32 0 30 3 14 65 3 37 -17 27 26 22 -22 -73 33 62 -10 2 20
2517 20 -69 -57 -20 24 -16 2 -18 -14 -49 15 91 36 -58 -99 66 -48 -59 -6 -29 4 5 25 13 29 66 -21 27 72 -10 50
2547 50 -12 -48 39 29 69 29 0 56 61 -10 -13 41 30 -15 28 32 -35 -7 -1 -75 -34 -42 -45 -15 -16 -18 -36 -2 -35 -1 3 25 -14 17 25
2582 25 -10 29 -13 64 -27 -23 -22 -30 0 16 20 47 19 -35 9 31 0 82 59 -31 34 3 33 -5 7 -52 -22 -38 -66 10 -54 22
2614 22 4 25 -58 25 -2 -17 12 56 1 6 57 25 -24 6 46 -50 12 -31 17 30 32 -27 -12 56 22 57 -17 -38 2 20 68
2645 68 -36 -2 10 10 -66 2 28 -32 -31 30 24 -7 -16 -19 36 -1 50 -5 -16 80 -12 7 22 -46 -67 19 -12 35 -26 46 -63 16
2677 16 -3 4 -3 28 49 13 -6 26 -4 42 47 56 59 21 -26 -35 33 -52 -24 25 -70 -41 -24 -115 -88 -31 0 12 5 -7 -3 -23 6 24
2711B4Ll0NK6M5n4K4j8O2q2J8m1Q8o2n8O7o4M1kO1l9L7lk4Pj8o3k5N9Pn3P8l4
2744a8J08r6J0j10J96j29J8N1j01P5K0J0l5Rm4RJK4L5J9l2J2j0J9l6J0K7j9j1
2773A2K2K8q1M5l5Q2m7Qm8J8K8k0n5L6j0R5q2L4k0m2K8N5n5M3J6j4l4qKk8M9n6
2805c4J7J5Ll3P9l9NP9p4K1m3lP4m2j3rl3J34m1l0m7J3n9J4M6n5O8p2P9k4p6J63
2837H3p2q9J21n0m2N3L7l1N0q3M0o5L2J2P9q6J1M5l7L1%j1j34J24j4P9j17J2O7
2866D5K0o8j9K0l5Q2j01R1k9N2m4L2K7Oj00N7Jk4M7%l8J3m4m3P9Jm9O6r8O7j4
2897@j5L9m5J2m8K4N0l0L4l0rM7oq9K5R4m2K6n3jkJ0K5k1N8k1l2l9rk0N2j0L2
2930F%n3oQL0L4k8L3l9%M2n9j7Q7k3r8O3Pl6Q3j6k9K2L0p7J0r4J47lp7N8l9o3
$$ plain form
2711 24 27 -3 2 28 73 19 43 25 87 5 23 -18 70 8 -50 17 -47 -6 -8 53 14 51 48 24 31 13 -50 -75 -16 -9 -62 16 -18
2744 -18 90 -6 4 -106 90 -39 -21 30 -71 4 24 34 -1 8 -36 -27 -26 -2 33 52 20 32 22 41 5 15 42 23 12
2773 12 34 62 -19 26 -9 73 26 34 -14 4 32 12 -43 -7 -17 78 -4 30 10 -32 -4 51 -4 39 55 41 7 -1 1 -27 22 -34
2805 -34 -17 -2 1 -32 47 8 13 92 18 39 -4 -7 67 25 12 3 -30 104 63 33 -14 -1 -60 -46 0 -55 13 -59 20 -4 -80 83
2837 83 11 -78 43 -7 -49 4 41 10 60 -23 17 -48 -16 -4 75 -11 0 45 8 39 39 28 -106 18 4 83 -34 -22 45
2866 45 65 -3 -22 -2 -37 45 -56 35 6 58 14 46 73 79 -21 36 37 13 60 60 22 35 -9 -52 27 28 -21 45 -53 14 0
2897 0 -15 24 -21 -9 -57 -33 17 -13 21 -9 -18 29 23 -66 -41 53 11 37 -16 -17 -19 -9 16 -5 53 32 0 -39 -48 -68 -16 -26 6
2930 6 6 -47 -53 -45 -15 19 -9 24 -15 -15 27 -32 -49 38 15 -83 -20 -13 -49 34 18 -11 11 41 -36 -26 -120 27 24 -53 5 -34 -97
2963i7O2qN6n1M3q7R8l1M5K2j18N3MP7Jm6MM5k3q9P8lK8k2p2J9J4L1k4Mk2j8o
2996c3j8L6L2m1k3O2j04J12j8J4J0nk1Rj3j1m4L0Q7j5Jl0JOj0rLlJ0m7Q2j11L7
3029b4rrL7O5k5p1L6n7K1j6L9L9Mr0J21j29Q5M4j13jL2jJ14nj24O9R2r0o6J7o
3060b1J8K8K7q5P1j2l9J8Q5j04J5om3K6mnL1ok2j1Q4J9l3J6m7JJ7k4L3j6M4J6
3092G1j09P3l3J4L7m5L1l8L3q2P6N0l4k2k9O2l4M2pm2L9J2j8k3pJ1l1k1O3kj0
3123B7jr3J9K8K6nL2n3J04o8OK0j09R1n5K7N1L8r7jJ2K0J6n4P9l7L6q0R1q1J0
3154aJ0k3L3M3k6N6j08MJ5k4Q3q5R3o6L3j00L6PL5o4Q2p2K4O6k5N0j7j01J39q8
3184Im5L7k6P6m7K6k2M4j3o7M7n5Q8k4Rj6l3J8L2p9K5QM%m6N5Mon6k6O5M0r0O1
$$ plain form
2963 -97 -35 -43 13 -38 5 -82 16 -15 30 52 -66 -13 -9 68 69 23 27 72 49 -40 38 35 63 41 -31 -12 2 33 9 13 -9 -27 -33
2996 -33 -51 -15 17 -24 -47 15 -89 23 5 19 29 24 3 12 -1 -12 -56 -26 61 46 47 17 18 24 14 5 8 5 15 -32 50 -61 -24
3029 -24 -33 -42 -5 60 35 -36 0 -57 -36 -52 -13 26 30 -60 61 -68 17 61 -52 -53 -21 -22 92 87 -37 32 124 34 -32 -15 -21
3060 -21 -3 25 52 -33 38 26 -13 5 90 -14 1 -5 -48 -22 -26 -31 0 -6 -28 -39 45 64 31 47 0 1 18 -6 27 11 55 71
3092 71 -38 35 2 16 53 8 39 1 34 -48 28 78 44 22 -7 55 21 63 56 14 53 65 47 24 17 28 -3 -24 39 37 27
3123 27 26 -67 -48 -20 6 1 33 -20 84 16 22 42 -67 24 -31 -4 47 85 -12 -13 -1 19 35 -19 60 23 59 -21 70 -11 -1
3154 -1 9 -14 19 62 36 92 -16 -12 3 -21 62 -23 70 4 37 -63 -27 -20 15 -49 33 -39 -15 51 26 76 59 -42 97 9
3184 9 -36 1 -25 51 4 30 8 52 39 -28 19 -36 52 28 37 21 -12 6 38 -41 -16 -8 -4 -4 -50 5 9 3 -53 -79 -14 26 -64 -3
3218cJ5q5N1L9N4q3l6M7l5P6j0j4K4MK8l5m4L1J8k7L2q8R0q7M3l0Q7n5L8l3N6
3249F8j19J20q1j0J4K6J2k8P0j12Q5q0j3J1kR7Jn7J4L0j2k7M1l3J26j79J22m1
3277D3k2o3Q9j8n2k6L2R9o0k6j4N7k2j8l8L9M4l8J3p6O1%mp3P5m1J38l3n8jl7
3308c0k4N7L3J0J1Nn7O4k3k9K9j03R4r3O6J2Q5o7ro4K1N2o1M3n1J2L1k7M8M7m7
3339C5r3Q6j2o4N3j2mM3Rk6K9j4J9o4K7q4J50l7M7o4J9n4J8l6J5j9L3L1j7N3q4
3370a7j6N2J5q9M5K3k6j1L2l5J7KM7J5K0o3j5K8q9M9M6o5N3M4L2j20JK2M4j05
3400f4J23o8rkljN7l0N9l3k5k5Qm5R4qp8L5J7J0j9k2N3j7M0l3j9L4j5Pj9R3r5
3433@Q1n0k0n8Q9K5m7J3qm7K5j4L6Q3m6n7PlJ3k6N4l1jnM1q9O0n8J00q3QQ5o6
$$ plain form
3218 -3 12 -73 -22 17 71 -12 -48 -1 -36 40 30 16 40 44 72 37 -7 24 42 15 47 -41 49 -38 5 -25 62 7 45 12 68
3249 68 -51 69 -12 -22 -8 18 30 2 72 -40 45 -35 -48 -37 -39 58 59 2 16 46 34 7 48 15 141 -38 84 43
3277 43 21 -42 47 29 -23 -49 -17 82 22 -4 -18 39 17 -1 -39 0 44 6 19 -57 4 4 0 -73 2 -39 99 66 8 7 -30
3308 -30 -54 3 36 46 57 62 5 69 46 17 46 -57 37 -56 10 22 107 40 31 -33 -12 40 -21 22 -29 -17 14 -13 35 82 35
3339 35 -58 28 16 -48 5 -7 -11 32 41 15 44 30 49 -15 12 -72 78 41 88 24 43 -11 7 -29 -14 -33 0 31 14 67 -17
3370 -17 -33 19 34 -55 -10 13 -13 -24 8 -27 -10 -8 39 54 74 11 -4 24 -65 -16 30 -35 18 62 94 -26 -25 -3 41 -64
3400 -64 59 -9 -18 -20 -23 -24 33 3 62 29 4 -21 -13 -58 36 28 -50 -15 2 12 -7 -29 24 7 47 14 -5 29 14 21 2 95 0
3433 0 81 31 11 -47 42 67 20 33 25 -22 3 -11 25 108 62 5 12 9 22 -4 50 19 18 13 54 -35 25 -33 67 -16 -8 77 11
3466A1J3l3j6M8M3p5J1j8L3j00R4n7j6M6L6j3mLq5J22M8j20NO8lk9j3lL6K8l3
3497B7q3J44j31L1P8q0k0nQ5m2n2N8o2N0L7PJ1Jl4j3J0l5Q2p5N5l6m7J5O8j08
3527f4J38o4k8Q8l6j9J2k7qj0K4lM2j21Q6m8Q1l2Kqj7l7R5l2N2j4p3K5mK0L4m
3559E0J5p4J5j2Q1p1l4Q3J3m9PK9j5J7L2j22K5M6K4m1j0rl6J00p8Ol8j0N4KQ5
3590H5p7n2Q3n5O4lj4r9O1k8P0j0l9M6l0r5J38J3o5K3J0l5l0R1o1QL3K8j10o7
3620a17J19k4NNK5L0q0P4j5q7J11L7j18L3P2p2l8J8k4L2j6R0l0o2J13q2J34j53
3648b0J0K9qM2o4K1l4N5L6J0rlj11J30l7o3J2N6qr4N8k4K7Pj6L2O9o2j8Lp5N6
3680Gj0J8ql2L1j0K9j8M8O1n3j17K5l7R2p5L8M9n4L8J7l5QN6j10j8Q0mQ8j40O0
$$ plain form
3466 11 24 -9 -25 23 66 -9 2 -16 17 -83 11 -46 -62 -16 20 7 3 6 -79 43 91 -29 -24 44 41 12 -1 -4 32 60 27
3497 27 -56 88 -43 -12 66 -14 -34 -39 46 4 -48 10 -52 -2 35 42 53 54 20 7 17 -18 64 -11 44 8 -39 -24 44 -64
3527 -64 74 10 -18 70 34 15 27 0 -8 -18 6 3 45 -76 10 -38 43 11 13 5 -12 -49 46 14 66 52 -21 4 0 20 54 50
3559 50 65 -9 6 -6 75 4 -30 53 66 17 24 53 38 55 87 -35 -10 36 60 19 9 0 -36 64 -14 -8 -46 -56 -2 0 85
3590 85 8 -44 39 -16 48 45 31 -68 -7 -35 35 25 -14 32 2 -93 45 58 -7 16 26 -9 -39 52 -9 -1 32 60 -50 -117
3620 -117 2 -22 -17 -12 13 43 -37 37 22 -65 46 83 -35 -2 70 -2 -40 -22 -46 -14 -30 60 30 -32 81 -1 133 -20
3648 -20 -10 19 11 53 -11 10 -24 31 67 77 68 65 -46 84 47 -16 -4 52 44 -50 8 -16 11 18 2 34 103 41 23 26 -49 7
3680 7 -3 15 7 -25 6 -4 25 7 55 116 63 -54 -29 -66 26 -49 -11 38 -16 22 39 4 12 68 -42 -60 20 16 104 -36 24
3711B4k2k0Q3q4O2l9K8J1k2J2L3k2o9K8L6o0P3l1O9k6n8LOP1q6j9nN8rp3k2J22
3743E2j9JK1l9Pm5l6Q8k8O0m4j1k4rK1Lm6J2j0O2l5k4R7p4n3Q0J2M0l7k9LoK1
3776A1L2J5l5On1N0J8L2r2J9j0M9n2lJ8rO8j9j0p1P4j8L0k5l0N4q5m9O2N9j6l7
3808a5J01k1L4q4j4rJ1o1OJ07nj6n2J5j6J0L2lk4qpQjR3q3J3q7M4o6N4n2Q9L5
3841B8m5Q7r1pOM4Np7M2J1K1r4J01o2L7K4k3L9o1j8L8M3Nq7J7K4Ln1N7K2n8o3
3873h3R6N2q8J9N8o3M7n6rP1k4N0l8l1m4o0N1O4k7J4qL9M2ko9r5L6N6kP1l3l5
3905aM6Qn2r4R0L5j22J14m9%J1J01j65J10K4n1n0M7L2o1j5Q3K3q3J5K0p4L8M8
3934B8Lm1M8j7J8k4kjl6N9K9j3k7J3n9%p3J06K1n0j6J7l8LO6M4l9K2n7MQm2K9
$$ plain form
3711 24 2 -18 65 -19 43 4 32 43 21 33 66 44 -25 3 39 -21 52 21 90 64 6 9 15 86 0 -19 -24 34 25 -48 -70 52
3743 52 33 34 55 16 23 -22 -58 30 2 62 18 7 -17 -26 -5 -2 -48 -36 -46 16 -19 -43 54 -20 -73 7 19 59 22 -7 -4 -10 11
3776 11 43 58 23 29 -22 28 46 78 -14 5 -5 44 -8 -11 7 -2 66 47 37 -34 40 22 52 27 -3 51 -34 -83 -21 38 22 -15
3808 -15 86 65 99 15 1 -8 3 -58 -52 55 50 34 -18 -3 -19 -9 23 20 -4 -12 -19 -11 -12 81 -2 11 -76 -32 -98 -44 -96 -7 28
3841 28 -17 70 -21 -28 -22 22 27 -50 -8 3 24 -70 31 -31 6 30 7 46 -15 -33 5 48 53 -34 -17 7 10 -41 16 38 -20 -83
3873 -83 13 65 -23 -4 54 -9 38 -18 -27 44 20 70 32 1 -43 -103 -52 12 -15 -1 -9 30 72 70 1 -94 -58 -2 -4 67 34 -1
3905 -1 45 53 1 -93 -3 32 -90 24 -25 -25 -14 87 -78 32 56 5 -45 2 34 -27 -42 41 64 -19 -4 16 -58 -20 28
3934 28 31 -10 38 21 39 15 13 12 -24 35 64 51 24 37 -22 -22 -95 11 32 -18 -34 -17 -55 -52 14 58 19 41 -16 -12 -4 -46 -17
3967a7KK5J9Rk9J7n0K3j0K4K3j02J71rj15M1k2J3k1k2K2j9k0PP1l0Orj1kR8j32
3999d9M1Q0l6j6o8K0k6KO0j8M8k1J6l7K9r6J03n2J5O7o5J4j6m2J09n1M2k8n3R4
4029F6o1Rm8J4O8K1p9M5M3l6K7r3O2k2qK9k5L7m8N2n4M6j06R9p3O4l1QK0M0m0
4060B6oJ3N2o1n4J19o6n9L0L1PMl0P1l9o2L6m0Q3o2N0k4o4M0J0J6M5j05J27j8
4090G0n9LL8l6%K4o0k6O7n3Q1n7j06J13K7j2K1LN9q5n9J07l7l6Q8Onj02K8K1p
4121A6l0J4N3o0l7R0j6J2J0l2K4m5%J3m1j8mM8N4l2J6p4L1Lp1N7K7rkJ2l6J13
4153H6p3n7J6R8p0lJ7rN5o5J0K5Jj3L4m7q2J16n1ML1J6q1L8J6k6N2jj10O2M0J1
4185D0k9J6K2o9N4l9N8j12J09m1N9p6N0m5k8M0L3j7J8n5j5P3k9M2j07J08K5o2
$$ plain form
3967 -17 -15 10 29 38 9 26 -24 -1 -11 13 36 -66 105 96 -19 22 0 13 -8 -30 -8 -27 -47 -40 31 1 7 -2 -13 -15 83 -49
3999 -49 -8 72 36 20 -48 -28 -54 -52 8 -10 38 17 33 -4 25 -71 32 -20 -5 62 -3 11 -5 -47 62 11 53 25 -28 66
4029 66 5 14 -34 -20 48 69 -10 35 78 42 69 -24 38 16 8 37 12 49 1 53 -1 45 -61 38 -35 29 -2 6 26 66 26
4060 26 20 33 85 24 -30 89 23 -36 -6 25 32 36 6 77 38 -24 12 -28 55 -7 43 19 -45 -5 5 21 66 -39 88 70
4090 70 11 14 52 16 16 40 -20 -46 21 -32 49 -8 -114 -1 26 14 35 38 97 12 -47 60 23 -13 75 81 76 -26 2 23 16
4121 16 -14 0 53 -7 -44 46 30 42 52 20 44 -1 -1 12 -29 -47 -51 -3 51 19 35 -39 -8 -5 -76 -19 8 -1 -3 9 -27 86
4153 86 13 -44 -28 70 0 -3 14 5 60 -5 5 30 31 18 52 5 -77 39 -12 -8 23 39 -42 -4 12 -14 38 37 -73 -11 29 40
4185 40 11 27 49 -20 34 -5 53 -59 50 9 68 -8 42 -3 -31 9 42 25 43 -12 -27 46 17 59 -48 60 85 23
4213B3l2k4O8n8O5Nn9RO0n0J0mj5L2n2L7pK1M4r6O9J3p2K0nl2O1L7l0J5n6P6m2
4246C1o4Q4k5o6LQ1M0r9J6j4O9q1O6nk3P0j20L9j1joM0n2l4Q5K3J9r8J1O2l3q9
4278h2J24j4Ln1K9k7Q9l8O1n4o8P9m1lj3J01m1mm3K3k5J3j6j0Q5j19L2L7n1L2
4308Hn9O1M2kL2k5k3m9k9L3O5j9L2n4k1N6Pq4M8k8J44j09J1qM2o0jk2m2P9J3J7
4340E5N1o1pn1L1j1L1M5j42R9p5Q8k3Pj0k0P6r9P5J1m8J7q1N0q9Q2K4M6m1j1K7
4371D6o6J07o8k2m4N7OP3n4k8Ok9K0P4q0L6l9O5j25P8q1R3pj7J7K0l6K8j7K9l9
4402CP3q9k9P4r0J75q3J4j8m4P4K6r4lQ4k3l1j3LK2k0M7K2k7p5l2P5L6o5P1m0
4433B3K5o6kM7l4LPL6j8pLj9m4R0m6K9J8L9m9r1K9L0lRO0n6n7M5j9K1o6P1m1L7
$$ plain form
4213 23 -9 -33 35 -23 42 47 -12 -3 57 7 17 13 -2 30 -22 15 8 29 73 -23 46 59 -13 7 2 -30 31 68 38 53 -3 73 31
4246 31 -33 51 26 -40 -37 44 84 -15 1 -13 56 -25 41 36 13 83 -37 2 -9 -10 -16 24 -28 -62 23 46 65 -33 -22 40 7 -82
4278 -82 42 28 31 -20 9 -18 71 33 94 40 -28 51 10 7 -6 95 54 50 7 30 5 18 2 -8 77 -42 -10 27 -24 8
4308 8 -51 10 52 50 82 57 34 -15 -44 -11 54 35 67 13 -8 48 55 -29 19 -9 135 26 37 29 71 11 10 -12 -54 25 38 55
4340 55 106 45 38 -13 18 7 38 83 -59 40 -35 53 30 37 27 7 83 -16 59 70 22 39 -42 8 -81 1 25 71 30 19 46
4371 46 -20 87 19 -3 -47 10 16 89 35 7 13 -16 4 78 -2 34 -5 60 -65 13 -68 25 18 1 18 38 2 30 13 42 3
4402 3 76 -13 -42 32 -58 117 34 48 30 -14 60 86 -8 -11 73 50 19 6 9 31 11 58 80 53 -22 -54 21 57 -8 63 23
4433 23 48 -18 -20 27 -7 -4 3 39 21 14 17 -2 -46 44 -2 27 45 84 35 -56 -27 3 0 9 69 13 -44 1 -18 3 -63 8 -33 4
4467Dk5J3K9o3N1l2p%K7k4J8MK7%Q3p7p8N7k2K5k1O8r4L0No0N2M5m8O2l3j6K7
4500B7L4J6j24pO5j2J5ko7R7j29Q3j6L4j0Qn5J28j19M6R2p8jk8qM4L9p9Pn2R8
4531D6k3o1N0j4j5J3j0K4m1Q7p9k8P5j0J1M8q6j1Q9j08PP8p9j6J11j0k9K5k3M7
4561F8l7L6p7j7Q9kj37J35N4j17N1p7M3l0N3K4m4k0k7j0J9L9L9o0J4j0m9M9P9
4590G8%q3l6rP2l3M0M3m7kk3M3q2M3P5j30K4K5M9l5K5k4N5m2j1L6q1PPK9mj5J7
4623A1OL7l9J5j6m2J2P6l5l1M1M8j02R7r9LR9o2N3q9R5n0Lj1j00J26m9Q2o1O6
4653H4p3Jjl3P2q3J7K1QQM4r1M5Nn3jk4QRO5l1P4j18R5o0P5p8L4m3Q2n4L8j1r
4687B2j1j8P5n5M2r2O9q9J26l0l6J5j2K4n5L8J9L7o1M3j08M0O4Pq9N1l1RjK1k8
$$ plain form
4467 4 -21 -8 21 -42 9 -23 -30 -30 -3 -27 -9 -5 22 22 105 28 -50 7 -15 10 -11 57 -37 -7 -2 -62 -10 35 -13 49 16 0 27
4500 27 61 77 -47 -54 11 -1 14 12 -55 42 -87 -4 -20 14 4 12 -43 85 -34 12 104 26 25 -3 -11 33 72 -7 0 -52 46
4531 46 23 -38 12 -2 -17 -4 -14 10 -31 56 -23 -51 24 14 25 73 -13 -24 65 -43 -36 42 -37 -53 58 48 19 44 21 68
4561 68 31 67 -10 -27 62 60 -77 58 112 -5 46 -31 12 -18 35 59 15 -5 -32 -42 -23 16 55 -5 9 -1 -50 -1 78
4590 78 78 -5 -41 -50 22 -11 29 72 25 23 0 43 -39 4 79 -51 -27 -2 47 12 37 13 68 26 15 51 -30 -23 -16 13 9 -6 11
4623 11 17 54 15 30 14 -28 -16 60 25 -6 35 83 -19 78 -21 -18 81 19 72 -17 78 28 31 20 -80 46 -3 79 18 84
4653 84 11 12 11 -22 50 -33 -16 5 13 21 65 -26 19 24 -29 -30 -54 -46 -37 28 -3 71 -47 48 -12 63 -15 19 -24 58 4 42 31 22
4687 22 11 -7 68 13 55 -37 32 -57 69 39 3 18 6 30 -25 13 32 69 8 51 -57 -17 47 54 -35 16 -15 -6 -7 14 -14
4718a4J4J4K2J2j28P8J8M2n2m9O5n1J1J2j0l3R0l2Ko5J53j10R5j04L8J3l7m0M9
4747CM1j17J09o5P0l7o0J2O7n1O0m0Ojj1j5J14m8k2m9O3k3QMj0L7Nk3K5n4K3j
4779B0mK6L4K0j80J56l8JQn4K1N8L2n5n6L1k4R2r6o0N8N8j9l4R0M6j71Q0Qo0J7
4810EnM3m4J3j0M4r6J05j8k4N8l2LPkj01J02K2k4j3j3Qk4L0m1P3l4J5l7oj2N5
4842D7p1kJ8L0r9P8N7j0m8k1J9RmRl4L6N0om5K9L5n2l9R7j06N6o3L1j4OM0m1J6
4875HJ2n9N1qK6r0Q0l2j1P1k3k3L2m4J9K8n6L0k2L1M3j7q4P5pn4R5o3m0j3J28
4906H3p3O2Kp6n9N8K4n5N8QL4j29Q7j0J6j0%OlPOJ7j14L7n5Q8k2n7P6rR3l7k2
4939C1K9l8j6K4n6K4oK2n4M1K5n5L5K4j5Kmj5k7M0k4m2O3k4%J4K7L9p0m2M4lj7
$$ plain form
4718 -14 0 14 36 48 -80 -2 16 58 6 -43 22 -29 -18 -6 -16 -49 41 9 11 -54 99 -11 84 -20 18 31 -6 -46 3
4747 3 44 -73 36 -29 41 4 -56 -44 23 -28 32 -8 -2 -3 -14 -29 85 37 15 -34 29 6 14 18 8 45 50 27 52 -2 21 20
4779 20 16 42 76 96 -84 72 34 35 43 -11 10 68 100 45 -11 20 -4 88 -8 -68 -10 48 29 -5 85 131 -40 40 48 -12 5
4810 5 0 43 -1 12 2 46 -50 55 37 13 71 39 42 49 47 -54 48 70 46 33 20 28 4 34 -7 66 32 47 10 4 -8 47
4842 47 -24 -26 -8 22 -77 1 58 48 0 -21 -2 7 3 12 -22 14 64 58 13 42 77 25 -14 83 -23 33 -30 1 -13 -7 33 -8 8
4875 8 20 -39 12 4 30 -60 20 -12 -23 48 25 2 34 -10 9 37 -19 11 -11 20 63 46 -38 37 30 -24 71 8 -32 -45 83
4906 83 10 72 74 -2 -61 -3 21 -34 24 32 66 -63 24 14 30 20 20 26 23 30 36 53 -61 -24 -79 9 -13 -70 6 -3 90 53 31
4939 31 60 22 6 30 -26 -2 -8 14 -40 1 26 -29 6 30 15 17 13 -2 -29 11 -13 -55 8 -16 -16 -2 25 64 -6 -48 -4 -7 -24
4972b4J0O8QM2m4p9M1oL7l7K2k4l7lN2K2m2j6l0K0P6j39N1O2m8M5Ro8QP9n8K8
5004B5o7L4l3P6o2N9n0N6Nl9L9K0On6K1o1N4J7p0Q6m0k3J2rj5O8j06J19n3p4R3
5035C2K1k3K0j10O6M7m0m7L7m2o5J52r1k2L7NJ4J2K4p3M0k8P1K3rl4J4m3QN9p8
5066b3M2nO5l8o6P8Nn4J4K9p2K2K3j0P2J7p0nJ3nl4jJ5p7Q6k1m2M7l6K8RK2q6
5099e8L1M8l4N1l3m4N6j6L2kk5JM7j08N4l8K7M8m3P9m6k2K5K0j0J6j5q2L7K8j7
5130GON1r6k1Q1l0p1J03K5p9N9J0n0R2o7QP2j12P9p3kK5nJ8J4k3j6m3Q9l9k0L3
5162B5k4n0QO7k8j7J12n9n9M9j2K2o1J12l1k9Kr7N5J7N5r4K9M1j1k8%J2r0Q8K9
5193C3o3P4n6N1K4o0j0M2m0RrM2K4k3j5p6P4J3J9o1QM6Rm6o9J10J4k4k9J2k4N
$$ plain form
4972 -24 -14 54 62 104 60 -19 22 16 53 16 38 14 -23 -26 26 48 6 -10 -40 -20 56 -83 -32 30 -18 27 36 -32 -24 55 -3 25
5004 25 -42 -8 -41 35 -27 32 -18 38 43 4 43 63 69 13 34 -27 27 44 -26 60 20 -3 9 0 -15 53 -53 66 13 -61 32
5035 32 53 30 50 -60 6 53 13 -34 3 -39 -104 48 -43 -65 -28 -23 -9 3 27 -46 -6 -34 37 60 51 17 31 -12 -4 55 -23
5066 -23 19 14 79 41 -25 53 58 4 18 47 -25 -3 20 10 82 99 29 24 37 32 -2 -3 12 -65 21 0 -42 5 -31 -3 6 28 -58
5099 -58 -27 21 -13 38 5 -39 17 1 33 31 6 7 54 -54 0 -38 -11 37 -6 73 27 5 30 50 40 56 41 -41 -4 24 7
5130 7 13 64 -32 -53 28 -2 -73 30 55 -24 35 45 -5 87 20 28 100 -12 67 -6 -8 17 12 30 44 21 5 -38 51 12 -8 25
5162 25 1 -49 -41 26 -2 -19 93 34 -25 24 12 34 -27 85 54 25 27 -70 -15 2 57 -37 -8 33 22 -6 -6 6 -84 4 33
5193 33 -30 44 -12 39 63 3 -7 35 -5 4 -5 37 61 38 23 -53 21 34 53 -8 0 46 55 9 -60 50 64 40 11 23 -1 4
5225Dk5J3K0l7K5J2k5l9J03ml4j30J61q8N8j3j2J1R7n3K5o7R2j17k8RR2r7J9Q0
5255E2r1O9q4L6j1N3m8K6j5P7k9l1O9o1J5p0n3J04J5q7M1L3J0K8m8LnN5l2j9M1
5286D3J0L6n1k1nk7j0N8Rm9J62q2j5q3j7J77j70J22q5K4k2k4L5n6L5o3N6rl3J52
5316I7j25O0M6k6k9K6n1K0K6l6jL4m4L9o9J2J31j0l2j08O0j0o6Q5l1J11j22m9
5344f2R0l9L9j4M3r3NP0m6j5K8m8k5P6M1o3nJ1O7k6M4rm5lK7K9n7kKoj9pk0Q4
5378E2n5O2l2m6n1NO6L9l2PO9l1p5pk9P3K1K3k7K0m2k0K4L0j5JNJ3M4j33Q5m9
5410enL2n9J10m6n1O5M8j27J3L8n5J5N9L7p7K7j4oj5P3j7O0j20J0RK1Q9K8j21
5440A6l6Q1Jl3m7j2M0J6n6P0j5p1O3j2j9J1L4j2J2M0Rq5O3M5m3j7k3o3N5pk5P2
$$ plain form
5225 4 -21 -8 12 -25 0 12 -13 -52 51 47 13 -117 44 -44 14 1 -11 0 97 44 69 2 94 -23 -51 -42 50 -47 -28 52
5255 52 -39 30 -54 -18 -29 24 -24 2 -13 64 35 4 73 12 27 -43 -96 8 23 -64 -23 10 20 48 0 3 -2 53 21 2 43
5286 43 53 89 38 17 12 -15 -25 33 42 -7 155 73 58 -25 -42 135 -35 87 2 26 4 -20 15 -41 -6 -69 -13 -22 -55 97
5316 97 -28 32 78 52 23 49 -2 18 44 8 7 41 -3 36 -33 -21 110 100 68 -40 20 10 -56 29 -2 109 -13 -62
5344 -62 28 -11 28 14 57 -36 -31 39 -7 -22 6 -42 -67 9 50 -13 -18 -7 60 34 78 69 24 21 48 77 20 18 20 14 -5 -12 -32 52
5378 52 -3 59 27 -19 -70 -65 1 40 8 15 84 53 -22 -29 -58 15 36 59 32 52 10 -10 14 44 29 30 35 48 92 -41 44 -5
5410 -5 -10 22 -37 73 27 -24 41 89 -38 -25 13 -42 -27 32 69 -8 19 5 -1 -16 57 40 100 -20 -10 -1 20 109 137 16
5440 16 -20 61 62 29 -18 -30 10 26 -30 40 25 -46 17 5 -14 -3 31 19 31 71 80 -5 58 103 60 43 20 -43 12 5 -20 52
5472E2m5l9J1P1q8j4N5L6J6n8m1O8n1L8k9Jj6L5N8n0k0M1l4N1l2M0om5l3J6jO1
5504D8o2j2Q8o9L9mJ5L1l1Rj17Q5J1l0J3k4O7j08J35p2k2K7K9J4m7n8R2j6j13
5533h2J03J7j0j2M1o9K2K2M1k7m1L9n7L8L0Qj2L3m9l0j5k4O1jk1N5n6p0P7rp6
5564g4J00l1J8P6j01m1J1N0j5L9N6k9p8L6rk2K9Ol9M6J5jJ0m1k5R1n7q2J27K7
5594I2l5pm8j3O7n5p4j4P8kq3R8N0r5N8L2J9r0kP0L9o6k6RN0J2M3j19o4J20n0
5625fM4o9J5N2K5k8K5p0L1pn0N7J4k0k0K0L0k3j7R0q0M2l5N8q9P2R9k0j57M6J7
5656D6r2N2j8J9P8k8n3rmkN7n8O7n7k2J9O6j05L6L5N3k5j2J8p7O2n5Q0j9j8J0
5687D4p9L4M8J0n9m6O8K1Lj23P1L1j3OK0o8P8o7K2M0k0L7J6p0M1n7K9J3r8J07
$$ plain form
5472 52 7 -32 -21 50 -38 -52 3 39 55 -3 -44 24 -27 11 -18 -17 -33 2 60 10 -10 31 -3 48 16 56 50 5 -28 -12 -13 48
5504 48 -14 -26 62 -7 32 28 43 74 43 52 -65 20 31 1 14 -10 57 -51 84 12 -10 17 46 60 13 -45 47 31 -82
5533 -82 21 38 28 16 57 -12 10 32 73 46 5 44 -13 25 55 63 51 84 35 5 -10 -34 27 26 5 60 4 -66 11 2 -74
5564 -74 26 -5 13 89 -12 -53 -42 8 -7 32 88 59 -19 17 8 -14 15 21 -18 28 43 42 52 11 -14 77 20 -62 65 92
5594 92 57 50 2 -11 56 1 -73 -87 -9 -11 -94 4 54 -41 17 49 68 -22 -24 46 85 19 -7 2 52 64 107 -12 -76 44 -6
5625 -6 38 -31 -16 36 61 33 58 -12 19 12 -38 19 33 13 -7 13 43 20 3 93 13 55 20 78 -11 61 160 140 -17 29 46
5656 46 -46 6 -12 7 85 57 4 -5 -9 -11 46 -12 55 -2 -24 -5 61 -44 -8 27 80 55 43 61 -16 46 -9 71 52 34 44
5687 44 -35 -1 47 57 -2 -48 20 41 44 -79 -8 23 10 16 36 -32 46 -21 1 41 21 58 74 4 45 -12 17 30 -68 39
5717C9k0j5j6J05j02m3M1J5m9M2JQ8k3r9N3k7J25j35P0kLn4M3m8Q2Mj22P6m3L8
5747B7M1Kl9J3K3j6k7j1K1l0K6M3l7NrrML0p4l2R9p5P9q1L0J1O9m9rOj0M6j4p8
5781b5Pjk1J01nk0qk3L7lO4o7j2K8k7N9o2j7O2m8L8j06lk5R5L0n9N4kpK9q4M1
5814B0p8M7L8q1Q2P6%r2P0k1k6n0M6k5q1M3PP0n6l1O1Q8n1n4K1r9J84n0p8K7j0
5845cO1j02Q6K0j2n0NK3l6K9l4O3ln5L8Lk8RJ6j3l3O9l9j8M2Qj8mm9Q8l0k5N0
5878E8n2J8L8L3q9P9o5J6J1Nl7N0l4J3j2Nj7k7kM2ml3M9q8P2l9RM0m5J25j11p
5910AQ7j34J4M0j5O2k8k0k7j3Q3j6J1L1%k0Kk3K5r4N0N2j6n1K7rj2NK4Lp7K7j5
5943b6K1O3j44Q2%o3J23ml5j0J7K5k7MJ0j9l3J01j3q2N4j31J07lOj6N5q4k8J24
$$ plain form
5717 39 19 4 -12 93 -9 -52 -11 4 -45 -3 -2 86 63 -36 17 -10 115 -20 50 48 51 -3 40 -8 74 78 -44 32 -11 27
5747 27 68 70 31 44 67 51 24 13 34 4 30 73 36 41 32 23 27 57 -17 -49 50 -25 54 -27 3 14 83 34 25 31 21 67 53 -25
5781 -25 -18 -19 -40 61 56 36 28 5 42 39 103 36 24 52 25 84 22 5 67 19 57 -49 -52 -77 18 48 -11 43 41 34 63 -21 20
5814 20 -58 -11 27 -54 28 104 104 12 82 61 35 -15 31 6 -75 -32 -25 45 -11 -42 19 107 56 2 23 -76 108 58 -20 7 -3
5845 -3 58 -44 42 62 50 0 5 28 -8 21 -13 50 47 -8 30 33 5 14 30 17 -16 53 14 -4 38 46 28 24 -25 63 33 8 58
5878 58 6 24 62 95 6 85 20 36 47 52 15 65 31 44 32 37 20 -7 -9 33 29 -4 45 -43 29 -10 -1 39 -6 119 8 1
5910 1 88 -46 -32 8 -7 55 27 7 -20 -33 50 34 45 76 76 56 58 35 60 -34 16 68 52 1 28 19 7 12 36 39 -38 -11 -26
5943 -26 -5 58 -86 -4 -4 -67 56 52 17 7 24 49 22 26 36 17 -16 85 72 -10 44 -87 20 17 23 7 62 -22 -50 74
5973G4o1lK0N4l2p5L7L4Qq8K7Ok0K7jK3j5k9P5j7k1k0M2L1o9l3N2n4pM1O1j16
6005d9O7L7l4K2l9M1k3M7p4lK9lrl2M9Pl6o8J8N2M4p5p0J30M1k3o2j5O7J6j2k3
6037A7k6K2OL8j7r7J11j3l5jO8m9N0oj25M5O6oj39J68j30N8n0R7l6p0O1K2o2j1
6067d4O8l3l0M2J2j6j2L6j2O9r6M9o1k9Q6n3J20p3L4j6j01J19l9K9Rn7N8o7L0
6096B2J1l4q0J25l3m0L9P7q1l1L2m6L2k2K2R6r8oL9K5o2K3Pj4K5k6KJ4o9L7KJ4
6128BJ5LJ3L6j6k7M0j8lM3j18N9J1jn9rL4Rj8k0M7q0Q6J5j4L0m4k7K3q2M1K0j8
6161b7M1j5N8o2M4J4j11N9L6K0l4lM2j6j11Q2%k0l0j0P4k5J4o0QK0K9M1j20J01
6191C9l5l2M4qnj2o5Q5K6km1l1O6m0M3k9O9r7j1N0J6j30J31JJ2on0O9p4N2M2r8
$$ plain form
5973 74 13 10 30 84 52 -23 14 48 56 -32 -5 1 -19 8 7 30 15 -14 61 44 23 3 45 76 7 -26 26 -28 -35 6 67 -49
6005 -49 18 55 21 43 4 45 22 69 -5 -8 21 18 9 -23 26 33 -3 -71 -53 -1 43 -32 -102 28 69 46 -16 -31 36 52 40 17
6037 17 -9 13 19 57 40 -57 54 41 6 5 73 24 74 68 -57 -12 54 48 -91 77 -53 5 -45 52 16 -54 7 29 -33 -44
6067 -44 24 -9 -39 3 15 -1 -13 23 11 80 -16 33 -28 -57 29 -24 96 23 57 41 -60 59 20 49 58 1 59 -8 22
6096 22 33 -1 -81 44 11 -29 10 87 6 -25 7 -39 -7 -29 -7 89 -9 -15 24 49 -13 10 17 3 28 2 4 18 -51 -14 -12 2
6128 2 17 20 33 69 53 26 66 48 45 88 -30 29 40 39 -20 -29 5 14 -4 -24 23 -57 29 44 30 60 16 -11 12 -70 -29 -9 -27
6161 -27 14 -1 57 -5 39 53 -58 1 37 57 23 20 62 46 -65 17 17 -3 -33 -43 31 6 20 -40 -32 -12 17 58 -62 39
6191 39 4 -28 16 8 3 -9 -74 11 37 35 -6 -37 29 -11 32 3 72 -25 -36 14 30 -100 31 32 44 38 -12 57 -17 35 77 -21
6223b1P8m0k6P9j04P8j05N4j1K5m5RMM1j5m6J40p0j7l6P1m0M5j8j09Q7lk7P4o5
6253a3N9l9o4P7oP2m0j3K1j71J53l4M6J3n7NK3n6M1q5O5n8Q8J9j8o5O9o5J6Q5
6283F8n0L8%j5K0k8O6q3m4K6l0N2p1M0K7n0O3L6jK2j22J2K0P7j2jk9K8m3O7n6
6314B7O7l9q2K7J8J2ln5K6J07r8j3M8r5J9J25o4mP1r4K5N1l2o3qJ26q4N1ML2l8
6345F4Jr3O9m6rNMJ3L9o6K8kN1l0n8Q4q7l5P9Qo0P5j1k6loK5n9J25n2Lol5M3L1
6380F3q3Q3o8JN1k2J5n7J09k0n0Kj6k2l1J24p5N1p7K1O2Jr9NO3k9N2j22O3O8l4
6411B9k8j9k7K0qR3l3mk8%Q8l0q1L0R5j20O3p1O5R1n6j20P8o8O2R1j11M7k2r3
6441f7K3O0j3P3L7j06o9N3P7o5mk7L8Lo1J23p5J05q7%MNPk9J4nKj8N1o0L6K7l1
$$ plain form
6223 -21 57 17 -9 70 -34 44 -61 -7 -18 7 -38 -29 -25 16 1 -45 95 25 8 -28 43 3 48 30 -79 8 5 -22 52 -13
6253 -13 46 7 -57 20 14 86 46 33 54 -117 36 2 48 61 4 9 32 -24 17 -68 -3 -61 27 46 28 -37 32 -33 -17 68
6283 68 18 56 56 41 61 33 99 16 -28 -2 -32 20 -51 -11 16 -34 29 65 64 86 -36 -24 -4 73 61 60 31 59 16 83 27
6314 27 94 55 -27 0 18 30 27 -28 -2 105 7 -6 42 -53 -34 91 27 23 94 0 25 76 44 -19 -27 99 15 66 70 102 64
6345 64 65 -28 41 -5 -14 -9 -5 8 47 -19 9 7 58 28 -30 54 -33 -68 11 19 -41 34 23 -3 -6 -12 13 -46 79 27 30 24 -11 32 63
6380 63 -20 63 -5 -4 47 25 40 -17 92 72 22 24 8 -14 -45 79 4 55 -22 -1 61 62 -37 -32 31 2 54 -68 -5 63 29
6411 29 1 -18 -45 -25 -33 60 27 23 -5 -5 83 53 -28 2 97 -23 40 -31 34 125 69 -51 27 -41 21 112 1 48 26 -67
6441 -67 -44 16 3 76 113 7 -62 -9 68 3 -1 -28 10 13 -48 75 0 105 18 18 22 27 34 5 19 14 16 -2 49 -11 25 52 21
6474B1l6J6l4R3K0q8O1p7kM0K1n2K8k6Kl7K3mJN8jl7m3L0Kk4K1PK4J8J1Kj9j8
6508AO9r3L4K0nj0Nj1O9k6p1M2p1J6K5q7J37j05J02L8j18N2M4n2n4OO1l3N6n5
6538a4N0%J8q2lQ9p0J27q3K1j4K0Q9j58N8o4L1R8n6K1l1r3M9J4K3j2m1N1k5M1
6568E4n4J8j3PM1k2l4k8M0j6L2k3j3k8J6J6O2Ro0M4pj0K3J1o1Q0m2o1oP0K5l3
6600C7k4L5k1n6L2J5K3lm1n5J08k1K8n5%K5m1J5J8k2M3MK2o4K4rk7J7n2L9R7q4
6632GL7m2K2k2j1QpQ1Jm1L0k9N3l0m0%mnj4k5M3k5L1nk3K7mK5l9M1j0j7K8j9M2
6667F4l2o4O4Kj7%K3K2om4O6l9K0p9j7M6O0j9k9K3m2O5o6J3k9J6%Ml9J09o8M2
6699D9j51J29m4M5Pm0L1n3P2Jl6K8j6m5Q0n8O9j01O1p4J09j3m2N3J2o6KK7qN5
$$ plain form
6474 21 -15 1 -33 60 80 -8 53 -24 -26 14 35 -17 11 -15 -13 -50 -27 -31 -30 28 27 -10 -53 -23 -21 -45 -24 -17 7 25 36 38 19 1
6508 1 70 -23 11 31 26 16 21 10 79 53 -18 24 -47 -31 -6 -93 44 -61 41 79 -39 13 57 5 -49 -43 18 -15 41 -14
6538 -14 36 36 54 -28 -31 58 -12 115 32 53 39 59 148 -10 48 -16 15 113 57 78 47 -46 3 17 40 28 -13 38 13 54
6568 54 0 18 5 12 53 31 -3 -31 9 -7 25 2 -11 -39 -23 -7 55 64 4 48 41 31 54 65 4 84 42 -19 -25 45 70 37
6600 37 13 48 27 -29 3 18 41 38 -3 -58 50 29 57 2 2 27 -14 1 19 -3 40 44 66 2 26 17 -10 7 -45 -6 91 7
6632 7 44 2 24 2 -9 -1 -8 73 74 33 63 34 87 57 17 17 13 8 -6 -31 12 -13 18 13 -10 17 13 38 -1 40 30 13 41 22 64
6667 64 32 -32 32 34 17 17 40 62 56 12 78 39 59 -20 -37 9 69 50 21 44 2 67 1 14 -15 1 1 5 -34 75 7 49
6699 49 -102 27 -17 28 35 -5 26 -27 45 46 10 38 22 -23 57 -1 68 -33 28 -46 63 50 8 61 73 7 9 36 28 83
6729H3n6k2J0k0kOl9N1k3J9l6km5j1P1J3J3rJ0K7L1m5o0M7O6j1n4j6p7P9LL5p
6762B9l4N2l6JK9M6k4l4L9l6l0j7lN6j6k2L3l0j9L2m6N9o4Nrj1k2L4Q7k7m8P8
6794E2k5l0qqK4QJ9N9r1M0l8L6n5P0p4L6Q6r0k6J9N0o6oL0J8k5j8Qk5K3m8P9m5
6827b1M8j9J0k5KJ36p0m9L2l0L9j09M4O6L8q9L2L4rm4l8N2k4M5m3m5O5mm0RLK7
6859B3Lk0j6Jmk2PN7l5ml7j3N9K8r5Q9J2j8L9j41J91j02J2K7n4RJ1Pj3k1Q7m4
6891B3N9nn6R6j78Q4n1j7NN4n8J09m0n2M5OQJ3kJ4r4J6J2o5J17MJ0j17K1M0jL
6923Cl0R1K3p3L9k8j2rRk2J41j03n4M1M8j9k2l3n4K3L0K0o4O5n1J0op3K7M2j2
6954e3M5P5m9k9m7RO7l6L2J4j7K4k3K8n2k3N8j8L8k3L2j2Nl2o2R2PJ2j6l1n0O4
$$ plain form
6729 83 27 5 15 -5 -7 -1 -40 11 -12 7 -29 -31 -76 -87 -16 -3 10 1 11 38 69 24 -36 11 77 66 12 -4 -81 -2 1 36 29
6762 29 -5 47 11 12 41 87 63 29 68 32 2 -15 -18 38 22 0 33 3 -16 16 -30 29 -35 -30 -39 -50 -72 -38 49 22 -26 52
6794 52 27 -3 -11 -19 5 13 32 91 0 40 2 38 -17 53 -21 15 101 11 -15 4 54 -12 -18 12 30 5 -13 -5 -30 -7 -55 24 -21
6827 -21 27 8 18 -7 -5 131 61 12 44 14 53 -56 -12 54 92 3 35 69 60 16 -22 30 6 51 8 -37 28 24 -16 -7 -4 23
6859 23 26 6 -10 -9 -13 -35 -28 29 -6 -10 -47 -60 -1 27 -68 21 33 15 54 -87 104 2 14 41 -13 -4 7 14 1 -20 67 23
6891 23 82 77 21 117 -61 23 -28 -45 -40 14 -44 65 25 -27 18 24 32 45 43 57 -37 -21 -9 -74 43 47 57 -60 -39 1 0 3
6923 3 -27 64 87 14 53 25 13 4 13 -9 132 29 -25 16 64 45 23 -10 -64 -41 -11 9 -55 10 -41 -31 -37 -110 -83 -41 -53
6954 -53 -8 67 18 -11 -58 -49 18 -18 14 28 11 35 12 40 -12 -35 23 5 43 20 52 40 45 13 -49 43 50 62 46 15 -35 29
6986B9n0M9j8J1j8l1k2N9J1N3j21R2o1l0P0j4Jj3K7k4K1l4J9P9n9k1J7J5l9k0
7016b2OO9l2rK7j02R1L5K6o4mJ6om9K9m6N1o3N0m6pL4l5K4M3J7p0LK4K7l7M0l2
7049a2k6K6O5p0J3L5q2L1m9O9M7L5q5m1J39j31KM2L1l9k4L0J5o1M9Nk8K6J6k7
7079AM6o8N7m2M7Qo7jK2kj1m1J17r8n5J11ql8O2p6RP4%j8m7mQ0K7j28M6Jk1Pq
7113a8M7m6j5lK5o1L2J61j75L1k0k9JP5KM5jn1k5K7k4O6k8k6j2L4K0K2p3J9K3
7144B3k1N7p4Q8m3J2k3m2Q2j5J7j0j9NO2j28Q2l2J4r1Q5n6R8n6qJ3j3o1K9m7P5
7175Cj6qM0J0L6q3P1o6Nk1O9k8oJ2O7j31Q9n7N7q4L7O4k9j5Kl6j3M2m9P6k9l5
7207b6L1N8j20N3o0M2O5r9J00o0n1J03o9Q4M6n2k2oloNKLOj4No5P5J5mp9J18j04
$$ plain form
6986 29 -21 28 10 21 3 -28 -50 9 20 73 -48 44 -17 -47 23 9 10 -3 24 0 21 -13 6 85 26 5 22 37 -2 -22
7016 -22 -16 53 21 12 39 -63 28 63 89 25 21 37 31 -18 11 -35 16 -47 3 -43 -50 -16 -51 -27 16 33 -37 -34 -10 17 -20 20 -12
7049 -12 -38 -12 53 -17 -4 31 -51 -20 -69 0 47 82 -3 -44 95 -36 -34 8 39 0 -24 6 21 -40 9 14 -14 12 28 1
7079 1 47 -21 36 -6 41 49 -18 -19 3 1 -10 -51 66 -32 -87 24 16 -22 40 -36 -27 47 47 29 -18 -22 58 85 -43 3 4 -17 -10 -18
7113 -18 29 -17 -32 -35 -10 -71 -39 122 -53 -22 -42 -71 -70 5 7 52 51 0 -25 2 -22 44 16 -10 -22 12 32 54 -19 0 23
7144 23 2 59 -15 73 30 42 19 -23 59 44 61 51 32 37 99 -29 53 21 35 -56 29 -27 71 15 7 20 7 -54 -25 -72 3
7175 3 -13 -21 19 29 65 -18 53 -13 -8 -29 40 12 6 18 85 -46 43 -14 43 -41 -4 60 31 16 18 -18 -31 11 -38 38 9 -26
7207 -26 5 63 -57 -4 -64 -22 43 -56 44 -16 -67 36 -33 51 97 45 23 17 14 8 13 15 18 24 10 15 -50 25 40 36 -43 75 -29
7240b9P1j3m8J8Q3n9M7q3Roj2O0o4N8n9K1J8O4j31L1l4Q1l8L3Lm4K6lM7l1j5O2
7272F3o5k0M2l3L8J2m1N5rj2j11J15p7J8J7J9K1m4N1P5j54Q3j05L9J5L0J1m5k0
7301c2m7L0J22k9m1lM3l8J9L0k4l1K8L9j5p6M9M9j02J07o6j7l4Q8o0N9q3O7q7
7330e5P0kj5N0Pr9L9N2k9l7L1km9P4k3j7J3o4N8J7q3j5O6j3O2K2n8rP5k2k5n8
7362c9Q9l4l4O0L7k2k1m3L5J8j24P4m7K1QJ3J1k7m9L5M4j9Pl2lJ15j58P5J19j54
7392d5P6O1j34Q3k9J7k3mL4m8On8J8k2P3m6M0Rp6LL9R0l8k2L1n6l2J0P3J0q6M8
7424BrJ4l1N3K2m8l1K5j5L5j7L2l3k4O1J3l1l3O4o8Q7k4n5J26j20lO7j11J7Q1
7454D6j06Q4k2ll2K2k4j3k7O2N3n3kk9Q2l3J5m5R4q1OJ2J9j1j9On8Q6r8N5L9m6
$$ plain form
7240 -29 42 29 -19 -1 82 23 70 -13 -4 -10 -22 38 -26 32 -27 -6 12 76 -55 -24 -58 23 -15 18 21 -23 3 0 47 16 1 63
7272 63 -2 -22 20 -13 25 37 -4 51 42 30 -81 34 -43 -25 -8 11 32 -12 39 114 -40 43 -62 -23 -8 22 33 -12 -32
7301 -32 -79 -49 73 44 3 0 43 5 24 54 30 -1 27 66 51 -25 24 73 -29 78 12 -5 -39 49 -11 48 -35 32 -55
7330 -55 15 13 -2 48 55 -44 -5 47 18 -19 12 10 -39 35 12 -5 8 -56 2 19 -64 -79 -13 -26 36 58 0 -9 66 44 19 -39
7362 -39 50 16 -18 42 79 57 36 -7 28 46 -78 -4 -51 -30 -22 -9 2 -25 -74 -39 5 -14 -7 -39 -42 73 -85 -10 109 -45
7392 -45 31 92 -42 41 12 29 6 2 36 -12 -6 -64 -46 -68 5 -41 -1 8 -68 -65 -26 64 26 4 35 -21 -53 -43 30 40 -46 2
7424 2 -7 7 -24 29 51 3 -28 -3 -18 17 0 32 -1 -25 36 49 18 -15 49 -19 68 44 -11 115 -5 -8 59 -52 -35 46
7454 46 -60 24 2 -1 -33 -11 -35 -48 -75 -13 40 -13 -15 -44 38 5 20 -25 69 -12 -6 6 25 14 -5 1 -57 29 -69 -14 25 -21
7486b1m4J07k4O3l2n6J7j7l2P5r5R4oj22R3M7n5M4m4m7O1J6m9%O0k8n7O3k5O1
7516D7k3JK0l3l9NJ25j25J34j42j4K9KN4o5L1k5M9k7ql0J3L0ql0O6m8mj5K4m7
7547e3J1K4n9J5K4N8n6j7K9J21j63R3op3M4l5P3m3K3m7R5m6j0O5j05R4n4K6N1
7576G9o2K4l0P3n4No5O5o3J2k0roJ13o7J3Jq7R1Nj8M0l0ro5L4J6LrL0nn0Q8Np0
7611b2J7oO1K6p1M9q1J2J5N1p3k6J2M8J0q9J09p9j8Q9n1j2L6l0n4Q4n3K3l1R0
7641C6n4P9j0r8R8p3L3lk5N8l1jjk7L2L3j9J0m4Lnj9j4R0k3n2o2R2MJ5m6j7N5
7674A4K3l7k1Nl2R5r0L0rN1j0l4K4O4j23K1N0N8p0M2l3K6l6J3lpo1LK5k0Q6p2
7706b8O2n7LJ01j29M4Qk9l7O0o2Q7j18M1KK4M4m8M8Oj6PL8kJ0m4kqk6n5P9l6N1
$$ plain form
7486 -21 -65 42 18 81 49 -7 10 -7 -39 36 -59 35 29 -93 0 47 -8 36 -8 -55 6 22 -27 -27 33 5 -52 11 -14 47
7516 47 24 25 45 12 -27 -22 103 -22 112 -30 -44 -15 -13 41 -24 7 -18 31 4 -4 -34 -21 9 1 -29 37 -11 -15 -30 -6 -53
7547 -53 -42 -18 -77 -62 -38 20 -36 -53 -24 97 -66 27 21 -52 -8 -43 30 -13 10 -37 58 12 2 67 -38 56 2 28 79
7576 79 17 41 11 84 30 35 -30 35 -28 -16 -36 -45 -51 62 -5 8 9 -78 13 18 0 40 10 1 -64 -30 -14 -11 -20 10 5 -45 43 48 -22
7611 -22 -5 -11 50 76 5 54 -27 -15 0 51 -22 -48 -36 12 22 -67 42 -37 -55 34 -17 -29 7 -23 -77 7 -46 -23 -54 36
7641 36 -18 61 51 -47 51 -22 11 8 -17 41 10 9 8 -19 13 46 27 37 -7 -4 -9 -28 -42 48 25 -27 -89 3 7 22 -24 -41 14
7674 14 37 0 -21 -16 -48 47 -43 -13 -22 29 19 -15 9 73 -50 -29 21 79 9 51 18 44 8 21 18 11 -50 -47 -22 -42 44 -28
7706 -28 34 -23 -20 81 -48 -4 4 -25 -62 -2 -64 23 -95 -54 -52 -28 16 -32 16 22 6 13 51 49 59 15 13 5 -21 -76 3 -33 18
7739A8l6O2K2o9NPJ1l2K3N8p7j5Q7j3O5j61L6j7K9m0%%K0L8m0K3Nq8O9O4k3m4
7771a3L1Ln0O2K2m0L6j3n0MJ20j24q0J18o3J14p9NK4l2PK9q4P8k4j8Km7M7l2J32
7802H5q7k9M8o6R2n8k2J9J8l3j6O6n9O1J3rM1m1o2J10Jk5j21J24Jr9k4N0k6J1
7832c7Q3l5L6o5L7n0L5L0k3J4q6K0O1lk0J%p3R1J0l8J1l6N1j%nk9Q2j2r1L7k5
7865c0R8M2j26K2Rj7K5l7m0J2Q1r2N7Q8j32J3J7O7o7L4k3L5q7J8N3m0K0pJ7r3
7895h3J45j42K1M3J18r3m6J04j4p8OP1k5p8jO3Mqm7P0j2k3j7JJ2J6k0n2N5kjj9
7927c2J31m6r3L4K0k2q4P6j7l0O6J9J9m9o5Q3J3J8Lq6M6O5n3L5q0K7M7m0m4j4
7957e3N4l6J2J5j8Jj8l1M6jLQp2R6q5J04n8J6n7P4L3J5k4o2R4m7o9J29Oo2O4j01
$$ plain form
7739 18 -18 44 66 -3 2 9 20 -12 11 69 -8 -23 64 51 116 -45 -9 -26 3 -37 -37 -37 -17 21 -19 4 9 -79 -10 54 31 -13
7771 -13 18 21 -29 33 55 15 51 38 -12 -8 112 -12 -92 26 -37 77 -2 3 27 -5 2 31 -53 25 1 -17 -15 -62 -15 -47 85
7802 85 -2 -31 17 -49 43 -15 -37 -18 0 -33 -49 17 -42 19 32 23 64 23 -39 71 72 47 -74 50 51 -48 -72 -22 -48 -37
7832 -37 46 11 47 -18 19 -31 4 34 11 25 -61 -41 20 17 -3 -2 -2 -75 16 26 -12 -1 -37 14 13 13 8 -21 61 49 -42 -5 -30
7865 -30 68 110 -16 6 15 -2 23 -14 -54 -42 39 -53 4 92 -40 -27 -10 57 -10 24 1 36 -51 -33 20 -20 0 -7 10 -83
7895 -83 62 -80 -59 -16 102 9 -37 67 53 -25 -19 52 27 -51 -52 11 15 7 -40 30 18 -5 -22 -21 -9 7 -13 -65 -10 -12 -13 -32
7927 -32 99 53 -40 -6 14 -8 -92 -16 -33 -63 3 22 41 -8 -73 10 23 41 44 -42 4 69 16 51 -29 -2 45 5 -39 -53
7957 -53 1 -35 -23 -8 -26 -25 -43 -74 -28 -29 -26 -18 -90 6 -79 25 -33 -17 -74 0 33 48 24 -38 56 9 -60 69 75 13 77 -24
7989b4P0%l9j7L0l0J6l1P2k7l5R3m1k9k4L0K4rj46K1J37m1N9l6%n5Q8r2QqMO4
8021C2r6L3k3jJ05k8r2Q9j2N7o7k5M1m7Q4j10M7o9N7kL4k1M6K9p9%J2kJ5k8m2
8052f3K9m7m0Q3p5J34m5N6j22R5Q2j60J05m1lML8o9O3o3nO8M1r3L7r0Q4K5p3J7
8082b8OJ3mLm4R2j05R7m3j9n2R4q3l2O6j5L1P5r5O4pp2M9l4mO8o8K7M5Kl8K8Q0
8115I7n9k3R8m6r0M0L4Kl8J3j16P9k1O1k7l3N2l3jJ4k6o3P4L8k6o0KJ9l2O0J0
8146aj6L1O1j47N5j4J18o9j9j9O3mr2J23r8J1Q0j13N5m6M8jn6j2K1P3p8qP3J2
8176C1r5L8qP4m8o0J39j26J5K6k7O5m0LK4
$$ plain form
7989 -24 46 46 7 -10 20 -10 6 -25 47 20 -15 78 37 8 -16 14 38 29 -117 -96 41 0 59 23 23 -32 56 -36 -28 -36 -32 32
8021 32 -64 -31 -54 -55 50 22 -70 19 7 64 -3 -28 13 -34 50 -60 -13 -82 -25 -27 7 -14 32 61 -18 -18 -6 -8 7 -21 -63
8052 -63 -34 -81 -121 -38 -113 21 -24 32 -90 5 87 -73 32 -9 -12 -8 30 -39 24 -39 -44 24 65 -28 9 -81 3 28 -45 -28
8082 -28 -22 -9 -13 -10 -54 38 -67 30 -13 -32 -84 10 -73 -105 -39 -54 -23 52 -43 21 14 -58 -9 -43 -47 21 -47 -20 25 27 -11 17 97
8115 97 38 15 113 67 -23 17 51 53 15 28 -88 -9 -30 31 4 -29 23 -10 -11 3 -23 -86 -12 26 0 -60 -58 -39 -71 -11 -1
8146 -1 -17 14 75 -72 -17 -31 87 18 -1 -20 43 39 -53 70 -28 -17 63 -50 5 -41 7 6 -50 -62 -41 32 -46 -54 19 31
8176 31 -64 -26 -34 40 -8 -68 71 -55 -40 -14 -41 24 -16 -13 11
8191A1
##END NTUPLES=NMR FID
##END=
