##TITLE=1H_LY-mix.Dixi
 D2O,8 sc, 
 3.03.2021
##JCAMPDX= 6.0         $$ Bruker NMR JCAMP-DX V2.0
##DATA TYPE= NMR FID
##DATA CLASS= NTUPLES
##ORIGIN= UXNMR, Bruker Analytische Messtechnik GmbH
##OWNER= root
$$ XWIN-NMR		Version 3.5
$$ Wed Mar  3 13:11:05 2021 Russian Standard Time (UT+4h)  she@DPX200
##.OBSERVE FREQUENCY= 200.1315066352
##.OBSERVE NUCLEUS= ^1H
##.DELAY= (6, 6)
##.ACQUISITION MODE= SIMULTANEOUS
##.ACQUISITION SCHEME= undefined
##.AVERAGES= 8
##.DIGITISER RES= 18
##SPECTROMETER/DATA SYSTEM= spect
##.PULSE SEQUENCE= zg30
##.SOLVENT NAME= D2O
##.SHIFT REFERENCE= (INTERNAL, D2O, 0, 15.7039)
##AUDIT TRAIL= $$ (NUMBER, WHEN, WHO, WHERE, WHAT)
$$ ##TITLE= Audit trail, XWIN-NMR		Version 3.5
$$ ##JCAMPDX= 5.01
$$ ##ORIGIN= Bruker BioSpin GmbH
$$ ##OWNER= she
$$ F:/spectra/data/she/nmr/H-F/1/audita.txt
$$ ##AUDIT TRAIL=  $$ (NUMBER, WHEN, WHO, WHERE, WHAT)
(   1,<2021-03-03 13:10:00.04 +0400>,<she>,<DPX200>,
      <created by zg, POWCHK disabled, PULCHK disabled
       configuration hash MD5:
       00 E9 B6 7A A2 85 ED C7 34 08 36 98 17 FE 4E 26
       data hash MD5: 16K
       36 1C 01 2A 96 3F 46 2A 4E 75 85 6F 47 D2 1E 11>)
$$ ##END=
$$ 
$$ hash MD5
$$ DD 70 97 9E 06 88 72 09 5A 4A 56 43 8D 33 E7 BB
##$RELAX= 
##$RELAX= 
##$RELAX= 
##$RELAX= 
##$RELAX= 
##$RELAX= 
$$ Bruker specific parameters
$$ --------------------------
##$DU= <F:/spectra>
##$EXPNO= 1
##$NAME= <H-F>
##$PROCNO= 1
##$TYPE= <nmr>
##$USER= <she>
##$AMP= (0..31)
100 100 100 100 100 100 100 100 100 100 100 100 100 100 100 100 100 100 
100 100 100 100 100 100 100 100 100 100 100 100 100 100 
##$AQSEQ= 0
##$AQ_mod= 1
##$AUNM= <au_zg>
##$AUTOPOS= <>
##$BF1= 200.13
##$BF2= 200.13
##$BF3= 200.13
##$BF4= 200.13
##$BF5= 200.13
##$BF6= 200.13
##$BF7= 200.13
##$BF8= 200.13
##$BYTORDA= 1
##$CFDGTYP= 0
##$CFRGTYP= 5
##$CHEMSTR= <none>
##$CNST= (0..31)
1 1 145 1 1 1 1 1 1 1 1 1 1 1 1 1 1 1 1 1 1 1 1 1 1 1 1 1 1 1 1 1 
##$CPDPRG= <>
##$CPDPRG1= <>
##$CPDPRG2= <>
##$CPDPRG3= <>
##$CPDPRG4= <mlev>
##$CPDPRG5= <mlev>
##$CPDPRG6= <mlev>
##$CPDPRG7= <mlev>
##$CPDPRG8= <mlev>
##$CPDPRGB= <>
##$CPDPRGT= <>
##$D= (0..31)
0 1.2 0 0 0 0 0 0 0 0.06 0 0.03 0 0 0 0 0.0002 0 0 0 0 0 0 0 0 0 0 0 0 
0 0 0 
##$DATE= 1614762599
##$DBL= (0..7)
120 120 120 120 120 120 120 120 
##$DBP= (0..7)
150 150 150 150 150 150 150 150 
##$DBP07= 0
##$DBPNAM0= <>
##$DBPNAM1= <>
##$DBPNAM2= <>
##$DBPNAM3= <>
##$DBPNAM4= <>
##$DBPNAM5= <>
##$DBPNAM6= <>
##$DBPNAM7= <>
##$DBPOAL= (0..7)
0.5 0.5 0.5 0.5 0.5 0.5 0.5 0.5 
##$DBPOFFS= (0..7)
0 0 0 0 0 0 0 0 
##$DE= 6
##$DECBNUC= <off>
##$DECIM= 32
##$DECNUC= <off>
##$DECSTAT= 4
##$DIGMOD= 1
##$DIGTYP= 9
##$DL= (0..7)
0 120 120 120 120 120 120 120 
##$DP= (0..7)
150 150 150 150 150 150 150 150 
##$DP07= 0
##$DPNAME0= <>
##$DPNAME1= <>
##$DPNAME2= <>
##$DPNAME3= <>
##$DPNAME4= <>
##$DPNAME5= <>
##$DPNAME6= <>
##$DPNAME7= <>
##$DPOAL= (0..7)
0.5 0.5 0.5 0.5 0.5 0.5 0.5 0.5 
##$DPOFFS= (0..7)
0 0 0 0 0 0 0 0 
##$DQDMODE= 0
##$DR= 18
##$DS= 0
##$DSLIST= <SSSSSSSSSSSSSSS>
$$ [...]
##$SUBNAM2= <"">
##$SUBNAM3= <"">
##$SUBNAM4= <"">
##$SUBNAM5= <"">
##$SUBNAM6= <"">
##$SUBNAM7= <"">
##$SUBNAM8= <"">
##$SUBNAM9= <"">
##$SW= 16.9725356469052
##$SWIBOX= (0..15)
0 0 2 0 0 0 0 0 0 0 0 0 0 0 0 0 
##$SW_h= 3396.73913043478
##$TD= 16384
##$TD0= 1
##$TE= 0
##$TE2= 300
##$TE3= 300
##$TEG= 300
##$TL= (0..7)
0 120 120 120 120 120 120 120 
##$TP= (0..7)
150 150 150 150 150 150 150 150 
##$TP07= 0
##$TPNAME0= <>
##$TPNAME1= <>
##$TPNAME2= <>
##$TPNAME3= <>
##$TPNAME4= <>
##$TPNAME5= <>
##$TPNAME6= <>
##$TPNAME7= <>
##$TPOAL= (0..7)
0.5 0.5 0.5 0.5 0.5 0.5 0.5 0.5 
##$TPOFFS= (0..7)
0 0 0 0 0 0 0 0 
##$TUNHIN= 0
##$TUNHOUT= 0
##$TUNXOUT= 0
##$USERA1= <user>
##$USERA2= <user>
##$USERA3= <user>
##$USERA4= <user>
##$USERA5= <user>
##$V9= 5
##$VALIST= <valist>
##$VCLIST= <CCCCCCCCCCCCCCC>
##$VD= 0
##$VDLIST= <DDDDDDDDDDDDDDD>
##$VPLIST= <PPPPPPPPPPPPPPP>
##$VTLIST= <TTTTTTTTTTTTTTT>
##$WBST= 1024
##$WBSW= 4
##$XGAIN= (0..3)
0 0 0 0 
##$XL= 0
##$YL= 0
##$YMAX_a= 104529
##$YMIN_a= -124479
##$ZGOPTNS= <>
##$ZL1= 120
##$ZL2= 120
##$ZL3= 120
##$ZL4= 120
##$ABSF1= 10
##$ABSF2= 0
##$ABSG= 5
##$ABSL= 3
##$ALPHA= 0
##$AQORDER= 0
##$ASSFAC= 0
##$ASSFACI= 0
##$ASSFACX= 0
##$ASSWID= 0
##$AUNMP= <proc_1d>
##$AZFE= 0.1
##$AZFW= 0.1
##$BCFW= 1
##$BC_mod= 2
##$BYTORDP= 1
##$COROFFS= 0
##$CY= 11.3945322036743
##$DATMOD= 1
##$DC= 2
##$DFILT= <>
##$DTYPP= 0
##$F1P= 15.9154993809931
##$F2P= -4.1035820241983
##$FCOR= 0.5
##$FTSIZE= 0
##$FT_mod= 4
##$GAMMA= 1
##$GB= 0.15
##$INTBC= 1
##$INTSCL= 1
##$ISEN= 128
##$LB= 0.24
##$LEV0= 0
##$LPBIN= 0
##$MAXI= 10000
##$MC2= 0
##$MEAN= 0
##$ME_mod= 0
##$MI= 1.114404
##$NCOEF= 0
##$NC_proc= 0
##$NLEV= 6
##$NOISF1= 3.799351
##$NOISF2= 2.8
##$NSP= 1
##$NTH_PI= 0
##$NZP= 0
##$OFFSET= 15.70392
##$PC= 1
##$PHC0= -10854.24
##$PHC1= 29.80094
##$PH_mod= 1
##$PKNL= yes
##$PPARMOD= 0
##$PSCAL= 0
##$PSIGN= 0
##$REVERSE= no
##$SF= 200.130013532006
##$SI= 16384
##$SIGF1= 3
##$SIGF2= 2
##$SINO= 400
##$SIOLD= 16384
##$SREGLST= <1H.CDCl3>
##$SSB= 0
##$STSI= 0
##$STSR= 0
##$SW_p= 3612.71676300578
##$SYMM= 0
##$S_DEV= 0
##$TDeff= 0
##$TDoff= 0
##$TI= <>
##$TILT= no
##$TM1= 0
##$TM2= 0
##$TOPLEV= 0
##$USERP1= <user>
##$USERP2= <user>
##$USERP3= <user>
##$USERP4= <user>
##$USERP5= <user>
##$WDW= 1
##$XDIM= 8192
##$YMAX_p= 0
##$YMIN_p= 0
$$ End of Bruker specific parameters
$$ ---------------------------------
##NTUPLES= NMR FID
##VAR_NAME=  TIME,          FID/REAL,        FID/IMAG
##SYMBOL=    X,             R,               I
##VAR_TYPE=  INDEPENDENT,   DEPENDENT,       DEPENDENT
##VAR_FORM=  AFFN,          ASDF,            ASDF
##VAR_DIM=   8192,          8192,            8192
##UNITS=     SECONDS,       ARBITRARY UNITS, ARBITRARY UNITS
##FACTOR=    0.0002944,     1,               1
##FIRST=     0,             0,               0
##LAST=      2.4114304,     0,               0
##MIN=       0,             -124479,         0
##MAX=       2.4114304,     104529,          0
$$ Real data points
##PAGE= N=1
##DATA TABLE= (X++(R..R)), XYDATA
0@%%%%%%%%%%%%%%%%qJ6j6J6j6J7k5L2l3M1m8N6o5P3q8J02j11J23j41J62j84K03
38A06k27K58k88L18l52L89m31M78n26N79o40P05p76Q57r44J040j149J270j407
57g40J564j746J959k212K519k899L387m038M955o358Q791j4179M7662l4829j13597
72a09761L2325R6532P2467l0365p2026n7299L970M9801O9512K2820n3661r4697
84g0382k9820P5288J06640J4360r1050r4768N224Q7088P4049o957o6035o2431
96e8794p805N0520P0511K6233n0722q6203l0741O3549R3304K0505p3530q6050
108f9223q853O8774P1022P228n5268o4707j8712M3675P0008L0564m4838q0956
120e1286l3076N3818Q5468K5483n9804p8572j6351N6421O8068J6231m4837o2075
$$ plain form
0 0 0 0 0 0 0 0 0 0 0 0 0 0 0 0 0 0 -8 8 -8 8 -8 9 -16 16 -17 24 -24 32 -33 40 -48 54 -57 66 -75 87 -97 106
38 106 -121 137 -151 167 -185 204 -227 251 -275 304 -336 369 -407 450 -494 546 -603 667 -740
57 -740 824 -922 1037 -1175 1344 -1555 1832 -2206 2749 -3609 5182 -8997 38665 3836 -109761
72 -109761 -77436 19096 91563 61198 -10828 -68127 -64157 -14356 55156 77976 24315 -70382
84 -70382 -100202 -24914 81726 96086 5036 -89732 -84508 2580 76629 69672 3637 -58794
96 -58794 -66599 -16079 54432 80665 29943 -56260 -87001 -23452 69852 90357 16827 -69223
108 -69223 -78076 -9302 61720 68948 13680 -51027 -69739 -26064 43944 74508 29670 -51286
120 -51286 -84362 -30544 54924 80407 20603 -57969 -74320 -17899 50169 66400 21563 -40512
132d0512k4124L6516O6382L3832l6087p4330l6360M2431P8048L1137m7735p4553
144d5355k4696M5825O6259K2375l9063o1201k7021L1541O1404L3333k9279o5935
156c1813l6985L1572O9425L5890l4695o8620l2000L5486O5010K9906l2175o0572
168b9571l0406K8014N9122L3595k4880n9868l6167K4364O1322L6756k5207o1711
180b4637l6051K5280O0174L4735k4479n8424l4838K2284N6848L5585k0618n6499
192b0640l6691J9609N6446L7094j9001n5780l6928J8406N4923L7099j6921n3730
204a6114l7426J5774N3232L8207j4620n2903l8539J4089N2382L8496j3518n1577
216a2517l8361J2365N0265L8449j1162m9483l9087R733M8859L9576r040m8565
$$ plain form
132 -40512 -64636 -28120 38262 72094 36007 -38323 -74683 -32252 45796 76933 29198 -45355
144 -45355 -70051 -24226 42033 64408 25345 -35856 -62877 -31336 30068 63401 34122 -31813
156 -31813 -68798 -37226 32199 68089 33394 -35226 -67226 -31740 33270 63176 31001 -29571
168 -29571 -59977 -31963 27159 60754 35874 -23994 -60161 -35797 25525 62281 37074 -24637
180 -24637 -60688 -35408 24766 59501 35022 -23402 -58240 -35956 20892 56477 35859 -20640
192 -20640 -57331 -37722 18724 55818 36817 -18963 -55891 -37485 17438 54537 37616 -16114
204 -16114 -53540 -37766 15466 53673 39053 -13850 -52389 -38300 14082 52578 39060 -12517
216 -12517 -50878 -38513 11752 50201 39039 -10444 -49531 -39798 9061 48637 39597 -8968
228h968l9813Q400M7949L9642p612m6752l9625O431M5921M0203n052m5380m0788
241d5444M585M5376M0847m324m4714m0195L972M3236L9550k557m1624l9898N42
254d0648M0556M1129Q37m1026m2299j007M1570M2131J27m1276m0614k1L9322L9276
268C8057J460l6774l9282m040L5572M1005N949l5984m2593n923L7251M2490M787
281D1975l7043m0813m230L5074L9036N588l2478l9018q094L0987M0446R934l1461
294I903m1900r968L2279M1663Q982l1999m0069q751L0053L8805J0093k7968l8821
307b7698j2039K7031L9927J3174k7178m0459j3084K7365L9947J2670k6498l8786
319b5628j3004K4917L8061J4164k3472l8257j5482K2836L8698J6112k2799l8804
$$ plain form
228 -8968 -48781 -40381 7568 47210 39598 -7154 -46779 -40348 5573 45776 40724 -4656 -45444
241 -45444 -40859 4517 45364 41040 -3674 -43869 -39897 3339 42889 40332 -1292 -41190 -40648
254 -40648 -92 41037 41874 848 -41451 -42458 -888 41243 41370 94 -40520 -40541 -1219 38057
268 38057 39517 2743 -36539 -40579 -5007 35998 41947 5963 -36630 -42553 -5302 37188 41975
281 41975 4932 -35881 -40111 -5037 33999 39587 7109 -31909 -40003 -9016 31430 41364 9903
294 9903 -31997 -41965 -9686 31977 40959 8960 -31109 -39860 -9807 28998 39091 11123 -27698
307 -27698 -39737 -12706 27221 40395 13217 -27242 -40326 -12961 26986 39656 13158 -25628
319 -25628 -38632 -13715 24346 38510 15038 -23219 -38701 -15865 22833 38945 16146 -22658
331b2658j5995K2476L8036J5904k1482l7110j6416K0059L6738J7533j9114l7016
343a9045j8277J8906L7208J8316j8764l6636j8041J7990L5701J8342j6678l5148
355a6126j9320J5664L5374K0118j5457l5717k0135J5582L5207J9573j4996l3985
367a4218j9565J3503L3054K0574j2048l3224k1876J1667L3992K2197j2171l3989
379a2104k1406J2263L2742K0648j0986l1136k1155R080L0625K2628p911l1342
391h054k3723Q140L2032K3516q778l1666k2465Q579L0173K1924p223k8788k2507
404b8840N485K8420K3829m601k9000k4642M756K9542K4362n270k9050k3469N047
417b3431K7750K2932l818k6449k3493K323K6163K4544j554k6622k5212J789K6912
$$ plain form
331 -22658 -38653 -16177 21859 37763 16281 -20829 -37245 -17186 19552 37085 17971 -19045
343 -19045 -37322 -18416 18792 37108 18344 -18292 -36333 -18343 17358 35700 19022 -16126
355 -16126 -35446 -19782 15592 35710 20253 -15464 -35599 -20017 15190 34763 19767 -14218
367 -14218 -33783 -20280 12774 33348 21300 -11924 -33800 -22133 11859 34056 21885 -12104
379 -12104 -33510 -21247 11495 32143 21157 -9979 -31134 -22054 8571 31199 23288 -8054
391 -8054 -31777 -23637 8395 31911 23133 -8533 -30998 -22419 7754 29678 22455 -6333 -28840
404 -28840 -23355 5065 28894 24293 -4707 -29349 -24593 4949 29311 24041 -5009 -28478 -23431
417 -23431 4319 27251 23433 -3016 -26509 -24186 1977 26521 24967 -1655 -26867 -25078 1834
430A834K4803k088k6327k3986J731K5034K3682n14k4039k4196p29K3842K5103
443B4150J168k4237k5302r54K4180K4806Q17k3334k4161j523K2283K4159K533
456B4585k1627k4696l319K1608K5068L504k1580k4977l477K1201K4524L752k0401
469D165k4284m378J9691K4344N113j9280k4578n512J9031K4620N755j8757k4388
482a8458n949J8185K4183O330j7615k4025o888J7062K4132P285j6766k4094p596
495b4214J6445K3941P752j5947k3682q098J5385K3488Q538j4789k3472q967J4435
508i185K3457R313j4109k3394r452J3787K3172R629j3339k2878r880J2766K2660
521A2547J0245j2281k2543j0605J1781K2446J0918j1431k2346j1189J1046K2234
$$ plain form
430 1834 26637 24549 -1778 -25764 -24033 1001 24683 24169 130 -24066 -24795 -953 24150
443 24150 25318 1081 -24221 -25175 -995 23811 24628 1294 -22867 -24390 -2107 22052 24585
456 24585 2958 -21738 -25057 -3449 21619 25123 3543 -21434 -24911 -3710 20814 24566 4165
469 4165 -20119 -24497 -4806 19538 24651 5371 -19207 -24719 -5688 18932 24687 5930 -18458
482 -18458 -24407 -6222 17961 24291 6676 -17349 -24237 -7175 16957 24242 7476 -16618 -24214
495 -24214 -7769 16172 23924 7977 -15705 -23803 -8418 15070 23608 8819 -14653 -23620 -9185
508 -9185 14272 23585 9476 -13918 -23370 -9583 13589 23218 9879 -12999 -22879 -10113 12547
521 12547 22792 10511 -12032 -22637 -10856 11590 22508 11077 -11269 -22458 -11412 10822
533A0822J1387j0727k2056j1527J0383K1825J1622r947k1425j1786R364K1124
545I059J2207q745k1048j2666Q400K1166J2907q295k1116j2851Q164K0720J2686
558B0588p725k0156j2786O944J9714J3256o220j9733j3884N927J9979J4094o018
571A3980k0006j3817O027J9470J3476n525j8653j3555M603J8205J4230l813j8369
584c747j4864L709J8760J4972l987j8683j4468L987J7947J4046l347j7069j4260
597a7004K302J6710J4920j677j6943j5544J625J7303J5466j944j7114j4965J918
610a4947J6374J4576j214j5584j4744L93J5270J5314J85j5414j5673j93J5540
623a17J5652Q1j5347j5277k15J4778J5028O51j4194j5096j315J3848J5387J692
$$ plain form
533 10822 22209 11482 -10574 -22101 -11718 10107 21729 11782 -9643 -21429 -12065 9059
545 9059 21266 12521 -8527 -21193 -12793 8373 21280 12985 -8131 -20982 -12818 7902 20588
558 20588 12863 -7293 -20079 -13135 6579 19835 13615 -6118 -20002 -14075 5904 19998 13980
571 13980 -6026 -19843 -13816 5654 19130 13605 -5048 -18603 -14000 4205 18435 14622 -3747
584 -3747 -18611 -14902 3858 18830 14843 -3840 -18308 -14321 3626 17672 14325 -2744 -17004
597 -17004 -14702 2008 16928 15251 -1692 -17236 -15611 1692 17158 15214 -1900 -16865 -14947
610 -14947 1427 16003 14789 -795 -15539 -15146 124 15438 15623 209 -15464 -15657 -117
623 -117 15535 15616 269 -15008 -15223 -445 14583 15234 1040 -14056 -15371 -1523 13864 15556
637A5556j3783j5611j884J3746J5528J912j3453j5313k124J2996J5195K567j2581
650B751j5308k893J2434J5377L095j2232j5261l195J1865J5105L565j1444j5122
663a1263l986J1183J5313M207j1204j5320m153J1003J5006M096j0556j4586m514
676a4774R857J4574N136r487j4961n576R662J5265N425r834j4953n062R566J4282
690I120N120q678j3869n756P933J4091O580p814j4664o804Q172J4826O411q396
704F272j4347n983P905J3573O101p059j3228o794O347J3517P475o262j4003p672
718a4158O624J4162P300o794j3657o840O385J2909O949n495j2527p588M813J2781
732D864Q285m760j3306q421N160J3377P949n353j2811p511M833J2060P653l984
$$ plain form
637 15556 1773 -13838 -15722 -1976 13552 15464 2011 -13302 -15426 -2430 12765 15332 2751
650 2751 -12557 -15450 -3016 12361 15456 3224 -12037 -15232 -3367 11738 15303 3859 -11263
663 -11263 -15249 -4066 11247 15454 4250 -11070 -15223 -4220 10786 14882 4326 -10260 -14774
676 -14774 -4917 9657 14793 5306 -9655 -15231 -5569 9696 15121 5287 -9666 -14728 -5162 9120
690 9120 14240 5562 -8307 -14063 -6130 7961 14541 6727 -7937 -14741 -6569 8257 14668 6272
704 6272 -8075 -14058 -6153 7420 13521 6462 -6766 -13560 -7213 6304 13779 7517 -6486 -14158
718 -14158 -7534 6628 13928 7134 -6523 -13363 -6978 5931 12880 7385 -5142 -12730 -7917 4864
732 4864 13149 8389 -4917 -13338 -8178 5199 13148 7795 -5016 -12527 -7694 4366 12019 8035
746H035j1782q332L415J2116Q894l509j2522q837L847J2450Q389l852j1826q103
760a1617L303J1237Q379k575j1129q907K249J1392R197k344j1539r075K482J1302
774B355Q780k327j0860q689J850J0505Q897j415j0447r223J227J0542R327j246
788I276j0516r203J258J0254R047r97r911r030O66R655R220l20r631r399K09R621
804A99R410j92r499r266N9R186R190K03q936r253m98Q758R386O92q704r439p78
821i482Q624R376Q43q397r279j036Q178R264J287p981r329j459P904R340J566
836I419p774r319j618P574R224J796p382r211j968P193R228K124p092r214k240
851i260O920R177K337o772r098k495O595R111K608o458r064k704O345Q996K779
$$ plain form
746 8035 -3747 -12079 -8664 3452 12346 8837 -3685 -12522 -8675 3775 12164 8312 -3514 -11617
760 -11617 -8314 2923 11302 8727 -2402 -11309 -9060 2332 11529 9185 -2354 -11429 -8947 2355
774 2355 11135 8808 -2052 -10741 -8891 1614 10511 9096 -1351 -10574 -9347 1195 10522 9276
788 9276 -1240 -10443 -9185 1069 10116 9119 -792 -9822 -9156 499 9719 9399 -232 -9631 -9422 199
804 199 9609 9417 -82 -9348 -9289 -103 9087 9290 354 -8899 -9397 -639 8747 9439 735 -8704 -9482
821 -9482 -858 8518 9361 964 -8315 -9351 -1173 8091 9378 1397 -7932 -9391 -1487 7853 9419
836 9419 1645 -7674 -9292 -1718 7506 9302 1920 -7291 -9259 -2066 7162 9286 2194 -7020 -9260
851 -9260 -2340 6837 9174 2402 -6696 -9191 -2596 6515 9123 2665 -6399 -9103 -2758 6238 9017
866I017o124q899k926N926Q864L121n733q919l288N672Q958L318n640q908l251
881h812N517Q632L284n207q464l504M853Q470L819m699q663l991M769Q773L913
896H690m854q594l716M700Q268L726m277q034m048L942Q138M376l860q373m483
911h399M023Q406M287m052q177m108L819P773M182l359p653m530L049P801M870
926G932l096q047m853L293Q014M610l301p670m411K981P305M573k524p210m937
941g341K274P423N222k368p677n135K614P588M811k613p186m633K229O790M836
956F834j747o783n271J566P059N466j762p225n272J954P013M954j790o562m942
971f508J360O375N250j060o479n525J087O675N485j243o605n246J220O263N134
$$ plain form
866 9017 2893 -6006 -8932 -3006 5858 8979 3246 -5673 -8961 -3289 5669 8987 3347 -5561 -8812
881 -8812 -3295 5337 8621 3414 -5050 -8554 -3701 4769 8588 3889 -4774 -8765 -3996 4777 8690
896 8690 3836 -4758 -8474 -3774 4494 8220 3943 -4091 -8139 -4197 3941 8317 4457 -3916 -8399
911 -8399 -4376 4030 8317 4265 -3912 -8020 -4201 3572 7754 4395 -3258 -7788 -4739 3062 7932
926 7932 4836 -3211 -8064 -4771 3243 7853 4552 -3118 -7529 -4548 2757 7330 4806 -2404 -7341
941 -7341 -5067 2356 7578 5210 -2467 -7602 -4988 2600 7411 4798 -2388 -7021 -4792 1998 6834
956 6834 5087 -1696 -6967 -5401 1658 7124 5362 -1863 -7135 -5181 1832 6786 4996 -1566 -6508
971 -6508 -5148 1227 6477 5417 -1062 -6587 -5500 1175 6660 5417 -1188 -6434 -5214 1049 6183
986F183r01o001n306N63N987N569m78o168n616N82O169N467o52n956n271M69N655
1003B95N294j62n493n493m4N564N673L9n658n643Q0N608N433n3n342n335j37N102
1021b72N346M43m985n599n85N080N704N30n192n596l79N044N343M37m734n230
1037d645p26M466N423J018m503n633j065M681N690Q62m726n427p54M480N174Q95
1053E210m074n179j269L923N428J490m055n631j404M215N532J234m163n291j171
1068e205L853N082J416l563n175j685L489N355J829l614n432j721L668N311J626
1083E234l539n131j670L310N059J827l117n105k017L090N210K061l134n222k015
1098e159L137N088J959k982m966k025K787M934K191k687n016k275K693N046K273
$$ plain form
986 6183 5282 -719 -6025 -5462 525 6094 5616 -552 -6168 -5586 583 6050 5398 -558 -5829 -5360 295
1003 295 5589 5427 -66 -5559 -5603 -39 5634 5673 15 -5628 -5548 60 5493 5440 98 -5237 -5374 -272
1021 -272 5074 5517 532 -5067 -5652 -572 5132 5662 470 -5126 -5505 -461 4882 5319 585 -4645
1037 -4645 -5371 -905 4518 5536 1033 -4600 -5665 -984 4706 5568 842 -4585 -5339 -859 4315 5210
1053 5210 1136 -4043 -5312 -1389 4039 5529 1474 -4157 -5561 -1346 4186 5420 1257 -4034 -5205
1068 -5205 -1352 3730 5146 1583 -3592 -5277 -1788 3567 5396 1782 -3650 -5371 -1703 3608 5234
1083 5234 1695 -3436 -5106 -1796 3263 5090 1973 -3132 -5149 -2059 3151 5212 2078 -3144 -5159
1098 -5159 -2022 3066 5025 2043 -2923 -4948 -2161 2773 4964 2277 -2739 -5014 -2321 2725 4998
1113D998k713m970k232K625M860K237k454m783k359K338M809K466k299m843k483
1128d803K293M795K447k226m691k467K090M619K553j958m620k659J929M629K682
1143D613j894m619k639J844M507K629j706m418k724J596M386K811j510m394k876
1158d394J504M370K860j435m328k850J369M219K890j250m185k932J176M148K962
1173D124j118m096k979J046M051K996r68m011l041R13L969L080q72l944l071Q47
1189c074L874L033p85l748l035O41L667L130n26l678l236N20L734L222n78l699
1205e38l120N85L556L003m26l359l082K31L301L238r9l413l340J63L490L301l07
1222C184l436l102K94L219K995r1l012l090j71K970L307K85l133l444j37L278
$$ plain form
1113 4998 2285 -2685 -4917 -2292 2568 4805 2351 -2432 -4791 -2453 2356 4822 2523 -2320 -4803
1128 -4803 -2510 2285 4732 2506 -2185 -4652 -2562 2057 4610 2652 -1968 -4627 -2698 1931 4613
1143 4613 2719 -1900 -4539 -2695 1812 4441 2735 -1683 -4407 -2811 1575 4386 2876 -1518 -4394
1158 -4394 -2890 1480 4340 2905 -1423 -4273 -2904 1315 4205 2955 -1230 -4162 -2986 1162 4124
1173 4124 3006 -1090 -4069 -3023 1028 4024 3056 -955 -3996 -3083 886 3966 3094 -850 -3921 -3074
1189 -3074 800 3833 3048 -700 -3735 -3094 573 3703 3177 -501 -3737 -3217 517 3739 3161 -538
1205 -538 -3658 -3073 483 3486 3060 -299 -3381 -3150 151 3389 3290 -123 -3463 -3300 190 3491 3184
1222 3184 -252 -3354 -3060 159 3154 3063 51 -3039 -3210 -240 3067 3352 219 -3225 -3362 -84
1238h4L322o1l171l057M2K891K902K45k620l069n40K626L356O31k880l482m13
1255c362L054L295J71k931k953k06K521K840N40k264l045q87K337L396R01k646
1271G61l465o08K796L183L64k559k832m99K163K802Q66j957l091j124K132L343
1287B275J064k404l343p72K454L047O25k203k804p76J890K802J083j767l030j274
1303c133J895L217J197k069l190r98K093K970Q99j893k757j023J644K770J247
1318B869j538k922j397J633L074J333j772l016j184J749K820J123j558k686j255
1333b727J358K718J430j323k850j498J428K899J401j460k789j327J383K663J360
1348B666j214k638j472J163K686J531j179k720j502J200K666J444j145k573j472
$$ plain form
1238 -84 3238 3177 6 -3051 -3009 -118 2784 3029 409 -2660 -3200 -574 2782 3413 533 -2949 -3362
1255 -3362 -308 2987 3158 227 -2726 -2932 -411 2429 2969 705 -2340 -3227 -890 2506 3407 761
1271 761 -2704 -3312 -516 2667 3031 472 -2360 -2859 -696 2106 2972 1015 -2076 -3200 -1068 2275
1287 2275 3339 935 -2408 -3180 -726 2321 2946 743 -2061 -2837 -947 1855 2938 1171 -1859 -3133
1303 -3133 -1238 1979 3176 1107 -2083 -3081 -988 1982 2881 988 -1769 -2792 -1148 1622 2869
1318 2869 1331 -1591 -2988 -1355 1719 3052 1280 -1736 -2920 -1171 1649 2772 1214 -1472 -2727
1333 -2727 -1369 1349 2779 1456 -1394 -2892 -1464 1435 2836 1376 -1413 -2740 -1357 1306 2666
1348 2666 1452 -1186 -2658 -1495 1191 2722 1543 -1177 -2679 -1479 1187 2631 1486 -1087 -2559
1363b559J031K534J553r68k579j603R83K591J571r98k532j521R44K440J537q44
1379A580k384j604P55K409J685p36k461j692P86K453J634p88k369j593P35K259
1395F69J588o14k229j655N26K232J733n13k273j746N33K280J715n71k215j650
1411b190N11K139J643m28k052j701L61K061J734l25k047j768L23K073J741l13
1427A762k043j731L06K004J699k82j958j694K46J877J671j44j852j738R0J854
1443F7J796p5j912j796J39J914J723j71j817j627J14J683J624M2j613j736j40
1460a785J685J859R7j787j863L2J820J685r5j675j547oJ473J561J95j404j732
1477a487l21J508J873K69j667j853j13J696J689J4j534j515r4J330J530K89j238
$$ plain form
1363 -2559 -1528 1006 2559 1591 -988 -2591 -1608 983 2554 1556 -976 -2497 -1553 887 2424 1580
1379 1580 -804 -2408 -1653 756 2441 1705 -756 -2448 -1662 791 2425 1637 -732 -2325 -1590 669
1395 669 2257 1643 -586 -2241 -1715 517 2250 1737 -536 -2282 -1749 531 2246 1675 -540 -2190
1411 -2190 -1679 460 2103 1675 -377 -2078 -1717 344 2078 1753 -294 -2062 -1739 334 2075 1762
1427 1762 -281 -2012 -1706 298 1997 1715 -243 -1937 -1691 186 1857 1713 -139 -1877 -1787 67
1443 67 1863 1788 -124 -1920 -1781 133 1856 1685 -132 -1759 -1645 38 1662 1704 91 -1645 -1785
1460 -1785 -100 1759 1856 69 -1794 -1762 58 1743 1648 -27 -1574 -1580 -107 1454 1649 245 -1487
1477 -1487 -1808 -300 1573 1842 175 -1678 -1791 -95 1594 1608 74 -1441 -1535 -205 1325 1614 376
1494C76j660m54J345J826M01j479j836k36J525J652J55j409j494k42J212J501
1510A183L74j140j608m95J192J731M67j300j715l75J321J640K93j244j514l31
1526a521J132J488M35j044j538n10J054J610N25j098j629m87J132J577M33j109
1542D50j519m35J059J456M48r79j461n10R37J474N65r34j488o07R49J536N92r92
1560E41j526n16J007J469M51r42j349m76Q23J307N93p14j399p04P52J526O98q90
1578F51j569n81R78J438M37r15j243m35O82J175O23n60j309p77O21J484P75q06
1596F69j512n91Q93J368M52p86j175m77N93J126O45m67j238q20N32J427P90p01
1614G28j456o49Q11J300M90p19j126n04N28J056O63l91j184q19M56J348Q14o25
$$ plain form
1494 376 -1284 -1738 -393 1433 1834 355 -1481 -1717 -192 1460 1615 206 -1288 -1530 -318 1183
1510 1183 1557 417 -1191 -1686 -494 1237 1704 404 -1311 -1686 -365 1275 1568 324 -1190 -1521
1526 -1521 -389 1099 1534 490 -1048 -1558 -504 1106 1631 533 -1096 -1583 -451 1126 1559 450
1542 450 -1069 -1504 -445 1011 1459 480 -981 -1491 -554 920 1485 551 -937 -1544 -595 941 1533 541
1560 541 -985 -1501 -494 975 1426 484 -865 -1341 -518 789 1382 668 -731 -1435 -683 843 1541 651
1578 651 -918 -1499 -521 917 1354 439 -804 -1239 -557 618 1241 681 -628 -1405 -784 700 1475 669
1596 669 -843 -1434 -541 827 1279 493 -682 -1159 -566 560 1205 738 -500 -1320 -788 639 1429 728
1614 728 -728 -1377 -566 734 1224 505 -621 -1125 -597 459 1122 731 -453 -1272 -816 532 1346 721
1632G21j379o48P10J237N20o08j054n57M27J030P10l36j149q32M17J290P80n54
1650G25j277o53N99J137N68m86j025o46L50J062P24l24j142p84L90J202P28m63
1668F85j142o59M51J061O52l70j019o98L18J060P43l19j098p52L70J101P07l94
1686F97j045o75L47J000O80k90r96p40K72J037P51l08j061p26L42J026O71l08
1704F74r70o73K71R42P01k12r54p59K24J000P68k64j003p32K88R89O71k79r16
1723b34o65J97R00P04j66r18p61J70R65P65k23r68p29K36R45O98k27r04o76J98
1743f93Q61P04j46q62p31J27Q80P70j38r27p69J79R52P21k20r07o50J81Q19O56
1763H07j05p90p25M6Q28P96n1r17q15J33R54P49k00r06o53J80P96O51r1p48p07
$$ plain form
1632 721 -658 -1306 -596 641 1161 553 -501 -1058 -631 399 1109 773 -376 -1208 -791 499 1279 725
1650 725 -552 -1205 -606 531 1099 613 -412 -1058 -708 354 1078 754 -388 -1172 -782 420 1148 685
1668 685 -457 -1116 -665 396 1048 678 -341 -1039 -721 339 1082 763 -335 -1087 -717 384 1091 697
1686 697 -348 -1023 -676 324 1004 714 -282 -1022 -750 287 1038 730 -331 -1057 -715 311 982 674
1704 674 -296 -969 -698 244 945 733 -221 -980 -756 244 1012 748 -255 -987 -699 290 961 682 -234
1723 -234 -899 -702 198 902 736 -182 -943 -773 192 957 734 -234 -963 -727 218 916 689 -215 -891 -693
1743 -693 168 872 726 -136 -867 -740 140 910 772 -155 -924 -745 207 928 708 -199 -849 -668 151 807
1763 807 702 -88 -813 -767 61 857 806 -111 -926 -793 161 910 710 -196 -849 -669 127 778 687 -61 -768
1784g68j6Q10Q08pq88q32R4R36P73j79q88o75J62P78O45n2p13p26m2P56Q09N0
1806H35q44q69L7R22P88j19q77o77J13P55O65j8o81p46p0P36Q35O4q16q66JQ75
1828D3Q01p9q22p30O8P47O82K5o83p48j15P22Q38Q6p76q55l7Q12Q10Jp84p62o
1851g62P28P44P3o93p91j14P07Q38J02p47q19r8P34Q20R6p27q08j05P18Q21J05
1872H22p18q17j08P22P95J02o81p80j52O57Q07J99o64q68j77P12Q62J37p18q35
1892g03j11O96P77J26o28p54k20N95Q49K45o42q92k36O97R01J72p18q33j29O43
1912a65P77J77n83p69k57N37Q63L14o04r22k89O69R29K17o95q42j69O10P87K02
1932G87n14p84l28N07Q75L82n82r41l47O52R32K57o59q47k21N80P80K82m92q17
$$ plain form
1784 -768 -784 26 834 827 -61 -893 -799 137 910 731 -157 -832 -670 108 753 701 -12 -738 -780 -24 785 835
1806 835 -9 -878 -841 81 869 750 -127 -804 -691 64 729 711 30 -716 -786 -50 785 849 33 -833 -832 43
1828 43 844 765 -57 -787 -719 28 710 735 52 -696 -811 -89 749 835 59 -796 -833 -21 789 790 6 -756 -762
1851 -762 -34 710 783 90 -701 -815 -108 730 832 85 -734 -832 -98 722 818 91 -717 -822 -104 717 822
1872 822 104 -713 -821 -99 696 798 117 -663 -815 -158 649 848 184 -684 -861 -149 713 850 132 -703
1892 -703 -814 -118 659 785 157 -597 -817 -222 627 872 230 -662 -898 -201 700 872 154 -679 -808 -165
1912 -165 612 789 206 -563 -820 -283 580 894 290 -632 -921 -252 677 894 199 -643 -812 -202 585 787
1932 787 273 -511 -839 -332 543 925 343 -598 -945 -293 639 896 237 -610 -831 -251 529 811 319 -498
1952d98l69M83R09M06n62r52l55O10R22K99n91q36l05N11Q16L69m62q72m21M82
1972d16R41M14n31r44l81N39R04L59n00q65l88M54Q46M49m36q98m64M54R34M39
1992I10m68r17m32M72Q81M19m22q52m68L96Q75N19m03r20n18M31R20M89m34q91
2012d13m61L83Q61M98l43q59n50L19R07N75l55r30n60L78R20N18l56q82n15L15
2032e50Q37N68k66q68o07K63R00O29k88r23o02L18Q91N75k96q47n78K51Q26O09
2052H42k12q50o51K11Q74O67k14r01o59K32Q91O28k26q45o27J97Q07O39j35q09
2072a41o83J23Q39P12j28q78p14J72Q73O80j72q41o55J54P81O57p1p68p20L9P95
2093E4P65m0q54p72R0Q53P14j09p96o81P0P39P00j0p11p58k8P62Q00K0q10q01
$$ plain form
1952 -498 -867 -384 525 931 369 -583 -938 -328 594 893 302 -534 -839 -328 488 857 395 -477 -898 -416
1972 -416 525 939 408 -536 -917 -378 526 885 385 -480 -868 -414 432 881 445 -453 -917 -463 471 910
1992 910 442 -475 -907 -435 446 865 443 -409 -877 -481 394 913 510 -410 -928 -497 423 912 478 -413
2012 -413 -874 -491 370 868 525 -334 -884 -565 342 917 562 -368 -928 -550 370 888 532 -350 -865 -550
2032 -550 287 855 589 -279 -886 -623 277 906 618 -305 -907 -589 302 877 581 -266 -844 -593 233 842
2052 842 630 -220 -871 -660 214 881 667 -234 -893 -661 230 858 632 -213 -840 -643 164 803 668 -141
2072 -141 -824 -701 138 850 722 -156 -870 -698 175 855 683 -158 -813 -659 122 779 708 -60 -780 -741 54
2093 54 819 779 -75 -847 -757 96 810 701 -95 -776 -706 33 733 723 12 -746 -774 -12 788 808 -2 -803
2115h03K1Q22P53n3p61p05J5O85P12P5o70p84j15P05Q43J08p79q40m2P84P77%
2137G48p09p30n7O45P37J47o20q09k00O70Q65J74p15q56j23P40P88R1o62p31j45
2158g52N77P57K23n66q24k73O18Q82K36o79q57j69O57P80J74n88p48k34N17Q04
2178E35K88n18q63l21N83Q72K78o04q35k37N63P79K64m98p61l24M67Q15L60m75
2198C68q66l47N11Q53L28n17q22l11M84P66L50m27p88l89M08Q17M15m34q32m04
2218h37M59Q21L69m43p80l63L91P63L98l39p96m47L44Q41M50l94q17m21L80P78
2238C57M21l40p55m40K97P58M80k79p86n07L00Q11M69l16p84m50L08P39M35k39
2258D79p18n03K23P43N55k37p84n29K56P76M94k60p30m75K05P15N02j70p05n49
$$ plain form
2115 -803 -782 40 793 740 -21 -726 -711 -26 686 761 91 -693 -808 -103 740 848 69 -771 -813 -29 748 748
2137 748 39 -691 -748 -103 634 781 161 -648 -848 -178 687 861 146 -710 -833 -93 695 786 124 -607 -752
2158 -752 -175 582 805 239 -585 -858 -240 642 878 199 -658 -827 -170 610 784 196 -552 -786 -269 535
2178 535 823 305 -558 -879 -296 576 854 250 -585 -822 -259 520 784 286 -475 -799 -332 483 843 368
2198 368 -498 -845 -334 519 847 330 -492 -803 -319 447 797 370 -418 -807 -399 418 833 399 -433 -837
2218 -837 -378 443 812 369 -411 -774 -383 380 778 439 -357 -804 -460 381 831 437 -380 -801 -421 357
2238 357 778 438 -317 -757 -460 298 778 499 -287 -794 -494 317 786 470 -314 -764 -456 283 718 479
2258 479 -239 -742 -519 224 779 542 -242 -771 -515 261 755 495 -235 -710 -505 210 712 542 -163 -712
2278g12J57P28N74j96p38n43J83P31N24j67p08n14J30O89N47j13o87n81J01P17
2298A22N76j14p09n71J30O79N54j04o46n68P6O34N87n0o54o08N6O66O01n7o59
2319e9n87O7O19N76k8o17n91nO28O10J3o31o18J2O16O06j3n99n83k3N74O04L8
2342F09n64o19n5N82O26L4n85n90n8N66N96O1n37o01q8N40O09J01n30o24r6N21
2364a02O39R8n42o14q1N04N92J13m93o04j22M77O19J39m75o26j52M92O22J33m75
2385A42o05j53M59O13J54m48o06j74M46N92J90m18o21j81M14O24J85m17o09j96
2405f09M12O15J89m06o01j95L94N81K27l75o04k28L59O14K38l70o35k12L70O12
2425C76K10l58n78k23L35N61K58l04n91k75L07O22K67l34o15k47L50N78K43l24
$$ plain form
2278 -712 -555 173 747 551 -187 -730 -547 184 708 541 -167 -681 -551 138 685 572 -115 -696 -595 122
2298 122 698 584 -125 -696 -566 113 667 563 -83 -651 -575 59 646 596 -58 -666 -610 56 657 600 -59
2319 -59 -646 -579 40 616 588 -29 -620 -625 3 613 626 -5 -623 -611 5 611 598 -1 -584 -607 -33 571 609
2342 609 45 -574 -629 -47 579 613 28 -562 -620 -54 542 603 66 -535 -623 -83 526 627 97 -527 -623 -102
2364 -102 537 635 93 -521 -602 -98 494 607 114 -490 -612 -135 484 623 148 -478 -630 -138 484 617 142
2385 142 -463 -616 -157 456 610 162 -444 -618 -172 420 610 192 -429 -610 -196 428 613 196 -413 -609
2405 -609 -197 418 607 201 -400 -595 -201 380 607 232 -372 -600 -241 373 611 241 -394 -606 -236 376
2425 376 586 228 -350 -573 -238 323 581 277 -314 -589 -282 340 607 273 -342 -589 -239 339 582 258
2445B58n62k40K80N34L07k68n65l31K67O14L11k98o11k86L17N70K55k87n24k72
2465e31K38N24L03j93n71l41K32N91L53k78o08k76K74N43K69k31m96k99J68N07
2485A78L67j68n63l81J96N99L53k44n69k99K28N16K85j71m90l28J37M84L94j39
2505C85n35l96J61N75L67k05n41l21J81M99L05j18m63l71R8M92L90j03n20m01
2525e21J38N29L69j53m99l36J18M53L63p9m57l90O3M80M02p6m93m05J09M91L67
2546D73j01m55l63O7M37L81l0m46m24M3M73M24o7m77l83O9M35L76l6m21l86J4
2568c97M14M12lm37m24K3M35M14l4m36l92L9L98L82nl83m02oL81M23K5m08m17
2591c98j2M11M15k5l77l82k6L77L74N1l56m04n9L67M22N0l88m15l2L69M08K9l63
$$ plain form
2445 258 -304 -544 -264 270 577 309 -256 -587 -320 294 605 307 -304 -590 -273 297 552 265 -259 -531
2465 -531 -293 231 534 341 -230 -571 -339 252 605 327 -281 -557 -283 260 529 298 -198 -497 -329 178
2485 178 545 377 -186 -567 -371 228 581 337 -232 -531 -303 213 498 327 -163 -491 -354 130 524 385
2505 385 -150 -546 -385 190 557 352 -189 -510 -329 170 475 357 -106 -477 -379 113 503 400 -120 -521
2525 -521 -383 146 515 362 -137 -473 -355 98 461 382 -75 -465 -402 78 480 404 -89 -494 -385 106 473
2546 473 372 -83 -446 -379 58 439 409 -37 -461 -418 55 479 412 -65 -448 -379 56 432 396 -25 -411 -397
2568 -397 17 429 426 -11 -435 -412 23 437 403 -33 -425 -386 12 394 389 6 -396 -402 -21 402 427 19 -398
2591 -398 -410 1 416 391 14 -368 -394 -17 357 408 52 -352 -411 -44 378 428 40 -375 -407 -38 370 399 36
2614C6l79n1L42L85O4l31m02q2L47M21N6l40m10n7L41L96O4l16m09q2L22M07R0
2637D12l22l99r0L18L88Q4k88l91j09L02M04R9k95m13j08L09M01R9k95l94r2K72
2659a08L87J01k54l82j42K54M03J48k66m06j35K83L92J25k77l86j09K44L79J17
2679C68k20l77j53K28L93J62k41m07j47K43L99J40k50l70j37K19L58J41j96l48
2699a95j63J74L82J88k00l92j70K08L85J61k15l61j62J93L50J77j89l38j81J66
2719a82L46J99j62l66j99J78L56J91j62l81j80J83L44J71j60l42j51J38L25J85
2739C31j24l44k10J43L43K21j59l54k00J58L61J68j41l27j79J28K92J98q7l05
2759h7k32R4L38K37j22l60k09J46L42J73j46k95j59R8K72J88o0k80k47P1L19K57
$$ plain form
2614 36 -343 -394 -52 333 397 66 -336 -418 -71 350 406 66 -344 -401 -60 336 400 84 -325 -407 -85 322 412
2637 412 90 -309 -399 -81 307 391 103 -288 -397 -95 309 408 113 -300 -408 -99 302 401 106 -288 -380 -108
2659 -108 279 380 126 -256 -398 -144 259 407 141 -265 -400 -117 275 400 123 -263 -372 -128 251 368
2679 368 148 -229 -382 -154 239 401 160 -247 -394 -151 248 388 138 -232 -369 -150 208 349 153 -195
2699 -195 -358 -184 198 386 186 -206 -376 -168 217 378 163 -198 -360 -167 183 360 171 -167 -348 -182
2719 -182 164 363 201 -165 -364 -186 170 361 199 -182 -362 -179 165 336 176 -166 -317 -179 146 331
2739 331 207 -137 -347 -204 139 360 201 -153 -353 -195 166 334 193 -134 -313 -185 107 305 218 -87
2759 -87 -319 -225 113 350 228 -132 -341 -195 147 320 174 -121 -280 -182 90 278 218 -62 -309 -238 81 338
2781C38r4l60k13J37L20J71j19k81j62P9K49J98l1k81k43M7L15K48r0l28k18J09
2803b09L16J81j02k62j74M7K52J94j7k74k30K9K98K49p4l01k11Q7K88J80p6k47
2825e6j90M6K35K15j0k53k49K6K84K31n3k95j98O1K68J74m6k13j98J2K21K30m
2848B38k56k36K2K75K24n2k63j97M4K25J96pk31k09KK29K29j0k52k16K3K53K03
2871B34l3k29j91OK11K15J1k21k28oK31K20Nk41k25K7K32K09k4k09j92MJ95K06
2895B07J4k07k26j5K31K12ok13k24K0K21J86kk06j87%J76K09Rj81k20k6K05K32
2919B09Qk20k11OK08K05mj92j91j8J82K12Nj82k04k8J89K21K7k00k18k4K12J99
2943A91Jj90j94j1J87J88J5j63j99l4J68K12M4j86k23k5J97K08K0j93j92JJ72
$$ plain form
2781 338 244 -116 -329 -192 128 299 180 -101 -263 -184 65 263 232 -49 -292 -245 70 318 228 -100 -318 -209
2803 -209 107 288 186 -76 -250 -203 49 243 226 -48 -278 -249 49 298 224 -77 -288 -201 87 267 191 -56
2825 -56 -246 -200 35 250 240 -13 -262 -236 48 279 226 -69 -267 -206 62 236 190 -23 -221 -209 12 242 238
2848 238 -18 -254 -232 43 267 215 -48 -245 -201 24 220 213 -18 -227 -225 4 233 223 -29 -245 -222 31 234
2871 234 201 -28 -219 -213 -2 213 224 3 -225 -231 0 220 225 -16 -241 -214 18 227 203 -6 -198 -194 1 207
2895 207 221 14 -212 -227 4 216 210 -3 -227 -207 14 200 198 -8 -195 -195 -19 190 199 18 -202 -228 -23 209
2919 209 217 -3 -214 -208 0 205 201 9 -182 -200 -18 194 199 17 -187 -215 -26 195 222 22 -196 -220 -8 191
2943 191 192 2 -192 -203 -16 172 187 24 -175 -209 -41 171 215 29 -194 -219 -22 186 206 13 -179 -178 -6
2966fJ84J2j57j94l8J60K02N4j67k35m1K02K06K1j97k04JJ80J77K6j58j78m7J37
2990f0K09N9j50k27o1J94K25K7j91k02k2J89J73K3j62j58o1J37K03O7j51k34o1
3013b34J82K32L3j95k02j2J63J84J6j35j78m9J33K01O4j32k31o6J62K42M7j85
3035D0k12l2J75J92K8j48j86m5J35J94P1j44k12p5J60K23N1j62k25m2J70K03L8
3058A97j58j88n3J52J91N3j47j85p3J35K23P0j59k16p3J75K14N8j62k13l8J49
3080d8J83O7j52j76p5J16K22Q3j46k46o2J74K21O1j91j97l7J68J74M7j22j97p5
3103b08J16K34P7j38k27q8J70K31N3j71k14l2J46J92N8j43j86p5J26K09J08j44
3125I4k51q7J62K48O6j73k26m7J57J95O2j30j93j04J27K34R5j40k50q3J60K43
$$ plain form
2966 -6 178 190 33 -161 -199 -39 163 217 50 -185 -226 -24 182 203 6 -198 -197 -17 160 186 28 -150 -197 -60
2990 -60 149 208 58 -169 -230 -36 189 216 25 -177 -199 -10 163 186 24 -134 -195 -58 145 212 61 -173 -234
3013 -234 -52 180 213 18 -184 -196 -33 151 167 32 -146 -195 -62 139 203 71 -160 -226 -64 178 225 40
3035 40 -172 -204 -29 163 191 43 -143 -188 -53 141 212 68 -144 -219 -59 164 215 53 -172 -214 -44 159 197
3058 197 39 -149 -202 -50 141 194 47 -138 -211 -76 147 217 58 -158 -231 -56 158 216 54 -159 -197 -48
3080 -48 135 202 50 -126 -201 -85 137 220 74 -172 -234 -60 161 222 31 -166 -203 -35 139 186 64 -133 -208
3103 -208 -92 142 219 81 -146 -234 -64 167 220 49 -165 -197 -51 141 199 56 -130 -205 -79 130 238 94
3125 94 -157 -244 -82 166 232 59 -167 -214 -57 138 200 70 -123 -227 -100 134 229 89 -161 -244 -84 159
3147A59P9j73k25n5J52J91Q3j29k20r1J17K54J10j54k47r4J62K30Q9j50k38q1
3169b31J33K40Q9j21k50j07J43K65Q9j57k43r2J40K44R2j36k43r9J30K44J17j29
3191A18k56j22J46K55J13j45k55j14J50K54J00j27k42j24J32K48J29j25k73j21
3211b59J28K76J23j48k70j04J38K56J11j20k49j40J24K56J51j27k78j48J40K79
3231A39J35j52k70j17J29K58J39j10k75j50J15K84J65j26k88j62J30K90J53j35
3251A52k76j47J16K90J44j20k70j63J00K78J84j05l03j85J25L01J80j26l03j67
3271b95J25K89J67j08k74j95Q6L00K06q1l08k29J11L23K09j17l28j78J10L04J85
3292C02r5k92k07P6K96K28p9l30k15Q3L40K15j07l32k08J04L12K10p2l01k32P3
$$ plain form
3147 159 238 65 -160 -215 -63 128 211 82 -138 -229 -112 142 252 98 -149 -243 -81 149 238 88 -150 -231
3169 -231 -98 142 231 110 -140 -247 -104 161 250 93 -150 -242 -102 142 234 98 -145 -244 -114 130 247 118
3191 118 -138 -260 -114 141 254 109 -146 -260 -110 144 244 117 -125 -249 -117 131 260 135 -138 -259
3211 -259 -131 145 268 120 -150 -254 -116 140 251 131 -118 -258 -134 122 273 146 -132 -280 -140 139
3231 139 274 122 -148 -265 -136 122 261 151 -124 -274 -159 125 290 164 -124 -286 -156 134 287 152
3251 152 -124 -271 -155 135 279 159 -111 -274 -174 104 288 183 -120 -305 -180 121 301 175 -128 -295
3271 -295 -170 119 286 178 -96 -291 -205 95 301 220 -88 -317 -206 117 326 209 -119 -297 -187 117 302
3292 302 207 -85 -292 -216 80 308 229 -101 -316 -233 107 322 215 -117 -325 -221 91 301 229 -72 -304 -231
3314b31K99K52n4l30k63P4L47K54r7l29k44Q9L16K28o3l07k38L6L13K63k5l34
3336d4k99N4L50K85p7l41k66O5L23K51l3l09k73L1L00L04j5l39l21L7L61L05l6
3359C13l54k98N1L29K76rl13l17JL19L35J0l41l46ML43L47j5l57l16J6L15L31
3382C24Jl18l32j5L06L45M8l22l72l5L47L65K0l39l53k7L31L58L4l25l68l8L05
3405f0L74O8l30l81n8L27L83O3l27l96o1L33L77P1l16l85q5L18L94R4l12m07r8
3428d14L18M11J01l04m36j00L22M22J00l07m24j07L00M24J21k95m42j32K95M50
3448C03J38l01m48j31K99M38J50l00m42j51K90M36J62k80m42j77K75M61J74k70
3468A84m67j76K70M63J85k74m69j74K50M70K14k76m67k15K59M87K08k49m84k24
$$ plain form
3314 -231 68 320 266 -64 -327 -253 94 348 251 -78 -322 -233 83 311 248 -59 -297 -261 52 315 290 -44
3336 -44 -343 -289 61 346 269 -72 -338 -273 50 301 268 -41 -314 -283 17 321 306 -33 -354 -317 44 349 313
3359 313 -41 -339 -288 41 317 308 -5 -322 -321 -2 333 343 2 -344 -340 3 350 335 -22 -338 -322 -7 324
3382 324 325 7 -325 -340 -34 311 359 37 -335 -370 -23 342 362 23 -330 -357 -26 332 366 41 -327 -365 -60
3405 -60 314 382 52 -329 -387 -60 323 386 59 -337 -398 -65 312 383 67 -318 -403 -85 309 403 91 -316 -414
3428 -414 -96 315 416 112 -324 -424 -102 320 420 113 -311 -418 -118 306 427 132 -310 -442 -147 303
3448 303 441 140 -308 -439 -140 298 448 148 -294 -445 -155 281 443 163 -279 -456 -181 280 454 184
3468 184 -283 -459 -189 274 459 185 -284 -458 -208 262 476 200 -267 -482 -223 264 472 223 -261 -485
3488d85K49M90K35k48m89k28K33M89K34k37m73k54K28M89K59k36m82k67K16M86
3508B09K91k23m87k86K10N09K75k02n03k87J85N02L12j92n02l17J90N05L22j79
3528C32n22l12J79N07L22j72n02l28J56M98L39j39n16l51J37N04L78j28n27l72
3548e17J42N05L74j16n22l64J09N04L81j02m97m07J08M95M25j08n08m13R5M99
3568H3M23q6n07m16P0N01M18m3m90m54M9M95M65n4n00m53M3M97M58l6m94m58J8
3591d71M80M63Pm85m73j1M80N11j2m90m89mM84M97J1m85m87l7M80N03L9m68n18
3614d75m3M62N26O0m75n21o1M68N20N6m60n12o7M39N19J05m36n38j21M38N52J16
3636E52m33n72j04M44N56J24m40n58j26M31N48J38l97n70j65M07N87J64m12o00
$$ plain form
3488 -485 -236 254 489 241 -248 -476 -243 246 480 243 -230 -484 -256 233 492 256 -226 -493 -277 209
3508 209 500 277 -210 -496 -286 223 498 296 -207 -494 -309 193 505 313 -189 -506 -316 189 511 332
3528 332 -190 -502 -323 184 506 334 -168 -496 -340 158 497 358 -158 -509 -372 132 510 382 -145 -517
3548 -517 -375 130 504 388 -134 -498 -389 115 496 394 -103 -510 -402 93 518 410 -98 -511 -416 83
3568 83 506 420 -87 -503 -433 68 486 443 -47 -501 -452 43 508 454 -46 -499 -456 41 499 463 -31 -489 -471
3591 -471 9 472 479 -6 -479 -490 -10 501 489 -1 -490 -494 -10 487 498 13 -474 -511 -31 472 511 43 -475
3614 -475 -518 -56 470 530 55 -466 -527 -59 461 517 57 -455 -522 -83 436 541 105 -433 -554 -116 436 552
3636 552 119 -453 -557 -113 443 567 127 -431 -557 -126 422 560 163 -407 -572 -165 422 586 174 -426
3656d26j67M25N92J54m06n81j63L77N79J91l68n93k12L64O08K32l84o01k34L90
3676b23O01K24l62n95k35L42N92K73l48o08k74L38O29K75l31o40k79L38O11K87
3696F15l21o16k89L00O08L19l00o08l33K90O25L40k94o33l29K81O27L30k70o08
3716b66l47K55O23L61k47o24l88K64O14L94k38o31l99K39O21L92k13o27l99J95
3736d21O25M27k01o34m26J94O27M34j80o33m22J72O10M43j59o20m58J49O26M75
3756F28j40o36m77J58O06M78j34o06m77J16O03M82r8n93n01P7O12N16r8o12n06
3777f02Q2O05N03o6n91n24O0N78N40l3n99n43L1N94N50l6n81n52L5N74N54j4n65
3800@n68lN71N71J3n70n81j2N62N90K6n83n71l6N56N87L6n34n92o7N40N99P7n34
$$ plain form
3656 -426 -593 -168 424 578 172 -409 -572 -195 384 575 207 -386 -598 -234 374 606 222 -379 -613 -223
3676 -223 378 602 240 -355 -590 -248 344 617 269 -339 -613 -275 354 629 298 -342 -621 -283 328 615
3696 615 294 -322 -611 -311 297 616 316 -292 -625 -335 290 630 336 -297 -626 -345 282 612 342 -266
3716 -266 -613 -358 265 626 379 -245 -633 -369 245 639 401 -230 -629 -390 231 623 410 -217 -616 -421
3736 -421 204 631 430 -204 -630 -436 191 625 445 -188 -610 -438 172 615 456 -164 -622 -473 153 628
3756 628 488 -148 -625 -467 139 617 483 -123 -600 -484 119 601 503 -90 -591 -514 98 614 516 -96 -602
3777 -602 -520 85 588 522 -69 -593 -533 45 585 552 -47 -590 -559 35 585 549 -32 -584 -549 25 579 565 0
3800 0 -568 -571 0 571 584 14 -567 -579 -17 573 599 16 -555 -591 -35 552 588 54 -538 -605 -65 534 611 77
3824G7o19q3N38O21Q7n25o22j01N18O35R4n09o25j15N13O21J28n08o40j28M97
3845a46O39J48m81o45j69N02O42J68m86o45j77M69O50J79m66o38j99M39O66K20
3865F70m45o73k32M53O77K20m35o75k39M54O52K40m05o62k74L98O83K85m06o84
3885c98k83L95O89K79l94o87k77L85O63L04l53o78l17L36O87L37l46o95l52L52
3905c53O96L43l35o94l46L33O81L45k94o67m03L01O86L98k85o95l96K81O98M02
3925F96k84o88l97K68O76M09k45o78m29K42O71M52k42o76m62K24O93M55k23o78
3945b16m58K02O85M53j93o60m78J78O61M84j56o59n17J55O69N27j54o72n22J64
3965e07O61N08j34o69n14J34O36N29q9o46n43O8O55N61q9o57n55R3O51N47q6o26
$$ plain form
3824 77 -542 -625 -87 534 621 96 -526 -627 -109 526 620 111 -514 -629 -116 505 633 125 -515 -643 -146
3845 -146 493 641 160 -485 -654 -152 490 658 172 -473 -650 -181 469 648 182 -456 -655 -216 450 670
3865 670 225 -448 -680 -227 450 670 235 -440 -679 -225 427 667 262 -400 -674 -276 407 692 286 -398
3885 -398 -681 -286 403 682 288 -399 -676 -291 372 676 323 -355 -672 -336 351 688 342 -353 -705 -353
3905 -353 343 686 351 -343 -689 -356 325 670 376 -291 -694 -393 293 691 406 -289 -685 -404 294 696
3925 696 412 -276 -673 -405 271 680 435 -243 -672 -430 241 693 451 -225 -687 -463 230 685 462 -216
3945 -216 -674 -472 213 666 473 -187 -665 -487 174 658 502 -157 -674 -519 150 677 523 -149 -671 -507
3965 -507 154 662 528 -141 -655 -521 115 644 555 -91 -634 -566 89 650 561 -96 -651 -558 93 640 554 -72
3987g2n42M6O18N60j8o17n94L3O12O12j6o47o00L3O20N83j6n92n81k8N81O11M2
4010F28n83o33m6O02O28N9o14o25n0N93O19M1n51o21q6N42O41J19n53o67j21N72
4032a06O74J00n68o51r9N37O35J29n06o54j47N02O76J68n20o92j69N19O91J65
4052F84n18o66j71M86O69J92m62o70k37M63P01K37m73p03k24M70O96K17m57o70
4072d36k42M33O77K66m15o92k98M27P11K94m35p12k75M24O81K86l89o90k99L56
4092c28P04L19l45p07l62L68P22L42l69p17l23L58O82L35l18o77l70L02O92L98
4112G06k97p11m16L14P24L98l24o94l97K93O84L98k47o76m40K56O81M51k47p00
4132b44m64K53P09M56k60o84m41K22O73M61k05o75m71J85O69M90j62o91n11J78
$$ plain form
3987 -72 -614 -568 50 610 592 -25 -619 -586 26 638 622 -25 -625 -592 28 611 595 3 -578 -606 -25 586 628
4010 628 45 -588 -634 -32 596 655 41 -584 -634 -41 578 619 68 -553 -639 -97 544 663 110 -557 -678 -106
4032 -106 568 668 100 -551 -650 -113 522 651 145 -509 -656 -154 522 690 170 -522 -691 -172 519 684
4052 684 166 -500 -671 -185 484 676 214 -456 -693 -230 471 708 235 -468 -692 -222 474 691 234 -436
4072 -436 -678 -245 432 698 283 -409 -707 -280 431 725 290 -422 -697 -273 408 694 305 -385 -684 -328
4092 -328 376 695 350 -357 -719 -351 371 713 344 -373 -696 -338 344 679 361 -316 -686 -384 308 706
4112 706 409 -302 -718 -404 320 718 394 -300 -697 -404 280 678 431 -245 -685 -429 252 703 456 -244
4132 -244 -708 -455 254 710 450 -234 -675 -453 220 681 476 -199 -670 -485 184 674 512 -179 -690 -512
4152e12O96M99j73o86m92J61O70M96j39o46n15J16O36N34q8o66n43J02O62N52
4172F64j06o56n57R8O50N46q6o28n48O6O11N72m4o17n87L0O33N87l5o16o00L1
4194e92O24N95k9o11n81RN83N91L0n95o07m4O01O28L5o01o29l9N96O23L3n68o03
4217e51p0N35O34R3n37o60j04N69O51J05n67o63r4N60O42J05n28o30j36M96O57
4238E07J71n08o70j73N10O81J62n07o75j66M96O59J72m68o56k03M62O67K21m62
4258B20o89k11M62O82K15m34o96k39M52O79K40m20o84k62M08O97K72m16o89k78
4278f91M18O83K78l88o87k95L80O87L13l79o99l17L81O89L16l62o83l26L31O78
4298C27L58l24o88l71L14P04L73l20o94l80L20O90L75l13o71l73K87O74L84k59
$$ plain form
4152 -512 184 683 510 -176 -668 -507 163 659 520 -126 -641 -525 111 645 557 -109 -652 -550 112 664
4172 664 558 -98 -655 -557 93 639 553 -75 -623 -557 54 626 582 -35 -622 -592 41 628 593 -23 -623 -592
4194 -592 32 627 598 -13 -594 -585 -2 589 619 24 -583 -627 -26 602 637 36 -593 -632 -36 587 620 52 -551
4217 -551 -621 -86 548 641 104 -556 -660 -91 560 665 98 -565 -659 -99 543 648 120 -510 -646 -150 507
4238 507 678 170 -500 -673 -163 518 680 173 -502 -668 -172 487 659 191 -465 -668 -206 461 682 220
4258 220 -469 -680 -218 464 679 245 -451 -690 -238 441 681 261 -423 -685 -277 420 692 276 -413 -691
4278 -691 -273 410 688 300 -387 -682 -302 385 698 319 -380 -697 -316 373 689 327 -356 -682 -351 327
4298 327 685 361 -327 -698 -384 320 693 373 -321 -701 -381 309 684 371 -300 -673 -386 288 672 413
4318D13o82m16K58P14M21k74p08m15K71O86L97k37o63m19K21O42M56j92o77m79
4338f83K10O82M81k19o93m42K10O51M61j92o42m73J56O44N11j41o59n24J45O69
4358A52N14j59o57m97J46O30N00j15o23n15P6O43N52q6o56n49R3O44N45r9o21
4379h2n24O3N95N47m0n91n72J1O20N92k2o31n72K8O18N72m6n73n66PN58N81K8
4402F01n59o07n1N91O21K2o00o05j7N80N87K7n21n93q6N20O22R7n17o56j03N60
4424h7O48P7n56o22p8N19O06J14m92o13j53M79O30J92n01o74j48N06O72J40n05
4445A54o41j37M67O20J76m40o36k03M27O59K19m38o79k17M55O72K08m57o45k19
4465f55M38O32K23l94o31k74L96O56K68l72o75k89M02O79K67l88o67k70L79O47
$$ plain form
4318 413 -269 -685 -427 287 708 434 -274 -689 -418 268 665 428 -235 -654 -433 209 665 473 -204 -683
4338 -683 -473 209 690 471 -222 -664 -454 197 658 466 -176 -649 -493 151 662 521 -138 -662 -517 152
4358 152 666 507 -150 -647 -501 129 629 514 -109 -624 -548 95 647 561 -95 -644 -551 93 638 539 -82
4379 -82 -606 -543 52 599 559 -32 -604 -593 27 619 597 -34 -606 -578 40 612 566 -7 -573 -566 -8 573 601
4402 601 42 -565 -616 -25 596 618 18 -587 -604 -24 563 590 69 -524 -610 -90 532 629 112 -544 -647 -87
4424 -87 561 638 82 -540 -618 -99 507 621 129 -484 -637 -158 472 664 163 -511 -659 -153 519 659 154
4445 154 -487 -624 -157 463 639 199 -437 -640 -213 446 665 227 -452 -669 -214 458 666 209 -436 -655
4465 -655 -217 415 638 244 -387 -661 -265 391 659 287 -388 -677 -275 404 671 283 -384 -654 -275 372
4485C72K80l50o44l05L35O46L28l16o85l39L40O84L33l56o57l25L27O54L22l08
4505C36o45l42K87O46L70k80o54l85K74O77L92k79o76l90K88O56L66k61o31l84
4525f35K36O18M25k09o50m25K09O63M26k17o65m24K30O46L93j98o17m34J74O07
4545A53M58j57o13m79J60O36M79j63o52m56J69O12M51j17o06m69J11N95M89r0
4565E11o02n09R2O12N03r3o11m95Q8N84N13q5n70n22N8N71N36n4n78n38N6N71
4587C8N38m5n68n33K1N75N37rn61n45%N59N66j0n47n50j0N33N44K7n19n56n6N23
4611d8N79N9n39n83n2N35N71N1n27n50o9M84N67R1m74n73j25N00N94J05m86o14
4633e04r8N08N70J04m64n69j22M32N84J51m21o12j66M42O20J63m66o13j50M62
$$ plain form
4485 372 652 302 -342 -647 -312 334 662 346 -339 -678 -338 346 679 323 -334 -659 -332 322 644 336
4505 336 -309 -651 -364 282 652 372 -282 -667 -393 284 676 397 -279 -669 -381 275 641 380 -251 -635
4525 -635 -399 219 644 435 -215 -640 -431 232 658 441 -224 -648 -418 228 621 423 -194 -628 -454 153
4545 153 611 454 -159 -638 -478 158 637 474 -178 -634 -465 147 598 481 -125 -594 -483 112 601 511
4565 511 -91 -600 -508 104 607 514 -97 -592 -504 80 593 508 -62 -584 -526 45 581 527 -51 -589 -533 38
4587 38 576 531 -37 -570 -549 26 563 554 -7 -552 -552 7 573 563 16 -534 -544 -11 533 560 41 -515 -571 -48
4611 -48 531 590 51 -532 -584 -49 522 573 46 -504 -573 -89 478 569 95 -478 -603 -103 491 596 110 -504
4633 -504 -602 -94 476 580 116 -453 -575 -143 441 592 171 -441 -607 -165 455 618 152 -461 -611 -149
4653a49N86J48m24n70j84L93N80K23l83o35k08M06O28K12m33n90j88L91N88K03
4673E94l62n79k36L39O07K58l60o32k42L57O32K43l67n97k47L41N79K60l07n92
4693c11k98L09O01L15l15o25k88L22O07K83l11n88k94K79N94L16k62o02l35K59
4713c44O13L54k87o08l24K72N79L29k45n65l43K12N66L70j94o06l83K31O14L57
4733E98k35n93l45K20N66L54j85n49l93J59N68M19j56o03m16J83N95L98j84n69
4753a68l75J61N24L92j20n36m10Q6N57M48r6n77m56J34N69M30j26n60m00R8N22
4774I7M26q0n12m52M3N41M73n5n43m94Q9N46M57p9n23m40N3N03M43k6m81m84R
4797d89N03N03j7n09m94MN25M85j7n01m62mM63M80K5m61m94l9M51N18M8m68n21
$$ plain form
4653 -149 437 585 161 -409 -593 -200 380 603 220 -415 -623 -217 411 623 190 -400 -588 -197 391 594
4673 594 232 -347 -583 -244 363 621 261 -371 -613 -256 376 619 252 -345 -592 -251 328 588 281 -311
4693 -311 -609 -300 301 616 301 -324 -612 -290 317 600 289 -299 -593 -314 280 596 334 -268 -603 -344
4713 -344 269 623 336 -272 -596 -324 255 584 339 -226 -569 -357 209 579 385 -221 -604 -373 241 598
4733 598 363 -230 -575 -355 211 565 380 -169 -562 -403 165 584 428 -175 -591 -408 187 585 401 -168
4753 -168 -543 -382 142 534 414 -122 -532 -446 111 559 463 -114 -570 -436 133 563 437 -123 -523 -425 97
4774 97 523 443 -69 -521 -478 63 536 481 -62 -556 -467 79 536 457 -66 -506 -453 50 493 467 -14 -498 -489
4797 -489 14 517 500 -9 -503 -499 26 511 494 -7 -469 -473 -10 470 495 34 -460 -499 -48 470 518 50 -471
4820d71m3M69N20L5m69m97l9M41M92O1m29m91q5M12N15J11m24n43j02M50N32Q4
4842E29m40n18p8M14M96J04l80n11j38L75N39J53l91n59j39M10N42J27m09n23
4862c97j19L75N01J47l38n12j79L29N39K02l53n50j86L74N32J76l64n32j69L49
4882a75M99J97l14n09k30K94N47K39l08n69k22L26N51K04l15n12k12K81N07K29
4902E08k44n31k68K57N57K64k80n42k71L07N21K40k57n08k60K40M91L06k27n32
4922b29l05K32N42L01k49n28k79K22N28K73k15m89l04J72N23L29j83n31l38K08
4942c20N27L12j98n17k98J80M84L22j50m86l56J35N16L58j42n27l54J56N23L35
4962E00j61m75l34J25M68L56j04m72l84P6N20L97j13n15l88J25N02L55j08m61
$$ plain form
4820 -471 -514 -45 475 510 41 -456 -495 -54 438 499 70 -421 -506 -94 421 532 108 -435 -537 -87 445 529
4842 529 89 -429 -507 -93 403 507 127 -384 -522 -147 392 545 154 -405 -544 -134 408 535 126 -397
4862 -397 -516 -141 360 507 169 -343 -522 -193 346 548 195 -355 -541 -167 365 541 177 -355 -524 -175
4882 -175 324 521 207 -302 -532 -238 309 548 240 -329 -551 -225 326 530 215 -297 -509 -228 279 508
4902 508 264 -267 -535 -278 279 543 263 -279 -550 -243 278 518 261 -247 -507 -267 224 530 303 -229
4922 -229 -534 -302 240 541 292 -236 -515 -293 235 508 293 -196 -500 -328 195 524 341 -190 -528 -320
4942 -320 207 519 321 -196 -494 -314 170 492 342 -144 -500 -365 151 509 367 -160 -514 -358 165 500
4962 500 339 -136 -470 -345 123 479 375 -97 -481 -405 115 512 399 -116 -504 -379 123 478 370 -91
4982i1l67P6M48L92m1m79m12N7M77M16o4m89l89Q2M55L78n4m35l95L2M27M11%
5005D35m40m39J7M63M25l5m44m11K2M30M14j4m09m28j6M28M34Pm22m37j6M20M40
5028D24Mm10m18k8L94M30M9l96m45n1M08M52M1m15m30l7L82M33O0l58m58p8L84
5051f3M56Q5l78m73q2L86M53P1l75m40p8L43M48J00l31m66j30L42M84J25l56m83
5073c62j04L61M58J10l46m35j26L13M41J60k83m91j69L15M98J69l36m93j53L32
5093a41M65J36l00m44j59K72M47J84k61m68k09K65N04J97k99m76j84L01M47J79
5113D56k62m45j96K46M42K19k22m75k37K42M87K25k52m77k05K35M73K15k47m50
5133b28k25K08M56K36j92m60k60K00M66K60j97m77k61K13M68K61k13m42k56J94
$$ plain form
4982 -91 -458 -382 66 458 417 -62 -474 -417 60 476 412 -77 -466 -384 71 449 395 -40 -435 -403 24 435 435
5005 435 -5 -444 -427 36 461 426 -18 -429 -407 23 437 423 14 -414 -430 -2 432 439 17 -420 -436 -16 424
5028 424 428 18 -400 -428 -34 396 445 49 -396 -447 -39 413 454 39 -391 -428 -46 387 447 89 -369 -447 -63
5051 -63 393 478 100 -373 -455 -69 384 455 80 -360 -438 -95 353 453 122 -344 -474 -132 352 477 121 -362
5073 -362 -466 -105 353 463 117 -318 -444 -131 310 470 187 -304 -473 -158 340 509 173 -320 -473 -141
5093 -141 324 460 160 -284 -443 -171 276 460 199 -269 -478 -213 291 488 189 -287 -471 -170 277 456
5113 456 194 -251 -447 -201 241 460 238 -237 -474 -232 255 480 228 -249 -454 -219 254 469 222 -228
5133 -228 -453 -245 211 447 255 -205 -465 -265 201 461 264 -213 -474 -261 207 468 255 -187 -443 -249
5153b49M26K68j67m38k81J52M48L10j57m77k99J61M79K83j70m44k79J58M05L04
5173D33j37m19l02J08M39L14j07m70l23J40M62K99j39m25k92J06M21K96p8m08
5193h2l27P3M20L59q9m47l42J01M48L24j17m24k94Q0L94L13n2l83l58M0M13L74
5215D24n4m29l67P9M27L23o4l92l30L4L76L46ol80l73JM07L78j4m13l70L3L88
5238B4L63l2l67l53kL49L66L8l70l95k5L90M02ml81l79QL60L57K1l42l66n6L41
5262e3L99N6l59m06m4L73L94J6l46l73l2L27L63Q2l18l89r9L23M19Q4l38m33o8
5285d22L65L95M9l19l78o1K80L86J21k90m12j29L05M29J07l20m24r3L19L95Q6
5306C89k87l75j14K61L87J41k50m17j61K75M37J42k95m25j22K91L95J18k60l79
$$ plain form
5153 -249 177 445 278 -160 -441 -289 159 469 312 -165 -464 -303 176 459 289 -155 -434 -276 129 433
5173 433 296 -123 -425 -317 122 436 329 -141 -464 -324 138 437 298 -127 -419 -313 108 404 326 -82
5193 -82 -409 -336 84 443 354 -93 -435 -334 114 438 321 -103 -397 -317 77 390 338 -45 -403 -363 50 424
5215 424 370 -59 -426 -347 80 403 339 -53 -383 -349 27 373 367 -13 -386 -385 22 400 386 -27 -397 -364 24
5238 24 387 355 -12 -365 -367 -18 348 386 16 -379 -404 -14 388 384 3 -376 -368 -8 349 370 28 -338 -394 -53
5262 -53 346 402 43 -363 -407 -34 360 376 30 -343 -375 -48 315 397 79 -310 -409 -86 333 417 79 -354 -422
5285 -422 -57 338 387 68 -310 -371 -91 295 416 126 -286 -415 -110 319 426 106 -318 -411 -92 303 389
5306 389 102 -273 -387 -126 261 402 152 -265 -426 -151 286 428 133 -292 -414 -123 272 390 130 -249
5326b49j42K26M06J72k28m29j78K44M48J63k71m19j57K46M14J48k21l94j86K15
5346a92M06J92k19m09j93K13M20K03k19m31j92K26M08J90k09l90k08J97M05K09
5366D07j95m00k11J72M18K19j72m18k31J85M10K26j80m17k12J72M01K15j62l88
5386a61k36J47L90K48j35m08k57J48M19K48j44m13k47J56L84K55j40l75k53J10
5406b64L78K84j05m09k84J11M18K71j27l98k62J30L61K58q9l61k83P2L65L07o5
5427C08l89l10Q3L97K88p2m01k66P1L74K88o4l67k93M9L51L30m4l76l22M7L66
5449D8L24n6l69l05M4L54L02k9l51l18L3L53L14k0l45l24J4L46L37k5l44l31J2
5472c36L50L29ml41l18%L27L24J6l26l34k9L32L47K2l30l46l8L31L45K3l16l46
$$ plain form
5326 -249 -391 -165 241 413 185 -244 -422 -178 270 433 162 -257 -414 -168 246 394 173 -221 -407 -192
5346 -192 214 406 187 -222 -415 -202 218 421 202 -229 -421 -195 213 403 194 -196 -404 -207 198 407
5366 407 212 -188 -399 -227 191 410 238 -180 -411 -226 184 410 230 -187 -399 -227 174 389 227 -161
5386 -161 -397 -250 140 388 253 -155 -412 -264 155 403 259 -154 -401 -245 139 394 254 -121 -374 -264
5406 -264 114 398 293 -116 -400 -289 129 400 273 -125 -387 -257 104 362 273 -88 -371 -299 66 373 308
5427 308 -81 -391 -308 89 377 305 -96 -362 -291 83 371 307 -60 -353 -304 47 377 333 -43 -365 -318 48
5449 48 372 316 -53 -358 -314 40 342 313 -38 -356 -323 30 344 324 -21 -345 -331 15 352 327 -17 -348 -336
5472 -336 14 343 339 -2 -320 -320 7 331 347 21 -313 -342 -10 337 359 29 -317 -355 -24 321 344 28 -318
5495c18k5L19L37L0k94l44m9K88L55O6l09l64n6L15L61M2l12l35m7K90L40N5k61
5518H4l49j03K74L80R5k85l77q3K96L59Q0k96l42q7K70L40J07k50l73j18K64L76
5540B62J11k71l74j08K78L76Q8k56l56j00K27L59J32k20l81j48K38L92J42k53
5560A38l88j10K28L66J28k19l62j34J97L72J56j96l86j74K22L99J52k32l79j44
5580c66K11L57J54j84l56j91J77L78J96j83l97j81J99L79J80k01l56j68J70L34
5600A52K02j43l65k06J50L78K31j78l90k11J80L78J78j55l49j95J27L49K18j04
5620B47l57k60J24L82K55j53l84k25J59L51K07j31l39k06R2L30K56q0l64k62Q3
5641b75L99K65j31l87k28J22L60K11r8l25k34O7L26K60n2l55k79P4L54K92q7l63
$$ plain form
5495 -318 -343 -24 313 343 49 -295 -344 -56 299 365 56 -308 -364 -49 312 354 42 -293 -340 -50 290 345 84
5518 84 -265 -368 -94 286 381 96 -281 -364 -68 291 371 75 -267 -354 -84 256 363 113 -260 -378 -114 262
5540 262 373 102 -272 -380 -102 274 362 106 -250 -350 -123 236 368 148 -233 -381 -143 249 391 138
5560 138 -250 -360 -132 234 362 143 -219 -353 -156 216 372 176 -210 -384 -162 237 389 157 -222 -366
5580 -366 -155 202 356 172 -184 -375 -198 180 376 193 -204 -385 -186 193 373 172 -184 -352 -182 152
5600 152 354 211 -154 -360 -210 168 399 221 -169 -380 -200 178 356 201 -148 -343 -216 133 351 247
5620 247 -110 -370 -246 136 391 238 -146 -371 -212 139 346 215 -124 -330 -238 92 348 268 -96 -358 -275
5641 -275 124 389 258 -129 -357 -235 125 336 238 -87 -321 -254 72 332 280 -75 -354 -280 74 366 279 -84
5663h4k61R1L41K47q6l05k68M4L22K96m1l42k92M3L41K97l6l59k78M8L33K78m2
5686B87l07k85J6L13K91j6l05l15J7L19L13j6l23l16K8L10K98pl17k91jL10L00
5709C03Kk87l16j8L09L14J7l06l26mL00L23J0l10l02j2K76L02M7k84l12n5K86
5732d3L32M8k85l44m4L00L17M2k78l15m5K61L07P2k57l30q4K67L48Q1k69l47q0
5755c46K73L46N7k49l29p7K45L31R2k33l42j08K48L43J07k47l58j00K59L27R8
5776C37k34l30j14K32L34J27k30l38j28K19L52J20k20l55j30K33L41J41k22l44
5796b09j38K07L45J44j89l65j41K01L45J41j96l40j46J87L35J73j84l41j81J85
5816a67L65J62j91l55j50J75L36J72j63l36j82J54L34J95j43l62k00J69L64J82
$$ plain form
5663 -84 -345 -254 87 334 248 -57 -325 -281 41 337 296 -46 -338 -295 46 343 307 -52 -330 -282 51 329 287
5686 287 -20 -305 -289 24 315 299 -6 -321 -304 15 328 312 -11 -327 -299 11 309 302 -15 -306 -307 3 303
5709 303 305 18 -298 -316 -7 307 324 18 -308 -312 -12 311 321 11 -291 -303 -27 275 322 38 -274 -329 -43
5732 -43 289 337 52 -292 -336 -36 281 323 45 -270 -315 -54 253 325 68 -262 -346 -79 269 350 81 -266 -346
5755 -346 -73 273 330 81 -248 -325 -80 251 343 110 -232 -340 -92 251 358 111 -247 -347 -88 239 337
5776 337 103 -227 -341 -109 225 352 122 -216 -344 -125 227 347 127 -228 -358 -125 216 357 135 -209
5796 -209 -347 -140 205 349 160 -205 -346 -145 200 341 145 -195 -341 -154 181 354 170 -171 -352 -167
5816 -167 198 360 169 -186 -336 -161 175 347 184 -152 -334 -180 154 349 206 -156 -356 -187 177 359
5836C59j64l54j68J48L29J80j20l34k06J11L45K31j39l53k23J44L58K05j41l42
5856a34j96J09L35K07r2l27k33Q9L46K41j02l55k37J20L46K23j21l17k36R7L26
5877H9K38o4l33k72P8L53K50q2l34k41O6L28K48o1l13k58M7L08K83n8l20k76N2
5900b72L22K70n3l19k55L4L07K66k4l01k90J7L23K94k5l22k95L4L27K66k7k97
5922b0k71J3K83K91Rk98l03j4L12L24ql24l02J1L13K80j3k76k77k7K65K94N7k78
5946D1l25n1L04L24K3l07l09nK90K89J6k54k87o3K56L19P9k55l55p2K88L40N2
5969C38k91l21m3K62L02N8k36l04r2K20L39J01k29l57r4K48L55P8k65l23o4K39
5991g9L08R1k12l24j22K22L23J41k26l53j32K43L53J12k37l38j00K13L21J19j95
$$ plain form
5836 359 195 -159 -327 -179 150 330 210 -124 -330 -219 126 357 218 -135 -358 -214 144 349 208 -134
5856 -134 -330 -221 114 321 229 -98 -331 -242 104 345 243 -112 -349 -229 117 340 219 -98 -334 -237 89
5877 89 327 263 -70 -342 -264 89 339 257 -77 -318 -252 76 324 263 -50 -308 -261 47 330 272 -48 -324 -272
5900 -272 50 320 267 -52 -307 -273 34 300 276 -25 -315 -298 25 319 294 -28 -323 -289 38 304 277 -20
5922 -20 -291 -278 5 296 305 7 -296 -310 2 326 318 -6 -308 -297 16 296 283 7 -270 -297 -32 262 319 41
5946 41 -284 -335 -31 293 316 9 -300 -305 -15 274 290 36 -251 -314 -58 261 340 85 -270 -342 -54 286 338
5969 338 47 -274 -317 -55 247 305 69 -235 -327 -107 232 333 104 -253 -347 -99 256 334 69 -254 -318 -79
5991 -79 229 320 108 -216 -338 -116 207 348 122 -231 -363 -120 233 345 108 -230 -330 -117 204 323 128
6012A28l34j33J92L40J60k20l46j40K01L61J40k08l39j56K18L22J60j88l35j59
6032c36J79L30J70j60l56j70J57L60J90j90l49j71J81L39J57j60l32j72J42L37
6052A46J86j33l46k11J41L60K05j51l53j94J43L47J87j26l34j96J12L32K14j01
6072B28l30k41J02L56K29j13l59k23J19L53K13j18l16k25R3L20K40q1l30k61R4
6093b50L42K42q7l53k21R3L24K34p7l20k48O7L08K69m7l36k69N9L37K51o2l08
6115e2k59L5L16K65k2l17k88M5L16K85l6l35k75M3L07K74l0k96k71J3K96K82J0
6138C06l08l06lL05L16j8l11k77LK93K75J7k68l05k8K72L21L9l05l19k4K92L33
6161C00J3l00k97j5K73K87M5k56l00o5K65L19O9k80l43m7K97L16L6k72l05m7K41
$$ plain form
6012 128 -206 -339 -147 193 353 133 -213 -353 -152 209 349 141 -198 -354 -136 186 346 158 -177 -336
6032 -336 -157 173 343 183 -173 -343 -186 174 364 174 -175 -346 -165 174 331 171 -161 -333 -191 146
6052 146 332 199 -147 -358 -217 143 348 197 -156 -350 -207 140 327 201 -133 -329 -217 115 329 228
6072 228 -102 -343 -241 115 344 231 -128 -351 -232 121 334 216 -100 -325 -232 88 328 247 -83 -344 -250
6093 -250 92 334 247 -106 -327 -234 90 324 247 -73 -321 -254 54 323 276 -60 -329 -270 67 318 256 -52
6115 -52 -311 -276 40 305 283 -34 -322 -277 39 324 288 -47 -322 -279 28 302 272 -24 -295 -282 14 296 306
6138 306 -2 -308 -311 -6 310 292 -19 -296 -293 0 275 292 24 -281 -309 -37 284 323 18 -301 -325 -33 300
6161 300 313 13 -284 -299 -26 261 306 50 -250 -315 -50 269 338 58 -285 -332 -35 281 317 45 -260 -307 -66
6184f6L11P1k32l28r5K48L34J05k75l31q1K66L20O5k20l24r3K30L21R6k13l37
6206b28j06K21L40J24k43l41j06K30L35R9k02l29j36J98L49J32k06l40j35K10
6226a34L37J36k03l34j38J92L32J49j80l45j57J84L60J55j87l41j68J75L44J60
6246C37j61l44j63J52L40J86j57l53j87J69L50J79j69l50j72J50L41J81j41l26
6266a38j98J16L37K25j23l50k20J42L56K00j50l32j95J26L27J97r6l22k20Q0L26
6287H8K58j07l40k51J15L52K30j30l24k12J02L08K26p9l03k58P0L20K67o5l42
6308g5k61Q0L36K53q3l20k41N6L09K52m5l12k59K5L32K81l5l35k83M7L15K84n2
6331B69l01k66J6L07K69j6k88k81JK97K91ml05k83jL04L03j9l01k80%K92K84J0
$$ plain form
6184 -66 245 316 84 -244 -339 -91 243 348 73 -258 -339 -73 247 312 92 -232 -325 -95 226 322 109 -228
6206 -228 -334 -113 227 351 108 -233 -339 -109 226 325 123 -206 -342 -144 205 337 131 -209 -344 -134
6226 -134 203 339 136 -198 -336 -144 188 337 157 -188 -345 -161 199 354 167 -174 -342 -167 177 337
6246 337 176 -168 -331 -179 161 347 190 -163 -350 -181 169 348 179 -171 -343 -193 148 329 188 -138
6266 -138 -336 -220 117 342 219 -131 -351 -209 147 347 197 -135 -330 -204 123 320 224 -98 -318 -238 88
6287 88 346 239 -101 -352 -237 115 345 215 -109 -321 -219 89 315 236 -67 -325 -255 65 332 267 -75
6308 -75 -336 -256 80 333 250 -70 -311 -255 54 306 261 -51 -310 -285 47 328 293 -42 -325 -278 37 321 269
6331 269 -32 -298 -282 25 294 278 -10 -291 -290 7 298 294 -11 -294 -295 9 312 293 -8 -288 -288 4 288 298
6355B98k76k94l3K82L01L4k73l21l3K89L20J7k90k93k2K64L02M1k62l13m8K52
6377e8L10O3k42l30q0K67L36N9k67l18o1K54L20N3k17l24q2K30L19J00k33l28
6399b29j06K46L29R2k42l39p1K31L02J08k01l23j20J87L50J33k19l46j32K27L45
6420B22J11k14l24j21K01L13J39j74l41j54J90L52J50j99l45j40J89L42J35j80
6440A52l20j41J61L10J76j56l43j85J75L47J70j68l53j46J52L23J65j34l26j91
6460c32J26L29K07j28l42k14J38L58K03j62l24j89J40L25J82j02l13k27R5L39
6480A09K34j01l53k33J32L41K00j22l12k02J01K90K12o1l11k43P7L14K53p2l49
6501i6k39Q8L39K26q9l04k27O7K88K51m8k94k67L6L23K70m9l26k65O2L22K32m9
$$ plain form
6355 298 22 -272 -305 -23 278 312 39 -282 -315 -26 294 311 21 -272 -294 -30 272 313 51 -262 -310 -58
6377 -58 252 315 73 -257 -337 -70 266 325 58 -260 -321 -67 253 306 89 -235 -317 -87 232 332 99 -229
6399 -229 -335 -89 240 332 90 -249 -320 -89 213 321 120 -203 -323 -136 214 347 128 -218 -350 -123 222
6420 222 333 119 -205 -326 -125 188 327 153 -188 -342 -152 200 350 151 -194 -334 -145 197 332 152
6440 152 -168 -309 -148 162 338 182 -161 -346 -171 176 346 178 -175 -321 -169 154 319 185 -141 -332
6460 -332 -206 123 330 202 -140 -354 -216 142 345 183 -141 -330 -190 135 317 215 -98 -325 -230 109
6480 109 343 242 -111 -344 -212 129 329 207 -105 -307 -206 84 296 235 -76 -319 -242 72 325 253 -96
6501 -96 -335 -247 92 318 229 -75 -302 -235 53 304 256 -38 -305 -269 54 324 275 -51 -316 -254 68 300 251
6524B51k92k44L4K76K60lk92k92J6K98K95j7l20k71L1K91K61k9k62k73LK81K80
6547B82J2k90k83j3K85K98J3k84k95j0K79K75K9k72k87l4K57L12L1k57l04n4K71
6570c9L01M7k57l02o1K62L00N1k38l16o6K61L03O2k53k87p1K23L22P1k26l17q9
6593c19K35L21Q6k34l12r1K25L14Q7k25k96r4J87L18J05j97l12j35K17L26J23
6614C29k06l28j22K17L11J11j86l12j32J77L11J50j70l28j49J70L33J54j79l37
6634a86j33J78L15J35j59k93j62J41L23J65j42l27j72J34L38J72j59l20j59J37
6654a74L07J86j37l06j87J25L08J90j16l13k01J07L36J97j20l22j95J20L00K01
6674C06j10l03j95J02K95K10r2k96k21Q2L09K21q0l02k32P9L09K21o5l06k20P1
$$ plain form
6524 251 -41 -285 -251 25 285 282 -10 -302 -286 12 307 290 -30 -301 -270 21 282 253 -9 -282 -279 2 282
6547 282 294 4 -279 -292 -7 291 304 20 -275 -285 -6 269 298 26 -261 -295 -38 274 305 48 -256 -310 -39
6570 -39 262 309 52 -250 -311 -49 251 302 64 -252 -318 -57 246 308 55 -232 -303 -80 242 313 87 -230 -319
6593 -319 -84 237 323 89 -223 -314 -89 225 312 87 -209 -303 -116 202 307 110 -202 -337 -120 206 329
6614 329 123 -205 -327 -110 201 312 126 -186 -318 -141 170 320 150 -178 -327 -157 176 330 151 -186
6634 -186 -319 -141 174 309 150 -143 -305 -164 159 324 182 -145 -317 -183 155 327 168 -152 -311 -174
6654 -174 133 319 182 -124 -311 -186 122 312 196 -117 -318 -211 125 322 202 -120 -315 -195 105 306
6674 306 196 -107 -302 -200 95 305 213 -83 -304 -222 87 308 228 -74 -306 -227 82 303 238 -68 -288 -217
6696b17K76K39p0k81k32L3L00K46m0l02k42M0L09K41n3l01k30M1K90K25l1k60
6718a9k55K4K72K62kk99k71K5K90K62k1k94k29mK62K62lk62k57k6K71K73J5k61
6742A5k87pK80K59Lk44k64k8K39K71L7k36k80m0K43K94L3k47k86l4K49K72K5k12
6766E5k71n9K12K92O9k25k99p0K39K94O3k39k81m8K04K59Q1j93k73j00J89L12
6788B11R5k07l10r3K22K98P3j99k80r0J84K67J24j73k87j41J81L13J30j94l13
6809a89j14K01K83R2j65k74j04J32K78J58j47k97j61J57L18J48j73l20j22J68
6829a31K94J21j43k76j27J03K78J77j04l03j94J27L25J80j59l03j49J43K75J39
6849B73j14k67j63J03K50K00p7k99k06J03L13J85j22k99j65J11K78J66q9k53j84
$$ plain form
6696 -217 59 298 228 -53 -285 -252 48 294 254 -48 -290 -250 59 300 247 -54 -284 -243 47 272 241 -19
6718 -19 -274 -250 22 284 282 -17 -288 -263 27 289 268 -26 -255 -259 3 265 262 0 -257 -283 -12 261 276 15
6742 15 -272 -279 1 260 263 19 -245 -273 -34 237 274 38 -242 -282 -39 255 288 41 -245 -279 -30 242 267 55
6766 55 -216 -275 -63 229 298 73 -226 -296 -57 237 300 61 -220 -268 -64 195 276 83 -190 -290 -101 211
6788 211 306 99 -211 -304 -82 216 289 90 -190 -280 -96 171 295 122 -165 -306 -125 188 318 124 -189
6809 -189 -303 -102 181 273 108 -166 -270 -138 140 298 151 -146 -307 -150 168 316 143 -177 -299 -131
6829 -131 163 284 141 -135 -262 -159 119 296 192 -111 -305 -178 147 327 168 -135 -284 -141 134 273
6849 273 159 -108 -271 -168 82 282 205 -94 -300 -197 116 301 179 -120 -285 -174 104 270 181 -72 -256
6870b56N1K72K08n2k86k24P7K89K10r4k69j95Q2K52J95n6k50j99K2K71K08k9k68
6893d1k24L5K84K22n2k70k18M9K60K06k3k37k42K1K46K35j9k50k23J8K47K28k
6916B50k58k32JK56K34j1k42k22lK22K40J0k23k49k1K22K63J4k32k57j1K31K44
6939B26J6k25k44rK12K31M2k16k36m8K06K67M4k27k52m0K20K47M6k21k42m5J90
6962e8K53P0j92k53p7J92K45R0k01k61o8J90K65O4j85k51o8J69K52Q6j56k73q7
6985b54J70K52J07j76k60j00J72K52J01j52k63r6J49K52J20j58k55j15J50K59
7005A55J09j43k59j12J34K50J34j34k66j23J19K70J31j35k66j10J28K43J32j16
7025A41k47j51J07K58J52q4k82j55J17K62J49j19k67j28J05K39J40p8k48j48P5
$$ plain form
6870 -256 -205 67 275 223 -63 -287 -210 79 289 195 -74 -269 -187 65 260 204 -46 -245 -223 48 256 227 -41
6893 -41 -265 -230 54 276 224 -46 -264 -215 45 251 228 -9 -251 -230 16 251 232 -18 -241 -223 24 252 250
6916 250 -8 -240 -239 17 251 240 -2 -224 -227 -5 235 245 22 -227 -248 -26 237 251 19 -238 -249 -18 226
6939 226 242 17 -227 -236 -24 207 249 33 -203 -251 -45 222 266 39 -213 -253 -33 214 260 39 -203 -248 -58
6962 -58 195 265 73 -180 -257 -65 180 270 69 -192 -260 -70 195 259 74 -177 -245 -76 176 262 106 -167 -254
6985 -254 -84 168 275 99 -161 -261 -89 163 264 112 -151 -247 -98 154 274 116 -139 -254 -104 155
7005 155 264 121 -138 -250 -116 134 268 134 -132 -255 -136 134 265 130 -136 -246 -118 125 257 141
7025 141 -106 -257 -150 108 260 176 -106 -261 -144 118 267 148 -119 -247 -142 97 237 159 -89 -237 -162
7046a62K52J61o7k56j77P8K73J63r7k41j58O6K38J66o1k28j86N6K40J94o6k48
7068f0j79N7K51J68o0k32j75N0K26J76k5k28j92K5K31K05l8k45j79M5K13J97k8
7091B03k23j93K0K06K06j2k30k03J9K32J99l4k11j90J4K01J93J4k03k15j2K09
7113a0K15J8k20k04%K07J96%j92j92k2J88K04L8j87k30n3K07K38K1k05k21oJ93
7137a7K06Oj55k06l1J30K27O2j55k43n8J93K32M2j94k17k1J68J95M0j40j96p8
7160b10J35K19R0j41k56p0J60K40P1j84k15m8J44J98P8j27k05r5J19K20J25j39
7182A09k51j01J59K43O7j44k21p2J37J90R0j05k04j14J05K34J13j02k54j04J26
7203i9K30R2j21k18q4J09J99J03r9j91j38Q8K21J39j04k28j24J02K20J19r8k10
$$ plain form
7046 -162 90 251 184 -72 -249 -171 102 265 168 -73 -231 -165 73 239 178 -50 -236 -180 60 254 188 -60
7068 -60 -239 -182 69 237 177 -55 -230 -180 46 222 197 -31 -223 -198 33 238 200 -45 -224 -179 34 231 203
7091 203 -20 -213 -193 13 219 207 -23 -226 -207 25 224 190 -21 -211 -197 4 197 211 8 -207 -219 -10
7113 -10 205 223 3 -201 -201 6 202 202 10 -182 -204 -16 188 226 39 -191 -244 -37 201 222 17 -204 -210 -17
7137 -17 189 195 40 -166 -197 -67 160 222 67 -176 -234 -41 191 233 39 -178 -199 -31 164 204 64 -132 -210
7160 -210 -75 144 234 93 -163 -233 -73 167 238 54 -161 -209 -65 133 211 84 -121 -216 -97 123 248 109
7182 109 -142 -243 -84 159 226 82 -139 -211 -74 116 206 101 -103 -217 -112 122 235 133 -121 -225 -99
7203 -99 131 223 102 -116 -200 -91 108 211 112 -79 -217 -129 92 231 127 -101 -225 -123 97 216 118 -92
7225i2j24Q8K14J21p5k08j30O0K13J52p3k13j45P2K17J22n9k18j19N3K13J28n6
7248A41j90j55N9K01J45m7k02j63N6K02J56n0k02j61M3K03J59m5j83j56K4J97
7270C2J53j5j89j74K9J85J77k3k04j60K9J92J50j6j66j80JJ91J72jj83j85NJ80
7294@J75lj79j69LJ78J56J0j58j88oJ63J82J7j74j78j0J77J74J1j63j67k0J55
7318a4J75L4j53j99k0J42K02L3j74j81l3J62J75L2j46j65n4J33J88N5j39k04n8
7341b09J53K02L8j52j84k8J32J75M6j11j82n9J10J93Q4j28k06o8J37K04L8j21
7363F4j77o3J21J68N8r7j85q6J08J91R8j16k09q0J18J96O8j00j91o7R7J69R1q0
7387I6j72j09P3K09J08j03j97j05J16J78Q6q5j70r6P0J81J01o1j79j25P4J86J21
$$ plain form
7225 -92 -216 -128 86 207 132 -76 -206 -146 67 219 146 -67 -212 -140 77 199 140 -78 -197 -144 69 197 141
7248 141 -49 -204 -145 56 201 154 -48 -211 -155 47 203 153 -49 -210 -167 36 195 150 -33 -189 -165 32
7270 32 185 170 -19 -193 -164 21 198 175 -29 -189 -160 32 182 166 0 -180 -179 12 184 183 0 -185 -180 0
7294 0 175 172 -7 -176 -173 5 161 171 13 -175 -181 -18 164 181 7 -171 -181 -4 170 181 18 -149 -169 -14
7318 -14 161 195 42 -157 -177 -35 167 200 26 -155 -188 -26 149 181 35 -130 -184 -51 137 192 53 -151 -209
7341 -209 -56 146 184 32 -152 -180 -48 127 173 62 -120 -179 -69 124 208 80 -126 -194 -57 147 185 64
7363 64 -113 -176 -55 113 171 74 -111 -197 -89 102 200 84 -125 -205 -87 109 177 77 -114 -181 -84 85 176 96
7387 96 -76 -185 -112 97 205 102 -95 -200 -84 94 180 95 -75 -171 -101 80 181 120 -59 -184 -110 76 197
7410A97q5j86j10P3J76J04o2j66j18N9J84J11n7j79j27P1J87J10o0j69j21M7J73
7433E2J16m1j65j30N0J66J33n0j76j26N3J67J04k5j58j26K7J49J41k1j62j48K1
7456a49J85J29k9j69j23L5J55J11qj30j56MJ47J59rj57j59J5J70J51l2j63j17
7479a40J8J28J24J3j33j33l5J43J73J4j60j73PJ64J43jj45j46QJ19J35K1j15j59
7503a30k7J18J80K1j48j58oJ40J45Pj29j32j7J15J32L6r8j63l0J01J70M3j29j65
7527a24l3J32J52L1j32j34m8J09J43O1j02j62m7R0J67O5j15j66n9J07J77M6r7
7550F1j51o0R7J43N9p7j63o5Q2J68P4r6j53q6J05J58O7r1j51o8P3J57P2p3j54
7575g2q4P1J61Q6q7j47q5O7J56P8o4j47q9O3J56P7n2j45p9M5J44R8n6j48r6O2
$$ plain form
7410 197 112 -74 -184 -111 65 169 107 -59 -177 -118 66 177 120 -59 -186 -115 72 182 122 -47 -168 -121 52
7433 52 168 127 -38 -168 -118 48 181 131 -45 -171 -118 49 153 128 -30 -156 -129 20 161 140 -22 -170 -149
7456 -149 36 165 136 -33 -156 -121 34 145 137 7 -149 -145 2 161 152 -5 -164 -149 21 172 140 -23 -140
7479 -140 -122 6 130 143 10 -123 -158 -15 158 172 12 -161 -154 10 153 152 7 -139 -131 -12 123 144 29 -130
7503 -130 -157 -39 141 162 14 -144 -150 -10 135 142 13 -119 -136 -21 111 147 49 -114 -144 -43 127 170 41 -124
7527 -124 -157 -25 127 158 26 -108 -156 -47 96 157 55 -107 -154 -64 103 168 53 -113 -172 -65 112 158 61
7550 61 -90 -150 -53 90 149 72 -91 -156 -74 94 168 72 -81 -167 -62 96 163 72 -79 -147 -74 83 155 82 -72
7575 -72 -156 -85 76 162 75 -72 -157 -90 66 144 80 -67 -156 -93 63 140 88 -57 -136 -91 53 151 95 -53 -149 -87
7601h7J53Q2n6j39r6N5J33J04m7j40j07M9J36J00k5j62j08N7J37J03n7j21j12
7624a48L7J33J08k6j21j22K9J34J19k3j53j03L4J45J03l0j35r9NJ24J31j5j41
7647a4j21J3J42J23j9j46j04K0J13J05Pj21j16NJ03J40Oj32j37jJ39J25j0j22
7671bj14J2J02J07K0j03j16m0J17J36L3j32j30j7J34J17j2r7j15rQ5J09L9q0j29
7696h5m6R5J40L2j04j43j8J08J29J4r8j20k1Q0J14L5o4j25o1R4J31N8j14j34l1
7721a34J14J10L6r0j10l9O5J12N6n7j30p1Q5J27N8q8j35m3Q5J26M0p7j13m1M9
7746f5J19O7n1j33o9O6J27O7p0j33n5P4J16O1m2j30p0N8J30O2n3j30p0N2J18P2
7772A18m6j22p8N2J25P1m7j24o8M5J24O8n7j04p6M0J21P7l2j28p4L7J15R2m3j12
$$ plain form
7601 -87 66 148 92 -47 -143 -88 45 149 102 -38 -145 -96 40 140 115 -47 -155 -98 39 142 85 -36 -148
7624 -148 -111 22 130 104 -17 -139 -110 24 143 120 -33 -136 -102 43 146 116 -19 -118 -113 11 142 127 -14
7647 -14 -135 -122 20 143 124 -22 -126 -106 7 112 119 -2 -118 -113 -10 130 136 4 -133 -134 5 130 120 -2
7671 -2 -116 -104 -2 105 125 22 -94 -134 -17 119 152 20 -110 -127 7 124 112 15 -100 -109 -24 85 124 44 -85
7696 -85 -131 -36 104 136 32 -111 -129 -21 108 122 24 -96 -117 -37 77 112 48 -77 -138 -44 87 145 31 -103 -134
7721 -134 -20 90 126 36 -74 -113 -48 64 120 63 -67 -138 -53 74 132 44 -91 -134 -49 77 117 40 -73 -114 -65
7746 -65 54 121 70 -63 -132 -66 61 128 58 -75 -130 -56 60 121 79 -51 -121 -63 67 129 76 -54 -124 -72 46 118
7772 118 72 -50 -128 -76 49 120 73 -51 -119 -74 50 118 61 -43 -119 -79 42 119 87 -41 -115 -78 37 129 86 -26
7798b6j04N7J13P3l5j04p7K8R1Q7j1j15q9J9J23R4l7j18r3L4J14P4k6q7q2J1J00
7825A4R6j2j04j00mJ10J07j1j10r0J5J06Q2j1r0q7kQ6R8Rr5j11jJ14R6Kj07r9
7853i9QQ3R7Jq7r4pP8R6K5q5j02k3R4J07Pp4j19jQ3R6J7q0r0k6P2J11J9q4j00
7883g7k9P6J20Rp3j05l1Q8Q8L4p8r4k4N7J06K6o6r0m4O5J09K8p0r0n0O6J14L4
7911I9o5r9l6N6R9M6n7r9m3M9J04P0p4j03n0N4R9N2n1j02n2N3R9M5m9q8o3M5R8
7940C7O2n2j03l4M1Q6N0m9q3m6L1R6M7j7r7o3L9R3O1l9r8m5K8R4M2k1q7o5K8R1
7970B7O7l5q3p6L5R9N4k1j02m5K1Q1N4pp9p7JR9Q3j6r9p6L2Q5P0k4q2n7LQ3O9
8001H4pp4q3qJ07O9j5q9p8L4O9O8j8o6n7qO9P6Mp0r0MQ3Q7j7q5o4OP2O5Lo6p1
$$ plain form
7798 -26 -130 -73 40 113 78 -26 -103 -75 16 103 92 -23 -112 -93 30 124 87 -31 -124 -90 24 98 72 -15 -97 -86 14
7825 14 110 98 -6 -106 -110 0 107 96 -14 -104 -89 17 99 88 -2 -89 -91 -5 93 102 7 -104 -105 9 105 107 0 -99
7853 -99 -91 -8 89 90 3 -91 -98 -20 76 101 16 -86 -109 -15 92 99 25 -94 -95 -12 84 101 21 -69 -95 -23 88 107 23 -77
7883 -77 -106 -30 90 99 26 -79 -110 -22 66 100 22 -72 -96 -39 67 93 27 -63 -107 -42 67 95 25 -65 -115 -49 65 99
7911 99 34 -65 -101 -45 54 100 43 -56 -99 -50 54 124 50 -53 -103 -49 50 102 51 -51 -103 -50 49 94 45 -43 -106 -61 37
7940 37 99 47 -56 -90 -49 37 87 38 -45 -91 -60 36 83 66 -31 -94 -55 38 99 60 -38 -83 -55 39 81 60 -27 -92 -64 27
7970 27 94 59 -24 -100 -65 34 88 67 -35 -80 -59 22 76 69 -10 -87 -86 13 96 80 -19 -95 -63 22 92 68 -14 -71 -68 15 84
8001 84 77 3 -80 -88 19 88 73 -16 -94 -60 9 77 59 -7 -64 -72 -3 73 77 7 -83 -79 4 91 74 -11 -75 -69 3 68 71 5 -66
8034f6j3N8Q9J8p4q8j6Q5Q9Pr6o4JO4O5J3n7o5k7N1R1J7p0q6k1P7R5Pp6o9j5N3
8066b3P5J5n3o6l1M7R6L2o6q8k5P7O8K1o1p1k4O4O7J4l4q8k8N7Q3K6n2q0l3N0
8096c1P2L1m8p5l1M2Q3K1m0o4m8M7Q4L6l3p8m6M0P9L2l7o4m8M2P3M5m3o9m0L6
8126c2O9L9k3p1o5L4Q3L0j5p4m3K0P3M4k9o8m0K4O9M4k7q0m0J9Q3M9k1p6n1J7
8156e8P3O1k1p0m9J5P9N3k4o8n3PP1M9j9p2m0J1P0M4qp2m8K0N3O0j4o1n6K1M9
8187CO4k3m5o3
$$ plain form
8034 -66 -79 -21 68 86 12 -76 -92 -7 82 89 -7 -71 -70 -6 59 72 15 -50 -77 -26 65 82 12 -74 -95 -18 77 84 8 -61 -76 -23
8066 -23 52 67 14 -52 -83 -36 60 92 26 -62 -87 -10 58 79 18 -53 -77 -13 54 68 34 -54 -82 -25 58 84 32 -48 -81 -31
8096 -31 41 72 24 -51 -82 -40 43 64 24 -40 -88 -41 43 79 46 -32 -78 -38 41 73 36 -28 -76 -34 39 84 41 -28 -68 -32
8126 -32 37 76 53 -18 -83 -49 34 64 49 -25 -68 -48 25 69 40 -28 -68 -44 25 69 42 -38 -78 -59 24 73 52 -24 -75 -58
8156 -58 15 76 55 -15 -64 -49 30 83 59 -9 -62 -55 16 65 46 -26 -66 -55 15 59 51 -21 -69 -49 4 64 50 -11 -67 -46 3
8187 3 67 44 -1 -64
8191f4
$$ Imaginary data points
##PAGE= N=2
##DATA TABLE= (X++(I..I)), XYDATA
0@%%%%%%%%%%%%%%%%%%Qj6J6j6J6j6K4l2L2l8M6m8N6o5P3q6R5j05J20j36J52j69
40h9J86k07K31k55K82l11L43l79M18m59N05n56O13o77P49q30R21j027J148j290
60f84J464j677J944k292K769l464M569o624J1707m7873q4318Q1342J08495L2291
74I7649p4321q1750k2341M6326O4166M1460j9854p2141o6829J8162R6890P7112
86A04529l5700j10437o2541N3782J02926M2341n2151q1558l5474L3519O7374M6609
98G3219j6377p1890o4436J3253Q5638O9802k5202r4709o1449L5525Q8190M7636
110G9200l3885p3649m3582K1143O4539N2323q682o7248o3473Q213P7639O7523
122H0061j5974q2396n9785K3813P7288N0056k1887o5806m6910J1742N8229N2875
$$ plain form
0 0 0 0 0 0 0 0 0 0 0 0 0 0 0 0 0 0 0 0 8 -8 8 -8 8 -8 16 -16 16 -22 24 -24 32 -33 40 -46 49 -56 64 -72 80 -89
40 -89 97 -110 121 -134 148 -163 180 -199 219 -240 265 -291 322 -355 394 -436 485 -542 606 -684
60 -684 780 -897 1047 -1245 1524 -1940 2629 -3995 7712 -40161 -124479 -43137 65358 97649
74 97649 23328 -58422 -80763 -34437 29729 71189 51335 -20806 -87635 -69473 27417 104529
86 104529 68829 -41608 -104149 -50367 52559 94900 42749 -38809 -74283 -40764 26610 73219
98 73219 56842 -15048 -79484 -66231 19407 89209 64007 -30702 -92151 -56626 31564 79200
110 79200 45315 -28334 -71916 -50773 13766 66089 57407 -9841 -73314 -65101 12538 80061
122 80061 64087 -18309 -78094 -54281 23007 73063 51176 -14630 -61540 -49798 8431 61306
134F1306k621o0329o2205N88O7051O5011o660p1855o0918J2260O8754N3203j2485
147E1100o0982m9417O593N4521N1979Q04n3053n7243l683N6652O1170K408n9622
160A227n9977J247N9715N6274k537n5989n2904M86N1401N2246L219m9061n4380
173d9033o474M8802N6190O949n0067n6881o436N0029N5623N732m8813n4047o235
186e4661M6727N3321P919m4825n3321r263M4145N4008J0255m3559n3682j0445
198e3381M2898N3247J1012m1520n2682j2018M0208N2504J3018l9348n2800j3961
210e2823L8658N2527J4177l8115n2201j4578L6895N1354J5242l5566n0988j6254
222e1672L4311N0979J7382l3476n0949j7856L2960N0845J8264l2036n0010j8640
$$ plain form
134 61306 58685 -1644 -63849 -63261 3790 68801 62141 -9714 -70632 -58372 10382 63585 51100
147 51100 -9882 -59299 -52706 1815 53794 54598 1545 -55698 -59381 -2729 58441 60849 1227
160 1227 -58750 -57503 2212 58486 55949 -40 -52944 -52458 -1057 51189 54408 5347 -49033
173 -49033 -55507 -6705 49485 56434 6367 -50514 -56950 -6921 48702 54434 5621 -48426 -54661
186 -54661 -7934 45387 53306 8481 -44840 -54103 -9958 44050 54305 10746 -42936 -53381
198 -53381 -10483 42764 53776 12256 -40426 -52444 -12236 40268 53286 13938 -38862 -52823
210 -52823 -14165 38362 52539 14424 -37777 -52355 -15460 35894 51136 15570 -35418 -51672
222 -51672 -17361 33618 51000 17524 -33425 -51281 -18321 32524 50788 18752 -31258 -49898
234d9898L0784M9629J9680k9542m9576k0708K8901M9791K1005k8690m9496k0966
246d9086K7995M8271K0807k6495m7164k1842K4481M6721K3495k3130m7583k4845
258d8375K3202M8399K4949k3796m8048k3719K3624M6296K3119k1751m4205k3840
270d4145J9060M3592K6124j7378m4614k7937J7479M5989K7910j8645m5817k6554
282d4936J8668M3867K5350j6905m1617k6134J4195M0768K8146j2399m1690k9852
294d2539J2535M2765K9828j3315m2443k8499J3221M0591K7826j1412l8806k8524
306c8772R306L8295L0105q156l8834l0967Q118L9122L0698q367l8376k9939P635
319c0132L6899K9730o168l5728l0480M660L5423L1364l915l5545l1776L863L5395
$$ plain form
234 -49898 -19114 30515 50195 20653 -28923 -49631 -20730 29061 50066 21376 -28120 -49086
246 -49086 -21091 27180 47987 21492 -25672 -47514 -23033 23688 47183 24053 -23530 -48375
258 -48375 -25173 23226 48175 24379 -23669 -47388 -23764 22532 45651 23900 -20305 -44145
270 -44145 -25085 18507 44631 27253 -17361 -45298 -27819 18170 46080 27435 -18382 -44936
282 -44936 -26268 17599 42949 26044 -15573 -41707 -27512 13256 41402 29003 -12687 -42539
294 -42539 -30004 12761 42589 29274 -13169 -41668 -28447 12144 39970 28558 -10248 -38772
306 -38772 -29466 8829 38934 30778 -8056 -39023 -30905 8217 38915 30548 -7828 -37767 -30132
319 -30132 6767 36497 30329 -5399 -35879 -31219 4204 35568 31653 -3892 -35668 -31805 3590
332C590L1344l653l4393l0810K826L3133L0927j436l2399l1612N14L2359L2092
345C2482l05l2316l1823K77L1557L1210L23l0351l1092j573K9486L1673K552k9436
359B664l2266k724K9588L2001K458k8963l1090k823K7523L0622M172k6243l1207
372b6288n628K6080L2264O027k6616l2410n451K6615L1353N086k5246l0161o066
385c0441K3410L0136P821k2466l1246r028K2858L2131Q873k3481l1844q063K3117
398h223L0526P952k1610k9521q988J9961K9621J0613j9263l0563j1505J9545L1235
411A9780J1353k0032l0828j0667J9591K9696J0562j8249k8732j1512J6767K8830
423A6559J2844j6147k9582j3642J6448L0046J3344j6668k9535j2809J6145K8404
$$ plain form
332 3590 34934 31281 -3112 -33922 -31096 2037 32964 31528 -871 -32483 -31969 390 32482
345 32482 32177 -139 -31962 -31685 -128 31082 31405 1054 -30038 -31611 -2125 29548 32100 2664
359 2664 -29602 -32326 -2738 29263 31721 2758 -28332 -31155 -3632 26990 31162 4919 -26288
372 -26288 -31916 -5836 26428 32455 5839 -26571 -32022 -5407 25946 31032 5786 -24375 -30441
385 -30441 -7031 23105 30926 8460 -22786 -31814 -8956 23175 32048 8567 -23277 -31340 -8223
398 -8223 22303 30255 8645 -20876 -29864 -9903 19718 30331 11068 -19495 -31000 -11455 19780
411 19780 31133 11101 -19727 -30394 -10803 18893 29455 11206 -17526 -29038 -12271 16559
423 16559 29403 13256 -16326 -29968 -13520 16526 29870 13202 -16333 -29142 -12997 15407
435A5407J2883j4771k7735j3822J3599K7868J4928j3219k8496j5281J3439K8534
447A3334J4974j3421k7831j4614J2572K6950J5005j1476k6578j5784J0655K6804
459A0590J6426j0500k6936j6511J0442K6679J6273j0025k6012j6327R259K5494
471H852J6697q447k5280j7224P988K5227J7453p675k5080j7492P361K4642J7499
484B4521o823k4199j7648O195K3800J7991n643k3673j8202N291K3456J8297m989
497A8374k3072j8243M507K2618J8365l945k2177j8563L377K1942J8787k955k1732
510b717j8958K652K1510J8899k364k1121j8877J950K0640J8879j440k0234j9032
523b0213R51J9865J9176m82j9613j9269J18J9333J9371K30j9058j9363m95J8772
$$ plain form
435 15407 28290 13519 -14216 -28038 -14439 13429 28357 15138 -13358 -28639 -15200 13334
447 13334 28308 14887 -12944 -27558 -14986 11964 26969 15493 -11085 -26869 -16214 10590
459 10590 27016 16516 -10420 -26931 -16489 10190 26463 16438 -9574 -25901 -16642 8852
471 8852 25549 17102 -8178 -25402 -17414 7813 25266 17591 -7489 -24981 -17620 7022 24521
484 24521 17698 -6501 -24149 -17954 5846 23837 18194 -5479 -23681 -18390 5066 23363 18374
497 18374 -4698 -22941 -18434 4184 22549 18604 -3573 -22136 -18759 3183 21970 19015 -2717
510 -2717 -21675 -19023 2487 21386 19022 -2099 -20976 -19026 1614 20493 19053 -1181 -20213
523 -20213 -19262 603 19779 19297 -316 -19585 -19467 -134 19237 19467 409 -18954 -19449 -677
537f77J9345P61j8362j9173j136J7835J9108J672j7325j9275k293J7084J9557
550A7121K591j7031j9679k682J6898J9438K685j6449j9045l044J5706J8887L712
563A9108j5075j9137m403J4891J9582M718j5012j9682m562J5018J9267M427j4412
576D728j8665m760J3509J8471N612j2843j8886o359J2810J9385O506j3142j9401
589a3035o147J3018J8747N963j2312j8094o441J1278J7996P342j0734j8445p986
602a8850J0793J8952Q003j1071j8780p609J0963J8145P463j0151j7519p931R312
615h280J7436Q651q797j7804r164Q834J7998R173q917j7913q953Q702J7370Q900
629A7236q150j6953r200P475J6800R711p085j6885j0008O893J6971J0112o829
$$ plain form
537 -677 18668 19429 1067 -18106 -19242 -1407 17701 19373 2048 -17227 -19520 -2436 17121
550 17121 19712 2681 -16998 -19680 -2782 16656 19341 2892 -16153 -19197 -3491 15396 19108
563 19108 4033 -15104 -19507 -4616 14966 19684 4672 -15010 -19572 -4554 14713 19140 4728
576 4728 -13937 -18697 -5188 13283 18895 6052 -12834 -19193 -6383 13002 19508 6366 -13035
589 -13035 -19182 -6164 12583 18546 6234 -11860 -18301 -7023 10973 18315 7581 -10864 -18850
602 -18850 -8057 10895 18898 7827 -10953 -18562 -7599 10546 18009 7858 -9661 -17592 -8280
615 -8280 9156 17807 9010 -8794 -17958 -9124 8874 18047 9130 -8783 -17736 -9034 8336 17236
629 17236 9086 -7867 -17067 -9592 7208 16919 9834 -7051 -17059 -10166 6805 16917 10088
642A0088j6734j0019O524J6409J0101o020j6092j0382N615J6068J0602n398j5969
655e207j0673N209J5690J0633m804j5379j0875M320J5227J1161m052j5321j1311
668a5382M034J5215J1126l943j4793j0899L479J4204J1125k750j3973j1616K321
681a1852J4240J2032k447j4438j1784K690J4134J1281k491j3334j1095J670J2687
694A293J1546q70j2729j2277O37J3179J2442r95j3358j2025J315J2805J1403r42
708A1424j1974j1279J36J1424J1792O26j1499j2377p62J1893J2590M28j2039j2109
722a1726j33J1536J1522M03j0701j1363j233J0121J1810J955j0218j2445k073
735a2545J0641J2532J663j0741j2024j372J0178J1401J752r346j1342k509Q894
$$ plain form
642 10088 -6646 -16665 -10141 6268 16369 10349 -5743 -16125 -10510 5558 16160 10762 -5207
655 -5207 -15880 -10671 5019 15652 10848 -4531 -15406 -11086 4141 15302 11250 -4071 -15382
668 -15382 -11348 3867 14993 11050 -3743 -14642 -11163 3041 14166 11416 -2557 -14173 -11852
681 -11852 2388 14420 11973 -2465 -14249 -11559 2575 13856 11365 -1969 -13064 -11394 1293
694 1293 12839 11969 -760 -13037 -12400 779 13221 12226 -1132 -13157 -11842 963 12366 11424
708 11424 -550 -11829 -11693 -269 11523 12149 650 -11727 -12489 -596 11994 12422 383 -11726
722 -11726 -11859 -323 11199 11602 901 -10462 -11695 -1574 10236 12191 1973 -10472 -12545
735 -12545 -1904 10628 12291 1550 -10474 -11846 -1668 9733 11485 2139 -9203 -11712 -2818
748b818J1831L131r066j2324l078R426J2268K691r354j1723k555Q747J1265L009
762A1450q066j1342l657P795J1738L992p959j1964l905Q069J1753L721p856j1400
776g631l760P369J1159M124o954j1194m515O781J1421M687o813j1430m645O790
790d611J1255M560o512j0970m702O129J0840M987n815j0918n279N711J0991N330
804A0996n668j0922n293N518J0672N336n193j0504n500M890J0434N745m677j0454
818d620n888M594J0427N918m479j0286n900M261J0104O011m007r986o174L788
832f237R965O263l665r898o316L545R754O311l346r618o399L123R505O492k912
847F567r441o585K808R340O623k653r206o637K454R089O745k303r002o759K163
$$ plain form
748 -2818 9013 12144 3078 -9246 -12324 -2898 9370 12061 2707 -9016 -11571 -2824 8441 11450
762 11450 3384 -7958 -11615 -3820 7918 11910 3951 -8013 -11918 -3849 7904 11625 3769 -7631
776 -7631 -11391 -4022 7137 11261 4307 -6887 -11402 -4621 6800 11487 4674 -6756 -11401 -4611
790 -4611 6644 11204 4692 -6278 -10980 -4851 5989 10976 5161 -5757 -11036 -5325 5666 10996
804 10996 5328 -5594 -10887 -5369 5303 10639 5446 -5058 -10558 -5668 4766 10511 5834 -4620
818 -4620 -10508 -5914 4513 10431 5952 -4334 -10234 -5973 4131 10142 6135 -3851 -10025 -6237
832 -6237 3728 9991 6326 -3572 -9888 -6343 3411 9722 6376 -3242 -9641 -6518 2987 9479 6567
847 6567 -2874 -9459 -6651 2689 9312 6659 -2547 -9184 -6730 2359 9104 6801 -2201 -8960 -6797
862f797Q906O783k035q750o788J835Q574O852j623q460o971J395Q443P076j345
877G095q430p088J349Q321O926j259q017o843R81P732O957n85p662p217M38P770
893D68P361m88p844p218O23P648O967n18p255o872J25O961P072K29o985p353l35
910g414P133P424J77p179p209q9O914O921K72o475o894o86O239P154J039o324
926A003p437r92O529P420P76o484p106p10O155O825R51n718o852j387N528P152
942E653J663n695p426j573N904P331J294n849o961j233N434O671J540m983o768
957d998k006M862P123K238n108p289k021N253P104J789n051o703j868M598O596
972D519K242m321o802k561M379P029K541m548o987k343M488O666K303m135o486
$$ plain form
862 -6797 2109 8892 6857 -1893 -8681 -6846 1728 8580 6957 -1503 -8474 -7079 1364 8440 7095
877 7095 -1335 -8423 -7074 1247 8173 6914 -1103 -7946 -6965 767 7724 7139 -523 -7740 -7302 468
893 468 7829 7341 -503 -7721 -7098 550 7517 6999 -256 -7128 -7003 -42 7030 7259 274 -7079 -7414
910 -7414 -281 7143 7320 141 -7068 -7157 -243 6678 6950 475 -6419 -7105 -866 6288 7327 1003
926 1003 -6434 -7426 -897 6523 7299 815 -6291 -7001 -846 5979 6930 1212 -5640 -7027 -1499 5653
942 5653 7316 1621 -5805 -7378 -1474 5857 7151 1302 -5659 -6892 -1458 5213 6753 1770 -4998
957 -4998 -7004 -2142 4981 7219 2111 -5178 -7199 -1946 5158 6947 1896 -4807 -6675 -2077 4519
972 4519 6761 2440 -4362 -6923 -2544 4485 7026 2478 -4509 -6852 -2364 4302 6605 2470 -4016
987d016k563L830O541K880l754o770k959L883O809K829l912o603k695L693O350
1002C543K826l373o278l070L162O417L276l192o538l272L287O491L115l244o246
1017c096l075K995O048L189k706o028l468K566O170L619k634o289l519K742O161
1032B675L326k629n855l304K307N651L561k009n754l830K010N954L888k186o001
1047b196l647K248N734L450k020n408l550J630N330L854j439n487m093J537N659
1062A602M008j701n577l789J680N294L660j381n052l811J098N023M068r82n184
1077a044m162J091N218M078j144n107l914J034M893L909q42m752m016O32M752
1092F26M180o05m802m217O41M810M110o50m673m021N37M498M051l61m411m160
$$ plain form
987 -4016 -6579 -2749 3792 6672 2918 -3852 -6811 -2928 3881 6710 2798 -3805 -6500 -2807 3543
1002 3543 6369 2996 -3282 -6352 -3190 3227 6503 3311 -3227 -6499 -3212 3279 6394 3150 -3096
1017 -3096 -6171 -3176 2872 6061 3355 -2673 -6141 -3575 2595 6214 3580 -2709 -6228 -3486 2675
1032 2675 6001 3372 -2483 -5787 -3480 2171 5732 3723 -2031 -5861 -3851 2103 5991 3805 -2196
1047 -2196 -5843 -3595 2139 5589 3569 -1839 -5389 -3759 1571 5425 3986 -1501 -5594 -4057 1602
1062 1602 5610 3909 -1668 -5457 -3777 1517 5177 3796 -1256 -5067 -3969 1054 5122 4140 -1044
1077 -1044 -5206 -4115 1103 5181 4037 -1070 -4984 -3950 943 4852 4010 -742 -4758 -4126 626
1092 626 4806 4201 -601 -4818 -4177 633 4743 4093 -580 -4601 -4064 434 4485 4124 -287 -4447
1108d447K36M445M237k40m472m202K77M386M106k11m222m091O4M105M162P6m117
1125I2m227q1M106M206R3m046m147j40L919M131K56l808m176l80L777M218M33
1142D226l772m223m10L702M147M64l581m111n81L452M148O91l390m195p76L397
1158h12M207P87l341m181p95L260M122Q76l159m111r58L079M121J012l007m127
1174c027j059K953M088J121k879m082j180K810M090J231k776m083j261K744M046
1189B736J246k673l952j292K533L924J403k414l970j527K404M049J542k459m024
1204b474j458K451L872J416k279l734j537K095L722J712j970l850j844K045L955
1219B122J784k153l904j645K144L658J608j922l495j747J651L537K000j570l729
$$ plain form
1108 -4447 -4211 234 4471 4231 -241 -4443 -4166 220 4326 4115 -107 -4198 -4134 -29 4133 4209 92
1125 92 -4135 -4216 -110 4096 4189 143 -4004 -4144 -225 3906 4162 354 -3822 -4202 -425 3793 4226
1142 4226 454 -3769 -4179 -477 3670 4134 553 -3558 -4139 -687 3461 4152 762 -3433 -4209 -812
1158 -812 3395 4182 841 -3340 -4135 -875 3247 4123 964 -3147 -4105 -1026 3095 4107 1100 -3027
1174 -3027 -4086 -1133 2955 4076 1197 -2885 -4065 -1255 2835 4066 1290 -2793 -4054 -1310 2736
1189 2736 3982 1309 -2643 -3935 -1402 2522 3925 1511 -2459 -3986 -1582 2467 4009 1550 -2474
1204 -2474 -3932 -1481 2391 3807 1528 -2206 -3743 -1648 2074 3786 1816 -2034 -3878 -1833 2122
1219 2122 3906 1753 -2151 -3796 -1652 2006 3614 1692 -1803 -3550 -1899 1638 3638 2068 -1661
1234a661k119J723L870J988j889l738j784J842L460J692j522l244j930J232L333
1249A253K208j180l589k350J423L731K157j633l582j848J538L203J803j150l000
1264a016k084Q35L143K438q61l468k494J157L581K207j353l309j910J166K937
1279I69J949p65k812k302N44L032K550o40l304k502R13L313K216j006l042k019
1295b906Q05K736K102m77k682k367L13K858K565m02l040k522O06L022K308o55
1311B264k805k154M87K570K203k29k509k428J16K632K557j84k769k507L08K755
1327C07K325l44k539k226J78K358K328J6k354k471p4K461K539j3k512k428P5K406
1345C2K326ok254k327j42K194K409K11k238k455j96K252K415J54k196k335k05
$$ plain form
1234 -1661 -3780 -2057 1813 3801 1912 -1826 -3610 -1768 1692 3384 1862 -1382 -3312 -2080 1253
1249 1253 3461 2281 -1308 -3658 -2235 1496 3653 2020 -1562 -3410 -1872 1331 3134 1984 -1016
1264 -1016 -3100 -2265 878 3316 2455 -1013 -3507 -2350 1231 3438 2085 -1224 -3134 -1968 969
1279 969 2918 2153 -659 -2961 -2417 615 3165 2525 -779 -3281 -2368 945 3161 2155 -887 -2906
1295 -2906 -2101 635 2737 2260 -422 -2789 -2476 382 2947 2545 -495 -3017 -2411 611 2919 2264
1311 2264 -541 -2695 -2208 362 2565 2336 -173 -2601 -2485 147 2704 2520 -249 -2756 -2448 307
1327 307 2632 2288 -251 -2477 -2299 59 2387 2403 49 -2422 -2496 -35 2504 2491 -21 -2449 -2374 32
1345 32 2358 2352 98 -2229 -2371 -177 2232 2443 205 -2250 -2446 -194 2221 2375 179 -2156 -2361
1362b361K090K340K85k025k391l59K053K429L53k058k381l17K009K306L52j905
1378D20k271m49J823K334N23j821k394n55J863K391M85j856k310m72J775K248
1394A734N06j674k217o14J610K236P06j587k318p10J626K318O92j634k267o27
1410b220J570K196O57j478k153p24J398K175Q02j381k204q35J370K215Q21j368
1426H41k201q21J346K161Q10j317k126q16J271K059Q49j176k051r08J114K084
1442A119R82j099k152r78J188K143R09j194k044q50J117J928Q84r76j886j018
1458a927Q58J981J132r12k104j127J032K107R65j082j940q68R42J780R18p39j754
1475g38j098O43J886J251p21k029j205Q82K040J033r29j851r22Q20J671R43n92
$$ plain form
1362 -2361 -271 2069 2354 329 -2062 -2421 -368 2061 2414 356 -2025 -2342 -333 1973 2325 420
1378 420 -1851 -2300 -477 1857 2380 559 -1835 -2390 -527 1864 2349 493 -1817 -2289 -514 1734
1394 1734 2240 566 -1651 -2265 -655 1581 2287 700 -1618 -2328 -702 1616 2308 674 -1593 -2220
1410 -2220 -650 1546 2203 725 -1428 -2152 -754 1421 2223 842 -1362 -2197 -827 1388 2209 841
1426 841 -1360 -2181 -835 1326 2136 819 -1307 -2123 -852 1207 2056 880 -1171 -2079 -965 1119
1442 1119 2101 1002 -1150 -2128 -940 1203 2112 918 -1126 -1976 -859 1069 1953 977 -909 -1927
1458 -1927 -1069 912 2044 1132 -972 -2099 -1067 1040 2005 923 -1017 -1885 -943 837 1755 1016 -738
1475 -738 -1836 -1193 693 1944 1223 -806 -2011 -1129 911 1944 1015 -836 -1758 -938 733 1676 1084
1492A084j618j136M79J730J301n61j904j266O92J920J106p71j767r96O70J595
1508E58J003m86j539j153L82J632J279m18j740j256N34J748J169n70j663j077
1524a597N30J535J069l96j487j143L14J505J219l04j573j245L55J587J185l90
1540A164j557j138L85J485J107l36j433j118K88J378J164k13j392j202K06J419
1556B07J231k15j449j213K60J465J159l08j393j065K65J259J051j44j196j143
1572a229K3J243J269l1j391j297J76J452J137k75j350r74K44J126R47l2j019j112
1590a093j19J130J307O6j309j299J09J377J131k22j245r68J74J025R56K4r50j089
1608i95j79J030J273J19j206j268K3J274J116j49j168r40Q6R70R34R2q69j069
$$ plain form
1492 1084 -534 -1670 -1191 539 1840 1279 -625 -1891 -1199 721 1827 1056 -711 -1707 -1037 558
1508 558 1561 1075 -464 -1617 -1235 397 1676 1258 -482 -1738 -1204 544 1713 1143 -520 -1597
1524 -1597 -1067 468 1537 1141 -346 -1489 -1175 330 1549 1245 -328 -1573 -1218 369 1554 1164
1540 1164 -393 -1531 -1146 339 1446 1110 -323 -1441 -1153 225 1389 1176 -216 -1418 -1212 207
1556 207 1438 1223 -226 -1439 -1179 286 1445 1137 -256 -1321 -1056 203 1254 1110 -86 -1229
1572 -1229 -1206 37 1306 1275 -116 -1413 -1237 215 1352 1077 -273 -1247 -1003 123 1070 1038 19 -1093
1590 -1093 -1212 -82 1225 1291 -18 -1317 -1208 169 1300 1078 -167 -1135 -961 64 1020 1044 94 -995
1608 -995 -1174 -144 1129 1248 42 -1226 -1203 71 1187 1038 -130 -1070 -984 -14 920 1012 143 -926
1626i26k18R61J221J97j129j243k2J185J100r0j066r32J1Q84R27J60q16j074k59
1645a129R04J193K09j048j180o6J058J040J0r39r36j13Q19R82K28q11j074k58
1663a111Q95J130J82r26j090j19R22R95J37q42r75j93P85J008K49q04j063k41
1681a061Q46J067J80q55j014j73Q09R70J99p49r76k56P41J017L02p90j040k40
1699a023Q00J014K06p82r50k07P19R33K62o81r62l14O84J009L11p21j026k69P43
1718b54R85K34p34r19k46O58R12L00o28r34l49O42R82L39o75r90l04O95R59K81
1738I54o67r24k70O27Q98K99n94r00l50N81R35L83o12r77l62O38R82L15o77r18
1758f39k80O30Q65K83n43q56l52M96R09M28n29r72m32O05J011L42o32r61k81O33
$$ plain form
1626 -926 -1144 -183 1038 1235 106 -1137 -1159 26 1126 1036 -30 -962 -951 -67 860 1020 204 -870 -1129
1645 -1129 -225 968 1177 129 -1051 -1117 -59 981 991 52 -884 -997 -178 804 1032 221 -853 -1111
1663 -1111 -216 914 1096 170 -920 -1039 -117 878 1015 173 -802 -995 -210 798 1047 243 -820 -1061
1681 -1061 -215 852 1032 177 -837 -1010 -201 769 968 219 -757 -1013 -272 745 1047 257 -783 -1023
1699 -1023 -223 791 997 215 -735 -942 -223 710 972 291 -671 -985 -301 708 1019 298 -728 -997 -254
1718 -254 731 965 231 -688 -934 -276 636 936 308 -626 -975 -333 649 988 313 -677 -981 -286 673 954
1738 954 287 -637 -907 -280 618 917 323 -577 -927 -346 589 972 360 -617 -979 -341 641 956 279 -639
1758 -639 -919 -289 576 859 316 -540 -892 -396 513 941 412 -560 -992 -387 624 966 334 -627 -908 -275
1778b75Q52K81n22q13l73M51Q63M56m60r74m72N67R99L94o24r57l00N86Q59K94
1798H32m89q04l91M10Q53M95m12r64n11N17J020M24n92r38l42N50Q49L19m48p91
1818d13m23L71Q57N22m02r50n30M73R92M71n56r23l91N07Q42L98m20q17m55L55
1838d92Q60N27l66r38n40M25R65M86m56r16m49M36Q68M49l80q44m98L46Q74N41
1858H98l59q98n43L76Q93N21l67q94n15L55Q82N38l47r01n41L59Q89N19l39q62
1878c36n30L09Q51N50k69q64o02K97R04O05l28r27n58L58Q79N10l06q20n38K60
1898e55P89O14k17q59o58K38R22O43l05r20n86L21Q63N41k68q00n62J83P93O28
1918H05j46q42p08J88R20O94k54r34o00K78Q50N69k30p78n85J26P67O85j04q25
$$ plain form
1778 -275 577 858 336 -477 -850 -399 464 920 460 -514 -986 -419 580 974 350 -607 -907 -321 538 832
1798 832 343 -461 -852 -442 411 906 494 -470 -981 -464 556 980 388 -550 -892 -342 507 826 378 -413
1818 -413 -836 -465 392 914 512 -438 -968 -495 497 968 412 -511 -902 -395 447 845 425 -392 -847 -492
1838 -492 368 895 529 -409 -949 -524 441 927 471 -445 -894 -458 410 859 479 -365 -863 -517 357 898
1858 898 539 -359 -902 -526 367 888 521 -373 -888 -533 349 887 540 -361 -902 -543 346 865 526 -336
1878 -336 -866 -557 294 844 575 -289 -891 -594 310 915 587 -340 -898 -540 339 849 543 -277 -815 -555
1898 -555 234 848 631 -228 -886 -648 274 917 612 -308 -894 -573 290 831 563 -237 -799 -616 177 805
1918 805 659 -183 -891 -703 217 911 657 -277 -877 -599 251 820 590 -188 -773 -647 120 805 701 -124
1938a24p57J46R12P26k15r14o47K43Q22O02j65p66o31P1P69P29n8q49p70J07R14
1959A45P18j67q66o59J58P93O53o7p64p14K6P90P72m1q25p85O9Q46P40q4q09p15
1981g86O0P59P34kp60p84k9Q06P95Mq10p97K5Q04P66k7p51p57k0P22P84P2p40
2004F8q35p4P88Q27N6p91p96m0P41P78Q4p16p91j17O92Q36J43p28q72j18P59Q44
2026G38R7p52p92j11P00P89J42o51q16j93O61Q67K06p03q90j74P18Q58J63o96
2046A61q33j63O45Q18K06o12q39k42N98Q89K77o48r05k51O66Q72K33o39q52k39
2066h58O05Q30K64n58q41l12N41Q86L50n85r05l18N80R14K99o00q67k87N57Q26
2086E21L21n09q29l76M85Q65M21m98r25m03N50R26L62n53q77l44N11Q27L67m40
$$ plain form
1938 -124 -881 -735 177 903 688 -226 -873 -630 192 794 629 -137 -768 -697 72 801 743 -106 -876 -769 145
1959 145 863 696 -170 -829 -671 122 775 708 -56 -770 -744 46 818 777 -48 -833 -764 82 822 738 -71 -786
1981 -786 -726 33 767 765 5 -779 -808 -2 793 797 -13 -810 -785 19 785 758 7 -750 -770 -48 736 808 68
2004 68 -767 -841 -53 774 830 39 -757 -797 -56 722 806 90 -701 -818 -126 710 853 125 -747 -865 -106 738
2026 738 835 83 -709 -820 -120 669 811 160 -656 -849 -188 679 885 182 -708 -882 -164 694 857 161
2046 161 -672 -835 -190 628 834 222 -617 -859 -261 628 905 257 -648 -899 -233 639 872 233 -619 -858
2066 -858 -253 577 841 283 -558 -870 -329 557 907 322 -583 -901 -321 593 892 292 -575 -862 -305 521
2086 521 842 333 -496 -872 -387 478 899 401 -524 -927 -377 549 911 358 -519 -863 -352 475 842 402
2106D02q32m24M15Q67M76m36r28m63M75R33M20n02q78l77M47Q15M15l84q03m89
2126h51L34Q68N50l56r39n38M20R35M64m27q56m38L69Q02M70k96p90n50K65Q46
2146B82O09k95r17n90L64R02N12l61q35m81K95P63N33k13p87o02J84Q42O51k36
2166F20q85o23K93Q78N47k81p94n33K05P48N91j33p70o56J14Q36O83j65q59o49
2186h33K08Q09N98j77p40o03J03P17O49m9p68o99P9P95O99j06q04o44J00P54O37
2207G25q6o99o52K2O98P00lp14p24J0P59O93l0p33o73L1O92O54Ro50o90n7O60
2230e8P25O4o97p36k6P03O86K8o65o71n0O16O84J12o03p36j39O41P68R1o51p25
2252f39q1O26O94R8n74o81j53N47P30J83n79p47j73N89P59J33n99p14j37N57O93
$$ plain form
2106 402 -430 -854 -439 428 904 468 -460 -923 -448 485 905 403 -475 -852 -405 410 825 441 -362 -851
2126 -851 -517 351 901 545 -394 -932 -512 423 887 460 -396 -834 -465 337 807 511 -279 -829 -564 282
2146 282 891 596 -321 -911 -547 355 867 506 -329 -810 -515 248 781 568 -219 -821 -637 205 856 620
2166 620 -265 -888 -595 283 830 549 -245 -778 -573 175 766 633 -137 -793 -679 157 840 675 -184 -833
2186 -833 -625 184 782 605 -135 -738 -635 82 731 682 -86 -785 -706 89 788 682 -122 -766 -666 88 725
2207 725 639 -60 -712 -690 8 708 705 -9 -733 -723 36 729 699 -34 -707 -676 16 670 679 29 -661 -718 -58
2230 -58 667 731 34 -702 -728 -25 661 689 24 -647 -697 -81 603 715 112 -624 -763 -122 646 737 86 -639
2252 -639 -720 -94 600 698 124 -557 -710 -163 567 750 171 -576 -749 -160 599 732 133 -581 -718 -161 532
2273E32J60m99p24k03M93P46K37n31p55k08N35P40K02n23p01k23M99P03K30m59
2293B51p17k68M65P43K69m74p43k59M81P13K59m56o96k78M12P09K96m03p06l36
2313g38M04P43L23m39p18k99M15P06K95l93o64l36L48P12L42l36p33l61L80P07
2333C58L49l67o91l28L34O61L71l15o86l79L08O83L88l02p04l75L03O76L74k78
2353C80o65l77K59O54M02k53o66m05K45O77M09k57o52m12K38O56M14k36o43m02
2373f34K02O36M22j82o43m44J95O36M45j90o38m38J88O23M31j72o12m30J45O04
2393A44M46j30o10m65J41O01M68j32n95m72J37N90M58j17n90m53J12N66M65r6
2413D68n67m68P4N71M93q2n67m98Q7N77M74r4n62m60P7N40M56o1n03m87J5N37
$$ plain form
2273 532 692 193 -531 -734 -241 505 742 211 -544 -752 -217 523 725 202 -499 -722 -223 480 710 251
2293 251 -466 -734 -269 474 743 269 -474 -733 -252 461 720 264 -432 -710 -298 411 707 304 -402 -738
2313 -738 -334 409 732 293 -425 -724 -309 397 692 299 -365 -701 -353 359 701 365 -368 -729 -349 358
2333 358 707 340 -351 -679 -345 316 687 372 -314 -693 -385 298 686 384 -320 -695 -392 284 658 380
2353 380 -285 -662 -403 251 653 400 -266 -671 -426 251 660 403 -249 -661 -423 233 647 411 -232 -634
2373 -634 -432 204 626 444 -199 -643 -448 188 633 443 -195 -633 -445 178 609 437 -175 -605 -460 144
2393 144 590 460 -150 -615 -474 127 595 463 -132 -604 -467 123 581 464 -126 -579 -467 99 564 468
2413 468 -99 -567 -493 78 571 489 -78 -576 -489 88 562 468 -94 -554 -477 63 519 458 -45 -532 -517 20
2435B0N14k9n47n08M2N64M86o9n16m68M1M92M51Mm70m98k4M80N36K3n15n34QN32
$$ plain form
2435 20 534 505 -42 -550 -508 56 542 473 -43 -511 -470 22 473 477 7 -491 -515 -35 501 524 9 -525 -517 15
$$ [...]
8191c5
##END NTUPLES=NMR FID
##END=
