##TITLE=1H_LY-hexene-1
 CDCl3, 8 sc, 
 28.6.2019
##JCAMPDX= 6.0         $$ Bruker NMR JCAMP-DX V2.0
##DATA TYPE= NMR FID
##DATA CLASS= NTUPLES
##ORIGIN= UXNMR, Bruker Analytische Messtechnik GmbH
##OWNER= root
$$ XWIN-NMR		Version 3.5
$$ Fri Jun 28 14:09:31 2019 Russian Standard Time (UT+4h)  she@DPX200
##.OBSERVE FREQUENCY= 200.13155
##.OBSERVE NUCLEUS= ^1H
##.DELAY= (6, 6)
##.ACQUISITION MODE= SIMULTANEOUS
##.ACQUISITION SCHEME= undefined
##.AVERAGES= 8
##.DIGITISER RES= 18
##SPECTROMETER/DATA SYSTEM= spect
##.PULSE SEQUENCE= zg30
##.SOLVENT NAME= CDCl3
##.SHIFT REFERENCE= (INTERNAL, CDCl3, 0, 15.7039)
##AUDIT TRAIL= $$ (NUMBER, WHEN, WHO, WHERE, WHAT)
$$ ##TITLE= Audit trail, XWIN-NMR		Version 3.5
$$ ##JCAMPDX= 5.01
$$ ##ORIGIN= Bruker BioSpin GmbH
$$ ##OWNER= she
$$ F:/spectra/data/she/nmr/H-F/1/audita.txt
$$ ##AUDIT TRAIL=  $$ (NUMBER, WHEN, WHO, WHERE, WHAT)
(   1,<2019-06-28 14:08:39.00 +0400>,<she>,<DPX200>,
      <created by zg, POWCHK disabled, PULCHK disabled
       configuration hash MD5:
       00 E9 B6 7A A2 85 ED C7 34 08 36 98 17 FE 4E 26
       data hash MD5: 16K
       95 C5 25 3D FD D6 2A 73 81 66 F6 55 39 3A 46 F1>)
$$ ##END=
$$ 
$$ hash MD5
$$ 7C E5 44 A3 21 F8 0A 6F A2 8F 37 98 74 F2 2E FF
##$RELAX= 
##$RELAX= 
##$RELAX= 
##$RELAX= 
##$RELAX= 
##$RELAX= 
$$ Bruker specific parameters
$$ --------------------------
##$DU= <F:/spectra>
##$EXPNO= 1
##$NAME= <H-F>
##$PROCNO= 1
##$TYPE= <nmr>
##$USER= <she>
##$AMP= (0..31)
100 100 100 100 100 100 100 100 100 100 100 100 100 100 100 100 100 100 
100 100 100 100 100 100 100 100 100 100 100 100 100 100 
##$AQSEQ= 0
##$AQ_mod= 1
##$AUNM= <au_zg>
##$AUTOPOS= <>
##$BF1= 200.13
##$BF2= 200.13
##$BF3= 200.13
##$BF4= 200.13
##$BF5= 200.13
##$BF6= 200.13
##$BF7= 200.13
##$BF8= 200.13
##$BYTORDA= 1
##$CFDGTYP= 0
##$CFRGTYP= 5
##$CHEMSTR= <none>
##$CNST= (0..31)
1 1 145 1 1 1 1 1 1 1 1 1 1 1 1 1 1 1 1 1 1 1 1 1 1 1 1 1 1 1 1 1 
##$CPDPRG= <>
##$CPDPRG1= <>
##$CPDPRG2= <>
##$CPDPRG3= <>
##$CPDPRG4= <mlev>
##$CPDPRG5= <mlev>
##$CPDPRG6= <mlev>
##$CPDPRG7= <mlev>
##$CPDPRG8= <mlev>
##$CPDPRGB= <>
##$CPDPRGT= <>
##$D= (0..31)
0 1.2 0 0 0 0 0 0 0 0 0 0.03 0 0 0 0 0 0 0 0 0 0 0 0 0 0 0 0 0 0 0 0 
##$DATE= 1561716518
##$DBL= (0..7)
120 120 120 120 120 120 120 120 
##$DBP= (0..7)
150 150 150 150 150 150 150 150 
##$DBP07= 0
##$DBPNAM0= <>
##$DBPNAM1= <>
##$DBPNAM2= <>
##$DBPNAM3= <>
##$DBPNAM4= <>
##$DBPNAM5= <>
##$DBPNAM6= <>
##$DBPNAM7= <>
##$DBPOAL= (0..7)
0.5 0.5 0.5 0.5 0.5 0.5 0.5 0.5 
##$DBPOFFS= (0..7)
0 0 0 0 0 0 0 0 
##$DE= 6
##$DECBNUC= <off>
##$DECIM= 24
##$DECNUC= <off>
##$DECSTAT= 4
##$DIGMOD= 1
##$DIGTYP= 9
##$DL= (0..7)
0 120 120 120 120 120 120 120 
##$DP= (0..7)
150 150 150 150 150 150 150 150 
##$DP07= 0
##$DPNAME0= <>
##$DPNAME1= <>
##$DPNAME2= <>
##$DPNAME3= <>
##$DPNAME4= <>
##$DPNAME5= <>
##$DPNAME6= <>
##$DPNAME7= <>
##$DPOAL= (0..7)
0.5 0.5 0.5 0.5 0.5 0.5 0.5 0.5 
##$DPOFFS= (0..7)
0 0 0 0 0 0 0 0 
##$DQDMODE= 0
##$DR= 18
##$DS= 0
##$DSLIST= <SSSSSSSSSSSSSSS>
##$DSPFIRM= 0
$$ [...]
##$SUBNAM2= <"">
##$SUBNAM3= <"">
##$SUBNAM4= <"">
##$SUBNAM5= <"">
##$SUBNAM6= <"">
##$SUBNAM7= <"">
##$SUBNAM8= <"">
##$SUBNAM9= <"">
##$SW= 24.9336996594482
##$SWIBOX= (0..15)
0 0 2 0 0 0 0 0 0 0 0 0 0 0 0 0 
##$SW_h= 4990.01996007984
##$TD= 16384
##$TD0= 1
##$TE= 0
##$TE2= 300
##$TE3= 300
##$TEG= 300
##$TL= (0..7)
0 120 120 120 120 120 120 120 
##$TP= (0..7)
150 150 150 150 150 150 150 150 
##$TP07= 0
##$TPNAME0= <>
##$TPNAME1= <>
##$TPNAME2= <>
##$TPNAME3= <>
##$TPNAME4= <>
##$TPNAME5= <>
##$TPNAME6= <>
##$TPNAME7= <>
##$TPOAL= (0..7)
0.5 0.5 0.5 0.5 0.5 0.5 0.5 0.5 
##$TPOFFS= (0..7)
0 0 0 0 0 0 0 0 
##$TUNHIN= 0
##$TUNHOUT= 0
##$TUNXOUT= 0
##$USERA1= <user>
##$USERA2= <user>
##$USERA3= <user>
##$USERA4= <user>
##$USERA5= <user>
##$V9= 5
##$VALIST= <valist>
##$VCLIST= <CCCCCCCCCCCCCCC>
##$VD= 0
##$VDLIST= <DDDDDDDDDDDDDDD>
##$VPLIST= <PPPPPPPPPPPPPPP>
##$VTLIST= <TTTTTTTTTTTTTTT>
##$WBST= 1024
##$WBSW= 4
##$XGAIN= (0..3)
0 0 0 0 
##$XL= 0
##$YL= 0
##$YMAX_a= 63019
##$YMIN_a= -77154
##$ZGOPTNS= <>
##$ZL1= 120
##$ZL2= 120
##$ZL3= 120
##$ZL4= 120
##$ABSF1= 10
##$ABSF2= 0
##$ABSG= 5
##$ABSL= 3
##$ALPHA= 0
##$AQORDER= 0
##$ASSFAC= 0
##$ASSFACI= 0
##$ASSFACX= 0
##$ASSWID= 0
##$AUNMP= <proc_1d>
##$AZFE= 0.1
##$AZFW= 0.1
##$BCFW= 1
##$BC_mod= 2
##$BYTORDP= 1
##$COROFFS= 0
##$CY= 11.3945322036743
##$DATMOD= 1
##$DC= 2
##$DFILT= <>
##$DTYPP= 0
##$F1P= 18.9103706918063
##$F2P= -1.10871071338519
##$FCOR= 0.5
##$FTSIZE= 0
##$FT_mod= 4
##$GAMMA= 1
##$GB= 0.15
##$INTBC= 1
##$INTSCL= 1
##$ISEN= 128
##$LB= 0.24
##$LEV0= 0
##$LPBIN= 0
##$MAXI= 10000
##$MC2= 0
##$MEAN= 0
##$ME_mod= 0
##$MI= 1.114404
##$NCOEF= 0
##$NC_proc= 0
##$NLEV= 6
##$NOISF1= 3.799351
##$NOISF2= 2.8
##$NSP= 1
##$NTH_PI= 0
##$NZP= 0
##$OFFSET= 15.70392
##$PC= 1
##$PHC0= -8578.496
##$PHC1= 12.00098
##$PH_mod= 1
##$PKNL= yes
##$PPARMOD= 0
##$PSCAL= 0
##$PSIGN= 0
##$REVERSE= no
##$SF= 200.130013532006
##$SI= 16384
##$SIGF1= 3
##$SIGF2= 2
##$SINO= 400
##$SIOLD= 16384
##$SREGLST= <1H.CDCl3>
##$SSB= 0
##$STSI= 0
##$STSR= 0
##$SW_p= 3612.71676300578
##$SYMM= 0
##$S_DEV= 0
##$TDeff= 0
##$TDoff= 0
##$TI= <>
##$TILT= no
##$TM1= 0
##$TM2= 0
##$TOPLEV= 0
##$USERP1= <user>
##$USERP2= <user>
##$USERP3= <user>
##$USERP4= <user>
##$USERP5= <user>
##$WDW= 1
##$XDIM= 8192
##$YMAX_p= 0
##$YMIN_p= 0
$$ End of Bruker specific parameters
$$ ---------------------------------
##NTUPLES= NMR FID
##VAR_NAME=  TIME,          FID/REAL,        FID/IMAG
##SYMBOL=    X,             R,               I
##VAR_TYPE=  INDEPENDENT,   DEPENDENT,       DEPENDENT
##VAR_FORM=  AFFN,          ASDF,            ASDF
##VAR_DIM=   8192,          8192,            8192
##UNITS=     SECONDS,       ARBITRARY UNITS, ARBITRARY UNITS
##FACTOR=    0.0002004,     1,               1
##FIRST=     0,             0,               0
##LAST=      1.6414764,     0,               0
##MIN=       0,             -77154,          0
##MAX=       1.6414764,     63019,           0
$$ Real data points
##PAGE= N=1
##DATA TABLE= (X++(R..R)), XYDATA
$$ [...]
1514A101k773l60K052q29k078K152L038j440j456K834J126l774j525K772m97l802
$$ 1101 -1672 -2032 20 -809 -2887 -735 2303 863 -593 2241 3367 -407 -1932 840 343 -3459
1530c459Q76L937r08k708K717L249k624k462K849J182l974j531L048R1l174Q47
$$ -3459 -2583 1354 446 -2262 455 3704 1080 -1382 1467 2649 -1325 -2856 192 283 -2891 -2044
1546b044L600l11j896J849J877k174j858J270r2k355L2J980k10q13J718J334j227
$$ -2044 1556 1245 -651 1198 3075 901 -957 313 221 -2134 -2102 -122 -332 -1145 573 1907 680
1563F80m00J352o15k004L79R19j603r57K043Q52j645P00K730n97k442J016J610
$$ 680 280 1632 1017 -987 -608 311 -1292 -2249 -206 646 -999 -299 2431 1834 -608 408 2018
1580B018k549k285K176J413k466l29L444N87k719N18K688j368k859J276J833k269
$$ 2018 -531 -2816 -640 773 -1693 -2022 1422 2009 -710 -192 2496 1128 -1731 -455 1378 -891
1596h91j650K460J192k221k9K839K0k283O01J710j567j956J224R77j537k42K037
$$ -891 -2541 -81 1111 -1110 -1139 1700 1720 -563 38 1748 181 -1775 -551 426 -1111 -1353 684
1613F84K74j355O70J253j210j191J160L55j662o9J693l84j439J095J463j227r14
$$ 684 958 -397 273 1526 316 -875 285 640 -1022 -1091 602 218 -1221 -126 1337 110 -804
1630h04J674M56k081k19J795n81j919J094J913j265j289J873R89k175o95K076
$$ -804 870 1326 -755 -974 821 240 -1679 -585 1328 63 -1226 647 1636 -539 -1234 842
1646H42j8k181N01K099q57j725J336J375j638r57J840M52j918L0J798n33j663
$$ 842 824 -1357 -856 1243 386 -1339 -3 1372 -266 -1223 617 1069 -849 -819 979 446 -1217
1663a217R45J424j167r51J439N23j584j93J422l43j281Q21J167r78o97J247K72
$$ -1217 -272 1152 -15 -966 473 996 -588 -781 641 298 -983 -162 1005 27 -670 577 849
1680H49j508l4J360m86j255R18J123j106o93J404L49j522M8J478n63j493Q47J206
$$ 849 -659 -693 667 181 -1074 -156 967 -139 -832 572 921 -601 -553 925 362 -1131 -284 922
1698I22j263q97J620P24j624j72J793k58j879M59J526j005j354J321J143j367
$$ 922 -341 -1238 382 1106 -518 -690 1103 845 -1034 -575 951 -54 -1408 -87 1056 -311
1714c11n76J631K72j642P0J479n56j446P80J101j014p63J239N45j114o4J147k73
$$ -311 -887 744 1016 -626 -556 923 367 -1079 -299 802 -212 -975 264 809 -305 -369 778 505
1732E05j045M34O40q20m47R53J58q94L38R74n78q09Q23M97j152k97J213p9j276
$$ 505 -540 -106 534 -286 -733 220 378 -516 -178 796 218 -591 232 729 -423 -720 493 414 -862
1751h62M64J262p34j089J131Q99j365o44J517K41j692L3J662l62j551P68J447
$$ -862 -398 864 130 -959 172 1071 -294 -938 579 820 -872 -839 823 461 -1090 -322 1125
1768A125r63j178J185Q21j369n43J381J90j330J81J249m28j023O51P59q22m97
$$ 1125 162 -1016 169 990 -379 -922 459 649 -681 -500 749 321 -702 -51 708 -114 -611
1785f11Q69J99q37J13P36l57n51N80L10p27l7P78k81p93N58O94q05m90J051K89
$$ -611 258 457 -380 -267 469 112 -439 141 451 -276 -313 465 184 -609 -51 643 -162 -652 399 688
1805F88j159m0J213l46j248N94J097q51q67J139P04j264m01J344L8j414K13J304
$$ 688 -471 -511 702 356 -892 -298 799 -52 -919 220 924 -340 -741 603 641 -773 -560 744
1823G44m98j137P78R25r15o42J044L53j046j7R81l07q71M98O37p45l63R17J59
$$ 744 246 -891 -113 812 -103 -745 299 652 -394 -411 570 263 -608 -110 527 -218 -581 336 495
1842D95q91K03Q86n20q26O78N60r11l14J094P6j085K59J053n56r96Q20Q07j016
$$ 495 -396 -193 693 173 -653 25 585 -326 -640 454 530 -555 -296 757 201 -795 25 832 -184
1861a84n80J143K74j236l5J200k21j041N46R23p35o93Q00L37r43o8R25j62p71
$$ -184 -764 379 653 -583 -618 582 361 -680 -134 789 54 -639 161 498 -445 -513 412 250 -521
1880e21M96O38p22m50Q18J24q93K05R19m62p91P41N66j025l43J220P7j274L12
$$ -521 -25 613 -109 -559 259 383 -510 -305 614 152 -639 102 668 -357 -700 520 597 -677 -365
1899c65J289o45j270R09J058j162p89J401N35j486k07J478j64j484M81J350p49
$$ -365 924 279 -991 -82 976 -186 -975 426 961 -525 -732 746 582 -902 -421 929 180
1916A80j091J006Q15j186n50J205K05j138J40J051l80q53N69N31p46k51Q05n5
$$ 180 -911 95 910 -276 -826 379 584 -554 -414 637 257 -596 -27 504 -242 -493 312 257
1934B57p12M02O05o85m40R00J19j040J93J140n03j083Q65Q95j164o94J414L86
$$ 257 -455 -53 552 -133 -573 327 446 -594 -401 739 236 -847 18 913 -251 -945 469 855
1952H55j582j2J691l73j675P62J543j115j348J422J062j646p03J767L06j787J05
$$ 855 -727 -739 952 579 -1096 -334 1209 94 -1254 168 1230 -416 -1119 648 954 -833 -728
1969g28J716m85j533Q02J252j070r09J248N39j309j69J254k10j135N66Q97p80
$$ -728 988 503 -1030 -228 1024 -46 -955 293 832 -477 -646 608 398 -737 -171 726 -54
1986e4n77R41J89j048J80R58n54p58R38N55j164k41J331k08j443N95J369r59j178
$$ -54 -631 310 499 -549 -369 589 35 -723 215 770 -394 -635 696 488 -955 -360 1009 50 -1128
2005a128J345R15j644n73J858J59j878L25J922q01j848J110J496j534j208J902
$$ -1128 217 1132 -512 -1085 773 932 -946 -621 1301 500 -1348 -238 1258 -276 -1484 418
2021D18R41j907l59J994j36k042L97J684q62j403J258J151j355o44J484J75j473
$$ 418 1359 -548 -907 1087 951 -1091 -694 990 128 -1275 -17 1134 -221 -865 619 794 -679
2038f79K10J329o07j096Q52O43j165l51J264jj018O83J046r62q36J112J54j612
$$ -679 -469 860 253 -843 9 652 -513 -864 400 399 -619 64 1110 148 -688 424 578 -1034
2056a034O7J671m10j411J148J497j447j216J714O89k107l44K192k08k265O63K103
$$ -1034 -967 704 294 -1117 31 1528 81 -1135 579 1268 -839 -1183 1009 801 -1464 -801 1302
2073A302j128j762J772J687j864j113K044M04k520l34K155k66j883J034K052r62
$$ 1302 174 -1588 184 1871 7 -1106 938 1342 -1178 -1512 643 377 -1506 -472 1580 618
2089F18j411J278Q08j735o83J452P9j411M41J293o97q28J079N81j044rJ150n08
$$ 618 -793 485 1293 -442 -1125 327 406 -1005 -564 729 32 -796 283 864 -180 -189 961 453
2107D53j239N70O10j272m07J645L35j297O49J681j019j794J104J073j950r84K215
$$ 453 -786 -216 394 -878 -1285 360 695 -602 47 1728 709 -1085 19 1092 -858 -1842 373
2124C73P27k135O5K484m38k371R83K146j476j948J709J321k286j110K331O65k091
$$ 373 1100 -1035 -970 1514 1076 -1295 -312 1834 358 -1590 119 1440 -846 -1956 375 1040 -1051
2141a051K91K457l85k123O63J391j491j479J377R65j255j16J638Pj307M09Q93
$$ -1051 -760 1697 1312 -811 -148 1243 -248 -1727 -350 615 -640 -756 882 889 -418 -9 884
2158H84r04p42R65K34j119J16J039n67q34J089Q03j129j70J463l23j809L84J404
$$ 884 -20 -762 203 437 -682 -566 473 -94 -928 161 964 -165 -335 1128 805 -1004 -620 784
2176G84j104j342J672J407j629p37K060L10k375r5K129n51k102J041J978j369
$$ 784 -320 -1662 10 1417 -212 -949 1111 1421 -954 -1049 1080 529 -1573 -532 1446 77
2192G7j590J726J241j923p21K135L15k131M4J833o70j774R44J503j019q86J378
$$ 77 -1513 213 1454 -469 -1190 945 1260 -871 -827 1006 336 -1438 -494 1009 -10 -896 482
2209D82O03j400k70J127l40j097O48Q75p97m12J087O9j149K45J040o29r08R74
$$ 482 1085 -315 -585 542 202 -895 -247 628 -169 -581 506 575 -574 -329 711 82 -826 148
2227A48O35j193l01J332r6j383N13J366q76j193J243R60j570o95J762K90j859
$$ 148 783 -410 -711 621 525 -858 -345 1021 145 -1048 195 1155 -415 -1110 652 942 -917
2244i17J24J859m56j739Q28J524j161j268J373Q77j550m71J667J18j582K84J436
$$ -917 -793 1066 610 -1129 -301 1223 62 -1206 167 1044 -506 -977 690 808 -774 -490 946
2261I46o89j332R12J018j067o19J263L67j243o1J068l83r63O54P47p40l40R54
$$ 946 257 -1075 -163 855 -212 -831 432 799 -444 -505 563 180 -783 -129 618 -122 -462 492
2279D92J6j080J96R25n79p58R70O49j030l71J115p1j263L33J197n43r40R39P59
$$ 492 508 -572 -376 549 -30 -788 182 831 -199 -570 545 474 -789 -456 741 198 -742 197 956
2298I56j263o40J249K49j309K56J542l73j349N94R31j141r76J205P76j069j28
$$ 956 -307 -947 302 551 -758 -502 1040 667 -682 -88 843 -298 -1274 -69 707 -362 -490
2315d90J368m6j371J36R76o45q82Q89P87q63m55R29O4j021K07J059k49o53N89
$$ -490 878 832 -539 -403 573 -72 -954 -65 722 -141 -596 333 397 -624 -417 642 393 -260 329
2334C29M08j024n61O80M5p01N58J142k45o11N57K00j181n07Q47O2p91M91J117
$$ 329 737 -287 -848 -168 -123 -824 -266 876 631 20 577 777 -404 -911 -64 -2 -793 -302 815
2353H15m41q73O58N94r33l84J132K21j176j20Q43n14j074O72J158l44l04J034
$$ 815 374 -499 159 753 -180 -564 568 789 -387 -507 336 -178 -1252 -580 578 234 -70 964
2371I64L28j241o08N35l86r34N64J159j67l52P88L41j005m21O95o4p65K79O69
$$ 964 1292 51 -557 -22 -408 -1342 -778 381 214 -138 650 991 -14 -435 260 196 -569 -290 379
2390C79n13o62N25L85n16J93J092J18p40Q9K80j029r61N49N90l92K75J282K55
$$ 379 -134 -796 -271 114 -402 -209 883 1001 261 350 630 -399 -1360 -811 -221 -613 -338 944 1199
2409A199q75q4M13p36q46N01O28n10k08P90J07q24R3Q53p8m88N19M73q09p90K55
$$ 1199 324 240 653 -83 -929 -428 200 -310 -518 272 379 -445 -352 501 423 -65 454 927 118 -672 -417
2430d17Lo12K50J081L14k15L99K10q81p09K53m7n62L98R39r3m94M19L52o99l54
$$ -417 -414 -1026 -776 305 619 404 803 1013 132 -577 -324 -371 -933 -535 404 311 -183 236 588 -111 -465
2451d65P67K76p28j3N79m52r38L33P57k87j07J008M85q75m44L81l65r55J96R36
$$ -465 302 578 -150 -163 416 -36 -974 -641 116 -171 -278 730 1215 340 -104 277 -88 -1043 -847 89
2471H9Rk78N89M28o52m97L60O1m53J46N37j52m37J51J21m09JN58J58k07K57J79
$$ 89 98 -180 409 837 185 -312 48 109 -344 -198 339 187 -250 -99 22 -387 -386 172 330 123 380 559
2493E59n90m67K61K7l97L03Q00o7m92L11K87p32n04O47L25n98L0Q26j11q66J42
$$ 559 -31 -498 -237 -210 -607 -304 496 429 -63 248 535 -197 -701 -54 271 -327 -297 529 418 -448 -306
2514c06P01l93n78O57O26o54m73O28J34q00p8Q23M8n70K24N47l90n53K98K80l46
$$ -306 395 2 -576 81 707 53 -420 208 342 -458 -536 287 335 -235 -11 536 146 -407 -109 171 -175
2535a75o1M40L9l13Q1J67k58j43K68J9k50J52K46k66j54L95O6m65O1M76k65n53
$$ -175 -236 204 243 -70 11 178 -80 -223 45 64 -186 -34 212 -54 -208 187 253 -212 -151 325 60 -493
2557d93L65N26m81l73P13L17p95k41P64J9q45J86Q72k41p74L76O08o07n25P10
$$ -493 -128 398 -83 -456 257 574 -221 -462 302 321 -524 -338 534 293 -481 -105 503 -104 -629 81
2577H1M69n95j61O62p0q36oN60j72l25M96M98l46l10J91j23m43Q5L78OJ2L40q9
$$ 81 550 -45 -206 456 386 -450 -456 104 -68 -393 103 601 255 -55 136 13 -430 -345 33 39 51 391 302
2600C02m67m5J96k79j28O62L60n18j40M27l49q58K81Q34j76l64P60M70r86o82
$$ 302 -165 -210 -14 -293 -421 241 601 83 -57 370 21 -837 -556 278 102 -262 498 968 -18 -700
2620g00O20J37q06K07J242P0q95J49N41p69q46O82Q00l76j29P76L4j016l47M54
$$ -700 -80 57 -749 -542 700 770 -125 24 565 -204 -1050 -368 432 56 -73 703 737 -279 -626 -172
2640a72r6k79O03O90k09l63M6k93o17P3M98R9J80N67m2p67k37K13m14l48Q58Q10
$$ -172 -268 -547 56 746 537 174 220 -73 -690 -617 -119 -20 160 727 685 -82 -319 -106 -520 -868 -10 800
2662H00m31l35N52k30j231j14J068O9n45P49R19q80j127M82L92r38j37J493N25
$$ 800 369 34 586 356 -875 -989 79 148 -397 352 1271 391 -736 -254 138 -800 -937 556 1081
2681A081r94j27P33o28j252L89J084j46l10Q07L95r94o50L66l3m27M96Q45n8l25
$$ 1081 87 -40 693 65 -1187 -798 286 140 -170 637 1032 38 -612 -246 -279 -706 -210 635 577 252
2701B52J34k55p74p4N34N1J1P37K86p95l83L18l75o77O60J055l20n14P20J65j362
$$ 252 386 131 -643 -717 -183 -132 -121 616 902 107 -276 42 -333 -1010 -350 705 385 -129 591 756 -606
2722f06n26J142K72r19M79J404m77j444L03Q39r27p57J293J010r23m53R47j07
$$ -606 -1132 10 282 -637 -158 1246 769 -675 -372 467 -460 -1217 76 1086 163 -290 657 550
2740E50j399o3J119o6o20P36P78p91p65M96J18p57J13R65Q1n05K31K36o67l90
$$ 550 -849 -912 207 141 -479 257 1035 244 -521 -25 93 -664 -551 414 495 -10 221 457 -210 -600
2760f00M36Q7k57M98N39n46m18N18p1r92J68J167j41q67N82R07r73j036Q74O64
$$ -600 -164 -77 -334 164 703 157 -261 257 186 -806 -638 529 388 -479 103 1010 37 -999 -125 539
2780E39j005k43J372J88j279N1J070o36j140Q46J105r07o78J230M67j442m02J260
$$ 539 -466 -709 663 851 -428 -377 693 57 -1083 -237 868 -39 -717 513 980 -462 -864 396
2798C96P2j183K72J206l08r28M13N52o72l56O61J04n18L24N39n83m78O56J77q51
$$ 396 468 -715 -443 763 455 -473 -60 492 -180 -536 125 229 -289 35 574 -9 -487 169 346 -505
2818e05OR80j16p97L79O71o51n76P06K22q10J57J012l88r66P19Q34j139q23J305
$$ -505 -499 481 365 -432 -53 618 -33 -609 97 319 -491 -334 678 290 -676 43 877 -262 -1085 220
2838B20O88j396l68J589J70j557j3J353l44j191O03J012p16o09Q66K41j082M1
$$ 220 908 -488 -856 733 903 -654 -667 686 342 -849 -246 766 50 -559 307 548 -534 -493
2856d93J057l21r32O95R43q78q40Q38M74r96k57R87J92o08K32M35n37l50N21j83
$$ -493 564 243 -689 6 949 71 -769 69 543 -453 -710 277 469 -139 93 528 -9 -359 162 -21
2876b1p54N37R64o31q17R88P23j272o88J299M86j301j44J260j78j250L76R29o73
$$ -21 -775 -238 726 95 -722 266 989 -283 -971 328 814 -487 -631 629 451 -799 -423 506 -167
2895a67n30J173N21j207j56J212m60j641M16J486n60j092J114J271r72j004Q04
$$ -167 -697 476 997 -210 -366 846 386 -1255 -839 647 87 -1005 109 1380 408 -596 208
2912B08L90j036k66Q36j4n02M35L58p13j33R33l4q52M49R64p01j147M66N41q59
$$ 208 598 -438 -704 132 118 -384 51 409 -304 -437 496 462 -390 59 1023 322 -825 -359 182 -677
2932f77l41J160N11n33L21O60q04r29N62J78j196LJ647J26j378M03J529o60j568
$$ -677 -1018 142 653 120 441 1101 297 -632 -70 108 -1088 -1085 562 688 -690 -287 1242 582 -986
2951i86P55J397r09j157R18O01j284n27J121K92o29O74J141o07r38M68M4j439
$$ -986 -231 1166 257 -900 18 619 -665 -1192 -71 221 -408 266 1407 800 -138 330 374 -1065
2969a065m45J303M32p25M54J242k94j023J37L43n94k76N97o4n23L69L32p65k12
$$ -1065 -1510 -207 225 -500 -46 1196 902 -121 16 359 -235 -511 86 22 -501 -132 200 -565 -777
2988g77J265M51r24J41J169o17j779L9R38o01o89J342J233o41l68Q84l04j507
$$ -777 488 939 15 156 1325 708 -1071 -1032 -94 -695 -1384 -42 1191 550 182 1066 762 -745
3006g45QR80n51q28J098R83j133p67J279N51j203j05J458N3j388j93O11o10p84
$$ -745 -737 243 -308 -1136 -38 945 -188 -955 324 875 -328 -433 1025 1078 -310 -503 108 -502 -1286
3025a286O78Q50o4K59P74l25r42OJ01q65l32J074N14o58J13Q65l12r25L69O71
$$ -1286 -608 242 178 437 1211 886 -56 -50 51 -814 -1146 -72 442 -216 -103 762 450 -475 -106 565
3045E65n16l36P63m0j114m2Q38m11p17J131J227q07q59R56K64j676o48J320L79
$$ 565 49 -287 476 436 -678 -720 118 -293 -1010 121 1348 541 -318 638 902 -774 -1422 -102 277
3064B77r84L43J358k51j113K98O10p30m92Q87L21q29l8P57l80q63N43Q72l96l83
$$ 277 -707 -364 994 743 -370 -72 538 -192 -684 203 524 -305 -343 414 34 -829 -286 586 190 -193
3084a93P04K54r18l50M31j40l82N04N27l37l6N35l18q39K67O98n35n58Q97N98
$$ -193 511 765 -153 -503 -72 -212 -594 -90 437 100 64 599 281 -558 -291 407 -128 -686 211 809
3104H09r76m71R45J69j041R9J100k36r23M48O78p87o04R33M26r24o5J084j76j138
$$ 809 -167 -638 307 476 -565 -466 634 398 -525 -77 601 -186 -790 143 569 -355 -420 664 488 -650
3124f50K41R61m88q09P02P81o78n08O78K02p23o2N85j62m46L78L46m78j06N95
$$ -650 -409 552 64 -745 -43 738 60 -448 230 432 -291 -353 232 70 -376 2 348 -130 -236 359
3144C59m1o00K08N25m76n45N25L62n67j01P46Oo67K08N61n18n55O52L63p67j78
$$ 359 318 -282 -74 451 -25 -570 -45 317 -250 -351 395 401 -266 -58 503 -15 -570 82 445 -322 -500
3165e00Q60mr15K28R53k99p77N16O41p62o60O37L36p10J9Q96no50K43M74n86n33
$$ -500 360 356 -559 -331 622 323 -454 62 703 -59 -719 -82 254 -456 -437 459 454 -196 47 521 -65 -598
3187e98N49L35n77k7P13p7o94J80N45l42l59N54L16n81j64M25k17n82L27O04k95
$$ -598 -49 286 -291 -318 395 318 -376 -196 349 7 -352 202 518 -63 -227 198 -19 -601 -274 330 35
3208C5k38O49J90q19k20N76j27o71L68P91k98n55M47L13o89k92P02J68n47J47
$$ 35 -203 446 636 -183 -403 173 46 -625 -257 534 236 -319 128 441 -248 -540 162 330 -217 -70
3228g0N88l57o56K92M10m41j61P13K34n92p2M14l08n74L34M72k43j25N17L0o21
$$ -70 518 161 -495 -203 207 -234 -395 318 552 -40 -112 302 -6 -580 -246 226 -17 -142 375 405 -216
3249b16k0M06k83l66N35M62m87k64M98j1p13L9O97q9m82L98M76n56m86M79J93
$$ -216 -236 170 -113 -479 56 518 31 -233 265 254 -459 -420 277 188 -294 104 580 24 -462 17 210
3270B10n55L4P55l9o38J62M69m85n33N18M70m08j77N66N9o34p7M35j70l35L81
$$ 210 -345 -311 444 405 -233 -71 398 -87 -620 -102 368 -40 -217 349 408 -226 -303 132 -38 -373 8
3291HL55l30j73L43n9m82J41M55j83k83L56K13m69j98L78J0m03K46M65k63l24
$$ 8 363 33 -140 203 144 -338 -197 258 75 -208 148 361 -108 -306 72 82 -321 -75 390 127 -197
3312a97L51J38n85j16O08Kn45K15O28l16o14L73M50m89l52N90K58n90q9N44j06
$$ -197 154 292 -293 -409 199 201 -344 -129 499 183 -431 -58 392 -97 -449 141 399 -191 -280 264 158
3333A58n51K58N05l33l57M79K28n62j70N19K3n23J43M92j73l73K58K33l49j20
$$ 158 -393 -135 370 37 -320 159 387 -175 -345 174 197 -326 -183 309 136 -237 21 254 -95 -215
3353b15L44l0l10J73K97l03k18L88J39m58k9M77q2m69K02M00k87l23L79K00m53
$$ -215 129 99 -211 -38 259 -44 -262 126 265 -193 -222 255 173 -296 -94 306 19 -304 75 275 -178
3374a78o8M95q1n05K67M71l87m39M65L48n71k36O33J50o14KN75j49n57K47M47
$$ -178 -246 249 168 -337 -70 401 14 -425 40 388 -183 -419 214 364 -250 -248 327 178 -379 -132 315
3395C15l43k60M40J59m89n1M49j13m52K55M27k90k96L66J46m38p6L88n0k84K28
$$ 315 -28 -288 152 311 -178 -229 220 107 -345 -90 337 47 -249 117 263 -175 -251 137 87 -197 31
3416C1K70l27k05L52J5m46J17N19j83m08L27L14m79l13M92J87m97L8N71j24n73
$$ 31 301 -26 -231 121 136 -310 -193 326 143 -265 62 376 -103 -416 76 263 -234 -196 375 251 -322
3437c22K03M11l94l64N39L34n15j51N55n3o32Q9N59j77m05M11L37m55l05M23M9
$$ -322 -119 292 -102 -466 73 407 -108 -259 296 243 -389 -300 259 82 -323 88 425 -30 -335 88 137
3458A37m80J18N53j22m01K57K76m56k48M04J36l31J12M03k22l72K36J52m08m0
$$ 137 -343 -225 328 206 -195 62 338 -118 -366 38 174 -157 -45 358 136 -236 0 152 -256 -296
3478b96N74K8m80J41M29l99n29M00M26l78j77O07J06o38n6M52k49m53M24N04m20
$$ -296 278 306 -174 -33 396 -3 -532 -132 294 -84 -261 346 452 -186 -242 210 -39 -492 -68 436 16
3499A6k88N42O7p27n5O88qn36K63N39l66n65K72K73l59k0N17P4l59J37J87m54
$$ 16 -272 270 337 -390 -445 243 235 -301 -38 501 135 -430 -158 115 -244 -264 253 327 -32 105 292 -162
3521a62l44M62K13l99N9O22p8o24P3M02k75l15M47K99l85j13L33k39m90L28N14
$$ -162 -506 -44 169 -230 -171 451 373 -251 -178 224 -51 -366 81 380 -5 -118 215 -24 -514 -186 328
3542C28l32k12O46K34q18l48N92j1o73K06Q31p8n29K53K87m83l29M61J23l89J78
$$ 328 -4 -216 430 664 -154 -502 90 79 -594 -388 443 365 -164 89 376 -107 -436 25 148 -241 -63
3563f3M99l61n57L57L89m78j67P35K83o15j93L58j98n32J70M30p8K3M33n3n05
$$ -63 436 75 -482 -125 264 -214 -381 354 637 22 -171 187 -11 -543 -373 57 -21 2 435 382 -123
3584a23P3K91m24l97O11M71n74l05O28R7p31l4P31L2m65K24L61m84m43L40J02
$$ -123 -50 241 -183 -580 31 502 -72 -377 251 348 -383 -417 314 346 -119 105 466 -18 -461 -121 -19
3605a9m41K10P69r6n82K74M25o19o23N38M87m84j82N91J23n55n8L80j32j91L56
$$ -19 -460 -250 519 423 -159 115 540 -79 -702 -164 323 -161 -343 248 371 -184 -242 138 6 -185 171
3626A71J50m23n3L54k86n32L99N99l13k91N42K81o86l24M60Qm68K05N17j87k79
$$ 171 321 -102 -155 199 -87 -619 -220 379 66 -225 317 598 -88 -412 48 56 -412 -207 310 123 -156
3647a56L67J00n93k3O58j03o37K99O43m77o89M58N52m59l37O27L04n78j62L65
$$ -156 211 311 -282 -305 353 250 -387 -88 555 78 -611 -153 399 -60 -397 230 534 -44 -206 159
3667A59j34l93K46L14k87o2M63m4n69J04N19k56m72L71M49m24l49M11J52m24M5
$$ 159 25 -368 -122 192 -95 -157 306 262 -307 -203 316 60 -412 -41 408 -16 -365 46 198 -226 -181
3688a81M20j50l06L33J68n25j10O10Lo34J71P29k97p08L30N99m33m89N25L86n13
$$ -181 239 89 -217 116 284 -241 -351 259 262 -372 -201 528 231 -477 -147 452 19 -470 55 441 -72
3709g2k10M78k2m62J95M03l12k62M27J52n90o2N97j9n43J71N45k59m80K48K69
$$ -72 -282 196 174 -288 -93 310 -2 -264 163 315 -275 -337 260 241 -302 -131 414 155 -325 -77 192
3730A92l21j10L91lk81J94K20m28k10M97R9n57P3O74j48o87J78N70l33m65M61
$$ 192 -129 -239 152 149 -132 62 282 -146 -356 141 240 -317 -244 430 282 -405 -227 343 10 -455 6
3751FM15m28k25M37j5n42J17N11k50l45M82L24o02l14N66J26o10L8O79l5n17J51
$$ 6 421 -7 -232 205 190 -352 -235 276 26 -319 163 487 -115 -429 137 263 -347 -309 370 335 -182 -31
3773c1L44l37l23K87J77k78J19L56j98l35K77K00m45j47N33J15n22J3M68j96m73
$$ -31 313 -24 -347 -60 117 -161 -42 314 116 -219 58 258 -187 -334 199 314 -208 -195 273 77 -396
3794c96K48L98k51j45M29N4m99k9L63k96m11M25M84l66k43N61J82o74j82N13o0
$$ -396 -148 250 -1 -146 283 337 -162 -191 172 -124 -535 -110 374 8 -235 326 508 -166 -348 165 105
3815A05n05J76N13k14l43L30J97l89n2M69k1m20J53L22m11m14L37K93l50OO06
$$ 105 -400 -224 289 75 -268 62 259 -130 -182 287 266 -154 -1 321 -90 -504 -167 126 -224 -218 388
3836C88J07m39j7K35l22m34K42K38k24M9M88J2m25J11L09l20l42L85K69m19j99
$$ 388 495 56 39 274 -48 -482 -240 -2 -226 -177 311 323 -102 9 318 -2 -344 41 310 -109 -308
3857c08L71j9m65J20N18j4j94L53J71n13l36K18r3m40K81O47l6k71L32K32n66
$$ -308 63 44 -421 -301 217 203 9 362 533 20 -316 -98 -191 -631 -350 297 261 -10 322 554 -12
3878a2l98L71J36l88P8N06j16m71J23L07k63j30N29K65l94j45K43l10n95J37M86
$$ -12 -410 -39 97 -291 -213 293 177 -294 -171 136 -127 -257 272 537 143 -2 241 -69 -664 -527 -41
3899d1j5j5M85K72m59k93J00k04l37K10M28n0q0K60k7m78o5L96J1k04L11L16m24
$$ -41 -56 -71 414 686 227 -66 34 -170 -507 -297 131 81 1 261 234 -244 -309 87 98 -106 205 521 97
3922I7m34J32M0l36J48O68J60k81J33J44n76n07L02K82k49R6O48N6n99j19L08
$$ 97 -337 -205 -165 -501 -353 315 475 194 327 471 -105 -612 -310 -28 -277 -181 467 523 -76 -195 113
3943A13k24l48L88N05j89k67J74p5m97n4M21J07n5L44K47m05m00N5j5k69J51N25
$$ 113 -111 -459 -71 434 245 -22 152 77 -420 -474 -53 54 -1 343 590 185 -215 -160 -175 -444 -293 232
3965B32J07j64O6k9m09k03K79Q8j06L15L39l20m53J54J18l80l9O34K69m15r3K92
$$ 232 339 175 241 212 -197 -400 -121 -33 -139 176 515 195 -258 -104 14 -366 -405 229 498 83 -10 282
3987B82k99n27J85M87o4j05M00J14n61k76K89j0l18K88N70j08m00R3J21l87k31
$$ 282 -17 -544 -359 128 64 -41 359 473 -88 -364 -75 -85 -403 -115 455 347 -53 40 161 -226 -457
4008d57L60K82j10L7J46j69k90L4O1q0J60L50n2k83J8M8l28j69M00K72j43K7K67
$$ -457 -97 185 75 112 258 89 -201 -167 -106 -186 -26 324 272 -11 7 55 -273 -442 -42 230 87 114 381
4031C81k01m76O5K50j96o9M94K08m86j75L78j10n21K20O59r9m65J78K79m59m20
$$ 381 180 -296 -231 19 -177 -246 248 456 -30 -205 173 63 -458 -238 421 322 -143 35 314 -145 -565
4052e65L79L78j80pL79l7m77j13J74j22j03L31L04j76j68R1j02k69K7K91Q9J7
$$ -565 -186 192 12 5 384 347 -130 -243 -69 -191 -294 37 341 165 -3 88 -14 -283 -256 35 124 141
4074A41J07r2k80n5K2j28O7M60J88l04r4K14k58n27J52N53l5k24L58K72n42m45
$$ 141 248 156 -124 -179 -157 -285 -218 242 430 126 32 246 -12 -539 -387 166 131 -93 265 537 -5 -450
4096d50L22J67l34J29O35J8n65n1K81l29m37M52N83j82k39K98M9n88l25L62K04
$$ -450 -128 39 -295 -166 469 487 -78 -129 152 -177 -614 -162 421 239 0 298 347 -241 -566 -204 0
4117@j06J84L41q2l62j24m2j22Q3K85J59M4K5j49l30r6R4pN6L99K29l04k29J46
$$ 0 -106 78 419 337 -25 -149 -191 -313 -230 55 214 258 283 134 -196 -292 -198 -205 -149 250 479 175 -54 92
4141I2j74m55J59O04N2k89K37K72n25n60L34L80k97m2O25J94o41k64L67j30m58
$$ 92 -82 -537 -378 226 278 -11 226 498 -27 -587 -253 127 -170 -212 413 607 -34 -298 69 -61 -519
4162e19K58O49k0m00J58J71m38l83K99L17q0J2L00rl46j72J6j6K7J88J58K6J7
$$ -519 -261 388 368 -32 126 297 -141 -524 -225 92 12 24 324 315 -31 -203 -187 -203 -176 12 170 196 213
4185B13j27k60p8J36nl6K98K44k60k55J71J8m37J3N80R4l94Q3M27l07o02K29N04
$$ 213 86 -174 -252 -116 -121 -157 141 385 125 -130 41 59 -378 -365 215 309 -85 -2 425 118 -484 -255 249
4208B49k59l13M97L61n15l58L79J37m65k1N53P6m18M5L17k21l73J86K86j25j18
$$ 249 -10 -323 174 535 20 -338 41 178 -287 -308 245 321 -97 -52 265 44 -329 -143 143 18 -100
4229a00K12J11k22j27P7K4o7M1O8L2O0l8j86NJ81r3k19J96L00j99k73K58K19l75
$$ -100 112 223 1 -126 -49 -25 -92 -51 17 49 109 71 -115 -110 71 -22 -241 -45 255 56 -217 41 260 -115
4253a15k24L97K06m29o8M91K5n13K4M89j83m69K74M67l00l67L85K94m67k94M42
$$ -115 -339 58 264 -165 -233 258 283 -230 -206 283 100 -369 -95 372 72 -295 90 384 -83 -377 65
4274F5J86m14m7M66J9m00l7L01j00k59J24K35l1j03N1pr5l6j5j5J26J24q6o0J04
$$ 65 251 -163 -210 256 275 -125 -162 139 39 -220 -96 139 108 5 56 49 -46 -82 -97 -112 14 138 52 -8 96
4299I6m6k72NK84j3k04K17K65l01l31K60K14l63j25N39J82n04j26M36o8n65J04
$$ 96 50 -222 -217 67 54 -150 67 332 31 -300 -40 174 -189 -314 225 407 -97 -223 213 145 -420 -316
4321c16O08o8m03K06L76l38m58K50K79k25j10M00J50l66j35K23o7k34J35K88m9
$$ -316 292 224 -179 27 403 65 -393 -143 136 -89 -199 201 351 -15 -150 73 6 -228 -93 195 146
4342A46j47L9K2j75q6Q4J14R2J01n5r5K3q4k79LL32J16k15P4L10j84m26J13L43
$$ 146 -1 38 60 -115 -201 -117 -3 89 190 135 40 63 -21 -300 -297 35 151 -64 10 320 136 -290 -177 166
4366A66j53k33L18K54l86k83K95Q6l51J06N28L4m47O0K54l38m37K72M30j64j41
$$ 166 13 -220 98 352 -34 -317 -22 64 -287 -181 347 381 -66 -6 248 -90 -527 -255 175 11 -130
4387a30L48J82l96k44K29Q1j92N1K38k4k10n8J6o9O9K04J13K1L4q9k73j76K8k6
$$ -130 218 400 4 -240 -11 70 -122 -71 167 143 -67 -125 -109 -178 -109 95 208 229 263 174 -99 -275 -247 -273
4411b73M3K86K26q4q6Q7j42l36M6L37m1k02J83J94l35l43K93K98j46jM43L9n22
$$ -273 -230 56 282 198 112 199 57 -279 -233 104 63 -139 44 238 -97 -440 -147 151 5 4 447 486 -36
4434c6k13J28j61k58L11M96Lj34J76K5m42k29K46R6j70J17L00j22l31J1J43m1
$$ -36 -249 -121 -282 -540 -229 267 270 136 312 337 -105 -334 -88 8 -162 -45 255 133 -198 -187 -44 -85
4456h5N3K93J53j54j60j28k95j69J47K13J49K36K44j10l16r9r5k05KL09J65j00
$$ -85 -32 261 414 260 100 -28 -323 -492 -345 -132 17 253 497 387 71 -28 -123 -328 -326 -17 148 48
4478D8J1Q1k15k36J80K98m7lK60n9m92k52J63oj14L58N04j1k82J4n6m25k27L02
$$ 48 59 140 -75 -311 -131 167 120 117 377 318 -174 -426 -263 -269 -383 -25 479 468 186 200 144 -281 -508 -206
4502b06K24o9J19K54j27l83MJ77n5l0L18J66k75k42K0j32j85J55L86J65nP3p2
$$ -206 18 -51 68 322 195 -188 -184 -7 -62 -92 226 392 117 -125 -105 -237 -422 -267 119 284 279 352 280
4525B80l50k29J9L8N1K51K26n6j29m1j40j96J01K47N0j7J25m8l35j93J71O9n3
$$ 280 -70 -299 -280 -242 -191 60 286 230 101 60 -80 -276 -175 72 122 105 230 182 -153 -346 -175 -106 -159
4548a59K56L55j30l27k3Ol00j24L99K93j43nK15j57m45k5K96Or9K69K35k64k92
$$ -159 97 452 322 -5 -28 -22 -322 -446 -47 246 103 98 313 156 -289 -314 -18 -12 -111 158 393 129 -163
4571a63O5L0j77O2L57R8j91nJ4k15j78J23J96M2P7J20p1k19j08k8o7J03K43O6
$$ -163 -98 -68 -245 -183 174 272 81 76 90 -125 -303 -180 16 58 135 255 184 -35 -143 -171 -238 -135 108 174
4595A74m4L0mk51j81J77J09r1Q5K56o9l16j7J71j18j15K81K60k26k00J44m3l35
$$ 174 130 160 156 -95 -276 -99 10 -81 4 260 191 -125 -142 29 -89 -204 77 337 111 -89 55 12 -323
4618c23nL76R5j53J18K40k05l58N2J63j27o9K73J38j81j03J04n8j13R4J65j8n0
$$ -323 -328 48 143 -10 108 348 143 -215 -163 0 -127 -196 77 215 34 -69 35 -23 -136 -42 123 105 55
4641E5K0n9j76k6R8K5N1J89O1j38n8J1j62j31J40J67q9k3K21Mk91l1K51k6k03
$$ 55 75 16 -160 -186 -88 -63 -12 177 238 100 42 53 -109 -240 -100 67 -22 -45 176 180 -111 -142 109 83 -120
4666a20J06K71j70k95J14J67j96r9L17J60k30m6J88q7l13M0K48o6j21J80J60j70
$$ -120 -14 257 87 -208 -94 73 -123 -222 95 255 25 -21 167 80 -233 -193 55 -11 -132 48 208 38
4688C8j47J16N2j28j3J53Pr8J2J2q5J8R4mk3J09L9j59q2J21l0j57R7K01q6j33
$$ 38 -109 7 59 -69 -82 71 78 -20 -8 4 -81 -63 31 27 4 113 152 -7 -89 32 2 -155 -58 143 57 -76
4714g6J47R1k15r4K27M2k30J3K75p6k96J17K65j56k27K09K01k29j51K17P3k29
$$ -76 71 162 -53 -147 80 122 -108 -95 180 104 -192 -75 190 34 -193 16 217 -12 -163 54 127 -102
4736a02m6K46j3k04N5J86r3j55J21R8j30p5J52K2j09K0J03n8o5N0Rq9L3R9n2m2
$$ -102 -148 98 85 -119 -64 122 29 -126 -5 93 -37 -112 40 62 -47 -27 76 18 -47 3 12 -77 -44 55 3 -39
4762c9J25L5j79k3J64n3j65J12J93j28j61J52J16k29r3K58N6k26K5K31r8k68Q6
$$ -39 86 121 -58 -81 83 30 -135 -23 170 42 -119 33 149 -80 -173 85 141 -85 -60 171 73 -195 -109
4785a09K27j24j59K24J83k24j54J89Pk28K3K41j3j39P9J18j71j16J14O0q8L5J59
$$ -109 118 -6 -165 59 242 18 -136 53 60 -168 -145 96 83 -56 23 141 -30 -146 -32 28 -60 -25 134
4808A34n1j46L1J5j14J7J72K5q4O8P1j79j63J54Q7j42O0K36k5k24J0J34j42j45
$$ 134 83 -63 -32 -17 -131 -114 58 83 -1 67 138 -41 -204 -50 37 -105 -45 191 166 -58 -48 86 -56 -201
4832b01K02J93j48r1J74j3k90j5K40Pj52J57J76j83k00J05O2j71J6K49M6j43J
$$ -201 1 194 46 -45 129 116 -174 -189 51 58 -94 63 239 56 -144 -39 23 -148 -132 117 163 20 21
4855B1N7j56j22J14J21m3K7J67p9k08RP2j11j7K23J04j52j8Q9j37j98J07J95o9
$$ 21 78 -78 -200 -86 35 -8 19 186 107 -101 -92 -20 -131 -148 75 179 27 9 98 -39 -237 -130 65 -4
4879dk2K05J3k76q3J61l3j33J57K62j14j84Q9L1k30o9K43J05j27P6J33j44k41
$$ -4 -26 179 192 -84 -167 -6 -39 -172 -15 247 133 -51 38 69 -161 -230 13 118 -9 67 200 56 -185
4902a85O2J29p6j3K33P6k06o4O2j02j29J33J70k3k4J05o3k14k3J05j4k8J94J19
$$ -185 -123 6 -70 -83 150 226 20 -44 18 -84 -213 -80 90 67 43 148 85 -129 -152 -47 -61 -89 105 224
4926B24j69j04N9o2j64R1K31j0q6J06L0k45j13J67N9j12J21K23r7k31N0O4j55
$$ 224 55 -49 10 -52 -216 -125 106 96 10 116 146 -99 -212 -45 14 -98 23 246 149 -82 -32 32 -123
4949a23q7K50J59j44m5J28j11k25M7J82j1m2J67N6j88j27P7k7q6J00K02k2r7L1
$$ -123 -210 40 199 55 10 138 27 -198 -151 31 20 -22 145 201 13 -114 -37 -64 -150 -50 152 130 33 64
4973F4j9j84n0J49M7k8J05Q9j33j46O2kj02O1K16nj30L9K6j64j11J67J23p0L1
$$ 64 45 -139 -189 -40 7 -21 84 173 40 -106 -44 -46 -148 -87 129 124 -6 33 59 -105 -216 -49 74 4 35
4998C5J63o2k48j7J23o9p0J96J50j32j00R9n2j87L3J84M2q9N8P4j75j22R2O1m2
$$ 35 198 136 -112 -129 -6 -75 -145 51 201 69 -31 68 16 -171 -138 46 88 -1 57 131 -44 -166 -74 -13 -55
5023e5P7J51l0j49nOj39l2J70P1l9L9O5j13j36N2O2p7J6J90%j76j8J03r8r5J50
$$ -55 22 173 143 -6 -11 -5 -144 -176 -6 65 26 65 130 17 -119 -67 -5 -82 -66 124 124 -52 -70 33 -65 -160 -10
5050a0J52n5q8R4l0k16m0J57K5o1J24J47j17j39N6J3j30kJ95K5j05ON8r4r2Q9
$$ -10 142 87 -1 93 63 -153 -193 -36 -11 -72 52 199 82 -57 -1 12 -118 -120 75 100 -5 1 59 -35 -127 -38
5076c8Q3l3RJ20n5j50k8N4o3j6J64Q3p2k1M9p0j45M4R8m5j8J23K8j34n0J09k4
$$ -38 45 12 21 141 86 -64 -92 -38 -101 -117 47 130 58 37 86 16 -129 -85 13 -32 -50 73 101 -33 -83 26 2
5103Bj00R9J40q0r5L4L6j50m1J44Q0q6M6J04p3j43J1O8o7j5J36N2r3m6P6l0j00
$$ 2 -98 1 141 61 -34 0 36 -114 -155 -11 69 -17 29 133 60 -83 -72 -4 -71 -86 50 102 9 -37 39 9 -91
5130i1N9Q1l6l3Q7j4j14k9J04m4l1R8P6r0o5O6oj00rJ28J2p2M2P0q9p9O5L7p6
$$ -91 -32 49 13 -20 67 53 -61 -90 14 -30 -61 37 113 23 -42 24 18 -82 -91 37 49 -23 19 89 0 -79 -14 23 -53
5159e3J0J19j1j10K9P3p0p3Q9O5p4l6Q6j6r3J1J02n2m0P2M2r2l0Q1j4r3M3R7l6
$$ -53 -43 76 65 -45 -16 57 -13 -86 3 68 -6 -42 44 28 -65 -54 48 -4 -44 28 70 -22 -52 29 15 -78 -35 62 26
5188B6p7N8O3r6l7P4K1r0J4R3l8q1P0P1o7o7J18J7j09j5Q7lr5L7P3k7n8M1M3o2
$$ 26 -51 7 70 -26 -63 11 32 -58 -44 49 11 -70 0 71 4 -63 55 72 -37 -52 35 32 -63 -26 47 20 -38 3 46 -16
5218a6k3O1Rp1K5O7n5o3O8M4o9pQ7j8p9K1N0n7k8P9K8r3J1P8m4j03N9R6n8q6J04
$$ -16 -39 22 31 -40 -15 52 -3 -66 2 46 -23 -30 57 39 -40 -19 31 -26 -54 25 53 -40 -29 49 5 -98 -39 57 -1 -87 17
5249A7Q2j27m6R0L0j26QJ29j9r9M5R0q2o0R7N9r6j8R2j9j16RP0j5m2O0N7l0l2
$$ 17 99 -28 -74 16 46 -80 -72 57 38 -61 -16 74 -8 -68 29 88 -8 -26 66 47 -69 -60 10 -5 -47 13 70 40 8
5278HK4j7p5L5K4m6KR2j3p1K4R8m8p4N4O2j09p2Q7Pq6J3J44or0O0J01r9j31P9
$$ 8 32 15 -60 -25 -1 -47 -45 47 34 -37 -13 85 37 -37 17 79 -30 -102 -15 -8 -94 -81 63 57 -33 27 128 29 -102 -23
5308b3N4j30n2J60N7j30J5J51oj49L9R1o9j15O1N6o7k0J09K9n2K3Q1n3p7K0pp0
$$ -23 31 -99 -151 9 66 -64 -49 102 96 -53 -14 77 8 -107 -46 10 -57 -77 32 61 9 32 113 60 -17 3 -4 -74
5336g4j0O6oj5Q1L8n6pP1l9j19L0P2r4q2J27Q0r4l1J80J6j68j9J41o3j81O0J53
$$ -74 -84 -18 -24 -39 42 80 24 17 88 49 -70 -40 32 -62 -144 -17 63 -31 -62 118 134 -34 -53 88 25 -156 -96 57
5364E7r4j00J40J25j26o3J37L6j61k8J04m4j28N6J37m4m6R1N5p5m4M6k3p7K2M7
$$ 57 -37 -137 3 128 2 -61 76 112 -49 -77 27 -17 -145 -89 48 4 -42 49 104 29 -15 31 8 -69 -47 0
5390@k7J2N2on3O2M8r0j6Q3j0j49J5J30o2j10J06J44q6r3J06O2j87o0J51K8j68
$$ 0 -27 -15 37 31 -22 40 88 -2 -18 65 55 -94 -79 51 -11 -121 -15 129 43 -50 56 118 -69 -129 22 50 -118
5417a18N2J83o6j63Q9J49j28j26J40J07j54p8J40K6j26j2J35op4M7M5p2l5N6r
$$ -118 -66 117 51 -112 -23 126 -2 -128 12 119 -35 -113 27 53 -73 -85 50 44 -30 17 62 -10 -45 11 2
5442Bo8M6Q4l3m1N4Kj05J9O6m7k8Q5M6r8k5J25m8j45O2J53q1j44J33J22j57j02
$$ 2 -66 -20 64 31 -10 44 46 -59 -40 26 -21 -49 36 82 -16 -41 84 36 -109 -47 106 25 -119 14 136 -21 -123
5469a23J57Q2j78j3J63rj87L7J43r5j12J21J32j30o0J33L0j57k9J20k1r4N2J02
$$ -123 34 116 -62 -75 88 79 -108 -71 72 -23 -135 -14 118 -12 -72 61 91 -66 -95 25 4 -90 -38 64
5493F4m4n8N9L3o8j0N0k8m2O2Rr2J8J03l5p1Q3P7j00p4J03J9j50J6J31k1j12R4
$$ 64 20 -38 21 54 -14 -24 26 -2 -44 18 27 -65 -47 56 21 -50 33 110 10 -64 39 58 -92 -76 55 34 -78 16
5521A6J23j15j08J19Q0j88n6J94K4j97L2J81m0j74P9J46r3j15J01P6j37n2J31
$$ 16 139 24 -84 35 115 -73 -129 65 89 -108 -76 105 65 -109 -30 116 23 -92 9 85 -52 -104 27
5544B7Kj10M7J07m1o9N9K4p2m9O5jm5M8L7l9nQ5m5q0O8N8j01m6J17M0j48k7J74
$$ 27 29 -81 -34 73 32 -37 22 46 -26 -75 -10 -11 -56 -8 29 -10 -15 70 25 -55 13 71 -30 -76 41 81 -67 -94 80
5573H0k0j42O1J59j05j47J11J11j65q4J85N6j57j3J81k4j81M3J45o6j37J00J12
$$ 80 60 -82 -21 138 33 -114 -3 108 -57 -141 44 100 -57 -70 111 87 -94 -51 94 28 -109 -9 103
5596A03j21o0R5M2j27PJ12j5o2K5M2o1l0M1J0m5M7L5l9k3N5j9q3L4R5o1p4J04
$$ 103 -18 -78 17 59 -68 -61 51 36 -26 -1 41 -20 -50 -9 1 -44 3 38 -1 -24 31 12 -71 -37 58 -3 -77 27
5624B7N5j29l6J42J1j59M9J56p1j46Q0J41j47j02J70P4j58m9J74Qj87K4J59n5
$$ 27 82 -47 -83 59 70 -89 -40 116 45 -101 -21 120 -27 -129 41 115 -43 -92 82 90 -97 -73 86 31
5648C1j43Q6J24r8r3J07M6r7k6R9Rq3J5P2n8n4O5K0m2KN3l3m1N1Po5J1Q1m1o7
$$ 31 -112 -26 98 0 -93 14 60 -37 -63 36 45 -38 -23 49 -9 -63 2 22 -20 -18 35 2 -39 12 19 -46 -35 46 5 -62
5678f2P6N4r1n8J14K8j13j9J50j8j52P2J13r7j08J11J05j24o5J42L7j54oJ53l7
$$ -62 14 68 -23 -81 33 61 -52 -71 79 61 -91 -19 94 -3 -111 0 105 -19 -84 58 95 -59 -65 88 51
5703E1j32O0J23p7j11Q5P9r9m9J07K5q7rQ4l1n9M0L6n0k5P2rm2J6L3m5j3N9no8
$$ 51 -81 -21 102 25 -86 -1 78 -21 -70 37 62 -25 -34 50 19 -40 0 36 -14 -39 33 24 -18 -2 31 -14 -27 32 27 -41
5733d1K8N1n2m9P5L6o8l3R4nj00K6J16o3r6N8J02q4p3R8O0j20k9J26j6j10K9J06
$$ -41 -13 38 -14 -63 12 48 -20 -53 41 36 -64 -38 78 15 -81 -23 79 -5 -78 20 80 -40 -69 57 41 -69 -40 66
5761F6l3j04N9J07q4p5P7N0q2k4Q7j4o3J3O0k4n5M2K3k8k9O4j4l5J2L2m1j3M6
$$ 66 33 -71 -12 95 11 -64 13 63 -19 -43 44 30 -33 -20 40 16 -39 3 26 -2 -31 33 19 -16 -4 28 -13 -26 20
5790B0On5M0K7l6m4M7J8p6J3R4or2K3P9l9j09P2P7q0m9Q4N0j04l5J06%q6L7J01
$$ 20 26 -29 11 38 2 -42 5 23 -53 -40 54 48 -44 -21 58 19 -90 -18 59 -21 -70 14 64 -40 -75 31 31 -55 -18 83
5820H3m1j00N7L7o3n0R6M7n7pO0jq9j3N1k2j6L1J9rrK9l6k3L3K3l0pL4j0p3QN0
$$ 83 42 -58 -1 36 -27 -77 19 66 9 2 62 61 -28 -41 10 -12 -28 3 22 13 4 33 -3 -26 7 30 0 -7 27 17 -56 -48 2
5853Bl0j5Q5M6p1k5M8j9r3j4R8j3o4P5P5n6q0M1O3p7m0R2J8r0rN8j4o4N5Q9j4
$$ 2 -28 -43 42 88 17 -8 40 21 -72 -86 12 -1 -65 10 85 29 -51 -10 53 -24 -64 28 46 -44 -53 5 -9 -73 -18 71 57
5884E7l3K7L2r8n3L8kj1K6Q0Pk3Lj2n5rRJ1k3M2J6o8JM9J6o2N1P2l4p8J8Mq7l9
$$ 57 24 51 83 -15 -68 -30 -32 -43 -17 63 70 47 50 38 -17 -26 -17 -6 -29 13 29 -39 -38 11 27 -35 16 88 54 -24 -6 -2 -89 -128
5918a28J01O1m4L8R3k0j40rP6o4q6P3J10o2o1Q7M9r2l0R8L0q9%N3l8j01J9P7l
$$ -128 -27 34 -10 28 121 101 -39 -48 28 -36 -122 -49 61 -1 -62 25 74 -18 -48 50 80 -9 -9 44 6 -95 -76 1 -2
5947bj2Q3L5l4l8k0l5m0J1K3J6K8N1k7l8M1pn9qO8%p8J5O6n0q1O9J00o8j9R9J2
$$ -2 -14 69 104 70 32 12 -23 -63 -52 -29 -13 15 66 39 1 42 35 -24 -32 36 36 -42 -27 39 -11 -92 -23 77 9 -10 89 101
5979A01j30n8Q8pr9M9J45l2r8N8P4q8r9R1N1r3j1R4J0r5K0O1pn4L2N5l7k8J8j4
$$ 101 -29 -87 1 -6 -105 -56 89 57 -41 17 91 3 -96 -5 46 -47 -58 36 46 -49 -29 32 25 -29 3 58 21 -7 11 -3
6009cl8J8L1j0OM9pm0J0K7p2k7Q1K7q2jJ02k1r7J8Q7n3q8P5Q7r8n5J12L7j11l0
$$ -3 -41 -23 8 -2 4 53 46 6 16 43 -29 -56 25 52 -30 -31 71 50 -47 -29 58 5 -83 -8 79 -19 -74 38 75 -36 -66
6040f6J07%j22L2J04m1r3P8P2p7o3Q6J7o8qQ3j5o3K0L0k9j9O8J6l0OL0o1o4M3
$$ -66 41 41 -81 -49 55 14 -79 -1 71 -6 -69 17 34 -34 -42 41 26 -37 -17 13 -16 -35 33 49 19 25 55 -6 -70 -27
6070b7K9m7J6J02j5p0M3M6j00n7P8M8p6LR8k2j16J5J12m1o8Q7P2q6q4O0J7j15
$$ -27 2 -45 -29 73 58 -12 31 77 -23 -80 -2 46 -30 -27 71 49 -67 -52 60 19 -49 38 110 24 -60 0 17 -98
6098i8OJ24K0m1L9O5q4j09K9J9m5J0J07Rn3K1J2o9l3O9L6m4N4M4q2r9M8L2n5J6
$$ -98 -92 32 52 11 50 115 31 -78 -49 -30 -75 -65 42 51 -2 19 31 -38 -71 -2 34 -10 44 88 6 -93 -45 -13 -68 -52
6128e2J48M6j03j1M0r3j28O3J18l1mJ18L0j41n7N7k0o3O0J29k3r6M7oj05l7J02
$$ -52 96 142 39 28 68 -25 -153 -90 28 -3 -7 111 141 0 -57 0 -20 -83 -23 106 83 -13 34 28 -77 -114 -12
6155a2O3k0M1L0o3r5Mj7n4P2J07K2m6L8j4j21n6Q7K5k6M9J08n3j20J6K3p8l2J53
$$ -12 51 31 72 102 39 -56 -52 -69 -123 -51 56 78 32 70 56 -65 -121 -34 -9 -35 14 122 69 -51 -35 -12 -90 -122 31
6184C1J00r0j8P4q4j55K1J30Kl6J24N8j15r4K9pr2N5J36L0o4K2Nj09p0O5M4k0
$$ 31 131 41 23 97 13 -142 -121 9 11 -25 99 157 42 -52 -23 -30 -122 -67 69 99 35 57 62 -47 -117 -52 -8 -28
6212b8N4Q8n1o9Jm1o0K5J14J6l1N0Oj06q2O8L1n4M9J33rj28mM4j01o5J25J06n6
$$ -28 26 114 63 -6 -5 -46 -106 -81 33 49 18 68 74 -32 -114 -46 -15 -69 -20 113 104 -24 -28 16 -85 -150 -25 81 25
6241B5j6Q1k2j54j5R1j1m9R3R2o7r0N3nq9OR8M1m2L6K7q6q3N1J7l9O0Q6k4o6K0
$$ 25 9 90 68 -86 -101 -10 -21 -70 23 115 48 -42 11 6 -83 -77 21 62 20 56 83 -3 -86 -35 -18 -57 3 89 65 -1 19
6272A9Nq6j0P7J1l4M3P3q4q9O0M1q5qJ18L1j10kR5o7j06O2J00n7l8Q9L7j28j3
$$ 19 24 -62 -72 5 16 -18 25 98 14 -75 -15 26 -59 -67 51 82 -28 -30 65 -2 -108 -46 54 -3 -41 48 85 -43 -56
6301e6Q4j8q0L5R7l8p3N7L0o3l8P5J1n7K5M3l1l0M8J3o2jM9j5m2M5O1o8k4O5o
$$ -56 28 10 -70 -35 62 24 -49 8 38 -25 -63 12 23 -34 -9 34 3 -27 21 34 -28 -29 20 5 -37 8 69 1 -23 42 36
6332C6r2NR7k5o4P4O3r8n4P7K1j06kJ31J4j05J7O6o4r0M2R6n6k1J03K1j13k2M5
$$ 36 -56 -51 46 21 -43 31 94 -4 -58 19 40 -66 -68 63 77 -28 -11 55 -9 -99 -57 39 -17 -38 65 86 -27 -49 -4
6361dk2n3N0R8k8m5L9j5q1pL6K1lO8K9o5k5pk1n3M3Q5mk0N2jj12l8M9J3m5P8J19
$$ -4 -26 -79 -29 69 41 -4 35 20 -61 -68 -32 -11 -14 54 83 18 -7 -14 -35 -88 -45 40 36 16 68 67 -45 -83 -34 -21 -66 12 131
6394A31m9q8PJ2r2l1J16P1n4J5P0o4j44oR1k1j3J13O5p5o7j2k9o3K0J16L9lJ2
$$ 131 82 -6 1 13 -79 -110 6 77 23 38 108 44 -100 -106 -15 -36 -49 64 129 54 -13 -25 -54 -117 -97 19 58 55 67
6423F7Or7p8J1L0JP1Q0Jn5k8m6o9J2O2O8JO4Rr1r2O%k9O6J25K1o0l1Rj08p7Q5
$$ 67 73 -24 -102 -91 -61 -60 11 91 92 37 9 -37 -106 -94 -32 36 37 101 110 19 -73 -67 -67 -96 -30 95 116 56 25 34 -74 -151 -66
6456f6Q8J2K2P7j7j39p1L7j1j8J06J06j6p3k2k0j14k8R8Q6%K3M9o0j12m4K3J1
$$ -66 22 34 56 133 116 -23 -94 -57 -68 -86 20 126 110 37 15 -5 -119 -147 -49 37 37 60 109 49 -63 -107 -84 -73
6484g3J7R7N9k9m3l6n0n7J4P3N7M0K8l7q5l7k0j3K4R7P1j8j6or0r4J6Q6K8J1P9
$$ -73 -56 41 100 71 28 -8 -58 -115 -101 -28 29 69 97 60 -25 -62 -82 -95 -71 26 97 79 63 57 -33 -127 -111 -25 3 14 93
6515I3M7r4q7Nj7n0L9J42L1o8mK7r7r7M6Q9J1KP3J3j14p8K1Pl6O5J06J3m1j8k5
$$ 93 140 46 -41 -36 -53 -103 -64 78 109 41 37 64 -33 -130 -84 5 16 18 91 104 -10 -88 -67 -60 -96 -31 75 88 47 29 4
6546Dp4l6M0N1K0L2L6k1o6k5k1j6M5O3J3%Ok4o6l1L2K1qN3Q4n6o7mJ8n1m2R4N0
$$ 4 -70 -106 -66 -15 5 37 73 52 -14 -39 -60 -76 -31 32 45 45 51 27 -39 -70 -38 -17 -25 28 112 56 -11 -15 3 -48 -90 4 54
6579E4l0j2N9l6j00MP5k3m6P1O8m2q8M5K4o5k2Q6K3n7ML5k7n8J7L5rj7O1j4k7
$$ 54 24 12 71 35 -65 -61 14 -9 -55 16 84 42 -46 -1 23 -42 -64 22 45 -12 -8 27 0 -58 -41 -6 -15 -32 29 15 -12
6610a2%%J0m4K5K9k8RK1J3l4J2Pk1k8M9Rm0K0O9l1o7K1M9o1n0Q1M1l5k4O8j5j06
$$ -12 -12 -12 -2 -46 -21 8 -20 -11 10 23 -11 1 8 -13 -41 8 17 -23 -3 66 35 -32 -11 38 -23 -73 8 49 14 -10 58 43 -63
6643f3J7O0j7m1N7P0o7o9O6Rr9LJ05K3m8J8N7o9r5L0L0j4J4O7J6m6j4%m6m4N4
$$ -63 -46 14 -3 -44 13 83 16 -53 13 22 -77 -74 31 54 6 24 81 12 -83 -53 -23 -37 -23 44 60 14 0 0 -46 -90 -36
6674c6N5j0K5M6n4r1RK6j6oJ16M3o3k1Mo2q2L6J05KOP2Qj14q2N4j2l5P1J16j1
$$ -36 19 9 34 80 26 -65 -56 -30 -46 -52 64 107 44 23 27 -35 -117 -81 24 26 32 104 112 -2 -84 -30 -42 -77 -6 110 99
6705I9n5j3k3j02l1Q6O4j3N9M5p0j07j4K0m2M5J04N2m6j8k8p1p7N3P0K5L4O9l1
$$ 99 44 31 8 -94 -125 -39 25 12 71 116 46 -61 -75 -55 -97 -52 52 104 58 40 12 -59 -136 -83 -13 12 46 115 84
6734H4j21n2K3l5rJ17Q8j7l2J2n7j13qQ1L8NR3K6q7r1Prl3O5J04K8l4j1l5j00
$$ 84 -37 -89 -66 -101 -110 7 95 78 46 58 1 -112 -120 -39 -1 4 97 123 36 -55 -48 -57 -90 -25 79 107 73 62 27 -73
6764g3n1O2N5J1O0P7n6r5k6k1n0J2J02O9l4J3Np5p8J0O7nJ4Q7J1r0n3K0l5l4O4
$$ -73 -124 -62 -7 4 64 141 85 -10 -36 -57 -107 -95 7 76 42 55 60 -15 -93 -83 -16 -21 -7 80 91 1 -52 -32 -67 -101 -37
6795c7J03Nj0Ol5j11l5O0J3kP3O7l3p1Pj6o0J2P8K3j8K4Lo2n4L9K3j1M3O9k5p2
$$ -37 66 71 61 67 32 -79 -114 -54 -41 -43 30 97 64 -7 0 -16 -76 -64 14 37 19 43 46 -16 -70 -31 -8 -19 24 93 68 -4
6827djJ0p2m0R2N7l1J9L5k9p5NK4l7j2Q1L0m7j5L5k8o6L4N5k4l1N0J8o3k1L9j5
$$ -4 -5 5 -67 -107 -15 42 11 30 65 36 -39 -34 -10 -47 -59 22 52 5 -10 25 -3 -69 -35 20 -4 -35 15 33 -30 -51 -12 -27
6859b7j9K5O7k1j3J4ro7nN0j5k4M9M4l3l7L9Oo7mN3Ll3M3M4n5n0M1J5o2J7O4J6
$$ -27 -46 -21 46 25 12 26 17 -50 -55 -5 -20 -44 5 49 16 -21 18 24 -43 -47 6 9 -24 19 63 8 -42 -1 14 -48 -31 33 49
6892D9n9LM4l6p2M3M5k2RM0lm6j2J1k2l8N4L8j4j3M4k8o5JL2j9LO3J6k7j5Lk5
$$ 49 -10 -7 37 1 -71 -28 17 -5 4 44 41 -5 -17 -6 -28 -66 -12 26 12 -1 43 15 -50 -49 -17 -36 -33 30 46 19 4 7 -18
6925a8n4K6O5k7JO8j4p6k1L8Rm9N8O9m0m1K7lq8j1Q3L6k8L1M8n3o4oJ9k4j0O8
$$ -18 -72 -46 19 -8 -7 61 47 -29 -50 -12 -3 -52 6 75 35 -6 21 18 -70 -81 2 38 10 41 89 36 -28 -34 -15 -39 -49 19
6957A9L5k5rJ1l6m7J7M0J0rL6j1m8kOk9rO0L8j7oL4m9q2J3N3k5nO7L8m0n3M6k9
$$ 19 54 29 20 31 -5 -52 -35 5 15 6 42 31 -17 -19 -13 -42 -51 9 47 30 24 58 9 -73 -60 -7 -32 -37 30 68 28 -25 21 -8
6991hn3J0Q9j4m0N1K8p1m3M7K5l6JQ6j7m5j7K2n6j5M7L7oML6j6o3mKj2ON6J2k6
$$ -8 -61 -51 38 24 -16 35 63 -8 -51 -4 21 -15 -14 72 55 10 -7 15 -41 -56 -9 28 22 26 62 46 -17 -21 -19 -31 -25 31 43 17
7025A7JK1m1n1M3J7j8PN1Oo9j8L0m0k3O4O0k7l8N9j6j00k8O7Rk6L6P2k0o6J4J1
$$ 17 18 39 -2 -53 -10 7 -11 -4 47 53 -16 -34 -4 -44 -67 -3 57 30 -8 51 35 -65 -93 -26 -17 -43 -7 65 45 -21 -7 4
7057Do5PN9L7k3kK3k9p2K9L3j0JN6K5n5l3nj6l2M2M9J0MJ7k6o8J1j%PO2K7l7k0
$$ 4 -61 -54 5 42 19 17 40 11 -61 -32 1 -9 -8 48 73 18 -15 -20 -36 -68 -26 23 33 37 54 28 -40 -29 -30 -30 -23 39 66 29 9
7092IJ2m1m6J3O1J1rL0Lp0l5K3J4k5K6Q2j2m6pK1o6k5M3N8onL7Kq4k7M7mj1N2
$$ 9 21 -20 -66 -53 8 19 10 40 43 -27 -62 -39 -25 -50 -24 58 46 0 -7 14 -52 -77 -34 24 18 13 50 52 -32 -59 -12 -16 -27 25
7126B5M1l2l2%j1l5JN6J5mJ4J1l9l4jJ3j1M0K9j1j3Kj5m8qM4J6j8K2J9k3m1J0
$$ 25 66 34 2 2 -9 -44 -43 13 28 24 38 49 10 -24 -25 -12 -23 17 46 35 22 24 9 -39 -47 -3 13 -5 17 36 13 -28 -18
7159a8J0k5mN7J7n0OK4k7m9K8L8jl3M6J0l3l2L6rj4J9M1j3l9J0L0l5k2L9Mj1j0
$$ -18 -8 -33 -37 20 37 -13 -7 17 -10 -59 -31 7 6 -27 19 29 -4 -36 0 -9 -23 -4 37 24 -15 -5 25 -10 -32 7 11 0 -10
7192a0L8%j9j6K3rk3J2K6k5jL0j5k4kJ8j6j3K1J9j8JK6j4k7PQj8OK9J0l7ML0k3
$$ -10 28 28 9 -7 16 7 -16 -4 22 -3 -4 26 11 -13 -15 3 -13 -26 -5 14 -4 -3 23 9 -18 -11 -3 -21 -15 14 24 -13 -9 21 -2
7227bm9K3M7k7k0M4J3n6j3K6J1l4J9N2Km2J0Rl6l3M0M0j1mL6J1o5k9L9nnL0L0
$$ -2 -51 -28 19 -8 -28 16 29 -27 -40 -14 -3 -37 -18 34 36 -6 4 13 -23 -56 -16 24 13 9 45 56 -9 -38 1 -4 -9 21 51
7260E1J5m9j8rl6J7K8K8qK0Lm4j6j1Mj4M2K5Nl2J5j8m8JL8RoM2K2o7k9NJ3l4J8
$$ 51 66 17 -1 -10 -46 -29 -1 27 19 39 42 -2 -18 -29 -25 -39 3 28 33 1 16 -2 -50 -49 -11 -2 -8 34 56 -11 -40 -35 -22 -56 -38
7295c8P4K8n3k2K1j5o5L3N0omK1K1m8n0M1Jk0L2M8j0k6j0j2j8j9O4J7mJ4J1n0
$$ -38 36 64 11 -11 10 -5 -70 -37 13 7 3 24 45 -3 -53 -12 -11 -31 1 49 39 13 3 -9 -27 -46 18 35 31 45 56 6
7327Fk9jPk2L3M5ol3J1ol6k1M0L8l9RL7j8o9JM6j2k1N3L2m4k3J8Oo0PO7%j5J7
$$ 6 -23 -24 -17 -39 -6 39 33 0 11 5 -31 -52 -12 26 -13 -4 33 15 -54 -53 -7 -19 -40 13 45 1 -22 -4 2 -58 -51 16 16 1 18
7362A8K6m7l6K9J7j9lK0K1m0j3J4QjK3Pj3MK1n2j4K6K6l5PM9j3m3J2L2l9k6L8
$$ 18 44 -3 -39 -10 7 -12 -15 5 26 -14 -27 -13 -5 -6 17 24 11 15 36 -16 -30 -4 22 -13 -6 43 30 -13 -1 31 -8 -34 4
7395DJ7k6k2L6%m5J4N3ml9RL5m7m4L3L6k3rL1K1l3l8M7j5lmK0Mk1Nj1j3J7J6N
$$ 4 21 -5 -27 9 9 -36 -22 31 27 -12 -3 32 -15 -59 -26 10 -13 -22 9 30 -3 -41 6 -9 -12 -16 4 8 -13 -8 -19 -32 -15 1 6
7430FKONl6KpPlM3J8l8PK3l6m9K0M2kl7N1K7n5k1J8K1l3mP2nm8j0K7l2l9L2N3
$$ 6 8 14 19 -17 -15 -22 -15 -18 25 43 5 12 35 -1 -50 -30 12 10 -27 24 51 -4 -25 -7 14 -19 -23 49 44 -4 -14 13 -19 -58 -26 27
7466B7k0rK4Km1l3K3RmJ3M3j0k2j2poLJ4%K3J4j6m6kK1j2kM9J6k9k0K4l1l0J9
$$ 27 7 -2 22 24 -17 -50 -27 -18 -22 -9 34 24 2 -10 -17 -23 -20 -6 -6 17 31 15 -31 -33 -12 -24 -26 23 39 10 -10 14 -17 -47 -28
7501b8N2mj9L0J9m9l9J1K3k4J0M0K0n0pK6k6k3J5M4J3k3R%l9j3J9RJ2lK1mk2j6
$$ -28 24 20 1 31 50 1 -38 -27 -4 -28 -18 22 42 -8 -15 11 -15 -38 -23 21 34 11 20 20 -19 -32 -13 -4 8 5 26 22 0 -16
7535a6j8qJ8K7mJ1J4rl1nJ3mk0L7L2m3j7K0Lk1PM6Ql7J2K0l9l7K3K6j1NK2K4m5
$$ -16 -34 -42 -24 3 -1 10 24 15 -16 -21 -8 -12 -32 5 37 -6 -23 -3 0 -21 -14 32 40 3 15 35 -4 -41 -18 8 -3 2 24 48 3
7570Cj3J6pl0K2K5j4nJ3J1l2%J4JMnJ1j9nJ4k5oK2J7omK1j3m5J4J8qk3K8K9l4
$$ 3 -10 6 -1 -31 -9 16 2 -3 10 21 -11 -11 3 4 8 3 14 -5 -10 4 -21 -27 -5 12 6 2 23 10 -35 -21 -3 -11 -34 -6 23 -11
7606a1j9L9Rm1oL7Ll6MK9ql6L3J6lj8K8jk5mJ7jj4ORJ7l2J5JnPKpLlj6j0J4K2
$$ -11 -30 9 18 -23 -29 8 11 -25 -21 8 0 -36 -3 13 10 -8 20 19 -6 -10 7 6 -8 -2 7 24 -8 7 8 3 10 12 5 8 5 -11 -21 -7 15
7645A5k0j0J7J7l7QJ3Lk2oL2Km9K4L5k7k6K4K4m6%K6J6l2k0M0Pk3mL3Lm0J0J8
$$ 15 -5 -15 2 19 -18 -10 3 6 -16 -22 10 12 -37 -13 22 -5 -31 -7 17 -29 -29 -3 13 -19 -39 1 8 -15 -19 14 17 -23 -13 5
7679Ej4nJ6J4j3k2K7pn%J0rJK4k0j4J8Lmj2K4mj7J1Nj6k6M0Rl5qM0Om4%M6k2l6
$$ 5 -9 -14 2 16 3 -19 8 1 -4 -4 6 -3 -2 22 2 -12 6 9 5 -7 17 13 -4 7 12 -4 -30 10 19 -16 -24 16 22 -22 -22 24 2 -34
7717c4K8K3l0j4K1J1k4jK3Lk1mL2j5j8oK2J4k8KK8k1nQNj1J3Oqj5J3Pj6J5Nj2
$$ -34 -6 17 -13 -27 -6 5 -19 -20 3 6 -15 -19 13 -2 -20 -26 -4 10 -18 -16 12 -9 -14 -6 -1 -12 1 7 -1 -16 -3 4 -12 3 8 -4
7753dK0lj1rjK2qj5K2Rk1j4J7J0k6j0M0jl1RJ0ll5J2K9j4j6K5K2m5oJ9Ok0%K3
$$ -4 16 13 2 -7 -8 14 6 -9 13 22 1 -13 4 14 -12 -22 18 17 -14 -5 5 2 -33 -21 8 -6 -22 3 25 -20 -26 -7 -1 -21 -21 2
7789Bjj0j4J6Pl3J7K7j2jJ1j1k4J0Rlj0K5pj1J9Ok1j0J1J9Lj5L1j0l2mK8lj7K1
$$ 2 1 -9 -23 -7 0 -33 -16 11 -1 -2 9 -2 -26 -16 -7 -10 -20 5 -2 -13 6 12 -9 -19 -8 11 14 -1 30 20 -12 -16 12 9 -8 13
7825A3K5l6j6K1j0j2j6L2K5l2nL4k6k3RK1rk2K8K1k2k2J6oj7oL7Ml1J1Nkj4jK7
$$ 13 38 2 -14 7 -3 -15 -31 1 26 -6 -11 23 -3 -26 -17 4 -5 -27 1 22 0 -22 -6 -12 -29 -35 2 6 -25 -14 -9 -11 -25 -26 1
7860Aj0K0J1j4j9Nj8lK1J0Qj0J1Lk0j4J8J3pKK1j3k6QK3j3k2J3L1k5jJ0Ml2j4
$$ 1 -9 11 22 8 -11 -6 -24 -27 -6 4 12 2 13 16 -4 -18 0 13 6 8 29 16 -10 -2 21 8 -14 -1 30 5 4 14 18 -14 -28
7895b8L9Jj9J0J7k3%olj4K2ORj6pOnnLNRrJ2Nk9lJ6KrPK7j7j2J8pk5J4J6lnJ9
$$ -28 11 12 -7 3 20 -3 -3 -9 -12 -26 -4 2 11 -5 -12 -6 -11 -16 -13 -8 1 -8 4 9 -20 -23 -7 -5 -14 -7 20 3 -9 9 2 -23 -9 7 4 -1 18
7936A8Kk2j2J8J0k4J2L6l1k1K4J3l5qK3J5k5JL6j3l1OK3rj9J8J4rqnnpJJ9%oj
$$ 18 20 -2 -14 4 14 -10 2 38 7 -14 10 23 -12 -20 3 18 -7 -6 30 17 -14 -8 15 6 -13 5 19 10 2 -3 -8 -15 -14 5 5 -1 -2
7973bQkl6J8%lJ4J8k0KmJrkL7j4k7J8K8j7l3K3J0j0rM1Jl6jK1j4l9L3K5j5j6L5
$$ -2 6 4 -32 -14 -14 -17 -3 15 -5 -3 -7 -6 -15 -17 20 6 -21 -3 25 8 -25 -2 8 -2 -11 30 31 -5 -6 15 1 -38 -5 20 5 -11 24
8010B4jl2lK4j3j2LK9Nl6J0Oj7j2L3kj2jRj0j1J6J1k3J4NNk2jJ6k4oK3Nk1NK9
$$ 24 23 -9 -12 12 -1 -13 -10 19 24 -12 -2 4 -13 -25 8 6 -6 -7 2 -8 -19 -3 8 -15 -1 4 9 -13 -14 2 -22 -28 -5 0 -21 -16 13
8047A3k1j4PJ9j5j2L1K0j8k9L4j8pkL3Ll5J7J6l8LJ5Rj4rK3%k2JK3j6oJ4lJPj6
$$ 13 -8 -22 -15 4 -11 -23 8 28 10 -19 15 -3 -10 -12 21 24 -11 6 22 -16 -13 2 11 -3 -12 11 11 -11 -10 13 -3 -9 5 2 3 10 -6
8084fJ0k2J7Nj7MK1lk6%QMj8K0J1j5qK4pk7qK6rlJ3L1l0k2K4J2k9OL2j2j4J8j
$$ -6 4 -18 -1 4 -13 -9 12 9 -17 -17 -9 -5 -23 -3 8 -7 -15 9 2 -25 -33 -7 -16 -19 -6 25 -5 -27 -3 9 -20 -14 18 6 -8 10 9
8121Inj1J3Rj1qJ5onojKJJ5PpqJ4k0K%jJkJRk0QJ0nk0J7J0j0j5J4Kj5%K0Pk4L
$$ 9 4 -7 6 15 4 -4 11 5 0 -6 -7 -5 -4 11 18 11 3 17 -3 -1 -1 -2 -1 -3 -2 7 -13 -5 5 0 -20 -3 7 -3 -18 -4 -2 -17 -17 3 10 -14 -11
8164a1J3oj4LPj5J1RK0l1jJ1Lj3J1Ln%MnmJ1%lKQj4
$$ -11 2 -4 -18 -15 -8 -23 -12 -3 17 -14 -15 -4 -1 -14 -3 0 -5 -5 -1 -6 -10 1 1 -2 0 8 -6
8191f
$$ Imaginary data points
##PAGE= N=2
##DATA TABLE= (X++(I..I)), XYDATA
0@%%%%%%%%%%jRj6J6j6J7k5L2l3M1m9N7o6P5r0J06j21J37j54J71j93K18k45K74
$$ 0 0 0 0 0 0 0 0 0 0 0 -1 8 -8 8 -8 9 -16 16 -17 24 -25 32 -34 41 -49 57 -64 73 -81 90 -103 115 -130 144
34A44l05L41l79M19m65N18n74O34p04P80q63R57j062J180j316J474j658J876k140
$$ 144 -161 180 -199 220 -245 273 -301 333 -371 409 -454 503 -559 621 -695 779 -879 997 -1143
53a143K469k889L449m237N435p503J2034l8135K6162O7377p4037k3494O9308K4809
$$ -1143 1326 -1563 1886 -2351 3084 -4419 7615 -30520 -4358 63019 -11018 -34512 34796 59605
67E9605q0015k4381N1780J1132m3906J0696M0234j0260l1379J4810J1662k4972
$$ 59605 -20410 -44791 6989 18121 -25785 -15089 25145 14885 -16494 -1684 9978 -14994
79a4994n546L7184J0196k7025m996K1342q368l2469p479K3765J8989j064r017
$$ -14994 -20540 16644 26840 -185 -5181 16161 7793 -24676 -32155 -8390 10599 9535 518
92E18O307K0110m668m2184j7081L9403K0646m0564j3761N5409J9875o0169k4246
$$ 518 6825 26935 22267 -19917 -36998 2405 23051 -17513 -31274 24135 44010 -16159 -40405
105d0405N4133J5957n1502k607N6335r84n1986M235L4446k5681l2166L9471L4385
$$ -40405 13728 29685 -21817 -24424 31911 30927 -21059 -16824 17622 -8059 -40225 -754 33631
118C3631l5922j5033M9379M581o5444j1045N8222J803n5421J0091O2323n405n5265
$$ 33631 -2291 -17324 32055 36636 -28808 -39853 18369 20172 -35249 -25158 37165 31760 -23505
131b3505K640M1496p395l4291P846K9164o19j7349m679K458J184P73l840j067
$$ -23505 -20865 20631 13236 -21055 -13209 15955 15336 -2013 -6692 -4234 -3050 -2277 -6117 -7184
145g184J4341J1563j2206j2764P408K061j4872n53J5749r71p702J4167P377k4772
$$ -7184 7157 18720 6514 -6250 1158 3219 -11653 -12206 3543 2572 -5130 9037 16414 -8358
159h358q900K8843L424l5814K807M5128m347m9490N094M7325j1183m6724J6628
$$ -8358 -17258 11585 15009 -20805 -17998 27130 22783 -26707 -21613 25712 14529 -32195 -15567
172a5567M7650j5059m0007J6388K9505k2434k5046K1942J7712j8723n220K1022
$$ -15567 32083 17024 -22983 -6595 22910 476 -24570 -2628 15084 -3639 -8859 12163
184A2163k369k2115N920J8195j1729j5422J7003J5747j6736j4215J3432R536j1949
$$ 12163 9794 -12321 -6401 11794 65 -15357 1646 17393 657 -13558 -126 9410 -2539
197b539p141R513P965j927n953n395K150Q420l142j3126N656K0510m011k2899
$$ -2539 -9680 -167 7798 5871 -82 -5477 -3327 5093 1951 -11175 -5519 14991 10980 -11919
211a1919L694K1099q551k2412J1255K2834j0393j6768J3512J0701j8761q323J8993
$$ -11919 -8225 12874 4323 -18089 -6834 16000 5607 -11161 2351 13052 -5709 -14032 4961
224D961K956j8164N772K1392j0486k3149J1900J9600j6606j7404K1432J8923j9545
$$ 4961 7917 -10247 -4475 16917 6431 -16718 -4818 14782 -1824 -19228 2204 21127 1582
237A582j5963J6926R343j8923q328J6894Q207r446j885P185j960p053k52R16j242
$$ 1582 -14381 2545 11888 -7035 -15363 1531 9738 292 -1593 5592 3632 -3421 -3673 -2757 -3999
252c999M168N414k734l448L161n14p311o86O366Q82j416M873J288p844k038N769
$$ -3999 169 5583 2849 -599 2562 2048 -5263 -5949 417 1299 -117 4756 6044 -1800 -3838 1931
268A931l986q418Q521J3436o942j1217R355Q541j5314j1692J4564J0936j2038
$$ 1931 -2055 -10473 -1952 11484 4542 -6675 2680 11221 -4093 -15785 -1221 9715 -2323
281b323m925J5288L627j6223m499J1266n88r683N467J1531m272q022N036K988
$$ -2323 -7248 8040 11667 -4556 -9055 2211 1623 -8060 -2593 8938 4666 -3356 1680 4668
295D668r995l968R949M228o318P05P925j836r379j556M531J7j763K887L935O48
$$ 4668 -5327 -9295 654 4882 -1436 -731 7194 5358 -4021 -5577 -1046 -1029 -2792 95 4030 4678
311D678j558l413l471N59K163j447k53O331L975n491m642L106m9o657J78Q485
$$ 4678 3120 -293 -3764 -3205 -1042 -2489 -2742 3589 7564 2073 -2569 537 488 -6169 -5991 2494
327B494J998m638J921M384n699p586L597N165l981j327Q696L379q414m056N107
$$ 2494 4492 -146 1775 6159 460 -7126 -3529 1636 -2345 -3672 5024 8403 -11 -4067 1040
342A040p70p419J679R422J455m962J036L217m657o269J585M091q8N88M091J246
$$ 1040 270 -7149 -5470 3952 5407 445 1481 4698 41 -6228 -4643 -552 -640 -52 4039 5285
358E285l567k931p17j384p46K405L427J710L40r25k612k539j149n87J000M004
$$ 5285 1718 -1213 -1930 -3314 -4060 -1655 1772 3482 3822 2897 285 -2254 -3403 -3990 -2990 1014
374A014L388o56j587J1k210n018r17M456K758m27K172L071k902o031j133J731
$$ 1014 4402 3746 2159 2170 -40 -5058 -5975 -1519 1239 812 2984 6055 3153 -2878 -4011 -2280
390b280j023K9N210M015k233k961l4j855m224M3M808K929r5J077R69l131m667
$$ -2280 -3303 -3274 1936 5951 3718 757 723 -1132 -5356 -5313 -505 2424 2329 3406 4375 1244 -3423
407c423j118J398J106J825L228J793j241k626k592k005m70J482K486K645J862
$$ -3423 -4541 -3143 -2037 -212 3016 4809 3568 942 -1650 -3655 -4125 -2643 -157 2488 4350
422D350l50k608k696j553j106L00L056L573Q45p90o06k058l794j486K286K477
$$ 4350 4000 1392 -1304 -2857 -3963 -3663 -607 2966 3811 3021 2415 357 -3437 -4923 -2637 -160
438a60J047J929J895j727m073j883J27l51Q22L588K809o29j633j030k227k603
$$ -160 887 2816 4711 2984 -1089 -2972 -2845 -3196 -2374 1214 4023 3394 1761 731 -1496 -4099
454d099L85K837J896R28J380n0k868k770n00K94N59K185K631M28j218j171j770
$$ -4099 -3714 -877 1019 1947 3327 3277 409 -2361 -2861 -2567 -2008 177 2808 3236 2018 847 -923
471i23k199p4K161J580P50J421M84k493k719j45M88k74J368K989P43j831j043
$$ -923 -3122 -3196 -1035 545 1295 2716 3200 707 -2012 -2157 -1669 -1943 -575 2414 3157 1326 283
488B83m22j920j214K072K419M1J30J175j145l358r02J719M69j88K124J996j494
$$ 283 -139 -2059 -3273 -1201 1218 1259 1389 2564 1419 -1939 -2841 -1122 -653 -841 1283 3279 1785
505A785k443l02k35j198P24K620R61n79K25m56k603j286J684J063m87J432K246
$$ 1785 -658 -960 -1195 -2393 -1669 951 1912 1333 1558 1102 -1501 -2787 -1103 -40 -527 905 3151
522C151j411l170n5J051j276k39L282J857j931j067P26j871k778J536L255k59
$$ 3151 1740 -1430 -1485 -434 -1710 -1949 1333 3190 1259 192 918 -953 -3731 -2195 1060 801
538H01m94K693M94m433k365K435N60k222J728M461m72l797k65J196k190j475L183
$$ 801 307 3000 3494 -939 -3304 -869 -309 -2531 -803 3658 3186 -611 -876 320 -1870 -3345 -162
555a62K801q64l46Q17k309l574M31K099j50R47L954J127l488k153M91j669k264
$$ -162 2639 1775 1429 2246 -63 -3637 -3206 -1107 -1257 -310 3644 4771 1283 -870 -379 -2048 -4312
572d312K132L720L11m48J162j290l667k11K312m94k49M119J992m670l440K279
$$ -4312 -2180 1540 1851 1403 2565 1275 -2392 -2603 -291 -785 -1034 3085 5077 407 -3033 -754
588g54k13m320J552P357J660l788M72K121m585n464K052L474j201Q36N122K21
$$ -754 -967 -5287 -3735 3622 5282 1494 1966 4087 -498 -5962 -3910 -436 -1637 -801 4321 4542
604D542n133p26K585k724l200M641N056l100l611K597L92n655j600N319L079r18
$$ 4542 -591 -1317 1268 -1456 -4656 -15 5041 1941 -1670 927 1319 -4336 -5936 -617 2462 1544
620A544J595K073k882m007p51j222j854L077N166k49j786K763Q02n937l251M312
$$ 1544 3139 5212 2330 -1677 -2428 -3650 -5504 -2427 2739 2490 704 3467 4269 -1668 -4919 -607
636f07K255l079O93M357j488n003L13K022k017M91N885J520m337M8K771n123p025
$$ -607 1648 -1431 -738 3619 2131 -2872 -2559 -537 -2554 -2063 3822 5342 1005 1053 3824 -1299 -8324
653h324L587O689k317k540O747M241o640m979L639R05m745N85N339k33l161J763
$$ -8324 -4737 1952 -365 -2905 3842 8083 1443 -3536 103 1008 -3737 -3152 2187 1954 -1207 556
669E56R65m407o66N575R16m068K106M918m069p247J678M197k848j986N688L946
$$ 556 1521 -2886 -3552 2023 2939 -1129 977 5895 1826 -5421 -3743 454 -2394 -4380 1308 5254
685E254k857j456J429k493l370K066J673k895R41N696j047o421J353N889k757
$$ 5254 2397 941 2370 -123 -3493 -1427 246 -2649 -1708 3988 2941 -3480 -2127 3762 1005
700A005n482M409N946m174n119L224J826m813q88M929O23k239L238K444n209l057
$$ 1005 -4477 -68 5878 1704 -3415 -191 1635 -3178 -4066 863 1486 -753 2485 4929 -280 -3337
716c337M687K91o657P83Q126l23o950J736O266l001n875L085M466l031k260L311
$$ -3337 1350 1641 -5016 -4233 3893 3570 -3380 -1644 4622 1621 -4254 -1169 3297 266 -1994 1317
732A317J8l788J211K966l059j830N595K109o097j368O199m64p267O65O806j012
$$ 1317 1335 -2453 -1242 1724 -1335 -3165 2430 4539 -1558 -2926 3273 2809 -4458 -3793 3013 2001
748B001n154K491M263l011k825K997M99l427J510L615l147l302M734K694o117
$$ 2001 -3153 -662 3601 590 -2235 762 1261 -2166 -656 2959 -188 -3490 1244 3938 -2179
763b179k174O955J596o957n47O700m92o162J169M777k075l089L010J449l476M40
$$ -2179 -4353 2602 4198 -2759 -3306 3394 2902 -3260 -2091 2686 611 -2478 532 1981 -1495 -1055
779a055L737k362l928L896L739n121l262N975K620o318j737O182P58n589K57M505
$$ -1055 2682 320 -3608 288 4027 -1094 -4356 1619 4239 -2079 -3816 2366 3124 -2465 -2208 2297
795B297j379l161K420J633l118J31L731j833m180L182M126m361l721N392L285
$$ 2297 918 -2243 177 1810 -1308 -1177 2554 721 -3459 -277 3849 -512 -4233 1159 4444
810D444n764k504N658J279n444j82M752q68l511K242K289l330r94M030n76m684
$$ 4444 -1320 -3824 1834 3113 -2331 -2513 2239 1371 -2140 102 2391 -939 -1933 2097 1521 -3163
826c163J898M977k998m866L876M465m414l669M778K833m585j750L995J76l601
$$ -3163 -1265 3712 714 -4152 -276 4189 -225 -3894 884 3717 -868 -2618 1377 1553 -2048
841b048Q25K558j880j137L310M53l744P49L985k132m570K476L951l188l204L865
$$ -2048 -1223 1335 -545 -1682 1628 2081 -1663 -914 3071 939 -3631 -1155 2796 -392 -3596 269
857B69K796l433j284L411P1l134Q42K001k463j520L299N46l902P56M892j116m575
$$ 269 3065 -368 -1652 1759 1830 -1304 -462 1539 -924 -2444 855 1401 -2501 -1745 3147 2031 -2544
874b544K251M446l138m494K843K940l729k220L961J687k872N25L314j319k976
$$ -2544 -293 4153 1015 -3479 -636 2304 -1425 -3645 316 2003 -869 -344 2970 1651 -1325
889a325J733J424l592j498L794Q40l707M85M430m45l649J244L146j780k806J398
$$ -1325 408 1832 -1760 -3258 536 1376 -2331 -1846 2584 2139 -1510 -266 2880 1100 -1706 -308
905c08J082k266p22J908m9q74K149J791j878q74K189o15l906k68K944o95k446
$$ -308 774 -1492 -2214 -306 -355 -1229 920 2711 833 -41 2148 1533 -2373 -2641 303 -392 -2838
922b838K115L176j357j733K067Q70k686n90K111r59k578J305K056k124j476L413
$$ -2838 -723 2453 1096 -637 1430 2300 -386 -976 1135 176 -2402 -1097 959 -1165 -2641 772
938G72K106k654o41L287j63m214q00K423q50k421J719K987n89r63J726M42k267
$$ 772 2878 224 -417 2870 2707 -1507 -2307 116 -734 -3155 -1436 1551 962 -1 1725 2167 -100
955a00n98J320q09j723J097J456j399r76J915J050j320J46J909k18j834j29K58
$$ -100 -698 622 -187 -1910 -813 643 -756 -1732 183 1233 -87 59 1968 1750 -84 -213 45
972D5j530q29J410P52n42J209J945q63j788P30O38k170j255K014R72j814j19K221
$$ 45 -1485 -2314 -904 -152 -694 515 2460 1597 -191 539 1177 -993 -2248 -234 738 -1076 -1195 1026
990A026K0j915N88J980p05j501R79P50j965j203J361M88j226O84K257L5j466L07
$$ 1026 1046 -869 -281 1699 994 -507 472 1222 -743 -1946 -585 -97 -1323 -639 1618 1653 187 494
1008D94P47j436j449Q32Q52o88J3J232J08q81J46N49n28l13Q03J43r49n7N68o84
$$ 494 1241 -195 -1644 -812 40 -648 -635 597 705 -176 -30 519 -9 -322 481 624 -325 -382 186 -498
1028d98p69R34J010n57j15J184j9j596l16R53m80j087R58J444o86q74J025N19
$$ -498 -1267 -333 677 120 5 1189 1170 -426 -742 211 -269 -1356 -398 1046 360 -514 511 1030
1046A030j469n76J401L25j274J27J322m66j394M31J121n94p09J047P94r78o84
$$ 1030 -439 -1015 386 711 -563 -436 886 420 -974 -543 578 -16 -725 322 1116 138 -546
1063e46O72R2r15J1R19J27l87K13K45m59l01J80n7j46M66L09m02j27M61k38p35
$$ -546 126 218 -697 -686 233 360 -27 186 431 -28 -329 -149 -206 -352 114 423 21 -106 355 117 -618
1084f18K84P62l65n17P30M57r72m47R76J62j062J86J329l03j317M31J089q44j072
$$ -618 -334 428 63 -454 276 733 -239 -686 290 452 -610 -424 905 602 -715 -284 805 -39 -1111
1103a111J000J101r37p31J087N15j271m88J075K06r66R5R73j51q07K32N62l80
$$ -1111 -111 990 53 -678 409 924 -347 -835 240 446 -520 -425 548 397 -410 -178 384 4
1121Dm26M07L42l15j69J74Oj46nl9R7L09om12Q4N09l50p45M60Q29n67p75Q72P78
$$ 4 -422 -15 327 12 -157 17 23 -123 -128 -167 -70 239 233 -179 -95 414 64 -681 -221 608 41 -734 138 916
1145I16j070p26J171N49j339l23J478J38j519Q3J508l84j455N94J422p66j244
$$ 916 -154 -880 291 840 -499 -822 656 794 -725 -642 866 482 -973 -379 1043 277 -967
1162i67R22J050j052r17J059P21r93n16R40L79q19k99O14K13m67k12L32K74j56
$$ -967 -45 1005 -47 -964 95 816 -177 -693 247 626 -193 -492 122 335 -132 -344 -12 262 106
1181A06l65M4M95j0o94LR19o2j104K36J280m40j435O77J523r56j530J252J487
$$ 106 -259 -215 280 270 -424 -421 498 436 -668 -432 848 408 -1027 -350 1173 217 -1313 -61 1426
1200A426j516j371J779J171k002r41K164O33k217l08K242Mk188L11K036n90j846
$$ 1426 -90 -1461 318 1489 -513 -1454 710 1343 -874 -1182 1060 1064 -1124 -813 1223 633 -1213
1217a213P75J617r13j354R67J079r29q62Q37O83o33n25M06M47j86n33r3O08L46
$$ -1213 -438 1179 266 -1088 -121 958 29 -833 4 687 54 -471 -65 382 196 -337 -430 178 524
1236E24p68m84J079N96j369o54J677M92k003l35K348O9k573L27K742p57k830J220
$$ 524 -244 -728 351 947 -422 -1076 601 1093 -910 -1245 1103 1172 -1401 -1074 1668 911 -1919 -699
1254f99K836j674k687K108K435k532k137K786J745k941j221L079P81l015l46K805
$$ -699 2137 463 -2224 -116 2319 -213 -2350 436 2181 -760 -1981 1098 1879 -1136 -1482 1323
1270A323j39k608M87K276o96j842Q76J444r14j101P52P65n25m96K34L52J45l39
$$ 1323 1184 -1424 -937 1339 643 -1199 -323 1121 207 -894 -142 623 98 -398 -164 188 333 -6
1288fo01M14J015o09j351R56J659j371j874J794J860k269j740K841J520l238j126
$$ -6 -607 -193 822 213 -1138 -182 1477 106 -1768 26 1886 -383 -2123 718 2238 -1000 -2126
1305b126L528N46l857M2M008o51l901J413L767k046l528K545L036l013k521L347
$$ -2126 1402 1948 -1909 -1867 2141 1490 -2411 -998 2769 723 -2805 -260 2776 -237 -2758 589
1321E89J999l441j391L387Q04l186k38K840j61k366M49J724o94j208O85O74m50
$$ 589 2588 -853 -2244 1143 1947 -1239 -1477 1363 1202 -1164 -715 1009 315 -893 -208 466 16
1338A6o9K66k81O5M43o57o11J146M75j600j01K129l15k542Q71K778j569k871K305
$$ 16 -53 213 -68 -3 440 -217 -828 318 793 -807 -908 1221 906 -1636 -765 2013 444 -2427 -122
1357a22K843l016k654L594K224m118j627M569J067m699l25M656n48m566J232M195
$$ -122 2721 -295 -2949 645 2869 -1249 -2876 1693 2760 -1939 -2264 2392 1844 -2722 -1490 2705
1373B705j855l531K534K960k971k317L075J450l170p16L108K04k708L77K236p69
$$ 2705 850 -2681 -147 2813 -158 -2475 600 2050 -1120 -1836 1272 1476 -1232 -855 1381 612
1389F12j699Q93R88q84l70O42l16l13Q35j45j083R52J460j514j514J963J037k865
$$ 612 -1087 -194 794 -90 -460 182 -134 -447 388 243 -840 112 1572 58 -1456 507 1544 -1321
1407a321q62L286M09l343O24L816j211l743J930L270k999l072L502K394m104j612
$$ -1321 -2183 1103 1512 -1831 -1207 2609 1398 -2345 -415 2855 -144 -3216 286 2680 -1424 -3036
1423c036M629J013m525J00M763p52m528J230L653k350l508K497K791k446j403
$$ -3036 1593 2606 -1919 -1819 2944 2192 -2336 -1106 2547 197 -3311 -814 1977 -469 -1872
1438a872L120J173k640m27K022p57k134O90J177j137m24J554J80r28R55J012j237
$$ -1872 1248 2421 -219 -646 1376 619 -1515 -825 352 -785 -1209 345 525 -403 552 1564 327
1455C27n32J356o53k323O13J781j608j410K945J990k638p09L517p7m425p7L596
$$ 327 -205 1151 498 -1825 -1212 569 -1039 -2449 496 2486 -152 -861 2656 2579 -1846 -1923 1673
1472A673j520l960K209M023k273k741L675K722l715j867L708M35m559m98L605
$$ 1673 153 -3807 -1598 2425 152 -2589 1086 3808 93 -1774 1934 2369 -2190 -2688 917
1487I17q43l311J978L709j384j938K572J526l062j665J819k65k484M29K178k91
$$ 917 74 -3237 -1259 2450 1066 -872 1700 3226 164 -1501 318 53 -2431 -2002 176 -115
1503a15o30J696R19j193L9R60j329j603R29K43k160k9K673R7j725J836K790j783
$$ -115 -745 951 1870 677 716 1676 347 -1256 -327 -84 -2244 -2273 400 497 -1228 608 3398 1615
1521A615k463J851R01l717j595L194O23l040J024M270n89l171J826K855k938l179
$$ 1615 -848 1003 1904 -1813 -3408 -214 409 -2631 -1607 2663 2074 -1097 729 3584 646 -2533
1537b533K430J577l582j358L665J080k798P31L671m66k797Q80J572k405k207J524
$$ -2533 -103 1474 -2108 -3466 199 1279 -1519 -788 2883 2417 -380 500 2072 -333 -2540 -1016
1553a016Q59j669L58K548J93j198J066J036j679j133J021l80j852M18J540q45
$$ -1016 -157 -1826 -1468 1080 1273 75 1141 2177 498 -635 386 6 -1846 -1428 112 -733
1569g33p07K138J169j697k3K116q77k899N06J811j903j927K546K137k053o60L143
$$ -733 -1440 698 1867 170 147 2263 1386 -1513 -1007 804 -1099 -3026 -480 1657 -396 -1056 2087
1586B087M73l213k20K493j167k953J269K369j691j581K565J597k200n41K546r9
$$ 2087 2560 -653 -873 1620 453 -2500 -1231 1138 -553 -2134 431 2028 -172 -713 1833 1734
1602A734k736J04J830j224j892J486J619j214m36J950L10j744R0J182j101j354
$$ 1734 -1002 -898 932 -292 -2184 -698 921 -293 -729 1221 1531 -213 -123 1059 -42 -1396
1618a396J135P77j380j30J788p4j498P90J473j179j290J378N98j965l86J937j05
$$ -1396 -261 516 -864 -994 794 720 -778 12 1485 306 -984 394 992 -973 -1359 578 473
1635D73j788R25K013j128j631J533J078k109r17K112L58k110L09K183o34j916
$$ 473 -1315 -390 1623 495 -1136 397 1475 -634 -1551 561 919 -1191 -882 1301 667 -1249
1651a249J096J556j518j179J744O84j885k18J867k74j730P81J551j073j190J303
$$ -1249 -153 1403 -115 -1294 450 1134 -751 -969 898 624 -1106 -325 1226 153 -1037 266
1667B66P16j553l73J532n2j325O24J259r11r85J070M62j431j63J453j89j275P40
$$ 266 982 -571 -944 588 536 -789 -165 1094 183 -802 268 730 -701 -864 589 400 -875 -135
1685a35J228j013r17J236N13j525j85J501l14j519P21J413j020j038J510Q36j642
$$ -135 1093 80 -837 399 912 -613 -798 703 389 -1130 -409 1004 -16 -1054 456 1292 -350
1702c50n06J682j03j888L32J700o87j400J236J307j328q70J494L96j721j36J546
$$ -350 -856 826 723 -1165 -833 867 180 -1220 16 1323 -5 -875 619 1015 -706 -842 704
1719G04l35j473P03J324q60r05J153O86j197l29J093j30j164L34Q36o13n07R45
$$ 704 369 -1104 -401 923 63 -842 311 997 -200 -529 564 434 -730 -396 440 -173 -680 265
1737B65L29q82R1R15m86r27O64O42r98m17J210J54j243K80J310o08j177R35R78
$$ 265 594 -288 -197 718 232 -695 -31 611 -387 -804 406 560 -683 -403 907 299 -878 57 1035
1756A035j267p92J430M37j634p6J724j87j603N92J505q93j342J087R78j292o90
$$ 1035 -232 -1024 406 843 -791 -867 857 670 -933 -341 1164 271 -1071 16 994 -298 -988
1773i88J392L81j338lJ296l09j145N26Q95p47o45Q77L47q58l1P93k44o51M62M40
$$ -988 404 785 -553 -556 740 431 -714 -188 707 -40 -685 192 539 -319 -350 443 199 -452 10 450
1793D50o72j78P57j06q01M22P48o63o09R43M05j140j76J173j54j239M76J199o85
$$ 450 -222 -400 357 251 -550 -128 620 -43 -652 291 696 -444 -620 553 399 -840 -364 835 150
1812A50r84R99Q00j218n82J282K20j373Q2J377l42j210O45J034q44p95R81N02
$$ 150 -834 165 965 -253 -835 447 667 -706 -624 753 411 -799 -154 880 36 -759 222 724
1830G24j070j71J000j55r44M06P64o16m82Q64K79r40PQ74l84q91O02P09p70m28
$$ 724 -346 -517 483 328 -616 -210 554 -62 -544 320 599 -341 -334 540 156 -735 -133 576 -194 -622
1850f22J012K09j089P3J069m10j039O93R13r29p18J095M38j195j61J236o7j103
$$ -622 390 599 -490 -417 652 242 -797 -104 809 -120 -838 257 695 -500 -661 575 508 -595
1868e95L73R81o64q38P59N13q61j86R68m4q37L23O91o30n59P73L13q48L1R25l39
$$ -595 -222 759 95 -743 16 529 -332 -518 450 406 -431 -108 583 -47 -606 167 480 -368 -337 588 249
1889B49q72N99O86q88m60J145K15j256J16J276m92j293P74J173j038r11J301O66
$$ 249 -623 -24 662 -226 -686 459 674 -582 -466 810 318 -975 -201 972 -66 -977 324 990
1907I90j469l93J479L0j497L47J439o31j223Q73R44j093o88J199L95j171l2J117
$$ 990 -479 -872 607 637 -860 -513 926 295 -928 -55 889 -204 -892 307 702 -469 -501 616
1925F16k64r84M76O92o54l85Q00J07p75K27O66n65n44Q14K84r69N3J100l49j128
$$ 616 352 -632 -156 536 -118 -503 297 404 -371 -144 522 -43 -587 227 511 -458 -405 695 346 -782
1945g82O86R80j019q01J309N55j503k19J655k05j689N72J629r43j470J273J226
$$ -782 -96 884 -135 -936 373 928 -575 -794 861 656 -1033 -461 1168 225 -1245 28 1254
1962A254j542r01J715N16j792j18J769l00j621O38J404r61j078J180P30j306l54
$$ 1254 -288 -1189 526 1042 -750 -868 901 601 -1020 -382 1022 61 -1017 163 893 -413 -767
1979g67J323l9j212L89J043o80p43Q72L62r88jJ018l47q63P50O82j083m08J241
$$ -767 556 517 -695 -306 737 57 -686 186 548 -440 -441 577 230 -633 117 799 -284 -692 549
1998E49Kj383L95J430p67j278J155J053j495p63J777L66j888O2J904n77j911R37
$$ 549 551 -832 -437 993 226 -1052 103 1156 -339 -1102 675 1041 -847 -785 1119 542 -1369 -432
2016d32J707j303j336J763J106j924o94J927N5k050K62J882n85j535J118J306
$$ -432 1275 -28 -1364 399 1505 -419 -1113 814 869 -1181 -919 963 378 -1157 -39 1267
2032A267j323r13J403M00j514K6J401m44j232P51Q74j002m56J278K09j111L26
$$ 1267 -56 -969 434 834 -680 -654 747 303 -929 -178 696 -306 -762 516 725 -386 -60
2049f0J025r12j030R81M89j351J1J736j54j510Q08J445j363j440J537R40j954
$$ -60 965 53 -977 4 493 -858 -847 889 735 -775 33 1478 115 -1325 212 1152 -802
2066h02n34K186J08k221M57K232q36j919J476J717j876j508J871O85k334l59K451
$$ -802 -1336 850 958 -1263 -806 1426 590 -1329 147 1864 -12 -1520 351 1036 -1298 -1657 794
2083G94J61j929P57K012j072j822J015J017j580p73J644M15j372K83J393n28j052
$$ 794 955 -974 -217 1795 723 -1099 -84 933 -647 -1420 224 639 -733 -450 943 415 -637
2100f37R03O98j118l41J015l25j271N17R74q61l85J614M82j458J16J398r75j912
$$ -637 266 964 -154 -495 520 195 -1076 -559 415 -446 -831 783 1265 -193 -77 1321 346 -1566
2118a566R70J425j474r40K200R96k150l16K312k95k496O37K225j272k115J567
$$ -1566 -596 829 -645 -1585 615 1611 -539 -855 1457 1162 -1334 -697 1528 256 -1859 -292
2134b92J634j988j136K432R82k139j52K272m43k457L95J649j111j399J581J348
$$ -292 1342 -646 -1782 650 1632 -507 -659 1613 1170 -1287 -892 757 -354 -1753 -172 1176
2150A176j209m57J494j2j553J12J050p18q52R66N01j037j3J147l05q83Q84Q40
$$ 1176 -33 -490 1004 992 -561 -449 601 -117 -969 -3 498 -539 -552 595 290 -593 291 1131
2168A131j139n47J185j51j735L25J648o38j288J494J459j644j145J787M40k311
$$ 1131 -8 -555 630 479 -1256 -931 717 79 -1209 285 1744 100 -1045 742 1182 -1129
2184a129k46K269j82k093Q37K090j187j795J566J417j830j000K015M85k195j53
$$ -1129 -1375 894 712 -1381 -544 1546 359 -1436 130 1547 -283 -1283 732 1217 -978 -1131
2200a131J983l78j780Q86J709r52j210J210P04j471m85J256l5j109N40J041p08
$$ -1131 852 474 -1306 -420 1289 337 -873 337 1041 -430 -915 341 306 -803 -263 778 70
2217G0o48R67K28j162P8J116m69r80Q25P95j103m84J294J15j374L10J402o99j325
$$ 70 -578 389 617 -545 -467 649 180 -800 25 820 -283 -767 527 642 -732 -422 980 281 -1044
2236a044J050J098j437q10J654N14j799j07J885k75j822O22J638j013j406J303
$$ -1044 6 1104 -333 -1143 511 1025 -774 -881 1004 729 -1093 -471 1167 154 -1252 51
2252E1J086j465o69J625K89j655P4J515m99j403Q19J204r72q30J182M90j285k42
$$ 51 1137 -328 -997 628 917 -738 -664 851 352 -1051 -232 972 0 -830 352 842 -443 -685
2270f85J145j65j003N50Q93o90n61Q44J41j049R4R98l45q10P91P16j013n63J052
$$ -685 460 295 -708 -158 735 45 -516 328 469 -580 -486 512 167 -643 148 864 -149 -712 340
2289C40J37j195K33J284m16j108P36Q28j133p13J280M93j247L1J425l33j531M04
$$ 340 477 -718 -485 799 383 -725 11 839 -294 -1007 273 766 -481 -450 975 642 -889 -485
2307d85J126q70r27J272R52j083m44J177j4j485M2J190l84q93Q14Q95q86o28Q88
$$ -485 641 -229 -1156 116 1068 -15 -459 718 704 -781 -739 451 67 -826 -12 883 -3 -631 257
2326B57K43r46J06J049k23q97L32M58q74n02R29L97n39L72R57m33r92K34K82r59
$$ 257 500 -446 -340 709 486 -411 -79 379 -495 -997 -68 329 -210 162 1119 686 -306 -72 210 -749
2346g49l69J091M16p00K96R90m97j032N02O88q22n02J021K85j232k07J010j51
$$ -749 -1118 -27 389 -311 -15 975 478 -554 -52 636 -186 -688 333 618 -614 -821 189 38
2364C8q77P38J249m29p41N75J38j345o28Q55J92n78O69J213k48p72M05K22j044
$$ 38 -839 -101 1148 719 -22 553 691 -654 -1282 -427 -235 -813 -144 1069 821 49 454 676 -368
2383c68m70Q05J82p06K06P41l71o31N83O05m45j6P98j03j101k07L33o22n67R51
$$ -368 -838 -33 149 -557 -351 390 19 -612 -29 576 131 115 913 810 -291 -498 -165 -787 -1354 -403
2403d03R99k77jQ75r0j270l94M98l92o40O96Q62m05l62O92J70q24NQ79r5p12K08
$$ -403 596 319 318 1193 1103 -167 -561 -63 -455 -1095 -399 463 58 -304 388 558 -266 -261 618 523 -189 19
2425A9L62p93p15N50M94k51L42J007P2p02j05qq47n80N81M20k45L86Q57j91p76
$$ 19 381 -412 -1127 -577 -83 -334 8 1015 1087 385 280 272 -575 -1155 -574 -154 -399 -13 844 653 -123
2446a23K10L69o17l91P39K97p61k01O07k51p20N02R76j80l63O27J98j113o45N11
$$ -123 87 456 -161 -552 187 484 -277 -478 129 -122 -842 -340 636 456 93 720 918 -195 -840 -329
2466c29K3o10M38J110L6n71K50K85p35n56M57L03l83P8N16j32n16J26K90k37M
$$ -329 -306 -916 -478 632 668 97 347 632 -103 -659 -202 101 -282 -204 312 180 -336 -210 80 -157 -153
2487a53N49J10m16k9J03n11l74M43L32k17K40O57j80p18R2L08n67m09P47M95o10
$$ -153 396 506 90 61 164 -347 -721 -278 54 -163 77 734 554 -164 -72 236 -331 -740 7 502 -108
2508a08j15P10j02q86R7Q06k32o20N34N98o89n92O01L00o91p5Q65R3o81N7N05
$$ -108 -223 487 385 -501 -404 402 170 -450 84 682 -7 -599 2 302 -389 -464 401 494 -187 -130 375
2529C75l38n68L34M41l07j41M25O1m19lK33j94j49K81R7k52Q8K55k09k16L20J18
$$ 375 37 -531 -197 244 -63 -204 221 282 -137 -140 93 -101 -250 31 128 -124 -36 219 10 -206 114 232
2551B32m48JM47j55n17L35N73l92m54N88L39p75l25P84J45p91R2Q78k16q51L03
$$ 232 -216 -215 232 77 -440 -105 468 76 -378 210 549 -226 -551 233 378 -413 -321 557 341 -510 -207
2572b07O75m95n33O94N14o59l45N90lq02N2P49j2l90L64M02m83m67J91O7k90J54
$$ -207 468 -27 -560 134 648 -11 -356 234 231 -571 -519 230 218 -172 192 594 111 -356 -165 -98 -388 -234
2594b34M87J9j63J28j33m43j9L65q3r2N31K61o36l33L80j26o29L90R60j36n95
$$ -234 253 272 109 237 104 -339 -358 7 -76 -168 363 624 -12 -345 35 -91 -720 -330 630 494 -101
2615a01M09L45r88o62P87N07o12J51J096j08j165n7O17m90o52Q35R40m74m71N05
$$ -101 308 653 -335 -997 -210 297 -315 -164 932 824 -341 -398 219 -271 -923 -88 852 378 -93 412
2635D12l8j017k22P92K20k50M39N07n11o64K8m7l21L20O92J13j38K06k27q13k12
$$ 412 374 -643 -865 -73 147 -103 336 843 332 -332 -304 -351 -672 -352 340 453 315 521 294 -519 -731
2656g31N04J9j53P66O37o84o85L69n9r37J41J295K29p33L33O35r63j155O35Q16
$$ -731 -227 -208 -361 405 1042 358 -327 42 -17 -954 -813 482 711 -22 311 946 -17 -1172 -537 279
2676B79n86j11J326L19j317m60P20l10r96O37J329j84o79M62K25j072o08O92L77
$$ 279 -307 -418 908 1227 -90 -550 170 -140 -1136 -499 830 646 -33 429 654 -418 -1026 -334 43
2695D3k47M01O98l17p16l7n7n15J60Q09J78j74L35M5q95m81N14O3l89O38R69m64
$$ 43 -204 197 895 578 -138 -175 -232 -747 -587 222 400 226 561 606 -289 -770 -256 -193 -582 56 1025 561
2717E61q59M03K16j112l27J344N35r24J35J118n85j554L15J143n32p07J224R40
$$ 561 -298 105 321 -791 -1118 226 761 -163 -28 1090 505 -1049 -734 409 -123 -830 394 1334
2735A334j123q29Q13R3j206Q3J352J03p98L96O47q75q71N94M53n33R3R43Jp82
$$ 1334 211 -618 195 288 -918 -835 517 620 -178 218 865 -10 -881 -287 166 -367 -274 669 670 -112
2755a12j2K79n00l27O24L26k79K49L80o00n55M71J54p37K12J147j07j033L33Q12
$$ -112 -124 155 -345 -672 -48 278 -1 248 628 28 -527 -56 98 -639 -427 720 613 -420 -87 725
2775G25q49j004R61R20r06m11J236J73j384j20J138l46j083Q07J176q53q77J022
$$ 725 -124 -1128 -167 753 -153 -564 672 845 -539 -659 479 133 -950 -143 1033 180 -697 325
2793C25N18j371m66J376K81j192J37J216l18j127L41P16n39m36P14K60n90R2N05
$$ 325 843 -528 -994 382 663 -529 -392 824 506 -621 -280 436 -103 -539 175 435 -155 -63 442
2812D42m79n39O07L35p23o6R66o2q93K21P06n52o28O81M43p44j2R31k79j019N09
$$ 442 -37 -576 31 366 -357 -423 543 481 -412 -191 515 -37 -665 16 459 -285 -297 634 355 -664 -155
2833a55Q78r35q08J247P81j329n32J506K45j615j20J478j56j260M86J142o66q20
$$ -155 723 -212 -1020 227 1008 -321 -853 653 898 -717 -837 641 485 -775 -289 853 187 -633
2851f33P72L94r91r5J105j48r95N24R21q49r26Q39O91q86l31J036K75q34j3M74
$$ -633 139 533 -458 -553 552 404 -591 -67 854 5 -921 -82 609 -277 -608 428 703 -131 -144 330
2871C30m45m38N22J30n99M15R04n63r25P82P47j162p17J285O03j284l14J268m7
$$ 330 -115 -553 -31 99 -500 -85 819 256 -669 113 860 -302 -1019 266 869 -415 -729 539 492
2890D92j261L03J136m72p00R50M96j260m17J135j96j442N10J670l62j240Q64J157
$$ 492 -769 -466 670 198 -502 448 944 -316 -733 402 206 -1236 -726 944 582 -658 206 1363
2908A363j130j246Q01O56r17l02J008J83o37K21M60n76k42Q37O2r19J82Q57o65
$$ 1363 233 -1013 -212 444 -473 -775 233 416 -221 0 460 -116 -358 479 541 -378 -196 661 -4
2927dj132N78R09n62l00J146M98q72j91M38p33q99O37O20p87M2J555J42j505Q6
$$ -4 -1136 -558 351 -211 -511 635 1133 261 70 508 -225 -1124 -487 133 -654 -612 943 1085 -420 -334
2947c34J415o06j615O71J497q83j307Q96Q67j059m87J325N50p92K13P94q14j244
$$ -334 1081 475 -1140 -469 1028 145 -1162 -266 601 -458 -945 380 930 138 351 1145 331 -913
2965i13L81M14r52j17J577O69q88L2R51n17j299Q2O33l87k94O56J59n21K36M75
$$ -913 -532 -118 -1070 -1187 390 1059 171 203 1154 637 -662 -580 53 -334 -628 28 187 -334 -98 377
2985C77n10j91J089L50j164k75Q72n65j580L24J497j13n87J149J050j052r40N38
$$ 377 -133 -324 765 1115 -49 -324 548 -17 -1597 -1273 224 111 -476 673 1723 671 -269 269
3003B69j62j314J33J317j60p77R20R48j127q74J213O60j252l61J289l1j544k24
$$ 269 107 -1207 -1074 243 83 -694 226 1174 47 -827 386 1046 -206 -567 722 691 -853 -1077
3021a077R70j34n47Q47J014k82l12K84n10j072J2N09l82r0J147N64p91k30P08
$$ -1077 -107 -241 -788 59 1073 791 479 763 253 -819 -807 -298 -680 -770 377 941 150 -80 628
3040F28k83r63L08P99m34n48N95J24r67QJ073p1o50Q56R86j067j181P16M14j346
$$ 628 345 -618 -310 489 55 -493 102 226 -741 -733 340 269 -381 475 1461 394 -787 -71 343 -1003
3060a003m14J631O92j037L5J180l63j350J81Q11n17n16Q51M09q58j93P87j73p66
$$ -1003 -1417 214 906 -131 -96 1084 721 -629 -448 363 -154 -670 181 590 -268 -461 326 153 -613
3079f13N23R11m59o49N00K19q87l59O91J78l10M01N23m20l41L38k02p30K92Q09
$$ -613 -90 821 362 -287 213 432 -455 -814 -123 55 -255 146 669 249 -92 246 44 -686 -394 415
3099D15l65n74P40N69r60n87R69L23r83OJ078j70j043L17P90o24o28R02N34r28
$$ 415 50 -524 216 785 -175 -762 207 530 -453 -447 631 461 -582 -265 525 -99 -727 175 709 -219
3119b19k18R71q6j147K06J059l20q70O27Q10p16o68O43L40p34j15O77j7n10K79
$$ -219 -437 534 448 -699 -493 566 246 -624 3 813 97 -571 72 412 -322 -437 240 223 -287 -8
3139hL94m23k47N56K0o55J25N57l46n43N15M97n19k11O81L0p40P3N93m00n38N98
$$ -8 386 -37 -284 272 292 -363 -238 319 -27 -570 -55 442 -77 -288 393 423 -317 -244 349 -51 -589 9
3161IM63o92k80Q55J17r03J36R45k74q95L72O64o78o47P43N26o09j12Q38j2q31
$$ 9 472 -220 -500 355 472 -431 -295 650 376 -519 -147 517 -161 -808 -65 461 -148 -260 578 566 -265
3182b65P0N20m50n29O08M80n40j44O47l5p29J21O16k48m44M49L14o04k65M63j0
$$ -265 -195 325 -125 -654 -46 434 -106 -250 397 362 -367 -246 370 122 -322 127 441 -163 -428 35 25
3203B5m86L37O61k89m22M50J44q16k54P13P7n79L28P55l51o84L44L90n84k94P32
$$ 25 -461 -124 537 248 -174 276 420 -396 -650 63 140 -439 -111 644 293 -391 -47 343 -241 -535 197
3224A97K57o21k0N45k80o57L42N69l07k60O02J85p12k08M55j19m75L63N98k58
$$ 197 454 -167 -187 358 78 -579 -237 332 25 -235 367 552 -160 -368 87 -32 -507 -144 454 196
3244A96l11L74K5o18n3N28r0l61M55M25n26m26M74J01o26N1P79l7o00K28M41n01
$$ 196 -115 259 284 -334 -387 141 51 -310 145 570 44 -382 92 193 -433 -382 397 360 -240 -12 429 -72
3266g2n21N26L90n08n9O88n2p38N8N27l19m84N48N54m46l35M78P9o63o1N35k1
$$ -72 -593 -67 323 -185 -244 444 392 -346 -288 239 -80 -564 -16 538 92 -243 235 314 -349 -410 125 104
3288A04l35L00L58l67k88L02N7m23J06M99j28l81K61K40m53k31M58J16l55J45
$$ 104 -231 69 427 60 -228 74 131 -292 -186 313 185 -196 65 305 -148 -379 79 195 -160 -15
3308a5M28k69m35K82K25m81j29O30R9n77J07O00l04o44L47N30m26l85N54K94o03
$$ -15 413 144 -291 -9 216 -265 -394 236 335 -242 -135 465 161 -483 -136 394 -32 -417 137 431 -172
3329a72j88N73k7n41J99N43l06m21L99K80n35k25N61J18n04N4N19j51m48K19K90
$$ -172 -360 213 186 -355 -156 387 81 -340 59 339 -196 -421 140 258 -246 -192 327 176 -272 -53 237
3350B37l09j81L40N5l21J24L08k49k61L58J75m28j01M96k8m87J41M47k63l59L35
$$ 237 -72 -253 87 142 -179 -55 253 4 -257 101 276 -152 -253 243 215 -272 -131 316 53 -306 29
3371B9K53m12j31M83k5m80J67M92l21m87M25M14n30k83O05K10o37r3N93q1n59
$$ 29 282 -130 -261 222 197 -283 -116 376 55 -432 -7 407 -123 -406 199 409 -228 -321 272 191 -368
3392c68K00N01k82l39L97J94m69j15M75n4m26J96M52k74l81L24K10m08j12M47
$$ -368 -168 333 51 -288 109 303 -166 -281 194 140 -286 -90 362 88 -293 31 241 -167 -279 168
3412A68K8l52J41K96l12k51L39J15l90Q1M84j44m76K27L58m13l30N18K79m89o8
$$ 168 196 -156 -15 281 -31 -282 57 172 -218 -137 347 203 -273 -46 312 -101 -431 87 366 -123 -191
3433a91N13r7o07J60N13k98l78N01L50n30k62N05L6n94P5O27j09m77K91L61m72
$$ -191 322 225 -382 -222 291 -7 -385 116 466 -64 -326 179 215 -379 -304 323 214 -263 28 389 -83
3454h3l42M35K03m25N4N25j15m98J77K96l64k49M58K36l84LL58j83m18J94K84
$$ -83 -425 10 213 -212 -158 367 252 -246 -69 227 -137 -386 72 308 -76 -73 285 102 -316 -122 162
3475A62l09o2N20L5n56L6M28k82m87M25N32l71k92M96R4o59j07N30p5m10L82M93
$$ 162 -147 -209 311 346 -210 -174 254 -28 -515 -90 442 71 -221 275 369 -290 -397 133 58 -352 30 523
3497E23m45m00M38J58o37n9P43O1o11J05N19l38n81L08M51k58j23M78N0m86l0
$$ 523 78 -322 116 274 -363 -422 321 382 -229 -124 395 57 -524 -216 235 -23 -146 332 382 -104 -134
3518a34K23l01k57M90L31l94n6N06j07o53L4N14j54l48L81L25m28k42L40q0l95
$$ -134 89 -212 -469 21 352 -42 -98 408 301 -352 -318 196 42 -306 75 400 -28 -270 70 -10 -405
3539d05L19N55l02l55M53J60q03l28P21J98n78J91P90j42p01R7L78m10l15M96
$$ -405 -86 469 167 -188 265 425 -378 -706 15 213 -365 -174 616 474 -227 -130 248 -162 -477 19
3559A9K70m05N1M18l02n34L66M99l67k57O06K08p34l02M40k1m05K51N53p1j82
$$ 19 289 -116 -65 353 51 -483 -117 382 15 -242 364 572 -162 -464 -24 -45 -450 -199 354 283 101
3580A01K33j00n23j2L87k35k99N62M40n68l91N64J94o67m6P50M6o07M6L74m09
$$ 101 334 234 -289 -301 86 -149 -448 114 554 -14 -405 159 353 -314 -360 390 436 -171 -125 249 -160
3601a60m19M29L26l10J24O41j95p25J22M30m78n17O31O05m74l05N39J37o04j02
$$ -160 -579 -150 176 -134 -10 631 436 -289 -167 263 -215 -732 -101 504 30 -275 264 401 -203 -305
3621c05M68k8k73K50J55m19j34L72j22l82L85O07l21m67M06K33o84l55N79K08
$$ -305 163 135 -138 112 267 -152 -286 86 -36 -418 -33 574 253 -214 192 425 -259 -614 -35 173
3641A73m17J35N29j97m37K71J67m90o7O29j4o49J76O32l87o87M96O46m33m32N55
$$ 173 -244 -109 420 223 -214 57 224 -266 -333 296 282 -367 -191 441 54 -633 -137 509 76 -356 199
3662A99K89o15k81M49Pl50K12L82k38j98L79j9n40P1N45j63n03L30M76m15m07
$$ 199 488 -127 -408 41 48 -302 -90 292 54 -144 235 216 -324 -253 292 129 -374 -44 432 17 -390
3683c90M18K56l98o6M35q1l77K18K27m33j44N89P0o13Q9O71k44p59L25O83l95
$$ -390 28 284 -114 -180 255 174 -203 15 242 -191 -335 254 324 -289 -200 471 227 -532 -207 476 81
3704H1n43N04M27n32l06M84R7m60J05M25k43l42L71K18n18j22O12M6n73J06N39
$$ 81 -462 42 469 -63 -369 115 212 -248 -143 282 39 -303 68 286 -232 -354 258 304 -269 -163 376
3725C76k40n46K59L89k83j63L64O8l37P6K43l32k19M70J86n16j3O10j25o97J66
$$ 376 136 -410 -151 238 -45 -208 156 224 -113 -37 206 -126 -345 125 311 -205 -218 392 267 -430 -264
3746b64O29k37n10M03M70m83l38M32Q6m86R0N39j83m09L53L19n77l20N79K28n73
$$ -264 365 128 -382 21 491 8 -330 102 188 -298 -208 331 148 -261 92 411 -166 -486 93 321 -252
3767b52KO47l9o26O2L97k40l34L32K89k76KK98j60l73K13K71l65j64N03J38n36
$$ -252 -250 397 358 -268 -206 191 -49 -383 -51 238 -38 -36 262 102 -271 -58 213 -152 -316 187 325 -211
3789b11l8M78j02m67K36M70k42k80L24Q3n14o6M24j05l38L91M98l76l75M31J47
$$ -211 -249 229 127 -340 -104 366 124 -156 168 251 -263 -329 95 -10 -348 43 541 165 -210 221 368
3810C68o58j97N88P5m84J38N31j79m34K74K58l52j23M33j6m73O7L57l08l61M25
$$ 368 -290 -487 101 176 -308 -170 361 182 -252 22 280 -72 -195 238 222 -251 -184 173 -135 -496 -71
3831g1M11l05j11M86L2n88j42K86j93l29L37M11j73n1L65l6m96PL44k41l23L56
$$ -71 340 35 -76 410 442 -146 -288 -2 -195 -524 -187 224 51 0 365 329 -167 -160 184 -57 -380 -24
3853b4L24l95k48L94J05l81J20N35m5l68J22J13n19l21L71J63k35K83O20j20n01
$$ -24 300 -95 -343 51 156 -225 -105 430 385 17 139 252 -267 -588 -217 -54 -289 -6 614 494 -7
3874gJ09J87n49l46M72L24l46kM71r7n23J32M08j83j78M15J82n39k70K39j07l94
$$ -7 102 289 -260 -606 -134 190 -156 -158 313 216 -307 -175 233 50 -128 287 469 -70 -340 -101 -208 -602
3896f02K93O52K7k10K53O3n78l76K15N5j64K80M52r4k62J30qm19j5M78Q9l01J59
$$ -602 -309 343 370 160 413 476 -102 -478 -263 -208 -372 -92 360 266 4 134 126 -293 -308 170 259 -42 117
3919A17J79m13m35K58L11j58J51N76J8n39j11J05m24l48M88M97j90l6M46n8p13
$$ 117 296 -117 -552 -294 17 -141 10 586 604 65 -46 59 -365 -713 -225 272 82 46 492 434 -279
3940b79j30M13j6k86L47M68l11m44J13P2l42P0N23J69j81P0P2m53m17K17K23q1
$$ -279 -409 4 -12 -298 49 517 206 -238 -125 -53 -395 -325 198 367 186 256 328 -125 -542 -325 -102 -183
3962a83J83M73l3l80j00mk82q2L96K45j58J20J84l74m74K25L12k18pN58J60n81
$$ -183 0 473 440 60 -40 -44 -326 -408 -12 233 75 195 379 5 -469 -244 68 -150 -157 401 561 -20
3984b0k34K95j43l86K89N91p5k94K08L7n52k29M36J69k30K15M62k34n50L7K26
$$ -20 -254 41 -102 -488 -199 392 317 23 231 268 -284 -513 -77 92 -138 77 539 305 -245 -208 18
4005A8k44j38M30L14k24j44P7j44k43R6K23mQ4K27j54l72oJ61j64p0M46K57k60
$$ 18 -226 -364 66 380 156 12 89 -55 -298 -202 21 17 101 328 174 -198 -204 -43 -207 -277 169 426 166
4028A66j54J41j75m12J54L84p9r7L75J05n43k29M06M4m08K03O26j55o15R1L34
$$ 166 12 153 -22 -434 -280 104 25 -72 303 408 -135 -364 42 86 -322 -119 507 352 -263 -172 162
4049A62l27l32M88M59k55j87K24n8n00p4L59M4r4K85K16k90k83Q2K7j83J11L35
$$ 162 -165 -497 -9 450 195 8 232 174 -326 -400 -41 3 -91 194 410 120 -163 -81 -54 -237 -126 209
4071B09M2j32l0j28k41MJ96J8Q6L46N5m17k20J79j14l47K76O12m3l72J45J91n03
$$ 209 251 119 89 -39 -280 -276 -80 -62 24 370 425 8 -212 -33 -147 -494 -218 394 351 -21 124 315 -188
4094a88l90M34L58k58K1N04j04o85p9M05j38k95M70N67l15m44J62P6m89j63N25
$$ -188 -578 -144 214 -44 -23 481 377 -308 -387 18 -120 -415 55 622 307 -137 25 101 -388 -551 -26
4115b6L41j67J6J87k03m24q0J80M3J27K74P2j58j18j62k44K6K70J12M1K36P0m29
$$ -26 315 148 164 351 148 -276 -356 -176 -133 -6 268 340 182 64 -98 -342 -316 -46 66 107 343 413 -16
4138a6l10J73K1k60K56O05k7m74L9K12m48m34M83N22k35j76M57P8p24k92M93R4
$$ -16 -326 -153 -132 -392 -136 469 442 -32 7 219 -229 -663 -180 342 107 -69 388 466 -258 -550 -57 37
4160C7l43K55O11j35n77K8K00l06k64M26M29j51j57J68p4l78j15J92J28O2J59
$$ 37 -306 -51 560 425 -152 -124 76 -230 -494 -68 361 210 53 221 147 -231 -346 -154 -26 36 195
4181A95P8j10j31j22j74K0K54Q6n1J73J18l27l13J93J39k82N0N41P6n07k8L63
$$ 195 273 163 32 -90 -264 -244 10 96 45 218 336 9 -304 -111 28 -254 -204 337 413 -94 -122 241
4203B41k40n23K72O18k17l79L71L05n55l99M50K77m12m5N44O5n18n7L39j51l22
$$ 241 1 -522 -250 368 151 -228 143 448 -107 -506 -56 221 -191 -236 308 373 -145 -202 137 -14 -336
4224c36K08L63j20j94J51J04k49j44J54Q9n8L4P3Kj3o5j19K0J65l3j69J54K57
$$ -336 -128 235 115 -79 72 176 -73 -217 -63 26 -32 2 75 77 64 -1 -120 -100 65 32 -137 17 274
4247B74k04k87K12K41l11k48M06K33m07j32M58M5n39oM93j04m58K42M80k64m31
$$ 274 70 -217 -5 236 -75 -323 83 316 -91 -223 235 280 -259 -265 228 124 -334 -92 388 124 -307
4268c07L09L11m34k88M79K38m17j10M41L3m56m8L43j9k57J24K59q4j63J9K1q1
$$ -307 2 313 -121 -409 70 308 -109 -219 222 255 -201 -249 94 75 -182 -58 201 117 -46 -27 -6 -87
4290h7l1Q2L8R1P0j05j14O0jk02M7L00K7k44J10K08k77l19K71K94k81j55M60J58
$$ -87 -118 -36 2 93 163 58 -56 4 3 -199 -152 148 175 -69 41 249 -28 -347 -76 218 -63 -218 242 400
4314D00n57j83M58K4m93J30O06o1n21J20L64l17m39L19M10k29j72L31J04m28j40
$$ 400 -157 -340 118 142 -351 -221 385 324 -197 -77 287 -30 -469 -150 260 31 -141 190 294 -134 -274
4335b74K75L0k01J18K83q8k51K5N9j13l0J66J45K3k0j19j25%j3j21P8L44Q3k73
$$ -274 1 31 -170 -52 231 143 -108 -83 -24 -137 -167 -1 144 167 147 28 -97 -97 -110 -231 -153 191 274 1
4359AqK16j59l85J44M09j13k72K45K16m00k91L72K18k82K6M75o6n35m7L03k12
$$ 1 -7 209 50 -335 -191 218 105 -167 78 294 -106 -397 -25 193 -89 -63 412 346 -189 -236 67 -145
4381a45l22L56N06j82k84K43J16m20k40L06J67j73J4K19q2k49%J23J0P2J81M2
$$ -145 -467 -111 395 213 -71 172 288 -132 -372 -66 101 -72 -58 161 79 -170 -170 -47 -37 35 216 258
4403B58j48r9j24k06m0J87J53R2J96J10k21j97J6o7k26J28L73l4k54J07J77k72
$$ 258 110 11 -113 -319 -359 -172 -19 73 269 379 158 -39 -23 -90 -316 -188 185 151 -103 4 181 -91
4425i1k48L41L62j80j56K58n0n54k02L19Q2j03L27M37j23l62Pkl90j23L83K01
$$ -91 -339 2 364 184 28 286 236 -318 -520 -201 -119 -222 105 542 419 57 64 62 -328 -451 -68 133
4447A33j63L5K18j51l23O3K61K1j0J72K6l15k31l9q1L8L05L11P2K5J4k67l90o8
$$ 133 -30 5 223 72 -251 -188 73 94 84 256 282 -33 -264 -303 -384 -346 -41 270 342 367 381 114 -276 -344
4471c44R9mQ8L35J34k15j07O3j44j40K27L13q2j85Q0r4m21j15L83J97l2K57L37
$$ -344 -245 -249 -161 174 308 93 -14 49 -95 -235 -8 305 223 38 118 24 -397 -512 -129 68 36 293 630
4494F30k38m83r7L5k53n0M53K95j24o2J41j76l62O3L06%o6J72N7l47k56J21R1
$$ 630 392 -91 -188 -153 -406 -456 -3 292 168 106 247 71 -291 -228 78 78 12 184 241 -106 -362 -241 -150
4517a50k9K32L48J8k33j10j32k93r2K18K04J04J62R3k01k32l0l7o7J62K77oj44
$$ -150 -179 53 401 419 186 76 -56 -349 -441 -223 -19 85 247 340 139 -93 -123 -160 -227 -65 212 206 62
4540F2pn6k67p9L10J98n3J09J79k36m22pJ56j06%M11K53k74j89J14j15l67P9M30
$$ 62 55 -1 -268 -347 -37 161 108 217 396 160 -262 -269 -113 -219 -219 192 445 171 -18 96 -19 -386 -307 123
4564A23P2j67J24J25l12k93J42J76o5N8K79K5k96j20N8j03p7K25K35j4o2Rj31
$$ 123 195 28 152 277 -35 -328 -186 -10 -75 -17 262 287 -9 -129 -71 -174 -251 -26 209 195 133 142 11
4587A1k22k7J12N7J22J98lj74p2j6j74r8K43J96r6j5J69j03l23LK59k3j08K33
$$ 11 -211 -238 -126 -69 53 251 248 74 2 -14 -188 -286 -43 153 57 42 211 108 -215 -212 47 24 -84 149
4611A49J75k86k66J32P2k23N8M17J03k70j5J48k24l21J26K78m1p6K21Q0k36j38
$$ 149 324 38 -228 -96 -24 -247 -189 228 331 61 46 194 -30 -351 -225 53 12 -64 157 237 1 -137
4633a37J29J1r9R9J48o3j38Ll9j14N3J72O9OQ1j6j91j17N2n7n3J96J85j09r2J50
$$ -137 -8 3 -96 3 151 88 -50 -47 -86 -200 -147 25 94 100 181 165 -26 -143 -91 -148 -201 -5 180 71 -21 129
4659A29jk70m6K79K6k20O6K21j50k93J31K47j33r5K72J30k86j43J83n4k46P1L22
$$ 129 128 -142 -188 91 117 -103 -37 184 34 -259 -128 119 -14 -109 163 293 7 -136 47 -7 -253 -182 140
4682A40j9j74J28J28j95j83J41J05j08k0J35nj24mN2m4K5Q5On1L7J6j51o2J22
$$ 140 121 -53 75 203 8 -175 -34 71 -37 -57 78 73 -51 -55 -3 -47 -22 63 69 18 55 71 -80 -142 -20
4707b0K8r7O4J76p6j72R7J14j97r7K26Q8k25k1K59m3k92Q8K71j19k39J91K01k14
$$ -20 8 -89 -25 151 75 -97 0 114 -83 -180 46 134 -91 -112 147 104 -188 -100 171 52 -187 4 205 -9
4731ij86K19J18k35m3K28L4k23L1J92p5j81J10J15j22p0J48L9j25LJ09o3q2N8
$$ -9 -195 24 142 -93 -136 92 126 -97 -66 126 51 -130 -20 95 -27 -97 51 90 -35 -32 77 14 -68 -10
4755a0L3p2K3J00l3q1R7J6j50m0J67pj51O2J92j08j90J40J22j87r6K53Q0k30m7
$$ -10 23 -49 -26 74 41 -40 57 73 -77 -117 50 43 -108 -46 146 38 -152 -12 110 -77 -173 80 160 -70 -117
4780a17K29o8k52R6K58q5j89J88J45k20j80J88P3j79J3K41Mj93K5J00j23j06J51
$$ -117 112 44 -208 -112 146 61 -128 60 205 -15 -195 -7 66 -113 -100 141 145 -48 -23 77 -46 -152 -1
4803aR3p7oJ14p5j51K0Q9o1J2J66J4j36jO0j35j16J72J38j16rJ78n2k58j6K01
$$ -1 92 15 9 123 48 -103 -83 6 -55 -43 123 137 1 0 60 -75 -191 -19 119 3 -6 172 120 -138 -154 47
4829D7p6j37K06J94k04j47J51Mk45K0K91L1j88Q4J50j98k23J36J48j14lK43K5
$$ 47 -29 -166 40 234 30 -117 34 38 -207 -187 104 135 -53 31 181 -17 -240 -104 44 -70 -73 170 195
4852A95k42l9R4r0j00J70J62q7k6P7q5j92L4J38k1k4J77O6k11p2P9q0j17J59K12
$$ 195 -47 -86 8 -82 -182 -12 150 63 37 114 29 -163 -129 9 -12 -36 141 207 -4 -76 3 -77 -194 -35 177
4877A77q2j05J15qk54o3K14N8j22J16K08j59k48N9R8j57j4K62J10j86m7J16j18
$$ 177 95 -10 105 97 -157 -220 -6 52 -70 46 254 95 -153 -94 4 -153 -167 95 205 19 -28 88 -30
4900c0k22J09K19m7n4J75K3k43r7J24l1o3J44J84o8j24M2n5j50KJ97J8l6J27N1
$$ -30 -252 -143 76 29 -25 150 173 -70 -167 -43 -74 -137 7 191 123 -1 41 -14 -164 -162 35 53 17 144 195
4925A95j94j51R3K3r5J11K17l8j75L5J9j83q2K40J13j23L6J60j33k61M7J46p4
$$ 195 1 -150 -57 -34 -129 -18 199 161 -14 21 40 -143 -225 15 128 5 41 201 68 -193 -146 0 -74
4948g4l7K30J21k07j21R9n3j68Q4K28Nr9Q1K1k04j07J27P6o2R1J63p3j75qK4j11
$$ -74 -111 119 240 33 -88 11 -42 -210 -126 102 107 8 89 110 -94 -201 -74 2 -60 31 194 121 -54 -62 -38 -149
4974a49j0K03O9o9L1L6j51j36R7Q0m7N0J73m7j77k2Q2j06p3K11J36j07o4J05q2
$$ -149 -159 44 113 44 75 111 -40 -176 -79 1 -46 4 177 130 -47 -69 13 -93 -166 45 181 74 10 115 33
4999C3k34L0J90rp0J61J25k06j55R3K3j24N4K12j1j31K9L7j35r8J41J04m7K9J08
$$ 33 -201 -171 19 10 -60 101 226 20 -135 -42 -19 -143 -89 123 112 -19 10 47 -88 -186 -45 59 12 41 149
5024A49p3j88j8O8l3nJ68R4j11j8L4j10j22Q9J18m5pJ26j2j87k1J18j6q5J40J47
$$ 149 76 -112 -130 -62 -95 -100 68 162 51 33 67 -43 -165 -76 42 -3 -10 116 104 -83 -104 14 -2 -87 53 200
5050B00j19j46N3Mj49%K23N5r4P1O7j47j63O1P7o9kJ78K2j48l1P1n8q3J18J04
$$ 200 81 -65 -12 -8 -157 -157 66 121 27 98 165 18 -145 -84 -7 -76 -78 100 122 -26 -57 14 -44 -127 -9 95
5076I5n4l9N1n1j53J6J04J9k1J14Q6j27p9M3o3q8P0J44k8o4Q8K2j43n5J28L0r3
$$ 95 41 2 53 2 -151 -135 -31 -12 -33 81 167 40 -39 4 -59 -147 -77 67 39 -25 63 85 -58 -113 15 45 -48
5103d8O1J18r3j49N9O8q6l8J75P0r7k5P3q7j33M8J12k9k1R9L4j18o2R1k4o9N6
$$ -48 13 131 38 -111 -52 16 -70 -108 67 137 40 15 88 1 -132 -84 28 -1 -22 77 111 -7 -69 22 -2 -71 -15
5130a5R6m5o7M1J8j13kJ04Pn6O0O8j00q9O8L6r5K4J26J3j08K2O1p5q5R5O3p2n
$$ -15 81 36 -31 10 28 -85 -87 17 24 -32 28 96 -4 -93 -25 11 -84 -60 66 79 -29 -7 54 -21 -106 -11 52 -20 -25
5159b5R6qj02pQ9m8n6O9Q2q7m8P0rq2K9Q7k7n9O5M5j02m3R6Lq0K7J07l7r2O0O0
$$ -25 71 63 -39 -46 43 -5 -61 8 90 3 -45 25 16 -66 -37 50 23 -36 29 74 -28 -71 25 28 -52 -25 82 45 -47 13 73
5190G3r6n2R5J5p5RQ1l0p7N3P9q1n1P4M0j10k3J06j5o7K2Q8k9p8M8N3p2l2P6O
$$ 73 -23 -75 20 35 -40 -31 50 20 -57 -4 75 -6 -57 17 57 -53 -76 30 15 -52 -30 58 29 -49 -1 52 -20 -52 24 30
5220C0o8K8N6l9o4P4L4o6k2Q2k5p0MO2j5n2O8M8r5pP9n1p8M5J15n4q0P8P3j17
$$ 30 -38 -10 46 7 -57 17 51 -15 -37 45 20 -50 -46 16 1 -51 17 65 -30 -37 42 -9 -87 -42 73 19 -61 17 90 -27
5250b7p2J10M5j04oJ15Lj27M1Q3n7o2Q8M0q5n0Q2Jj06J9R9J1o2L8N4n0n2K7j5
$$ -27 -99 11 56 -48 -54 61 64 -63 -22 61 4 -58 30 70 -15 -65 17 18 -88 -69 30 41 -21 17 71 21 -31 -4 -19
5279a9m2J4O8k7k9Q4Kp5K2P5n0p7L7O1q0q2J11N4q2PJ39rj40K8Q7r3j36J03R5
$$ -19 -61 -47 21 -6 -35 49 51 -24 -2 73 23 -54 -17 44 -36 -118 -7 47 -35 -28 111 102 -38 -10 77 -16 -152 -49 46
5308D6j17k4J65O3j40k8J26k5j47J7J04n8j12R2Q7o0l0J03K6p3j2M3n8o3J2J5
$$ 46 -71 -95 70 133 -7 -35 91 66 -81 -64 40 -18 -130 -38 49 -11 -41 62 88 15 3 46 -12 -75 -63 -48
5334d8k8J8Q5Nl0N0K7p1l6N7m0j06L6J03n7o4J37R1j08n4J43mj90l4J64k7j60
$$ -48 -76 -58 27 32 2 52 79 8 -28 29 -11 -117 -81 22 -35 -99 38 129 21 -33 110 106 -84 -118 46 19 -141
5361a41O7J71n2j29J19J29j26j19J23L6j64l7J42kj11N1J56n2p4O5M2j11p7P2
$$ -141 -74 97 45 -84 35 164 38 -81 42 78 -86 -123 19 17 -94 -43 113 61 -13 52 94 -17 -94 -22
5385b2Pn5K7N9%j6M6j8l0J5L3p3m2Q1Nj18J0J44j7j12P7J40j06j15P8O6j59m5
$$ -22 -15 -70 -43 16 16 0 46 28 -2 13 46 -27 -69 12 17 -101 -91 53 36 -76 1 141 35 -80 -2 64 -95 -140
5413a40J56O1j48K1J85o6j69O8J50j20j24J40J06j39r4J40N1j25j9J23J8j15L7
$$ -140 16 77 -71 -50 135 69 -100 -32 118 -2 -126 14 120 -19 -113 27 78 -47 -66 57 75 -40 -3
5436cN4p8m7N6L8n4L0O6m9m5L8jo5PP9j7m6O1L4j12rR5j6j19M1J54o5j46J03J21
$$ -3 51 -27 -74 -18 20 -34 -4 62 13 -32 6 5 -60 -53 26 9 -37 24 58 -54 -63 32 16 -103 -62 92 27 -119 -16 105
5466A05j31j23J69R6j56n8J61Qj82J7J69m4j25J17J11j23q8J25K3j55k5J58Nj06
$$ 105 -26 -149 20 116 -40 -98 63 71 -111 -94 75 31 -94 23 134 11 -77 48 71 -84 -109 49 54 -52
5490e2M2J12o3q0N7L4n7k6M8j3m0L6K0n5NR0l6o7N4O9j04q0R7M1j24K0J45j7j21
$$ -52 -10 102 39 -41 16 50 -7 -33 15 2 -38 -2 18 -37 -32 58 22 -45 9 78 -26 -106 -9 32 -92 -72 73 56 -65
5519f5P5J22j26j27J17Q5j62m6J74M6j87KK09m9j82P0J57r9j24J00R2j33n6J54
$$ -65 10 132 6 -121 -4 81 -81 -127 47 93 -94 -92 117 68 -114 -44 113 14 -110 -10 82 -51 -107 47
5543D7K4j03L4J01m4j05M9M4q3l0Q6K2o1L4N3n6k3N9j9p5L1Q4q7o7J17M9j48j6
$$ 47 71 -32 2 103 59 -46 3 47 -36 -66 20 42 -19 15 68 12 -11 48 29 -46 -15 69 -18 -85 32 81 -67 -83
5571h3J60Kj60M0J64r9j62R9J35j45r4J82R3j73m3J79k0k01M4J68n1j51J08J20
$$ -83 77 79 -81 -41 123 24 -138 -39 96 -49 -143 39 132 -41 -84 95 75 -126 -82 86 35 -116 -8 112
$$ [...]
8191a
##END NTUPLES=NMR FID
##END=
