##TITLE=1H_LY-ehexyne Pd240
 CDCl3,8 sc, 
 23.9.2021
##JCAMPDX= 6.0         $$ Bruker NMR JCAMP-DX V2.0
##DATA TYPE= NMR FID
##DATA CLASS= NTUPLES
##ORIGIN= UXNMR, Bruker Analytische Messtechnik GmbH
##OWNER= root
$$ XWIN-NMR		Version 3.5
$$ Thu Sep 23 11:25:41 2021 Russian Standard Time (UT+4h)  she@DPX200
##.OBSERVE FREQUENCY= 200.1314
##.OBSERVE NUCLEUS= ^1H
##.DELAY= (6, 6)
##.ACQUISITION MODE= SIMULTANEOUS
##.ACQUISITION SCHEME= undefined
##.AVERAGES= 8
##.DIGITISER RES= 18
##SPECTROMETER/DATA SYSTEM= spect
##.PULSE SEQUENCE= zg30
##.SOLVENT NAME= CDCl3
##.SHIFT REFERENCE= (INTERNAL, CDCl3, 0, 15.7039)
##AUDIT TRAIL= $$ (NUMBER, WHEN, WHO, WHERE, WHAT)
$$ ##TITLE= Audit trail, XWIN-NMR		Version 3.5
$$ ##JCAMPDX= 5.01
$$ ##ORIGIN= Bruker BioSpin GmbH
$$ ##OWNER= she
$$ F:/spectra/data/she/nmr/H-F/1/audita.txt
$$ ##AUDIT TRAIL=  $$ (NUMBER, WHEN, WHO, WHERE, WHAT)
(   1,<2021-09-23 11:24:31.45 +0400>,<she>,<DPX200>,
      <created by zg, POWCHK disabled, PULCHK disabled
       configuration hash MD5:
       00 E9 B6 7A A2 85 ED C7 34 08 36 98 17 FE 4E 26
       data hash MD5: 16K
       E8 BE E1 91 FC 91 1D 1F 58 EB 01 37 27 95 DA 41>)
$$ ##END=
$$ 
$$ hash MD5
$$ F2 B7 4B 03 4A CB BB B5 FB 46 AC FE 31 E1 A7 CF
##$RELAX= 
##$RELAX= 
##$RELAX= 
##$RELAX= 
##$RELAX= 
##$RELAX= 
$$ Bruker specific parameters
$$ --------------------------
##$DU= <F:/spectra>
##$EXPNO= 1
##$NAME= <H-F>
##$PROCNO= 1
##$TYPE= <nmr>
##$USER= <she>
##$AMP= (0..31)
100 100 100 100 100 100 100 100 100 100 100 100 100 100 100 100 100 100 
100 100 100 100 100 100 100 100 100 100 100 100 100 100 
##$AQSEQ= 0
##$AQ_mod= 1
##$AUNM= <au_zg>
##$AUTOPOS= <>
##$BF1= 200.13
##$BF2= 200.13
##$BF3= 200.13
##$BF4= 200.13
##$BF5= 200.13
##$BF6= 200.13
##$BF7= 200.13
##$BF8= 200.13
##$BYTORDA= 1
##$CFDGTYP= 0
##$CFRGTYP= 5
##$CHEMSTR= <none>
##$CNST= (0..31)
1 1 145 1 1 1 1 1 1 1 1 1 1 1 1 1 1 1 1 1 1 1 1 1 1 1 1 1 1 1 1 1 
##$CPDPRG= <>
##$CPDPRG1= <>
##$CPDPRG2= <>
##$CPDPRG3= <>
##$CPDPRG4= <mlev>
##$CPDPRG5= <mlev>
##$CPDPRG6= <mlev>
##$CPDPRG7= <mlev>
##$CPDPRG8= <mlev>
##$CPDPRGB= <>
##$CPDPRGT= <>
##$D= (0..31)
0 1.2 0 0 0 0 0 0 0 0.06 0 0.03 0 0 0 0 0.0002 0 0 0 0 0 0 0 0 0 0 0 0 
0 0 0 
##$DATE= 1632381870
##$DBL= (0..7)
120 120 120 120 120 120 120 120 
##$DBP= (0..7)
150 150 150 150 150 150 150 150 
##$DBP07= 0
##$DBPNAM0= <>
##$DBPNAM1= <>
##$DBPNAM2= <>
##$DBPNAM3= <>
##$DBPNAM4= <>
##$DBPNAM5= <>
##$DBPNAM6= <>
##$DBPNAM7= <>
##$DBPOAL= (0..7)
0.5 0.5 0.5 0.5 0.5 0.5 0.5 0.5 
##$DBPOFFS= (0..7)
0 0 0 0 0 0 0 0 
##$DE= 6
##$DECBNUC= <off>
##$DECIM= 32
##$DECNUC= <off>
##$DECSTAT= 4
##$DIGMOD= 1
##$DIGTYP= 9
##$DL= (0..7)
0 120 120 120 120 120 120 120 
##$DP= (0..7)
150 150 150 150 150 150 150 150 
##$DP07= 0
##$DPNAME0= <>
##$DPNAME1= <>
##$DPNAME2= <>
##$DPNAME3= <>
##$DPNAME4= <>
##$DPNAME5= <>
##$DPNAME6= <>
##$DPNAME7= <>
##$DPOAL= (0..7)
0.5 0.5 0.5 0.5 0.5 0.5 0.5 0.5 
##$DPOFFS= (0..7)
0 0 0 0 0 0 0 0 
##$DQDMODE= 0
##$DR= 18
##$DS= 0
##$DSLIST= <SSSSSSSSSSSSSSS>
$$ [...]
##$SUBNAM2= <"">
##$SUBNAM3= <"">
##$SUBNAM4= <"">
##$SUBNAM5= <"">
##$SUBNAM6= <"">
##$SUBNAM7= <"">
##$SUBNAM8= <"">
##$SUBNAM9= <"">
##$SW= 20.0188988654967
##$SWIBOX= (0..15)
0 0 2 0 0 0 0 0 0 0 0 0 0 0 0 0 
##$SW_h= 4006.41025641026
##$TD= 16384
##$TD0= 1
##$TE= 0
##$TE2= 300
##$TE3= 300
##$TEG= 300
##$TL= (0..7)
0 120 120 120 120 120 120 120 
##$TP= (0..7)
150 150 150 150 150 150 150 150 
##$TP07= 0
##$TPNAME0= <>
##$TPNAME1= <>
##$TPNAME2= <>
##$TPNAME3= <>
##$TPNAME4= <>
##$TPNAME5= <>
##$TPNAME6= <>
##$TPNAME7= <>
##$TPOAL= (0..7)
0.5 0.5 0.5 0.5 0.5 0.5 0.5 0.5 
##$TPOFFS= (0..7)
0 0 0 0 0 0 0 0 
##$TUNHIN= 0
##$TUNHOUT= 0
##$TUNXOUT= 0
##$USERA1= <user>
##$USERA2= <user>
##$USERA3= <user>
##$USERA4= <user>
##$USERA5= <user>
##$V9= 5
##$VALIST= <valist>
##$VCLIST= <CCCCCCCCCCCCCCC>
##$VD= 0
##$VDLIST= <DDDDDDDDDDDDDDD>
##$VPLIST= <PPPPPPPPPPPPPPP>
##$VTLIST= <TTTTTTTTTTTTTTT>
##$WBST= 1024
##$WBSW= 4
##$XGAIN= (0..3)
0 0 0 0 
##$XL= 0
##$YL= 0
##$YMAX_a= 39865
##$YMIN_a= -46475
##$ZGOPTNS= <>
##$ZL1= 120
##$ZL2= 120
##$ZL3= 120
##$ZL4= 120
##$ABSF1= 10
##$ABSF2= 0
##$ABSG= 5
##$ABSL= 3
##$ALPHA= 0
##$AQORDER= 0
##$ASSFAC= 0
##$ASSFACI= 0
##$ASSFACX= 0
##$ASSWID= 0
##$AUNMP= <proc_1d>
##$AZFE= 0.1
##$AZFW= 0.1
##$BCFW= 1
##$BC_mod= 2
##$BYTORDP= 1
##$COROFFS= 0
##$CY= 11.3945322036743
##$DATMOD= 1
##$DC= 2
##$DFILT= <>
##$DTYPP= 0
##$F1P= 2.36226072786647
##$F2P= -0.459571619588291
##$FCOR= 0.5
##$FTSIZE= 0
##$FT_mod= 4
##$GAMMA= 1
##$GB= 0.15
##$INTBC= 1
##$INTSCL= 1
##$ISEN= 128
##$LB= 0.24
##$LEV0= 0
##$LPBIN= 0
##$MAXI= 10000
##$MC2= 0
##$MEAN= 0
##$ME_mod= 0
##$MI= 1.114404
##$NCOEF= 0
##$NC_proc= 0
##$NLEV= 6
##$NOISF1= 3.799351
##$NOISF2= 2.8
##$NSP= 1
##$NTH_PI= 0
##$NZP= 0
##$OFFSET= 15.70392
##$PC= 1
##$PHC0= -14158.67
##$PHC1= 18.00088
##$PH_mod= 1
##$PKNL= yes
##$PPARMOD= 0
##$PSCAL= 0
##$PSIGN= 0
##$REVERSE= no
##$SF= 200.130013532006
##$SI= 16384
##$SIGF1= 3
##$SIGF2= 2
##$SINO= 400
##$SIOLD= 16384
##$SREGLST= <1H.CDCl3>
##$SSB= 0
##$STSI= 0
##$STSR= 0
##$SW_p= 3612.71676300578
##$SYMM= 0
##$S_DEV= 0
##$TDeff= 0
##$TDoff= 0
##$TI= <>
##$TILT= no
##$TM1= 0
##$TM2= 0
##$TOPLEV= 0
##$USERP1= <user>
##$USERP2= <user>
##$USERP3= <user>
##$USERP4= <user>
##$USERP5= <user>
##$WDW= 1
##$XDIM= 8192
##$YMAX_p= 0
##$YMIN_p= 0
$$ End of Bruker specific parameters
$$ ---------------------------------
##NTUPLES= NMR FID
##VAR_NAME=  TIME,          FID/REAL,        FID/IMAG
##SYMBOL=    X,             R,               I
##VAR_TYPE=  INDEPENDENT,   DEPENDENT,       DEPENDENT
##VAR_FORM=  AFFN,          ASDF,            ASDF
##VAR_DIM=   8192,          8192,            8192
##UNITS=     SECONDS,       ARBITRARY UNITS, ARBITRARY UNITS
##FACTOR=    0.0002496,     1,               1
##FIRST=     0,             0,               0
##LAST=      2.0444736,     0,               0
##MIN=       0,             -46475,          0
##MAX=       2.0444736,     39865,           0
$$ Real data points
##PAGE= N=1
##DATA TABLE= (X++(R..R)), XYDATA
$$ [...]
164E835Q02j3754N785J0511j1600n849J1652j145p206Q320J965j0637L620P413
178E712r041k188J1288k588r027N574L832n771J868L602m926M21M087n541j450
193d148Q470j130p140L751L074n041Q18L255k730J858K701p777j064J0786k958
208B725j0491Q474Q494j2008n052J2079J039r310J922N047l021j551J261k90K975
223B293J449o227j163O676j628o087M381N085m496l160K633J040j32l36j920J714
239A22K970m584l023P081J903p687O14O426l830m465N620K350m632M81K271l186
255a569n69L372q73j389K527l04k706J330J354j796K65J066j960k22K368l54p89
272b49J973j28k602j34O95n76R39R23j217N95J543k202j210L316K06m003M16L180
$$ y = [5835, 6637, -7117, -1332, 9179, -2421, -8270, 3382, 2237, -4969, 3351, 5316, -5321, -1701, 5712, -3329, -5517, 5771, 3183, -5844, -270, 3562, -2209, -341, 3261, -1665, -1244, 2843, -2698, -4148, 4322, 3192, -3948, -197, 2877, -2164, -1346, 1909, -821, 1037, 3738, -4039, -5103, 5683, 2725, -7766, 708, 9202, -2806, -7858, 4221, 5260, -4050, -2128, 2919, -102, -1653, -392, -682, 2293, 3742, -2485, -3648, 3028, 1400, -4687, -306, 4779, 283, -2877, -244, 796, 664, 328, -1592, 122, 3092, -1492, -4515, 2566, 4469, -3218, -2604, 3822, -8, -4473, 1147, 3497, -1135, -654, 1617, -1569, -2138, 1234, 361, -1028, 1499, 1195, -1511, -181, 1173, -623, -358, 708, -1252, -1474, 894, 540, -249, 1724, 1596, -1006, -1140, -445, -1021, -82, 841, -376, 219, 1762, -440, -1650, 1666, 1872, -2131, -1715, 1465]
290A465j455j847K581J674j849j378J81L41K88m55k52J551M33k298l31K398l0
307A017j864O50J126j086p21P84M79O5k13r79o4J036k56n36J395O97j751r52R39
326b34N9p06N87J012L0n52j78M71J78r45o16O47r1r62R27J836l46r36N54j85j656
347a106k30J073K58p0M79J66l7J03n09m36M44k70j143L36J451N8n40N63M40r13
367A17j004J41Q06K26o48K1J097j53j430L56J527o69j447Q03R38r91m31J014K67
386E40o12j94L3K53M42l77m60P41J20j402k6J581r6j055P13P74j036o72O46K02
406A15k93L9J09K68L02m77l14P31j86j264L72J250o09n34J322K61j499j13P69
425B49o17m15Q26L09j41K83k61l62N15m01j166P90J139j190l82K010M9j996L09
$$ y = [1465, 10, -1837, 744, 2418, 569, -809, -628, -287, 1, -454, -706, 845, 1278, -1020, -1351, 1047, 1017, -847, -197, 929, -157, -878, -94, 385, 450, 237, -742, -806, 230, -26, -562, 833, 1530, -221, -1173, -234, -175, -881, -294, 718, 748, 196, 18, 489, 667, -278, -894, -247, -338, -1300, -373, 1463, 1117, 181, 735, 550, -1106, -1336, -263, -5, -75, 404, 570, 533, 636, 127, -309, 135, -135, -1278, -942, 509, 567, 27, 590, 1030, 117, -887, -746, 60, 286, -362, -341, 756, 603, -827, -471, 1056, 387, -1060, -257, 681, -310, -741, 273, 540, -72, -266, -233, 20, 462, 85, -375, 366, 486, -916, -942, 639, 543, -512, 201, 975, -61, -733, -87, 115, -178, -139, -30, 238, 540, 63, -251, 480, 294, -970, -598, 652, 43, -491, 831, 1092, -407, -520, 249, -368, -783, 43, 352, 211, 494, 233, -129, 386, -15, -1181, -391, 748, -442, -824, 1186, 1235, -761, -452]
444d52J270j095r95J010P17k64j17j33M02N30j193r99J676O34k240J11K572o81
462G53k111J328J382j450n84R43j21j42J85r08K18J668j008j721K143J386k779
479h18n94K757n89k488J184J651j058l27Q99j80k03j02j077K14J335r53q32K083
497I02M57k063O56J503j835q93J823m93j392J695P50j707N29J072j689l19J583
514E79q79n82K170m33k160J770J199l045j49L082j211k344K218J370k003j8J075
531F39r13pN77j268O81K381j703k142K714Q07l736R8L352r48k009J631R80q78
549B56R9l79m96J453n19k622J757K843k774j599L628p7l741J321K441k141l86
566i36K286j236j179K300n40k358K081J293l151k3K858j307j613K169K38j784
$$ y = [-452, 818, -277, -1272, -262, 455, 191, 74, -59, 343, 873, -320, -1319, 357, 991, -1249, -1138, 1434, 753, -1358, -30, 1352, -98, -682, 261, 140, -2, 183, -725, -507, 1161, 153, -1568, 575, 1961, -818, -1412, 1345, 756, -1732, -548, 1103, 45, -282, 617, 437, 234, 132, -945, -731, 604, -349, -1181, 902, 1359, -704, -48, 1455, -380, -1273, 550, 57, -1335, 360, 1110, -597, -68, 1004, -685, -1004, 579, -300, -882, 1288, 855, -1305, 465, 1664, -1381, -1530, 1552, 341, -2003, 215, 1585, -418, -436, 639, -274, -281, 296, -972, -291, 2090, 387, -1755, 959, 1766, -1970, -1872, 1480, 532, -1477, 154, 1134, 256, 355, -24, -520, 933, 414, -2208, -451, 2392, -382, -1981, 1647, 1570, -2171, -850, 1591, -550, -936, 1350, 114, -1065, 1235, 695, -1663, 418, 1711, -1440, -1463, 1395, 88, -1525, 644, 882, -902]
582i02R95N92j480R97J214k003k29J828j308j136K151r9j683J722L27k695J478
599b31K509l231j191M283p56m256K642L302l522j512L248m68k412J313Q53r36
615c65R66Q0j841J189J525k380m76K822q00k381J551J049j424N69O34j483P39
632b6J179k403mL445j488l205K927J773l857J03L759j689k442K555M38k552J282
649b05J623k039l2J825j453r31K032k96j416J426Q8j857J191J240k065K73K273
666A677j772j688K501L77k279J160J383k002n9J652j373m58K311j019k205K260
682D66J084k976M73K918j624j920J970L80j600Q59O91j169O14M98j840N46K135
699A505j636j424K439R6k562J182J970j727n31J663r80j074J620j39j452J392
$$ y = [-902, 93, 685, -795, 202, 1416, -587, -816, 1012, -296, -1432, 719, 620, -1063, 659, 986, -1709, -231, 2278, -953, -2144, 2139, 1383, -2873, -231, 3071, -451, -1963, 1285, 817, -1595, -282, 571, -365, 601, 681, -1160, 29, 1554, -826, -1302, 1520, 720, -1661, -110, 939, -485, 84, 718, -765, -26, 1153, -1250, -1254, 2191, 703, -2502, 425, 2198, -1659, -1556, 2203, 514, -1928, 627, 1065, -1487, -205, 1418, -621, -653, 1172, -281, -1212, 820, 524, -892, 534, 622, -1235, -44, 1196, -869, -596, 1677, -95, -1783, 718, 1095, -1184, -24, 1359, -643, -702, 950, -423, -881, 1430, 411, -1794, 466, 1550, -1426, -953, 1965, 341, -1579, 391, 771, -829, 30, 721, -448, 166, 664, -1176, -630, 1505, -131, -1555, 884, 980, -1582, -400, 1570, -157, -688, 975, -5, -1079, 541, 402, -1050, 342]
715C42O54k093M13J861j318q01J853m04j670J247O48j509P31J350j595n96J663
732G76n85j255J439M40j523M62Q30j097K44J319j126p48J522m48j621J412J176
749A217j649j52J552p37r32J147N1r16O20j6j167P72R47j305JJ614q93j439J431
768A46P53j413K93J221q45o30Q82j64n68N82k43q82O06L67q61N14J107q42n76
787e53J076j16r14P40N63q83l9N35o34j76P28m17n42P69j16q94Q09R01r52j83
807b98J118m92j059Q80O42r23j12O67m00n10L95J45j95J62j15k12L76O3l47L98
827A83L77o59k58O01j30m38M89K21n54J9K22l40R9M79l91k97N86j10o77N56O96
848F74p09l99P76kq04K98O95l66n19K75K09k24j05K32K03j29l44J8L53o3k48K98
$$ y = [342, 996, -1097, -684, 1177, -141, -942, 911, 507, -1163, 84, 732, -777, -46, 1304, -291, -887, 776, 191, -1064, 375, 815, -708, -246, 584, -513, -269, 1050, -76, -824, 698, 250, -1371, 41, 1217, -432, -584, 968, 231, -701, 446, 497, -419, 201, 185, -982, -210, 737, -568, -567, 1047, 154, -1285, 146, 899, -514, -221, 1000, 155, -475, 407, 243, -325, 257, 14, -868, -262, 105, -756, -242, 865, 23, -553, 523, 407, -507, 233, 796, -87, -126, 409, -225, -401, 327, -90, -632, 137, 21, -873, -64, 837, -115, -298, 820, 328, -731, 149, 791, -132, -244, 423, 23, -487, -92, 53, -142, 20, -95, -307, 69, 132, -215, 183, 560, -99, -357, 244, 114, -324, 165, 386, -168, -149, 73, -267, -168, 311, -80, -377, 209, 99, -578, -22, 674, -35, -434, 342, 340, -464, -166, 529, 163, -356, -81, 128, -96, -201, 31, 234, 105, -239, -221, 132, 69, -179, 119]
870A19K61l96k17L55L8k40J05P1k31JJ41q1J23K63k42l07K87P2l83J33M86k48
892A10m25K89K33l58o1L78ml65J7K75K1j20M0J43p1k90l2K75M0k41N5K26j71k39
916b75K04K40j39j09J12M3p9k6R2J27l1k38n6J89l4k16J46K50k11k45K04J79j57
939c0l9K02M0j97o5J49J17q5j27Q2M7k14j02K45Q0j93l6J63k3j26Q2J74j1j37
963dp0J07N9j46oK26p1l05O1K46j56j30K18N5j91J2J17QN1oj26J06R5l00pM17
989B60j20m35K87K88m64j20N35m3m26J69K42j97p8J91L3o0k8j19J02J30k33m5
1011a31L30j37l46K98K00l79Q9L24l11j32L87j57l05M83M0o39L21N22o98k09R18
1032D68k00q98O08O07q46k06Q89j50o83L17L52k84j09R7N8J27j69l27M51L07o80
$$ y = [119, 380, -16, -233, 122, 160, -80, 25, 96, -135, -134, 7, -74, 49, 312, 70, -237, 50, 122, -261, -128, 358, 110, -315, -26, 207, -151, -212, 166, 162, -203, -186, 89, 110, -10, 30, 173, 102, -188, -220, 55, 95, -146, -91, 135, -36, -275, -71, 169, 30, -79, 33, 76, -3, -29, 63, 190, 159, -79, -135, 54, 20, -196, -50, 200, -11, -256, -52, 127, -30, -69, 133, 173, -24, -89, 60, 177, 92, -35, 47, 94, -120, -222, 23, 103, -90, -126, 37, 14, -112, -30, 144, 133, -4, -74, 33, 92, -54, -60, 166, 95, -210, -149, 97, -59, -189, 29, 84, -107, -95, 22, 30, 81, 75, -51, 55, 150, -150, -157, 260, 140, -295, -8, 280, -184, -304, 231, 188, -238, -69, 173, -24, -102, 89, 122, 62, 34, -85, 17, 147, -86, -131, 199, 62, -284, 14, 214, -165, -76, 248, -63, -195, 192, 35, -270, 213, 253, -386, -65, 457, -241, -450, 468, 268, -630, -22, 585, -261, -467, 422, 272, -411, -94, 258, -26, -135, -38, 20, 147, -22, -349, 102, 409, -271]
1053b71n2Q15l40o76O35L21p14J45N22n61p4O79m67m76R47l2j105N82R31j051
1073b42m26J247j53j076N94O23p75p4N95l06k00L75k45j50N10k97m23O89K9q48
1093e53N19O90r60j99J090m06r10Q74M03r81J93O98o35j01O82n28l10R63l29j006
1113h06R99O49j428j4J439o00j072R40M44q53J62L93m47K72K90q47K16J122r00
1132d1r25J416L91j584K71J325p65p33Q64M9n20M21j15m91P45J16j133N31J060
1151H82j128n44J412j71j213Q09O12j105J79R19q40l62J093l84q74R28K77j071
1169e81M69P30r37k4J056p52o87J258j6j345O67R68j086l43J015k27n18N08j56
1188ak78Q11k70j068J043Q28j670k87J852m67j629R65J030j086k67P61k19n7L48
$$ y = [-271, -323, 492, 152, -524, 111, 432, -282, -137, 385, -176, -250, 429, -38, -514, 433, 401, -704, -122, 809, -242, -668, 579, 426, -650, -56, 567, -208, -282, 313, 7, -193, 182, -63, -213, 297, 0, -423, 266, 295, -553, -34, 656, -304, -503, 587, 181, -729, 145, 548, -433, -240, 458, -177, -278, 404, -124, -434, 529, 200, -806, 193, 842, -586, -600, 839, 239, -833, 107, 551, -302, -140, 253, -194, 78, 368, -479, -263, 859, -41, -966, 450, 841, -743, -472, 853, 88, -645, 219, 268, -252, 169, 54, -437, 308, 424, -709, -178, 882, -246, -790, 622, 451, -762, 47, 659, -446, -267, 652, -188, -550, 543, 159, -715, 213, 490, -581, -112, 618, -319, -343, 713, -39, -726, 532, 516, -829, -162, 806, -280, -623, 392, 165, -353, 155, -1, -279, 532, 262, -806, 237, 1065, -605, -892, 960, 493, -1136, -171, 859, -227, -494, 267, 48, -9, 339]
1207C39o40L4J129o88j190J288P37j678j45J527m72r80P94K96n79L69P8o42O47
1226B24M64j225L2J350p27j116J183M42j290K71R95p36l13R43l12o33P79J09q59
1245d19L42M78o40NM89n18j9P35n91n07J173O3j348N91J167j029o84J091L6q61
1265d46L47K35m49M51J46r04M75J082j048q23J481L57j543J19J241m52q09L48
1283a92L31l7r3m41K32Q56n12r42R62P67j272l62J270j59r54M41M02m86J21K25
1303A57n23K83O21p31l58J052m2j039M33P48o94l34O53j23l98L94Pl76L40J73
1323B43m63J53L72l50q5L66k84j52N14k53n84O70L81r32k8R91l12q04N32M84n18
1344e9j68K87m4P2K2m08J79O09n04n96P72M30q87j85Q08l0n66O9K74O4o1l00m
$$ y = [339, -301, -267, 862, 174, -1016, 272, 1009, -669, -814, 713, 241, -739, 55, 351, -228, 141, 219, -423, 224, 688, -537, -505, 845, 118, -998, 185, 627, -663, -392, 603, -133, -446, 497, 185, -448, 331, 440, -419, -77, 401, -239, -234, 255, -263, -282, 453, -138, -645, 528, 591, -757, -166, 1001, -28, -712, 379, 415, -446, -99, 136, -313, 138, 284, -620, -145, 937, -111, -934, 547, 904, -639, -520, 721, 269, -540, -192, 139, 102, 9, -432, -200, 656, 144, -798, 164, 931, -341, -703, 567, 408, -546, -105, 297, -189, -68, 157, -366, -83, 538, -193, -551, 501, 459, -580, -147, 601, -93, -427, 226, 103, -295, 99, 106, -270, 70, 243, -220, -67, 305, -45, -130, 236, -48, -200, 314, 61, -523, 147, 528, -404, -432, 559, 247, -557, -25, 459, -59, -227, 60, 16, 88, 110, -298, -119, 490, -14, -610, 162, 592, -295, -480, 328, 298, -268, -199, 75, 139, 78, -222, -226]
1367b26N88r0p97L29Q22n60o85O84M55o86j88N14L7k71rMJ54J51l51j30N18rn80
1390c26J75N12l48l19L93R2l18J05J29j64Q1J14j99J4K44j81j43K61k9k79K04
1411A8J55l27L0L43k12k57L20J32l19JK14m0r6nk7J34P5l12k2M32r3m84K54M57
1435C71l37l60L45K54k91j85J63J87n2k53l1L79L4m91N0N43j44n43K71M53l03
1456F0l25K63K23j72j82M3J95M3k74q3L83M8m56M1M70j35l95J90L06j86k07J33
1478a7J47m2j84k5K17L8l28K7L61r9l76K20L33l04j93L25J17k96m0K20J4j54p6
1501a15J03J40j47k09J99K53l03k20M29J19m26j8M32l9l47O8K42l2k00p8K00J37
1523A88k64k32L95K02m70j31N29N8n32O7M70q8l55O9K70J5k69j45K94K04m20j85
$$ y = [-226, 362, 272, -525, -196, 626, 66, -619, 65, 520, -166, -354, 160, 197, -74, -83, -79, 75, 226, -125, -255, 263, 254, -326, -151, 361, 13, -306, 87, 179, -139, -34, 95, -69, 12, 126, -73, -59, 185, 4, -139, 122, 93, -186, 18, 173, -154, -124, 219, 7, -250, 70, 202, -117, -116, 98, 58, -38, -43, -70, 64, 139, -173, -195, 237, 144, -340, -86, 371, 34, -326, 19, 273, -18, -203, -40, 147, 95, -158, -189, 190, 224, -267, -217, 326, 182, -361, -90, 363, 60, -265, -2, 221, 49, -133, -90, 105, 148, -126, -209, 174, 222, -234, -193, 277, 142, -253, -63, 243, 57, -150, -17, 130, 88, -96, -121, 96, 134, -194, -167, 194, 95, -281, -61, 272, -32, -225, 100, 217, -79, -119, 101, 115, -39, -115, -12, 128, -19, -228, -29, 224, -79, -299, 130, 249, -177, -195, 237, 198, -149, -81, 161, 129, -71, -149, 51, 188, -76, -308, 87, 289, -181, -312, 217, 275, -257, -190, 280, 192, -163, -94, 176, 191, -78, -223, 71, 275, -145, -330]
1545c30N04J09n64LN81j18m77J98L52j96k27J18J80k2j92j03K82J12m02m3M84
1566B49p9n14K25M58l44k91L81J42l01p6K16L9p7j46J7K68l9m21J91M71l18m43
1588c92M66L46n53j91N26Q2m43n3K87J08j87k30J79L91k87m81M30N14n81l88O71
1609B14K08o64m4N42n3l50J7J43R0r3k59J26M25k37m77M19M44n62k32O07M5n52
1631b43R4L68j79j82J14L7Nm2j45J45K33k71j84M45M9n23K06N14l87l71M76J40
1653B99n01JL34o0j61mMJ80M7l76O7N86k72o44M90O12o33m25O81K29o20j56M15
1676I3J15k17k60J00M45j35o13K86P46m63o99O53N19o88k76O33Q5m37n2J70O8
1697G3Qk25r8M07K6n67J49O01k86m18M45K22m49K8L03j80j08J50j34r4K14q4j41
$$ y = [-330, 174, 283, -281, -278, 303, 185, -292, -94, 258, 62, -165, -47, 133, 111, -81, -184, 98, 210, -192, -235, 249, 170, -344, -119, 339, -5, -296, 85, 227, -74, -150, 66, 105, 28, -118, -101, 167, 128, -293, -102, 369, 51, -392, 74, 420, -133, -324, 202, 284, -159, -212, 75, 183, -4, -234, -55, 336, 49, -432, -2, 512, -69, -457, 214, 422, -242, -286, 256, 203, -147, -130, 13, 103, 10, -249, -123, 302, 65, -412, 7, 451, -111, -343, 264, 309, -243, -149, 219, 40, -142, -28, 9, 14, -28, -173, -28, 205, -66, -250, 195, 244, -279, -73, 441, 54, -317, 159, 299, -202, -201, 133, 73, -88, -92, -88, 92, 139, -237, -170, 416, 144, -500, -10, 602, -31, -456, 225, 454, -166, -322, 93, 208, -9, -269, -169, 276, 141, -472, -186, 560, 97, -602, 51, 570, -118, -394, 239, 324, -113, -165, 5, 73, 81, -144, -242, 165, 191, -376, -227, 374, 88, -330, 115, 337, -112, -84, 219, 39, -69, 81, -53, -147, 67, -17, -158]
1720a58K60j1l18K45K37m46K4N69k57n36M69L87o07j74N47k4m53K4K51R3o9k56
1742b03Q9M60k01o00L87O30n63n21O31L07o11j25M50P0k05j57j5L16J57n58q8
1763c50P69r2q65K82P92m18n90M92L43m41j49K38Q8J2j23j68K50K09m14j18M98
1784B45m6m88J87L09k72o1K92j34j49K28n6k36K31J39k82J9J89j59j7K09j70j27
1806a49L45r4m49L06M26m57k52M98Q1m47J9K96j6j04j16j8K78M6m77Q4O15k52
1828A63o23L74N13m34l30M13J72k95j22J04J62R5k69j82M26J28n52j8O15j32n38
1849c30K20L61k35j65J85N1j0l5j77O8K79j97k71L11J89m01j5L77j16k32K01N
1871F3k13J38J29k10M8K25j64j59J87L6j55Q1J0j19J24O9k26P5K95k08k69K85
$$ y = [-158, 102, 91, -227, 18, 255, -191, -167, 402, 145, -391, 78, 465, -142, -316, 231, 207, -246, -222, 29, 122, 53, -203, -114, 346, 145, -455, -68, 562, -1, -522, 109, 416, -195, -320, 130, 200, -5, -162, -177, 139, 296, -262, -350, 419, 327, -538, -256, 536, 118, -472, 20, 363, -78, -227, 11, 99, 111, -12, -180, 70, 279, -135, -253, 245, 199, -289, -102, 207, -65, -126, 166, 32, -117, 111, 55, -181, 50, 189, -93, -74, 115, -44, -61, 148, -22, -149, 196, 102, -347, -41, 385, -72, -324, 174, 255, -192, -173, 123, 107, 3, -113, -131, 147, 193, -284, -200, 415, 163, -460, -86, 427, -7, -337, 76, 248, -47, -169, -65, 97, 192, -77, -259, 167, 295, -257, -275, 340, 208, -330, -110, 251, 16, -149, 36, 87, 77, 42, -135, -67, 212, 15, -256, 55, 244, -157, -172, 205, 89, -143, 58, 63, -150, -12, 117, -93, -45, 180, 16, -143, 44, 80, -75, 6, 16, -103, 21, 90, -136, -61, 234, 26, -243, 42]
1893D2J21k79NK24m6j01J9m7O7J55k00j66L27M4m40P3M62j54l52K38K51k13j04
1916g4J20M2l2j02j32J49J95k28j07L30M4l70L9K75j28j29J42J9m2R8q6j01J85
1939A07ll06M4K73j50j59K79J14k39RJ51j18n6Q3o2m0J17n7p4J47Qj41N1R4j37
1964f5KJ60q2o7J59j4k05J05J22j77k5J52n9j09J42%j03J17M0j64P3J62j68j01
1988a05J92mk29Q6J29q3k4J01m1j3O3j07l1J68m9j84J30J42j80p4J91j7j36M3
2012c2L2k0O2l1o9J28L6k10K9K23j29j94K05J11k22pJ72o9r4J06ln7Q5k0j10J19
2038D1L3j70L5J55q5j00J44L7j20L6L4n5PK2p1N0J04j38j8J87p5j87J48J13k05
2063g8j2J98q5j39J57P1j47K3O0p2RM8p6K7J06j25n9J80j6j68R0J22j46o6J48
$$ y = [42, 163, -116, -111, 113, 67, -34, -15, -62, 5, 160, -40, -206, 121, 165, -275, -202, 260, 106, -246, -8, 243, 30, -74, 46, 88, 56, -46, -178, -29, 166, -62, -169, 161, 205, -165, -126, 149, 21, -108, 34, 53, 11, 109, 23, -78, 107, 104, -202, -158, 115, -35, -194, 85, 199, -40, -31, 120, 2, -54, 29, -33, -73, 44, -13, -87, 60, 68, -73, -22, 72, -65, -63, 97, 15, -52, 107, 93, -112, -7, 115, -62, -87, 65, 6, -103, 39, 39, -64, 53, 93, -71, 2, 164, -4, -105, 87, 83, -146, -60, 69, -14, -38, 63, 22, 9, 72, -35, -66, 102, 53, -131, -1, 141, -39, -113, 78, 61, -75, -32, 0, -20, 42, 11, -58, 70, 106, -104, -75, 148, 19, -175, 30, 141, -81, -88, 84, 15, -79, 27, 24, -33, 52, 32, -78, 41, 74, -96, -61, 94, 9, -91, 53, 90, -30, 6, 40, -15, -8, 14, -57, -7, 97, -41, -59, 128, 53, -134, 14, 127, -78, -90, 108, 23, -116, 41, 112, -35, -12, 48, -24, -15, 33, -43, -16, 90, -35, -94, 86, 70, -98, -8, 114, -32, -98, 50]
2088E0m1n9Q8k4n8J07k2j47J36J23k25m8K40o5k18J65J55j81l5J20m8m4O5m4R
2113aO9j13o3J77K2j68R9J43k04p6J91m2j46J28N3j38R1R3j32L6J08j83j21K10
2137C3j7j78K00J69k33l6J98j04j62J18M6j21P4M1l8R1N0j74K5J16k06r1K82J9
2161A02k23J46J55k25m7J97q4j03J46n5j34J80N2k17J35J69k55q7K83m8k12J66
2183D1P2k28L5J44r1K9J49j29r1J47r0j66K06R0k42Q1K18j97p2K72n9k63J16O1
2207C3k03R4K14j19k0J36j55j13K12n5k01K05J15l04M6L38j65j80K47l2k75J14
2229f8J49j64O6J71k02n5K31j22j78K67O1l01N6K09j70m4K45p3j65J28k9j56K06
2252F2P7k43P3J85k62m7L54p8k58K12P3l33Q6K77j99p6K43j26k20K33P2k18J37
$$ y = [50, 9, -50, 38, 14, -44, 63, 41, -106, 30, 153, -72, -120, 120, 55, -163, 2, 157, -24, -59, 61, 13, -31, 34, -10, -1, 68, -45, -108, 69, 91, -77, 22, 165, -39, -115, 76, 34, -112, 16, 69, -69, 22, 115, -17, 19, 127, -56, -177, 33, 16, -162, 38, 207, -26, -62, 136, 32, -130, -12, 34, -87, -13, 28, -10, 81, 131, -43, -18, 98, -108, -199, 83, 102, -121, 25, 180, -45, -92, 105, 21, -82, 64, 9, -125, 55, 107, -110, 25, 194, -61, -148, 135, 87, -125, 41, 113, -115, -80, 64, -27, 2, 151, 22, -69, 78, -12, -178, 28, 118, -124, -43, 175, -22, -94, 178, 119, -144, -28, 33, -170, -76, 138, 19, -1, 135, -20, -133, 79, 24, -177, 28, 143, -161, -115, 223, 58, -122, 125, 93, -182, -68, 81, -83, -17, 154, -48, -103, 128, 6, -172, 95, 156, -145, -89, 120, -50, -94, 151, 78, -87, 41, 12, -144, 62, 139, -104, -31, 154, -108, -155, 199, 121, -137, 75, 148, -185, -99, 178, -21, -97, 146, 20, -200, 33, 105, -113, 24]
2275B4J36k72k6K82j43j48L00k4l20J13K12k11NK54j37j74J55j9j27J99L4k21
2297a08J04J24k38K5K89j29k29K03Mk53J94K04k26J6K01k28j28L20l0k91K15J51
2319A90l73J8L71j38k05K61j2l20J02J95j34J3J76j25n8J35p7m4J51r6j97J40
2341b7M5k02J56K73k69j17K78j19k70L14J77l63L8K92k37j43L54j2l36J44J26
2362A02l05K4L24q4j35J77k6j89J01J10r7M6Qj41N0J08j56O4K32k26k15L01N8
2385A31l40J97L06l36k08L50l1k49K43J86k75k9J83j68p2K52o3k36J40R1k14Q7
2407e5K11j17r3M9q1rJ56l5l3K16q1k82J76J94l07q6K96j63k62K62J85k04Q2K07
2431B26k32j60K27j6j19J57Q8k26PJ25j12LJ03j15p7J13n2o5K38O5j91N4J04k13
$$ y = [24, 160, -112, -138, 144, 1, -147, 153, 129, -191, -78, 134, -77, -72, 182, 45, -129, 26, 7, -120, 79, 113, -108, -4, 120, -118, -93, 196, 67, -162, 41, 45, -208, -14, 190, -36, -20, 181, -47, -175, 145, 115, -176, 39, 190, -183, -165, 206, 68, -137, 124, 112, -208, -106, 89, -45, -32, 144, 19, -39, 96, 19, -25, 126, 30, -167, -27, 18, -184, -28, 245, -24, -141, 137, 18, -252, 62, 239, -124, -86, 206, -31, -174, 180, 168, -168, -24, 102, -203, -179, 145, 61, -74, 103, 77, -112, -11, 99, 2, 48, 56, -85, -35, 73, -83, -19, 213, -13, -228, 73, 131, -209, -12, 294, -42, -250, 100, 69, -180, 63, 249, -26, -55, 128, -40, -112, 140, 77, -159, -19, 72, -142, -55, 156, 39, -54, -5, -86, -95, 61, 26, -7, 209, 128, -154, 22, 216, -91, -177, 119, -44, -306, -44, 141, -63, 19, 226, -6, -166, 61, 45, -74, 83, 171, -55, -48, 77, -35, -32, 71, -44, -121, -8, -60, -125, 113, 178, -13, 41, 145, -68]
2455f8k1K20q6j53J76l6k54J86K48k17q2K47j21k57J83J86j64k2J16p7o5Q9qq
2479A2P2j16j30J40O1j19J30J30j94p9J33r3n1K01pk14J18J22k08J0K77q6k49
2502a40J23P0j51P0J60p1r3N4p1m5J44J5q6O4K2j31L7J00o5JN9j30n4J76mj18
2528f4J48R9k61o1J97l4j26J43O6j68mR5m3J5R8j07o6Q6k2p6J35Q3j33k3N5q7
2554e5MJ08m7o3R8m1j33J36J51j46l4J10j04j29J27O7q8P0K7j23J8J20m9n9J00
2579F5k3j30L9P9k8M3K8r0JN0r2lJ50k9j79Q4R9j12JJ62j7j28K5kn7O5K5o1L7
2608BO8j22oJ60k8j34M7M2j18J3J23lj8M3n7n5N5j3o2P2L4j24L1J15m2l7J04k1
2636F9j50L6O3n1K4R7n0n7M8l0k0P1l2q6P9L1j30N2J53o4j20Q8N3j27J3J02j7
$$ y = [-68, -89, 131, 45, -108, 68, 32, -222, -36, 212, -5, -87, 160, 39, -218, -35, 151, -13, -35, 81, 4, -61, 28, 20, 12, 84, -32, -162, -22, 39, -80, 50, 180, -14, -93, 40, -53, -104, 97, 90, -124, -6, 116, -92, -82, 195, 109, -140, -17, 53, -98, -28, 132, 61, -32, 22, -49, -94, 50, 65, -21, 43, 65, -66, -29, 71, 6, 7, 66, -64, -118, 58, 54, -64, 84, 183, -78, -139, 58, 24, -102, 41, 107, -61, -65, 30, -13, 2, 100, -7, -73, 13, -9, -85, 50, 133, 0, -23, 32, -55, -51, 57, 10, -53, 45, 4, -129, 7, 158, 12, -22, 88, -16, -145, -18, 49, -39, 31, 58, -65, -47, 73, 24, -35, 65, 42, -88, -49, 30, 2, 45, 73, -17, -16, 34, -58, -61, 89, 60, -119, -35, 64, -48, -47, 115, 98, -30, -5, -7, -64, 1, 26, -35, 2, 70, -52, -58, 102, 74, -60, -13, 29, -89, -76, 47, 44, 26, 69, 12, -43, 12, -1, -63, 9, 43, -81, -50, 65, 23, -14, 90, 69, -81, -45, 18, -33, -9, 88, 38, -19, 29, -1, -21, 50, 18, -68, 11, 42, -88, -36, 117, 53, -67, 21, 74, -53, -40, 62, 45]
2663D5m5j5k3J3N9m8k1J05k3j59N6J46q4p2J04J1j01jO9J0Rk0p1O7L3j15NJ58
2691I2m7j54R6J09j23m5J38j3j08K7L0k1K3K2j7L9nr9L5J09r6p7J18J3j29O2J28
2718A07p1n5M8mp5J6K4JM8j9p8Q0P4j40l5J60l0j78O8J48p1p1R0L9o7o1LO0M1
2747E2r6l6J58rj71N6J89j13j57J31O4j29MJ13j1m3Ok6J5N0p0m0J22Oj41N3J41
2774A18r7j00J04K9j00kO8%lj1mM6k8r8N3J08j02q2J74M1j85J5J89r5j68Q8J10
2801F8j01k5Q1L6k3k5o5N3N4j30m3J78L5j67L3J76o2j37L5O0k2n2j7Q2Q3j02q9
2828h6J58O0k28m3K21j7k02J00J75j00j04Q8L3n7k3nK5L4m6l4J09K3j20K4R2p8
2854aq8J18J8j15M3Q9p2k5P0j8k1J4m7k1R5j4j12J13J21j77q0K02nj88K1J57n1
$$ y = [45, 0, -15, -38, -25, 34, -14, -35, 70, 47, -112, -56, 90, 6, -66, 38, 49, -52, -53, 16, 26, 35, 15, -56, 11, 44, -71, -66, 92, 45, -109, -13, 96, -27, -72, 66, 53, -55, -28, 2, -19, 4, 26, 9, 48, 43, -56, -21, 88, -8, -85, 33, 46, -83, -21, 107, 36, -19, 29, 25, -50, -34, -10, -9, 39, 20, -58, 22, 96, -44, -79, 81, 51, -127, -59, 89, 18, -53, 37, 76, 9, -52, -49, 11, 52, -44, -80, 78, 69, -102, -46, 143, 30, -127, 4, 68, -61, -57, 56, 45, 2, 8, -18, -3, 47, -23, -63, 59, 65, -76, -23, 118, 21, -79, 25, 54, -46, -48, 20, 20, 17, 6, 2, 48, 20, -78, -25, 83, -19, -101, 73, 114, -71, -56, 133, 38, -130, -42, 68, -33, -58, 23, 59, 36, 11, -54, -1, 53, -77, -120, 58, 93, -74, -41, 135, 73, -64, -29, 31, 9, -43, -60, 22, 105, 3, -86, 72, 132, -96, -139, 82, 65, -137, -37, 138, 38, -66, 22, 55, -2, -25, -30, -5, 29, -17, -51, 58, 81, -39, -15, 77, -1, -89, 29, 47, -68, -25, 64, -8, -33, 37, 19, -2, 12, -35, -56, 39, 25, -87, 26, 147, -30, -110, 92, 87, -101, -80, 77, 26]
2881B6j11M5R9K3r2o2Q8Q6j60q7K23P6k50j9K39m4j91P3J26n9p0J2L7N7k0j22
2907g7N8J30j20j34J72J14j70o7J39K0j16J1O8J7op1qQ7oj18O3J07j33n6J45N
2933E4j15O8Q1j27m1J32m0q1Q6L8q4QJ1KL0Np5L8Q0j00o1J66L6j86K1J29m7q9
2961f1N6N1ok7q1K7J36n0j72J27J69j93j39K15R5k10l9J63j3j02KM9R2m6j27K1
2987f3J56p1j50J33J19j54r1J52L9r7K1L5m1K2j9n4Q0P6j15m7J39l8j22R0Q5j02
3013a7k9R5n7n1Q5K3o2J8J4n6J8L1k5L6L4j07NJ21m9j23J27R2j82n8J85Kj12M9
3041GK9k1k6m8QJ11K2j72L7J62j01j47J48J38j66p0R7N3n2j6RM0Rj31l7J86J8
3068H7k01N2J91j18j49J32J10j08l3M5jMnl4N7O3j45n0J43j2j19R2Q9r8o5J11
$$ y = [26, -85, -40, 59, 82, -10, -72, 16, 102, -58, -145, 78, 154, -96, -115, 124, 80, -111, -38, 88, 29, -41, -29, 8, 65, 45, -77, -19, 111, -9, -143, 29, 143, -27, -94, 45, 65, -51, -40, 28, 45, 39, -32, -40, 47, 41, -77, -14, 93, -40, -96, 49, 54, -61, 7, 88, -39, -80, 52, 12, -69, 17, 55, -29, -21, -10, -8, 22, 27, -48, -10, 70, -30, -91, 75, 111, -75, -54, 75, 28, -61, -5, 46, 40, 13, -68, -41, 95, 45, -127, 0, 169, -24, -163, 52, 147, -63, -102, 61, 48, -54, -52, -3, 89, 43, -84, -63, 93, 22, -128, 5, 124, -30, -121, 31, 70, -27, -6, 29, -12, 10, -9, -63, 17, 93, -22, -69, 70, 32, -90, 0, 85, -17, -46, 49, -8, -59, 26, 49, -13, 5, 19, -37, -19, 12, -13, 23, 57, -50, -45, 76, 27, -96, 31, 123, -59, -117, 68, 70, -42, 7, 36, 15, -11, -59, -51, 60, 82, -90, -53, 109, 8, -139, 9, 147, -19, -89, 8, 61, 9, -7, 2, 42, 51, -80, -117, 69, 87, -114, -62, 129, 11, -138, -6, 104, -4, -37, 8, 7, 11, 6, -28, 29, 92, -53, -103, 40, 28, -91, 1, 90, -8, -73, 38]
3094C8j2n9N6J8o4J5K5n0M6O4q4j9P4n5q6J29L6j37K7J13p6q0J08K6n5j5M%O0
3123D7l6o7J03N4j92k3J90k8j69P9J31j11p5J06N8l4k1k2K4M0q1o8J34O7j74k5
3149i3J67m2j37Q3R6p8n9M7L3M0k2n6N9N3j40n6J40M1j64M6J29p8r1J03M2r3J4
3176a6J6j4J6K2k5L5J7r2k9J05m0q5J15N7j12k5J19l4q5N6L1m1Lj2J3P0j2j18
3204f5M8P3j18n4J68N4j71J1J24m6r7N2O5k1l7k7L1R6p3r7J15P3j76k6J75Kj59
3231h0N7R0o2o2M4K9J9oo1J7P4p3p6J29O2j43rJ26l0j05N9O6o8l0L2J4Nnm6L5
3261BL4j08qJ45l1j07Q1P8j12m7J28j7q3L8L8m6J5Ql1N5Qj05J1J28n7j17J28Q5
3289A13j44n7J36kp2NN2J9m6m7J8R2m7j00P9Q9j25m5J50Pj29K5P4m3k9M2mlL2
$$ y = [38, 26, -33, 23, 41, -23, -8, 17, -33, 13, 77, -7, -26, 48, -7, -93, 36, 72, -65, -38, 75, -1, -81, 27, 53, -2, -17, -13, -13, 47, 11, -56, 47, 101, -91, -114, 76, 48, -121, -42, 89, -22, -97, 9, 67, 33, 12, -10, 14, 54, -27, -95, 39, 106, -68, -93, 74, 32, -105, -22, 74, -4, -63, -16, 17, 57, 35, -21, 38, 91, -49, -105, 35, 76, -88, -42, 87, 9, -82, 21, 63, -30, -16, 0, -14, 2, 24, -1, 34, 51, -41, -70, 35, -5, -90, 25, 82, -30, -55, 64, 30, -55, 1, 32, -9, -6, -18, -5, 65, 53, -65, -17, 56, -62, -116, 52, 106, -65, -54, 70, 24, -73, -21, 44, 23, -14, -41, -10, 86, 13, -84, 31, 104, -72, -98, 77, 79, -80, -23, 67, 5, -57, -13, 16, 35, 29, -32, -15, 59, -14, -90, 39, 101, -42, -51, 75, 45, -60, -1, 65, -3, -33, -1, 13, 18, 13, -33, 2, 36, -72, -80, 65, 34, -73, 8, 86, -26, -73, 55, 38, -45, -7, 31, -15, 0, 8, -23, 32, 40, -65, -54, 74, 17, -100, 28, 113, -31, -88, 48, 46, -26, -21, 31, 50, 4, -43, -25, 67, 20, -80, -1, 88, -37, -82, 68, 75, -54, -29, 45, 2, -27, 15, 11, 8, 40]
3318D0o3l6R5Kj08P1Q9r6o3J20J1j15L1O2k9m3M6K4j6j3l6K6L8r4RJ16k1j21Q5
3347A1Q6j28n1J29Oj08M6N1k9j3K1m2K1L3n9k7J15qj19N8R8j00o7R2K7n5j1J6
3375gL9J4p5j4J07j8j26M4J42q0j16J19N8j37j2J10l3m4N4j1l4M2j1m1L7K7n4
3402b0PN2m4k8O6on7M9Kn4L1L8m7J1L5n1k0P0l0n9P8M9j22OJ31o1j07R5P2j04
3432a8k9Q6mm8J0J5J2Jn1jQ2l9p1N6O3q1m1Q0lm3K5kk1N2lq0N1P4q9o0J42j2j22
3465f9L6R7o3m1N8J5m9%NJK8ml5M3J7o7J3L9l0k8O2oo4N7L2p9qQ3m0m5O1J3n5
3498b3K3K2l9PL5l9k9Q6k1p4N2L3m6mL7j1lK1m5J0N1m5m8O3L4j00K5Q6m7o9M8
3529a0L8n1mL0oMOk2J9K5l7l6N7J1o4M1L9n2mL9l5j2O3m3n3Q5K0q9QQ6m5n1O5
$$ y = [40, -23, -59, 36, 38, -70, 1, 90, -6, -69, 51, 62, -53, -22, 40, 11, -32, 14, 38, 22, 9, -27, -1, 37, -57, -48, 68, 47, -74, 11, 97, -31, -82, 47, 53, -55, -9, 42, 13, 0, 21, -21, 0, 33, -26, -53, 62, 54, -65, -7, 91, -9, -76, 16, 43, -12, -23, -7, 32, 46, -29, -43, 64, 46, -80, -36, 106, 26, -90, 29, 87, -50, -62, 48, 15, -29, 25, 14, -20, 22, 11, -30, 7, 34, -20, -13, 39, -5, -33, 33, 27, -30, 19, 21, -33, -2, 36, -11, 0, 35, -16, -36, 34, 4, -55, 23, 72, -50, -44, 87, 26, -81, 14, 86, -18, -47, 39, 35, -13, -3, 12, 24, 25, -26, -27, 55, 16, -55, 1, 64, -17, -58, 22, 19, -24, 1, -1, -22, 30, 27, -53, -2, 72, -17, -77, 65, 53, -69, -33, 64, 1, -40, 18, 33, -16, -16, -11, -10, 18, 14, -21, 22, 39, -28, -15, 24, -6, -34, 28, 22, -42, 15, 47, -32, -40, 43, 3, -42, 19, 32, -23, 0, 22, -17, -10, 25, -14, -43, 43, 22, -52, 0, 33, -13, -17, 20, 9, 6, 27, -18, -8, 43, -2, -50, 13, 47, -53, -28, 58, 11, -58, -10, 28, -23, -27, 3, -3, 1, 7, -15, 4, 29, -8, -44, 13, 24, -40, 1, 40, -12, -16, 23, -12, -24, 39, -4, -57, 28, 48, -41, -33, 53, 8, -43, 22]
3562B2J8o1K0L7l5j6K5k0j7L9%l3L5jj9NLj9J6K1m4J8L4k5o0O4J3p1L5O2m9j8
3594b1M4Ko5M6J7o8K4O8m8l3O1nm9QM6l5jL3k2RJ2k8kJ3j0l7N9K0n1OL6l4j5L5
3628A5l0j3O0j2o3M6M0p3j0O1j7n4N2K8m7J2L3l0k6L5j3jK8rl4L9On1RM2l1j1
3660a9M5j5k1K0lk9J6K6m2OL8j6l2M3J0o8K1M9m3pN2j9l8L7lk6QJ3j9J8J6k2k
3693fL8l6l0O3pn9M7L7n2j1L8ql9K9Ok4J9K7m5jM4m1k7O7Nn3J8L1l7j0K9k0LO
3727Aqj1M8j7m0L2J6m9JN3k5k5L4J3m6J2L6m1LL5j5k8M4j7k8L4Ll0J4J8k0qM0
3760B9j6l8K7J2m8L5K8n3J5L8l9l1N5Jm7K3M4n8jM1j0l7K6K0k7%K8k9J9Lk8QK1
3793A1j5k3M3Km4J4L9n4jO4k3l9M5j0l2L1J9m0pK8pl8M3Rl7J9J6l0ML7k0k7L4
$$ y = [22, 40, -21, -1, 36, 1, -15, 10, -10, -27, 12, 12, -21, 14, 13, -6, -1, 2, -17, -1, 20, -24, -6, 28, 3, -57, 7, 20, -51, -16, 46, -3, -21, 23, 25, -40, 6, 23, -45, -21, 47, -1, -34, 27, 22, -27, -19, 27, -8, -9, 24, 2, 11, 23, -5, -7, 6, -4, -41, 18, 38, -13, -7, 29, -5, -20, 15, -15, -28, 32, 20, -43, 3, 43, -30, -40, 21, 4, -50, 2, 30, -17, -5, 28, -2, -28, 7, -6, -7, 21, 12, -22, 17, 23, -28, -19, 23, -8, -19, 26, 11, -10, 10, 7, -22, -6, 20, -22, -16, 22, 6, -26, 17, 27, -41, -20, 29, -14, -21, 31, 12, -26, 11, 8, -18, -10, 3, -16, 2, 18, -4, -6, 32, -4, -34, 29, 22, -37, 10, 47, -5, -16, 22, 14, -25, 4, 10, -14, 5, 32, -13, -14, 30, -11, -38, 29, 34, -19, -1, 30, -7, -17, 12, -8, -5, 1, -7, -18, 30, 13, -27, 5, 21, -28, -27, 26, 1, -24, 10, 23, -23, -11, 25, -16, -13, 22, 7, -21, 23, 6, -22, 12, 15, -15, -1, 17, -3, -11, 29, 13, -25, 2, 14, -34, 1, 29, -24, -9, 29, -10, -41, 14, 15, -32, -9, 35, -23, -24, 17, 7, -30, -4, 16, -11, -11, 17, -12, 7, 10, -18, -10, 11, -4, -27, 16, 18, -26, -12, 27, -27, -28, 36, 13, -26, 19, 9, -23, 8, 27, -13, -20, 8, 1, -37, 6, 15, -22, -3, 13, -17, -13, 24, 4, -23, 11]
3826A1oj8K5rk9L6J1n4J6M1k8k9O0mn0L0J7l4kL9k6j2K8j1k6L1Kk9mM7l9MK5%
3860A3l3K2J2l2J6J6qk0L0k4pL4j1k9K0J6l2lM0k2rL1Jm1J6K7l9J0L4j8j6K0r
3893Ek6M3j0l0J8L2m2mL3j1l5K5J6l8L1K1m2K1jk9J0L2j5l2M3ll6J9K3k1k1L7
3925A3j3k7L2J4l0J8J0l2JL0j0j3L5nl2J2K1l5NK4k2j3K2Mj8J4%j5J0J1l2J1L7
3958B7j6l7L9Jm5K2K8k5j2K8nk2J8J1k2J3J0l1K6K4l6oK7j3k0J6Qj1kJ7k0kRJ
3992@k1L6Nl7K2Rj9NJ6k3j3K7Kl5K6Ok3KQpj2M4k2pK9jm2K4L1l3nM3k5k6J7K2
4028B3l0Mkj3J5J8qj1L7j6m1L3J2l5OK9j7j0J3Jk6K6Lm1J3M2l6rM3j2l2K4J0m7
4062c4K1K0omJ6j2j7K8Kj9J2mJlRj6OJ9k2j6L8J0n5J7L0l8%K7k0j1K6Nj9RK2n0
$$ y = [11, 5, -13, 12, 3, -26, 10, 21, -33, -17, 24, -4, -33, 27, 23, -27, 3, 20, -14, -16, 23, -3, -15, 13, 2, -24, 7, 9, -20, -24, 23, -16, -12, 13, 13, -20, 2, 14, -18, -2, 14, 6, -14, 16, -8, -15, 19, 8, -21, -1, 15, -17, -20, 20, -2, -11, 20, 21, -20, -4, 23, -16, -6, 28, 10, -6, 14, 5, -21, 22, 12, -18, 0, 32, -10, -14, 19, 8, -27, -2, 14, -24, 7, 28, -14, 7, 6, -23, -13, 19, 4, -28, 15, 12, -24, -5, 18, -3, -24, 13, 0, -27, 5, 19, -11, 7, 17, -15, -14, 16, 6, -7, 28, 23, -9, 3, 24, -11, -6, 18, -4, -17, 5, 9, -9, 5, 5, -10, 0, 11, -21, -10, 27, 11, -26, 13, 14, -31, -9, 19, -6, -18, 10, 5, -17, 1, 12, -10, 3, 13, -18, 8, 32, -4, -10, 17, 4, -16, 0, 8, -3, -5, 12, -8, -10, -1, 0, -21, 15, 20, -17, 5, 14, -5, 0, 16, -7, -20, 7, 9, -26, 0, 6, -17, -15, -7, -14, -26, 18, -4, -11, 18, 17, -25, -1, 30, -3, -8, 35, 10, -16, 1, 23, -7, -3, -5, -18, -3, 15, 7, -4, 33, 17, -24, 9, 21, -14, -8, 21, 4, -6, 7, 8, -18, 8, 11, -30, -17, 25, -11, -20, 23, 11, -21, 3, 13, -34, -13, 7, 1, -3, 13, 1, -16, 12, 14, -5, 7, 3, 4, 1, 10, -6, 0, 19, -3, -19, 19, 29, -26, -9, 21, -17, -17, 10, -10, -21, 5, 10, -9, 0, 22, -28]
4098b8J4L8j5l9K7K2l0j1K0o%nqJ8J7k3l0N2j1l6J1M0k4j0K8rj8J8kj9J6K5l0
4131hj3M8k8l1K8K3k7nK9j3oQj7J4J6l5qM3j2l5K5K0k6nL8l2j4M9j4k9L0Rl8R
4165gK6j5j9J9J0k0%J5k8K7Rl0mK2Qk8J4K3j4j3J0j4PPj8LM2k7m2L9L1n7nL5L
4200Il2K0J1j5MPj4K4ml1%M1k2l2M2J8l1j1K8k6NJlNK4k0j2L6kn2J8K8k2j9M1
4235A4nl4J9K1k5LK0kj9NJnMMk8K9Nl2K3K9l1j8J6Rk0lM6j2Lk1JJ5Ml7kL5Jn5
4273d2K8N7n1l4N0Ql2JJ0Qjj2jK9On1K2M3l0m8K2L8m5kL6Ok3QmlJ7j1j8K7Pj5
4309@j7M7k3k5L1J3n1J0K4j3j3J7PkJrjQjl4L4J6l8%N8k2n6L2L4l8j2K9Qj4Lj6
4345a3J4Qk6rN0No6J3N8l5l1L1L2m0j4J2J7Lj8k2M5J2m8j9O8mo4L4M6m4k9L2K0
$$ y = [-28, -14, 24, 9, -30, -3, 19, -11, -22, -2, -8, -8, -13, -21, -3, 14, -9, -39, 13, 2, -34, -23, 17, -7, -17, 11, 2, -16, 2, 0, -19, -3, 22, -8, -21, 27, -1, -32, -4, 19, -8, -13, 16, 3, -3, 5, -12, 2, 18, -17, -25, 18, 6, -29, -4, 16, -10, -15, 23, -9, -23, 26, 12, -17, 13, 22, -16, -7, 19, 4, -15, 4, 14, -6, -6, 9, -19, 8, 17, -13, -17, 5, 13, -15, -1, 22, 8, -5, 5, -9, -2, 5, -13, -10, 32, 5, -37, 2, 33, -24, -29, 6, 9, -23, -3, 8, -7, -3, 4, -10, 14, 10, -21, -21, 20, -2, -34, 8, 26, -5, -16, 12, -14, -9, -8, -11, -6, 18, -2, -14, 22, 20, -32, -14, 14, -8, -27, 14, 9, -25, -6, 15, -10, -7, 13, 11, -8, -3, -2, -7, -3, 1, -27, 2, 7, -25, -2, 27, -4, -22, -6, 3, -17, -20, 26, 14, 17, -4, -3, 12, 16, -21, -23, 12, 13, -42, -14, 43, -8, -42, 8, 16, -16, -15, -5, 3, 2, -10, -11, 18, 24, -27, -5, 38, 8, -40, -18, 20, -25, -27, 9, 15, -8, 0, -4, -7, 10, -1, -19, 8, 15, 0, -17, 30, 7, -18, 13, 26, -25, -15, 9, -4, -17, 0, 7, 5, 6, -3, -4, 4, 3, -31, 3, 19, -19, -19, 39, 17, -39, -7, 27, -11, -23, 6, 14, 0, 3, -13, 1, 9, -17, -26, 24, 29, -37, -24, 34, -1, -32, -1, 31, -9, -23, -11, 6, 9, -9, -31, 14, 26, -22, -41, 27, 23, -41, -7, 39, -5, -34, -2, 18]
4378A8l3jJ7mMj2kJ4J8m1RL7j6l2L1K1m2nL6j0j7J9Rk4klQK1j8k4K9L1m5j8O0
4413C3ko4K2L9j9j9J1R%j7jJ5J8l9j5M6J2n9j0P8mo5K4K8j4l4PK9oj6j5L7K6n0
4447a5j3M7J2n8J1M6j9m2L2J6k5pJ3LJj4j4J9K9n0KN3j5m7K6L6m2j8M0lj8J4J3
4480A3Nj1pj8L5j0m6L2K9l5j7O0Ko1J1L5j2l3J2K8l%k3J6L9m4m7O5J7o0j5P0p
4513B0n5RN1j7l0J0J7lqk5NN2k9l3M9K0o0ML8ok9J2QPllnJ9j3m2L7L6n6j2O0K
4549B7n2K2M3l7k6K8J3m0PK9j6j0JJ5MLl9K4K5l3k3L1K9l2j0L2nj4pJ1J4kl4N
4583a7L8Jm8L0M7m9n2O2K7n5rL7Ok9pJ3J5%k2KL5j8l2K3L0l7j0L3roOLoKroRJ6
4621A4k8mL9k6k3M5J0l7OK7k3j4K5J0j3j8K7pj4k%L2ll6OL2k5k2L1K3l6k4K8m
$$ y = [18, -15, -16, 1, -3, 1, -11, -13, 1, 19, -22, -13, 24, 8, -24, 7, 28, -14, -19, 17, 7, -10, 9, 18, -6, -8, -11, -3, 18, 0, -24, 5, 36, -9, -27, 33, 31, -33, -11, 28, 9, -10, 1, 10, 10, -7, -8, 7, 25, -14, -29, 17, 29, -30, -40, 38, 34, -31, -7, 21, 7, -27, -20, 9, 3, -13, -28, 9, 35, -15, -28, 19, 31, -27, -16, 30, 11, -31, 1, 17, -8, -15, -2, 1, 2, -12, -26, -7, 22, -28, -26, 27, 12, -35, -9, 27, -15, -33, 7, 4, -14, 0, 13, 18, 7, 0, -18, 17, 7, -39, -7, 22, -13, -30, 30, 32, -29, -18, 17, 5, -28, -16, 12, 9, 9, -14, 2, 41, -3, -50, 15, 32, -28, -43, 27, 20, -35, -26, 25, 8, -22, -12, 5, 2, -6, -31, -26, 26, -3, -36, 13, 33, -27, -23, 15, 9, -20, -8, 0, 7, 4, 1, -4, 15, 2, -40, -3, 33, -23, -35, 25, 27, -25, -3, 40, 3, -23, 5, 18, -22, -15, 14, -2, -12, -11, 4, 8, 11, -28, -4, 21, -12, -35, -4, 25, -7, -17, 15, 10, -4, -11, 0, 14, 12, -22, -17, 21, 22, -26, 4, 51, 2, -50, 12, 39, -16, -25, 12, 18, -11, -18, -5, 10, 10, -12, -10, 25, 7, -25, -2, 28, -9, -19, 14, 5, -1, 5, 8, 2, 4, -5, -11, -2, 14, -14, -18, 21, -5, -28, 17, 27, -10, -4, 23, 0, -14, 11, 21, 8, -10, 17, 10, -4, -6, -6, 26, 23, -13, -7, 25, 0, -22, 9, 32, -4, -28, 0, -4]
4655dlqK6kJk7LL9J7n1rN1j6n9K8M7k7k6J8J6pk5J2J7Ql7RL0j2j7QK5j6l5L1N
4691A0j6mMQrRj1J2Lj9QK%j7K3K0k7kJ2Nk6J0J2poj0J9M%qK2J5l5k0L7ll9K1K5
4730B2l0k3L5J6pk8RmJ1j3kK7K8m2pK5ml6mM8j4k8jJ9Llk1K4J6l4j2L3K4m0j1
4765b4L7jl3K8J9j4j8NNj5jJ5mJ5k0j4J6J4l3J8J7lk2KK3k5J8Kjj9MJOPj6MK0
4802A3j0l5K8L4m2rL0ok1qM0kk5LJJ4Lj1J3Mk6oK7J5j9lJ5j3k4QK5j5J0j7mL3
4838B0j0l1J5K9l0j9K7K7l2j7L2jl5J0J3L%n%J2k5qK7Moj1RJj1J4J3j7kMMj6J4
4875BKkJ5j6j2J2J2k6QJ8qk5NL7l7JJ5Qk0j3K1K0j0j3OJ9k3k2L1J9l3j2K9Nk6
4910a3QOo%lnJ5J1j9%K2j8k9J8L8j3k0J3Lj5nJ1mJ7j8mPNpJ0Nj5k2L4j0j6J3K7
$$ y = [-4, -7, -15, 11, 9, 10, -17, -14, 25, 42, -9, -18, 33, 17, -42, -14, 33, 6, -20, -2, 14, 7, -18, -6, 11, 19, -18, -9, 21, 9, -8, 0, 25, 9, -26, 5, 10, -6, -10, -6, 2, -7, 2, -9, 3, 6, -13, -5, -3, -3, -20, 3, 23, -4, -6, 6, 11, -15, -5, 7, 0, -6, -16, 3, 7, 7, -1, 21, 36, 1, -19, 18, 15, -24, -3, 22, -8, -31, 4, 20, 13, -15, -6, -10, 1, -12, -14, 13, 41, -1, -8, 17, 13, -23, -27, 21, 7, -21, -22, -3, 0, -3, -24, 0, 16, -18, -30, 3, 27, -13, -24, 13, 12, -21, 7, 26, 12, -6, -1, 4, -11, -12, 3, -1, 14, -6, -20, -4, 10, -23, -5, 12, 9, -13, -11, 12, -13, 5, 7, 6, -13, -9, -8, -2, 5, -11, -7, 13, 3, -32, -4, 30, -12, -21, 9, 3, -18, -26, 14, 12, -13, -10, -9, 5, 8, -3, 10, 14, -12, -18, 9, 24, 5, 2, 17, 4, -20, -12, 13, -2, 8, -9, -13, 20, 10, -21, -6, 23, -7, -26, 1, 28, -4, -21, 11, 10, -25, -15, -2, 1, 1, -4, -4, 8, -17, -25, 2, 6, 0, -11, -2, -1, -12, 2, 15, -2, -4, 0, 4, -12, 2, 4, 2, 17, 1, -11, 1, 13, -13, -5, 13, 5, -20, -15, 22, -15, -14, 1, 9, -11, -24, -3, 17, 7, -6, 0, 19, -4, -26, 5, 24, -9, -21, 8, 13, -13, -5, 1, -5, -5, -8, -13, 2, 13, -6, -6, 16, -2, -31, -13, 25, 12, -8, 5, 8, -7, -12, -1, -5, 12, -6, -10, -3, 2, -5, 5, 10, -5, -27, 7, -3, -19, -6, 21]
4948B1j8j1J2%kmJ0j4OqkJ3Pj2lQjk4J6J6qj1QQJj1mJ6kk0rK8Kk8J8L1k7k0K3
4987EJ0k2nRMj4jMJ4J4k2rJ7Mk0NQjk0K5J7j0nj0QKj9mK8Lj9jK4k8KQmj1KK3j3
5028bk3K9J2j5%%j0MLqJ2Mqj0J9j2j2J9Nj6LM%JPj3JOMj8K3jj1nL0j7j8PNjOj
5070Cq%KNj2J5j9j3J7J2j2KJ6npjmJJ5Mj5PQj4OMj1j2J0P%kjKjPkllQj2LQj2N
5115bJ0pj2J1kqPKqNKmj2J8j2kPoJ1J1j0mJ6Nj5pJ5Mk0J7Oj2j%j2J5rMj1J9mj7
5157a2J7Rk5OqJ7rLKoQlnJ4rmNOpLj7J3joQm%lL%LJ1j3QJ4j3mJ4pqLpKMJ1j2N
5204Flmj1J0lj4J0JKOJkrMLj1RLJmK3j5Pj1j1%MnQLLo%KJrJ0Kj7J3JPmJ2k4%J4
5251Crj1RJ0kLLj6kMLj0NJ2lqRpJQloRJ1j7mPlnJ0QrKJ0j8J4Omj0Jj5PK1j8nO
$$ y = [21, 3, -8, 4, 4, 2, -2, 8, -6, 0, -8, -10, 3, 10, -2, -5, 3, 2, -22, -6, 10, 2, -9, -1, 7, 8, -3, -7, 9, 7, -13, -22, 6, 8, -20, -2, 29, 2, -18, 5, 15, -7, -12, -3, 1, -13, -14, -10, 4, 18, -4, -13, 4, 8, -12, -7, 1, 0, -20, 5, 22, 12, 7, -3, 5, 7, -12, -16, 12, 15, -4, -5, 19, -9, -7, 1, -3, -14, -12, 11, -2, -25, 4, 16, 1, 1, 1, -9, -5, -2, -10, 2, 6, -2, -12, 7, -5, -17, 2, 7, -9, -6, -2, -2, -1, 6, -7, -6, 0, 4, -14, 9, 8, -3, -8, 22, 5, -13, -6, -1, -2, 4, 3, -5, -5, -3, 2, -10, 5, -14, -27, -10, 2, -10, -8, 8, 3, -4, -5, -9, -8, 7, 11, -4, 3, 11, -3, 3, 7, -4, -16, -6, 1, 1, -1, -2, 0, -1, 6, 4, 1, -2, 6, -6, -3, 5, -7, -2, 8, 1, -11, 0, -2, -10, -3, -1, -9, -4, -2, -6, -18, 0, -12, -14, -7, -13, -2, 9, -1, -5, 11, 16, 1, -6, 9, 13, -7, 10, 16, 4, 3, 3, -9, 6, -3, 1, -10, 9, 5, -12, 5, 14, -11, -5, -13, 4, -5, -2, 0, -6, 2, -1, -6, 8, -1, -5, 0, 6, -1, 2, -15, -2, -3, -9, -1, -5, -5, -8, -5, -5, -2, 9, -4, 4, 18, 5, 1, 15, 8, 0, 3, -4, -2, 2, 13, 1, 6, 3, -1, -12, -2, -5, -19, -9, -8, -6, 0, 1, -1, -10, -6, -3, -14, -5, -2, -1, -5, 18, 3, 10, -1, -12, -12, -8, -13, -5, -2, 1, -5, -5, -3, -2, -11, -1, 1, -16, -3, -2, 5, 1, 13, -11, -11, 3, -6, -17, -8, 2, 0, 3, 6, -10, -12, -8, -5, -15, -10, 2, -1, -9, 0, -7, -6, 2, -1, -7, 2, 13, -4, -8, -1, -4, -9, 1, 9, 0, 2, 12, -6, 8, 14, 10, 0, 1, -14, -7, 14, -4, -9, -3]
5297cJ0mpNMoLj3QNRk6J2j0PLlPrRLlJKmpQlOlJ%j3J4JoJ5j2rK0j0qJ0nkmlJJ2
5346CKlrNLpJ2lj0%J9Nj4j%kj1%PKQnqJ7Jj1R%j0pQk0RK3kpLNj1JJ5j9KJ2lml
5393ANrJPj5%KNPrK1j5mJNONj3mQqj0J9Pj5mJ9j8j3K6j2PkOKkQk5K0Jk0%J8kq
5438aJ7rk0MRjJOjrJ6j0j3J1%k3J7PpKK1j0rMJpnK7j2lJNj4K2j1j2LJpJ3J5j3
5480Fk1K5kk4RQmPmJMJj0rK0Nl2J7%OlQnj1kJKJ1kNnMj4OK2j1lJjqJQpRJ2k8J3
5527FLj2K%Mj1mJ2kJNkj6J0J8j6RJ1j2nlJ2j7J0moRllL%QrJ1jrQjQj5OmpJ2p%
5573aJ9ok8J0K0j7JQkj4kQkRrPPMj5nJ5rpQJ7oj6K0j0j1J1KjQmpMnkMJ4j1jKj
5618Fj0PJ0LloKJmnK%oJJ1onqJ5j2%K2qpJ1Jj5KjJOMqj2K0J%rMKj5J1jPlNnOk
$$ y = [-3, 7, 3, -4, 1, 5, -1, 2, -11, -3, 2, 11, -15, -3, -13, -6, -3, -6, 1, -8, 1, 4, 1, 2, 4, 0, -7, 1, -2, 4, 1, 2, 2, -11, 3, 4, -2, 13, 1, -8, 12, 2, -6, 4, -1, -3, -7, -10, -9, 3, 5, 2, -7, -2, 1, -6, 6, 3, -7, -7, 12, 17, 3, 2, 2, 0, -11, -11, -4, -2, 6, 1, -7, 10, 11, 0, 9, 9, -1, -8, 0, -20, -11, 12, 10, 3, 6, 11, 0, 1, 16, -3, -1, 11, 8, 4, 1, 6, -3, -2, 5, -10, -10, -8, -3, 4, -5, 16, 1, -3, -2, 3, 9, 14, 1, -3, 5, -3, -13, 6, 13, -2, -6, 13, -5, -18, 8, -4, 3, 1, 7, 9, 7, 15, -10, 10, 11, -9, -9, 9, 7, -1, 16, 7, -13, -9, 0, -1, 0, 6, 5, -4, 12, 2, -11, 0, 0, -23, -6, 1, -6, -4, 17, 7, -2, 2, 3, -4, -9, 18, 6, 3, 4, 9, -5, 17, 6, -6, -3, -2, -9, 4, 19, 6, -15, 10, 8, -16, -7, 1, -3, 4, 0, 1, 5, 6, -4, -13, 7, 12, -20, -3, -3, 3, 0, 8, 3, -8, -10, -9, -7, 4, 2, 7, 2, 6, -8, -2, 20, 9, 6, 7, 6, -2, -1, 7, 0, 9, 21, -7, 6, 9, -3, -1, -1, 3, -8, -12, 0, -2, -1, 4, 2, -14, -4, 14, -2, 7, 18, 6, 1, -2, 10, -7, 3, -1, -7, 2, -1, -4, -1, -1, 7, -2, 9, 8, -1, 7, 6, 14, -1, 5, 1, -6, 6, -1, -1, 18, 12, -16, -6, 14, -3, -2, 6, 4, -10, -12, -4, -6, 3, -6, 1, 8, 12, -3, -8, 7, -2, -9, -1, 16, 10, -6, 14, 4, -7, 4, 6, 5, 13, 9, 2, 6, 1, -1, 3, 17, 6, 5, 7, 6, -4, 3, 13, 16, 13, 7, 9, 10, 6, 1, 3, 3, -3, -2, 9, 3, -2, -10, 5, -7, -7, 15, 7, 0, 11, 12, -3, -1, -2, -1, 5, 9, 1, -11, 9, 10, 10, 1, 5, 7, -8, 3, 2, 9, 6, 11, 6, 12, 10]
5667A0j9PJ2lj5K4j1rJ8j1olKJPKqJ3oJrN%j8K0Nj1JJ7j6J3lJj3RjnRnlkQLj8
5711gJ2JqrJ5Mj2LlKlOMJopPKqJRQj7kJ4kqJ0Pj4lMj7K4mj0LRJj1Qj%lJ2lljk
5760ColkkJ5j4QLJj1LPjpLR%mMj3%J6njjpPKjj2J7MlrnJ3j5ROrKLnklJqJ7Qj8
5810fLJ0j1pJ9Nj2nJ1%j3LLlPj3mL2j8%NQj5mRRplJ1j0qJ1j2J4JpJJ1j1jJ5j1
5852GomRoj2J1NoNMjPj1LjJ7k0jJ3Kj7Plpj0K5Mj0J%jPj2JJ3Jk1J3POj1kJjlk
5898AOrpKJ5Mk3J3NLj9J0J1oj6J0NJj2K3j5JJ1j2MnLoJ1omMOKk5L4qj4OqK0j1
5940ErJ4omJKJ5j4rJ1Mj8KLJ1k0J9klm%MRj4qJ4%qj1K8qrLJ8j2k0K2J0rqmLJ3
5983A1rj0J3jlLMqj1J4Pj6qK8rrMlmJ9j0LpJj%KoRqJ1j6J5j1J3qlJ4nj2oJ7Rq
$$ y = [10, -9, -2, 10, 7, -8, 16, 5, -4, 14, 3, -3, -6, -4, -3, 4, 6, -2, 11, 5, 6, -3, 2, 2, -16, 4, 9, -2, -1, 16, 0, 13, 10, 11, -2, 7, 6, 1, 10, 5, 2, 0, 8, 11, -7, 5, 6, -2, -11, 4, 8, -4, -1, -4, -2, -5, 1, 5, 6, 0, -7, 0, 2, -6, -5, 4, 12, -5, -7, 7, 5, -3, 7, 14, 0, -3, 1, -16, 8, 4, -6, -3, 6, 7, -4, 4, 3, 3, 0, 12, 9, 6, 5, 3, -3, -6, -8, -10, 5, -9, -1, 2, 3, -8, -5, 2, 1, -6, -3, 6, 6, 2, 6, -7, -7, 9, 4, 3, 2, -5, 2, 4, 3, -9, 8, 12, 9, 0, -5, 8, -7, 2, 8, -1, 1, 4, -1, -3, -6, -5, -13, 4, 12, -6, -3, 7, -4, -11, 8, 13, 1, -4, 7, 7, -6, -3, 0, -3, 4, -9, -13, 19, 1, 1, 6, 14, -1, -5, 4, 13, 6, 3, 14, 4, -4, 7, -5, 9, 10, 3, 4, 15, 4, 3, 18, 7, 1, -3, 6, 0, -12, -1, 4, -2, 3, 7, 6, 13, 2, 5, 4, 21, 1, 0, 13, 15, -2, 5, 2, -5, -15, 10, 14, 4, 5, 5, 4, 11, -1, 0, 13, 14, -7, 6, 13, 19, 8, 6, 7, 6, 3, 1, 7, -2, -9, -7, 8, 12, -11, 2, 7, 10, -9, 1, 12, 6, -10, 0, 5, 6, -6, 17, 2, 3, 14, 2, 6, 1, 4, -2, 9, 3, -1, 3, 9, 11, -14, 20, 12, -2, 4, -4, 16, 5, -4, 10, 4, 0, 1, 3, 18, 4, -5, 6, 10, -8, -6, -3, 8, -12, 7, 5, 2, -2, -2, 2, 11, -3, -11, 3, 3, -5, -16, 12, 4, -5, -2, 16, 4, -16, 6, 16, 7, -1, -5, -2, 11, 2, -8, 5, 4, 1, 4, 8, 0, -11, 3, 10, -6, -14, 14, 5, -4, 0, -3, -7, 12, 2, 5, -2, -1, -2, -2, 0, -6, 3, -5, 6, -10, 5, -6, 7, -1, -4, 10, 5, -7, -13, 4, 13, 5]
6027Ej1J2Qj9KRMk4NK8k5LjJ0omlkJ5j3oJ0J9k3kJ5Oj9j6K5mjoJ7Qk4JJ5Jk2K
6068a1J1Jj5J3PJj0NRj5jKPkL%Ooj8NJ9%j7J0krmJ2J2j6qJ5Roj1nJ6nj6J1K3j9
6110AnJ2J3k0mJ7lj1nJ4J2j5j2OK4k7%pK2jk6K2Mkj0LkOPj9JRj0J3Nj4j7K4Kr
6150bLNpjJ3n%pPPonlRMj4PJorLJ8mmj1J2jj0J4jKj5QJ4j4pNK6k4k0J3Roj2J3
6195aJmJnJ2okOPj3qJ8K%j7J0MjJmJ6j6Mj2OJ9k3PJ3pj6J8mmrJ9k2MjJ1KMkm%
6240Djj2K0nkj4J6j4%J5lomMoK2j8qJ2J2j8J2jM%j3J9j1j7NK0Kj9j5J6llkJ7%
6280EqjpJ9j3oK3ompPJ6j5lNlj3RJ6qj8OkJ1j3%K4mj9MJ0mKQj2J0j%j4J3kpJ4
6323A2oj4J7%rpOQj4J1Pkj5J9rrJJJ3Kj0JLJ0j2j0J5jj0kQJ1j5jQj0lJ0jMkqJ
$$ y = [5, -6, 6, 14, -5, -3, 6, 10, -14, -9, 19, -6, -3, -4, 6, 0, -4, -7, -9, 6, -7, -13, -3, 16, -7, -9, 6, 12, -7, -23, 2, -2, -3, -9, 8, 16, -8, -7, 8, 9, -13, -11, 0, 1, -14, -1, 6, 7, -3, 2, 11, -4, -5, -3, 4, 2, 5, 5, 11, 5, -13, -8, 11, 11, -6, 4, 2, -7, -11, 1, 13, -3, -11, 4, 13, 7, -4, -9, 7, 2, -14, -3, 20, 1, -4, 8, 21, 1, -3, 14, 11, 0, -5, 9, 21, 6, -6, 0, 24, -3, -3, -10, 12, 11, -15, 7, 11, 9, -1, 2, 0, 6, 13, -6, -5, 4, -6, 7, 12, -2, -19, 5, 7, -2, 1, 6, -1, -2, 11, 6, 6, -1, 6, 13, 7, 2, -1, 8, 12, -2, 5, 6, 0, -9, -6, 12, 8, 4, -7, 5, 4, -6, 8, 7, 9, -6, 2, 16, 2, -5, 0, 26, 2, -18, -5, 4, -2, -14, -1, 0, -4, -3, -8, 4, -2, -4, 2, 9, -4, -12, 6, 8, 8, -9, 1, 5, 4, 5, 1, 17, 1, 5, -7, -1, 18, -5, 2, 15, 8, -8, 10, 6, 2, -7, 12, -10, -6, -7, 4, 6, 10, 8, 4, 4, 3, -9, 11, 6, 4, -10, 6, -8, -8, 7, 4, -2, -6, -2, -8, 14, -4, -12, 0, 12, -6, 6, 5, 9, 9, -4, 15, 4, -13, -8, 12, 14, -5, -20, -4, -7, -10, -12, 5, 5, -3, -4, -11, 8, -5, -11, 12, 6, 2, -5, 2, 18, 3, 0, 5, 2, -11, -2, 14, 6, -12, -6, -8, 3, -10, -10, 14, 10, -9, -5, 5, 1, 3, 11, -1, 9, 8, 8, -6, 7, 5, -2, 12, 6, -8, 9, 9, 0, -7, -1, 7, -7, 4, 11, 9, -6, 13, 4, -5, -4, -3, 10, 12, 2, 3, 6, 16, 4, -6, 9, 8, -2, -4, 4, 15, 0, -1, 7, -3, -6, 4, 3, 7, 5, -3, -2]
6366bOj4OJ7j1NpnPlqJ0lnlJ0J0j1pQPj3J4Nj1lR%rlJ4j2Rlj2J6Rj0mJ4j3Oj4
6409dNjpJ8%j3mQjj0J5Lj0Qj6J2NQk0OMj5J0mNPj1kPln%K0j1j3NJ7k2J6J0j3q
6451dmPJ1j0LOo%jqJ1Jj8J1kkjJ2Jj0OJrLNMJ%j0j3J5jNlRkrKPrPkKj2J2oJ0J
6499A1j7J9Pj5jJ3j9j4K2JMj3JJ4j3knKLKKlklLNk%j3J7omMJ1jp%%LloPoJrJ9
6545Gkj0QkoQnRpnPJPpj2PKj1%P%MMoJjl%PqQoJ9j7mJ6rjKNj2ROOj0kJpQ%mKn
6598aj3J2KjqJ1nKjj2jQRmk%lKJ6lj3OMqP%Oj5JMqJ5jNpQqpMNKKJnLkrQPmpRq
6651Cj1J2oJ0rlmQj0OPmJ4pnNpRrMM%qQPj3mRlQj0K%pJ4qqLJ3j1J1Qk4J1Qj2%
6698AOl%%qj0J2LpoK1j4KRqoJ4kj1OMOpMKj4K2j5kJ2pPj0RmknlN%LjnKMj0LJ0
$$ y = [-2, 4, -10, -4, 13, 2, 7, 0, -5, 2, -1, -9, 1, -2, -7, -10, 0, 10, -1, -8, 0, 7, -6, 8, 13, 2, -1, 8, 8, -1, -4, 10, -2, 7, 4, -8, 8, 17, 7, 3, 17, 4, 10, -4, 1, 0, -7, 11, 11, -2, -6, 2, 1, -9, 6, 9, -1, 7, -9, 3, 8, 16, -4, 2, 6, -9, 1, -3, 2, 9, -2, -4, 3, 0, -5, -5, 15, 4, -9, -4, 13, -9, 7, 17, 4, -4, -8, -1, 10, 0, 3, 9, 3, 3, 2, -6, 5, 6, -12, -1, -3, -5, -6, 6, 7, -3, 3, 4, -5, -2, 3, 7, 8, 8, -2, -15, 0, -1, 4, 1, 10, 8, -1, 1, 8, -1, 6, 4, 6, -6, 6, 0, 10, 11, -6, 13, 20, 5, 4, 17, -2, -16, 6, 7, 11, -2, -1, 13, 0, -2, -7, -5, -2, 0, 2, -1, -3, -6, -3, 2, 0, 0, -13, 4, -2, -6, -2, 9, 8, 1, 1, 1, 4, 1, -5, 2, -4, -3, -12, 7, 5, -5, 3, 1, -5, 3, -2, 7, 0, -5, 2, 3, 10, 3, -9, -2, 0, -11, -11, -4, -4, 0, 4, -2, -1, -2, -5, -5, 2, -6, 2, -4, 15, -2, -6, 10, 1, 0, 2, 7, -5, 4, 10, 16, 6, 4, 5, -2, 6, 6, 2, 4, -1, -14, -2, 0, -1, -9, 2, -3, -1, -2, -14, -15, -7, 2, -2, -4, -4, -7, -5, 11, 8, -5, 1, 5, -3, 4, 4, 10, -5, -4, 0, -8, 7, 6, 11, 4, 12, 4, -3, 1, 6, 8, 10, 11, 6, 9, 7, -2, 6, 13, 9, 2, 11, 3, -8, 4, -2, 8, -1, -4, -8, 0, -10, -4, 3, -1, 13, 6, 1, 6, -1, 8, -1, 3, 7, 7, -1, 7, 14, 1, -3, 6, 3, 11, 1, 3, 3, -4, 10, 2, -6, -3, 10, -1, 10, 18, -6, 5, 13, 1, 1, 7, 4, 4, 4, -4, -14, -2, 1, -6, -12, 9, -5, -3, 6, -2, -8, 6, 4, -7, -1, 3, 9, 2, 6, 8, -6, 16, 1, -1, 11, 4, 11, 1, 10, 6, 4, -1, -4, 1, 1, 4, 3, -2, 0, 4, -6, -3, 7]
6746Go%J2j8M%Rj5jJ2j2MJkLJ2j1L%kl%J0JlMmooK1j6PLrjKj%J1pj3O%mLOPoR
6795A1mqNlplK0nj6K1nKjkoNjmKQj3PLLkMoNjRj6%MQnJOj1Jj0PpmjK%J0JmJ1j1
6846@lqNLRrJ4Mk2J2LPj1lqNjJ5mmM%qRmMrOjKj1J9pnQ%j0mJ%LOkqKmOnRpKmp
6899a1OJ3lKl%OmJK%j2Rj7J6nqPKpjJ3kj0KJkNj2QMMj8J2nMlNlKnJ0rKJJMJ0j7
6948eQj0RLj4J7Pr%J0k1J3o%kLNqKjmJ4pJonJ4Moj7OMLkPkj5MONJooOQj2PJj2
6997hNpJ5rMNolj1J8okQmKjJ0rRoL%m%oKlL%j2Q%JPrJ4mJLMojj2J2j0QJ3j6Pn
7047BkJJ1l%pKNMj0%LOlljLkKJj0jPj8KJ8kroOLk%JrkJ0N%koMloRJ1q%LqjPjK
7101CoOoJMLqkOPjpPOqKj4J5j2KJ4qpNJrQkMOJj3kNJj4MLJ3j1LjJ1%lJpJ0pKN
$$ y = [7, 1, 1, 13, -5, -1, -1, 8, -7, -8, 4, -8, -4, -3, -5, -2, 10, -1, 2, 2, 0, -3, -3, 7, 8, 5, 9, 5, -1, -7, 14, -2, 5, 8, -1, -2, 0, -1, -1, 10, 3, -10, -4, -4, -8, -5, 1, 8, 2, 11, 7, -1, 4, 1, -6, -9, 11, 6, -10, 11, 6, 8, 7, 5, -1, 4, 3, -1, 1, 9, -4, 3, 6, 9, 7, 11, 5, 10, 9, 18, 2, 2, 6, 14, 9, 10, 16, 5, 6, -4, 3, -4, -8, -9, -7, -7, 3, 4, 0, 11, 0, -3, -11, -6, -3, 6, -3, 11, 15, -7, 5, 8, 15, 4, 1, -7, -2, -3, 12, 8, 4, 8, 8, 0, 9, 5, 9, 0, 6, 5, 7, -4, 15, 8, 3, 11, 11, 1, -3, -2, -2, 1, 7, 5, -3, -1, -5, 1, -4, 5, -2, 0, -4, -11, -5, 8, 5, 7, 4, 4, 10, 6, 7, 9, 9, -3, 6, -11, 5, 0, -8, -1, 1, -6, -7, 6, 4, -6, -4, -3, -5, 0, -12, -4, 0, 4, -14, -2, -7, -3, -6, -1, -4, -2, -7, 3, -6, -4, -3, -2, 2, 12, -5, 3, -7, 2, 5, -9, 8, 15, 6, 6, 16, -5, 8, 2, 2, 0, 3, 8, 0, 2, 1, -3, 11, 4, 5, -1, -6, 8, 12, 6, -11, -5, -1, 2, 0, 7, 5, -10, -6, 0, 5, 6, 0, -6, 0, 8, -4, 3, 4, -8, -3, -10, 5, -4, 0, 5, -1, -4, -15, 3, -3, -5, 3, -1, 1, 0, 10, 1, 10, 4, 7, 7, 3, 3, -3, -1, -4, -1, -1, -13, -5, -5, -4, 3, -6, 8, 4, 5, 8, 12, 6, 5, -7, 5, -5, 3, 16, 0, 7, 2, 0, 1, 12, 9, 9, 2, 4, 9, 13, 3, 3, 6, 12, 9, 6, 5, 8, 6, 8, 9, -1, -2, 5, -13, -11, 7, 5, -4, -10, -4, -1, -3, -3, -2, -11, -13, -3, 2, 2, 0, -6, -2, -5, -11, -2, 9, 1, 1, 4, -4, -5, 2, 1, 3, -3, 3, -3, -2, 2, 5, -3, -5, 1, 8, 7, 0, 7, 13, 5, 7, -7, 8, -4, -2, 12, 4, -3, 2, 3, -6, 2, 0, 4, 10, 11, -2, -4, 1, 2, -12, -8, -5, 8, -3, 0, -1, 10, 10, 7, 8, 1, 11, 4, 6, 11]
7152A1j2OLmj3J8mqJ1poPj2J1oJ3j1Rj4LQmMj3J0MJ0qj0j1K3qj4NRmNQrkKLKr
7196dJ3Kj0Mj0KPpKkkplK2jj3Lj2LJ9j3KlNM%oPJoJLP%kj2KJ4j4NJPnqOKokOJ
7246CJrJ2%j3JJ3Jpj1J4Jj4oJ0Oj6RjJ1rmjMOPj1Rj4kK2j1OkokpONjKlOJpnPJ0
7294A1j6JJ3pJqJJ9j7K%PrmRJpj1K1j2lJ0%j0Qj2ONo%J8j1lKjJmLJ0pLmJ8j4l
7339AJOj6J0j0JJ6k1OJJ0rPKj2RKjjj0JJ1jNj0jkJ3jMnnMlj5kK1j5ROnJ1jj0j
7384@J4loJoJ0j5J5j2nNPmj5OjNLkPrQkKjnLLLj2lJ9rjjNrkQpPj6J0J4j1Jj2K7
7432A4qj4K1k1J3lJ1j3lPj2lJ5mJRmloJ0j3%J4l%j7K4%j9J0PpK%j%jnJ1Kk1QM
7475BJ3j2qJ4qj4J2RLk2LjNNrPkJ1j1LQj4mQKj3MJ0j0NjJ1pMj2QPrqK3j5lkPJ2
$$ y = [11, -1, 5, 8, 4, -9, 9, 5, -3, 8, 1, -5, 2, -10, 1, -5, 8, -3, 6, -8, -5, 3, -1, 3, -10, 0, 4, 14, 6, -4, -15, 8, 0, -14, -9, 0, -4, 1, 9, 0, -2, 0, 3, 5, -4, 9, 11, 1, 5, -5, -3, 4, -3, -1, -3, -5, -12, -15, 7, 6, -7, -4, -16, -13, 6, -7, -5, -8, -3, 1, 1, -5, 2, 3, -3, -2, 1, 8, 8, 6, -6, -4, 10, -4, 1, 2, 9, 4, -4, 2, 4, -2, -4, 2, 3, 4, -5, 7, 7, -6, -5, 8, 9, 2, -9, 5, 6, -8, -14, -4, 2, -14, -5, -6, 5, -4, -8, -9, -5, 1, 8, -3, 6, -8, -10, 12, 1, 7, 5, -1, -3, -10, -4, 1, 0, 2, -1, 5, 6, -1, -6, 1, 11, -5, -4, 9, 2, 3, -5, -4, 15, -2, 0, 0, 7, -2, -6, 3, 4, -3, -14, 7, -5, -8, 2, 2, -8, 0, -12, -6, -1, -7, -7, 11, 0, -3, -1, -2, -1, -5, -2, 8, 1, 4, 0, 18, 4, 1, 2, 8, -8, 2, -8, -7, 9, -12, -6, -5, 5, -4, 3, 5, -7, 2, 4, 3, 2, -8, -7, 4, 3, 8, -2, -3, -5, 8, 7, 11, 6, 1, 5, 2, -13, -15, 6, -9, 0, 6, 1, 12, 11, 1, 0, 14, 11, 5, 6, 0, 10, -5, 10, -2, -7, -2, 5, 1, -14, -8, -9, -4, -1, -3, 4, -5, 3, 1, 3, 2, -3, 0, 3, 6, -6, -9, 10, 1, 0, -1, 4, -5, -7, 1, -6, 1, -15, -5, 9, -2, -1, -13, 14, 6, -8, 13, -8, 5, 2, 13, 0, -3, 4, -8, -11, 4, 0, 1, 10, 6, 3, -3, 7, -6, -6, 8, 5, 5, -12, 12, 12, -7, 3, 10, 3, 5, 5, 4, 4, 3, -2, 9, 11, -10, -2, 2, 15, 3, -5, 9, 1, -13, -1, 8, 11, -11, -8, -9, -4, 1, -8, -1, -3, 8, -3, 0, 8, -6, -10, -2, 0, -13, -9, 1, -9, -4, -5, 6, -1, 3, -9, -1, 6, -3, -11, 12, -3, -6, -8, -1, 11]
7520A1j2nJ4omjRRk3jJ2qkkJ0noJ1nkMJMOokOMj5QJjj4QMklKKj2RmKRqmK0j4%
7569aOj1Qj1J4J0j8O%Lj1qMNkj8J0OokNPMj5MMj0KROrLjJ2j0JKNNj0PKj5QNlp
7616eJ4nKj%%o%kLLMqLkj7JJ3Rj5JPKopRPjj1J5pjj3J6JkOJqNjOqkJ4jj1rKJ0
7666ENj9OJ0j4jQJ0j1lnJQNJKj7QmJ4oj0MPj3kJ0pM%KLljPJMj2PQk3QJ0r%jJ1
7713Hj3%Jj1J0j6J0PQj8JJ2Lj4LQp%JJLj0K3j7JmKRJj2QNpj4OMJ1j7KJ8qJrMJ
7758eJ1lmLLL%lj4J0Mk5J6j3POj1JOKnJ2mJ2j7OJmlJ0MqnJ3rjJLjn%J5looJ1q
7805cmLJ4Mk2KMKMj5jJ4pj3LK0j0JJ0lqJloMNoOJ0ojjJ2j4JJ9j8kJ4rrPLqJ2l
7851CLKj0j1RJj0J0jLlJJ2rj1J3Rj6OMJnj2MJ5roLLRj0jJ5nj1OoJ3j4J5knoJ1
$$ y = [11, -1, -6, 8, 2, -2, -3, 6, 15, -8, -9, 3, -5, -7, -9, 1, -4, -10, 1, -4, -6, -2, -1, 3, 9, 3, 1, 7, 11, -4, 4, 5, 4, -10, -2, 2, 0, -3, -1, 1, -11, -2, -6, -4, 5, -3, -7, 13, -1, -1, 5, -6, 2, -9, 5, 15, -3, 3, 3, 6, -5, -13, -9, -4, -6, -24, -14, -8, -14, -16, -11, -4, 0, -15, -11, -7, -17, -15, -6, 0, -9, -6, -7, 5, -5, -4, -2, 3, 8, -2, 5, 7, -8, 0, 5, 2, -5, 9, 4, 6, 5, 5, 5, -1, -1, -3, 0, 3, 7, -1, 2, 0, -17, -16, -3, 6, -9, -8, -1, 1, -5, -12, -3, 4, 3, -8, 7, 0, -1, -14, 2, 3, 1, 7, 8, 0, 5, 4, 10, 2, 0, 14, 13, 2, -7, -5, 5, 10, -9, -3, 7, -7, -8, 0, 10, -1, -4, -9, -8, 0, 5, 6, 8, -9, -1, -5, 9, 3, -7, -3, 4, -9, -11, -1, -8, -4, -4, -2, 1, -2, -3, 4, 5, 9, -3, 4, 12, -11, -3, 7, -2, -2, -3, 8, -5, -5, -4, -15, -5, -21, -11, -4, 4, -14, -13, -1, 2, -12, -9, -1, -8, -8, -7, -6, -3, -13, 10, -7, -6, -10, -8, 1, 2, -10, -2, 3, -4, -18, -12, -8, 3, -14, -12, 6, -2, -1, -10, -6, -5, 6, 3, -1, 2, 5, 8, 8, 5, -9, 1, 5, -20, -4, -17, -10, -4, -15, -14, -8, -6, -11, 1, -3, 9, -8, -2, -1, -5, -8, 2, 6, -2, -7, 6, -3, -4, -3, 0, -1, -6, -6, 9, 6, 0, -6, 5, -3, -7, -4, 10, 14, -8, -6, -2, 0, 4, -11, -12, 2, -5, -18, -15, 5, -5, -4, 6, 3, -5, -4, -7, -13, -9, -4, -10, -4, 6, 0, -1, -2, 10, -4, -3, 16, -2, -4, 10, 1, -8, -1, 2, -6, 6, 3, 6, 8, -2, -13, -4, -3, -13, -3, -4, -1, -4, -3, 9, 0, -11, 2, 11, -5, 1, 5, 6, 1, -11, -7, 8, -1, -7, -4, -1, 8, -2, -3, 12, 7, -4, 2, -4, 9, -5, 10, 8, 3, -3, 8]
7895HqjNj7K3nj3PlnqJ3%kkN%Ok%Pj6LQklj0J2Pj3LqJ1nOmJQqnMJMnOjJJklnP
7947APj0JQj8J4rRnj0PLomKJ2okmQj3J9qKjmRj3Q%oJ1%pLOplMjkOj5OJ4%j3M%
7996cJORj1mNKj2KRpMmNrJJoJ5j4KLJ5k%omOlKJ2rMomQqPoKLokPj0PKmmQj2Jo
8049a3K0npmMQMj8MjLrMLpMPKLj1NOLmLKj1lJ4qjkK%LKqKjKRj2KMj3%JlJ3%mM
8101bqJ6j1NOj3jQ%opJ0nO%kj1J1j4J3NMj2LpJ3rJ2rpPJ1ljNj0KLrRKnmLj0J4
8147Bj7J2oRJjrLJ0j7J5oMNj2mMNNpjJ0j0NmmjKMJjkOoj7J3J0oOlJoJ1j0
$$ y = [8, 0, -1, 4, -13, 10, 5, -8, -1, -4, -9, -17, -4, -4, -6, -8, -3, -3, 3, 1, 1, 8, -8, -5, 3, 1, -2, -12, 0, 7, -6, -3, -11, 0, -5, 1, -3, -2, 6, -2, -7, -3, -2, 2, -3, 3, 2, 3, 4, 2, -1, -6, 1, 8, -2, -1, 7, -11, 3, -6, 3, -2, -12, -5, -2, -8, -12, -10, 2, -4, -6, -10, -2, -15, 4, -4, -2, -3, -7, 2, -11, -3, -3, -9, 2, 2, -5, -2, 4, -3, -6, -2, -3, -5, 1, -14, -8, 6, 6, -7, -3, -3, -2, 4, 13, 2, -2, 3, 5, -7, -5, 4, -3, 1, -3, 2, -7, -6, -5, -11, 4, -10, -8, -5, 10, 8, 8, 2, -2, 4, 1, 3, 15, 6, 10, 4, 0, 8, 0, 7, 1, 3, 6, 0, -2, 5, -5, 2, 4, 0, -4, 4, -8, -7, -13, 7, 2, -5, -9, -5, 3, 7, -11, -7, -8, -5, -14, -10, -7, -14, -10, -3, -1, 2, -9, -4, 2, 5, 1, 4, 6, -5, -8, 6, -2, -3, -5, -3, -3, 0, 2, -6, -4, -5, -3, 6, -6, -4, 0, -13, -13, -12, -15, -2, -2, -6, -2, -10, 6, -5, 0, 6, -7, -8, 0, 0, -6, -13, -3, -8, -2, -2, -4, -15, -4, -18, -5, 0, 4, -8, -5, -12, 1, -8, 4, -5, -12, -5, 6, 3, 2, 7, -3, -1, 2, -7, 2, 4, -1, -5, -2, -12, 2, -15, -3, -9, 0, 1, 0, -9, -6, 4, -13, 2, -4, 0, 5, -7, -11, -7, -2, 3, -4, -5, 5, -5, 0, -4, -8, -9, -7, -3, -2, -3, -5, 1, -5, -22, -9, 1, -5, 1, -2, -1, -7, 4, -6]
8191f
$$ Imaginary data points
##PAGE= N=2
##DATA TABLE= (X++(I..I)), XYDATA
0@%%%%%%%%%%%%%%%%%%Nj3J6j6J6j6J7k5L2l2M0m8M9n7O5p3Q8r7J06j22J38j54
40h1J70j87K09k32K56k82L10l44L81m20M63n10N63o20O85p57Q39r35J042j168
60f18J319j500J726k016K400k942L761n161Q186k5699K4670L5739o3805M284M9675
75C0019j4574l9426K3633J4351j8043j352J0014r191L754Q336r014l978J1652
88F181m162r820J711M427M643L756j0690L5J8135r538k4564K0797K1396l0296
102g989j1091L4464n095l1470J9246K1460k6607n305K5741j0868j8279K1973P506
115A3686k3593L830J7578j2777r914J4189M003p352K51j292l03N944o163o861
129h774J4417M302j8896J717J7503q458j0977J2375J983j1034N418L647r056P604
$$ y = [0, 0, 0, 0, 0, 0, 0, 0, 0, 0, 0, 0, 0, 0, 0, 0, 0, 0, 0, 5, -8, 8, -8, 8, -8, 9, -16, 16, -16, 24, -24, 25, -32, 33, -40, 48, -49, 57, -65, 73, -81, 89, -98, 111, -121, 135, -147, 163, -181, 200, -220, 243, -267, 296, -324, 361, -396, 443, -492, 550, -618, 701, -799, 927, -1089, 1311, -1631, 2130, -3031, 5155, -20544, 4126, 39865, -23940, -19656, 30019, 15445, -23981, -348, 14003, -4040, -5392, 4622, -4569, -815, 7521, -1493, -5471, 6181, 2019, -7801, -6090, -1663, 2980, 6736, -3954, -3919, 14216, 4678, -19886, 911, 22307, -7989, -19080, 15384, 10289, -21181, -1935, 19525, -7082, -12387, 13354, 2486, -15793, 6180, 13686, -9907, -6077, 11501, -1276, -11190, 2999, 7002, -350, -99, -1391, -1694, 4250, -1913, -8774, 5643, 9945, -8951, -7234, 10269, 1811, -9166, 3209, 5192, -5842, -424, 3223, -5833, 1771]
143A771R392j6085m616J8833m905j8128J2935J4172j5141p124J2117P7o838K708
157h32R65K25M165n748n613J1422L165j4223K272J2371r176q405J2438K638r720
172d056N082M596j0293P30R519o531m836J0747l30j0671M364O653o028q57M940
187C029l900j817M876l015k811P503J68q312K474N229m700r58M610k076r87K902
203B215m986k105R767o17j0936N765R653j0653o962J2460K998j0967O44P234k749
218G61l077K560M75P20R56m956j600O705Jo410L274N693m778m261L731K014j383
235D25m31r99P60K585l074l152O019K620p656q10P229k263n474N041L453n457
251a184j019L468k032j307L643q0k484J776M21k900Q58K103j689n40J540j134
$$ y = [1771, 11163, -4922, -9538, 9295, 4390, -13738, -803, 13369, -1772, -8896, 3221, 3298, -3540, -832, 133, 358, 4523, -1225, -6838, 4584, 7749, -6474, -4202, 8169, -1007, -9412, 3026, 5664, -4056, 1026, 5622, -4671, -3941, 5578, -953, -5789, 4958, 4628, -6043, -1679, 4974, -1054, -1911, 3029, -871, -2688, 2188, -827, -3638, 3865, 4033, -4279, -1805, 3424, -1276, -2234, 2376, 300, -687, 2215, -2771, -4876, 4891, 4274, -6662, -897, 8756, -1897, -8859, 3601, 6599, -4368, -3724, 3510, 761, -2316, 244, 719, 1439, 2395, -2561, -4161, 2544, 2545, -3865, -591, 5102, 324, -3937, -206, 1808, 425, -6, -1005, -245, 2340, -734, -3886, 2133, 4753, -2903, -3713, 3516, 1253, -4221, 820, 4273, -1184, -2203, 1265, -767, -2074, 1569, 1489, -995, 781, 1202, -1698, -840, 1263, -426, -966, 574, -560]
267e60n55K441J5j702J074R6k629j3J842q4L22J020j131l12J366j476j548K782
285I48P16l790J56L788q30k415K135J655k474j670R48Q37K12j90k24R85L63k008
303h58m47K422J71k182L10J458r29r15J048N64m02l34n85P2J135J6p79P92N23
322A080j771r31J387N90o44M22R11l19q69k18L52Q4p38m53Q77M51o29O84J510
341A776p38j634K42K14j182R7J593M47m62J96M2l99j78l61l80M59J52p01M70J488
361A141n7j035J52L19r18p51N70R93J60o27j23Q25r9j305K05J481n34j534P62
380c75J237r00o47J042L27q57k17L23J99K09k87n31N19K97j085j4J596Oj351L80
400a29Q58r87p45Q84M76m27qK40Q7R3m09l98N44Q7j003L45J394m22r03R43L19
$$ y = [-560, -1115, 1326, 1341, -361, 713, 809, -1820, -1833, 9, -75, 247, 1267, 136, -176, 1190, -286, -1834, 948, 1664, -2126, -1970, 1818, 988, -1427, 708, 2363, -111, -1781, -833, 4, 216, 26, -198, 787, 1150, -858, -1305, 1117, 1288, -894, -584, 874, -55, -970, 78, 642, 240, -94, -679, -607, 528, 544, -235, 557, 1080, -691, -1622, -235, 355, -289, 133, 1044, 725, -144, -362, -10, 74, -664, -1117, -240, 211, -418, 266, 1776, 1038, -596, -354, -140, -1322, -1225, 368, 815, 353, 549, 591, 192, 14, -347, -727, -268, -116, -817, -347, 1141, 1084, 49, 201, 520, -398, -1149, -579, 414, 574, -53, -176, 649, 550, -755, -550, 931, 397, -1137, -375, 862, -38, -685, 357, 684, -173, -390, -67, 132, 341, 54, -477, 42, 339, -746, -760, 836, 842, -509, -129, 729, -258, -1003, -119, 357, -70, -78, 162, 249, 342, -67, -465, 79, 166, -837, -492, 902, 480, -423, 520, 839]
421H39j562k37J164k17m87Q51M17n19l8j37m74L25Jq31O58J315r06p60J606J18
441A126k151N6J632p27j076J211R04o16l82MJ19K87q11q30J447R21j914k44K482
460A438l99k418J009J746j491r85J248J68n87K61l73k8J394n49j753J572J582
477A835k567j063K830j0k647J007K168j149r79R91r1o74O5m85J60J401m27j088
495g23J588O77k231j1J766j377j255J952K72j620J219J142j829j77J410j214p25
512a136J817k11j121J620P0k363J010J734k522p01L232m76k780J861J898k255
528c23p07J567n54n59R09o02J8J917j242k478K147J507l311k70L779m94k663J421
546F2J453j419m60K32m80R18J05k073J195K917k267k365L240P52l839P72L256
$$ y = [839, -723, -960, 204, -13, -500, 351, 768, 249, 211, 74, -400, -75, -74, -905, -247, 1068, 162, -598, 1008, 1126, -1025, -969, 663, -64, -1140, 71, 975, 359, -23, -19, 100, 387, -424, -1254, 193, 1114, -800, -1044, 1438, 1039, -1379, -370, 1376, -115, -1100, 148, 316, -271, -10, -383, -411, 983, 434, -1319, 253, 1835, -732, -1795, 1035, 1025, -1622, -615, 1553, 404, -575, 416, 325, -349, -284, -769, -609, 792, 365, -723, 865, 1542, -689, -700, 1066, -311, -1566, 386, 658, -962, 257, 1399, -430, -607, 803, -411, -1136, 681, 470, -651, 969, 1039, -1324, -314, 1420, -1102, -1803, 1429, 953, -1827, 34, 1932, -323, -1030, 537, -17, -576, 333, -269, -251, 1666, 424, -2054, 93, 1600, -1711, -1981, 1798, 1304, -1359, 62, 1515, 96, -364, -132, -612, 306, 411, -1662, -467, 2450, 183, -2182, 1058, 1810, -2029, -1257, 1999]
563A999j776j421K364n17j887J847K97k484J343J912k756o48L201o44k278J860
579D12R20k102M21J270j369J99J414j654q24K020n30j537J919N74k046R24J080
596A091k343N55K759k414j941L883K37m384J762L861l217k494L476M62k897J085
612e19J737j210R3N70j573N23J792j857j061K725j99k698J274J808j587k10J107
629G15j161k3J477j577o62L051p33l503K241K602l513q36L973r81l239K233J457
646A521k669N08K204j805q75K048p87j440J896L38j854Q92Q10j784O01J692j706
663d10n50K266j076k087K267J104k501M13J914j716p72J980o83j135J970k81k396
680a693J688J750k687l00L056j136k519J883J195j882L08J231j156p6R24j299
$$ y = [1999, 223, -1198, 1166, 649, -1238, 609, 906, -1578, -235, 1677, -1079, -1727, 1474, 830, -1448, 412, 1332, -770, -349, 921, -448, -249, 1165, -489, -1313, 707, 177, -1360, 559, 1133, -913, 11, 1091, -1252, -697, 2062, -352, -2293, 1590, 1827, -2557, -795, 3066, -151, -2645, 831, 1293, -1604, -519, 1218, 8, 101, 671, -902, -379, 1413, -444, -1505, 1220, 1021, -1677, -403, 1405, -182, -392, 715, -446, -469, 1008, -569, -1231, 1820, 1087, -2416, -175, 2427, -1086, -1922, 2051, 1070, -2169, 64, 1521, -1148, -640, 1564, -241, -1116, 932, 145, -1295, 601, 939, -915, -23, 787, -997, -396, 1296, -410, -960, 1306, 230, -1857, 410, 1514, -987, -574, 1340, -376, -1148, 832, 149, -986, 984, 703, -1693, -5, 1745, -942, -1242, 1814, 678, -1841, 42, 1237, -645, -337, 894, -262, -338, 586, -713]
696g13JK122j090j883K094Q16k586N97K367j561j339J743k86j446J406N17j616
713h57Q11J112j851r4K083q94j402J655J74j855R02J228j442M9J486j278j053
730a226J713J4j517J108Q82j568J6J265q12k98J285p53j134J375J86j613J026
747e1J490j578p19J650l60j308R91M73j130K78N00r29M58J174j051m98J521m63
765D48j596J223J167j481k25J343o84r94Q72J98p98L80J61p62M97P63o99J28J076
784A017p44q95R64K08j048M38P38r19l52P20l42l64P51j09o38O48K94q22N27R82
804A054r37o01J041k14j136O90Q70r62m14Q21j82o16M84L64k99M7O5j94K81J82
824C44l82J46L56n84l66O54P1n20L15L23n85j20M24j64n7M41k34m24M98J20o31
$$ y = [-713, -712, 1410, 320, -1563, 531, 1347, -1239, -642, 1725, 164, -1175, 568, 282, -1164, 242, 759, -857, -46, 1066, -785, -879, 1204, 310, -1092, 563, 737, -1118, -216, 1012, -430, -381, 1105, -173, -1226, 487, 501, -1016, 92, 974, -594, -578, 687, -125, -423, 862, 109, -1025, 350, 536, -1077, -51, 1439, -139, -858, 792, 432, -876, 115, 588, -542, -264, 236, -693, -235, 939, -112, -610, 911, 448, -1148, 75, 1242, -239, -464, 879, 195, -799, 73, 271, -527, -147, 14, -748, -251, 512, -187, -59, 1017, 273, -622, 342, 550, -498, -60, 678, -241, -593, 127, -215, -579, 172, 63, -575, 73, 367, -455, 72, 1054, 117, -484, 557, 343, -793, -103, 767, -195, -609, 212, 30, -586, -102, 262, -37, 10, 75, -119, 162, 344, -38, 108, 464, -120, -486, 168, 239, -281, 34, 357, -228, -348, 76, -88, -145, 296, 62, -362, 136, 256, -375]
845c75L60P11o68n86P47J84q01J65P64l65o37L13L79k32j40K56J35j85k88Q0L71
866A88ll02J71K67l97k53L79J47l24M0J72j93j0K15k1j3J61j95l25K53K18l24
888a49M0M51k08m86K85L31l25j36L92J9l88K0L23J2j94%J01r3k36L9K97N5k46
911i6KK19j11k26J96K58j73j75J11N6q2j4Q8M1o8k05l6K23L3j70R2K26j69k52
935b32K23K32j62j18J67K9k06m5J75P1j22j54P6Q2j38o0K55J04k25n0K06Oj47
958c3O7J39n0j64m3J00O6j25m0J68l0k76N6K79q0j81J89R9k13rJ81k2k8Jj21M6
984b4J02k12l4L53o2m39K01L80l90j88N11M1m84J27L32j91j46K22J4j26l0m6O1
1007b8J41j59q7K68m8l40K45K74l42n4L53k13k49L84jl79L39J79n79J20O05n14
$$ y = [-375, -15, 696, 28, -558, 189, 373, -428, -263, 501, 136, -501, -188, 191, -41, -181, 75, 210, 25, -263, -183, 188, 185, -117, 54, 321, -76, -329, 50, 197, -127, -87, 85, -108, -118, 97, 76, 63, 224, 29, -296, -43, 175, -149, -109, 342, 134, -352, -67, 264, -61, -197, 195, 214, -174, -154, 169, 181, -13, -13, 88, -5, -241, -202, 95, 150, -96, -94, 125, 14, -212, -16, 242, 69, -106, 5, 61, -21, -35, 53, 94, 26, -179, -215, 8, 41, -129, -37, 189, 20, -232, -9, 223, 61, -57, 110, 139, -67, -112, 63, 134, 12, -142, -66, 16, -122, -182, 73, 177, -48, -98, 108, 114, -33, 34, 173, 123, -41, -84, 16, 82, -43, -83, 85, 55, -221, -165, 114, 34, -147, 42, 141, -72, -81, 100, 78, 50, 51, -70, -24, 78, -134, -168, 185, 123, -316, -115, 265, -125, -313, 198, 239, -245, -118, 214, 23, -123, 99, 113, -13, -43, -89, -28, 113, -46, -133, 135, 87, -253, -8, 266, -76, -130, 223, 10, -239, 145, 144, -235, 104, 283, -296, -176, 429, -85]
1029h5l97Q60kr38M12P74p39m06Q91Jq13K52N25l31k03K13M6J1q8k46K95L57n76
1052a87j98P60j40p66M94N35p05q7O33l72l25O69j89o05P18K36j054L08J069q40
1072d6o91J184J25j213M09Q63p17l39P12j46m15L76j7k94M01m9n00M95K67q09
1092d04K31Q21p73m81J078j21j042O83O67r79r0Q85m62m29P18k13n52P82L1j041
1112f91O80Q63j255l63J492l12j303Q30P70r50j08O49l47o8M17o03n1J043n73
1131A20j072J193O94j559n2J529n69j052Q76L80p50K31K24n18M44L31r72J94J165
1150H37q48q50J322K01j376N13R56j020k23J071n53o72J021j6j033P08N99j045
1168d08J10R56p51m03J041l85r36J053L54j376L69J195r22o55J121M4q11M29K00
$$ y = [-85, -482, 378, 376, -562, -150, 624, -115, -521, 370, 371, -442, -190, 335, 4, -199, 14, 60, 71, -17, -263, 32, 389, -187, -385, 375, 235, -531, -37, 498, -207, -294, 339, -33, -358, 311, 122, -483, 235, 471, -583, -275, 794, -46, -737, 447, 572, -641, -232, 631, -86, -425, 287, 141, -274, 102, 85, -209, 192, 143, -357, 138, 405, -404, -173, 648, -125, -606, 472, 351, -691, -8, 659, -320, -410, 475, 13, -416, 302, 89, -463, 319, 350, -691, -11, 852, -403, -766, 726, 414, -889, -59, 711, -239, -347, 302, -45, -113, 304, -299, -350, 693, 120, -952, 241, 935, -624, -676, 853, 284, -768, 108, 488, -262, -31, 193, -325, 119, 450, -522, -328, 837, -11, -861, 461, 662, -714, -201, 755, -265, -488, 583, 30, -642, 379, 363, -670, 38, 637, -408, -298, 658, -93, -496, 545, 160, -776, 277, 631, -745, -376, 819, -103, -758, 363, 407, -404, 25, 225]
1187B25m52N06M2j007O42R89j405n98J821q5j785P67J377j070o27R75mm24L28
1206B15l40k12R31l49j239R86J008j510m50J664j61j273P01O52p31N9L55n92K74
1225a2N97j002k51J355m00j290J011Q32j288p1J201n13o69Q86k3q49N66L67q87
1244d40J27O95n35k43O36k64k75O92k79o61R20L11j306K47J283q47r88J108L44
1263E25j026K02N80m22J39L61p03J47J037p63j001J281O00j567j24J411l20j035
1281f78M55N53k11j62j86J38O77l46r52P35Q91j171n92J301Q6j154L33P08n08
1300h3j19M11l52K2O14n05n38R07J70j095K36R33o03n63P08R7n31K76K16l94J78
1321a5K93m18k1M53k64k67L76r7k92M25l4n76M72N10q11k20R86j37r37M44O70
$$ y = [225, -227, 279, 321, -686, -44, 945, -460, -1058, 763, 678, -1107, -340, 1037, -33, -660, 315, 311, -113, 215, -125, -337, 594, 245, -994, -8, 1000, -510, -960, 704, 543, -730, -29, 623, -108, -49, 306, -286, -12, 585, -417, -668, 687, 287, -1003, 8, 840, -448, -519, 682, 169, -500, 386, 363, -486, 80, 447, -440, -313, 382, -153, -396, 240, -24, -299, 393, 114, -547, 373, 684, -622, -375, 908, 61, -927, 181, 525, -501, -299, 281, -141, -2, 359, -344, -197, 840, 77, -924, 357, 957, -610, -734, 677, 357, -678, -223, 330, 119, -43, -229, -91, 586, 240, -712, 23, 914, -257, -849, 452, 538, -616, -283, 425, -83, -202, 209, -143, -121, 493, -12, -550, 357, 527, -568, -332, 601, -2, -565, 143, 240, -291, -15, 201, -193, -15, 278, -140, -161, 292, 28, -239, 137, 40, -252, 173, 139, -437, 35, 545, -266, -486, 500, 363, -574, -130, 540]
1342E40n70l20M35L5j09N1k47N3N44l39o28O58N34q66l07Q70M8o90P1M20k9j53
1364Aj73J3M56l8p12J94Q38m55p70O50N71p08l12O17R2l88j7J38Q8P5k43j65M35
1387A87P2n55P2N68k77m24L81K24l65J6K34j40m6J59j39o0K26r3k13K31O6k94
1409a70J34K27k67o4L40j30l11K87J86l23o3K72l0j73L6L3N2N5k15n0L83l4m69
1432b94J71M84k93m19L44K93l15k24K45J74j10k09ML12K7m33MN44j02n56K12N08
1454C67l00l94K95K71k31j97J16J84qk26o8L42P0m14kM79r7m54J87L43j95k63
1476a95J61J74j03j67K0J91L8k69nL61n7l80J74L71k80k63L29J39l38n8K46Pj92
1499i6k7J15R5j07j65J64K41k45k30L76J67m23p8M37j8l92N6K68n4k26j7J82J14
$$ y = [540, -30, -350, 85, 120, 11, 62, -185, -132, 412, 73, -555, 103, 637, -229, -536, 334, 382, -308, -237, 183, 154, 1, -172, -159, 297, 259, -453, -259, 579, 124, -646, 4, 575, -133, -445, 172, 264, -124, -141, -3, 85, 160, -83, -248, 187, 259, -296, -224, 344, 67, -357, 24, 248, -117, -101, 133, -7, -53, 106, -33, -93, 133, 40, -173, 58, 124, -170, -36, 191, -76, -140, 200, 70, -241, 46, 232, -91, -154, 118, 88, -85, -49, -16, 36, 91, -124, -174, 209, 175, -294, -123, 361, 68, -351, -7, 286, -29, -253, -8, 166, 56, -153, -149, 163, 190, -243, -239, 305, 203, -353, -141, 367, 67, -327, -32, 239, 8, -189, -73, 111, 103, -123, -191, 151, 221, -193, -195, 284, 187, -267, -80, 263, 68, -195, -34, 140, 37, -130, -110, 81, 119, -150, -155, 206, 149, -231, -57, 314, 34, -229, 100, 239, -99, -157, 89, 96, -96, -123, -8, 87, -20, -185, -21, 220, -25, -255, 121, 288, -135, -213, 224, 206, -186, -130, 138, 84, -142, -159, 23, 137]
1522A37k26j75L39K23m31j77N30R3n42J3M86p3m09P3L02l6k69p2K74J79l35k15
1544c11M62J76n44n0N84o4n33J59M15k01l00J65J83p0j87m7K31J12l24o7M31j0
1566B10n08J57M88k80l88L66K27l57j07K60N5j55q3L5K04k1l37J07M53k52m77
1587d03M02M11n21k68N44J43m95o4L55P9k21j50J66L17k19m56L55N14n08m57O27
1608A51K90o85j17O05j0m60M5K48K4r9j59R6L72j73m75L40M64m96l53N84J35o13
1630b86L0M67j51k69J47J08n5k0p5R1K11j89k36L76J36n14O8N48l12m77M32K51
1652B81n06n8M33m6k53O3Q9Q5N1k70j7M84j48o35L60O59n60n34O65K90o69j83
1674d19N39J04k93j69J51L73j12n27J95P18l71p56N65O11o82m00O55J71n70o3
$$ y = [137, -89, -264, 75, 298, -133, -310, 220, 313, -229, -216, 270, 197, -212, -139, 163, 127, -142, -214, 60, 239, -96, -311, 151, 327, -217, -267, 317, 253, -280, -121, 294, 93, -207, -42, 141, 71, -116, -163, 68, 180, -144, -211, 220, 210, -298, -141, 347, 67, -321, 45, 272, -85, -192, 68, 123, -32, -115, -80, 124, 103, -234, -127, 326, 74, -403, -1, 410, -111, -379, 165, 308, -187, -251, 104, 183, -38, -188, -22, 295, 76, -380, -25, 489, -19, -476, 151, 441, -244, -361, 244, 234, -226, -181, 67, 91, -8, -167, -71, 301, 128, -347, -7, 457, -39, -392, 192, 327, -286, -256, 211, 60, -209, -62, 46, -9, -29, -104, -13, 198, 9, -227, 149, 285, -229, -161, 387, 75, -402, 30, 281, -225, -283, 150, 104, -149, -86, 3, 88, 139, -131, -148, 336, 188, -447, -87, 572, 12, -522, 143, 433, -236, -419, 120, 224, -69, -238, -87, 286, 174, -353, -158, 560, 189, -567, -2, 609, -73, -473, 182, 353, -217, -280]
1694b80L09M1n5j36p2L22R4m83O7N90j99n28L67L24m63j03L63j18k22J68j9j42
1716a75J90M2j90J97P3l07J25L11l36j29N21j25o07L72M68n70k73N93O3n14M6
1737b25L77K2j30j70O1L50j33n53K93O35m93n94O19M12o46k03N38J05l21j06O3
1758i9K39J21m37j49O56Oq27J77Q62l64p02M71M52m78k35L63J04j07r9r6J65K21
1780B44l39j81M62M1n01J26M14k41j82K96n0k43J87N4k52J63K08k84n9K65j05
1801B3j18K11p4j85K62K9m12K12M43l97l50M90J59m86PL67m3j97l6J9J86N0l60
1824b00MN50j72o38L26N97m32m21M39K35l64j19J86J33K4k27j60L52J75n07o8
1845b87O00o6n95J83M67k44k60K27R2r6m8p3L1K53j23k93K61K31l68r9M04p0l17
$$ y = [-280, 29, 70, 15, -121, -193, 129, 223, -260, -193, 397, 198, -330, 37, 361, -102, -205, 158, 40, -182, -14, -33, -175, 15, 57, -133, 64, 137, -170, -45, 266, -70, -199, 322, 197, -410, -38, 430, -140, -413, 180, 243, -271, -225, 152, 174, 44, -126, -65, 285, 152, -401, -108, 527, 34, -560, 59, 471, -175, -378, 160, 265, -56, -162, -99, 140, 261, -176, -325, 331, 337, -490, -313, 549, 185, -517, -46, 406, -72, -307, 56, 160, 53, -46, -142, 23, 244, -95, -276, 186, 227, -274, -148, 266, 25, -157, 139, 89, -154, 33, 87, -165, -2, 206, -78, -137, 128, 23, -95, 116, 42, -143, 119, 148, -264, -52, 391, -6, -356, 134, 293, -193, -186, 181, 138, -59, -95, -76, 110, 160, -200, -196, 354, 182, -456, -130, 467, 35, -386, 53, 288, -76, -195, -9, 124, 148, -79, -239, 113, 288, -219, -287, 313, 247, -348, -165, 302, 58, -202, 25, 117, 21, -27, -100, -69, 184, 61, -232, 29, 260, -108, -207, 197, 127, -190]
1868a90J76J11k16Q3J97j80n9K24j13k10J92J02j88L8R2j21N3J12j69oK56j41
1890D3k75K41K01k79p3K73m7j71N2J6QJ14j42j69K62J26l87J3M79j12m13K16K76
1913B52k33j79J54O6q5m9o1J26J99j98j54K91P7l84%L29q4j85J45O8j06M8k2j16
1937a01J11N7k56L3L19p2k17K40J25k91n4J82q2r9J07j1o2J09lj08R6O1j59K0
1961e5J17q2m4J61l9j51J33K4j99O8J79j33r2J79j1j42J17N2j14N6N8j48J0J73
1985A17j35j35J87M2k12O3J90r1o2R8k3n1M0m3o4J35J0j78Q6J67j55j09J84K2
2009H3j61L9Q5l1OOo4O3O6j78k6K33p4k19J72J60k16n6K15n4j28R8L6r3N5Rj04
2036g8N7Q2j31j4J78n0j32J16O7j31kO8n8pO4m6QR9r6p1J54k2j80J06J55j88o1
$$ y = [-190, -14, 97, -119, -36, 161, -19, -78, 146, 33, -177, 15, 117, -71, -33, 59, -62, -9, 103, -66, -72, 184, 43, -232, 9, 210, -69, -142, 131, 84, -87, -35, -19, -11, 103, -39, -208, 54, 180, -207, -194, 285, 173, -240, -24, 252, 19, -160, -6, 60, -25, -74, -135, -9, 190, -8, -162, 129, 206, -178, -178, 151, 67, -118, 27, 95, -11, 37, 15, -101, 10, 67, -189, -156, 163, 91, -126, 114, 239, -52, -106, 76, -6, -105, 2, -9, -71, 38, 35, -73, 23, 84, -75, -55, 62, -20, -64, 97, 58, -93, 40, 64, -135, -67, 112, -21, -113, 66, 55, -87, 30, 82, -32, 24, 82, -66, -56, 117, -18, -153, 34, 76, -136, -73, 117, 26, -36, 62, 39, -12, 28, -15, -79, 56, 66, -112, -26, 141, -14, -123, 61, 83, -78, -39, 46, 15, 21, 27, -37, 26, 92, -86, -112, 121, 47, -172, 0, 160, -56, -112, 103, 49, -79, 19, 55, -38, 17, 26, -78, -21, 61, -70, -84, 94, 44, -88, 28, 95, -36, -38, 30, -28, -35, 29, -17, -9, 90, -6, -77, 77, 55, -125, -19, 136, -52, -113]
2063a13K26l5j86J25R2j40k6J02m9l4Q8n7jQ5o7q5J46K3j83N7J59j44r2J52J5
2088E8r7N3K6q3O6K4j44Q9J43j91q6K45j0k30J09J90j64j04J61rr2O5j9k9N9n9
2114b9n7J45O5k00M5J73j73j14K05J3j56Q7J07j39K7J21j26n2J30j15j26K19N8
2137A08j81J24J69k23j35K15n1j91J40R7j15L3Q9n0K3L5j76kJ51j38p8K62P3k53
2161g4N7J93k15r6K22l8j52J28J1j37J34J03k08M8J83k02j36K85Lk39J19J44k10
2184g7k4K10o6n9J27p4j56J39oj54J73J32k35LK37j44j47K32Mk89R3J81j75M1
2208c4K43j34j24J31q9j46K06M2k25J29J85k66l6L29j00k79J91O5k63Q2K32j38
2230Ak9J76j76j18K27j6k08J94J27l23QK76j17j32K26k4k27J11O3j38J19J33k28
$$ y = [-113, 113, 78, -108, 17, 109, -31, -57, 45, -4, -38, 50, -7, -8, 77, 10, -75, 71, 94, -89, -32, 127, -17, -109, 43, 58, -39, 14, 40, -43, 23, 47, -97, -8, 135, -56, -142, 103, 93, -137, -28, 162, -2, -106, 55, 46, -46, 19, 0, -29, 30, -29, -86, 59, 124, -76, -31, 142, -31, -145, 60, 73, -83, 4, 111, -28, -1, 120, -6, -58, 72, -43, -169, 50, 108, -73, 51, 220, -3, -138, 77, 26, -165, -25, 72, -43, -10, 79, 29, 52, 87, -89, -91, 60, -78, -156, 106, 179, -74, -17, 176, -39, -135, 87, 49, -103, 25, 36, -101, 33, 136, -72, -24, 159, -43, -179, 106, 109, -130, -11, 133, -77, -101, 109, 43, -16, 111, 37, -119, 20, 14, -140, 33, 165, -70, -67, 170, 26, -121, 111, 115, -174, -81, 100, -75, -34, 209, 75, -49, 82, -7, -153, 53, 95, -130, -1, 184, -82, -118, 211, 111, -168, 23, 88, -175, -93, 139, 1, -28, 148, -28, -146, 81, 65, -143, 51, 178, -145, -137, 139, 22, -110, 116, 92, -135, -24, 39, -99, 20, 153, -75]
2253g5j1K12j58j23L20j6l06J33J62k81J9L33j56j92K26j4k45J81J75k42K3J80
2275A45k14r9L08n2k28K12P4l36P9K95j69j04K32p4k29J41O8j19J20Q0k21L0J81
2298A20j89m0K78r2k77J87J04k31J11K66k19j16K18j36j96L08N5l25J35K35l13
2319a17o4M05p9l12K00P9k99O9K99j17j02J72r1j40J27J0j24J15j6k07J34J56
2341I8j61O0K64k28k17K65J4l01K35K52l66n4L20j69k17L15P6m09Q0K55k12m2
2363a42L51n8k46J42L9j93Q0J50j09m5O1j12J9J46j05k0J83j43k44K68J70l15
2385a23O0L26k67k74L49J07k89J41K20k81j21K25q3j25K30mk62J24J71j70PK11
2407A72j01j81Q6Lj8J47Jj02J15m9k70J05K45k46j41L05k7k77K39K73k47o6K08
$$ y = [-75, -86, 126, -32, -155, 165, 149, -157, -24, 138, -143, -124, 209, 53, -139, 87, 73, -172, 9, 184, -58, -35, 145, -69, -168, 140, 88, -140, 72, 146, -190, -111, 184, 15, -89, 143, 69, -160, -19, 49, -70, 50, 130, -91, -61, 120, -69, -109, 169, 77, -200, -13, 91, -140, -29, 237, 18, -98, 120, -16, -212, 96, 151, -174, -39, 196, -117, -181, 224, 145, -167, 33, 112, -187, -118, 181, 64, -38, 134, 43, -97, 30, 40, -84, 31, 15, -192, -58, 98, -63, -3, 261, 33, -184, 81, 95, -206, 29, 281, -85, -139, 181, 12, -205, 110, 186, -223, -143, 112, -100, -142, 209, 151, -95, 47, 86, -107, -27, 123, 14, -31, 30, -82, -63, 83, -22, -42, 141, -2, -246, 22, 192, -123, -63, 263, -4, -278, 71, 178, -111, 30, 250, -31, -152, 73, -10, -135, 95, 91, -171, -47, 124, -46, -39, 172, 71, -110, -24, -21, -39, 108, 109, 7, 122, 73, -197, -92, 153, -93, -234, 71, 44, -233, 6, 279, 32, -34, 174]
2430A74j75k05K36Q3j81R2J14k26m1J68l7o8J14n8j08J30L7p1J55P1k34k5J32
2453G7j42o8K34m2k08J35Q7k05J05K77k15j82K30k9k56J60K42j82j01J36l2r6
2475g5R9J2m6N1p2j04J38R9j09K7J24j74j25J59J4j04J73K1k24O5J81j72n3K47
2499A52n6k67R2J80j44RJ75r3j33N6j1m4J43L6j12J6M7j05kJ16n0m3O1p3o0J78
2525F8L4j53P1J08k21r0K49J6j57R5R2j79k3J53l2m0P4p5r8J07L3q1Q2Q5j36q4
2551a02J04m0j0J01l1q0Q0Pj09R6J38j42j04J17l3j22J32R5j06PM6r7j3J41l3
2576D2r8O5J5j23M1J28k7k1K4p3j7N6l6k2J28k5j68O0J46q6o3J55k8j64J8O5k7
2603c5L2O9p7PO1o9m5J49rj76L8Q5q8oJ54np5Mj7q0O9K5o4M9M3r4NJ38m5p9P9
$$ y = [174, -1, -206, 30, 113, -68, 24, 138, -88, -129, 39, 2, -66, 48, -10, -118, 12, 49, -22, 133, 204, -30, -55, 77, -65, -133, 101, 59, -149, -14, 73, -132, -27, 250, 35, -147, 83, 54, -202, -42, 200, 18, -83, 53, 21, -75, 24, 36, -10, 41, -31, -135, 3, 102, -7, 20, 144, -30, -155, 4, 18, -86, 87, 108, -116, -51, 130, -42, -95, 152, 96, -171, -79, 101, -43, -34, 141, 48, -85, -29, -40, -84, 59, 95, -17, -1, 46, -59, -61, 55, 5, -38, 23, -50, -110, 68, 102, -51, 20, 128, -93, -183, 66, 82, -75, 20, 112, -67, -90, 63, 31, -9, 65, -10, -108, -1, 32, -49, 33, 118, -18, -102, 2, -38, -48, 53, 22, -58, 22, 29, -80, 16, 154, 12, -92, 25, -8, -130, 2, 97, -9, -2, 44, -53, -66, 75, 42, -56, 9, 24, -99, -58, 70, 43, 22, 46, -27, -44, 12, -24, -46, 82, 57, -111, -51, 95, 9, -54, 101, 73, -91, -73, -8, -35, -3, 66, -11, -4, 57, -12, -57, 92, 83, -93, -55, 30, -58, -64, 90, 85, 10, 14, -3, -83, -14, 11, -53, -4, 39, -55, -50, 88, 43, -36, 43]
2634D3rj45L6J22l6k1Q8n1p2M5j1j3M6nr3N7P6r6OJ64o2j57O9R0j24lJ30k2q4
2663c2LJ5J5M7m3k9P0lj48N8J59p6j10R4M7j28J9P7Pj6k9m3L1N3p5j7J51k5j74
2692a02P4J34j07p7J43jj28QQ4j6OJ0l6J9no9L2J02q1q0J17L6j19L7J33p2j02
2719f0N1L2p8L1L6NK8j3p8N3Q0j20o3J48Qj58M8J76p3j02O6M1p8n6L5P7L8j07
2747c3k1J22J6j76L8J63q2j58J04J19j34k3J23ro7KqjM9m2m4J03M2j45J8J47q2
2774B1j14R5N0r3mR0Rl5k4kK4j1q1M4J13p5r5J42P3k03j7J97o1j86J10J34q4o2
2802d5Q4K4m2m6l7N7O0j03n5J74M7j71JJ66o5j60M7J13m3l5MP1M5p8j01J04J05
2829A21k14o8K48J0k07N2K11j05j45R0N5o8k7K8J5M4l2l1P1L2j17j4J14n4r4J00
$$ y = [43, 34, -111, -75, 47, 11, -10, 78, 27, -45, 0, -11, -24, 22, 17, -76, -19, 57, -39, -33, 131, 69, -88, -19, 71, -53, -56, 74, 52, -32, -29, -14, 1, 48, 5, -24, 46, 43, -105, -47, 112, 36, -74, 20, 67, -61, -42, 35, 42, 26, -3, -46, -15, 38, -37, -54, 97, 72, -102, -28, 106, -1, -78, 65, 64, -64, -56, 28, 12, 18, 28, -8, 11, 6, -63, -31, 71, -10, -90, 27, 63, -56, -19, 114, 42, -60, -9, 23, -55, -24, 12, 17, 45, 32, -46, 7, 87, -33, -96, 52, 60, -98, -50, 126, 53, -49, 17, 58, -20, -76, -41, 36, 74, -33, -54, 68, 84, -92, -54, 109, 27, -131, -27, 92, -42, -65, 58, 49, -18, -16, -24, -25, 24, -18, -62, 41, 83, -62, -44, 103, 21, -93, 2, 52, -41, -45, 45, 54, 19, -5, -7, 17, 6, -75, -31, 82, 7, -88, 54, 127, -76, -93, 104, 43, -143, -33, 101, 17, -45, 39, 63, 21, -25, -62, -5, 55, -48, -103, 71, 118, -53, -52, 114, 49, -111, -64, 49, 6, -29, -25, 46, 91, 13, -88, 16, 121, -93, -161, 87, 97, -110, -58, 153, 48, -97, -7, 48, -20, -47, -19, -4, 40, 8, -23, 48, 80, -37, -51, 63, 9, -85, 15]
2855A5O6j17QJ01n6n0O2Nn4J3kk9Q2J3j10O0J08j41j00J75N6k05PJ76l6j30N2
2882c1J08j8q8n7R2Q3j23j03K07Q3k44m7K38lk19N5J64n3j09N2M0K9l3r4L4J29
2908I2q3j40J58J25j68r9J61K5j42L5P8jl2l7mP4oj12M6J11j04o7J45M4j46L8
2934iR9j24n4J30Lj18P7N6p5k5N5pJMo1J3J05q0q0J52M6j76k7J62l8r7N2P4l9
2963A9l2l9K0J15k0j65P1J79j63j64K18J13k15o6J96Jj17kR9J7l6j05K4J26m0
2988C4j30Q6J54j68r2J54M0j08J5N9n7KK0m3L6Q1r7o0J17J0j35P0J12j13m4R9
3014D2j1n9N8L3q7KL7n7J9N2m1J6M3r1j2J28l8j34J09J07j53q1J98K0j44J7P6
3041D9m1m8J0J2Q4J0j47OJ68n9j66J22J47j53j07J47N4q0k1RK3Nq9k0J72L7k02
$$ y = [15, 81, -36, -28, 73, 17, -33, 29, 34, -20, -7, -9, -38, 44, 57, -53, 7, 115, -26, -126, 49, 105, -100, -93, 83, 47, -83, -31, 77, 59, -29, -86, 6, 89, -34, -137, 70, 153, -91, -138, 100, 97, -122, -67, 97, 44, -65, -13, 27, 56, 23, -71, -37, 92, 9, -131, 27, 152, -16, -115, 46, 71, -71, -36, 42, 41, 9, -28, -32, 42, 36, -76, -30, 81, -23, -90, 55, 99, -47, -9, 90, -34, -88, 42, 45, -73, 4, 60, -15, -40, 15, 8, 9, 13, -48, -35, 70, -10, -90, 62, 108, -68, -95, 67, 29, -68, -16, 58, 19, -13, -52, -32, 83, 63, -102, -31, 148, -15, -179, 39, 152, -63, -129, 67, 68, -49, -51, 48, 65, 29, -76, -52, 74, 34, -96, -10, 144, -24, -116, 38, 78, -30, -15, 44, -13, -11, 9, -34, 2, 83, -14, -74, 43, 53, -82, -12, 100, -13, -57, 42, 31, -28, 30, 63, -24, -22, 15, -42, -23, 29, -12, 4, 47, -44, -56, 72, 34, -100, 9, 116, -37, -118, 80, 100, -44, -27, 49, 8, -40, -30, -18, 66, 76, -71, -65, 103, 44, -122, 0, 147, -6, -113, 34, 88, 8, -13, -4, 19, 24, -65, -85, 87, 124, -78]
3068g8J6J84p3j68J27J24j21p7Q3Mk4Pj9J8N4j14l6J26M2j33N0J25j10p8R9L5
3094F3q6K3N4q2J9L8l4J4M3p0l8Q0k1q5J02Q2j42pJ25m6j01R4N8p9m1M4MK0k0
3123A1m3N4O4j53n0J93mj76N6J76j09j03J18O9p5l2j1J0L5n3n2J14O4j60l9J79
3149H3k0j55O4J30q0p3M9N9j4k3l8QL6q5n6J43O2j46KJ46o3j07R2N9r8j1O8k1
3177A1pL3k2pL2r4k5J11%q7Q0P7j25n7J24Pj04L8O1l4k0J2JM4oj04L0R9q9o5J51
3208F5O2j76k5J45m1j07O4O6k2o2kK9O3m6r4R5Q6j47m6J69K0j66L0J19o5p4O6
3235FL3j3k6l6KQ1m2p6J05P1j34m0J41kj35N1Q0o1n4O0J3j0rl1J8K2n5k5J29J4
3265G7j38M9J05j06o6J28J0j03J5O5m2mK6k7K3K0r0J1J29m0j09Q4Q9j46n5J30
$$ y = [-78, -62, 122, 49, -119, 8, 132, 11, -66, 17, 21, -3, 4, -15, 3, 57, -57, -93, 33, 75, -58, -8, 117, 7, -71, 28, 63, -23, 0, 54, -28, -9, 29, -5, 9, 52, -18, -56, 24, 3, -82, 20, 102, -40, -47, 78, 32, -69, 25, 83, 4, -37, 7, 11, 31, 11, -32, 22, 86, -67, -117, 76, 72, -104, -48, 128, 19, -84, 34, 103, 28, -4, -15, -5, 30, -23, -75, 39, 103, -57, -96, 83, 63, -92, -28, 102, 22, -51, -2, 57, 43, 20, -18, -10, 26, -59, -115, 28, 90, -56, -54, 92, 29, -78, 14, 73, -25, -36, 32, 11, 4, 37, 15, 8, 40, -54, -79, 32, 32, -55, 25, 102, -23, -80, 44, 51, -53, -15, 46, 12, -8, 4, 5, 49, 43, -61, -31, 68, -21, -86, 65, 127, -49, -74, 71, 30, -77, -13, 53, 31, -31, -33, -4, 59, 13, -81, 14, 100, -47, -93, 76, 96, -70, -40, 79, 14, -60, 6, 39, 26, 0, -36, -34, 47, 5, -71, 34, 105, -29, -69, 72, 70, -65, -14, 66, 5, -49, 11, 24, 14, 5, -26, -8, 14, -41, -66, 63, 77, -61, -12, 93, -13, -79, 49, 59, -44, -29, 36, -6, -10, 16, -11, 12, 32, -58, -47, 82, 42, -67, 17, 106, -40, -95, 35]
3291C5L8j13PP3qn4j5L4M7l1r7O7J15j15p4J57K3j56L1R5l9n5P3pk8J2l1l6Q4
3320C2K3j08M6J01j02o8J19K6j17J3R8m0n4M6L1l3j6k7L0J9m4j2J08j6j36N7J12
3347H8j05o9J24L3j16RR3m1m8M0k7%M4m3l2J00J7j34L2J19p5r0R5O1p1l5M0J1
3375B0j3l7j3Q7J1j18K7J42o8j33J10P8j37l1J27j8n5K3L3n3J3J8m9L1L5n4LP0
3403D9l7n9O8Qp0L4L2m4J8L5k8k1M3l3k6O5pq0P2N6j09k1J37m5j32Q2J07j07n9
3432g2J00K6p5NK1K5j6m7J1P4k5q2M8P7q2n0R2Ko2OM4l6L5%n5L2P8q9o5J28K0
3463F8j36K8J27o4p4N9L2n9LK0j0K4jl1K3K0m8j0N4l1l4O9Lo4L2M4o2j8P4l3n0
3494d5O3K1o2K5M0o1oN5l8k6P1Lq5L7M7o2lM3j0j6K5j4j9N7k7n4O2M0q4j9R9k3
$$ y = [35, 73, -40, -33, 40, 32, -22, -37, -3, 44, 13, -84, -17, 98, -17, -91, 66, 89, -67, -36, 59, 20, -35, 38, 31, 3, 15, -16, -52, 32, 55, -53, -7, 94, -8, -76, 43, 69, -48, -35, 63, 23, -31, 15, 46, 13, -3, -30, 0, 19, -25, -37, 71, 55, -81, -24, 88, -17, -86, 38, 71, -45, -36, 57, 16, -32, 8, -19, -19, 25, -18, -50, 50, 67, -67, -35, 84, 9, -81, 14, 75, 4, -31, 9, 20, 7, -30, -43, 44, 55, -63, -36, 106, 38, -95, 15, 93, -44, -75, 52, 34, -21, 2, 35, -18, -5, 13, -36, -5, 30, -24, -21, 49, 12, -47, 21, 29, -41, -7, 25, -19, -1, 34, 6, -15, 28, -5, -31, 34, 27, -53, 19, 75, -34, -55, 82, 37, -95, -13, 94, -13, -72, 28, 54, -21, -16, 5, 30, 14, -33, -22, 52, 27, -55, -7, 70, -12, -62, 30, 32, -30, -24, 20, -16, 19, 19, -36, -4, 74, -15, -80, 48, 68, -68, -40, 87, 23, -51, 8, 40, -19, -16, 4, -6, 18, 17, -14, 9, 29, -19, -29, 25, -6, -40, 29, 32, -32, 0, 44, -18, -36, 38, 5, -45, 18, 39, -23, 2, 42, -19, -25, 30, -8, -34, 37, 40, -45, -8, 39, -23, -26, 17, 7, -9, 16, 2, -17, 40, 13, -41, 21, 61, -23, -42, 57, 34]
3526C4r1M7N5n0l1N5j6pJ9k8%L8l1k2M5J2n6J3N2m4pK1j3k3O8k5n1M8N5q7j5Q5
3558E0l1o9O4M8q2kM9k3m0M3Jk1L5J1m2K2K1l2j0J2j7J8J4k5j2N7l7m6N3L5q4
3589d0K8P0m2n4N8%p1M1M0n6jO9l0m6M5K6o1J3N0k8j4K4rj3Kk0lL6mm6N5J8l9
3622boM4l1l8M6nj5K3J2n8K4L7n4j5O7mm9L0N1n1l0M9k1l0K7QoK2ml3J7J9l3p
3656a6L5rk3M1nl4RJ6m0K1L5l2j0M3j8m3L8J5n7QN0k6k3M9Mn3K5J7l8J4L4k1K
3689HJ9l0j3L1k1j7L9Qm9J4O2m3k8M1nm2L1K6l8QM5o0nL8j3k6L3K2m5LM3l7k0
3722b1K8qj1J9mpJ9jl7K7K9o0LO4j8m2K4K3n6LM5k2k0L3jj9K6Pm2K4K0l8LL5k4
3757Ak0L9nk5K2Jk9J1L0k4k1M3j6l1M3%m3K5L5l8l3N9j4l4J9L4l7lK6j9OJ5j8
$$ y = [34, -57, -10, 45, -5, -36, 19, 3, -4, 15, -13, -13, 25, -6, -28, 17, 29, -27, -14, 38, -6, -13, 8, -5, -28, 40, 15, -36, 12, 67, -20, -35, 50, 19, -50, 14, 62, -20, -22, 27, 4, -36, 7, 8, -13, 22, 33, -9, 13, 34, 2, -8, 4, -13, 5, 19, -6, -18, 39, 2, -44, 9, 44, -40, -12, 58, 16, -38, 20, 20, -51, -10, 30, -26, -27, 42, 12, -34, 11, 37, -24, -11, 39, 11, -3, 21, 12, -1, 1, -19, -22, 14, 10, -36, 19, 37, -2, -8, 36, 5, -33, 13, 8, -7, 16, 28, -30, -6, 31, -23, -38, 29, 25, -24, 6, 57, 6, -24, 25, 4, -26, 1, 9, 3, 25, 21, -12, 5, 24, -9, -16, 19, 10, -13, 28, 23, -11, -2, 14, -26, -5, 30, -2, -12, 31, 13, -30, 8, 23, -34, -26, 24, -2, -25, 24, 28, -25, 0, 17, -21, -7, 27, 6, 8, 27, -3, -16, 15, -6, -23, 16, 24, -25, -11, 51, 8, -20, 21, 16, -26, 5, 31, -7, 1, 46, -14, -19, 19, 6, -20, 13, 35, -10, -7, 36, -1, -21, 7, -1, -12, 7, 3, -4, 15, 14, -23, 4, 33, -27, -24, 40, 22, -20, 4, 27, -29, -26, 19, -3, -23, 10, 9, -10, 16, 23, -19, 5, 25, -13, -10, 25, 1, -19, 20, 15, -10, 12, 13, -16, -5, 25, 1, -20, 23, 7, -24, 19, 19, -24, 1, 36, -2, -35, 24, 10, -24, -5, 29, -8, -11, 15, -4, 2, 17, -1]
3790ak0L5j4k3M0Qn4K3M5n0j5M2Km5L5Pk2oM1l6j1M0k2j8K9K4m0%L3k5j0K5oj1
3824@OKk4K3Nk6K0J6k7j9N0k3l3M7J6n0K4L5m0rL7j8l3K8J8l9K1Ok5j1L9j3j7
3857a4L6Kk6JL3l5%K7k7j0K5pj9J9Pl0OM1m8J2L7j8k6K8Pm0MM7k0j7K7pl3L2M
3892A8k0K0Ok8pM5l4oL4k6j8J2K5k7JL8l6lK3k0j5M1oj9J5J0l6mM6k0k9M5ml9
3926a8L4J1k8kK4j9j7M0j1k2L4Jm0J8J2j9qK8j2j9L4%k2%K4k0nK3j0j8L9k7l0
3959b5K3J4k9KM2k3j9K7Jj1J2J8k4J6J1l7KL2k2l0L2Jl4J6L4l2oK7k0j1J8Pk6
3992a4K4J6k3QJ0j1k1L1j2l3K6J4k7PL3j6k5K8k2mK8Jk9L5rl0mM1k5k3M6Nm5J0
4026a0L1j7j9J9jmJ8j3oK6kl3J0K9m2kM1j9j7J6lk4L2Mk6J6K1j8j7M3pl5QJ9l3
$$ y = [-1, -21, 14, 0, -23, 17, 25, -29, -6, 39, -11, -26, 16, 18, -27, 8, 15, -7, -13, 28, -8, -19, 21, -1, -19, 10, 34, -6, -6, 27, 2, -8, 17, 11, 0, 6, 8, -16, 7, 12, -14, 6, 22, -5, -24, 26, 3, -30, 17, 33, -17, 7, 42, 2, -7, 30, 12, -21, 7, 25, -14, 7, 13, -12, -23, 16, 3, -14, 22, 24, -2, -1, 32, -3, -3, 24, -3, -13, 12, 5, -14, 5, 12, -18, -12, 29, -19, -7, 30, 12, -14, 14, 21, -19, -15, 32, 12, -5, 22, 15, -18, 14, 18, -2, 18, 24, -4, -11, 34, 0, -6, 28, 2, -16, -4, 21, -6, -5, 33, -3, -6, 17, -3, -18, 23, 17, -2, 13, 23, -13, -17, 29, 9, -20, 25, 21, -18, 16, 27, -1, -3, 21, 2, -15, 25, 14, -8, 26, 27, -13, 5, 17, -2, -10, 18, 6, -13, 21, 21, -1, -1, 23, 3, -2, 21, 11, -7, 32, 5, -25, -2, 12, -17, -15, 27, 4, -15, 12, 13, 2, 14, 32, 8, 24, 35, -2, 0, 32, 10, -20, 12, 13, -21, -5, 29, -3, -9, 18, -2, -13, 5, 12, -14, 10, 26, 3, 11, 21, 10, -11, 20, 8, -25, 1, 15, -12, -5, 28, 12, -13, 15, -7, -11, 17, 18, -11, 24, 15, -15, -19, 22, -3, -26, 20, 25, -20, -10, 21, 4, -15, 4, 3, -1, 17, 4, -2, 24, 22, -11, -1, 28, -14, -16, 25, 6, -11, 5, 2, -22, 10, 14, -12, 4, 25, 7, -10, 33, 26, -9, -1, 18, -15]
4061a5OK2j8%J7j2j2J2Lj2J0J8k7J1J0k0QK8j1l4L9Pn4J2L8l0k2L6J5l5OK5l5
4094a4QK2l5nL6Rl5J6J6k0lJ9koJj5K0J9l0k8M2Mm4K2K6j8k0K1J2k5J3lj9NK8
4129A7k6%L8j2n5L1K8l7kK5Pk8J6j0oJ7j1lJ9Jk2OK7k5j2K3Jk9L4Ql4J1L3l1j3
4164a4M0j2k3LK3k5J6Kj5J3J1j4j8L0%k6J2J0j8mRqJ9Kk7JM2l0m1L9M0n0l3N9
4198A3Pl6J3J4J2k4pOKJ2k0JM1k4l8L2K4l5qL5j5j1PnLJ2jl2L3ml6LN3k0l7M5
4234A5Kk6%K9k3oK6ml0J8Oj1KJ4k1J7Jk6J0L0k8k7K7K0k9kL7jk1lJ0qJ1j8rN1
4270C3rn0J8N3m1m0L9L1m9pL4oqj0J4J5ol7J0M8j1o6M4M7l3l6M7Pm1PJ2j2JJq
4305iMK0l1J3L0k4k7K6K5m2kM7j2l4K6J3j9lnqJ7lj5J8J6l0j0M3rn6L3M3m9k1
$$ y = [-15, -9, 13, -5, -5, 12, 0, -12, 0, 3, -9, 1, 19, -8, 3, 13, -7, 1, 29, 18, -16, 23, 30, -24, -12, 26, -4, -26, 10, 25, -10, -4, 21, -14, -6, 16, -19, -24, 12, 21, -14, 2, 18, -2, -5, 14, 12, 6, 7, -8, 12, 31, 1, -27, 15, 19, -25, -3, 23, 5, -15, 6, 18, -7, 6, 3, -16, -11, 17, -9, -9, 29, 17, -38, -7, 21, -16, -18, 7, 14, -14, 2, -8, -14, 3, -8, -11, 8, 9, -13, -7, 20, -5, -17, 6, 7, -22, 12, 20, -14, -3, 30, -1, -14, 26, 14, -9, -6, 17, -8, 8, 10, -5, 8, 19, 5, -13, 17, 17, -9, 3, 13, -5, -9, 0, -8, 11, 13, -14, -13, 29, -1, -42, -3, 37, -13, -46, 13, 20, -16, -3, 11, 23, -1, -8, -2, 0, 12, -8, -7, 34, 10, -28, 4, 28, -7, -15, 20, 5, -6, 1, -4, -1, 11, 10, -22, 11, 7, -29, -26, 27, 7, -30, 15, 17, -9, -9, 20, -3, -9, 17, 13, -17, 1, 7, -4, -2, 12, -9, 8, 9, -17, -7, 23, -5, -32, -5, 15, -14, -16, 21, 20, -1, -4, 6, -2, 9, -9, -18, 33, 24, -26, -8, 45, 4, -36, 3, 34, -15, -22, 12, 6, -2, -12, 2, 17, 11, -26, -16, 32, 21, -45, -1, 46, 13, -23, 24, 31, -10, -3, 9, -3, -2, -1, -9, -5, 15, -16, -3, 27, 3, -24, 2, 27, -15, -17, 30, 18, -16, 10, 23, 4, 1, -4, -12, 5, 2, -13, 5, 21, -9, -19, 24, 15, -41, -8, 35, -14, -35]
4339c5M6kn%J0j2J7j9rK6Om0JN3j9n7L8L8l4l0J2K6lj7kK4K4m5j9N6Mo7K3O8l6
4374B1m6L9J8l3pK4mj1noJ0J5l1j5M8pm0L7J3l0jK1Ql1KK8rnJj5J1J5m3L6L5m3
4410@l3N6Kn2PN9k3l6K2K3k0j9J6mJ6j2k8M4K4n5j2N8no9L4L5k1k6J9K2j8j2m
4443a2K6K5m1k7L8K9o1JO4k2m6L9J8l1kkQj1Kk3K7L3l2j8M2ln7K8L8l9j6M6Ml8
4477a3J5K3j5Pj8j1J7lk1K1M2m7k3M4J5m7lN2rm4KL1LKl2J9J8j1m7L3M4n3l6O2
4511A7K0o3J8N0k7m1J5J0oOj7RL6k2l6K8M1n0j4M2jl7K0J6nNj0lQkk1QL7l8k9
4546c6N3Qm7QM0k0l6L0J7l6J1L5j1k3PJ5q%k0nL7k7k2M1L1n1mK8lk9PJ6Jkl2R
4582a8M8om7K2N7n6n3N0M2m9nL1J0l8j1L2Rom3K1K8jm3K0L9l5k4L9Jk4J5J6k4
$$ y = [-35, 11, 9, 4, 4, 14, 2, 19, 0, -9, 17, 23, -17, -16, 37, 18, -39, -1, 37, 3, -27, -15, 11, 8, -9, -11, 13, 37, -8, -27, 29, 33, -34, -11, 57, 21, -25, 14, 32, -1, -8, 16, 12, 1, -4, -10, 0, 15, -16, -31, 17, 10, -30, 7, 20, -10, -11, 10, 18, -13, -11, 17, 8, 3, 4, -11, 0, 15, -28, 8, 43, 0, -33, 23, 25, -27, -20, 39, 16, -20, 2, 25, 5, -14, 2, -2, 14, 2, -26, 18, 42, -13, -25, 33, 28, -41, -7, 28, 7, -19, 0, 22, 4, -8, -12, 14, 39, -2, -29, 9, 38, -23, -22, 42, 20, -26, 13, 31, 0, -2, -4, 4, -7, -5, -28, -1, 32, 0, -18, 24, 21, -36, -8, 30, -9, -25, 21, 25, -13, 2, 25, 10, 17, -1, -12, 5, 2, -19, 2, 44, -3, -26, 18, 33, -14, -17, 35, 26, -18, -16, 15, 18, 20, -12, 7, 25, 14, -33, 0, 44, -9, -45, 17, 37, -26, -8, 42, 15, -26, -11, -1, -7, -1, -18, -9, 27, 5, -31, -3, 38, -12, -26, 16, 15, -22, -2, 14, 9, 14, 4, 1, 9, 7, -14, -6, 31, -7, -36, 17, 25, -22, -14, 26, 6, -30, 0, 17, -19, -8, 27, 16, -7, 0, 15, 7, 7, -13, -18, 19, -8, -30, 11, 42, -9, -13, 15, 12, -17, -10, 6, 7, 5, -27, -18, 30, 24, -23, -1, 56, 0, -53, -3, 39, -10, -15, 16, 26, -12, -23, 9, 18, 12, -31, -10, 18, 17, -26, -6, 33, -2, -26, 13, 14, -10, 5, 21, -3]
4615cJ1onJ4J1k0mL0j4l5L7J1l4lK8j8k0J9J5rj3K1rMj0nK6Ol0MK4qm0L8K9n1
4651il0M2J6l0JJ5MJj4rK8K2o1JM6k2l9L8L6k4k1PL2k2j4MK4jk9mM1jm2J2L0l0
4687bl4K9K0opNLlRqQJ0j3k5K2KqnL1k5k0J3MopK5lj5NJ6PolORk6j6K8J3k5MJ7
4729B3ok6K1J3j8k2%K7pj1QJ2K5m5pL1Qk6k7M9j0l2kL9%j8jjJ8k6j6M5J4l0k2
4764b0M0j3k4J7K1j3k0lJ7lLlPJ0j2j1PK0j9lNqj2QJ2%jPj1KJj0J0Rj3j5M0kk6
4803fJ3K3l9k6M5Nk4KL4ql3OL1nrj1PQj8j5L4Qk0j0L1rj9%J3Mj3j0MJ6Lk5OL0
4841B3k1l3L6J9k6j5L7jk8NJ3KnlJj1J2%J6Ml1LK3j4k2K4J2j6j3J2jj0OJ1j0L
4877BmrJ9knj0K1j2k4K1L5j9k5NJ9j9j2K6Jj3j4J4J4rj5L0J0l8j1K5J5rrK0j0
$$ y = [-3, 8, 2, -3, 11, 22, 2, -2, 28, 14, -21, 16, 27, -7, -10, 18, 0, -20, -1, 14, 5, -8, 13, 4, 8, -2, -7, 19, 25, -5, -1, 23, 15, -25, 13, 42, -9, -39, 3, 19, -11, -10, 5, 9, 10, -4, -13, 15, 37, -24, -23, 23, 1, -38, 0, 36, 12, -9, -2, 30, 8, -6, -2, 22, 21, -8, -12, 29, 28, -14, -2, 28, -2, -36, -7, 13, 7, 0, 5, 8, 5, 14, 6, 14, 24, 11, -14, 8, 10, 2, -3, 28, 3, -17, -4, 0, -6, -13, 12, 9, -6, -1, 15, 22, 16, 13, 19, 28, 2, -14, 14, 27, 2, 6, 23, 17, -9, 12, 25, 7, -15, -15, 12, 5, -6, 2, 14, 39, -6, -13, 18, 26, 0, -27, 22, 12, -20, -22, 17, 17, -1, -2, -3, 15, -11, -27, 18, 32, 2, -20, 20, 7, -17, 0, 21, 8, -12, -15, 2, -1, 2, -1, 6, 16, 4, -7, 0, 20, 1, -2, 3, -5, -17, -9, 3, 3, 2, 9, -2, 0, 1, -9, 1, 10, -3, -18, 22, 20, -6, 7, 30, -9, -35, 10, 15, -9, -7, 27, 19, -14, -8, 23, 18, 9, -2, 5, 13, -5, -20, 14, 22, 2, -8, 23, 14, -5, -5, 8, 12, -1, -11, -7, 9, 12, -13, -7, 23, 2, -31, 5, 24, -2, -17, 20, 19, -9, -4, 9, 11, 6, 3, 4, -7, 5, 5, 21, 25, -6, -3, 20, 6, -16, 8, 20, 4, -9, 3, 2, -8, -2, 9, -1, 2, -2, -11, 8, 6, 1, -9, 12, 0, -24, -3, 32, 13, -12, -7, 12, -7, -19, 7, 8, -5, -19, -5, 9, 0, -15, 15, 25, -13, -24, 1, 16, 7, -2, 18, 8]
4912Hpj1J1KLnj7RQk0J6K5j9k7K9Qk5JK0jpooK4lj6QPk9j6L2J4j7JK4j5j8J5N
4951Ej4J1Kj0%rJ7KJRj7J0lj5J6J7j9j4PK1j4j5QQpj2mL2Lk5J5J1rk2J5K2k3j4
4989a4QJ0j2OJ8qJ1j2k2J1Oj3J4LllRQj1nQ%j4m%J6Qj8LJ2j4j7J0J4qkK3j2k5
5028a9K1J0k1lKNOQ%mJ0j1nPJ6k1JQjj2OK3j6j0pJOJkK1%j6j2J2Qj7OJ2j0lRj1
5070bNPj7QQooKJ3Lk2MQj1jJ5j8J6j3J3lJ0j0mJ0kj5PRj4J0mkpJ5Jj8J1Nj0MO
5112ENqPnJKnj1RJ2oNJj5jOJ0rj1J3j0J2JpkLpqK5KrPLk0lK9k1LQLj5J2lj3KJ2
5158IMl1L2mj2KNrJ2j2mJ0Opj3J5KmMlmJ2qrJ2Jmj8J1RojNPj9J8j7LJJmJ1J4m
5202A3qOmj8J0OoJ1jj0%J4k1mOOpOJ4Oj7J0j1lNjqJ2NmJ2lqonJ3rnOj5J2NpOk
$$ y = [8, 1, -10, 1, 3, 6, 1, -16, -7, 1, -19, -3, 22, 3, -24, 5, 13, -12, -11, 9, 8, 1, -5, -11, 13, 10, -6, 2, 9, -20, -36, -4, 10, -7, -6, 18, 3, -15, 0, 5, -9, 2, 4, -6, -6, -15, 2, 4, 5, 14, -3, 7, 4, -11, 5, 22, 3, -11, -4, 17, 3, -12, -4, 4, -3, -15, -19, 13, 16, -9, 6, 17, 8, -14, 1, 23, 0, -14, -6, 4, -8, -2, 16, 8, 19, 7, -15, -4, 2, -11, 3, 6, 3, 0, 9, 17, 6, 1, 9, 9, -5, -9, -9, 7, 15, -3, 0, 12, -2, -19, -9, 5, -3, -5, 18, 6, -19, 2, 12, -9, -12, -10, -5, 1, 9, 9, 5, 15, 4, -1, 6, 22, 1, 2, 10, 9, -3, 3, 26, 10, 0, -7, -6, 0, 1, -1, 20, 20, 4, -8, 4, 12, -5, 1, 13, 3, 0, 9, -2, 3, 10, -7, 1, 9, 3, -3, -1, 12, 15, -7, -3, 5, -6, -7, 8, -10, 6, -7, 6, 3, 13, 3, -1, 9, 7, -8, -1, 8, -6, 4, 0, -2, -9, 6, 7, -11, 0, 5, -5, -1, 5, 10, 2, 9, 4, 5, 7, 2, -9, 0, 12, 6, 11, 12, -3, -4, 2, 12, 3, -8, 5, -5, 7, 8, 1, -1, 2, -5, -13, 12, 14, 5, 12, 15, -5, -8, 21, 0, 3, 11, 14, -1, 11, 8, -5, -3, 9, 13, -18, 14, 10, -2, 0, 5, -4, 8, -4, -8, 2, 8, 1, -12, 3, 5, 1, 5, 2, -2, 10, 2, -7, 5, 6, 2, -16, -5, 4, -2, -3, 2, 9, -10, 8, -9, -6, -5, -4, -8, 3, 17, 13, 5, 11, 7, -11, -1, 5, -1, 10, 9, -1, -1, 13, -8, -12, -6, 0, -7, -1, 13, 19, 2, 12, 1, -2, 3, 2, -6, 6, 11, 7, 19, 16, 8, 2, -3, 10, 1, -4, 2, -13, -1, 4, -3, 3, 1]
5247AoJ0kLqK6j7rpJ0J2j7J7rjQJk0J9mqMMQj5J7rKj7J2JnNMoOJmJ1j1j2LJ5j2
5291ArK2kpkNmqPK%jKomMlPMKj1J4j9%J5Kj4LQ%j4J7%j1J3j0j0MJ8j0lJ3j2pJ8
5336A4k%j2J9k6lJ8%%nrLQQk0lJ4pqJ9lrK0qj1oJ3Lj4J6nmQJ1k1J0Nk1LRNj4J7
5379A2j1lJ4kqM%OrJ7rj3J2Rj6MKj0j0J6Ok6K5j1j%LjPk%jj5J0pJ1Omj0J5kj9
5421a1K3o%JRopRj1j5K0pqNKkkLNLKkJLo%Pok3J2J2j0j1L0oj0KKmMKnNK0jj5R
5468A7nqJqNkJKPLJpqLj3J6JOj0J2j5%OLj2J3mj6LJ6Nj8J5polJ4pPRk6LRkk2K7
5514FMj8NJ1j5NJ8jk1J8rj0J2OpLkrLQkj9K5oj0JK0kj1J9k3JJ2Nj2O%oNMpLPK
5558A9rNMk2QOmkLj6QJ2qj0J0Pj5jK4k0MNRj7oRRrOj5OJ4j9Q%J3k1J1J5j7lML
$$ y = [1, -5, 5, 3, 6, -2, 24, 7, -2, -9, 1, 13, -4, 13, 4, 3, 11, 12, -8, 11, 7, -1, 3, 7, 15, 0, 17, 8, 10, -7, 5, 6, 1, 6, 10, 4, 10, 11, 7, 18, 7, -5, -2, 13, 1, -8, 14, 12, 5, 3, 8, 4, -4, 3, 5, 5, 4, 6, 0, -4, 0, -3, 4, 8, 10, -1, 13, -6, -6, 9, 11, -3, 0, 8, 8, -6, 11, 11, 0, 13, 3, -7, -3, 15, 5, 2, 15, 3, -4, 14, 12, 12, 0, 19, -7, -10, 8, 8, 8, 3, -6, -3, 5, 13, -7, -10, 4, -3, -11, 8, 5, -4, 16, 8, -3, -9, 4, 7, -7, 9, 4, 0, 8, 19, -2, 8, 13, -8, -5, 4, 9, -5, 12, 1, -2, 12, 10, 2, 6, 6, 12, 3, 20, 11, -2, 10, 19, 3, 7, 9, -1, -11, 5, 11, -15, 10, -1, -2, -2, 1, 0, 7, 5, 5, 4, -11, -1, -8, 3, 9, 5, -5, 10, 8, -11, 12, 6, 6, 7, 16, 10, 3, 12, 1, -14, 6, -1, -9, -4, -2, -4, -6, -3, 2, 5, 7, 5, 6, 9, 3, 3, 10, 4, -19, -7, 5, -5, -16, 14, 8, -2, 0, 2, -2, 2, 4, -1, 4, 24, 23, 8, 17, 12, 4, 5, -3, 2, 0, 1, 3, 10, 13, 14, 7, -1, 2, -11, 5, 6, 12, 2, 14, -1, -1, 5, 8, -4, 9, 5, -11, -8, 8, 13, -5, 10, 3, -3, -6, 8, 1, 8, 17, -9, -6, 3, 1, -21, 6, 10, -8, -3, 8, -7, -2, 16, 15, -6, 12, 3, -7, 5, 11, 4, 7, 5, -4, -1, 7, 5, -14, 11, 5, -5, -4, 16, 14, 3, 22, -1, 0, 12, 17, 5, 11, 11, 5, 10, 14, 7, 10, 17, 19, 10, 15, 19, -3, 5, 11, 7, 5, 8, -8, 0, 12, 4, -6, 4, 11, -4, -5, 19, -1, 3, 8, 17, 0, -6, 3, 12, 3, 9, -6, 0, 14, -5, 3, 3, 16, -5, 6, 21, 4, 1, 5, 8]
5601HnOo%%J0qlPj0LQqj6K4%k3J3J2j5jQrMMj0PJ1Lk3LL6k4KJj1QJ1o%j3J0k1
5644a3J4npNJ7j3j8L2j3JLJ1kj4oJ3j4J3nMLprRPjl4J9J8j9OK1j0j4J3llJ5kj1
5684AJ2j5jJ0%qOPjmOjj1J0lj3KMLkJ1%j3jJ9k0J1Rj5j3K2Kk1J2oMKo%LnMRoj8
5729a4JK1PnpJ1klrLMKJrPlkj2K7j4k0J8Mo%OlJ0k0J6ppJ6%nQqLj2MkRonJ2ko
5776AnLLnnJ4KOj2MlKnKRKnjJj5J2RqQj9J8jj8K%J5rkQojLKOj4j1J6kJj4J6Nj4
5824e%NKp%NMMk1J5JrNMQj6NJ0Ol%loKpLPj1oK1rj3MJ7rj1J7kOj9KOK1j4j2J6
5870A3qrKJ5kj4J6nMj0%jklJ7konrJ6Nj6MJ1kj2MRnj3OLNj0QlNj0jK1j8%LJ5j4
5915Bj3J8J1j2k%J3k3RM%Qj6RNj3pJ7lj6OJ5qrRLNj0KmQrpJ8Lj4j0K2pj6J7J4
$$ y = [8, 3, 9, 3, 3, 3, 13, 5, 2, 9, -1, 2, 10, 2, -14, 10, 10, -13, 0, 12, -3, -4, 4, -5, -1, 3, -7, 0, 11, 14, -9, -6, 30, 6, 8, 9, -2, 6, 17, 11, 11, -2, 8, -13, 1, -4, -11, -6, 11, -2, -20, 12, -1, 0, 3, 14, 12, -2, -8, 5, -9, 4, -1, 3, 6, -1, -10, -1, 6, 5, -29, -10, 8, -11, -5, 16, 6, -8, 5, 2, -1, 14, 12, 1, 13, -2, -3, 7, 7, -1, 5, 12, 11, 7, 13, 12, 1, 11, 8, -5, -3, 1, 4, 2, 13, 13, 0, -1, 18, -2, 9, 18, 3, -10, 12, 14, -7, 5, -1, 3, 5, -1, -1, 2, -3, 1, 10, 4, -14, -13, 8, 15, 10, 3, 14, 12, 9, 0, 3, 7, 9, 10, 1, 8, 5, 3, -9, 18, 4, -16, 2, 6, 0, 0, 6, 3, 13, -7, 9, 2, -5, 11, 11, 6, 14, 6, 9, -3, 1, -1, 8, 2, -3, 9, 7, 1, -4, -1, 2, -3, -8, 6, 8, 14, 2, 6, 3, 5, 0, 2, 11, 13, 8, 7, 8, -7, 5, 14, 6, 14, -5, 13, 12, -6, -4, -4, 11, 2, 0, 8, 2, 1, 4, 6, 12, -2, -13, 3, 1, 2, -12, 4, 9, -5, -5, 0, 2, -5, -5, 0, 4, 8, -13, 2, 3, -6, -1, 3, 11, -5, 0, 10, 16, 13, 13, 10, 4, 6, -1, 2, 9, -2, -8, 13, 4, -9, -5, 12, 3, -8, 9, 7, 13, -6, -4, 2, 23, 9, -3, 13, 5, -4, -2, 13, 11, -3, 13, 8, 12, 2, 2, 1, -1, -4, 13, 11, 5, 0, -9, 7, 12, -4, 0, 11, 9, -3, 1, 10, 5, -8, -2, 1, 6, -4, 4, 1, 6, -4, -5, 16, -2, -2, 1, 16, 2, -11, 7, 18, 6, 4, 4, 17, -6, 3, 7, 7, 15, -1, 8, 13, 0, -7, 10, 7, -9, -3, 12, 4, -5, 4, 7, 12, 2, 4, 0, 8, -1, -8, 10, 13, -1, -11, 11, 4, -12, 5, 19]
5957A9pk3PJ4Jj2j0J9J2l0nL1nj5KJ3Jj3KJ4Ok2oJ8Pj5oRNj4nK5%k0jJ0kl%kJ
5998@oK1%kj0oK1j2j0P%NoRKj5pLJ7nj3K0Nj5j0J2Rj3pJ4J4k1KlJ2ok0K4Lk4J1
6039@NlnmN%Nj6J8Nj5%J6Ok7J0OJ1k3J0J3j2j5J2lK8j8rMOj1j0K4j6KORk4PJR
6080Gj3PmLRrkJ7j1lNJrpJ1Nj3%J1mjnKOlqJ3J9k3j1K4j0lj5K2jj1lPJ4%j3%O
6124G%j1LJ8j2j4QK1k0KJ1o%j0OMj0jRJj4LJ3%j1MJ5j0j0J1n%j1J3MnpOJ0p%l
6166BJ2Lj7RKnllJJnlQJJj5K3Kk0OJ6j1j3NJ9j0mJ4pj1KJJ1j1kjJ2jk1NJ6oj0
6209gLNJ3j6RJ0j1klRNj4nK1pj6QQj2oJ2Lj3OJ0qlMkLmmK5rpLlPm%Jjj3J1KPm
6256A1plkjkRNj0qRjmNRJj6PKjLJJRj1j0J2%j2k0L1Lk2NJ3Rk2J7nj3J8j0J1j8
$$ y = [19, 12, -11, -4, 10, 11, -1, -11, 8, 20, -10, -15, 16, 11, -4, -2, 11, 12, -1, 1, 15, 21, -1, -7, 11, 18, 3, -3, 6, 11, -3, -8, 17, 17, -3, -4, 6, 4, 1, 1, -1, 0, -6, 15, 15, 13, 3, -3, 18, 6, -4, 3, 3, 8, 2, 11, 13, -2, -9, -6, 11, 6, -7, 13, 18, 3, -7, 5, 14, 1, -6, 8, 22, 1, 3, 0, 12, 6, -14, 10, 13, -11, 0, 5, 2, -3, -7, -2, -2, 3, -13, 5, 10, -5, -5, 11, 17, -10, 0, 6, 17, -6, 4, 17, 5, -10, 2, -1, 27, 9, 0, 4, 10, -1, -11, 13, -3, -1, 5, 14, -10, -3, -2, 7, -6, 1, -3, 0, 9, 0, -2, 15, 4, 1, 6, 7, -2, -9, 2, 7, -6, -6, 5, 1, 0, -5, -3, 3, 0, -8, 5, 24, 1, -10, 14, 4, 1, -14, 8, 7, -4, -7, 0, 14, 14, 1, 1, 7, 7, -4, -1, 17, 5, -9, -1, 20, 0, 2, 13, 7, 7, -3, 3, 7, -3, -4, 5, 6, -8, -5, 8, 8, -3, 1, 16, 6, -4, 7, 2, 2, -9, 4, 8, 3, -4, 2, 12, 5, 5, 2, 14, 17, 0, 9, 11, 6, 3, 0, 1, 2, -3, -6, 2, 3, 4, -11, 12, 14, -6, 0, 16, 5, -8, -3, 16, 6, 2, 16, 9, -2, 0, 1, 12, 1, -1, -2, 10, 9, -12, -7, 9, 3, -7, -4, 1, 14, -2, 7, 17, 6, 4, 1, 10, 15, 1, -4, 17, 10, -6, 2, 10, -2, -8, 4, 7, -6, 0, 10, 2, -1, 3, 1, 4, 0, -4, 21, 12, 5, 8, 5, 12, 8, 8, 9, 8, -5, 6, 8, 15, 11, 4, 1, -1, -2, -4, 5, 10, 0, -8, 1, 0, -4, 1, 10, 11, -5, 2, 4, 3, 6, 7, 8, 17, 6, -4, 8, 8, -4, -24, 7, 10, -12, -7, 6, 15, -7, 10, 5, -8, 10, 0, 11, -7]
6299gJ1pOJ3qj1J7j6kOJ2j1j5RllMkJ0njJ0J%pPJ1j6j7K1lkj0JOnlJ3noqQJ7n
6343Ej4J5ljnLQj5KJ0QoqnJ0rLjMJj0LJ2pj2J5loNKkoKJ0Nj6mJ0OnkNjqoJ7ol
6391c%jJ3j4j0NJ3n%LkMjJ6oj3nJ6nrJ2koj0LJ0LNj5J5rqoJ7jj4J9Pk4oJ8Pj3
6434bLlQKnoQok0RJ3JnMjj1Q%ONmj2NMpNQKkm%mlRnj5J3pNPmMJlljJ4olJJ8k0
6486A%J8k2KoJ2Rj0jlMpLlNqJJ0lqkJ6kqKoJ2omMRrjjlKmP%ljJ8j8J0qKjJ%Lj
6537B%lJ7qoOKj1lJ0kqj3J2jLQooMpP%%rJ2J6plMmrPLrPnlOnMoNNj1NlkKRjKj
6590FpPoPjJrMLMqnJ0jj2QlqPMMj5J6qnJ4j2J0Mj1MjJ1rjM%oJ2j3QrPj2OJ0k%
6638GmjqJ5%qlJ4j8QNj0%J6j6mNOqOJ1j2moOKKllNJ0rMjJ1j7QmlJ1j2klPPokj
$$ y = [-7, 4, -3, 3, 16, 8, -3, 14, -2, -4, 2, 14, 3, -12, -3, -6, -9, -5, -7, 3, -2, -3, 7, 8, 8, 1, 8, 19, 3, -14, 7, 4, 2, -8, -7, -1, -6, -9, 4, -1, -7, -15, -7, 10, 5, -9, 6, 3, 2, -3, 0, 8, -7, -5, 5, 13, 7, -1, -6, 4, -5, -2, -3, 1, 2, -8, -5, 7, 0, -12, 3, 0, -6, -1, 1, -1, -7, -5, 5, 10, -6, -10, 0, 6, 1, -1, 4, 3, -5, -11, 6, 0, -3, -3, -4, 9, -5, -15, -10, 3, -2, -2, 1, -1, 3, 2, 18, 12, -1, -6, 10, 5, -4, 8, 6, 0, -10, -7, 3, 6, 11, -4, 11, 2, -6, -12, 5, 4, -10, 9, 16, -8, -14, 4, 11, -2, 1, -2, 6, 8, 3, -3, 5, -1, -21, -12, 1, 2, -3, 1, 0, -11, -3, -3, 3, 8, 4, -8, -3, 1, -6, -1, 7, 9, 7, 3, 3, -1, -4, 5, 0, -15, -2, -9, -4, 3, -1, 3, 4, 1, -2, -3, 11, 5, 2, 3, 21, 1, 1, 19, -3, -1, -7, 5, 14, 4, 3, 0, 4, -3, 0, -3, 2, -6, -5, 5, 2, -6, -8, 8, 6, -2, 0, -6, 6, 0, -4, 0, 9, 0, -1, -2, -5, -3, -7, 0, 0, -3, -4, 14, -4, 6, -2, 0, -1, 0, 0, 3, 2, 2, -1, 16, 8, 2, 8, 10, -1, -4, 6, 4, -4, -17, -5, -6, -3, 5, -1, -7, -3, -10, -3, -3, -3, -12, 0, 16, 9, 6, 10, 6, -3, 4, 7, -2, 5, 0, -3, 3, -2, 2, -4, 1, 6, -5, 0, -3, -5, -3, 6, 5, 7, 6, -1, 6, 0, 7, 6, 7, -2, 2, 5, 9, 1, -4, 6, 5, -7, 1, -2, -10, -3, 1, 5, -10, 6, -2, -7, 7, -5, 5, 9, -2, 2, 1, 12, 3, 2, 6, 6, 0, 12, -1, 7, -2, 5, -7, -1, 9, 7, 7, 3, 2, -6, 9, 9, 1, -2, 12, -6, 2, 7, -3, -3, 13, -3, -7, -2, 4, -4, 2, 13, 1, -3, -9, -3, -1, 1, -2, -5, 0, 10, 1, 5, 4, 15, -2, 6, 2, -1, 10, -2, -4, -7, 0, 7, 1, -1, -2]
6686bpJ3oj2J3mjL%OJKmopJ1rOOK%%q%MOj2L%KqJ8oqJKOMnoPj4QJ2j3NoMLjj3
6737a0J4j7RQrRmJ3k2OJ0j7J0J0qJj0J4j3LLNNq%nPpqJ3Qqj0K2rjLnjNkpNOnJ
6783DRLk4J9k3J1j1K0k2J3J0oQj5MOoLNj1J6j5QOnlLpmOoKLKlMMj1lMJ0j0QkJ
6828EJj0PnRqJ1j5pJ7j6NJ5%lmklkPj2J1J0qlPoJ0j5J4j1MQkj4J8j1j3J8%j3M
6870bMj3J2MmPQj6Lj3J1mJ0krpJ2jOqNnJ2%qKlj1J6JmmRj2LQprJ7j2NMOlnnNK
6918ElpOJ5j1mrQOj4J1%pJjJLJ0Kj7KMkKJ2j1pKkPnKpRLj6J7J0mj4JJ0j5J5lM
6964IJOj2QpkkQLj2lJ5pnLp%MqJ1Jl%lJ2JKknrLJ0j4OKjKkM%LqlkRjlKOoNmqK
7018ajJ5j6J6j5lQNj0oJ0oMnMKmRKk3J1R%OqjQrOmjmOQplKmkjJ2j9RJ2j0kkOj0
$$ y = [-2, -9, 4, -2, -14, -1, -5, -6, -3, -3, 3, 4, 6, 2, -4, -11, 0, -9, -3, 3, 5, 5, 5, -3, -3, 1, 7, -5, -2, -2, 0, -8, 10, 4, -4, -3, -1, 5, 9, 4, -2, 5, -9, -1, 11, -2, 3, -3, 1, 4, 3, -10, 4, -13, -4, 4, -5, 4, 0, 13, -9, -3, 7, -10, 0, 10, 2, 3, -7, 7, -6, -3, 0, 5, 10, 2, 2, -3, 4, -3, -11, 2, 10, 2, -8, 14, 5, 4, 7, 2, 1, 6, 4, -3, 2, 8, 3, 4, 13, 16, -8, 11, -12, -1, -12, 8, -14, -1, 9, 3, 11, -4, 0, 6, 0, 3, 8, -3, 13, -2, 6, 12, 7, 4, 7, 0, -4, 2, -4, -2, 1, 3, 0, 4, 8, -3, -6, -2, 8, -2, 6, 4, 5, 6, -4, 3, -2, 7, -1, 10, -5, -12, 5, -11, -6, 9, 9, 6, 2, 0, -3, -5, 2, -10, 1, 11, 3, 0, 7, 1, 11, -4, 10, -1, 3, 11, 9, -5, 13, 2, -11, 7, 7, -6, -2, 2, -11, 1, 5, 1, 8, 16, 0, 3, -10, 1, -3, 7, 5, -4, -11, 1, 0, 6, -2, 3, -2, 10, 10, 2, 4, 1, -10, 6, 7, 3, -1, 8, -4, -1, 7, 0, -9, 8, -4, 1, 5, 11, 8, 3, -2, 3, 5, 2, -5, 1, 16, 5, 1, -8, 0, 6, -8, 3, 3, -4, -3, -4, -3, 0, 10, 12, -5, -3, 1, -1, 1, 13, 2, -5, -3, -5, 2, -3, -1, -8, 1, 4, -12, 5, 15, 11, -3, -2, 8, -7, 8, 5, 9, 10, 16, 4, 12, 5, 3, 1, 9, 12, 0, -3, 12, 5, 0, 3, -4, -4, 0, -8, 3, 4, 1, 1, -2, 10, 11, 13, 11, 6, -3, 0, 10, -4, 2, 4, 3, 5, 3, 7, 7, 10, 2, -1, -3, 6, 5, 2, 4, 10, 4, 9, 5, -3, -1, -2, 13, -3, 13, -2, -5, 3, 8, -2, -8, 2, -4, 0, -5, -1, 1, -3, 6, 8, -15, -4, 5, 5, 11, 3, 2, 10, 1, 7, 3, 2, -2, 4, 12, 5, 2, 4, 0, -2, -3, 9, -10, -1, 11, 1, -1, -3, 3, -7]
7067gjOQjmJ0j6NjOlMj1J2%qNrkPJjJ3nmoLJ4j5LJ2qpNMpkrONpnJ4mj5K2j6Jj
7116iJ3MnpjJJ0Kk2J8JJjPllqNJlLkKj4ROkkmKjNkjk%KMj3PJ0j1MlJoKKlMj%o
7169iJ0rqK4nMO%qNmLmjmOoKj2J5mNj3KJ5j4JK0nj4RmqMJ1j2Qq%NLj4MNLj6J8
7216FnNjmkJm%J2Oj7JJ4j3jQKmqMQlkJnK%OOrj8J6%KrJ1nqNPRj2QnkjklJ3qj2
7267a0J1OonNQj3j1K1QqjmrJ2qNPj2NKPj3MOlkjnPnJKJ1ll%%plRmoRQj5NnQOj2
7318alJ9j0ojQoKJKLnoJ0qpQRj2J9pnOkr%jl%J4rnJ0%j4oJ6j1J3rNKnkKJ8q%R
7367A5j3OMnMpj1RJOj1MoMj1J7npMmJ3jj1Ql%lNLnjJ8j8m%J6q%nKkOljJ2opJ5
7415A4pmjOMj2PM%rmJ6rj9J4mJ6j1jNjj0KRpOKkM%mMRqqJ2o%oK%pRkkjOL%LqR
$$ y = [-7, -8, -2, 6, 5, 1, 11, -5, 0, -1, 5, 2, 6, -5, 7, 7, -1, 4, -5, -7, 0, 1, 0, 13, 8, 4, -2, 1, 15, 0, 3, 15, 7, 0, 5, 9, 2, 0, -9, -3, 2, -5, -10, 4, 0, -15, 7, -9, -8, -9, 4, 8, 3, -4, -5, -4, 6, 8, -14, 4, 5, 6, 5, 12, 9, 6, -2, 3, 4, 1, 4, 2, 4, -10, -1, 5, 3, 1, -3, -1, -2, 3, 1, 0, -2, -2, 0, 4, -9, -2, 8, -3, 1, -2, -1, -7, -5, -3, -6, -2, -3, -3, -9, 1, -8, -16, 8, 3, 7, 13, 13, 5, 10, 6, 9, 5, 4, 0, 6, 0, 2, -10, 5, 1, 6, -7, -5, 10, -4, -3, 17, 12, -2, 7, 3, -5, -1, 10, -2, 6, -2, -2, 3, 6, -8, -4, 1, 4, -12, 6, 1, 6, 5, 1, -1, 0, -4, -4, 8, 14, -3, -2, 12, -1, -2, 6, 8, 4, -4, 0, 8, 5, 3, 4, -1, 1, 1, 7, 13, 4, -14, 2, 2, 4, -5, 6, 1, -7, -2, 5, 14, 2, 10, 5, 3, 2, 0, -3, 10, 2, -10, 1, 7, 1, -4, 1, 9, -4, -15, 6, 14, 6, 5, 1, -8, 4, -4, 1, 8, -4, 1, 3, 10, -3, 1, 7, 4, 2, 1, -4, 3, -2, -1, 1, 12, 9, 6, 6, 6, -1, -4, 5, 1, -5, 4, 12, -3, 2, -3, 5, 11, -1, -4, 15, 5, -1, -2, 6, 0, 2, 3, 5, 8, 3, -3, 7, -1, -8, 0, 9, -3, 16, 9, 4, 10, 8, -1, -1, -2, -5, -5, 9, 0, -5, 5, 5, -9, -15, 1, -10, 3, -6, -1, 1, -4, -6, -4, 14, 6, 6, 15, 2, 8, 12, 7, 11, 4, -7, 2, 3, 9, -2, 2, -4, 0, -11, 6, 1, -6, -2, -6, 7, 6, -5, 3, 0, 0, -3, 2, 5, 0, -1, 17, -1, -5, -5, 11, 3, 3, -2, 0, -2, 4, 1, 0, 12, 6, -1, 14, 7, 3, 2, 8, 12, 0, 7, 11, 11, 2, -2, 14, 5, -14, 0, -4, 12, 1, 0, 5, 4, -6, -4, 5, -2, 4, 6, 4, 8, 8, 4, 8, 17, 9, 1, 13, 7, 7, 1, 3, 3, -4, 5, 3, 1, 0, 6, 9, 9, 12, 4, 13]
7467A3Nk0K1Jj3l%J3qkMJqN%pJk%LPlnNnJjQlJKmnMjPr%LJ0j5jRjkkMmJjlKj0
7520gOKJ8k1J0Ppm%kJ2j5LPmj3J4Kj0J0jlmmKJ3pnmJ4qMJ0Lj2j0LJ6nJkRj3mR
7565A0Lqj3KJ2mMMJj3NkQj3lNPOo%kMrRqMpJ1mLNKj0kkJ3jj4J0jJ8k3KMPk0J3
7612GmRj6kJ6qkmM%QrJ4j5oNRKknJ4pj0NJ%oJ0Pj4LMlJj1QoPjOPj9j1K2lNk0J1
7660AOj4OLK%mKJkj2J3kmmPNKp%J3mnjRj0lKLLJjJ1pjj1J4rJ0%MMoj7J3r%nJ0
7709Gn%PoKJkjj2J2NkKj0Rj0KrK2rQllj5OQoRmKJ0rlrJ9om%J2oj1RnJKplQllJ7
7760A4oj1KNQj7NJ0Qj8OMjjj0J7pjmRrnJ1j4QkkJ3pjJ0Kkj2PqJoQKmjrK0j8oJ5
7807CqJ0j5PJ2j2nK0j1Kj3J3K0k2nJ2kmjpRqQJ0rQmrRmojRjJNnqO%kLrRkoOj0
$$ y = [13, 18, -2, 19, 20, 7, 4, 4, 17, 9, 7, 11, 12, 4, 9, 9, 2, 3, 1, 1, 4, 11, 8, 3, 8, 3, 4, 3, 11, 8, 9, 11, 7, 2, 6, 5, 12, 3, 3, 6, 16, 1, 0, 9, 8, 6, 4, 8, 4, 5, 4, 1, 3, -7, -1, 1, 19, -2, 8, 15, 8, 4, 4, 2, 14, -1, 2, 9, 5, -8, 6, 8, -2, 8, 7, 4, 0, -4, -2, 11, 4, -1, -5, 9, 1, 5, 15, 18, 6, -4, -1, 15, 10, 11, 9, 18, 5, 1, 10, 13, 5, -8, -6, 6, 2, 6, 10, 11, -2, 3, 1, 9, -4, -7, -2, 5, 11, 5, 5, 3, 7, -2, 7, -1, 3, -4, 7, 3, 6, 11, 13, 3, 1, -1, 12, 11, -3, 7, 6, 24, 1, 3, 7, 14, -6, 7, 3, 12, -4, -6, 10, 2, 0, -4, 0, 0, 8, -1, 13, -2, -8, -3, 6, 8, 6, 1, 15, 8, -2, 3, 4, 4, -2, 8, 15, 1, 4, 8, 5, 6, -5, 3, -3, 4, 3, 9, 16, -3, -14, 8, 5, 10, -10, 1, 7, -7, -1, 2, 4, 4, 0, 2, 3, 1, -11, 2, 0, -4, -8, -1, 4, 6, -1, -1, 12, 8, 3, 2, 11, 1, -2, 0, 3, 6, 7, 6, 17, 10, 9, -2, 12, 3, 13, 13, 17, 21, 15, -2, 11, 2, 2, -3, 7, 2, 2, 9, 3, 5, 6, 4, 3, -9, 3, 8, 6, 8, -2, 7, -3, -1, -10, 12, 3, 11, 8, 5, -10, -4, 4, -2, 7, 3, 5, 15, 6, 3, -6, 13, 7, 3, 3, 15, 9, -2, 7, 2, 3, 5, -2, -5, 3, 0, -3, 14, 8, -3, -1, 4, 12, -5, 0, 10, 18, 0, 6, 10, 9, 8, -2, 15, 8, 7, 3, 12, 3, -2, 9, -5, 3, 1, -1, 12, 5, 4, 14, 16, 14, 2, 9, 1, 2, -4, 4, 6, 2, 1, -8, 12, -6, -12, 3, -5, 5, -10, -3, 9, -3, -8, 12, 1, 3, -10, 3, 23, 1, -4, 8, 6, 2, 1, -6, 3, -5, 3, 13, 4, 12, 8, -1, 8, 4, -2, -3, 6, 5, 6, 11, 6, -2, 4, 4, 2, 5, -4, 5, 3, -3, 3, -7]
7855gNJj0J0Jm%J2Kj7NJ3qnj0J9lOrJ5nnkkmlJ5mmNkrJJLl%oPkPJOj2pKMJ2j3
7904cMR%lj5QoO%LjOj2RLoqMnMPNNrJLj3OJNnrQJjlmJ5qJqOJ4j2rRNj5OJ0%lm
7957BkLlOlkj3NK4k3mJ0KnJ0Oj1kmKLQj3Ml%oJ3koQPrKnKjlKKjoQj1K1j0MmLl
8007BLLoOqjomJ8mJJ1j3mJ5j6nMjL%JQj0NNj3PKLjj0jjJ0Oj4LJ1j6nOOJLJoJp
8056gPJ0%j5LJJnJ1%j7MJ3j8Kl%J5qKpOMLNnj%MoqJ1mMJn%Pj1J0j4RKnJ2j4mJ2
8104BMqkkJ0mJ1j5%NpjjPLMMroKoPj0POmpJ2nlqJ4O%j3kJ3Mjo%Qop%J4j0OrJ8
8154A5j4Klj0%Rkj%MMKj2J0MlMmj3J0L%j3ONLnpQnKOqNMrP
$$ y = [-7, -2, -1, -11, -1, 0, -4, -4, 8, 10, -7, -2, 11, 3, -2, -12, 7, 4, 10, 1, 16, 11, 6, 4, 2, -2, -5, 10, 6, 2, 7, 5, -4, -3, -2, 1, -2, -2, -8, -1, -3, 4, 5, 11, -1, -8, -6, -2, 10, -3, 1, 10, 10, 7, -8, 0, -6, 0, 0, 3, 2, 8, -4, 5, 8, 2, -6, -2, -7, -3, 4, 9, 14, 5, 6, 9, -4, 2, 3, 8, 3, -6, 2, 3, 2, -1, -5, 10, 2, 3, -5, 1, 15, 3, -6, 3, 8, -7, -1, 9, 9, 6, 2, 0, 3, 0, 6, 3, 1, -12, -7, 17, -6, -10, 0, 2, -3, 7, 13, 2, 0, -4, -2, 1, 9, -4, 0, -3, -3, -9, 4, 2, -4, 4, 11, 2, 4, -1, 1, 0, -3, -1, 1, 0, -6, 2, -9, 12, 2, 6, 2, 5, 2, 5, 8, 2, 8, 0, -1, -7, -11, 7, 3, 4, 15, 2, -2, 13, -3, -8, -4, -5, -2, -2, -1, 7, -3, 2, 7, -6, 1, 3, 6, 5, -5, -6, -7, 3, 9, -5, -2, 9, -7, -12, -6, 0, 1, 4, 5, -1, 0, -7, 0, 10, 10, -5, -2, -1, 0, -5, 6, 6, -11, -7, 6, -12, -10, -13, -13, 2, -6, -4, -11, -5, -1, 2, 7, 2, 1, 1, 5, -1, -9, 2, -2, 2, 3, -2, -2, 5, -6, 4, -10, -1, 1, -4, 8, -6, -10, 2, 6, -2, -4, -6, 4, 0, 11, -4, -4, 1, -6, -7, -8, -1, 2, 6, 10, 1, -5, -3, -9, -2, -12, -5, 1, -3, -10, 2, -3, -6, -14, 0, 6, 6, -7, -9, 4, 8, 7, 1, 1, 9, 3, -4, -4, 10, 0, 6, -3, 15, 1, 3, 0, -10, -10, -1, -3, -4, -4, 0, 4, 6, -6, 4, 8, 5, 9, 5, -8, 2, 5, 5, -8, -2, 3, 6, 1, -6, 2, -3, -1, 5, -3, 2, 6, -3, 4]
8191D
##END NTUPLES=NMR FID
##END=
