##TITLE=1H_LY-dioxan
 , 8 sc, 
 28.6.2019
##JCAMPDX= 6.0         $$ Bruker NMR JCAMP-DX V2.0
##DATA TYPE= NMR FID
##DATA CLASS= NTUPLES
##ORIGIN= UXNMR, Bruker Analytische Messtechnik GmbH
##OWNER= root
$$ XWIN-NMR		Version 3.5
$$ Fri Jun 28 14:13:55 2019 Russian Standard Time (UT+4h)  she@DPX200
##.OBSERVE FREQUENCY= 200.13155
##.OBSERVE NUCLEUS= ^1H
##.DELAY= (6, 6)
##.ACQUISITION MODE= SIMULTANEOUS
##.ACQUISITION SCHEME= undefined
##.AVERAGES= 8
##.DIGITISER RES= 18
##SPECTROMETER/DATA SYSTEM= spect
##.PULSE SEQUENCE= zg30
##.SOLVENT NAME= CDCl3
##.SHIFT REFERENCE= (INTERNAL, CDCl3, 0, 15.7039)
##AUDIT TRAIL= $$ (NUMBER, WHEN, WHO, WHERE, WHAT)
$$ ##TITLE= Audit trail, XWIN-NMR		Version 3.5
$$ ##JCAMPDX= 5.01
$$ ##ORIGIN= Bruker BioSpin GmbH
$$ ##OWNER= she
$$ F:/spectra/data/she/nmr/H-F/1/audita.txt
$$ ##AUDIT TRAIL=  $$ (NUMBER, WHEN, WHO, WHERE, WHAT)
(   1,<2019-06-28 14:12:40.84 +0400>,<she>,<DPX200>,
      <created by zg, POWCHK disabled, PULCHK disabled
       configuration hash MD5:
       00 E9 B6 7A A2 85 ED C7 34 08 36 98 17 FE 4E 26
       data hash MD5: 16K
       84 AF 5E BD A6 A6 4A 52 9B 1C EF 7B 99 BC C2 FD>)
$$ ##END=
$$ 
$$ hash MD5
$$ B9 FF B8 F2 C8 F7 91 93 BF 23 41 4D 38 21 B7 5B
##$RELAX= 
##$RELAX= 
##$RELAX= 
##$RELAX= 
##$RELAX= 
##$RELAX= 
$$ Bruker specific parameters
$$ --------------------------
##$DU= <F:/spectra>
##$EXPNO= 1
##$NAME= <H-F>
##$PROCNO= 1
##$TYPE= <nmr>
##$USER= <she>
##$AMP= (0..31)
100 100 100 100 100 100 100 100 100 100 100 100 100 100 100 100 100 100 
100 100 100 100 100 100 100 100 100 100 100 100 100 100 
##$AQSEQ= 0
##$AQ_mod= 1
##$AUNM= <au_zg>
##$AUTOPOS= <>
##$BF1= 200.13
##$BF2= 200.13
##$BF3= 200.13
##$BF4= 200.13
##$BF5= 200.13
##$BF6= 200.13
##$BF7= 200.13
##$BF8= 200.13
##$BYTORDA= 1
##$CFDGTYP= 0
##$CFRGTYP= 5
##$CHEMSTR= <none>
##$CNST= (0..31)
1 1 145 1 1 1 1 1 1 1 1 1 1 1 1 1 1 1 1 1 1 1 1 1 1 1 1 1 1 1 1 1 
##$CPDPRG= <>
##$CPDPRG1= <>
##$CPDPRG2= <>
##$CPDPRG3= <>
##$CPDPRG4= <mlev>
##$CPDPRG5= <mlev>
##$CPDPRG6= <mlev>
##$CPDPRG7= <mlev>
##$CPDPRG8= <mlev>
##$CPDPRGB= <>
##$CPDPRGT= <>
##$D= (0..31)
0 1.2 0 0 0 0 0 0 0 0 0 0.03 0 0 0 0 0 0 0 0 0 0 0 0 0 0 0 0 0 0 0 0 
##$DATE= 1561716760
##$DBL= (0..7)
120 120 120 120 120 120 120 120 
##$DBP= (0..7)
150 150 150 150 150 150 150 150 
##$DBP07= 0
##$DBPNAM0= <>
##$DBPNAM1= <>
##$DBPNAM2= <>
##$DBPNAM3= <>
##$DBPNAM4= <>
##$DBPNAM5= <>
##$DBPNAM6= <>
##$DBPNAM7= <>
##$DBPOAL= (0..7)
0.5 0.5 0.5 0.5 0.5 0.5 0.5 0.5 
##$DBPOFFS= (0..7)
0 0 0 0 0 0 0 0 
##$DE= 6
##$DECBNUC= <off>
##$DECIM= 24
##$DECNUC= <off>
##$DECSTAT= 4
##$DIGMOD= 1
##$DIGTYP= 9
##$DL= (0..7)
0 120 120 120 120 120 120 120 
##$DP= (0..7)
150 150 150 150 150 150 150 150 
##$DP07= 0
##$DPNAME0= <>
##$DPNAME1= <>
##$DPNAME2= <>
##$DPNAME3= <>
##$DPNAME4= <>
##$DPNAME5= <>
##$DPNAME6= <>
##$DPNAME7= <>
##$DPOAL= (0..7)
0.5 0.5 0.5 0.5 0.5 0.5 0.5 0.5 
##$DPOFFS= (0..7)
0 0 0 0 0 0 0 0 
##$DQDMODE= 0
##$DR= 18
##$DS= 0
##$DSLIST= <SSSSSSSSSSSSSSS>
##$DSPFIRM= 0
$$ [...]
##$SUBNAM2= <"">
##$SUBNAM3= <"">
##$SUBNAM4= <"">
##$SUBNAM5= <"">
##$SUBNAM6= <"">
##$SUBNAM7= <"">
##$SUBNAM8= <"">
##$SUBNAM9= <"">
##$SW= 24.9336996594482
##$SWIBOX= (0..15)
0 0 2 0 0 0 0 0 0 0 0 0 0 0 0 0 
##$SW_h= 4990.01996007984
##$TD= 16384
##$TD0= 1
##$TE= 0
##$TE2= 300
##$TE3= 300
##$TEG= 300
##$TL= (0..7)
0 120 120 120 120 120 120 120 
##$TP= (0..7)
150 150 150 150 150 150 150 150 
##$TP07= 0
##$TPNAME0= <>
##$TPNAME1= <>
##$TPNAME2= <>
##$TPNAME3= <>
##$TPNAME4= <>
##$TPNAME5= <>
##$TPNAME6= <>
##$TPNAME7= <>
##$TPOAL= (0..7)
0.5 0.5 0.5 0.5 0.5 0.5 0.5 0.5 
##$TPOFFS= (0..7)
0 0 0 0 0 0 0 0 
##$TUNHIN= 0
##$TUNHOUT= 0
##$TUNXOUT= 0
##$USERA1= <user>
##$USERA2= <user>
##$USERA3= <user>
##$USERA4= <user>
##$USERA5= <user>
##$V9= 5
##$VALIST= <valist>
##$VCLIST= <CCCCCCCCCCCCCCC>
##$VD= 0
##$VDLIST= <DDDDDDDDDDDDDDD>
##$VPLIST= <PPPPPPPPPPPPPPP>
##$VTLIST= <TTTTTTTTTTTTTTT>
##$WBST= 1024
##$WBSW= 4
##$XGAIN= (0..3)
0 0 0 0 
##$XL= 0
##$YL= 0
##$YMAX_a= 214130
##$YMIN_a= -212010
##$ZGOPTNS= <>
##$ZL1= 120
##$ZL2= 120
##$ZL3= 120
##$ZL4= 120
##$ABSF1= 10
##$ABSF2= 0
##$ABSG= 5
##$ABSL= 3
##$ALPHA= 0
##$AQORDER= 0
##$ASSFAC= 0
##$ASSFACI= 0
##$ASSFACX= 0
##$ASSWID= 0
##$AUNMP= <proc_1d>
##$AZFE= 0.1
##$AZFW= 0.1
##$BCFW= 1
##$BC_mod= 2
##$BYTORDP= 1
##$COROFFS= 0
##$CY= 11.3945322036743
##$DATMOD= 1
##$DC= 2
##$DFILT= <>
##$DTYPP= 0
##$F1P= 18.9103706918063
##$F2P= -1.10871071338519
##$FCOR= 0.5
##$FTSIZE= 0
##$FT_mod= 4
##$GAMMA= 1
##$GB= 0.15
##$INTBC= 1
##$INTSCL= 1
##$ISEN= 128
##$LB= 0.24
##$LEV0= 0
##$LPBIN= 0
##$MAXI= 10000
##$MC2= 0
##$MEAN= 0
##$ME_mod= 0
##$MI= 1.114404
##$NCOEF= 0
##$NC_proc= 0
##$NLEV= 6
##$NOISF1= 3.799351
##$NOISF2= 2.8
##$NSP= 1
##$NTH_PI= 0
##$NZP= 0
##$OFFSET= 15.70392
##$PC= 1
##$PHC0= -8577.657
##$PHC1= 12.00098
##$PH_mod= 1
##$PKNL= yes
##$PPARMOD= 0
##$PSCAL= 0
##$PSIGN= 0
##$REVERSE= no
##$SF= 200.130013532006
##$SI= 16384
##$SIGF1= 3
##$SIGF2= 2
##$SINO= 400
##$SIOLD= 16384
##$SREGLST= <1H.CDCl3>
##$SSB= 0
##$STSI= 0
##$STSR= 0
##$SW_p= 3612.71676300578
##$SYMM= 0
##$S_DEV= 0
##$TDeff= 0
##$TDoff= 0
##$TI= <>
##$TILT= no
##$TM1= 0
##$TM2= 0
##$TOPLEV= 0
##$USERP1= <user>
##$USERP2= <user>
##$USERP3= <user>
##$USERP4= <user>
##$USERP5= <user>
##$WDW= 1
##$XDIM= 8192
##$YMAX_p= 0
##$YMIN_p= 0
$$ End of Bruker specific parameters
$$ ---------------------------------
##NTUPLES= NMR FID
##VAR_NAME=  TIME,          FID/REAL,        FID/IMAG
##SYMBOL=    X,             R,               I
##VAR_TYPE=  INDEPENDENT,   DEPENDENT,       DEPENDENT
##VAR_FORM=  AFFN,          ASDF,            ASDF
##VAR_DIM=   8192,          8192,            8192
##UNITS=     SECONDS,       ARBITRARY UNITS, ARBITRARY UNITS
##FACTOR=    0.0002004,     1,               1
##FIRST=     0,             0,               0
##LAST=      1.6414764,     0,               0
##MIN=       0,             -212010,         0
##MAX=       1.6414764,     214130,          0
$$ Real data points
##PAGE= N=1
##DATA TABLE= (X++(R..R)), XYDATA
$$ plain form
0 0 0 0 0 0 0 0 0 0 0 0 -8 4 -4 8 -8 8 -8 16 -16 16 -24 24 -24 32 -36 40 -45 53 -58 64 -74 84 -92 103 -116
35 -116 128 -140 157 -175 195 -214 238 -262 290 -323 360 -400 446 -501 564 -641 739 -855 1006
54 1006 -1215 1513 -1970 2762 -4400 9122 -50192 -212010 -53759 180101 146989 -107163 -197547
67 -197547 4698 200239 94880 -149828 -170933 63606 200832 39146 -180507 -129645
77 -129645 113545 187201 -19336 -195856 -79345 155507 156184 -76021 -193188 -21033 180818
88 180818 111731 -123486 -172605 35793 189313 59514 -157748 -138713 86591 181638 5885
99 5885 -178091 -95992 129282 161130 -48041 -184924 -44794 161911 125678 -98314 -174384
110 -174384 10552 178890 79071 -138255 -147801 63249 178491 27079 -163611 -109706 107222
$$ packed form
0@%%%%%%%%%%qJ2qJ2j6J6j6K4l2L2m0M8m8N6o8P6q5R8j11J22j38J58j76J95k19
35a16K44k68K97l32L70m09M52n00N52o13O83p60Q46r47J065j205J380j594J861
54A006k221K728l483M732p162J3522n9314j61818J58251K33860l3112k54152r0384
67a97547K02245J95541j05359k44708k1105K34539J37226j61686k19653N0862
77a29645K43190P3656k06537j76520J16511K34852O77k32205j17167J72155K01851
88A80818o9087k35217m9119K08398J53520j29799k17262J9035K25304R5047j75753
99E885j83976Q2099K25274L1848k09171j36883J40130K06705l6233k23992p6070
110a74384J84936J68338r9819k17326r546K11050J15242j51412j90690N3905K16928
$$ plain form
121 107222 163593 -24197 -175482 -64323 142760 135915 -74060 -172554 -12799 165405 95595
132 95595 -116834 -153516 39449 172048 46749 -146996 -119795 85351 161438 -3240 -161653
143 -161653 -78372 120872 138725 -50188 -163107 -32253 145952 105524 -92168 -151289 15872
154 15872 158484 63410 -125868 -125716 62176 155583 16123 -145943 -89043 99859 138458
165 138458 -29329 -152210 -47664 127281 111673 -70398 -146792 -3895 144541 76773
175 76773 -105663 -129771 40450 149797 34493 -132045 -100192 81289 140129 -10606 -144456
186 -144456 -61941 112420 118155 -52307 -143845 -20470 132753 87348 -88064 -131561 21327
197 21327 142074 50341 -116465 -108622 61763 138987 7927 -134128 -74851 95643 122009
$$ packed form
121A07222N6371j87790j51285J11159K07083o845k09975r8494J59755J78204o9810
132I5595k12429l6682J92965J32599j25299j93745K7201K05146P6087j64678j58413
143a61653Q3281J99244J7853j88913j12919J30854J78205m0428j97692n9121J67161
154A5872J42612r5074j89278J52J87892R3407j39460j62066N6900J88902L8599
165A38458j67787j22881J04546J74945j5608j82071p6394J42897J48436o7768
175G6773j82436k4108J70221J09347j15304j66538L1853J81481N8840j50735j33850
186a44456Q2515J74361N735j70462r1538J23375J53223m5405j75412m3497J52888
197B1327J20747r1733j66806P843J70385P7224j31060j42055N9277J70494K6366
$$ plain form
208 122009 -33790 -137801 -35504 118706 94706 -69891 -128919 4167 129884 61550
218 61550 -97901 -110761 41546 131268 24619 -118286 -83688 75776 121021 -14771 -127560
229 -127560 -49102 102023 99700 -51308 -124475 -11462 117527 70467 -80935 -110757 24313
240 24313 122457 37767 -103004 -89711 57566 118516 2177 -117098 -60952 86249 104089
251 104089 -33881 -120757 -26621 106870 79775 -66275 -112273 9417 116068 49163 -90428
262 -90428 -94591 42120 115440 16313 -106793 -70182 71009 105790 -17464 -114313 -40043
273 -40043 93922 86905 -50082 -111361 -5802 107428 59326 -76610 -97107 27062 109745
284 109745 28484 -94421 -75812 55412 103176 -2924 -103986 -49689 78345 89062 -33196
$$ packed form
208A22009j55799j04011J02297J54210k4000j64597n9028J33086J25717o8334
218F1550j59451j2860J52307Q9722j06649j42905L4598J59464M5245j35792j12789
229a27560P8458J51125k323j51008p3167J13013J28989m7060j51402k9822J35070
240B4313R8144q4690j40771J3293J47277O0950j16339j19275N6146J47201J7840
251A04089j37970q6876R4136J33491k7095j46050m5998J21690J06651o6905j39591
262i0428m163J36711P3320r9127j23106L6611J41191L4781j23254r6849P4270
273d0043J33965p017j36987o1279J05559J13230m8102j35936k0497J24169Q2683
284A09745q1261j22905J8609J31224M7764j06100j01062N4297J28034J0717j22258
$$ plain form
295 -33196 -105435 -19799 95094 67214 -60962 -97139 11983 102265 39256 -81739 -79895
306 -79895 40969 99831 9579 -94192 -56952 64762 89367 -19183 -98814 -30950 83028
317 83028 72809 -46326 -96020 -1794 94894 49205 -69924 -83921 27608 97209 21150
328 21150 -85998 -64067 53200 90264 -7362 -93259 -39810 72556 76363 -33613 -93184
339 -93184 -13566 86129 56899 -57320 -85474 14288 92297 31985 -75801 -69682 40505 89385
351 89385 4463 -86323 -47607 61554 78045 -21605 -88188 -23139 75851 61407 -44361 -83568
363 -83568 1948 84230 40523 -63555 -72363 27031 85674 16004 -77276 -54462 49590 78787
375 78787 -9831 -82980 -31874 66158 64905 -32855 -81018 -8328 76388 46979 -52358 -73347
$$ packed form
295c3196p2239Q5636J14893k7880j28176l6177J09122R0282o3009j20995J844
306g9895J20864N8862r0252j03771L7240J21714K4605j08550p9631O7864J13978
317H3028j0219j19135m9694R4226R6688m5689j19129j3997J11529O9601p6059
328B1150j07148K1931J17267L7064r7626q5897N3449J12366L807j09976n9571
339i3184P9618R9695k9230j14219k8154R9762P8009o0312j07786O119J10187M8880
351H9385q4922r0786L8716J09161J6491r9650o6583O5049R8990j4444j05768l9207
363h3568Q5516Q2282m3707j04078q808R9394N8643o9670r3280K2814J04052K9197
375G8787q8618p3149N1106R8032j253r7760m8163P2690Q4716k9409r9337k0989
$$ plain form
387 -73347 15109 80838 25732 -67803 -59826 37707 78619 1740 -77447 -40383 56810 68459
399 68459 -22147 -79014 -17721 69475 52570 -42453 -73631 4999 75757 33378 -58501 -62908
411 -62908 26460 76171 12051 -70009 -47238 46189 70232 -10874 -75274 -26744 61383 57185
423 57185 -32254 -72842 -4582 69868 39684 -49224 -64184 16377 72069 20276 -61455 -51388
435 -51388 35284 69133 -380 -69238 -34369 51827 60185 -21515 -70609 -13899 63198 45387
447 45387 -40036 -65089 7036 68042 27253 -53735 -54196 25945 67079 8191 -62734 -39974
459 -39974 42372 61326 -11440 -67018 -22270 55728 50161 -30453 -65183 -2240 63705 34046
471 34046 -46211 -56906 17268 65041 15655 -56581 -44193 33854 61160 -2664 -62340 -28931
$$ packed form
387g3347Q8456O5729n5106r3535P977R7533M0912p6879p9187L7064R7193J1649
399F8459r0606n6867O1293Q7196j6905r5023l1178P8630P0758m2379r1879m407
411f2908Q9368M9711o4120q2060K2771R3427K4043q1106o4400M8530Q8127m198
423E7185q9439m0588O8260P4450l0184q8908j4960Q0561N5692n1793q1731J0067
435e1388Q6672L3849o9513o8858L4869Q6196Q358q1700m9094N6710P7097j7811
447D5387q5423k5053P2125O1006m0789q0988m61Q0141M1134n8888p0925K2760
459c9974Q2346J8954p2766n5578M4748P7998n567q0614l4730O2943O5945k9659
471C4046q0257j0695P4174M7773m9386p2236J2388P8047K7306o3824n9676L3409
$$ plain form
483 -28931 47601 52947 -20859 -63416 -11069 57753 39995 -37542 -58551 8114 62229 23053
495 23053 -50158 -48006 25579 60462 5111 -57404 -34161 39785 54152 -12121 -60146 -18402
507 -18402 50704 44029 -28432 -58356 -972 57783 29925 -42603 -51064 16876 59169 12857
519 12857 -52261 -38965 32223 54826 -4317 -56578 -24379 43855 46553 -20002 -56569 -8754
531 -8754 52062 35114 -34321 -52401 7944 56291 20288 -45922 -43107 24123 54912 3535
543 3535 -52679 -29941 37151 48396 -12413 -54301 -15200 46316 38687 -26480 -52022 66
555 66 52006 26249 -38745 -45780 15694 53598 11187 -47851 -35050 30110 49891 -4929 -51968
568 -51968 -21198 40898 41622 -19581 -51237 -6478 47656 30662 -31904 -46807 8091 50908
$$ packed form
483b8931P6532N346p3806m2557N2347O8822j7758p7537k1009O6665N4115l9176
495B3053p3211K152P3585L4883n5351o2515K3243P3946J4367o6273m8025M1744
507a8402O9106o675p2461k9924N7384N8755k7858p2528q461O7940M2293m6312
519A2857o5118J3296P1188K2603n9143n2261L2199O8234K698o6555l6567M7815
531h754O0816j6948o9435j8080O0345M8347l6003o6210K815O7230L0789n1377
543C535n6214K2738O7092J1245o0809m1888L9101O1516p629o5167k5542N2088
555F6N1940k5757o4994p035O1474L7904m2411n9038J2801O5160J9781n4820m7039
568e1968L0770O2096P24o1203l1656M4759N4134j6994o2566j4903N4898M2817
$$ plain form
580 50908 17666 -42047 -38865 22513 50079 2587 -48591 -26863 34902 44162 -12542 -50071
592 -50071 -12683 43239 34346 -25545 -46997 1516 47497 22662 -35789 -40789 15093 48427
604 48427 9394 -43643 -31355 27795 45228 -5031 -47560 -18788 37945 37653 -18820 -46752
616 -46752 -4790 43907 26845 -29977 -41861 8517 45977 14897 -38287 -34329 20868 44892
628 44892 1842 -43968 -24037 31869 40028 -11805 -45831 -11124 40074 31038 -24253 -42926
640 -42926 2466 43788 19658 -33563 -36604 14810 43979 7584 -40022 -27883 25853 41008
652 41008 -5108 -43626 -16881 35121 34461 -17816 -43232 -3870 41041 24410 -28478 -38496
664 -38496 8904 42655 12713 -35901 -30801 20038 40806 839 -40205 -21297 29368 36218
$$ packed form
580E0908l3242n9713L182O1378K7566m7492n1178K1728O1765R260n6704l7529
592e0071L7388N5922q893n9891k1452M8513M5981k4835n8451n000N5882L3334
604D8427l9033n3037J2288N9150J7433n0259m2529K8772N6733k92n6473k7932
616d6752M1962M8697j7062n6822j1884N0378L7460l1080n3184L958N5197K4024
628D4892m3050m5810J9931N5906Q159n1833l4026L4707N1198r036n5291j8673
640d2926M5392M1322k4130n3221l041N1414K9169l6395m7606J2139N3736J5155
652D1008m6116l8518K6745N2002o60n2277k5416L9362M4911j6631n2888j0018
664c8496M7400L3751k9942m8614N100N0839K0768l9967m1044J8908N0665O850
$$ plain form
676 36218 -11025 -41800 -10027 36707 28408 -22411 -39508 2535 40537 17765 -31321 -33300
688 -33300 14312 40212 6113 -36832 -24760 24013 36857 -5178 -39445 -14877 31922 31082
700 31082 -16244 -39315 -3526 37543 22292 -26310 -35396 8509 39473 11295 -33535 -28029
712 -28029 19206 37503 -155 -37316 -18766 27576 32695 -10856 -38183 -8546 33899 25759
724 25759 -20903 -36303 2664 37624 16187 -29415 -30857 13859 37631 5062 -34810 -22432
736 -22432 23266 33922 -5918 -36623 -12753 29898 27951 -15569 -35860 -2645 34538 20105
748 20105 -24372 -32372 8042 36373 10220 -31197 -25810 18168 34713 -716 -34763 -16713
760 -16713 26022 29696 -10751 -34990 -7113 31249 22956 -19536 -32806 2864 34223 14525
$$ packed form
676C6218m7243l0775L1773M6734q299n0819j7097M2043L8002k2772m9086j979
688c3300M7612K5900l4099m2945J2072M8773J2844m2035l4267K4568M6799q40
700C1082m7326k3071L5789M1069j5251m8602r086M3905L0964k8178m4830N506
712b8029M7235J8297l7658l7161J8550M6342N119m3551k7327K9637M2445q140
724B5759m6662j5400L8967L4960k1437m5602j442M4716K3772l2569l9872J2378
736b2432M5698J0656l9840l0705K3870M2651j947m3520k0291L3215L7183j4433
748B0105m4477q000M0414K8331k6153m1417N387M3978J6545l5429l4047J8050
760a6713M2735L674m0447k4239K7877L8362q293m2492j3270L5670L1359j9698
$$ plain form
772 14525 -26888 -28135 12730 34599 4565 -32299 -20661 21838 31384 -5965 -34096 -11241
784 -11241 28194 25424 -15165 -32943 -1607 31960 17805 -22753 -29358 7779 33377 9188
796 9188 -28831 -23742 17007 32243 -887 -32557 -15384 24642 27639 -10588 -32764 -5931 29571
809 29571 20781 -18853 -30140 3422 31671 12747 -25116 -25589 12139 31810 3904 -29874 -18919
822 -18919 20333 29050 -5721 -31853 -10293 26570 23520 -14677 -30689 -770 30015 15871
834 15871 -21680 -26755 7906 30675 7747 -26734 -21356 15924 29411 -1050 -29928 -14018
846 -14018 22887 25531 -10070 -30544 -5188 27826 18998 -18139 -27863 3973 29613 11081 -23774
859 -23774 -23093 11932 29108 2863 -27615 -16867 19046 26520 -5617 -29387 -9188 24828 21664
$$ packed form
772A4525m1413j247M0865K1869l0034l6864J1638M2499R546l7349k8131K2855
784a1241L9435k770m0589j7778L1336L3567j4155m0558o605L7137K5598k4189
796I188l8019N089M0749J5236l3130l1670J7173M0026K997l8227k2176K6833L5502
809B9571q790l9634j1287L3562K8249j8924l7863m73L7728J9671k7906l3778J0955
822a8919L9252Q717l4771k6132K1560L6863l050l8197j6012K9919L0785j4144
834A5871l7551n075L4661K2769k2928l4481N378L7280J3487l0461k8878J5910
846a4018L6905K644l5601k0474K5356L3014q828l7137r724L1836K5640j8532l4855
859b3774O81L5025J7176k6245l0478J0748L5913P474l2137k3770K0199L4016l164
$$ plain form
872 21664 -14011 -28629 -302 28296 14408 -20885 -24782 8270 28776 6301 -25405 -19134
884 -19134 15558 26926 -1865 -27833 -12332 21558 23309 -9809 -28343 -4433 26187 17541
896 17541 -17420 -26148 4277 28103 9781 -22993 -21223 12126 27198 1705 -26129 -14925
908 -14925 18389 24204 -5991 -27219 -7894 23220 19713 -13286 -26431 24 26434 13226
920 13226 -19729 -23023 8090 26916 5441 -24015 -17447 15083 24892 -2390 -25889 -10737 20261
933 20261 21001 -9487 -25847 -3696 24017 15879 -16085 -24000 4066 26043 8967 -21528 -19721
946 -19721 11617 25455 1097 -24784 -13466 17832 22284 -6431 -25377 -6509 21981 17709
958 17709 -12973 -24356 655 24729 11805 -18819 -21282 8135 25379 4620 -23062 -16130
$$ packed form
872B1664l5675j4618K8327K8598j3888l5293l897L3052K0506k2475l1706O271
884a9134L4692J1368k8791k5968J5501L3890J751l3118j8534K3910L0620q646
896A7541l4961q728L0425K3826j8322l2774J770L3349J5072k5493k7834J1204
908a4925L3314N815l0195k1228J9325L1114l507l2999j3145K6455K6410j3208
920A3226l2955l294L1113J8826k1475k9456O568L2530R809k7282k3499J5152L0998
933B0261P40l0488j6360K2151K7713q138l1964p915K8066K1977j7076l0495J807
946a9721L1338J3838k4358k5881J1318L1298M452k8715j8946J8868K8490m272
958A7709l0682j1383K5011K4074j2924l0624k463K9417J7244k0759k7682O932
$$ plain form
970 -16130 14973 23500 -3170 -24886 -9297 19937 19281 -9959 -24212 -2394 22903 14018 -15704
983 -15704 -21956 4518 24191 7779 -20226 -18035 11153 23701 726 -23274 -12294 17017
995 17017 20652 -6539 -23707 -5472 20734 15903 -12541 -22140 1265 22676 10257 -17402 -19094
1008 -19094 7661 23019 3998 -21133 -14662 13886 21640 -3120 -23129 -8380 18831 17726
1020 17726 -9880 -22590 -1503 21743 12418 -15379 -20085 5186 22645 6364 -19355 -16236
1032 -16236 11146 21970 -85 -22101 -10989 16636 19305 -6936 -22701 -4424 20404 14618
1044 14618 -12998 -21018 2376 22005 8698 -17368 -17394 8340 21558 2751 -20102 -13032 13469
1057 13469 19852 -3440 -21590 -7422 17788 16359 -9531 -21069 -1044 20463 11243 -14703
$$ packed form
970a6130L1103Q527k6670k1716J5589K9234o56k9240j4253K1818K5297q885k9722
983a5704o252K6474J9673j6412k8005K191K9188J2548k2975k4000J0980K9311
995A7017L635k7191j7168J8235K6206m831k8444r599K3405K1411j2419k7659j692
1008a9094K6755J5358j9021k5131O471K8548P754k4760k0009J4749K7211j105
1020A7726k7606j2710K1087K3246r325k7797m706K5271J7459j6281k5719L119
1032a6236K7382J0824k2055k2016J1112K7625K669k6241j5765J8277K4828n786
1044A4618k7616q020K3394J9629j3307k6066k6K5734J3218j8807k2853P070K6501
1057A3469O383k3292j8150J4168K5210j429k5890j1538K0025K1507r220k5946
$$ plain form
1069 -14703 -18475 5258 20899 5349 -17978 -14467 10529 19807 -456 -20050 -9708 15145
1081 15145 17348 -6430 -20650 -3969 18725 13381 -12089 -19409 2469 20602 7764 -16618
1093 -16618 -15972 8484 20117 1697 -19155 -11358 13380 18154 -4165 -20237 -6071 17174 14813
1106 14813 -9708 -19798 -217 19765 10113 -14717 -17372 6030 20234 4104 -17965 -13097
1118 -13097 11184 18635 -1691 -19354 -8125 15074 15747 -6937 -19199 -2899 17680 11911 -11641
1131 -11641 -17851 2662 19154 6911 -15604 -14659 8167 18635 1227 -17897 -10203 12630 16451
1144 16451 -4253 -18453 -5112 15716 13113 -8954 -17679 -35 17732 8989 -13318 -15714 5516
1157 5516 18494 3696 -16642 -11968 10680 17283 -2055 -18246 -7028 14622 14268 -7329 -17834
$$ packed form
1069a4703l772K3733J5641j5550k3327L511K4996R278k0263j9594J0342K4853
1081A5145K203k3778j4220J6681K2694n344k5470p320K1878J8133j2838k4382
1093a6618O46K4456J1633j8420k0852P797K4738M774k2319j6072J4166K3245k361
1106A4813k4521j0090J9581J9982r652k4830k655K3402J4204j6130k2069M868
1118a3097K4281P451k0326j7663J1229K3199O73k2684j2262J6300K0579n769k3552
1131a1641o210K0513J6492j2243k2515R45K2826J0468j7408j9124P694K2833L821
1144A6451k0704j4200J3341K0828k603k2067q725J7644J7767q743k2307k396K1230
1157E516J2978j4798k0338M674K2648O603j9338j6191J1218K1650l54k1597j0505
$$ plain form
1170 -17834 -1747 16915 10386 -11627 -16307 3420 18101 5690 -15276 -13373 8541 17656 328
1183 328 -17494 -9061 12918 15449 -5135 -17847 -3851 15691 11700 -9580 -16475 1089 16936
1196 16936 7550 -13015 -14153 5785 17035 2903 -15546 -10813 10063 15905 -2082 -16930 -6334
1209 -6334 13696 13079 -7027 -16418 -1292 15589 9153 -10845 -14613 3401 16292 4877 -13768
1222 -13768 -11836 7760 15826 239 -15790 -8192 11808 14087 -4845 -16465 -3303 14757 10627
1235 10627 -9374 -15257 1691 16045 6351 -12806 -12744 6289 15857 1779 -14891 -9370 10123
1248 10123 14565 -2800 -16046 -5268 13436 11938 -7462 -15627 -397 15348 8070 -11196 -13610
1261 -13610 4262 15587 3583 -13583 -10443 8073 14494 -583 -14756 -6962 11226 12683 -4818
$$ packed form
1170a7834J6087J8662o529k2013m680J9727J4681j2411k0966J903K1914R115j7328
1183C28j7822Q433K1979K531k0584j2712J3996J9542l991k1280o895J7564J5847
1196A6936r386k0565j138J9938J1250j4132j8449M733K0876N842j7987j4848J0596
1209f334K0030o17k0106r391J5126J6881o436j9998l768J8014J2891j1415j8645
1222a3768J932J9596Q066j5587j6029P598K0000K279j8932j1620J3162J8060m130
1235A0627k0001n883J6948J4354r694j9157O2J9033R568j4078j6670N521J9493
1248A0123M442j7365j3246J0778J8704j498j9400q165J5230J5745p278j9266k414
1261a3610J7872J1325j2004j7166L140J8516O421j5077j4173P794J8188J457j7501
$$ plain form
1274 -4818 -15108 -2801 13656 9634 -8794 -14017 1736 14828 5658 -11894 -11523 6008 14399
1287 14399 1308 -13605 -8205 9370 12947 -2776 -14358 -4471 12144 10621 -6805 -14073 -266
1300 -266 13994 7259 -10421 -12451 4259 14541 2959 -12970 -9342 8191 13356 -1399 -13988
1313 -13988 -5702 11014 11269 -5289 -13938 -1812 13020 8418 -8798 -12908 2305 14081 4726
1326 4726 -11722 -10542 6419 13642 456 -13270 -7098 9558 11839 -3475 -13534 -3430 11669
1339 11669 9331 -6841 -12778 307 12909 6299 -9721 -11228 4085 13298 2553 -12004 -8525
1352 -8525 7695 12302 -1507 -12951 -4984 10339 10127 -5170 -12649 -1251 11903 7291 -8137
1365 -8137 -11432 2324 12679 4099 -10669 -9486 5980 12484 209 -12382 -6359 9136 10868
$$ packed form
1274d818j0290J2307J6457m022j8428n223J5753J3092r170j7552L71J7531Q391
1287A4399j3091j4913N400J7575L577j5723j1582R887J6615j523j7426p268J3807
1300b66J4260o735j7680k030J6710J0282j1582j5929L628J7533N165j4755j2589
1313a3988Q286J6716K55j6558q649J2126J4832m602j7216m110J5213J1776r355
1326D726j6448J180J6961P223j3186j3726O172J6656K281j5314j0059J0104J5099
1339A1669k338j6172n937J3085J2602o610j6020j507J5313R213j0745j4557L479
1352h525J6220M607j3809j1444P967J5323k12j5297p479J1398J3154m612j5428
1365h137l295J3756J0355q580j4768J183J5466O504j2275j2591O023J5495J732
$$ plain form
1378 10868 -3690 -12649 -2648 11215 8231 -7002 -11686 1017 12077 5154 -9455 -10000 4372
1391 4372 12242 1806 -11368 -7521 7591 11301 -1901 -12245 -4254 10078 9248 -5411 -11857
1404 -11857 -520 11463 6277 -8152 -10332 2793 11706 3195 -10058 -8305 5820 11255 -106
1417 -106 -11308 -5632 8510 9911 -3573 -11708 -2241 10555 7435 -6774 -10722 1344 11271 4369
1431 4369 -8970 -8907 4409 11075 1206 -10435 -6513 7099 10135 -1983 -11177 -3668 9389 8340
1445 8340 -5269 -10964 -197 10764 5539 -7921 -9458 3115 10958 2415 -9657 -7254 5904
1458 5904 10155 -696 -10450 -4688 8069 8830 -3619 -10696 -1719 9852 6646 -6520 -9889 1565
1472 1565 10618 3713 -8712 -8009 4636 10245 539 -9841 -5512 6952 9034 -2332 -10246 -2893
$$ packed form
1378A0868j4558q959J0001J3863k984j5233m684J2703J1060o923j4609n45J4372
1391D372P870j0436j3174L847J5112L710j3202j0344P991J4332q30j4659o446
1404a1857J1337J1983n186j4429k180J3125Q913q511j3253J753J4125N435j1361
1417a06j1202N676J4142J401j3484q135R467J2796l120j4209l948J2066R927o902
1431D369j3339O3J3316O666r869j1641L922J3612L036j2118r194P509J3057j049
1445H340j3609n695J0767J0961n225j3460j537J2573P843q543j2072K403J3158
1458E904M251j0851r754N762J2757P61j2449p077Q977J1571l206j3166l369J1454
1472A565R053o905j2425P03J2645N609r706j0380M329J2464K082j1366p914P353
$$ plain form
1486 -2893 8791 7358 -5115 -9943 127 10031 4906 -7584 -8688 3260 10263 1830 -9278
1499 -9278 -6433 5973 9357 -1192 -9867 -3804 7890 7796 -3878 -9746 -1105 9161 5779 -6243
1513 -6243 -8967 1738 9861 3219 -8270 -7320 4596 9529 186 -9357 -4864 6832 8253 -2595
1527 -2595 -9431 -2211 8239 6427 -4905 -8908 349 9121 4287 -6983 -7797 3096 9376 1588
1541 1588 -8571 -5847 5653 8637 -1348 -9239 -3248 7564 7006 -3954 -8919 -581 8585 4921
1555 4921 -6082 -8014 2008 9046 2549 -7782 -6500 4546 8809 -164 -8925 -4274 6782 7600
1569 7600 -2998 -9017 -1539 8122 5599 -5220 -8185 1009 8632 3388 -6871 -6895 3305 8587
1583 8587 1092 -8064 -5178 5469 7956 -1491 -8661 -2827 7191 6377 -3933 -8289 -271 8051
$$ packed form
1486b893J1684j433j2473m828J0070R904n125j2490j104J1948P003q433j1108
1499i278K845J2406L384j0549q675O063J1694r4j1674n868Q641J0266l382j2022
1513f243k724J0705Q123o642j1489R50J1916M933r343r543M493J1696J421j0848
1527b595o836P220J0450j812j1332m003R257Q772m834j1270q14J0893O280p788
1541A588j0159K724J1500K984r985p891N991J0812n58j0960m965Q338R166l664
1555D921j1003j932J0022P038o497j0331J282J1046M263q973q761M651J1056Q18
1569G600j0598o019P478R661k523j0819k965R194P623n244j0259k4J0200N282
1583H587p495r156K886J0647K487r447p170N834J0018q14j0310m356Q018Q322
$$ plain form
1597 8051 4340 -5783 -7201 2084 8221 2126 -7075 -5735 4142 7884 -150 -7985 -3861 6093 6929
1612 6929 -2637 -8234 -1441 7506 5162 -4946 -7592 1163 8087 2869 -6583 -6149 3436 7856 573
1627 573 -7555 -4435 5317 7154 -1751 -8073 -2306 6948 5783 -4083 -7830 199 7912 3706 -6013
1642 -6013 -6674 2613 7886 1390 -7101 -4981 4485 7250 -753 -7598 -3149 5952 6197 -2806 -7637
1657 -7637 -1076 7107 4673 -4724 -7030 1188 7591 2617 -6208 -5697 3310 7294 407 -6977 -3929
1672 -3929 4922 6427 -1592 -7211 -2100 6162 5239 -3538 -7077 5 7100 3539 -5373 -6208 2312
1687 2312 7322 1295 -6665 -4575 4337 6691 -965 -7116 -2624 5759 5540 -2952 -7046 -600 6755
1702 6755 4014 -4770 -6444 1535 7240 2085 -6225 -5175 3657 6973 -173 -7012 -3316 5264 5924
$$ packed form
1597H051l711j0123j418R285O137o095r201J340R877L742q034p835M124R954Q36
1612F929r566n597O793Q947k344j0108k646Q755O924n218r452M34R585M420p283
1627E73q128L120R752J837q905o322N767R254j165r866l747Q029P713m206r719
1642f013o61R287N273o496q491K120R466K765q003o845M449R101K45r003m831
1657g637O561Q183k434r397k306Q218O403m974q825N11R007L984o887p384L048
1672c929Q851J505q019n619N111Q262r23q777l539P082P095l561q912q35Q520
1687B312N010o027p960K090Q912K354p656o151M492Q383k19q492m094O446P355
1702F755k741q784j674P979N705n155q310J050Q832L316p146o839L696Q580O60
$$ plain form
1717 5924 -2230 -6985 -1347 6230 4533 -3859 -6479 506 6725 2979 -5192 -5654 2348 6873 1116
1732 1116 -6297 -4241 4138 6295 -949 -6711 -2415 5411 5123 -2776 -6457 -523 6125 3676 -4213
1747 -4213 -5825 1234 6476 2053 -5510 -4840 3108 6391 35 -6377 -3215 4788 5574 -2032 -6569
1762 -6569 -1236 5905 4135 -3819 -6011 766 6357 2481 -5083 -5061 2537 6391 685 -6076 -3751
1777 -3751 4212 5877 -1269 -6525 -1979 5556 4760 -3167 -6267 18 6184 3109 -4532 -5370 1733
1792 1733 6224 1508 -5410 -4292 3226 5941 -161 -6023 -2920 4552 5243 -1896 -6190 -1192 5577
1807 5577 3965 -3534 -5688 635 5932 2374 -4682 -4755 2226 5847 741 -5456 -3518 3651 5378
1822 5378 -919 -5901 -2070 4886 4519 -2685 -5867 -181 5760 3026 -4227 -5087 1682 5890 1254
$$ packed form
1717E924q154m755N638P577j697q392k620O985O219l746q171m62Q002M525n757
1732A116p413K056Q379K157p244n762M296P826k88p899l681N934O648k449p889
1747d213j612P059N242m423p563O70P948L283o356o412L162Q003P86p606m537
1762f569N333P141j770p954k192O777N591l876p564K2P598L854n706o761K325
1777c751P963J665p146n256M546P535p96p927l100O285O166l075p641q38P103
1792A733M491m716o918J118P518K715o102n862L103P472O91p139m294M998O769
1807E577j612p499k154O323N297l558p056p3O981L621n106o197J938P169J727
1822E378o297m982L831O956l67p204l182N686N941k734p253q60O769M208m636
$$ plain form
1837 1254 -5227 -3874 3252 5487 -438 -5688 -2448 4446 4760 -2070 -5845 -850 5457 3569 -3686
1852 -3686 -5399 999 5874 1941 -4849 -4367 2639 5642 238 -5477 -3009 3876 4968 -1275 -5596
1867 -5596 -1613 4778 4092 -2694 -5481 -80 5417 2812 -4019 -4843 1564 5627 1248 -4988 -3714
1882 -3714 3072 5197 -444 -5365 -2299 4115 4401 -1830 -5351 -895 4927 3403 -3233 -5051 708
1897 708 5417 1988 -4440 -4226 2371 5397 314 -5204 -2844 3730 4675 -1339 -5314 -1357 4610 3727
1913 3727 -2724 -5089 165 5184 2460 -3929 -4485 1690 5366 1006 -4890 -3459 3178 5010 -677
1928 -677 -5296 -1959 4257 4090 -2164 -5156 -478 4880 2952 -3360 -4661 933 5133 1728 -4285
1943 -4285 -3948 2313 5122 241 -5029 -2739 3630 4507 -1359 -5154 -1270 4471 3508 -2690 -4856 207
$$ packed form
1837A254o481J353P126K235n925n250L240O894L14o830l775M995O307j888p255
1852c686j713O398M875l933o790M82P006L003n404n715K468O885J092o243m321
1867e596L983O391o86o786k787N401N497k605o831q24O407M063m379o236J274
1882c714O786K125n641m921L066O414K86o231l521M456N822j524o636j818N759
1897G08M709l429o428K14O597L026n083n518K360O574R45o014l975L957N967q83
1913C727o451k365N254N019k724o389n56O175L676m360n896J431O637J832n687
1928f77m619L337O216j67o254k992M678N358j928o312j301N594M200l405o013
1943d285L37O261K809m881n270K290O369Q77n866l795L884N741r63o198k166N063
$$ plain form
1959 207 4895 2303 -3690 -4188 1532 5002 1044 -4529 -3302 2895 4763 -525 -5005 -1977 4019
1974 4019 3992 -2009 -4983 -462 4722 2815 -3274 -4416 1000 4880 1518 -4082 -3611 2256 4799 149
1990 149 -4745 -2528 3493 4279 -1347 -4987 -1152 4427 3336 -2772 -4667 437 4833 1984 -3764
2005 -3764 -3885 1742 4764 675 -4432 -2946 2944 4455 -691 -4813 -1739 3950 3751 -2077 -4827
2020 -4827 -326 4656 2635 -3312 -4239 1154 4784 1302 -4092 -3380 2366 4565 -24 -4560 -2303
2035 -2303 3382 4058 -1278 -4719 -1118 4197 3260 -2598 -4568 322 4699 2006 -3655 -3801 1722 4640
2051 4640 653 -4301 -2813 2833 4237 -667 -4584 -1687 3715 3595 -1903 -4600 -379 4437 2577
2066 2577 -3173 -4157 1102 4685 1208 -4077 -3225 2453 4444 -229 -4523 -2044 3459 3778 -1534 -4540
$$ packed form
1959B07M688k592n993m98N720L470l958n573J227O197J868n288m480L028N996
1974D019k7o001k974M521N184j907o089j142N416L880l362n600M71N867K543m650
1990A49m894K217O021P86n626l640L835N579j091o108j895N104M396k849n748
2005c764j21N627L022m089n107J486N890J511n146m122L074N689j99n828k750
2020d827M501M982k021n947r27N393L630l482n394P12N746K199m589m536K257
2035b303N685O76n336l441L601N315r37n858j970M890M377k693n661j46N523K918
2051D640l987m954J488N646J404m904l917K897N402j20n498k697M221M816j860
2066B577n750r84N259L583l477n285Q52N678J991m673m294K479N503L19n312l006
$$ plain form
2082 -4540 -798 4148 2912 -2690 -4283 563 4592 1736 -3739 -3609 1932 4591 362 -4388 -2532
2097 -2532 3092 4077 -993 -4515 -1297 3795 3272 -2071 -4356 -158 4308 2381 -3109 -3956 1111 4541
2113 4541 1187 -3933 -3195 2323 4359 -137 -4409 -2063 3332 3716 -1403 -4374 -840 3934 2849
2128 2849 -2517 -4142 432 4358 1769 -3465 -3524 1687 4397 510 -4185 -2597 2937 4024 -995
2143 -995 -4450 -1201 3821 3112 -2241 -4210 117 4277 2031 -3253 -3674 1391 4366 843 -3951 -2856
2159 -2856 2552 4198 -480 -4440 -1686 3593 3458 -1823 -4340 -382 4125 2520 -2822 -3934 827
2174 827 4330 1398 -3561 -3235 1838 4230 343 -4086 -2432 2885 3899 -919 -4343 -1287 3697
2189 3697 3173 -2081 -4226 -48 4193 2140 -3074 -3643 1191 4210 994 -3703 -2915 2244 4067 -233
$$ packed form
2082d540L742M946j236n602j593M846M029k856n475J30N541K659m229m750J856
2097b532N624R85n070l522L218N092n23n343k285M198M466j927n490q47N067L430
2113D541l354n120P38N518K036m496m272K346N395L84n119k971L534M774j085
2128B849n366j625M574L926k589n234n9N211K710l887m695J588N534J087n019
2143i95l455L249N022p09n353j969M327M160k246n284m21N065K975l523m794J095
2159b856N408J646m678l960K754N279j35n281k517L958M507j605n342j112M761
2174H27L503k932m959L26N073K392l887m429J654N317J014m818l424L056M984
2189C697n24n254k145M178M241k053n214n69M834L019l216m697P88N159J823m300
$$ plain form
2205 -233 -4218 -1846 3308 3503 -1567 -4293 -537 4063 2523 -2823 -3895 910 4291 1212 -3624
2220 -3624 -3019 2102 4085 -36 -4138 -2029 3127 3611 -1309 -4261 -839 3860 2817 -2462 -4057
2235 -4057 436 4291 1680 -3427 -3372 1681 4198 461 -3922 -2477 2639 3837 -652 -4153 -1524
2250 -1524 3338 3261 -1676 -4157 -473 3951 2484 -2682 -3847 761 4212 1345 -3521 -3108 1916 4055
2266 4055 168 -3950 -2145 2839 3604 -1005 -4109 -1069 3571 2861 -2141 -3965 185 4083 1828
2281 1828 -3195 -3386 1557 4160 490 -3887 -2382 2717 3714 -858 -4122 -1185 3528 2940 -2031 -3942
2297 -3942 25 3948 1989 -2972 -3505 1234 4157 845 -3752 -2710 2379 3903 -408 -4080 -1669
2312 -1669 3213 3272 -1533 -4015 -546 3695 2470 -2396 -3714 455 3975 1604 -3171 -3247 1533 4029
$$ packed form
2205b33l985K372N154J95n070k726L756M600j540n346j072M805L381l079m836
2220c624O05N121J983m121m102K109N156M84m920k952L422M699j043n279j595
2235d057M493L855k611n107N5N053K517l737m383J445N116J198m489l501K629
2250a524M862p7m937k481L684M424j467n166j165M608L451k867m866M13N024K139
2266D055l887m118J805M984P65m609l104L040M640p10n002j824M150L898k255
2281A828n023j91M943K603l670m377J505N099R97m572l264K937M713n88m971j911
2297c942L967L923j959m961n33M739K923l312m597J042N089J524m311l672K411
2312a669M882N9m805k482L469M241j225m866j318M169L520k371m775p6M780K496
$$ plain form
2328 4029 524 -3761 -2443 2525 3719 -629 -4031 -1378 3327 3026 -1760 -3890 -210 3758 2143
2343 2143 -2656 -3491 938 3971 1061 -3457 -2780 2071 3815 -182 -3927 -1734 3106 3243 -1534 -3981
2359 -3981 -402 3727 2226 -2591 -3518 828 3930 1156 -3339 -2832 1913 3781 0 -3796 -1956
2374 -1956 2834 3391 -1162 -3986 -831 3575 2585 -2240 -3710 311 3842 1644 -3003 -3184 1336 3862
2390 3862 645 -3503 -2446 2206 3610 -337 -3823 -1633 2996 3171 -1395 -3871 -536 3591 2369
2405 2369 -2384 -3566 601 3855 1327 -3164 -2888 1681 3714 216 -3569 -2035 2559 3341 -912
2420 -912 -3826 -976 3344 2622 -2057 -3636 290 3775 1576 -2984 -3036 1500 3729 340 -3537 -2112
2436 -2112 2457 3342 -776 -3718 -1105 3171 2699 -1809 -3642 -25 3620 1859 -2692 -3215 1084 3766
$$ packed form
2328D029l505m285J318M968J194m348l402K653M705l01m786k130L680L968j615
2343B143m799q35M429L033k910m518O77M851J744l997l745K193M840J37m777k447
2359c981L579M129j501m817r27M346L102k774m495N07M745J868l781l796J840
2374a956M790N57m553k824L155M406r90m825j470M021L531k198m647j81M520K526
2390C862l217m148J057M652J404l947l486K190M629J75m566k476L335M127j222
2405B369m753j182M167L254k528m491K76M569K033l498l785J534M594P82m253
2420i12k914K850M320p22m679j579L926L485k199m560n2M536K229l389l877J425
2436b112M569Q85m118k942K613M276m72m508j833L617L645j761m551n23M299K682
$$ plain form
2452 3766 810 -3364 -2483 2069 3505 -276 -3617 -1590 2781 3023 -1189 -3630 -686 3301 2400 -2061
2468 -2061 -3457 303 3635 1567 -2868 -3007 1370 3691 475 -3416 -2170 2297 3319 -608 -3613
2483 -3613 -1208 2981 2713 -1603 -3500 -156 3430 1875 -2496 -3141 942 3616 834 -3231 -2417 2031
2499 2031 3419 -355 -3561 -1399 2851 2809 -1468 -3508 -288 3336 1971 -2330 -3129 717 3497 1070
2515 1070 -2985 -2595 1680 3453 39 -3435 -1754 2558 3048 -1002 -3530 -769 3131 2346 -1899 -3292
2531 -3292 212 3382 1540 -2552 -2845 1102 3438 657 -3102 -2250 1985 3256 -336 -3422 -1390
2546 -1390 2732 2768 -1345 -3431 -359 3226 1955 -2216 -3065 668 3360 1030 -2826 -2470 1597 3276
2562 3276 54 -3248 -1690 2423 2891 -1005 -3400 -687 3068 2181 -1996 -3164 431 3346 1222
$$ packed form
2452C766k956m174Q81M552J436l781l341K027M371K42m212k441K944L987r01m461
2468b061j396L760L332k068m435j39M377K321l216l891J246M467J022l927l005
2483c613K405M189k68m316j897L344L586j555m371o45M083K674k782m065Q14M448
2499B031J388l774l206K162M250m2m277k040L220L624j365m301p99L846K780k427
2515A070m055L90M275J773l414l474J681M312M90m050k528K761L900p85m245j393
2531c292L504L170j842m092k93L947K336k781l759Q52M235J271l592l086K032
2546a390M122L6m113k086L072L585j271m171q49L733K692k330l856L56M067J679
2562C276l222l302J558M113M68l896k395K713L755q87m177j168L595K915k124
$$ plain form
2577 1222 -2693 -2569 1381 3244 260 -3104 -1836 2183 2972 -675 -3300 -985 2819 2427 -1617 -3220
2593 -3220 4 3229 1632 -2397 -2808 979 3300 710 -2919 -2174 1801 3073 -202 -3165 -1396
2608 -1396 2444 2683 -1059 -3213 -571 2947 2076 -1910 -3049 389 3227 1209 -2626 -2514 1371 3176
2624 3176 222 -3020 -1740 2122 2802 -713 -3143 -889 2692 2272 -1560 -3060 32 3084 1506
2639 1506 -2360 -2681 1032 3181 556 -2886 -1981 1894 2913 -428 -3107 -1130 2523 2377 -1290 -3028
2655 -3028 -237 2909 1735 -2022 -2752 642 3100 945 -2620 -2255 1505 3035 11 -3004 -1487
2670 -1487 2249 2601 -895 -3042 -633 2704 2005 -1662 -2853 188 2939 1310 -2291 -2493 1034 3030
2686 3030 462 -2785 -1868 1855 2779 -467 -3012 -1046 2475 2251 -1319 -2919 -158 2814 1579 -1990
$$ packed form
2577A222l915J24L950J863k984l364J268M019P89l647k625K315L804l92m044j603
2593c220L224L225j597m029m11L787K321k590l629P45L975J272l275k963J769
2608a396L840K39l742k154K642L518q71l986j139L438K838k018l835J12L885J805
2624C176k954l242J280L862O80l515k430K254L581m20l832j500L092L052j578
2639A506l866l21L713K149k625l442R05L875J019l341k679J977L653j46l667j738
2655c028K791L146j174l757p30L394K458k155l565L65L760J530l024l015J517
2670a487L736L52l496k147K409L337o99l667j191L041K751j629l601k02L527J996
2686C030k568l247R17L723R24l246k545J966L521k24l570j600K761K972j235l569
$$ plain form
2702 -1990 -2587 688 2933 801 -2531 -2071 1495 2832 -60 -2879 -1379 2197 2479 -968 -2940 -481
2718 -481 2698 1839 -1743 -2673 386 2855 1065 -2303 -2227 1172 2828 285 -2674 -1638 1871 2610
2734 2610 -568 -2891 -875 2472 2081 -1426 -2783 20 2757 1371 -2057 -2399 835 2805 583
2749 583 -2520 -1877 1527 2633 -212 -2745 -1205 2161 2276 -1026 -2813 -397 2597 1686 -1757 -2559
2765 -2559 461 2791 920 -2298 -2062 1245 2670 119 -2597 -1448 1836 2397 -618 -2723 -731
2780 -731 2375 1944 -1382 -2650 76 2686 1272 -2049 -2282 905 2707 472 -2443 -1682 1571 2475
2796 2475 -312 -2623 -1027 2107 2082 -1048 -2620 -276 2490 1533 -1725 -2393 514 2653 793 -2265
2812 -2265 -1930 1283 2548 -7 -2533 -1270 1880 2196 -763 -2569 -554 2265 1716 -1404 -2441 159
$$ packed form
2702a990n97L275K245k132l332M60L566J337k892k819J500L576K82l447j972K459
2718d81L179q59l582r30L059K469j790l368P6L399J656k543k959J036L509P39
2734B610l178k323K016L347l91l507j357K803K737j386l428l42L234J970k222
2749E83l103O43L404J106k845k533J540L366J15l302j787K416K994r11l443q02
2765b559L020K330j871l218K36L307J425k551k716J149L284N61l015k105J992
2780g31L106m31l326j268K726K610j414l321k33L187J802k235k915P61L253R04
2796B475k787k311J596L134k5l130j572K344K766r57l258o68K907K139j860l058
2812b265L35L213J265k555k526J263L150L16k959j806K015K819n49l120j037K600
$$ plain form
2828 159 2535 1125 -1981 -2107 923 2564 364 -2387 -1546 1613 2334 -423 -2512 -845 2075 1911
2844 1911 -1064 -2437 -174 2353 1376 -1655 -2212 553 2508 734 -2134 -1810 1239 2426 -22 -2438
2860 -2438 -1185 1821 2078 -746 -2440 -477 2186 1590 -1380 -2283 227 2368 970 -1877 -1945 867
2876 867 2391 343 -2257 -1464 1530 2210 -456 -2415 -769 2012 1758 -1112 -2319 -57 2272 1195
2892 1195 -1657 -2026 605 2331 587 -2021 -1639 1225 2266 -106 -2299 -1041 1780 1931 -789 -2326
2908 -2326 -383 2134 1459 -1396 -2130 324 2273 856 -1809 -1764 895 2243 243 -2124 -1317 1458
2924 1458 2057 -427 -2277 -735 1927 1700 -1084 -2226 -43 2196 1103 -1619 -1904 605 2202 502
2940 502 -1951 -1510 1177 2100 -118 -2149 -988 1664 1818 -743 -2215 -373 2037 1369 -1344 -2028
$$ packed form
2828A59K376j410l106j26L030J641k200k751Q41L159P21k757k089J667K920j64
2844A911k975j373K263K527r77l031n57K765J955j774k868L24L049J187k448k416
2860b438J253L006K57k824j694J963K663n96k970r03K510K141j398k847o8K812
2876H67J524k048k600P93K994O80k666j959J646K781k54k870j207K262K329j077
2892A195k852l69K631J726j744k608L82K864J041k372k193J258K821J51k720j537
2908b326J943K517o75k855p34K454J949j417k665M5K659J348k000k367Q07K775
2924A458N99k484j850J542K662k27k784j142K183K239j093k722k85K509J597j700
2940E02k453M41K687R23k218k031J161K652J54k561j472J842K410o68k713o84
$$ plain form
2956 -2028 334 2171 764 -1759 -1643 919 2114 163 -2023 -1168 1431 1893 -435 -2110 -628 1809
2972 1809 1560 -1017 -2079 0 2081 1035 -1545 -1796 630 2108 428 -1878 -1354 1191 1955 -190
2988 -190 -2018 -842 1572 1653 -740 -2051 -326 1885 1254 -1265 -1895 325 2059 701 -1694 -1552
3004 -1552 892 1984 90 -1932 -1069 1365 1760 -470 -1986 -554 1683 1423 -974 -1915 3 1925
3020 1925 977 -1422 -1684 589 1992 434 -1773 -1309 1118 1872 -172 -1932 -792 1517 1562 -692
3036 -692 -1882 -263 1763 1180 -1157 -1781 269 1918 696 -1566 -1474 828 1891 123 -1832 -1021
3052 -1021 1311 1650 -477 -1878 -486 1607 1291 -942 -1786 45 1802 863 -1375 -1542 568 1834
3068 1834 340 -1664 -1202 1062 1739 -202 -1840 -703 1464 1406 -741 -1789 -183 1681 1044 -1136
$$ packed form
2956b028K362J837j407k523J16K562J195j951k186Q55K599M62k328j675J482K437
2972A809k49k577j062K079K081j046k580k51K426J478j680k306N24K545P64k145
2988a90j828J176K414Q1k393j311J725K211o31k519o30K220J734j358k395J42
3004a552K444J092j894k022Q63K434L95k230j516J432K237k60k397r41J918J922
3020A925r48k399k62K273J403j558k207M64K427P54k044j760J140K309M5k254
3036f92j190J619K026n83k337o24K050J649j222k262R2K302J063j768j955Q11
3052a021K332L39k127j401J392K093l16k233q44J831J757r39k238j67K110J266
3068A834j494k004M62K264O77j941j638J137K167n8k147j048J606J864o37k180
$$ plain form
3084 -1136 -1618 336 1780 598 -1447 -1344 767 1764 148 -1723 -999 1248 1622 -422 -1790 -464
3100 -464 1551 1268 -875 -1709 18 1717 858 -1263 -1487 504 1737 405 -1544 -1202 933 1672 -122
3117 -122 -1742 -724 1353 1396 -652 -1718 -209 1624 1015 -1111 -1542 327 1674 508 -1400 -1223
3133 -1223 770 1607 40 -1604 -846 1167 1427 -465 -1672 -376 1481 1134 -911 -1572 132 1646
3149 1646 698 -1260 -1312 566 1598 262 -1444 -1024 948 1541 -157 -1611 -661 1282 1332 -585 -1636
3166 -1636 -232 1523 1022 -1020 -1536 260 1633 570 -1337 -1259 671 1592 146 -1537 -928 1059
3182 1059 1446 -320 -1607 -493 1329 1178 -766 -1569 -9 1560 763 -1189 -1338 516 1561 261
3198 261 -1412 -971 927 1411 -202 -1493 -527 1216 1156 -617 -1461 -104 1441 831 -1022 -1335 367
$$ packed form
3084a136m82J954J444j182k045J03K111R97j616j871P24K247L74k044j368J326
3100d64K015k83k143q34J727J699q59k121k24J991J233j332j949L42K135P39j794
3117a22j620J018K077M3k048j066J509J833o09k126m31J869J347j166j908J77
3133a223J993Q37j567j644P58K013K60j892j207J296J857l47k045o61J704J514
3149A646r48j958n2J878J032j336j706M20J972N93j698j454R50J943N0j917j051
3166a636J404J755n01k042n16J796J373j063j907P8J930R21j446j683O09J987
3182A059L87j766j287J114J822j51j944q03J560J569p97j952j49J854J045j300
3198B61j673M41J898M84j613j291R66J743o0j773q44J357J545o10j853l13J702
$$ plain form
3215 367 1521 401 -1303 -1041 779 1446 -28 -1450 -704 1099 1270 -423 -1460 -316 1317 1028
3231 1028 -780 -1449 40 1484 722 -1132 -1316 450 1536 345 -1400 -1046 867 1482 -124 -1533
3247 -1533 -670 1175 1242 -537 -1522 -267 1379 977 -915 -1423 197 1503 534 -1235 -1166 658 1471
3264 1471 71 -1423 -755 1050 1251 -414 -1430 -281 1264 919 -796 -1314 147 1387 548 -1095
3280 -1095 -1077 543 1354 164 -1295 -797 906 1270 -274 -1388 -391 1183 1010 -646 -1336 -38 1319
3297 1319 737 -947 -1232 301 1398 425 -1169 -1054 644 1421 73 -1394 -787 1003 1295 -358 -1471
3314 -1471 -403 1257 1046 -735 -1415 -5 1410 713 -1062 -1231 425 1446 306 -1274 -952 799
3330 799 1361 -141 -1436 -552 1141 1095 -594 -1367 -91 1319 733 -935 -1166 369 1321 283 -1152
$$ packed form
3215C67J154j120j704K62J820O67j474j422P46J803J71j693j037J144J633k89
3231A028j808o69J489J444p62j854j84J766J086j191j745L54J913O15j606j409
3247a533Q63J845O7j779r85J255J646m02j892n08J620J306r69j769O9J824Q13
3264A471j400j494O68J805K01j665j016J149J545l45j715n18J461J240q39j643
3280a095J8J620Q11j190j459M98J703L64j544j114R97J574j73j656o90J298J357
3297A319n82j684k85J533J097r73j594J15J698P77j348j467O07J790K92j653j113
3314a471J068J660k11j781o80J410J415o97j775j69J656J021j140j580L22J751
3330G99N62j502j295Q84J693m6j689p73J276J410n86j668k31J535R52j038j435
$$ plain form
3347 -1152 -865 699 1210 -82 -1269 -549 985 1051 -480 -1290 -184 1199 788 -807 -1197 214 1301
3364 1301 451 -1081 -983 555 1269 126 -1232 -784 835 1228 -222 -1366 -490 1108 1057 -580 -1372
3381 -1372 -141 1308 811 -923 -1279 283 1423 444 -1195 -1033 648 1370 40 -1336 -714 978
3397 978 1202 -358 -1351 -315 1210 933 -738 -1288 127 1349 539 -1067 -1018 566 1283 64 -1199
3414 -1199 -668 851 1095 -322 -1244 -304 1065 851 -644 -1162 52 1207 557 -943 -1027 436 1236
3431 1236 185 -1155 -776 738 1151 -146 -1247 -513 991 1007 -485 -1263 -175 1163 806 -762 -1222
3448 -1222 131 1312 532 -1064 -1080 518 1355 163 -1281 -804 867 1248 -242 -1343 -430 1129 1008
3465 1008 -596 -1288 -55 1277 701 -908 -1151 350 1310 305 -1156 -851 725 1194 -122 -1255
$$ packed form
3347a152K87J564N11j292j187P20J534O6j531q10J106J383m11j595l90J411J087
3364A301q50j532R8J538P14j143j358M48J619L93j450j144Q76J598n1j637p92
3381a372J231J449m97j734l56J562J140r79j639J62J681P22j330j376O22J692
3397I78K24j560r93J036J525k77j671n50J415J222q10j606M9J584P17j219j263
3414a199N31J519K44j417r22R40J369k14j495n18J214J155o50j500q4J463Q00
3431A236j051j340L79J514M13j297j101P34J504J6j492p78J088J338l57j568m60
3448a222J353J181p80j596j6J598Q37j192j444M77J671L81j490j101R13J559j21
3465A008j604o92J233J332n76j609k43J501R60j005j461L05J576M69j316j133
$$ plain form
3481 -1255 -492 1004 962 -526 -1186 -68 1140 634 -811 -1021 280 1171 305 -1030 -814 600 1130
3498 1130 -44 -1152 -548 875 1008 -388 -1216 -230 1093 777 -686 -1119 106 1189 521 -929 -1009
3515 -1009 410 1227 196 -1121 -801 728 1192 -105 -1252 -518 1024 1042 -499 -1269 -120 1196 762
3532 762 -811 -1155 235 1273 411 -1062 -913 588 1218 31 -1168 -624 876 1063 -347 -1217 -241
3549 -241 1095 765 -713 -1116 144 1177 410 -964 -890 524 1122 46 -1087 -587 766 990 -261
3566 -261 -1128 -320 993 797 -589 -1108 36 1139 540 -857 -983 368 1156 225 -1040 -746 657
3583 657 1098 -81 -1137 -501 904 982 -404 -1195 -195 1084 758 -698 -1118 151 1218 475 -964
3600 -964 -943 512 1203 106 -1125 -656 795 1070 -248 -1177 -327 1000 833 -571 -1113 10 1122
$$ packed form
3481a255P63J496m2j488o60J118J208n06j445k10J301Q91q66j335K16J414N30
3498A130j174j108O04J423J33j396q28R86J323l16j463m33J225J083o68j450q0
3515a009J419Q17j031j317L20J529M64j297j147P34J542J8j541p70J149J316m34
3532G62j573l44J390J038q62j473J49J501O30j187j199N44J500J87j410q70R76
3549b41J336l30j478m03J260J033p67j374P4J414N98j076j133N00J353K24j251
3566b61q67Q08J313j96j386n19J144J103n99j397j26J351P88r31j265K94J403
3583F57M41j179j056O36J405P8j386p91J000J279l26j456m20J269J067p43j439
3600i64K1J455O91j097j231M69J451K75j318r29Q50J327j67j404n42J123J112
$$ plain form
3617 1122 538 -859 -958 385 1134 181 -1042 -677 686 1016 -188 -1103 -371 909 815 -499 -1052 -52
3635 -52 1040 574 -760 -969 260 1098 273 -954 -765 571 1072 -33 -1084 -512 832 939 -370
3652 -370 -1102 -200 1013 712 -643 -1038 108 1105 458 -867 -886 415 1117 170 -1057 -698 715 1058
3670 1058 -194 -1134 -365 946 838 -524 -1089 -27 1068 547 -784 -949 287 1098 269 -954 -754
3687 -754 586 1048 -77 -1076 -453 850 881 -404 -1059 -117 1009 633 -696 -947 211 1061 325 -872
3705 -872 -746 503 1026 40 -1001 -531 747 913 -278 -1065 -262 943 744 -557 -1013 81 1068 463
3723 463 -804 -827 383 1053 149 -944 -633 640 986 -133 -1048 -379 840 819 -445 -1046 -84 1015
3741 1015 566 -718 -910 265 1051 264 -910 -732 526 987 -52 -1005 -470 756 851 -338 -1009 -171
$$ packed form
3617A122n84j397r9J343P49r53j223L65J363L30j204r15P32J280r4j314n53J000
3635e2J092m66j334k09J229Q38q25j227J89J336N01j105j051N72J344J07j309
3652c70p32R02J213l01j355l95J146R97o47j325j9J301P02r47j227L59J413L43
3670A058j252r40P69J311j08j362n65J062J095n21j331j65J236Q11q29j223K00
3687g54J340M62j125r99O23J303L1j285o55R42J126l76j329k51J158Q50p36j197
3705h72J26J249N23r86j041M70J278J66j191p87Q03J205j99j301m56J094R87o05
3723D63j267k3J210O70r04j093L11J273L46j119r15O69J219k1j264o01R62J099
3741A015m49j284j92J175P86p87j174J78J258M61j039r53N35J226R5j189o71Q38
$$ plain form
3759 -171 927 653 -608 -957 131 1031 389 -835 -795 434 1023 77 -963 -554 685 893 -236 -999
3777 -999 -269 867 738 -483 -973 -4 984 499 -732 -852 318 1031 205 -905 -649 590 946 -109
3795 -109 -987 -377 781 775 -397 -959 -90 932 567 -628 -878 196 967 291 -823 -722 463 941
3813 941 -3 -943 -462 711 822 -298 -964 -178 873 621 -547 -884 103 936 395 -729 -779 345
3831 345 961 144 -890 -583 620 905 -150 -965 -318 816 736 -439 -945 -40 927 522 -653 -841
3849 -841 213 967 264 -828 -677 488 937 -22 -942 -455 717 801 -311 -949 -148 880 595 -582
3867 -582 -876 148 920 306 -755 -704 384 884 33 -876 -485 600 788 -237 -900 -230 796 630
3885 630 -488 -858 60 886 391 -682 -723 302 878 152 -812 -561 537 839 -105 -876 -328 728 728
$$ packed form
3759a71J098k74j261l49J088R00o42j224M0J229N89r46j040M09J239K08j129p63
3777i99P30J136j29j221m90R69R88m85j231j20J170P13q26j110K56J239L56j055
3795a09q78O10J158oj172n62Q69J022l65j195k50J074P71o76j114J01J185M78
3813I41r44r40M81J173J11j120o66P86J051k52j168l37R87Q33n41j124n0J124
3831C45O16q17j034L07J203K85j055q15O47J134q0j175n06R05R67m05j175j88
3849h41J054P54p03j092J51J165M49r59r20M87J172Q4j112o38Q01J028k85j177
3867e82k94J024P72o14j061N1J088N00q51r09L91J085J88j025o63O70J026j66
3885F30j118l70R18Q26m95j073m1J025N76p26r64K51J098L02r44p71N48J056%
$$ plain form
3904 728 -339 -894 -101 858 554 -595 -836 181 927 314 -770 -696 421 910 37 -880 -475 630
3922 630 797 -224 -907 -244 798 636 -461 -880 36 889 398 -690 -736 332 885 123 -814 -509 556
3941 556 773 -144 -846 -274 697 624 -388 -808 -28 802 409 -606 -718 229 831 183 -721 -543 464
3960 464 794 -53 -817 -347 653 670 -292 -806 -114 748 528 -489 -771 100 844 332 -661 -669 318 850
3980 850 114 -800 -529 557 802 -148 -856 -283 715 649 -355 -845 -55 820 471 -564 -766 190 851
3999 851 232 -725 -581 434 812 -44 -827 -357 633 669 -300 -792 -95 736 465 -499 -698 141 763 236
4019 236 -623 -540 358 740 16 -705 -379 544 658 -201 -756 -163 683 507 -404 -708 70 737 313 -564
4039 -564 -612 259 749 151 -680 -504 428 729 -40 -777 -333 598 645 -287 -803 -130 722 489 -486 -729 100
$$ packed form
3904G28j067n55P93R59l04j149k41J017P46o13j084P4J117M89q73r17M05J105
3922F30J67j021o83O63J042j62j097m19R16Q53m91j088m6J068N53p62r37L05J065
3941E56K17r17p02N72R71p3j012m20P80Q30l93j015j12R47O02o48r04J78J007
3960D64L30q47p64M70J000J7r62n14O92Q62k20j017k82Q71P44n12r93qR87N32
3980H50p36r14K71J086K45r50p08N73R98o6j004m90P90Q75l49j035k02R56O61
3999H51o19r57J44J015L78q56p83M70R90L6r69m92O97Q31k71r64j99Q39O22n27
4019B36q59Q3Q98L82p24p21L26R23J14q59n55N93Q46j76r11l04P78O67m24q77
4039e64m8Q71M90n98q31J76R32L01p69p37M44R31M7r32n16O73Q52k33r75k43Q29
$$ plain form
4060 100 784 295 -630 -612 312 763 74 -730 -445 502 701 -145 -778 -236 647 546 -366 -724 10 737
4080 737 346 -558 -589 256 722 107 -636 -427 427 639 -85 -665 -243 573 521 -277 -650 -44 657 366 -458
4101 -458 -603 169 686 187 -592 -466 343 649 3 -639 -347 481 592 -185 -698 -167 595 469 -350 -673
4121 -673 9 698 346 -529 -619 228 716 147 -648 -468 413 672 -51 -691 -292 546 561 -255 -692 -91 644
4142 644 443 -416 -636 115 706 245 -566 -502 309 635 23 -633 -337 463 560 -172 -619 -137 555 415 -334
4163 -334 -577 48 598 259 -472 -492 215 598 78 -561 -369 370 548 -109 -610 -214 497 444 -267 -603 -34
4184 -34 559 322 -402 -552 113 616 200 -526 -474 284 617 38 -621 -334 438 567 -150 -644 -160 571 453
4205 453 -330 -611 4 621 323 -457 -549 201 635 136 -555 -406 362 601 -42 -613 -253 500 501 -257 -595
$$ packed form
4060A00O84m89r25J8R24M51o89q04K85R47J99q46o33N42Q83j01r12l58P34P27
4080G37l91r04l1Q45M66o15p43K09Q54K12p24n80M22Q16n2p98l73O06P01k91q24
4101d58j45P72N17m99p79J26Q09L06o46o42K92Q28J11p77n13N31P62j26q19l23
4121f73O82O89l52q75r0Q47M88n69p95J80Q81K59p23o40L99Q38J5q16m37O01P35
4142F44k01q59k20P51N91m61q11O4Q11L26o12o56K96Q00R7p32m47M82O92j40p49
4163c34k43O25N50l39p31k0P07L83n20o39J92P39J78o57n01L96P11n3p11l36N69
4184c4N93k37p24j50O65N03m16p26N2P58L33n79o59K87P72J29p17m94M84P31j18
4205D53p83k81O15O17k98p80r2P50M34m99o91J49P68K39o43n71L60P53Jp58l38
$$ plain form
4226 -595 -63 555 356 -375 -523 113 571 171 -487 -408 263 539 5 -539 -297 405 485 -164 -571 -123 499
4247 499 352 -314 -517 28 528 225 -425 -446 179 526 84 -504 -350 315 532 -51 -558 -214 469 455 -220
4268 -220 -565 -71 543 351 -360 -544 97 589 201 -480 -434 268 564 37 -543 -329 390 531 -124 -593
4288 -593 -157 498 417 -289 -557 -1 555 270 -438 -472 189 549 95 -484 -353 300 506 -49 -530 -208 392
4309 392 413 -207 -524 -64 485 302 -332 -481 102 517 153 -424 -371 241 486 26 -470 -260 361 446 -117
4330 -117 -496 -134 440 355 -254 -487 -1 519 258 -377 -446 169 543 109 -466 -343 305 515 -41 -541 -231
4351 -231 421 450 -191 -549 -90 512 343 -329 -533 69 569 216 -453 -432 223 554 35 -519 -300 351 478
4372 478 -122 -548 -158 446 367 -271 -519 -15 503 260 -372 -442 133 507 105 -452 -329 272 471 -48 -486
$$ packed form
4226e95N32O18j99p31j48O36M58m00o58P9O71K76n34n44K42P02Q0o49m07M48O22
4247D99j47o66k03N45N00l03o50k1O25L47m42n88J54O65K17n83n07L44O83j4o75
4268b20l45M94O14j92p11j84O41M92l88o81M6P02K96n27n80K14P19J41o55m69
4288e93M36O55q1p06k68N56N56k85p08l4O61L60m54n79J31O53K06n55m81L22O00
4309C92K1o20l17M60N49j83o34j49N83M15l64n77N3O12K45m60m96K10O21Q5n63
4330a17l79L62N74q5o09k33M86N20k61o35o9O15L74m34n75J23O48K10n56n00L10
4351b31O52K9o41l58M59O02j69o72k04O02N00l53o69K1O55L31n19n54K19O51J27
4372D78o00m26L90O04p9o38k48N04N18k43o32p0N75L74m02n57J23O01J99n19m38
$$ plain form
4393 -486 -201 379 378 -173 -465 -56 440 290 -292 -453 74 487 191 -396 -389 216 485 31 -483 -281 351
4414 351 461 -109 -529 -149 439 375 -259 -518 -9 510 282 -389 -494 133 552 137 -490 -397 280 531 -19
4435 -19 -555 -266 430 457 -207 -558 -87 480 331 -319 -494 47 528 193 -429 -400 208 495 41 -484 -299
4456 -299 339 462 -111 -495 -136 440 359 -236 -446 8 460 240 -324 -395 137 470 106 -419 -310 254 459
4477 459 -35 -482 -211 374 408 -179 -488 -90 460 315 -303 -486 69 517 191 -435 -399 210 517 50 -486
4498 -486 -322 341 499 -98 -567 -188 476 408 -255 -548 -17 533 273 -404 -473 155 543 125 -461 -363 294
4519 294 514 -2 -515 -227 396 441 -163 -496 -74 464 328 -302 -475 57 499 192 -388 -379 201 475 37
4540 37 -440 -267 307 430 -97 -466 -161 400 346 -226 -485 -25 491 255 -380 -454 135 518 121 -450 -353
$$ packed form
4393d86K85N80jn51k92M09M96j50n82j61N27M13k96n87PO05K69m54n14K02O32
4414C51J10n70m20L80N88o4o34k59N09N19k28o71j05O27M19m15o27R3O77K51n50
4435a9n36K89O96K7o64l51M71N67j49o50j75N41M81l35o22K9O08K87m54n25J85
4456b99O38J23n73l84L59N76q1n95k10M54M52k20n64p1N32L33l64n25J09N64K05
4477D59m94m47K71N85L4n87l09L98N50j45o18j83N55M48l26o26L6O09L07m67n36
4498d86J64O63J58n97m69L79O64o8o63k93N31N50k60o77o9O28L88m18n86R8O57
4519B94K20n16n13K88O23M5o04l33M22N38j36o30j73N32M42l07n80RN80K74m38
4540C7m77J73N74J23n27l69L05N61n4n72k59M60N16k36o35p4N89L83l97n71R7
$$ plain form
4561 -353 274 492 -15 -521 -238 410 443 -180 -545 -109 507 358 -338 -510 61 571 200 -450 -426 232 558
4582 558 64 -520 -312 370 493 -107 -548 -154 458 390 -249 -497 -29 509 282 -347 -446 139 517 123 -444
4603 -444 -345 260 477 -32 -490 -211 371 387 -175 -470 -75 445 296 -292 -452 49 488 185 -409 -399 206
4624 206 497 43 -484 -289 346 457 -118 -510 -154 451 379 -267 -511 1 530 268 -387 -475 162 561 134
4645 134 -497 -371 317 530 -19 -544 -223 443 453 -203 -553 -61 512 329 -331 -488 81 534 184 -422
4665 -422 -401 211 517 34 -495 -294 346 453 -124 -514 -146 430 356 -248 -474 7 491 242 -356 -419 146
4686 146 496 93 -439 -328 279 478 -44 -502 -216 398 431 -194 -516 -64 491 308 -330 -463 93 554
4706 554 160 -446 -392 250 526 25 -505 -283 400 493 -125 -546 -129 507 384 -280 -525 31 548 257 -406
$$ packed form
4561c53O27K18n07n06K83O48L3o23l65M36O16j49o96j72N71N10l71o50K4O58L26
4582E58m94n84K08O82J23o00m41L94O12o8o39k48M68N38k27o29r9N85L78l94n67
4603d44R9O05K17n09m58K79N82J6n62k95L95N20j49n88j60N01M39l03n94J0O05
4624B06K91m54n27J95O35J11n75l92L56O05p2o46k44N12N29k62o55q8O37L99m27
4645A34o31J26O88K13n49n25L21O66J0o56l50M92N73j83o60j57N69M53l50o06
4665d22K1O12L06m83n29K01O40J07n77l90L68N76p4o04k26M81M84k49n98o3N65
4686A46L50m03n32J11O07J99n22m58K86O14L3o25l22M52N55j83o38j33N56M61
4706E54l94o06N4O42K76n01n30K22O83R3o18m21M17O36j23o64k45N56N17k91o63
$$ plain form
4727 -406 -447 193 537 96 -474 -343 293 490 -62 -518 -195 428 414 -200 -497 -51 482 278 -351 -461 101
4748 101 510 153 -428 -372 239 485 -7 -487 -242 369 439 -141 -484 -106 467 357 -265 -490 41 518 217
4769 217 -404 -421 198 516 76 -471 -310 331 486 -84 -515 -164 442 403 -229 -520 -24 534 300 -359 -466
4790 -466 141 530 135 -454 -360 265 504 3 -508 -237 383 424 -170 -516 -87 446 321 -302 -472 53 489
4811 489 195 -399 -407 209 501 41 -490 -285 330 443 -99 -502 -141 429 357 -229 -481 -4 485 259 -354
4832 -354 -438 141 515 117 -443 -354 291 492 -38 -498 -213 403 421 -182 -513 -65 483 317 -319 -470 82
4853 82 512 175 -416 -374 219 493 21 -481 -276 340 451 -127 -498 -136 432 347 -261 -473 11 467 214
4874 214 -356 -407 152 472 75 -432 -321 286 453 -52 -486 -195 394 379 -204 -487 -45 464 275 -328 -435
$$ packed form
4727d06m1O40L44m41n70J31O36J97n52m56L23O23j4o14k97M46N33k04o29j10N62
4748A01M09l57n81N6O11K46m92m80K45O11P0n80l43L78N73j10o22k25N31M77l01
4769B17o21j7O19L18m40n47J61O41J55n70m31L51O06l9o32k91M96N58k34o59j07
4790d66O07L89l95n89R4O25K39n01n11K71O20M1n94l46M29N33j25o23j70N25M36
4811D89k94n94qO16K92m60n31K05O15J13n42m03L61N70p2n86k52M77M89k26o13
4832c54q4N79L74l98n60Q9O45K01n30m60K85O16J8o03l31M48N48j66o36j51N52
4853H2M30l37n91M2N93K74m72n02K05O16J11n78l71L62N68q5o08k12M84M56k53
4874B14n70n1N59L20l97n07J11O07J67n05m34K91N89j5n83k83M42N09j89o03j07
$$ plain form
4895 -435 99 493 147 -407 -353 235 478 15 -473 -244 360 419 -127 -502 -115 444 332 -282 -465 41 490
4916 490 205 -380 -396 189 481 48 -437 -284 296 434 -77 -476 -167 381 365 -219 -472 -19 448 247 -329
4937 -329 -425 121 474 105 -408 -321 239 435 -21 -448 -204 336 391 -156 -460 -72 433 294 -266 -436 57
4958 57 469 189 -375 -358 212 478 27 -449 -260 334 435 -105 -487 -136 411 330 -247 -455 -5 459 236
4979 236 -360 -409 146 473 77 -442 -309 260 435 -49 -468 -184 360 351 -174 -447 -54 405 267 -276 -412
5000 -412 75 444 143 -377 -327 189 426 15 -416 -243 301 384 -112 -443 -105 394 302 -227 -410 40 432
5021 432 206 -313 -362 159 445 81 -395 -272 259 412 -73 -440 -167 377 338 -210 -451 -20 434 246 -311
5042 -311 -402 92 461 122 -402 -326 209 438 -11 -449 -224 322 362 -153 -434 -76 378 274 -248 -413 33
$$ packed form
4895d35N34L94l46n54N4N88K43m63m88K29O04N9n46l75L87N59j12o14j83N06M49
4916D90k85n85j6N85K92m33m85J53N80J38n11l99L09N48j6n84k53M53M67k01n76
4937c29r6N46L53l69n13Q7N60J96m56m27K44N40N5n47l04L88N05j39n60j70M93
4958E7M12k80n64J7N70K66m51m76J89N94J01n40l82L51N47q1n77k08M50M64k23
4979B36n96m9N55L27l96n19J33N69J75m84m19K84N44rn25k73L93M59j38n43j36
5000d12M87L69l01n20N0N16K37m11m31J73N44Q3m96l31L38M99r2n29j83M50L92
5021D32k26n19m9N21K86l64m76J23N31J53m85l67K73N44l9n48k41M31M54j88n57
5042c11r1M94L69l39n24P6N35K29m49m38K25N46M0n15k81L58M54j04n22j65M46
$$ plain form
5063 33 425 166 -340 -340 160 398 46 -387 -246 247 374 -80 -412 -147 325 303 -186 -389 -19 392 215
5084 215 -287 -347 106 416 106 -348 -274 222 389 -10 -388 -183 313 349 -149 -413 -56 385 260 -255 -391
5105 -391 63 420 149 -349 -331 180 414 17 -412 -230 288 378 -101 -425 -125 350 297 -212 -411 0 404
5126 404 196 -309 -358 122 415 86 -367 -264 221 370 -42 -386 -159 298 307 -133 -387 -50 371 236 -236
5147 -236 -352 52 377 133 -305 -280 179 380 17 -350 -191 268 325 -81 -374 -94 333 261 -195 -365 18
5168 18 377 158 -286 -315 134 389 78 -377 -244 238 356 -65 -394 -137 313 301 -177 -398 -27 354 203
5189 203 -253 -342 76 379 120 -328 -276 196 384 2 -354 -172 277 319 -99 -359 -75 314 244 -205 -328
5210 -328 37 350 148 -262 -271 135 368 64 -326 -196 219 314 -56 -328 -120 284 261 -156 -337 -1 322
$$ packed form
5063C3L92k59n06%N00K38l52m33J41M93J27m54l32K65M72k2m89k03L70M11j77
5084B15n02o0M53L10l10m54P4M96J67l99l78K05M96L6m98k64L57M41j25n15j36
5105c91M54L57k71m98J8N11K34l97m29J82N18R0m79l24L00M75n3n09j99M11M04
5126D04k08n05m9M80K93l29m53J03M85J49m12l44K27M57Rm40k54L37M21j35m72
5147b36j16M04L25k44m38K5M59K01l63l67J59M59N7m06k93K80M27p2m56j70L83
5168A8L59k19m44k9M49K55l11m55J33M82J18m21l29K57M50j2m78k21L71L81j51
5189B03m56q9M18L03k59m48N2M72J88l82l56J82M49M2m18k60K84L89p0m49j23
5210c28L65L13k02m10rM06K33l04l90J30M15R5l70k72K08M04k3m17j81L36L23
$$ plain form
5231 322 176 -229 -289 83 336 93 -297 -254 191 339 -22 -354 -164 256 277 -120 -358 -66 316 220 -214
5252 -214 -328 54 346 125 -282 -265 150 351 39 -316 -192 241 300 -69 -341 -97 295 249 -157 -345 10
5273 10 325 169 -239 -289 115 340 69 -287 -218 186 302 -28 -309 -124 244 261 -105 -324 -47 307 205
5294 205 -202 -295 43 315 113 -257 -244 136 303 14 -290 -172 204 258 -70 -314 -85 263 207 -156 -305
5315 -305 15 299 142 -231 -263 94 309 64 -273 -195 194 299 -44 -308 -98 260 251 -114 -296 -37 300
5336 300 202 -184 -275 64 310 98 -271 -229 161 309 -3 -295 -151 233 265 -91 -302 -79 263 210 -156 -289
5358 -289 18 297 131 -226 -245 89 293 45 -283 -185 163 270 -43 -289 -107 227 210 -108 -278 -26 262
5379 262 147 -182 -246 59 275 82 -237 -193 141 271 17 -267 -133 219 238 -73 -273 -38 266 181 -161
$$ packed form
5231C22j46m05o0L72K53k43l90M3M45J48l61l32J90M20K1l97k38K92L82r6m34
5252b14j14L82K92k21m07J7M15K01l12l55J24M33N9l69k72K44L92m6m06j88L55
5273A0L15j56m08n0M04K25k71l56O9M04J16l30k81J85L68J7l66k19K77L54j02
5294B05m07r3L38K72k02l70J3L80J67k89l04J18L76N4l28k44K29L48n6l63j49
5315c05L20K84j57l73l2L57K15k45l37P8L89J05l43k64K10L58rl65j82K59L37
5336C00r8l86r1L39K46k12l69M2L90J48l12k92J44L84L2l56k11K23L42n3l66j33
5358b89L07K79j66l57j9L34K04k48l28R8L48J07l13k46J82L34j7l18j70K52K88
5379B62j15l29o4L05K16j93l19M4L34J30k54k84J34L52J9l11k00K35L04q5l42
$$ plain form
5400 -161 -255 38 289 119 -217 -227 104 274 43 -274 -173 194 255 -74 -297 -89 237 218 -124 -284 -11
5421 -11 278 156 -208 -243 89 291 69 -254 -199 148 262 -10 -280 -130 201 231 -82 -276 -45 245 177 -160
5443 -160 -250 27 258 95 -213 -202 103 251 38 -227 -148 161 234 -43 -237 -68 213 208 -102 -244 -1 252
5465 252 139 -159 -210 71 263 67 -222 -171 140 244 -18 -263 -114 213 212 -104 -255 -35 255 164 -167 -249
5487 -249 62 277 88 -250 -212 129 266 14 -270 -141 186 233 -65 -269 -72 222 181 -133 -264 -3 260
5508 260 126 -198 -211 71 244 50 -214 -165 132 238 -9 -217 -106 182 216 -76 -214 -46 226 145 -127
5529 -127 -206 37 236 101 -176 -179 81 228 33 -226 -137 160 212 -59 -247 -76 197 155 -126 -233 2 248
5551 248 110 -196 -214 85 256 35 -241 -175 164 258 -43 -268 -96 218 209 -114 -251 -27 258 142 -171 -233
$$ packed form
5400a61r4K93K51j70l36j0L31J70k31l17J01L67O1l29k23K08L26j9l42j60K73
5421a1K89j22l64l5L32K02k22l23N5L47J14k72k70J50L31L0l13j94K31K90o8l37
5443a60r0K77K31j63l08J1L05J48k13k65P9L09P3k77j94J69K81nl10j42K43K53
5465B52j13k98n1K81J92j96k89N1L11J04k62k45J49L27jl16j51K20K90r1l31q2
5487b49L11K15j89l38L8L41J37k52k84J29L27M7k98k04J97K94m1l14j31K61K63
5508B60j34l24j3K82J73j94k64M9K97J06k47k08J11K88L4k92j38J68K72q1k72
5529a27p9K43J99j35k77lK60J47j95k59Q9K97N2k71j88J71K73m2k81j07K35K46
5551B48j38l06j8K99J71k21k76O6L39R4l01k25J72L14rl23j37K24K85j16l13o2
$$ plain form
5573 -233 58 268 71 -214 -167 123 247 8 -234 -127 166 217 -68 -228 -64 206 174 -107 -220 6 211
5594 211 123 -149 -183 65 211 53 -174 -152 102 211 -10 -218 -112 169 171 -86 -239 -47 191 132 -152 -216
5616 -216 42 237 73 -207 -175 115 226 -4 -245 -127 182 210 -92 -255 -50 227 167 -164 -246 22 262
5637 262 107 -216 -210 101 259 36 -246 -138 154 228 -39 -249 -80 207 196 -97 -243 -20 217 151 -145 -216
5659 -216 50 214 77 -166 -164 93 209 26 -213 -129 145 184 -50 -217 -79 170 155 -114 -219 -11 223 104
5681 104 -159 -188 61 225 41 -209 -147 132 215 -41 -235 -82 197 177 -105 -248 3 250 131 -180 -221 75
5703 75 254 70 -228 -174 144 243 -13 -248 -104 199 217 -81 -243 -38 229 162 -140 -224 34 247 107 -182
5725 -182 -193 88 236 34 -215 -146 139 210 -26 -229 -101 162 181 -77 -214 -36 189 137 -148 -198 27 209
$$ packed form
5573b33K91K10j97k85M7K90J24k39k42J07K93N1k85j60J64K70l2k81j13K26K05
5594B11q8k72l4K48J46j58k27K2K54J09k21k08J06K81Kk57j53J92K38n9k84o4
5616b16K58J95j64k80L2K90J11k30k41J18L09K8l02j63K05K77o0l31q2K68K40
5637B62j55l23OL11J58k23k82J08K92P4k67k10J69K87j1k93j46K23K37o6k96p1
5659b16K66J64j37k43KK57J16j83k39Q4K74L9k34j67J38K49j5k69j05K08K34j19
5681A04k63k9K49J64j84k50O2K79Q3k56j94J53K79k0k82j43K51K47j19l11m1K96
5703G5J79j84k98N4L18R9k56k35J44L03J8k98j62K05K67o7l02q4K58K13j40k89
5725a82j1K81J48k02k49O9K85P1k36k03J28K63J9k58j37J78K25n2k85n0K25J82
$$ plain form
5747 209 82 -190 -177 94 216 5 -230 -108 177 194 -66 -222 -42 218 166 -128 -217 40 251 103 -185
5768 -185 -192 106 261 19 -250 -121 182 241 -57 -247 -65 225 186 -119 -249 11 248 120 -187 -201 78 250
5790 250 39 -222 -162 131 219 -11 -221 -116 173 198 -81 -230 -52 205 146 -134 -225 8 203 77 -165 -189
5812 -189 64 217 42 -203 -142 135 217 -24 -228 -75 190 173 -103 -219 -1 228 112 -169 -204 67 233
5833 233 54 -210 -148 142 242 -17 -243 -91 205 203 -111 -262 -19 230 142 -169 -232 58 251 56 -231 -183
5855 -183 125 244 6 -238 -128 170 216 -69 -246 -61 198 171 -131 -235 9 238 107 -186 -197 70 221
5876 221 44 -210 -158 130 217 -14 -230 -88 182 191 -79 -232 -23 218 146 -140 -204 51 249 98 -183 -161
5898 -161 123 244 10 -215 -113 180 223 -64 -223 -57 211 167 -146 -236 22 257 100 -205 -193 104 252
$$ packed form
5747B09j27k72J3K71J22k11k35J22K85J7k60j56J80K60n2k94q9K57K11j48k88
5768a85pK98J55k42k69J29L03N9k98j90J82K90l9l05j30K60K37j28l07j4K79J72
5790B50k11k61O0K93Q8k30k10J05K89K5k79j49J78K57n9k80r1K33J95j26k42k4
5812a89K53J53j75k45O1K77Q2k41k04J53K65j7k76j16K18K29j16k81l5K71J66
5833B33j79k64O2K90J00k59k26J52K96kl14j51K43K49q8l11o3K90J93j95k87M8
5855a83L08J19k38k44J10K98M6k85j77J85K59k7l02j04K44K29j31k93j1K67J51
5876B21j77k54N2K88Q7k31k16J42K70Rk70j53K09K41p2k86o4K55J98j51k81K2
5898a61K84J21k34k25J02K93M3k87j59J66K68m4l13r0K58K35j57l05J2K97J48
$$ plain form
5919 252 22 -233 -141 159 227 -57 -247 -78 203 172 -114 -236 -3 234 126 -173 -210 62 252 57 -206
5940 -206 -162 119 221 -12 -244 -110 172 182 -83 -223 -35 209 152 -133 -203 37 245 95 -180 -180 96 242
5962 242 39 -216 -134 154 217 -51 -237 -61 206 175 -117 -226 -7 230 122 -169 -199 87 246 57 -201
5983 -201 -145 144 230 -39 -242 -96 198 195 -102 -237 -13 222 154 -145 -222 61 246 80 -214 -189 117 232
6005 232 7 -237 -121 174 215 -63 -250 -47 223 165 -121 -226 32 239 112 -174 -193 93 232 29 -211
6026 -211 -145 140 222 -21 -233 -78 217 189 -106 -234 1 224 128 -162 -208 52 243 66 -209 -168 122 220
6048 220 -13 -231 -116 186 190 -92 -238 -38 210 135 -142 -220 34 238 86 -195 -191 100 233 8 -226 -124
6070 -124 161 213 -51 -236 -64 204 172 -122 -231 11 243 108 -181 -197 84 244 41 -213 -157 141 225 -15
$$ packed form
5919B52k30k55R2L00O8k84j90J69K81l1k86j22K33K37j08k99l7K72J90j95k63
5940b06M4K81J02k33k32J34K82J0k65j40J88K44n7k85p0K40K08j50k75%K76J46
5962B42k03k55Q2K88O3k68j86J76K67l1k92j09K19K37j08k91l0K86J59j89k58
5983b01N6K89Q6k69k03J46K94lk97j35K24K35o8k99p7K83J85j66k94K5L06J15
6005B32k25k44J16K95M1k78j87K03K70n8k86j05K58K07j27k86j9K86J39k03k40
6026b11O6K85Q2k43k12J55K95k8k95j28K35K23r6k90m6K60J91j77k75M1K90R8
6048B20k33k18J15L02Mk82j46K00K48p5k77p8K54K04j52k81MK91J33k25k34J02
6070a24K85N2k64j85J72K68l2k94j09K42K32j35k89j6K81J60k03k54N6K98Q4k40
$$ plain form
6092 -15 -223 -76 204 188 -97 -247 -13 217 131 -137 -212 44 233 70 -210 -179 106 220 2 -238 -124 167
6114 167 205 -70 -235 -43 203 149 -138 -223 18 231 94 -179 -190 89 234 37 -223 -125 158 211 -46 -225
6136 -225 -63 204 184 -108 -225 15 239 121 -164 -196 70 242 62 -191 -145 136 232 -9 -218 -92 194
6157 194 188 -94 -216 -21 228 140 -150 -203 50 224 70 -194 -178 102 227 5 -241 -127 150 193 -65 -226
6179 -226 -56 196 156 -121 -217 10 230 93 -171 -180 78 224 44 -203 -139 144 224 -28 -220 -70 190 182 -90
6202 -90 -212 -1 231 122 -158 -190 59 232 73 -185 -149 131 223 3 -213 -90 186 182 -70 -212 -33 227
6224 227 151 -143 -214 40 221 81 -198 -177 94 217 14 -218 -119 149 194 -51 -213 -68 185 164 -115 -223
6246 -223 1 225 107 -163 -187 71 225 55 -185 -140 134 207 -26 -202 -79 176 172 -75 -202 -20 205 130
$$ packed form
6092a5k08J47K80j6k85j50K34K30q6k68p5K56J89j63k80L1K85J14k18k40J14K91
6114A67L8k75j65J92K46n4k87q5K41K13j37k73j1K79J45j97k60R8K83N3k57j79
6136b25J62K67k0k92j17K40K24j18k85l2K66J72j80k53M6K81R6k41k09J26K86
6157A94ok82j22J95K49q8k90n3K53J74j54k64J6K80J25k22k46J14K77M3k58j61
6179b26J70K52m0k77r6K27K20j37k64rK58J46j80k47O4K83Q0k52j92J50K60qk72
6202i0j22K11K32j09k80l2K49J73j59k58L6K80R2k20k16J23K76mk52j42J79K60
6224B27p6k94p1K54J81j40k79K1K71J23k03k32R9K68M5k45j62J45K53k1k79j08
6246b23K24K24j18k70k4K58J54j70k40M5K74P3k33j76J23K55mk47j27J82K25p5
$$ plain form
6268 130 -124 -199 40 220 63 -174 -154 107 210 9 -202 -101 170 175 -54 -206 -45 195 151 -113 -210 29
6290 29 226 92 -169 -174 95 220 14 -201 -131 142 189 -50 -228 -55 184 150 -120 -213 -4 207 109 -169 -194
6313 -194 60 218 41 -187 -147 129 210 -12 -208 -82 168 186 -71 -201 -24 185 137 -122 -184 27 217 70
6335 70 -174 -156 98 206 28 -188 -105 141 182 -46 -212 -55 181 144 -105 -195 0 199 88 -145 -168 72
6357 72 200 33 -188 -119 125 189 -18 -199 -89 165 155 -101 -207 -23 189 109 -140 -189 56 212 59 -179
6379 -179 -135 111 209 -3 -200 -88 163 183 -58 -197 -33 199 136 -104 -166 33 215 88 -158 -148 93 202
6401 202 21 -172 -107 123 179 -36 -202 -50 164 133 -95 -185 6 189 101 -124 -171 56 192 47 -173 -133
6423 -133 99 184 -22 -207 -90 144 141 -81 -190 -23 165 99 -125 -181 21 189 58 -157 -141 88 179 -5
$$ packed form
6268A30k54p5K39J80j57k37K0K61J03k01k11J01K71Nk29j52J61K40m4k64r7K39
6290B9J97j34k61nK69J25k06k15P0K73M7k39j78J73K39l4k70r3K09K11r8k78k5
6313a94K54J58j77k28M0K76Q1k22j96J26K50J8k57j30J77K09m8k59o2K11J90j47
6335G0k44J8K54J08j78k16Q3K46M1k28j66J57K36l7k49r0J95J99j11k33k3K40
6357G2J28j67k21O9K44O4k07j81J10K54j0k56j06J84K12q0k49m9K45J56j53k38
6379a79M4K46R8k12j97J12K51K0k41j39J64K32o3k40o2J99J82j27k46J0K41J09
6401B02j81j93O5K30N6k15j66J52K14l1k28r0J91J83q8k25m7K27J36j45k20M0
6423a33K32Q5k06j85J17K34lk22j09J67J88o6k24n6K02J68j31k15J6K29R1j84
$$ plain form
6445 -5 -191 -98 142 160 -57 -183 -49 172 125 -88 -166 18 194 89 -126 -147 69 202 41 -164 -104 124 173
6468 173 -25 -173 -66 144 142 -83 -184 -9 168 101 -129 -152 33 180 51 -146 -133 82 162 -3 -172 -97
6490 -97 115 145 -60 -160 -46 163 116 -98 -163 10 172 63 -132 -142 62 173 29 -170 -107 119 160 -20
6512 -20 -167 -51 148 138 -73 -157 4 167 95 -110 -134 48 174 45 -147 -113 101 166 -17 -171 -65 126
6534 126 137 -59 -164 -13 142 104 -107 -160 24 159 61 -142 -135 57 166 3 -155 -85 102 137 -36 -158 -45
6557 -45 136 123 -71 -149 -5 156 70 -111 -123 48 153 39 -138 -101 100 147 -10 -152 -58 122 125 -53 -135 -10
6581 -10 155 106 -90 -142 30 161 63 -109 -115 72 165 -2 -143 -61 104 127 -46 -145 -17 134 106 -82 -155 5
6605 5 143 50 -130 -134 52 151 18 -151 -98 108 129 -24 -144 -56 138 124 -62 -155 -17 154 78 -117 -129 31
$$ packed form
6445ej86R3K40J8k17j26J34K21m7k13p8J84J76j05k15k1K16J33j61k05O0K28M9
6468A73j98j48J07K10kk25j01J75J77o7k30k3J85J47j29j97J3K15Q0j65j69P5
6490i7K12L0k05j00J14K09m7k14o5J73J62j09j95j0K04J11j44j99O3K26M1j80
6512b0j47J16J99j0k11q4J61J63p2k05k4J82J26j29j92L4K14O5j83j54J06J91
6534A26J1j96j05J51J55l8k11n3J84J35r8k03PJ92J09j63j58P0J87L5j73j22J13
6557d5J81j3j94p8J44J61q6j81j2J71J05j14j77L7K01M7j57j42R4J80Lj78q2J25
6581a0J65m9j96n2J72J31r8j72oJ87R3j67j41Q2J65K3j73r9J28J51k8j88p3J60
6605EJ38r3j80mJ86R9j33j69N3K06K1j53j20Q8J94j4j86r3J38J71p6j95j2J60
$$ plain form
6629 31 142 46 -115 -114 73 144 2 -128 -60 104 128 -36 -140 -34 134 95 -78 -119 12 132 63 -97 -115 42
6653 42 146 34 -135 -75 92 133 -8 -128 -49 112 101 -68 -147 -10 131 67 -111 -133 38 137 16 -131 -112
6676 -112 83 132 -12 -144 -59 108 108 -47 -144 -21 126 83 -76 -124 24 145 48 -104 -103 80 147 22 -115 -74
6700 -74 91 133 -17 -130 -30 121 110 -57 -140 -3 129 80 -88 -112 37 134 36 -104 -83 74 145 -4 -139
6723 -139 -68 110 117 -43 -136 -30 124 84 -75 -130 6 125 34 -119 -112 46 125 4 -133 -61 85 116 -40 -146
6747 -146 -45 122 97 -73 -135 3 140 69 -97 -106 50 148 29 -136 -82 82 137 -13 -125 -45 107 114 -53 -132
6771 -132 -11 124 84 -80 -120 30 131 57 -106 -99 51 139 27 -117 -69 99 127 -24 -136 -36 115 93 -56
6794 -56 -128 -7 122 64 -90 -127 31 130 27 -127 -99 68 113 -25 -141 -69 104 110 -69 -129 -14 131 81 -92
$$ packed form
6629C1J11r6j61JJ87P1j42j30O8J64K4j64j04J06J68l9j73m1J31J20o9j60j8J57
6653D2J04j12j69O0J67M1j41j20P9J61j1j69p9J37J41o4j78k2J71R9j21j47J9
6676a12J95M9j44j32Q5J67%j55r7J23J47m3j59m8J48J21r7j52JJ83O7j25j37M1
6700g4J65M2j50j13J00J51j1j67q3J37J32m9j68k4J49R7r8j40K1J57P1j49j35
6723a39P1J78Pj60r3J06J54m0j59n5J36J19r1j53PJ58P9j21j37P2J46L1j56j06
6747a46J01J67k5j70o2J38J37p1j66rJ56R8j19j65N4J64N5j50j12Q0J52Pj67p9
6771a32J21J35m0j64m0J50J01p4j63PJ50Q8j12j44M8J68K8j51j12J00J51k2j49
6794e6p2J21J29n8j54l7J58R9j03j54K8J67M5j38j16P2J73Oj79o0J15J45n0j73
$$ plain form
6818 -92 -107 32 142 39 -111 -92 71 140 5 -133 -59 97 121 -33 -135 -34 125 96 -61 -116 13 146 67
6841 67 -100 -107 41 132 43 -126 -96 71 132 3 -130 -60 101 107 -34 -132 -13 120 71 -83 -122 13 138 48 -114
6866 -114 -106 56 134 19 -133 -81 92 118 -44 -143 -38 131 93 -74 -134 12 129 68 -98 -108 58 137 16 -126
6890 -126 -82 99 142 -12 -125 -40 124 122 -52 -115 -1 147 86 -75 -124 40 149 46 -120 -97 63 138 21
6913 21 -124 -52 104 126 -22 -126 -38 129 101 -82 -125 12 142 50 -109 -127 37 141 24 -133 -85 73 127
6936 127 -18 -137 -49 111 102 -50 -135 -6 135 84 -91 -133 46 146 51 -116 -90 83 149 15 -130 -50 121
6959 121 116 -33 -133 -25 136 99 -86 -132 32 145 55 -106 -116 54 146 24 -123 -69 86 126 -15 -143 -54
6982 -54 122 100 -78 -150 -13 126 72 -98 -138 29 134 45 -121 -95 80 143 -9 -145 -58 113 120 -57 -142 -20
$$ packed form
6818i2j5J39J10j03j50J9J63O9j35j38P4J56K4j54j02J01J59k9j57n5J29J33p9
6841F7j67pJ48R1q9j69L0J67O1j29j33P0J61Oj41r8J19J33m9j54l9J35J25r0j62
6866a14QJ62P8j15j52N2J73K6j62r9J05J69l8j67o0J46J17o1j66j0J66P9j21j42
6890a26M4J81M3j54j13Q5J64kj74o3J14J48o1j61m9J64J09j03j66K3J60P5j17
6913B1j45P2J56K2j48j04Q8J67k8j83m3J37J30r2j59j8J64J04j17j57M8J58N4
6936A27j45j19Q8J60rj52q5J29J41n1j75m2J79J00r5j67K6J73O6j34j45Q0J71
6959A21nj49j00J08J61l7j85m6J64J13r0j61j0J70R2j22j47N4J55M0j41j28Q9
6982e4J76k2j78p2J37J39n4j70m0J67J05q9j66K6J75O3j52j36Q7J71Pj77q5J22
$$ plain form
7006 -20 123 102 -92 -129 27 156 59 -111 -100 65 160 19 -135 -69 110 153 -29 -138 -24 134 93 -70 -129
7029 -129 -4 147 71 -108 -118 62 151 28 -136 -93 87 149 -22 -157 -64 114 115 -62 -155 -25 130 83 -111
7052 -111 -139 34 152 32 -120 -103 82 143 -1 -154 -84 117 133 -47 -162 -32 143 110 -91 -139 24 149
7074 149 62 -118 -116 70 157 27 -127 -72 106 148 -25 -148 -44 142 112 -59 -153 -5 161 100 -105 -139 56
7097 56 157 28 -149 -99 76 152 -19 -164 -76 117 112 -59 -150 -28 147 100 -85 -161 26 160 56 -132 -126 69
7121 69 147 6 -135 -89 106 139 -35 -154 -31 132 106 -78 -151 3 167 80 -111 -137 68 170 26 -154 -98
7144 -98 100 148 -13 -155 -51 146 128 -84 -156 8 168 83 -113 -146 49 165 57 -150 -109 87 151 -10 -163
7167 -163 -82 123 137 -66 -178 -38 139 102 -95 -154 13 154 66 -148 -144 71 153 22 -141 -90 101 146 -27
$$ packed form
7006b0J43k1j94l7J56J29r7j70J1J65R5j41j54O6J79M3j82j09J14J58m1j63n9
7029a29J25J51p6j79j0J80Q9j23j64M3J80O2j71j35R3J78Jj77r3J30J55m7j94
7052a11k8J73J18j20j52J7J85O1j44j53P0K01J6j80j15J30J75l3k01m8J63J25
7074A49q7j80KJ86Q7j30j54N5J78M2j73j23J04J86l0j71r4J48J66o1k05l4J95
7097E6J01j29j77N0J75P6j71j45Q8J93nj71r1J22J75m7j85p6J87J34j04j88OJ95
7121F9P8j41j41M6J95L3j74j19J23J63k6j84p3J54J64q7j91k6K05J02j44j80N6
7144i8J98M8j61j42J04J97j8k12p2J64J60q5j96l3J95J16j08k07M1J96O4j61j53
7167a63Q1K05J4k03j12J40J77l7j97n9J67J41q8k14MK15Q2j31j63N1J91M5j73
$$ plain form
7190 -27 -173 -49 137 135 -82 -173 8 159 93 -106 -134 57 178 38 -149 -107 106 172 -13 -161 -55 139 147
7213 147 -66 -157 -14 168 96 -110 -156 51 186 48 -151 -126 97 165 0 -171 -94 117 156 -48 -177 -42
7235 -42 147 110 -98 -174 18 161 66 -131 -147 56 167 31 -158 -111 113 165 -24 -173 -62 139 135 -59 -166
7258 -166 5 160 106 -119 -148 49 183 43 -153 -115 100 178 3 -173 -82 130 154 -51 -173 -26 178 123
7280 123 -110 -169 35 186 57 -150 -132 95 180 6 -181 -91 134 159 -54 -193 -47 158 113 -101 -172 5
7302 5 185 76 -147 -145 65 170 32 -173 -117 110 174 -24 -172 -65 140 145 -65 -183 -15 171 107 -118 -154
7325 -154 32 179 55 -146 -129 88 171 5 -169 -81 119 146 -44 -171 -37 165 121 -108 -177 31 185 71
7347 71 -155 -152 81 167 13 -185 -112 127 164 -40 -173 -56 171 117 -107 -206 9 175 69 -153 -170 60 172
$$ packed form
7190b7j46J24J86kk17r1J81J51o6j99k8J91J21j40j87M2K13O6j85j48J06J94Q
7213A47k13r1J43J82p2k06m6K07J35j38j99K5K23O8j65j71P7K11L9k04j29J35
7235d2J89l7k08p6J92J43r5j97j6K03J11j36j89M7K24N2j89j49J11K01mj94j07
7258a66J71J55n4k25k9J97J34j40j96L8K15P8j75j76R1K12K4k05j22J47K04n5
7280A23k33n9K04J51j29k07J8K27Q5j74j87R0K25K5k13j39J46K05m5k14p1J77
7302EJ80j09k23KK10J05j38k05N6K27O4j98j48J07K05Nk10j18J68J86o4k25l6
7325a54J86J47j24k01J7K17Q3j66j74Q8K00K7j90j27J34K02m4k29o9K08J54j14
7347G1k26LK33Q6j54j98P3K39L7k04j33J17K27n4k24r9K15J66j06k22j7K30J12
$$ plain form
7370 172 22 -177 -122 111 169 -27 -191 -76 152 148 -79 -181 -31 177 110 -113 -160 45 190 64 -132 -123 87
7393 87 170 22 -166 -88 133 170 -49 -178 -54 170 132 -91 -179 10 174 81 -136 -161 57 176 18 -169 -114
7416 -114 121 172 -38 -184 -67 153 142 -86 -192 -12 184 86 -135 -163 43 182 31 -165 -125 113 179 -25
7438 -25 -193 -78 145 153 -71 -190 -15 181 108 -111 -157 26 185 74 -154 -131 83 193 21 -170 -89 128
7460 128 166 -33 -182 -38 154 136 -78 -169 9 184 91 -148 -155 51 182 34 -165 -107 99 165 -23 -201 -83
7483 -83 148 141 -81 -181 -18 166 103 -128 -166 46 205 55 -171 -129 112 180 -4 -178 -79 147 152 -69 -184
7506 -184 -26 169 109 -115 -176 31 204 74 -154 -140 89 188 9 -179 -100 131 166 -38 -190 -58 165 151
7528 151 -90 -187 1 167 84 -138 -160 49 191 43 -167 -134 106 148 -39 -186 -89 130 139 -87 -193 -28 151
$$ packed form
7370A72j50j99N5K33N8j96j64J15K28mk27j02J50K08o7k23m7K05J45j26j96RK10
7393H7Q3j48j88P8K21L7k19j29J24K24l8k23q8J89J64r3k17k5K18J19j58j87N5
7416a14K35N1k10j46J17K20j1k28j06J80J96r8k21k8K06J39j51j96M0K38O6k04
7438b5j68J15K23Qk24j19J75J96p3k19m6J83J59j11k28K3K14J10j72j91Q1K17
7460A28L8j99j49J44J92j8k14r1J78J75r3k39pK06J31j48j99N8K06O6j88j78J18
7483h3K31pk22j00J63J84o3k31l8K12J59j50k26M2K41O8j84j74R9K26Nk21j15
7506a84J58J95o0k24o1K07J73j30k28J4K29R9j79j88P9K31L5k04j52J32K23j4
7528A51k41r7J88J66q3k22k2K09J42j48k10L3K40M2j87j47R7K19Rk26j06J65J79
$$ plain form
7551 151 106 -126 -174 35 197 66 -159 -137 87 161 -9 -189 -100 141 160 -56 -192 -39 172 117 -117 -182 32
7574 32 189 78 -135 -156 85 197 25 -171 -103 120 183 -24 -197 -52 161 144 -76 -180 2 190 91 -133
7596 -133 -168 47 190 48 -159 -142 95 185 -15 -182 -105 140 149 -64 -189 -31 162 119 -106 -180 25 181 68
7619 68 -153 -153 84 197 13 -198 -109 120 164 -52 -195 -47 162 143 -106 -182 14 188 86 -151 -150 66 200
7642 200 28 -169 -109 128 182 -31 -199 -60 168 150 -70 -187 -4 183 113 -128 -175 42 190 51 -164 -156
7664 -156 91 176 -4 -188 -97 140 160 -64 -196 -45 162 123 -95 -185 20 193 78 -144 -159 77 185 22
7686 22 -174 -124 126 185 -23 -186 -61 163 147 -83 -180 4 199 112 -116 -154 55 202 48 -156 -126 102 194
7709 194 -5 -178 -80 151 159 -55 -190 -23 176 125 -109 -181 38 181 73 -167 -145 83 176 9 -186 -115 122
$$ packed form
7551A51m5k32m8K09J62j31k25K2K24P4j70j80Q9K41J9k16j36J53K11n5k34o5K14
7574C2J57j11k13k1K41J12j72j96O8K23O3k07j73J45K13j7k20j04J82J88r9k24
7596a33l5K15J43j42k07J7K37R0k00j67P7K45Rk13j25J58J93m3k25p4K05J56j13
7619F8k21%K37J13j84k11Q9K29M4k16j43J48K09j9k49p6J96J74j02k37JK16J34
7642B00j72j97O0K37N4k13j68J39K28j8k20j17J83J87p0k41m7K17J48j39k15Q
7664a56K47Q5j80j84R1K37K0k24j32J51K07l9k18r0K05J73j15k22j5K36J08j63
7686B2j96N0K50N9k08j63J25K24j6k30r7J84J95q7k28l8K09J47j54k04L0K28R2
7709A94j99j73R8K31Qk14j35J67J99n1k34p2K19J43j08k40K2K28R3j67j95P1K37
$$ plain form
7732 122 163 -51 -189 -54 157 134 -106 -191 0 180 66 -147 -165 45 181 29 -176 -124 104 176 -23 -182
7754 -182 -74 149 148 -62 -181 -10 176 104 -118 -170 26 194 66 -159 -120 85 193 9 -188 -90 133 163
7776 163 -55 -175 -46 157 136 -104 -180 11 190 74 -150 -160 78 198 25 -171 -100 105 169 -39 -189 -64
7798 -64 156 132 -84 -182 -12 172 95 -127 -170 55 181 49 -162 -142 97 179 -4 -187 -84 147 171 -43 -179
7821 -179 -27 176 121 -104 -172 19 186 78 -147 -157 74 181 28 -181 -99 126 170 -28 -187 -61 151 139
7843 139 -88 -194 -3 185 98 -135 -169 44 181 44 -161 -113 98 178 -15 -182 -89 136 149 -73 -183 -34
7865 -34 160 103 -112 -183 36 185 58 -156 -137 87 180 -1 -180 -100 123 167 -38 -174 -49 177 138 -90 -168
7888 -168 13 193 88 -118 -148 68 191 40 -148 -110 110 186 -11 -183 -74 149 153 -70 -187 -20 172 98
$$ packed form
7732A22M1k14j38J35K11k3k40q5J91J80j14k13j8K10J36j52k05N2K28P2j99j59
7754a82J08K23jk10j19J71J86p2k22n2J96J68j28k25L9K05J08j84j97R8K23L0
7776A63k18j20J29K03k1k40p6J91J79j16k24j0K38J20j73j96P1K05O4k08j50J25
7798f4K20k4k16r8J70J84p7k22m3K25J26j32k11K0K39Q2j83j83J03K31K4k14j36
7821a79J52K03n5k25o8J91J67j08k25j0K31J07j53k09Q2K25M4j98j59J26K12j2
7843A39k27j06J91J88q7k33l4K13J37j37k05M8K11Q0j93j67R3K25J3k22j10J49
7865c4J94n7k15p1K19J49j27k14J9K24R3j81j79Q0K23M4k05j36J25K26l9k28p8
7888a68J81J80j05k06l0K16J23j51j88L8K20P6j97j72J09K23Mk23j17J67J92p4
$$ plain form
7910 98 -122 -160 32 175 67 -150 -146 84 173 16 -178 -102 114 141 -54 -175 -49 150 116 -105 -185 0 181
7933 181 89 -152 -152 76 174 30 -166 -98 121 174 -38 -178 -54 153 141 -69 -186 12 199 102 -117 -152 55
7956 55 193 63 -151 -120 93 180 0 -185 -85 120 156 -49 -181 -36 166 123 -106 -168 14 185 74 -153
7978 -153 -145 56 167 17 -178 -119 102 168 -27 -182 -59 144 138 -83 -178 -7 162 100 -125 -160 41 187 47
8001 47 -160 -118 96 180 1 -168 -64 141 146 -56 -176 -19 176 116 -104 -158 18 191 78 -143 -131 86 180
8024 180 28 -162 -96 117 164 -38 -176 -56 154 136 -96 -186 -13 170 77 -144 -166 36 155 18 -161 -136
8046 -136 86 163 -20 -182 -88 126 158 -65 -187 -29 148 122 -115 -179 37 175 65 -148 -136 74 165 9
8068 9 -167 -96 113 179 -30 -180 -57 163 135 -79 -173 4 183 95 -128 -151 60 190 28 -159 -121 115 178
$$ packed form
7910I8k20l8J92J43j08k17MK30Q9j57j94P6K16K7j95j21J26J99l4k21q0J85J81
7933A81r2k41%K28R8j44j96O8K19N3k12j40J24K07j2k10j17J98J87r7k19l5K07
7956E5J38j30k14L1K13Q7j80j85J00K05L6k05j32J45K02m3k29o2J82J71j11k27
7978a53QK01J11j50j95N9K21O6j95j55J23K03ok21r5J71J69o2k25l5K01J46j40
8001D7k07M2K14Q4j79j69J04K05Nk02j20J57J95o0k20n4J76J73j13k21J2K17R4
8024A80j52j90O6K13M7k02j38J20K10j8k32r0J73J83r3k21k2K02J19j37j79K5
8046a36K22P7j83j62R4K14L2k23j22J58J77k6k37o4K16J38j10k13J2K10R1j56
8068Ij76P1K09O6k09j50J23K20k8k14r4J77J79q8k23k3K11J30j62j87L8K36O3
$$ plain form
8091 178 -19 -175 -59 150 136 -68 -185 -27 168 108 -127 -178 37 185 56 -153 -139 79 181 -8 -183
8112 -183 -89 124 150 -45 -183 -37 164 133 -95 -173 16 182 79 -135 -150 62 186 38 -163 -107 104 161
8134 161 -18 -174 -65 155 143 -89 -166 -22 173 107 -116 -168 33 190 64 -158 -120 98 181 3 -169 -81
8156 -81 135 156 -48 -187 -43 162 113 -114 -186 13 172 82 -158 -149 59 180 27 -182 -108 118 166 -36 -183
8179 -183 -66 154 143 -77 -189 -25 165 103 -121 -151 31 184
$$ packed form
8091A78j97j56J16K09j4k04j17J58J95o0k35n1K15J48j29k09J4K18J02j89j75
8112a83R4K13K6j95j38J46K01l1k28p8J89J66j03k14j5K12J24j48k01N6K11N7
8134A61j79j56J09K20j2k32p7J44J95o6k23n2K01J57j26k22L8K18Q3j78j72Q8
8156h1K16K1k04j39J44K05m9k27p2J99J59r0k40RK08J21j53k09P4K26M8k02j47
8179a83J17K20j1k20j12J64J90o2k24l0J82J53
8191A84
$$ Imaginary data points
##PAGE= N=2
##DATA TABLE= (X++(I..I)), XYDATA
$$ plain form
0 0 0 0 0 0 0 0 0 8 -8 8 -8 16 -16 16 -24 25 -32 40 -48 56 -64 73 -88 97 -113 133 -150 169 -193 217 -245
31 -245 277 -311 345 -385 431 -479 533 -592 656 -726 804 -892 984 -1092 1212 -1346 1498
48 1498 -1674 1877 -2116 2403 -2759 3200 -3774 4560 -5700 7501 -10811 18862 -77444 -22747
62 -22747 214130 96234 -142570 -182691 61399 202410 49578 -183207 -135422 108289 193817
73 193817 -14013 -195749 -88588 152954 162842 -67625 -198721 -30420 180845 122399 -120020
84 -120020 -180103 27768 193538 68416 -156796 -147284 82406 186858 12642 -179459 -102405
95 -102405 126045 165699 -41728 -185838 -52832 158846 132885 -91471 -178820 1652 179155
106 179155 88164 -134385 -155042 56122 182472 35456 -163795 -117299 104042 168663 -18541
$$ packed form
0@%%%%%%%Qj6J6j6K4l2L2m0M9n7P2q8J04j20J37j61J85k10K46k83L19l62M10m62
31b45N22n88O56p30Q16r10J012j125J248j382J530j696J876k076K304k558K844
48A498l172L551l993M519n162N959o974Q334j0260J3201j8312K9673r6306N4697
62b2747K36877j17896k38804m0121K44090J41011j52832k32785M7785K43711Q5528
73A93817k07830j81736J07161K41542R888k30467j31096J68301K11265n8446k42419
84a20020o0083K07871J65770j25122k25212R512K29690J04452j74216j92101P7054
95a02405K28450L9654k07427j44110J33006K11678k5961k24356q7349J80472J77503
106A79155r0991k22549k0657K11164J26350j47016j99251M6496K21341O4621j87204
$$ plain form
117 -18541 -176748 -70768 139869 141265 -67856 -175264 -20850 164392 103523 -111929 -159360
128 -159360 31594 174596 56123 -145736 -128792 80583 168173 3903 -164806 -86209
138 -86209 119945 145442 -45560 -166929 -38978 145916 112292 -88286 -156026 9122 159653
149 159653 71288 -122916 -132719 55730 160067 24714 -146826 -97824 96979 145342 -23637
160 -23637 -155763 -54481 126903 117661 -66572 -150179 -9571 144412 82417 -102104 -133609
171 -133609 34264 150511 41735 -129216 -106711 75461 144474 -2988 -145560 -69650
181 -69650 110115 124159 -47402 -147046 -26646 132660 93152 -85003 -135377 16379 142919
192 142919 55770 -114081 -113183 56430 141362 15046 -133566 -82181 92038 127980 -27690
$$ packed form
117a8541j58207J05980K10637J396k09121j07408J54414J85242o0869k15452m7431
128a59360J90954J43002j18473k01859J6944K09375Q7590j64270j68709P8597
138h6209K06154K5497j91002j21369J27951J84894l3624k00578o7740J65148J50531
149A59653q8365j94204r803J88449J04337j35353j71540M9002J94803M8363j68979
160b3637j32126J01282J81384r242j84233q3607J40608J53983o1995j84521l1505
171a33609J67873J16247j08776j70951K2505J82172O9013j47462j42572P5910
181f9650J79765J4044j71561r9644J20400J59306l9508j78155n0374J51756J26540
192A42919q7149j69851Q98J69613Q4932j26316j48612N1385J74219L5942j55670
$$ plain form
203 -27690 -141065 -42871 118610 101773 -66773 -134289 -1050 132498 67451 -97306 -115597
214 -115597 38172 133771 29797 -117666 -89151 71947 125080 -8651 -128903 -56024 100215
225 100215 105835 -46642 -128400 -17844 118543 76966 -79132 -115905 20446 125034 42466
236 42466 -102457 -93683 54321 120554 7036 -116488 -65954 82897 107590 -28595 -121730
247 -121730 -32648 105049 85326 -61981 -116142 3695 117569 55024 -89429 -99303 39013
258 39013 117972 20629 -106657 -74339 68463 108580 -13261 -114850 -44774 91797 90929
269 90929 -45683 -113738 -11721 107575 65674 -74296 -102442 22812 113013 33748 -95040
280 -95040 -80931 53454 106898 864 -105453 -53976 77369 92575 -30034 -107068 -24274
$$ packed form
203b7690j13375R8194J61481j6837j68546o7516J33239J33548o5047j64757j8291
214a15597J53769R5599j03974j47463K8515J61098N3133j33731j20252P2879J56239
225A00215N620j52477q1758J10556J36387m1577j56098l6773J36351J04588q2568
236D2466j44923Q774J48004O6233j13518j23524N0534J48851K4693j36185r3135
247a21730Q9082J37697j9723j47307n4161J19837J13874o2545j44453r874J38316
258C9013P8959r7343j27286L2318J42802M0117j21841j01589P0076J36571q68
269I0929j36612o8055J02017J19296m1901j39970k8146J25254R0201p9265j28788
280i5040J4109J34385N3444j06034j06317N1477J31345J5206j22609p7034Q2794
$$ plain form
291 -24274 94169 71722 -57597 -100528 6831 103583 45046 -80532 -84927 37602 103006
302 103006 14176 -95044 -61667 63292 92881 -16148 -100230 -34431 82116 75688 -43310
313 -43310 -97252 -6150 93920 53620 -66830 -87269 22942 98618 26406 -85089 -68784
324 -68784 50348 93602 -3280 -94641 -44103 71848 79765 -31246 -94846 -16811 85680
335 85680 60100 -54780 -87622 10313 92635 36440 -74103 -73594 36942 91845 9225 -86800
347 -86800 -52548 60051 82232 -18536 -90786 -26998 76350 64989 -42910 -85924 -872
358 -872 84755 43778 -62043 -74938 23878 86707 19972 -76363 -58373 46738 81649 -5646
370 -5646 -84163 -36454 65507 68899 -30625 -83600 -11487 76969 50030 -51129 -75440 12620
$$ packed form
291b4274J18443k2447j29319m2931J07359R6752n8537j25578m395J22529O5404
302A03006q8830j09220L3377J24959K9589j09029q4082O5799J16547o428j18998
313d3310n3942R1102J00070m0300j20450k0439J10211P5676p2212j11495J6305
324f8784J19132M3254r6882r1361N0538J15951P917j11011o3600P8035J02491
335H5680k5580j14880l2842R7935Q2322n6195j10543N09J10536N4903q2620r6025
347h6800L4252J12599K2181j00768p2250O3788J03348j1361j07899m3014Q5052
358h72Q5627m0977j05821j2895R8816O2829o6735r6335J7990J05111L4911q7295
370e646p8517M7709J01961L392r9524n2975P2113Q8456k6939j01159k4311Q8060
$$ plain form
382 12620 81350 28653 -66484 -62193 34826 79679 5500 -76815 -44264 54448 71534 -18541
394 -18541 -80613 -21794 69346 56276 -40726 -76203 2207 76687 36360 -57829 -65267 24475
406 24475 77235 14730 -69336 -49779 43892 71888 -7429 -75537 -30675 59987 60699 -29429
418 -29429 -75158 -8224 70601 43424 -48301 -67210 14235 73717 22930 -61536 -53742 33848
430 33848 70433 2076 -68982 -37057 49978 62299 -18405 -71503 -17617 62508 48857 -37853
442 -37853 -67576 3900 69138 30693 -53279 -57105 24251 68791 10485 -62934 -42161 41127
454 41127 62693 -9112 -67048 -24908 54317 52365 -27797 -66325 -5646 63392 37422 -44493
466 -44493 -59595 14542 66600 18820 -56751 -47025 32741 63014 -788 -62872 -30989 46691
$$ packed form
382A2620O8730n2697r5137M291R7019M4853p4179q2315L2551R8712J7086r0075
394a8541o2072N8819R1140j3070r7002l5477P8410P4480m0327r4189p438Q9742
406B4475N2760o2505q4066J9557R3671K7996p9317o8108M4862R0662P12r0128
418b9429m5729O6934P8825k7177r1725j8909Q1445N9482n0787q4466P794Q7590
430C3848L6585o8357p1058L1925Q7035J2321q0704n3098N3886Q0125j3651q6710
442c7853k9723P1476O5238l8445q3972l826Q1356M4540n8306p3419K0773Q3288
454D1127K1566p1805n7936M2140P9225j952q0162l8528O0679O9038k5970q1915
466d4493j5102P4137N2058m7780p5571R726P9766L0273o3802o2084L1883P7680
$$ plain form
478 46691 54467 -18827 -63813 -13573 56822 42332 -35354 -60139 5003 62578 26386 -49230
490 -49230 -50924 23549 62414 7791 -58032 -36759 39091 56061 -10538 -60937 -20365 50184
502 50184 45669 -26799 -59067 -3251 57300 32288 -40879 -52926 14168 59967 15960 -51862
514 -51862 -41885 30688 56977 -2013 -57544 -26807 43637 48494 -18845 -57605 -10446 51886
526 51886 36674 -32973 -53291 5805 56168 22706 -44612 -45231 21816 56137 6386 -52814
538 -52814 -32788 36168 50669 -10589 -55557 -17324 46407 40534 -25584 -53110 -1493 51978
550 51978 27873 -37601 -46882 13721 53785 13557 -46880 -37232 28098 51331 -2322 -52418
562 -52418 -23928 40234 43906 -18064 -52619 -8431 47965 32492 -31232 -48021 6713 51085
$$ packed form
478D6691P776p3294m4986N0240P0395j4490p7686k4785O5142N7575l6192p5616
490d9230j694P4473L8865n4623o5823K1273P5850J6970o6599n0399M0572P0549
502E0184m515p2468l2268N5816O0551k5012p3167j2047O7094M5799m4007o7822
514e1862R977P2573K6289n8990n5531L0737P0444M857o7339l8760M7159O2332
526E1886j5212o9647k0318N9096N0363l3462o7318o19O7047L4321m9751n9200
538e2814K0026O8956J4501o1258m4968L8233O3731n873o6118k7526N1617N3471
550E1978k4105o5474r281O0603M0064m0228o0437R648O5330K3233n3653n0096
562e2418K8490O4162L672o1970l4555M4188N6396j5473o3724j6789N4734M4372
$$ plain form
574 51085 19216 -41109 -40051 20674 50531 4980 -48021 -29209 33342 45954 -10289 -50981
586 -50981 -15252 43116 36710 -24462 -48684 -93 48221 24344 -35522 -42067 13930 48827
598 48827 10942 -43040 -32818 26288 46138 -2896 -47561 -21069 36898 39573 -16964 -47966
610 -47966 -7157 44143 29191 -29289 -43613 7225 46859 16386 -38159 -35531 19840 45388
622 45388 3304 -43584 -25471 30573 40954 -9814 -45901 -13385 39170 33093 -22559 -44371
634 -44371 304 44364 21794 -33209 -38209 13784 44835 8942 -39966 -29111 24978 41644
646 41644 -3738 -43420 -18355 34044 35624 -15965 -43718 -6095 40699 26531 -27339 -40163
658 -40163 7164 43535 14629 -35891 -32514 19298 41974 2020 -40595 -22514 28885 37000
$$ packed form
574E1085l1869o0325J058O0725K9857m5551n3001J8812O2551J2612n6243m0692
586e0981L5729N8368o406o1172k4222M8591M8314k3877n9866o545N5997L4897
598D8827l7885n3982J0222N9106J9850m9034m4665K6492N7967K675n6537l1002
610d7966M0809N1300j4952n8480j4324N0838L9634l0473n4545K628N5371K5548
622D5388m2084m6888J8113N6044J0381n0768l6087L2516N2555o077n5652k1812
634d4371M4675M4060k2570n5003n000N1993L1051l5893m8908J0855N4089J6666
646D1644m5382l9682K5065N2399J580n1589k7753L7623M6794j4168n3870j2824
658d0163M7327L6371k8906n0520L377N1812K2676l9954m2615J8081N1399Q115
$$ plain form
670 37000 -9918 -41892 -11478 35965 29731 -20859 -40292 513 40563 19872 -30529 -35120
682 -35120 12854 41341 7882 -37113 -26400 23565 38003 -4201 -39819 -15987 31413 31847
694 31847 -15102 -39456 -5044 36852 23757 -24868 -36359 6574 39720 13354 -32990 -29835
706 -29835 17967 38660 1470 -37707 -20338 27249 33887 -9965 -38657 -9639 33536 26600
718 26600 -19869 -36649 1184 37265 17737 -28295 -32064 12204 38209 7011 -34619 -24326
730 -24326 22328 35388 -4521 -37431 -14229 29994 29167 -15029 -36449 -3549 34378 21049
742 21049 -23504 -33005 6662 36375 11764 -30431 -27114 16748 35530 1136 -34902 -18640
754 -18640 25473 31261 -9757 -35915 -8297 31393 24011 -18971 -33432 1869 34230 15539
$$ packed form
670C7000m6918l1974L0414M7443o234n0590j9433M0805M0050k0691n0401m591
682c5120M7974K8487l3459m4995J0713M9965J4438m2204l5618K3832M7400M34
694C1847m6949k4354L4412M1896j3095m8625j1491M2933L3146k6366m6344L155
706b9835M7802K0693l7190l9177J7369M7587O638m3852k8692K9018M3175o936
718B6600m6469j6780L7833L6081j9528m6032l769M4268K6005l1198m1630J0293
730b4326M6654J3060l9909l2910K3202M4223q27m4196k1420L2900L7927j3329
742B1049m4553r501L9667K9713k4611m2195L317M3862J8782l4394l6038J6262
754a8640M4113N788m1018k6158K7618L9690p382m2982j4461L5301L2361j8691
$$ plain form
766 15539 -26261 -28849 11553 34645 6041 -31569 -22032 20478 32437 -4183 -34549 -13045
778 -13045 27952 26888 -14343 -33831 -2751 32192 19001 -22368 -30169 6994 33549 10054
790 10054 -28287 -24405 15761 32415 739 -32157 -17018 23697 28951 -9235 -33480 -7512
802 -7512 29531 22220 -18202 -31226 2389 32204 13829 -25005 -26333 11505 31959 4829 -29359
815 -29359 -19830 19236 29644 -4242 -31859 -11798 25946 24792 -13447 -31460 -2379 30163
827 30163 17484 -21301 -28031 7144 31366 8634 -26695 -22032 15297 29703 -64 -29676
839 -29676 -15061 22032 26225 -8768 -30661 -6695 27298 20468 -16979 -28965 2512 30167
851 30167 12503 -23733 -24224 11393 29700 3692 -27564 -17668 18447 26997 -4677 -29333 -10211
$$ packed form
766A5539m1800k588M0402K3092k8604l7610R537M2510J1959l6620l0366K1504
778a3045M0997j064m1231j9488L1080L4943j3191m1369p801L7163K6555k3495
790A0054l8341L882M0166J6654l1676l2896J5139M0715N254l8186k4245K5968
802g512L7043p311m0422j3024L3615K9815j8375l8834j328L7838K0454k7130l4188
815b9359R529L9066J0408l3886k7617K0061L7744j154l8239j8013K9081L2542
827C0163j2679l8785o730L5175K4222k2732l5329M663L7329J4406k9767k9612
839b9676J4615L7093M193l4993k1893K3966L3993o830l7447j1986L1477K7655
851C0167j7664l6236m91L5617J8307k6008l1256R896L6115Q550l1674k4656J9122
$$ plain form
864 -10211 24098 22407 -12750 -28891 -1851 28006 15953 -20055 -25965 7070 29399 7607
876 7607 -25425 -20272 15036 27663 -985 -27987 -13163 21170 23822 -8995 -28316 -5432 25510
889 25510 18403 -16227 -26694 2778 28180 11357 -22510 -22567 11207 28038 2857 -26395 -16051
902 -16051 18117 25035 -5364 -27549 -8586 23016 20245 -12581 -26571 -1001 26063 14270
914 14270 -18859 -23862 6865 27324 6852 -23822 -18724 14362 25810 -1350 -26332 -11860
926 -11860 20169 21895 -9018 -26276 -4322 23857 16416 -15357 -24242 2956 25757 10106 -20735
939 -20735 -20617 10388 25840 2541 -24560 -14825 17108 23336 -5429 -25958 -7550 21988 18478
952 18478 -12538 -24650 -37 24483 12536 -18057 -21730 7043 25358 5754 -22513 -17107
$$ packed form
864a0211L4309j691l5157j6141K7040K9857j2053l6008n910L3035K2329k1792
876G607l3032N153L5308J2627k8648k7002J4824L4333K652l2817j9321K2884L0942
889B5510p107l4630j0467K9472K5402j6823l3867n7L3774J6831k5181k9252J0344
902a6051L4168O918l0399k2185J8963L1602k771l2826j3990K5570K7064j1793
914A4270l3129n003L0727K0459k0472l0674N098L3086J1448k7160k4982J4472
926a1860L2029J726l0913j7258K1954K8179p441l1773q885K7198K2801j5651l0841
939b0735J18L1005J5452k3299k7101R735L1933O228k8765k0529J8408K9538l510
952A8478l1016j2112K4613K4520j1947l0593l673K8773J8315j9604k8267N406
$$ plain form
964 -17107 13919 24106 -1815 -25012 -10710 19651 20490 -9367 -25008 -3196 23143 14794 -15443
977 -15443 -22482 3902 24355 8510 -19943 -18599 10449 23853 1680 -22972 -13363 16195 21570
990 21570 -5376 -24261 -6740 20827 17037 -12154 -22931 509 22932 11039 -17194 -19681
1002 -19681 7111 23168 4658 -20695 -15149 12951 21771 -1885 -22833 -9653 18070 18747 -8780
1015 -8780 -23108 -2697 21680 13498 -14810 -20824 4314 22896 7202 -19188 -16800 10624 22103
1028 22103 631 -21684 -11662 15784 19755 -5804 -22776 -5642 20001 15642 -12164 -21690
1040 -21690 1312 22276 9864 -17239 -18411 7932 22221 3265 -20360 -13504 13269 20146
1052 20146 -2863 -21530 -8161 17344 16993 -8739 -21427 -2081 20327 12271 -14129 -19354 4377
$$ packed form
964a7107L1026J0187k5921k3197J4302L0361Q39k9857j5641K1812K6339q349l0237
977a5443p039K6384K0453j5845k8453J344K9048J3404k2173k4652R609K9558N375
990B1570k6946j8885J7521K7567l790k9191j0777K3440K2423j1893k8233k487
1002a9681K6792J6057j8510k5353N546K8100Q820k3656k0948J3180K7723O77k7527
1015h780j4328K0411K4377q182k8308o014K5138J8582j5694k6390K388K7424J1479
1028B2103k1472k2315J0022K7446L971k5559j6972J7134K5643m359k7806r526
1040b1690K3002K0964j2412k7103j172K6343J4289j8956k3625O856K6773O877
1052B0146k3009j8667J3369K5505l51k5732j2688J9346K2408q056k6400n225K3731
$$ plain form
1065 4377 21469 6379 -18149 -15368 10279 20340 51 -20119 -10280 14716 17711 -5658 -20586
1078 -20586 -4773 18196 13978 -11150 -19635 1263 20322 8955 -15912 -16942 7526 20689
1090 20689 2761 -19206 -12245 12958 18634 -3507 -20288 -6775 16804 15263 -9071 -19808
1102 -19808 -969 19338 10794 -13892 -17876 4891 20424 5337 -17816 -14201 10715 19424 -966
1115 -966 -19726 -8903 15036 16406 -6639 -19650 -3363 17781 12358 -11385 -18071 2081 19068
1128 19068 7677 -15168 -15408 7371 19099 2195 -17970 -11163 12280 17216 -3562 -18863 -5924
1141 -5924 15774 13798 -8714 -18044 -471 17647 9426 -12736 -15890 4633 18312 4685 -16030
1154 -16030 -12752 9734 17655 -942 -18146 -8098 14117 15115 -6555 -18338 -2572 16975 11003
$$ packed form
1065D377J7092j5090k4528K781K5647J0061k0289k0170R839K4996K995k3369j4928
1078b0586J5813K2969m218k5128q485K0898J9059j1367k4867j030K4468J3163
1090B0689j7928k1967O961K5203N676k2141j6781J3513K3579j541k4334j0737
1102a9808J8839K0307q544k4686l984K2767J5533j5087k3153L615K4916Q709k0390
1115i66j8760J0823K3939J370k3045j3011J6287K1144n423k3743o686K0152J6987
1128A9068j1391k2845k40K2779J1728j6904k0165O807K3443M936k0778j5301J2939
1141e924K1698j976k2512r330J7573J8118q221k2162l154K0523J3679j3627k0715
1154a6030L278K2486P921j8597j7204J0048K2215R98k1670j1783J5766J9547n972
$$ plain form
1167 11003 -11337 -16598 2848 17946 6274 -14743 -13788 7799 17784 1168 -17238 -9854 12309
1180 12309 16016 -4261 -18173 -4870 15691 12679 -9310 -17209 646 17325 8043 -13056 -14594
1193 -14594 5491 17259 3335 -15492 -11224 9721 16127 -1475 -16842 -7098 13225 13797 -6281
1206 -6281 -16975 -2224 15815 10028 -10692 -15220 2964 16548 5412 -13666 -12298 7352 15970
1219 15970 757 -15540 -8633 11134 14308 -3883 -16322 -4345 14252 11494 -8609 -15785 780
1232 780 16124 7203 -12465 -13365 5714 16188 2424 -14904 -9880 9848 14776 -2348 -15898
1245 -15898 -5752 12925 12366 -6679 -15808 -1277 15226 8882 -10803 -14259 3629 15988 4377
1258 4377 -13702 -11210 8002 15104 -341 -15071 -7281 11185 12888 -4484 -15133 -3311 13420
$$ packed form
1167A1003k2340n261J9446J5098j1672k1017R55K1587R985j6616j8406P384K2163
1180A2309L707k0277j3912J3303K0561l012k1989p899J7855J6679r282k1099j538
1193a4594K0085J1768j3924j8827M268K0945O406j7602j5367R744K0323N72k0078
1206f281j0694J4751J8039n787k0720m528J8184J3584j1136j9078J368J9650Q618
1219A5970j5213j6297O907J9767L174j8191j2439J1977J8597k758k0103p176J6565
1232G80J5344q921j9668r00J9079J0474j3764j7328N024J9728M928j7124j3550
1245a5898J0146J8677n59j9045r129J4531J6503o344j9685l456J7888J2359j1611
1258D377j8079K492J9212P102j5445j4730P790J8466J703j7372j0649J1822J6731
$$ plain form
1271 13420 10158 -8270 -14340 1056 14864 6439 -11594 -12228 5413 14899 2037 -13798 -8879
1284 -8879 9246 13427 -2414 -14477 -4933 11877 10924 -6288 -14129 -881 13680 7814 -9777
1297 -9777 -12749 3387 14499 3893 -12602 -10194 7544 13930 -675 -14199 -6363 10925 11740
1310 11740 -4941 -14131 -2217 12912 8755 -8445 -13046 1773 13942 5284 -11281 -11005 5752
1323 5752 13941 1260 -13326 -7905 9362 12492 -3067 -13903 -3895 11802 9809 -6706 -13113
1336 -13113 24 13019 6594 -9562 -11434 3683 13282 3113 -11683 -9031 7143 12694 -774
1349 -774 -13067 -5728 10162 10762 -4746 -13042 -1819 12036 7820 -7995 -11757 2014 12679
1362 12679 4415 -10372 -9694 5397 12445 909 -12057 -7021 8609 11358 -2987 -12843 -3402
$$ packed form
1271A3420l262j8428o070J5396J3808q425j8033o34J7641R486j2862j5835M919
1284h879J8125M181j5841j2063R544J6810r53j7212p841J3248J4561n866j7591
1297i777k972J6136J1112j0606j6495K408J7738O386j4605j3524P836J7288Q15
1310A1740j6681r190J1914J5129m157j7200m601J4819J2169q658j6565K76J6757
1323E752Q189j2681j4586N421J7267L130j5559j0836J0008J5697j993j6515o407
1336a3113J3137J2995o425j6156j872J5117R599j0169j4796K652J6174N551j3468
1349g74j2293P339J5890O00j5508q296J1223J3855m216j5815l762J3771J0665
1362A2679q264j4787O78J5091P048j1536j2966N036J5630K749j4345r856R441
$$ plain form
1375 -3402 11099 8892 -6631 -12148 530 12324 5633 -9402 -10283 4132 12289 2137 -11148
$$ packed form
1375c402J4501k207j5523n517J2678J1794o691j5035q81J4415Q157j0152j3285
$$ [...]
8191A2
##END NTUPLES=NMR FID
##END=
