##TITLE=1H_LY-dicyclpd
 CDCl3
 8 sc, 
 11.1.2022
##JCAMPDX= 6.0         $$ Bruker NMR JCAMP-DX V2.0
##DATA TYPE= NMR FID
##DATA CLASS= NTUPLES
##ORIGIN= UXNMR, Bruker Analytische Messtechnik GmbH
##OWNER= root
$$ XWIN-NMR		Version 3.5
$$ Tue Jan 11 12:01:15 2022 Russian Standard Time (UT+4h)  she@DPX200
##.OBSERVE FREQUENCY= 200.131346
##.OBSERVE NUCLEUS= ^1H
##.DELAY= (6, 6)
##.ACQUISITION MODE= SIMULTANEOUS
##.ACQUISITION SCHEME= undefined
##.AVERAGES= 8
##.DIGITISER RES= 18
##SPECTROMETER/DATA SYSTEM= spect
##.PULSE SEQUENCE= zg30
##.SOLVENT NAME= CDCl3
##.SHIFT REFERENCE= (INTERNAL, CDCl3, 0, 15.7039)
##AUDIT TRAIL= $$ (NUMBER, WHEN, WHO, WHERE, WHAT)
$$ ##TITLE= Audit trail, XWIN-NMR		Version 3.5
$$ ##JCAMPDX= 5.01
$$ ##ORIGIN= Bruker BioSpin GmbH
$$ ##OWNER= she
$$ F:/spectra/data/she/nmr/H-F/1/audita.txt
$$ ##AUDIT TRAIL=  $$ (NUMBER, WHEN, WHO, WHERE, WHAT)
(   1,<2022-01-11 11:59:13.29 +0400>,<she>,<DPX200>,
      <created by zg, POWCHK disabled, PULCHK disabled
       configuration hash MD5:
       00 E9 B6 7A A2 85 ED C7 34 08 36 98 17 FE 4E 26
       data hash MD5: 16K
       22 C6 30 68 27 BF 51 23 65 BF C4 4C F4 EB A8 7A>)
$$ ##END=
$$ 
$$ hash MD5
$$ DC D0 A3 36 72 86 04 DE A2 AB 86 6E B6 D0 89 AD
##$RELAX= 
##$RELAX= 
##$RELAX= 
##$RELAX= 
##$RELAX= 
##$RELAX= 
$$ Bruker specific parameters
$$ --------------------------
##$DU= <F:/spectra>
##$EXPNO= 1
##$NAME= <H-F>
##$PROCNO= 1
##$TYPE= <nmr>
##$USER= <she>
##$AMP= (0..31)
100 100 100 100 100 100 100 100 100 100 100 100 100 100 100 100 100 100 
100 100 100 100 100 100 100 100 100 100 100 100 100 100 
##$AQSEQ= 0
##$AQ_mod= 1
##$AUNM= <au_zg>
##$AUTOPOS= <>
##$BF1= 200.13
##$BF2= 200.13
##$BF3= 200.13
##$BF4= 200.13
##$BF5= 200.13
##$BF6= 200.13
##$BF7= 200.13
##$BF8= 200.13
##$BYTORDA= 1
##$CFDGTYP= 0
##$CFRGTYP= 5
##$CHEMSTR= <none>
##$CNST= (0..31)
1 1 145 1 1 1 1 1 1 1 1 1 1 1 1 1 1 1 1 1 1 1 1 1 1 1 1 1 1 1 1 1 
##$CPDPRG= <>
##$CPDPRG1= <>
##$CPDPRG2= <>
##$CPDPRG3= <>
##$CPDPRG4= <mlev>
##$CPDPRG5= <mlev>
##$CPDPRG6= <mlev>
##$CPDPRG7= <mlev>
##$CPDPRG8= <mlev>
##$CPDPRGB= <>
##$CPDPRGT= <>
##$D= (0..31)
0 1.2 0 0 0 0 0 0 0 0.06 0 0.03 0 0 0 0 0.0002 0 0 0 0 0 0 0 0 0 0 0 0 
0 0 0 
##$DATE= 1641887952
##$DBL= (0..7)
120 120 120 120 120 120 120 120 
##$DBP= (0..7)
150 150 150 150 150 150 150 150 
##$DBP07= 0
##$DBPNAM0= <>
##$DBPNAM1= <>
##$DBPNAM2= <>
##$DBPNAM3= <>
##$DBPNAM4= <>
##$DBPNAM5= <>
##$DBPNAM6= <>
##$DBPNAM7= <>
##$DBPOAL= (0..7)
0.5 0.5 0.5 0.5 0.5 0.5 0.5 0.5 
##$DBPOFFS= (0..7)
0 0 0 0 0 0 0 0 
##$DE= 6
##$DECBNUC= <off>
##$DECIM= 32
##$DECNUC= <off>
##$DECSTAT= 4
##$DIGMOD= 1
##$DIGTYP= 9
##$DL= (0..7)
0 120 120 120 120 120 120 120 
##$DP= (0..7)
150 150 150 150 150 150 150 150 
##$DP07= 0
##$DPNAME0= <>
##$DPNAME1= <>
##$DPNAME2= <>
##$DPNAME3= <>
##$DPNAME4= <>
##$DPNAME5= <>
##$DPNAME6= <>
##$DPNAME7= <>
##$DPOAL= (0..7)
0.5 0.5 0.5 0.5 0.5 0.5 0.5 0.5 
##$DPOFFS= (0..7)
0 0 0 0 0 0 0 0 
##$DQDMODE= 0
##$DR= 18
##$DS= 0
##$DSLIST= <SSSSSSSSSSSSSSS>
$$ [...]
##$SUBNAM2= <"">
##$SUBNAM3= <"">
##$SUBNAM4= <"">
##$SUBNAM5= <"">
##$SUBNAM6= <"">
##$SUBNAM7= <"">
##$SUBNAM8= <"">
##$SUBNAM9= <"">
##$SW= 18.0517287032376
##$SWIBOX= (0..15)
0 0 2 0 0 0 0 0 0 0 0 0 0 0 0 0 
##$SW_h= 3612.71676300578
##$TD= 16384
##$TD0= 1
##$TE= 0
##$TE2= 300
##$TE3= 300
##$TEG= 300
##$TL= (0..7)
0 120 120 120 120 120 120 120 
##$TP= (0..7)
150 150 150 150 150 150 150 150 
##$TP07= 0
##$TPNAME0= <>
##$TPNAME1= <>
##$TPNAME2= <>
##$TPNAME3= <>
##$TPNAME4= <>
##$TPNAME5= <>
##$TPNAME6= <>
##$TPNAME7= <>
##$TPOAL= (0..7)
0.5 0.5 0.5 0.5 0.5 0.5 0.5 0.5 
##$TPOFFS= (0..7)
0 0 0 0 0 0 0 0 
##$TUNHIN= 0
##$TUNHOUT= 0
##$TUNXOUT= 0
##$USERA1= <user>
##$USERA2= <user>
##$USERA3= <user>
##$USERA4= <user>
##$USERA5= <user>
##$V9= 5
##$VALIST= <valist>
##$VCLIST= <CCCCCCCCCCCCCCC>
##$VD= 0
##$VDLIST= <DDDDDDDDDDDDDDD>
##$VPLIST= <PPPPPPPPPPPPPPP>
##$VTLIST= <TTTTTTTTTTTTTTT>
##$WBST= 1024
##$WBSW= 4
##$XGAIN= (0..3)
0 0 0 0 
##$XL= 0
##$YL= 0
##$YMAX_a= 57141
##$YMIN_a= -100163
##$ZGOPTNS= <>
##$ZL1= 120
##$ZL2= 120
##$ZL3= 120
##$ZL4= 120
##$ABSF1= 10
##$ABSF2= 0
##$ABSG= 5
##$ABSL= 3
##$ALPHA= 0
##$AQORDER= 0
##$ASSFAC= 0
##$ASSFACI= 0
##$ASSFACX= 0
##$ASSWID= 0
##$AUNMP= <proc_1d>
##$AZFE= 0.1
##$AZFW= 0.1
##$BCFW= 1
##$BC_mod= 2
##$BYTORDP= 1
##$COROFFS= 0
##$CY= 11.3945322036743
##$DATMOD= 1
##$DC= 2
##$DFILT= <>
##$DTYPP= 0
##$F1P= 2.36226072786647
##$F2P= -0.459571619588291
##$FCOR= 0.5
##$FTSIZE= 0
##$FT_mod= 4
##$GAMMA= 1
##$GB= 0.15
##$INTBC= 1
##$INTSCL= 1
##$ISEN= 128
##$LB= 0.24
##$LEV0= 0
##$LPBIN= 0
##$MAXI= 10000
##$MC2= 0
##$MEAN= 0
##$ME_mod= 0
##$MI= 1.114404
##$NCOEF= 0
##$NC_proc= 0
##$NLEV= 6
##$NOISF1= 3.799351
##$NOISF2= 2.8
##$NSP= 1
##$NTH_PI= 0
##$NZP= 0
##$OFFSET= 15.70392
##$PC= 1
##$PHC0= -15943.21
##$PHC1= 8.20079
##$PH_mod= 1
##$PKNL= yes
##$PPARMOD= 0
##$PSCAL= 0
##$PSIGN= 0
##$REVERSE= no
##$SF= 200.130013532006
##$SI= 16384
##$SIGF1= 3
##$SIGF2= 2
##$SINO= 400
##$SIOLD= 16384
##$SREGLST= <1H.CDCl3>
##$SSB= 0
##$STSI= 0
##$STSR= 0
##$SW_p= 3612.71676300578
##$SYMM= 0
##$S_DEV= 0
##$TDeff= 0
##$TDoff= 0
##$TI= <>
##$TILT= no
##$TM1= 0
##$TM2= 0
##$TOPLEV= 0
##$USERP1= <user>
##$USERP2= <user>
##$USERP3= <user>
##$USERP4= <user>
##$USERP5= <user>
##$WDW= 1
##$XDIM= 8192
##$YMAX_p= 0
##$YMIN_p= 0
$$ End of Bruker specific parameters
$$ ---------------------------------
##NTUPLES= NMR FID
##VAR_NAME=  TIME,          FID/REAL,        FID/IMAG
##SYMBOL=    X,             R,               I
##VAR_TYPE=  INDEPENDENT,   DEPENDENT,       DEPENDENT
##VAR_FORM=  AFFN,          ASDF,            ASDF
##VAR_DIM=   8192,          8192,            8192
##UNITS=     SECONDS,       ARBITRARY UNITS, ARBITRARY UNITS
##FACTOR=    0.0002768,     1,               1
##FIRST=     0,             0,               0
##LAST=      2.2672688,     0,               0
##MIN=       0,             -100163,         0
##MAX=       2.2672688,     57141,           0
$$ Real data points
##PAGE= N=1
##DATA TABLE= (X++(R..R)), XYDATA
0@%%%%%%%%%%%%%%%%%%%%%%%%%%Oj4J6j6J6j6J6j6K0k4K8l2L2l6M2m6N1n5O0o8
$$ 0 0 0 0 0 0 0 0 0 0 0 0 0 0 0 0 0 0 0 0 0 0 0 0 0 0 0 6 -8 8 -8 8 -8 8 -8 12 -12 16 -16 16 -20 22 -24 27 -28 32 -36
46c6P3q1Q8r6J10j18J28j44J61j81K01k24K53k90L35l92M69n73P28r71J393k265
$$ -36 37 -44 44 -52 58 -60 68 -76 85 -96 105 -119 134 -156 179 -213 256 -317 411 -560 833 -1432
68a432M708k3352q0087O8556O3502o1566m3597L3794J8139P944L1426q926l6438
$$ -1432 3276 -20076 -100163 -31607 31895 -29671 -73268 -39474 -21335 -13391 18035 9109 -27329
81b7329L1904N1588k8700m4495J9410K0451j9088p862N958q352P856K5283j0712
$$ -27329 4575 56163 27463 -17032 2378 22829 3741 -4121 1837 -6515 1341 26624 15912
94A5912k5407K2716L1095k8304m3936R985L1615j3297m5984j3892L3485K6193
$$ 15912 -9495 13221 44316 16012 -27924 -17939 13676 379 -45605 -59497 -26012 181
106A81j6000j9002J7761L2326J5836J04j0715r389J4298J9122j8449l6126l938
$$ 181 -15819 -34821 -17060 15266 31102 31206 20491 11102 25400 44522 26073 -10053 -13991
119a3991J6295n8j0730q533m915J2736K1294p058k0686J0280J7512j4749j4122
$$ -13991 2304 2246 -8484 -17017 -21932 -9196 12098 5040 -15646 -5366 12146 -2603 -16725
132a6725J1894M82j7052K855J5252J285J379P911R64Q079J8763m157k0415L342
$$ -16725 -4831 -4349 -21401 -18546 -3294 -2009 -630 7281 8245 16324 35087 30930 10515 13857
146A3857R306j6263j3730K059j3085j3811J6393R063k1206j36K8517L827j1293
$$ 13857 23163 6900 -6830 -4771 -17856 -31667 -15274 -6211 -27417 -27553 964 4791 -6502
159f502J3439R198j5924Q46J6752j0914j7682J0414O278j1863P017J5061j2669
$$ -6502 6937 16135 211 1057 17809 6895 -10787 -373 5905 -5958 1059 16120 3451
172C451r003K2209R400k0885q452Q016n046p980J273r958j4000J0864J7240o504
$$ 3451 -5552 16657 26057 5172 -3280 4736 -310 -8290 -7017 -16975 -30975 -20111 -2871 -9375
186i375r337J2224J6580M650j056k267m30N303J542r971r260k68P21j924j995
$$ -9375 -18712 -6488 10092 14742 13686 11419 10989 16292 17834 7863 -1397 -1665 -944 -2868 -4863
201d863k949P91P877L123o287p90P275k36q246l732J038Q70L30l560m328P561
$$ -4863 -7812 -7021 856 3979 -2308 -3098 4177 3941 -4305 -8037 -6999 -6129 -5799 -9359 -13687 -6126
217f126J4043L79q222M626J3443K887p999p712k382K811O82j0194j2370J055R050
$$ -6126 7917 8296 74 4700 18143 21030 13031 5319 2937 5748 6430 -3764 -16134 -15079 -6029
232f029J816n297l213M742J1990O418q935p789R442R250q421j0251J920M332J620
$$ -6029 -4213 -9510 -12723 -7981 4009 10427 1492 -6297 3145 12395 3974 -6277 -4357 -25 1595
247A595J086m409l502J1139J0739j0147j0529J0253P906j1720r662K297r58k982
$$ 1595 2681 -1728 -5230 5909 16648 6501 -4028 6225 14131 2411 -7251 -4954 -5912 -8894
261h894K448l348p025Q923J4347m841r019J0213J2248m573o465J303j130j546
$$ -8894 -6446 -9794 -16819 -7896 6451 1610 -7409 2804 15052 10479 4014 5317 4187 2641
275B641L040m585j1424L287J3294l069j2899L805J3358l51q526p83L162k46j307
$$ 2641 5681 1096 -10328 -7041 6253 3184 -9715 -5910 7448 7097 -1429 -2212 950 704 -603
290f03l009n350J89O534J570m368P02P025M668K77j198j403R24L192j788q439
$$ -603 -3612 -8962 -8773 -2239 -669 -5037 -4335 2690 7358 7635 6437 5034 5958 9150 7362 -1077
306a077m621L748K126n801n323L516P141Q55m091R40O490J610m723j271K895j381
$$ -1077 -5698 -1950 176 -5625 -10948 -7432 -291 564 -3527 -2587 3903 5513 790 -481 2414 1033
322A033l616J078R86l052P85N554J84l445L211N532j688m250k82nj565j640m029
$$ 1033 -2583 -1505 -519 -3571 -2786 2768 2952 -493 2718 8250 6562 2312 2030 2025 460 -1180 -5209
339e209m098L074M558l584l383O497O201k178q54M316O79k886N34P77l703l211
$$ -5209 -9307 -6233 -1675 -5259 -8642 -2145 4056 1878 1024 5340 6019 3133 3667 4444 741 -2470
355b470J135R55j597j155J345K489J081n60M70J345j200k504J4k6k895j837R60
$$ -2470 -1335 -380 -1977 -3132 -1787 702 1783 1223 1693 3038 1838 -666 -652 -678 -3573 -5410 -4450
372d450N25N71J878L05O03M788K920l078n70L630j703m910M36l02n373l01M092
$$ -4450 -3925 -3354 -1476 -1171 -568 4220 7140 4062 3492 7122 5419 509 945 643 -4730 -5031 -939
389i39k882l387N957L639m876R66O618j922m641L141J013n054M37K250m715l72
$$ -939 -3821 -7208 -1251 2388 -2488 -1522 5096 3174 -1467 1674 2687 -2367 -1930 320 -4395 -4767
405d767P535p10n767N708O599n523k290O108k870p562M090K853r908l359Q719
$$ -4767 2768 2058 -3709 1999 8598 3075 785 6893 4023 -3539 551 3404 -6504 -9863 -1144
420a144Q9p120L250O636j387J79M116j493j626M154j166o808J522M240n436l908
$$ -1144 -1055 -8175 -4925 1711 324 503 4619 3126 1500 5654 4488 -2320 -798 3442 -1994 -5902
436e902N890J893n054J786N710j827l056L052J318l950k305P90k4j460k032k27
$$ -5902 -12 1881 -3173 -1387 4323 2496 -560 2492 3810 -140 -2445 -1655 -1679 -3139 -5171 -5398
452e398L561K528k157J56N361K196k841n98J706p15k182j959j581K34n0k738O8
$$ -5398 -1837 691 -1466 -1310 4051 6247 3406 2808 4514 3799 1617 -342 -1923 -1689 -1739 -4477 -4409
469d409M409k98l532M177N213m682l388N997P07p487j94M837k873l197L754J118
$$ -4409 0 -298 -3830 347 5560 878 -2510 3487 4194 -3293 -3487 1350 -1523 -4720 -966 152
485A52j814L732K067l855K105N411n145n504N920Q74r818k06P670m230o398P198
$$ 152 -1662 2070 4137 282 2387 7798 2653 -2851 3069 3943 -5875 -6081 1589 -2641 -9039 -1841
501a841N018o232M39P726j393m258L717R91m946P86K181m970j339N476j370m812
$$ -1841 3177 -3055 -2616 5110 3717 -541 3176 4167 -779 7 2188 -2782 -4121 1355 -15 -4827
517d827M761M826m656j401N841n99n383J327K314l993k241K211l02j507J656J204
$$ -4827 -66 4760 104 -1297 4544 3945 -1438 -111 2203 -1790 -4031 -1820 -2122 -3629 -1973 -769
533g69JK246J406j408P85K066j897k566J021kk714o72Q97m07P7J142K72P86J506
$$ -769 -768 1478 2884 1476 2261 4327 2430 -136 885 883 -1831 -2503 -1606 -2013 -1936 -794 -522 264 1770
552A770l48m73J298p44k590O84J085k949j194K986M3k108K314K328j799O89L012
$$ 1770 1422 949 2247 1503 -1087 -403 682 -2267 -3461 -475 -432 -2540 -226 2102 303 992 4004
569D004k040k459K856r1m891M58L104l178k103M360N99l607K874M072l540j558
$$ 4004 1964 -495 2361 2270 -2621 -2163 941 -2237 -4340 20 619 -2988 -114 3958 418 -1140
585a140M786n76n072J536K684l968j581L713r06k941L455K557l434J57M359j228
$$ -1140 3646 3070 -2002 -466 2218 -1750 -3331 382 -524 -3465 -10 2547 -887 -730 3629 2401
601B401l204K107Q42l555o4K254k284j816L046R26k343J175K513j160o34J833
$$ 2401 -803 1304 2146 -1409 -1473 781 -1503 -3319 -273 653 -1690 -515 1998 838 204 2037
617B037o28j946R17M10k323l80J621o05r95J490J090n25N19R32m34k05L75p25
$$ 2037 1409 -537 380 790 -1533 -1913 -292 -897 -1892 -402 688 163 682 1614 1180 975 1350 625
635F25q76N6m15o81L29M0n58P69J208k72j45R29O9l93K94o89j218P86N68j858
$$ 625 -251 -195 -610 -1291 -962 -922 -1480 -711 497 225 80 1009 1078 685 979 290 -928 -142 426 -1432
655a432l43K160j53j592J680J756j856n07K441m80k656P02J328j955j060J507
$$ -1432 -1775 385 232 -1360 320 2076 220 -287 2154 1674 -982 -280 1048 -907 -1967 -460
671d60j87j094J354Q43j176Q17J860j214j216J891L97k548k18J876r03j823J123
$$ -460 -647 -1741 -387 456 -720 97 1957 743 -473 1418 1815 -733 -951 925 22 -1801 -678
688f78J242j059l56J388M30p08l4L86j7l42o94l94N32J20r49j5J276K25p27N02
$$ -678 564 -495 -851 537 967 259 225 611 594 252 -442 -836 -304 -184 -1133 -1148 128 353 -374 128
708A28R89k39m53K58K0m89l33k95j46J94l07n44Q44J132q09p95J543J108j533
$$ 128 1117 878 425 683 703 214 -119 -414 -560 -366 -673 -1217 -373 759 -50 -845 698 1806 273
727B73r38J365L48j564l96Q97k38p28M77N77k62Q4N97J06k00N6p1k41n8l06m84
$$ 273 -665 700 1048 -516 -912 -15 -253 -981 -504 73 -189 -105 492 598 398 454 383 142 84 -222 -706
748g06K93M89o38n90J217J220r86j070J303J373j052j514L74Q01m54q34k71R5
$$ -706 -413 76 -562 -1152 65 1285 299 -771 532 1905 853 -661 -287 514 60 -774 -1045 -950
766i50L33M68k7l32L29Q83L26m65m39K41M84k80r66l29P69M25r27p29R97J361
$$ -950 -617 -149 -176 -508 -179 704 1030 565 126 367 851 571 -395 -724 45 470 -457 -1186 -189 1172
786A172n40j501L01J756O0j905q11J134P01p14p62r9N81J205M99j135n33J683
$$ 1172 632 -869 -568 1188 1248 -657 -1468 -334 367 -347 -1109 -1208 -627 578 1077 -58 -591 1092
804A092J257j214j407M07P94k16j047j052K04J349r9j804J52K403K64k091k9J960
$$ 1092 2349 1135 -272 135 929 713 -334 -1386 -1182 167 68 -1736 -1584 819 1083 -1008 -1037 923
822I23K35j279m90J51M25Q50l50j685K96K437M93j923o48J362R11m54j360j243
$$ 923 1158 -121 -611 -460 -35 815 465 -1220 -924 1513 2006 83 -565 797 1708 1254 -106 -1349
840a349N74J466r12k349L35K261J06j526K43J673O45n40m42M35Q31r8j233n80
$$ -1349 -775 691 -221 -2570 -2235 26 132 -1394 -1151 522 1167 627 185 620 1451 1353 120 -460
858d60Q30N37o74r50j47R81J139o43j838J61K100J61k188j020J102R48k55r88
$$ -460 370 907 233 -717 -864 117 1256 613 -1225 -1064 1036 1197 -991 -2011 -909 39 -216 -1204
876a204o34J208J921l82j553R89K061o32j506O11O84j042p53O0m90j76O34n11
$$ -1204 -1838 -630 1291 909 -644 345 2406 1774 268 879 1563 521 -232 -172 -662 -838 -204 -715
894g15j185R52J787o09j530N01J485K09q66q55l4J127P89j056j116J032J628j24
$$ -715 -1900 -948 839 230 -1300 -799 686 895 29 -826 -860 267 1056 0 -1116 -84 1544 1420
912A420j080n9Q38K72p64q44pN5p04n08K56N5k30L17L95K6P29R05n89o87J202
$$ 1420 340 281 1119 1391 627 -217 -224 -169 -873 -1381 -1125 -1070 -1300 -983 -588 -562 167 1072 483 -204 998
933I98R34j287j069P15L43m69Qk28o68P05J219q39j231Q47P52j038m99N41n16
$$ 998 1932 645 -424 291 634 165 173 -55 -723 -18 1201 362 -869 -22 730 -308 -807 -266 -782
952g82p53P30N68o45K9R65K60R4Q06J04p48J99P82m87j140k24J91k60k63j08k39
$$ -782 -1535 -805 -237 -882 -853 112 372 466 1272 1376 628 827 1609 1122 -18 -242 -51 -311 -574 -682 -921
973i21L0N16L10j76p8K33J70p4j45J1l5k76NO11L68m13j30P41N81j63l70l92j47
$$ -921 -891 -375 -65 -241 -319 -86 84 10 -135 -124 -159 -435 -430 181 549 136 6 747 1328 1165 795 403 256
996B56L95q8j349q22P98M96q71l81P75M47M8M96K49k97L65O29n32o19N19J88q40
$$ 256 651 563 -786 -1608 -810 -314 -1185 -1566 -791 -344 -296 200 449 152 517 1146 614 -5 514 702 -138
1017a38k21O89Q3m22J7J55J01L96j96j058k04R89o2j434m20J034N03m72q7N21
$$ -138 -359 330 413 -9 8 163 264 660 464 -594 -798 191 129 -1305 -1725 -691 -188 -660 -747 -226
1037b26N35M55K74j53j80K79K42m58p14j68K20k19n97q9M37J64k74o5L25L72J8
$$ -226 309 764 1038 885 705 984 1226 768 54 -114 106 -113 -710 -799 -362 -198 -472 -537 -212 160 178
1058A78m98l55N39N40p04p55P13R67l27m56O27N38j81Q7J81n39m41L30r7j024
$$ 178 -320 -675 -136 404 -300 -1055 -342 625 298 -158 469 1007 826 913 1094 555 114 444 347 -677
1078f77m38L98M3l90KL18K97L72J32j12L36N77k55o34K95N73n02o72M27N39m16
$$ -677 -1115 -717 -674 -1064 -1062 -744 -447 -75 57 -55 281 858 603 -31 264 837 335 -337 90 629 213
1099B13k84M84J60m58n8L14l53o46K4K06l53m09J52L89J61J00K19L74M52K37j05
$$ 213 -71 413 573 115 57 371 18 -628 -604 -398 -751 -1160 -1008 -619 -458 -358 -139 235 687 924 819
1120H19n8K56k1n37k77J54k64n68Q4L71l84m26N87M90o40m11O83L40o86l11N24
$$ 819 761 1017 996 459 182 336 72 -496 -412 -41 -425 -851 -264 226 -414 -825 -142 198 -488 -799 -275
1141b75K32k78N3L55K31J93K27M2N2J79j19l62j45q9m62l69Nk10l74J81M76k01
$$ -275 -43 -321 -268 87 318 511 738 780 832 1011 892 530 385 296 -166 -535 -530 -740 -1114 -933 -457 -658
1163f58l32O35Q26l09o00N25P77l03o60J82M80o8k41J3J09P9N9q0k00j15r2k17
$$ -658 -990 -355 471 162 -438 87 864 561 -99 83 563 495 254 267 376 455 514 434 234 119 27 -190
1185a90j94j88k75j09K13K7k26L05O85J07l33M43Q65q3p17P1O29j08p63l09K71
$$ -190 -384 -572 -847 -956 -743 -716 -942 -637 48 155 -178 265 1130 1047 330 401 1030 922 159 -150 121
1206A21P6k67k62q0J17J42p8j62l6pk3Q9K1k18MM75K78k11Q0O35K52l68mM70n8
$$ 121 197 -70 -332 -412 -295 -153 -231 -393 -429 -436 -459 -370 -349 -567 -563 -88 190 -21 59 694 946 578 574 1044 986
1231I86o44k89K10r3n33l80K6J72K5j43p3K62L32R2o2P9J15K4Q7J69j70j95K83
$$ 986 342 53 263 170 -363 -743 -717 -545 -520 -663 -736 -474 -142 -50 -112 -33 82 106 193 362 192 -3 280
1254B80L54j83k68K62K57k90k68Q9o4m39k39M6o8k50q2J35J85K14J68P8J65L34
$$ 280 634 451 183 445 702 412 144 233 169 -270 -509 -463 -531 -781 -863 -728 -543 -329 -161 -83 82 416
1276D16K03p4r3N0j6j22p4j09k28p3J67J8k41p7K01M9j96q3O0j09j52J01J38j18
$$ 416 619 545 452 502 486 364 290 181 -47 -120 47 65 -176 -253 -52 -3 -199 -282 -222 -331 -483 -382 -244 -362
1300c62n0L01L14J5P2K36Q7l0Q3k8l30k10M3j71l42p3O8j50j6K96P7j47J33L64
$$ -362 -412 -111 203 218 290 526 613 583 666 638 308 98 141 -30 -372 -445 -377 -527 -543 -247 -170 -317 -184 180
1324A80k7j96J05J07j72m9J78n2j69J69K46n7q0J80K1j71J9ml49k29J48q3l65
$$ 180 153 -43 62 169 -3 -52 126 74 -95 74 320 263 183 363 384 213 232 228 -121 -350 -202 -285 -650
1347f50M0K92m6m5L86K48j27J09L13k4k56K3L4k35j44N3j08j13J36R3r1J05K09
$$ -650 -610 -318 -364 -409 -23 225 98 207 520 496 240 263 297 62 -82 -29 -137 -250 -114 -21 -112 -7 202
1370B02j14j48K20L0l91j39K91q3l78J49L57r0q7L53K32j33M3J93j19j91m0j37
$$ 202 88 -60 160 190 -201 -340 -49 -132 -510 -361 -4 -94 -181 172 404 271 314 507 388 197 157 20
1392B0k40J8l3k66Q0L67o0k08L79M04k82k20L76P9m87j47K71j13l42J02K59n1
$$ 20 -220 -202 -235 -501 -421 -54 -114 -322 57 461 179 -41 335 414 -73 -220 51 -62 -404 -302 -43 -94
1414i4j7K24J23pJ08m1j88K5L9l26k60K31M4l64Q4N06j6k85L65M51k71k72K71
$$ -94 -111 113 236 229 337 296 108 133 172 -154 -414 -183 -139 -503 -419 87 71 -214 151 602 331 59 330
1437C30L4m02j40R4j94j37J64M9o9K40K19j09J06L17j60l52J72J31m54k90L15
$$ 330 364 -38 -178 -84 -278 -415 -251 -202 -271 -31 188 79 185 502 342 -10 162 293 -161 -451 -136
1458a36J8l39J67L97j04q7L75J63k92pJ58k27k65Q4p2l08Q9L03j20p1M25K05k00
$$ -136 -118 -457 -290 107 3 -84 291 454 162 155 313 86 -179 -95 -167 -475 -386 -83 -203 -274 151 356 156
1481A56J27L02k27l28J48rm34j46K18j43j82L31K33k05J15M66k3l47J36J99l05
$$ 156 283 585 358 30 178 169 -265 -411 -193 -336 -518 -187 46 -159 -44 422 399 52 188 387 82
1502H2l05J30Jk64K7K31J4K2K59Q3n9J44R2l12j56J56j69m80N4L19k65k15M89
$$ 82 -223 -93 -92 -356 -329 -98 -84 -62 197 280 221 365 457 145 -11 145 -24 -504 -450 -131 -396 -611 -122
1525a22L40k90N1N20K1l42M8J21k49j90l1j43n6J71l7j12L26K91k52q0M57kn71
$$ -122 218 -72 -21 499 520 178 226 347 98 -92 -123 -266 -322 -151 -188 -300 26 317 65 -15 442 440 -131
1548a31jL74l34n03K47L54k75j49M26K61p8M6J44l0j3j8k87k09J33q1l94O9L78
$$ -131 -132 242 -92 -595 -348 6 -269 -418 8 269 191 237 381 351 338 320 33 -176 -43 -124 -518 -449 -71
1571g1j17k23M39L88l22j54M60Q7n33j28L02r9m09LK96L5q4R4J86J48N1j01j33
$$ -71 -188 -411 28 416 94 -60 400 487 -46 -174 128 29 -380 -377 -81 -46 -130 -36 150 298 349 248 115
1594A15Q6N7k90l36Q8J44k13j20K67J65p0J71K92m3j64J40J22k57k69K0O3j48
$$ 115 201 258 -32 -368 -280 -136 -349 -469 -202 -37 -107 64 356 313 149 289 411 154 -115 -95 -32 -180
1616a80j51N4J72J06k4KK23J49j52j65O2K3k02j66n8K2P8P2m9O1K70J88o8k2J02
$$ -180 -331 -277 -105 1 -23 -21 202 351 199 34 96 119 -83 -249 -307 -285 -207 -135 -184 -123 147 335 267 245 347
1641C47m1j68n7p6k41p2J57p5j60J77K75m8m4K47R3j71n5P7j44j65K2l9j36Q6
$$ 347 306 138 81 5 -236 -308 -151 -226 -386 -209 66 18 -26 221 314 143 88 165 21 -144 -122 -161 -297 -211
1665b11K07k3n0K31K00j07p4J07m8k25p5l1j13j07K9L8L6J33R8N6J03J10J5q4
$$ -211 -4 -27 -77 154 354 247 173 280 232 7 -68 -99 -212 -319 -290 -252 -216 -83 15 71 174 284 299 215
1689B15q7m6l6p0j88q7J38R4j21L5K97Q5j42O4J71j45j54J8j35k01J15Q2k84j6
$$ 215 128 82 46 -24 -212 -299 -161 -67 -188 -153 144 229 87 151 322 177 23 41 -94 -295 -180 -98 -382 -398
1713c98M64J30k63J18L47m7j59J31j24l87J06K73m18m50M66M23l96k26N69K97
$$ -398 66 196 -67 51 398 351 192 323 199 -188 -82 191 -227 -677 -211 212 -184 -410 159 456
1733D56l63p9K87l1k46n3j10j50J72J15l48j25N95L18m29j23M95J26l64l6O2l62
$$ 456 93 14 301 270 24 -29 -139 -289 -117 -2 -350 -475 120 438 9 -114 381 507 143 107 169 -193
1755a93j26L98j18o63J57Q06k2o10K24O76l7m08kJ64m8j68k69j53K79K02m08k19
$$ -193 -319 79 -39 -702 -545 261 239 -371 -147 529 492 84 82 246 198 30 -239 -392 -113 89 -319 -538
1777e38N95M45l80k72L40K60j60k03j83j78R3J83j88l31P5M49L20j48l37J69O39
$$ -538 57 502 122 -150 190 450 290 87 -96 -274 -181 2 -186 -517 -442 7 327 179 -158 11 650
1798F50L9p78k27O31L1p86j45N47K7l59J09K94R6J63kl27J03M96k38p75M8N40
$$ 650 689 -89 -316 315 346 -440 -585 -38 -11 -370 -261 33 129 292 290 -37 66 562 324 -451 -403 137
1820A37j65m07J22J56l7L81L23m72k95P18L86p88n70N13K84n25l13K81J37q5J72
$$ 137 -28 -435 -313 -157 -194 187 510 38 -257 461 847 59 -511 2 286 -239 -552 -271 -134 -219 -47
1841d7J18p2K09K90k71l12L67J94o54l99M75K66m95j60L82J58J4K37o7l17K68
$$ -47 71 -1 208 498 227 -85 282 476 -178 -577 -102 164 -331 -491 -109 49 63 300 233 -84 184
1862A84M58m21o39K17L37l12k26J63LpL87J11l31J33M66j60m16J21J57l09k19
$$ 184 642 221 -418 -201 136 -176 -402 -239 -236 -243 144 255 -76 57 523 363 -53 68 225 -84 -303
1883c03R7K9K7M2j51R2N14O2n21N5N65j41n53Q5J71l14p4L28j69k78M05L54k72
$$ -303 -206 -177 -150 -108 -259 -167 347 409 -112 -57 508 367 -186 -101 70 -244 -318 10 -159 -437 -32 322 50
1906E0q0L32m4j89J75r7m77J18M13l93m59N50M47n67j67P95J59p05J2O52j80o70
$$ 50 -30 302 258 69 244 147 -330 -212 201 -192 -651 -101 346 -221 -388 407 566 -139 -127 525 345 -325
1928c25J38L52l29k69L59R2k89J90L72j88j35L50rm31J76K89n29l70O16J84p82
$$ -325 -187 165 -164 -433 -74 18 -271 -81 291 103 -32 318 309 -122 54 343 -186 -556 60 244 -538
1949e38L0Q91q7p16M15O76m97m64N62J42o81m4M91k37l95L37K21k85J16L31j94
$$ -538 -508 383 296 -420 -5 671 174 -290 272 414 -267 -311 180 -57 -452 -115 106 -179 -63 268 74
1970G4j39M19j2n16O7M04l07m40L16K76l50j25M32J14k70K6K78Jk12m1N4l6j04
$$ 74 -65 354 342 -174 -107 297 -10 -450 -134 142 -208 -333 99 213 -57 -31 247 248 36 -5 49 13 -91
1993i1m5L1Qn2N4J58J3j05P9J22k8p7k6o6l1R3l6k28M4K27Kj17R2J24q7n2J66
$$ -91 -136 -105 -97 -149 -95 63 76 -29 50 172 144 67 41 -25 -56 37 1 -227 -183 44 46 -71 21 145 58 6 172
2020A72rk53l5J78Mj95k1J36nj7J06M2j64L9K32m4k68J9J60q2j17J15J4j85R8
$$ 172 163 -90 -125 53 57 -138 -159 -23 -28 -45 61 103 -61 -22 210 166 -102 -83 77 -5 -122 -7 7 -178 -80
2045h0K75r0k31J23J93j50p2J59j14k05J75J96k37j76K22J33j21J8Q1j37j7K30
$$ -80 195 105 -126 -3 190 40 -32 127 13 -192 -17 179 -58 -234 -12 121 0 18 99 -38 -55 175
2067A75ql02l3K22K4j54oM4j6O9P5o9o7P4M7n0Mj4p2j7R4M3o9p2oJ22J15j03j71
$$ 175 167 -135 -168 54 78 -76 -82 -38 -54 15 90 21 -46 28 75 25 29 15 -57 -74 20 63 -6 -78 -84 38 153 50 -121
2096a21P6J75n7j29L7Kp0O6J30j32j76J71K27j25j70N7J00j9k1j2p7K3R3m2q0
$$ -121 -45 130 73 -56 -19 -17 -87 -21 109 -23 -199 -28 199 74 -96 -39 61 42 21 9 -68 -45 48 6 -74
2121g4R4L3j56K0K69n8l20M9L50o1l29N6K35p7j40J41Q0j83l3K09O6j93r9J07
$$ -74 20 53 -103 -83 186 128 -192 -143 207 146 -183 -127 108 31 -109 32 112 -71 -104 105 171 -22 -121 -14
2145a4J32m1j43p4J28J10r5j25R1J44j01j31J47J39k18j58K46J99k86k00K53K18
$$ -14 118 77 -66 -140 -12 98 3 -122 -31 113 12 -119 28 167 -51 -209 37 236 -50 -250 3 221
2167B21k25j77K17J24j88n5J77M3k09n7J81P4j54j35J03J85m4j81MJ85K7j86j7
$$ 221 -4 -181 36 160 -28 -83 94 137 -72 -129 52 126 -28 -163 -60 125 81 -100 -96 89 116 -70 -87
2190h7J71K3j96nK03Rk66rK88M7l14l0L17K9l04j7K83m6k55O0K27j11j63R1J32
$$ -87 84 107 -89 -94 109 118 -148 -157 131 178 -136 -166 151 180 -124 -141 142 96 -159 -99 128 17 -146 -55 77
2215G7n4l4MqQ4N3j69l8K07Kk77O4K68j53k59K35K13k74j49K80J06k62k3J77j6
$$ 77 23 -11 -7 -15 69 122 -47 -85 122 124 -153 -89 179 26 -233 2 215 -59 -208 72 178 -84 -107 70 54
2240E4j32M1M7m6K6K2n6M4R2p9q1J27N4j48l8J46j1j41J2J05m8q3O0P9n6n0J03
$$ 54 -78 -37 10 -36 -10 12 -44 0 92 13 -68 59 113 -35 -73 73 62 -79 -67 38 -10 -93 -33 46 -10 -60 43
2267D3J3n9j2N6pm5rM4k4qK5j4l5M7K2n6LN6l5o7O1K5j04L0J05q1o7J32O7j53
$$ 43 56 -3 -15 41 34 -11 -20 24 0 -8 17 3 -32 15 37 -19 -16 40 5 -62 -1 24 -80 -50 55 -26 -93 39 106 -47
2297d7RJ56l1j51Q1R6j04o2Q9l2o5P6J5r4M7R0q9n3J31k8j40P9J44j51j11J84
$$ -47 -38 118 87 -64 17 113 9 -53 36 4 -61 15 30 -64 -17 73 -16 -69 62 34 -106 -27 117 -34 -145 39
2323C9O4j70j0J73k3j10N3N0m9j7J7m0kM0m1n4P6N3j15J1J17j3j20N4J12p2q1
$$ 39 103 -67 -77 96 73 -37 16 66 17 0 17 -23 -25 15 -26 -80 -4 49 -66 -55 62 49 -71 -17 95 23 -58
2350e8O7N9p4m5N4N6l4m8J8L3J8n5k6J3L7m0m3J1N7kn5J6P1j4n5P2N4p8l7R1j0
$$ -58 9 68 -6 -51 3 59 25 -23 -5 28 46 -9 -35 -22 15 -25 -68 -57 0 -2 -57 -41 30 16 -39 33 87 9 -28 63 53
2381E3j01J6Q1m2n6O6Pl8K2M2q8kR7n8q9P2Q2j19l6J23J4r1N6N9n7pO7n3o4O0
$$ 53 -48 -32 49 7 -49 17 24 -14 8 50 -38 -40 57 -1 -90 -18 64 -55 -91 32 46 -45 11 70 13 6 73 20 -44 16
2411A6M0j02j6P5j0o1N1L4o6PR2k7p3K4O3m0m6J9K1J2Kk5jN6K3n2k8M7K7o6m0
$$ 16 56 -46 -62 13 3 -58 -7 27 -39 -32 60 33 -40 -16 47 7 -39 -20 1 13 15 -10 -11 45 68 16 -12 35 62 -4 -44
2442d4J2K2k4k6K2J0J0J9J7j4j9M5L4m0p5K8Q1l5q3rQ2M7o0m2L3P8lq9j4N1Om0
$$ -44 -32 -10 -34 -60 -38 -28 -18 1 18 4 -15 30 64 24 -51 -23 58 23 -60 -69 13 60 0 -42 -9 69 66 -23 -37 14 20 -20
2474b0l4RQM2Rm4rP7M1n0n9K3O2J6q5p5L3J10m3j28L0J57J4j15j5P0K1kl6p1J1
$$ -20 -54 -45 -37 5 14 -30 -39 38 79 29 -30 -7 55 71 -14 -89 -56 54 11 -117 -87 70 84 -31 -46 24 45 43 7 -64 -53
2505e3J00Kj32k8J36O3q6n5N8P4J3p4p7L3J12k8j69j5J42N7j17n9Q5P1nl6m1J9
$$ -53 47 49 -83 -111 25 88 2 -53 5 79 92 18 -59 -26 86 58 -111 -126 16 73 -44 -103 -18 53 48 12 -29 -10
2533a0N9J7r4q0Q2J17p9j36O6J48Kj33k0J20O1p9r9J7Q3L1j06p7P1R6k3q3PQ0
$$ -10 49 66 -28 -108 -26 91 12 -124 -58 90 92 -41 -61 59 120 41 -58 -41 42 73 -33 -110 -39 57 34 -49 -42 38
2561C8K1k3l3k6RQ2k9j20k6J32N6j40o8J50J13j05j06P5J20m9j18k0R3L3o9p6
$$ 38 59 36 3 -23 -14 68 39 -81 -107 25 81 -59 -127 23 136 31 -75 0 120 71 -47 -67 26 59 -10 -86
2587h6M2Q3J0o2j9M4M8j1l7m0jO1L5r2q6P7J25l7j46M1J53Oj48k4J15M7j17p9
$$ -86 -44 39 49 -13 -32 12 60 49 12 -28 -29 32 67 -25 -111 -34 91 54 -92 -51 102 108 -40 -64 51 98 -19 -98
2615i8O8P3m7p8K4N9L2m2j2K6K6Kkl6k7J1P1lj12j4J16N9j09o7J04Q6p1r3J6P3
$$ -98 -30 43 -4 -82 -58 1 33 -9 -21 5 31 33 31 -5 -32 -21 50 47 -65 -79 37 96 -13 -80 24 110 39 -54 -38 35
2645C5j5o7nL5J0k9pN5K0l9QM1pl5J9K4m6k9M1J2n9k6M4L9%k6j0J4M5k6m5JM1
$$ 35 20 -47 -52 -17 -7 -36 -43 12 32 -7 1 42 35 0 19 43 -3 -32 9 21 -38 -64 -20 19 19 -7 -17 -3 42 16 -29 -28 13
2678A3pl0K5Qm0J7O4oq0RR3%p5k8M7J2m5k1NJ2J0jpMK3J6k9QK9Ok5j8K7j1kJ1
$$ 13 6 -24 1 9 -31 -14 50 44 -36 -27 66 66 -9 -37 10 22 -23 -44 -39 -27 -17 -18 -25 -21 2 18 -11 -3 26 32 7 -11 16 5 3 14
2714A4k6k0M7N0o4o6P3P5o2p3K7M4k4k2J0k4K5M3j1l9PP7rp2PN1k4k3okjJ1Pk7
$$ 14 -12 -32 15 65 1 -65 8 83 21 -52 -25 19 -5 -27 -17 -41 -16 27 16 -23 -16 61 52 -20 -13 38 14 -9 -15 -17 -18 -7 0 -27
2748b7j4N8K0o2j5P1K2p1j3M1J8m3LJ4j8J7M7k2o5M8N8m3o0K5M0m8rJ4j1LK7O
$$ -27 -41 17 37 -25 -40 31 53 -18 -31 10 28 -15 -12 2 -16 1 48 26 -39 9 67 24 -36 -11 29 -19 -28 -14 -25 -22 5 11
2780A1o4L9N3j1p4M5N1l6m2K5K9l0pJ7j7j1M8Ll9j2M1K7n5j5K9lj4Rj0j2K6K9
$$ 11 -53 -14 39 28 -46 -1 50 14 -28 -3 26 -4 -11 6 -11 -22 26 29 -10 -22 19 46 -9 -24 5 2 -12 -3 -13 -25 1 30
2812C0l3l1N3L5n1n2M8M4m2l1J8K0j3J4j8j9J3M2j3l3LL6lk7mJ0J0J8j5k8QM9
$$ 30 -3 -34 19 54 3 -49 -1 43 1 -30 -12 8 -5 9 -9 -28 -15 27 14 -19 -16 20 17 -10 -14 -4 6 24 9 -19 -11 38
2844C8Jp6J5P7j6o3MM3Jl1j6oL7J0rl4RL7Rk7j6J0J8Rl5k2OM1J0m1k6O5K6l9m5
$$ 38 39 -37 -22 55 39 -24 -20 23 24 -7 -23 -29 8 18 9 -25 -16 21 30 3 -13 -3 15 24 -11 -33 -27 14 24 -17 -43 22 48 9 -36
2879c6L6O1l5m0QK7j2k3pJ4K1jk2KK6J3k1j8PJ6Jj0j5k7L6J9j6n8L7N5j4m3lN1
$$ -36 0 61 26 -14 -6 21 9 -14 -21 -7 14 13 -9 -7 19 32 11 -7 0 16 17 7 -8 -35 1 20 4 -54 -17 38 24 -19 -22 29
2913B9j0l4%J6%oj1jL0J2k7rL3K2k0k8KK1j2Lk9qRL6j4l7J2M6Kl7j4K6J2oj1j9
$$ 29 19 -15 -15 1 1 -5 -16 -17 13 25 -2 -11 22 44 24 -4 -2 19 7 10 -19 -27 -18 18 4 -33 -21 25 27 -10 -24 2 14 8 -3 -22
2949b2J5J3j2lNJ4Nk3J4K2k1j8J3mllJ1k9J1M5rm1LM5Ol5rK4j6QJ0k0j9J7J0j8
$$ -22 -7 6 -6 -9 -4 10 15 -8 6 28 7 -11 2 -2 -5 -8 3 -26 -15 30 21 -20 -17 28 34 -1 -10 14 -2 6 16 -4 -23 -6 4 -14
2985a4JJ7Nj6J0J6j8k1J4Q%rJ2qrJ7K2k1k4K5L5l6k0K4jqj1J3kj2J9Nj6qJ8%j8
$$ -14 -13 4 9 -7 3 19 1 -20 -6 2 2 -7 5 -3 -12 5 27 6 -18 7 42 6 -14 10 9 1 -10 3 1 -11 8 13 -3 -11 7 7 -11
3022a1K5j4jpJ3j6j3K0J2j9pK8Kk5PJ8Kl2J1K5k5jJ1onJ1J1Pj4KJ2j0j9J4j0%
$$ -11 14 0 -1 -8 5 -11 -24 -4 8 -11 -18 10 12 -13 -6 12 14 -18 -7 18 -7 -8 3 -3 -8 3 14 21 7 9 21 11 -8 6 -4 -4
3058dRnj5NJ9j4kj0K5oj0J1Qj1j6K0Oj3j6K0LqMPomJ6j6NQj0LkQorPLOj7PJ9j4
$$ -4 5 0 -15 -10 9 -5 -7 -17 8 2 -8 3 11 0 -16 4 10 -3 -19 1 4 -4 0 7 1 -3 13 -3 2 10 0 3 1 9 3 -6 1 4 10 -7 0 19 5
3101Ej0%LkJkkjlmJ1lNR%plkJ1pkQkj6J2MlKrJ1NpKm%NLqPJ%j4J4okJ0j2jLkk
$$ 5 -5 -5 -2 -4 -3 -5 -7 -8 -11 -15 -4 -7 -2 7 7 0 -3 -5 6 -1 -3 5 3 -13 -1 3 0 2 -7 4 9 2 4 0 0 5 8 0 7 8 8 -6 8 2 0 10 -2 -3 0 -2 -4
3152dJljQqMKqJ2kkjnNjRllMMj%MlPpj0PJojlPj0lJ3j1LpNJ1rKjRnkoJ0Kj0J4
$$ -4 -3 -6 -7 1 -7 -3 -1 -9 3 1 -1 -2 -7 -2 -3 6 3 0 4 8 7 7 11 8 15 8 -2 5 6 0 -1 -4 3 -7 -10 3 -8 -5 -12 -7 4 -5 -3 -4 5 0 -2 -8 2 4 -6 8
3204HpKrj0K0qNOMkj1lJ2NlmMjjqKJ1j1Qj0%Lj3N%Rj0mQjkj2K2jllJJ1j4qK5j0
$$ 8 1 3 -6 -16 4 -4 1 7 11 9 -2 -5 7 12 9 5 9 8 7 -1 1 12 1 9 -1 -1 2 -11 -6 -6 3 -7 -11 -3 -4 -6 -18 4 3 0 -3 -2 9 -5 -13 12 2
3251BMplNOoKJ6j3omOQj5jK4j4j1PJ6qj6lJ9Kj3rPJ1k0%K9j0j1kJ1J1j8LPRj6
$$ 2 6 -1 -4 1 7 1 3 19 6 0 -4 2 10 -5 -6 18 4 -7 0 16 8 -8 -11 8 10 -3 -12 -5 6 -14 -14 15 5 -6 -8 3 14 -4 -1 6 15 -1
3293arPJ9j2j1J7lnLlJ6j0k3J3J8j1r%J4mj3LLJ0nqPPj8PLjj5jK1oNj3J4J1ok2
$$ -1 -10 -3 16 4 -7 10 7 2 5 2 18 8 -15 -2 16 5 -4 -4 10 6 -7 -4 -1 9 4 -4 3 10 -8 -1 2 1 -14 -15 6 0 5 -8 6 17 11 -11
3335a1J6Nj0qJ4lj5RJ0KpnPPj1m%J4lnj6RlKj4J6J0rj8K4Mj0JjkJ2Kk3J3j0%J9
$$ -11 5 10 0 -8 6 3 -12 -3 7 9 2 -3 4 11 0 -4 -4 10 7 2 -14 -5 -8 -6 -20 -4 6 -3 -21 3 7 -3 -2 -3 -5 7 9 -14 -1 -11 -11 8
3377Hj9KJ6ORj6qJ3JLpj6J3omnOJ4rmONj6KPMk1lJ1mJ5nrj0J0J3J6j7rJ1LoJj3
$$ 8 -11 -9 7 13 22 6 -2 11 12 15 8 -8 5 -1 -5 -10 -4 10 1 -3 3 8 -8 -6 1 5 -16 -19 -8 -12 3 -2 -11 -21 -11 2 18 1 -8 3 6 0 1 -12
3421a2J1MJj2mK3Pk0KQJ4j6orQOj9J3j3J7j6J2pJ5Knj3oJ9j4ljMPO%nKJ2MLk7
$$ -12 -1 3 4 -8 -12 11 18 -2 0 8 22 6 0 -9 -1 5 -14 -1 -14 3 -13 -1 -8 7 9 4 -9 -15 4 -10 -13 -14 -10 -3 3 3 -2 0 12 16 19 -8
3463hJ9Qj7nNlKoLpJ1J2Jj8KRj2%Jjj0OLQk1PJ2KKjOj6oJ2lNj2JOjJ9j2rJ2J0
$$ -8 11 19 2 -3 2 -1 1 -5 -2 -9 2 14 15 -3 -1 8 -4 -4 -3 -4 -14 -8 -5 3 -18 -11 1 3 5 4 10 -6 -12 0 -3 2 -10 -9 -3 -4 15 3 -6 6 16
3508A6rk0K2Kqn%kLpNklJ3J3j8nOOrnJ3qjjjrLJ4j0JJ1J0j3j5J2K1j6rOPr%M%
$$ 16 7 -13 9 11 3 -2 -2 -4 -1 -8 -3 -5 -8 5 18 0 -5 1 7 -2 -7 6 -2 -3 -4 -5 -14 -11 3 -7 -6 5 15 2 -13 -1 20 4 -5 1 8 -1 -1 3 3
3553CJJ7rj1KJNj7kKMlooR%J1j0JJ4koj7J8Kj1nNRo%RnMNLj4JJ6nj0qNJ1j4LJ3
$$ 3 4 21 12 1 3 4 9 -8 -10 -8 -4 -7 -13 -19 -10 -10 1 -9 -8 6 4 -2 -19 -1 1 -10 -15 -10 -1 -7 -7 2 -3 1 6 9 -5 -4 12 7 -3 -11 -6 5 -9 -6 7
3600Gj3KJ2mlJRj8j4J1J1j4qLJ1Rj3LJ5pJJNnqPj8QK1j2NQmj3J2J6j1j7jJ2k6
$$ 7 -6 -4 8 4 1 2 11 -7 -21 -10 1 -13 -21 -18 -7 2 -11 -8 7 0 1 2 7 2 -6 1 -17 -9 12 0 5 13 9 -4 8 24 13 -4 -5 7 -19
3641a9j2J4K7j8oJ9J2l4J3J4lmnNj6kQPj7OMNNNj2pJ7J0j8j5K1Kl1J6J4J2k9m
$$ -19 -31 -17 10 -8 -14 5 17 -17 -4 10 7 3 -2 3 -13 -15 -7 0 -17 -11 -7 -2 3 8 -4 -11 6 16 -2 -17 4 6 -25 -9 5 17 -12 -16
3679a6K7J4j8JJ2pk2J1k2RKNj2kK3rpRKm%J0Ll1J1J3kj6RJ0Nj8KL0oj7lQkj7J
$$ -16 11 25 7 8 20 13 -9 2 -20 -11 -9 -4 -16 -18 5 -4 -11 -2 0 -4 -4 6 9 -22 -11 2 0 -16 -7 3 8 -10 -8 22 16 -1 -4 4 2 -15 -14
3720a4Nj1J1PqJ4J%MnlnjLqmlNlj0MK5Lj6jJ4Nj8oK4rk1NOMKJLMJ0%j4J1Oj3j3
$$ -14 -9 -20 -9 -2 -10 4 5 5 9 4 1 -4 -5 -2 -10 -14 -17 -12 -15 -25 -21 4 7 -9 -10 4 9 -9 -15 9 0 -21 -16 -10 -6 -4 -3 0 4 14 14 0 11 17 4 -9
3766i%RrjJNj5K0J%mJ0pnoQOj4j2J2JJ0LjNkJ3j0j3QpqlNJ0j5oJ5Rj2J9Nj2kO
$$ -9 -9 0 -9 -10 -9 -4 -19 1 2 2 -2 8 1 -4 -10 -2 4 -10 -22 -10 -9 1 4 3 8 6 19 9 -4 4 -3 -11 -14 -9 1 -14 -20 -5 4 -8 11 16 4 2 8
3811Hpj6OJ2qj1kJ8noJ4oKrJ6r%KOk3lJ2J2oMPOrLO%j6%LPk2J7%j1pJ3j3KOJ%
$$ 8 1 -15 -9 3 -5 -16 -18 0 -5 -11 3 -3 -1 -10 6 -3 -3 -1 5 -18 -21 -9 3 -3 1 8 14 5 8 14 14 -2 -2 1 8 -14 3 3 -8 -15 -2 -15 -13 -7 -6 -6
3857fNJ5j4mNlrlJ6LqPj4KNPRj8NJ5j8Lj1Rj2lJ9k%NJ0rmPPj2lNnk1KPjKKmKM
$$ -6 -1 14 0 -4 1 -2 -11 -14 2 5 -3 4 -10 -8 -3 4 13 -5 0 15 -3 0 -11 -2 -14 -17 2 0 0 5 15 6 2 9 16 4 1 6 1 -20 -18 -11 -12 -10 -8 -12 -10 -6
3905fjqNNKj4J2LkmnJ4%qK2o%nJqKNj5QlmJRjj0J5JmNoMNpok0J4J1oj2K1%j0O
$$ -6 -7 -15 -10 -5 -3 -17 -5 -2 -4 -8 -13 1 1 -7 15 9 9 4 5 -3 -1 4 -11 -3 -6 -10 -9 0 -1 -11 4 5 1 6 0 4 9 2 -4 -24 -10 1 -5 -17 4 4 -6 0
3953@OLk0J6oomJ5rjkJ2OlLpQKNj8onJ1j4QNkj6MOJ1omQKkj1J1rNjmPnkK1Jj4
$$ 0 6 9 -11 5 -1 -7 -11 4 -5 -6 -8 4 10 7 10 3 11 13 18 0 -6 -11 0 -14 -6 -1 -3 -19 -15 -9 2 -4 -8 0 2 0 -11 0 -9 -4 -5 -9 -2 -7 -9 12 13 -1
4001a%KKrQj4J7Kj5RmRj7OJ8Kj4kJ2nkpQj7rJ7oLo%J5onoQJ%qR%j2MJ5J0rknJ4
$$ -1 -1 1 3 -6 2 -12 5 7 -8 1 -3 6 -11 -5 13 15 1 -1 11 6 4 -3 5 -12 -21 -4 -10 -7 -13 -13 2 -4 -9 -15 -7 -6 -6 -14 -5 -5 -17 -13 2 12 3 1 -4 10
4049A0j5lJ2J2k0%l%KkmJ5j9kJ1J2Kj2mNQj0j2NLrJ3J2Jj3qJ6%rPpQj6MLPLj9
$$ 10 -5 -8 4 16 -4 -4 -7 -7 -5 -7 -11 4 -15 -17 -6 6 8 -4 -8 -3 5 -5 -17 -12 -9 -18 -5 7 8 -5 -13 3 3 -6 1 -6 2 -14 -10 -7 0 3 -16
4092a6J8QKj5J8lqqNj5J0kPj1mOJLkjM%mjjmMqPQnK1j9J0nRmkmPrjoJ5lmjjJ4
$$ -16 2 10 12 -3 15 12 4 -4 1 -14 -4 -6 1 -10 -14 -8 -7 -4 -6 -7 -3 -3 -7 -8 -9 -13 -9 -17 -10 -2 -7 14 -5 5 0 9 5 3 -1 6 -3 -4 -10 5 2 -2 -3 -4 10
4141A0kj1JpJ2jp%mRmj0QOj2PQ%j4NLoJ5noj1J0LrLJ9j8J2kRj0J6j0qmJ1j1Jj4
$$ 10 8 -3 -2 -9 3 2 -5 -5 -9 0 -4 -14 -6 0 -12 -5 3 3 -11 -6 -3 -9 6 1 -5 -16 -6 -3 -12 -9 10 -8 4 2 11 1 17 7 -1 -5 6 -5 -4 -18
4185a8J7qrJ2Ok2J8Nmj0OrnJ6j9J3mKjJ0OPj1jRj4PnnPMj3lNK3j5J8nnjlJj3K
$$ -18 -1 -9 -18 -6 0 -22 -4 1 -3 -13 -7 -16 -21 -5 -24 -11 -15 -13 -14 -4 2 9 -2 -3 6 -8 -1 -6 -11 -4 0 -13 -16 -11 12 -3 15 10 5 4 1 2 -11 -9
4229ij0J0KjqNJjJKJ1nj4Pj1J1qJ3j0LlMJL0j2kqJ2nqJKj0PQj1JRj%Jj0MOpj1
$$ -9 -19 -9 -7 -8 -16 -11 -10 -11 -10 -8 3 -2 -16 -9 -20 -9 -17 -4 -14 -11 -14 -10 -9 21 9 7 -1 11 6 -2 -1 1 -9 -2 6 -5 -4 5 4 4 5 -5 -1 5 -2 -13
4275a3KJJ2j8QkOj1J5JmkPKLnnMmmOmJ2j0J1J3nojjmlK%oQmo%JKK%j1kK1j2k4
$$ -13 -11 -10 2 -16 -8 -10 -4 -15 0 1 -3 -5 2 4 7 2 -3 1 -3 -7 -1 -5 7 -3 8 21 16 10 9 8 4 1 3 3 -3 5 1 -5 -5 -4 -2 0 0 -11 -13 8 -4 -28
4323b8J1J4j%nPmjPKNmlmJ3mj8QPj8J1QJpJ1jNj2kJ1j2Qj3ol%%MKJ1kLJ2j0j4
$$ -28 -17 -3 -4 -4 -9 -2 -6 -7 0 2 7 3 0 -4 9 5 -13 -5 2 -16 -5 3 4 -3 8 7 12 0 -2 9 -3 5 -8 -14 -17 -17 -17 -13 -11 0 -2 1 13 3 -11
4368a1N%JmJ2rJ2kkMjkKQj3KLnnrK6j5LnJ%RNjoKnqPlJ1k2J3pj0J0NMOj1J6qj
$$ -11 -6 -6 -5 -9 3 -6 6 4 2 6 5 3 5 13 0 2 5 0 -5 -14 12 -3 0 -5 -4 -4 5 10 9 3 5 0 -8 -1 -4 7 -15 -2 -9 -19 -9 -4 0 6 -5 11 3 2
4416BJKj2J3j1jMJJ1Qj1nLKKnkrQj6QJlJlJ9oKkJNpj5J5qkMRpKnRQq%J1oL%Kj2
$$ 2 3 5 -7 6 -5 -6 -2 -1 10 18 7 2 5 7 9 4 2 -7 1 -15 -7 -6 -9 -8 -11 8 2 4 2 3 8 1 -14 1 -7 -9 -5 4 -3 -1 -6 3 11 3 3 14 8 11 11 13 1
4467ApLKMLJ1j0JqJ0Jkmj1MpmQK%mP%nNlJ4l%rQjqmJ5Mj4J2NpnJ0jmnNkqJ4j9
$$ 1 -6 -3 -1 3 6 17 7 8 0 10 11 9 5 -6 -2 -9 -13 -5 -3 -3 -7 0 0 -5 0 -3 11 8 8 -1 7 6 -2 -6 9 13 -1 11 16 9 4 14 13 9 4 9 7 -1 13 -6
4517fJ3mRKj1Kj3NJ1oOj1J7nj8J3j0KPMpjJ1J0k3J8jj2PnomK0oj2J1J2j1lKOj6
$$ -6 7 3 12 14 3 5 -8 -3 8 2 8 -3 14 9 -9 4 -6 -4 3 7 0 -1 10 20 -3 15 14 2 9 4 -2 -6 14 8 -4 7 19 8 5 7 13 -3
4559c%J3pj3RpmJ1okJ5Nj0JPj5nJ8j3kjJ5j2KJ4okOJ1koJ9k6%Okj1PJrkJ1Kj4
$$ -3 -3 10 3 -10 -1 -8 -12 -1 -7 -9 6 11 1 2 9 -6 -11 7 -6 -8 -9 6 -6 -4 10 4 2 8 19 17 11 30 4 4 10 8 -3 4 5 -4 -6 5 7 -7
4603gQQj6jJ4mj0J1kj6NK4j6oRRj6NK0k4JJ1jj1J3mlJ1J6j8rJ0Qj4OnpoK3j2p
$$ -7 1 9 -7 -8 6 2 -8 3 1 -15 -10 14 -2 -8 1 10 -6 -1 19 -5 -4 7 6 -5 8 4 1 12 28 10 1 11 19 5 11 6 -1 -7 16 4 -3
4644cJLqMJ5j0j4J7j5%RQj1QOj8oK1J3k2QRj6nK6oj7PPqmJ2pj0K2kk0J5Qk7J0
$$ -3 -2 1 -7 -3 12 2 -12 5 -10 -10 -1 7 -4 4 10 -8 -14 7 20 -2 6 15 -1 -6 20 14 -3 4 11 3 -1 11 4 -6 16 14 -6 9 17 -10 0
4685@Poj9J3J6k3N%JNPjj4J2Nj9J0J0j3mJ6Pl7K0J3j9MK4%k9J7Mj2KQrjLnj2J3
$$ 0 7 1 -18 -5 11 -12 -7 -7 -6 -1 6 5 -9 3 8 -11 -1 9 -4 -8 8 15 -22 -2 11 -8 -4 20 20 -9 8 12 0 2 10 1 0 3 -2 -14 -1
4726aJ3j3mQLj5%PNj2J0j1j4K7npLJ0mrK2j1k3J9J5j9kJ9rKmlkjK0mlLLj7kPj1
$$ -1 12 -1 -5 3 6 -9 -9 -2 3 -9 1 -10 -24 3 -2 -9 -6 4 0 -9 13 2 -21 -2 13 -6 -8 11 2 4 0 -3 -5 -6 14 10 7 10 13 -4 -6 1 -10
4769a0NJ6qloOjkLj2J0Pj4kJ0Nj5QkKkP%L%kmnPJRrPpmK1j5KJkq%O%kjknKLOl
$$ -10 -5 11 3 0 -6 0 -1 -3 0 -12 -2 5 -9 -11 -1 4 -11 -3 -5 -3 -5 2 2 5 5 3 -1 -6 1 2 11 2 9 2 -2 19 4 6 7 5 -3 -3 3 3 1 0 -2 -7 -5 -2 4 1
4821Aj3lJ1POlmm%NmKlMQ%oOj0L%KKjk%pNQj7JNnN%JpNPj0nQj0QJ0j4Oj0RJkJ5
$$ 1 -12 -15 -4 3 9 6 2 -2 -2 3 -1 1 -2 2 10 10 4 10 0 3 3 5 7 6 4 4 -3 2 10 -7 -6 -1 -6 -1 -1 0 -7 -2 5 -5 -10 -2 -12 -4 6 -8 -2 -12 -3 -2 -4 11
4873A1kj2O%jklJ3rK%OmjPj1JNqqJ1Kj3pOLPj%oJ0jKJNj5j1J4OpLKPj3J1jLRk
$$ 11 9 -3 3 3 2 0 -3 10 1 3 3 9 5 4 11 0 1 6 -2 -10 1 3 -10 -17 -11 -8 -1 -2 -2 -8 2 1 3 4 9 -6 -17 -3 3 -4 -1 1 8 -5 6 5 8 17 15
4922A5nj0J0lk4J7J2k3NJ6rj1K1mp%J0k4jJ1j3kLJ6mqJ6Kj1J4nnjJ1j6nJ3kj1
$$ 15 10 0 10 7 -17 0 12 -11 -6 10 1 -10 11 7 0 0 10 -14 -15 -4 -17 -19 -16 0 -4 -12 4 6 -5 9 4 -1 -2 9 -7 -12 1 -1 -12
4961a2J2J4j9J2J6j6%J5j4j6J1LqoRlpJ5Oj0rJ3Nj9J8jk2J0Nj6J4Jj0QLQlpJ9
$$ -12 0 14 -5 7 23 7 7 22 8 -8 3 6 -2 -8 1 -2 -9 6 12 2 -7 6 11 -8 10 9 -13 -3 2 -14 0 1 -9 -1 2 10 7 0 19
5000A9qj6J6lj5QK2l0MJ4lj9K4Oj5LJ7j8k2J9rj7RQj6LK9pk0K3Mj8PJ2k1kQLk6
$$ 19 11 -5 11 8 -7 1 23 -7 -3 11 8 -11 13 19 4 7 24 6 -16 3 -6 -23 -14 -6 -22 -19 10 3 -17 6 10 -8 -1 11 -10 -12 -4 -1 -27
5039b7J6K3j7%K4k4J4RqrOJ1j3j9K7j1qJ3Kj4rL6j5j8J4Ok9J4kmpK1j0j8K9J2
$$ -27 -11 12 -5 -5 19 -5 9 18 10 1 7 18 5 -14 13 2 -6 7 9 -5 -14 22 7 -11 3 9 -20 -6 -8 -12 -19 2 -8 -26 3 15
5075A5k7RJ7mj8J3Nk2MNpLJ5jj3J5J5k1jK7k0j7K4kj5lJ9j6pJ9nk6K2J2k4LJ6
$$ 15 -12 -3 14 10 -8 5 10 -12 -8 -3 -10 -7 8 7 -6 9 24 3 2 29 9 -8 16 14 -1 -4 15 -1 -8 11 6 -20 2 14 -10 -7 9
5112Ij7oORk3J4J3j8kK9nl0L2pj9J9J9k2j3J8p%%J1k1jK5j1pJ7Jj8kK1j3j1J1
$$ 9 -8 -14 -8 1 -22 -8 5 -13 -15 14 9 -21 11 4 -15 4 23 1 -12 6 -1 -1 -1 10 -11 -12 13 2 -5 12 13 -5 -7 14 1 -10 1
5149Ajj8PJ5k0jK6j4nOJ0k1J6Qj2mJ2Mj7J4J7k6JK1roQPl1J8jorJ6pj1J7J3l6
$$ 1 0 -18 -11 4 -16 -17 9 -5 -10 -4 6 -15 1 9 -3 -7 5 9 -8 6 23 -3 -2 19 10 4 12 19 -12 6 5 -1 -10 6 -1 -12 5 18 -18
5188a8LK9j5j3J5kj8J1Qok7L1PrmK1j2jNlkJ6Lk9PK2k3oJ7poJ8oj3QK1j8j3J7
$$ -18 -15 14 -1 -14 1 -1 -19 -8 0 -6 -33 -2 5 -4 -8 13 1 0 5 2 0 16 19 -10 -3 19 -4 -10 7 0 -6 12 6 -7 1 22 4 -9 8
5227H%k2NOrnJ5Mj7ORj6%J4nj0QPrNLrQP%KNpjkJJnJ0lj9kJ1J0oLRj3%KpLQj7
$$ 8 8 -14 -9 -3 -12 -17 -2 2 -15 -9 0 -16 -16 -2 -7 -17 -9 -2 -11 -6 -3 -12 -4 3 3 5 10 3 2 0 1 2 -3 7 4 -15 -17 -6 4 -2 1 10 -3 -3 -1 -8 -5 3 -14
5276a4oJ7lj0KMNrJ6kmlJ2l%OqjKqJORj1mKMlMLrP%j0lQJpLOpj6J0J1p%NrnJ3
$$ -14 -20 -3 -6 -16 -14 -10 -5 -14 2 0 -4 -7 5 2 2 8 0 -1 1 -7 -6 0 9 -2 -6 -4 0 -3 1 4 -5 2 2 -8 -11 -3 -2 -9 -6 0 -7 -23 -13 -2 -9 -9 -4 -13 -18 -5
5326ekNj0RLnJ0nnJ0l%NllOrJ1j6J0J%j0OjljKMj6QmlMQj1lJ1Kj3PRoKknnJ2N
$$ -5 -7 -2 -12 -3 0 -5 5 0 -5 5 2 2 7 4 1 7 -2 9 -7 3 4 4 -6 0 -1 -4 -5 -3 1 -15 -7 -11 -14 -10 -2 -13 -16 -5 -3 -16 -9 0 -6 -4 -6 -11 -16 -4 1
5375AkMMl%J4mj8RPj3QlpjJ5j2oPQj2LQrjj8J2nKkJ4pj0J1%oRKj0K0pojQjj5J4
$$ 1 -1 3 7 4 4 18 14 -4 5 12 -1 7 4 -3 -4 11 -1 -7 0 8 -4 -1 7 -2 -3 -21 -9 -14 -12 -14 0 -7 -17 -6 -6 -12 -3 -1 -11 9 2 -4 -5 3 2 -13 1
5422AOnM%KnJjLmjoJMmmOJrNNoMknj6K2nPmK2l4J7PrJPQj4nJ3kj0lJ7j5PJJoJ3
$$ 1 7 2 6 6 8 3 4 3 6 2 1 -5 -4 0 -4 -8 -2 -1 -10 -5 0 -6 -2 -4 -9 -25 -3 -8 -1 -5 17 -17 0 7 -2 -1 6 14 0 -5 8 6 -4 -7 10 -5 2 3 4 -2 11
5473A1j0j2J9pj3kJ5j3%J7rk0J7Opj2K2Mj7J5olkQomJ2KrKL%jRmj2K1nnoNOj0
$$ 11 1 -11 8 1 -12 -14 1 -12 -12 5 -4 -24 -7 -1 -8 -20 2 6 -11 4 -2 -5 -7 1 -5 -9 3 5 -4 -2 1 1 0 9 5 -7 14 9 4 -2 3 9 -1
5516aPkk3J6Kj0PJ4j7oMNpRRj4pK0qrjK2j8KJ6Kj1PpopK0j4rK6j2nQJ2j7mK1j5
$$ -1 6 4 -19 -3 -1 -11 -4 10 -7 -13 -9 -4 -11 -2 7 -7 -14 6 -2 -11 -12 10 -8 -6 10 12 1 8 1 -5 -12 8 -6 -15 11 -1 -6 2 14 -3 -7 14 -1
5559aj4J8j1nJ4n%j0J0Lk4K6Pj4MNj2mPJ5j5NN%pJ7rMkLljKj1jjJ3j7J1mj1RJ7
$$ -1 -15 3 -8 -13 1 -4 -4 -14 -4 -1 -25 1 8 -6 -2 3 -9 -13 -6 9 -6 -1 4 4 -3 14 5 9 7 10 7 6 8 -3 -4 -5 8 -9 2 -2 -13 -4 13
5602A3j7KnoOj5J7j4nJ2Rj4RNj0jPNj2QPj6lQK0pnLKmJLlQj3kOJlkQj3jRj6PN
$$ 13 -4 -2 -7 -13 -7 -22 -5 -19 -24 -12 -3 -17 -8 -3 -13 -14 -7 -2 -14 -6 1 -15 -18 -10 10 3 -2 1 3 -1 0 3 0 8 -5 -7 -1 0 -3 -5 3 -10 -11 -2 -18 -11 -6
5649fLj0pJ4pqRoJOJ0j1OPjj0PKkLJ0rnJ6kj5%J5qqJ5qrNkkKOmj7LmJ7n%jJ%j
$$ -6 -3 -13 -20 -6 -13 -21 -12 -18 -17 -11 -1 -12 -6 1 0 -10 -3 -1 -3 0 10 1 -4 12 10 -5 -5 10 2 -6 9 1 -8 -3 -5 -7 -5 1 -3 -20 -17 -21 -4 -9 -9 -10 -9 -9 -10
5698a0rJ4kKoKKMjQJonJ6j6J4KonJ2rMj1O%rKNkNj8OOnLj0JjJ1Jj6J2NjmPknk
$$ -10 -19 -5 -7 -5 -11 -9 -7 -3 -4 4 5 -1 -6 10 -6 8 10 4 -1 11 2 6 -5 1 1 -8 -6 -1 -3 2 -16 -10 -4 -9 -6 -16 -15 -16 -5 -4 -20 -8 -3 -4 -8 -1 -3 -8 -10
5747a0J0lKJj0J0KOj0lOQrLj2RoNJMnlkPrPj1PjolkJ4j2QmJ2j1J5%kqLkjPoJP
$$ -10 0 -3 -1 0 -10 0 2 8 -2 -5 1 9 0 3 -9 0 -6 -1 0 4 -1 -4 -6 1 -8 -1 -12 -5 -6 -12 -15 -17 -3 -15 -7 -11 1 -10 5 5 3 -5 -2 -4 -5 2 -4 -3 4
5796Dkj7J5J2j2oJ1Rj5Mj0lrjQoJ0MlknK2j5J5j0rjrJ2oJPmLJ2kl%Oj1J6lj3J0
$$ 4 2 -15 0 12 0 -6 5 14 -1 3 -7 -10 -19 -20 -12 -18 -8 -4 -7 -9 -14 8 -7 8 -2 -11 -12 -21 -9 -15 -14 -7 -11 -8 4 2 -1 -1 5 -6 10 7 -6 4
5840Dnq%J2kkN%kmP%rpJlnJ2j4OQj1KJ2J3j8m%QqNpMpJ4oJ8omOLLrqPq%Pj1MP
$$ 4 -1 -9 -9 3 1 -1 4 4 2 -2 5 5 -4 -11 -10 -13 -18 -6 -20 -14 -6 -17 -15 -3 10 -8 -12 -12 -4 -12 -7 -14 -10 -17 -3 -9 9 3 -1 5 8 11 2 -6 1 -7 -7 0 -11 -7 0
5891@nLpNMpPqNlljqKNpJ3%PMjnMj1J5j3NjoJ5pMj1J0%mJNj0KOlrKpK%pJ5nPq
$$ 0 -5 -2 -9 -4 0 -7 0 -8 -3 -6 -9 -10 -18 -16 -11 -18 -5 -5 2 6 5 0 4 -7 8 -5 0 -1 -7 8 1 5 -6 4 4 0 1 6 -4 -2 4 1 -8 -6 -13 -11 -11 -18 -3 -8 -1 -9
5943iLOpNj3QQpJnj1RkJ7oQnLpQnrPMrJ1qKJJ0orPL%jj2jnnMKNRj9J7Ojnjn%J5
$$ -9 -6 0 -7 -2 -15 -7 1 -6 -5 -10 -21 -12 -14 3 -3 5 0 3 -4 4 -1 -10 -3 1 -8 3 -5 -3 -2 8 2 -7 0 3 3 2 -10 -11 -16 -21 -17 -15 -10 -1 -20 -3 3 2 -3 -4 -9 -9 6
5996FlpKkPoJJ5r%mOJ3pnnkPjMqnkOJ%lLMj3mNkLj2J0kkJ3mLmMNpJ0j4OMojJ2
$$ 6 3 -4 -2 -4 3 -3 -2 13 4 4 0 6 19 12 7 2 0 7 6 10 2 -3 -5 1 2 2 -1 2 6 -7 -11 -6 -8 -5 -17 -7 -9 -11 2 -2 1 -3 1 6 -1 9 -5 1 5 -1 -2 10
6048A0kOmkpOmqR%j2LNj6J1%JmPj2NlOoLQmjLNqL%LoOPMpJrJ0nkkkMKj3RrQJJ1
$$ 10 8 14 10 8 1 7 3 -5 4 4 -8 -5 0 -16 -5 -5 -4 -8 -1 -13 -8 -11 -5 -11 -8 0 -4 -5 -2 3 -5 -2 -2 1 -5 1 8 12 5 6 -3 7 2 0 -2 -4 0 2 -11 -2 -11 -3 -2 9
6102IolJljj1PpkOMKJOPqMpPOj7QmjJ3p%JMmRj0K0j4j1MJrJ0rNpOLKrlJJ0qrJ2
$$ 9 3 0 1 -2 -3 -14 -7 -14 -16 -10 -6 -4 -3 3 10 2 6 -1 6 12 -5 3 -1 -2 11 4 4 5 9 5 14 4 24 10 -1 3 4 -5 5 -4 1 -6 0 3 5 -4 -7 -6 4 -4 -13 -1
6154aj9J5rRMmJ5n%LoOjpPj1OqJOJ1rnJ6JprPLj9OOj0mN%O%ljORj1jkNj3K3j5
$$ -1 -20 -5 -14 -5 -1 -5 10 5 5 8 2 8 7 0 7 -4 2 -6 -5 1 12 3 -2 14 15 8 -1 6 9 -10 -4 2 -8 -12 -7 -7 -1 -1 -4 -5 1 10 -1 -2 -4 1 -12 11 -4
6203d%RoMNPlnOjknpJLMorkJ3KnJKNj2JQj1M%j0qJ7j1J6qJLJ0j0M%QpkjkQkqJ4
$$ -4 -4 5 -1 3 8 15 12 7 13 12 10 5 -2 -1 2 6 0 -9 -11 2 4 -1 0 2 7 -5 -4 4 -7 -3 -3 -13 -21 -4 -15 1 -7 -6 -3 7 -3 1 1 9 2 0 -1 -3 5 3 -5 9
6255IKpRLnOj0%jomMklJ3kj1KkJjMJkMj8QKKKjMQj1J6j8J3%KmMoKK%J0k0RjJ1
$$ 9 11 4 13 16 11 17 7 7 6 0 -4 0 -2 -5 8 6 -5 -3 -5 -4 -5 -1 0 -2 2 -16 -8 -6 -4 -2 -3 1 9 -2 14 -4 9 9 11 7 11 5 7 9 9 19 -1 8 7 18
6305A8okj5R%nnKlj2JJ7jrJ8j0RmjP%pkkrQjJ1j2J4lKPjoOnlj0J5okKMlOmrNj1
$$ 18 12 10 -5 4 4 -1 -6 -4 -7 -19 -18 -1 -2 -11 7 -3 6 2 1 8 8 1 -1 -3 -12 -4 -5 6 -6 8 5 7 14 13 7 13 8 5 -5 10 4 2 4 8 5 11 7 -2 3 -8
6355hOMnJJj2OnPLRj2NJ3kj0nlJ0lJJJJjJ0rRnNr%Kj1lL%RqnLKQj0J7j6RqQno
$$ -8 -2 2 -3 -2 -1 -13 -7 -12 -5 -2 7 -5 0 13 11 1 -4 -7 3 0 1 2 3 4 3 13 4 13 8 13 4 4 6 -5 -8 -5 -5 4 -4 -9 -6 -4 4 -6 11 -5 4 -4 4 -1 -7
6406glJ8j6MLknJK4j0OmooJ3j8K7nKj0mJRoJkjlRpqLmNmmJ1jNLlrJ4j3jRj0J0
$$ -7 -10 8 -8 -4 -1 -3 -8 -7 17 7 13 9 3 -3 10 -8 19 14 16 6 2 3 12 6 7 5 4 1 10 3 -5 -2 -6 -1 -5 -9 2 1 6 9 6 -3 11 -2 -3 6 -4 6
6454FpJJ2j0LmlJ8Jkj1POj1qjQJLq%j0K0pkJ3j0j2JJ0poR%j2MQNJjJOj0KmKmR
$$ 6 -1 0 12 2 5 1 -2 16 17 15 4 11 17 6 -2 -3 5 6 9 1 1 -9 11 4 2 15 5 -7 -6 4 -3 -9 0 0 -12 -8 0 5 6 5 6 12 2 4 0 2 -2 7
6502GoOjJLMMmqRj9J2lkNj2Nnkj0RLjjLJ1kpj0QnMMMpJ0j0R%OPj6%J2nJnKnJ0
$$ 7 1 7 6 7 10 14 18 14 6 15 -4 8 5 3 8 -4 1 -4 -6 -16 -7 -4 -5 -6 -3 8 6 -1 -11 -3 -8 -4 0 4 -3 7 -3 6 6 12 19 3 3 15 10 11 6 8 3 13
6552A3j6J4klrPQKk0J0pkkMoONk3J2RoKJ4oJrk%RlJQqRJJ0krkKkjj0NMrKJLj5
$$ 13 -3 11 9 6 -3 4 12 14 -6 4 -3 -5 -7 -3 -9 -3 2 -21 -9 0 -6 -4 10 4 5 -4 -6 -6 3 0 1 9 1 10 11 21 19 10 8 10 8 7 -3 2 6 -3 -1 0 3 -12
6602a2J8oklRmKlj0J3j4QnJ5j4J2mkJ1qOnkJJKmQpKJ5j2Lj0J3lLklnqNjjJ1qj2
$$ -12 6 0 -2 -5 4 0 2 -1 -11 2 -12 -4 -9 6 -8 4 0 -2 9 1 7 2 0 1 2 4 0 8 1 3 18 6 9 -1 12 9 12 10 7 2 -6 -1 -2 -3 8 0 -12
6649a2J6qNLrPjqKn%J0nQjJ5j6RP%kkpNj0mJkP%lPnPLnnqJ0mplMmMPloJ1oQqM
$$ -12 4 -4 1 4 -5 2 1 -7 -5 -10 -10 0 -5 3 2 17 1 10 17 17 15 13 6 11 1 -3 -2 -4 3 3 0 7 2 9 12 7 2 -6 4 0 -7 -10 -6 -10 -6 1 -2 -8 3 -3 5 -3 1
6702AkkPoMLn%MNMLj4J4jmnLj1jJ0pqMRqJJLj3mK0rLmkjLoJ1mkJK1oj0KOMmPj1
$$ 1 -1 -3 4 -2 2 5 0 0 4 9 13 16 2 16 15 11 6 9 -2 -3 7 0 -8 -4 5 -3 -2 -1 2 -11 -15 5 -4 -1 -5 -7 -8 -5 -11 0 -4 -6 -5 16 10 0 2 8 12 8 15 4
6754DKMnN%nlNkpLKoJ2j2llOlMnMQlj7J2mnJ2RLk5J3Nm%J1Kj4J4Nj4J2mpNqjn
$$ 4 6 10 5 10 10 5 2 7 5 -2 1 3 -3 9 -3 -6 -9 -3 -6 -2 -7 -3 5 2 -15 -3 -7 -12 0 9 12 -13 0 5 1 1 12 14 0 14 19 5 17 13 6 11 3 2 -3
6803cMNmnRj2QKjj0JLj8J2JLlnNMOMk%KKkRpnmnJ1j3J8loKlMpQPj7L%oKQnlJ4
$$ -3 1 6 2 -3 6 -6 2 4 3 -7 -6 -3 -21 -9 -8 -5 -8 -13 -8 -4 2 6 4 4 6 8 6 15 8 3 -1 -6 5 -8 10 7 1 3 0 4 -3 5 12 -5 -2 -2 -8 -6 2 -3 -6 8
6855HKj1P%j4KJPj4kQjJRmMJ5Kj0mmpJ1LKqR%j5J3J2k0nJ4lonMmMljr%J4nONj0
$$ 8 10 -1 6 6 -8 -6 -5 2 -12 -14 -6 -7 -6 3 -1 3 18 20 10 6 2 -5 6 9 11 3 12 12 -3 10 22 2 -3 11 8 2 -3 1 -3 1 -2 -3 -12 -12 2 -3 3 8 -2
6904bnJ5kj8PKj4MJ9Lj8J8kj4J2RrN%Jj1oJ6j2lJ1j4jOKK%%lqOJj6J2lLj2J9N
$$ -2 -7 8 6 -12 -5 -3 -17 -13 6 9 -9 9 7 -7 5 14 5 10 10 11 0 -6 10 -2 -5 6 -8 -9 -3 -1 1 1 1 -2 -10 -4 -3 -19 -7 -10 -7 -19 0 5
6948Ek3J7Kj0J0J3j2nQnjJ5qkmO%j0J3j0%J2Kj1kPj0nROj0ljJ1j6J5plKJ0ooJ8
$$ 5 -18 -1 1 -9 1 14 2 -3 5 0 -1 14 6 4 0 6 6 -4 9 -1 -1 11 13 2 0 7 -3 -8 1 7 -3 -6 -7 4 -12 3 -4 -7 -5 5 -1 -7 11
6991A1j4llJ6j3PJ2j2lJ1plK3j4oMQrjJOj7NmOjLomJ2mj3LMKjJ0Jj7J2%nKJ0J
$$ 11 -3 -6 -9 7 -6 1 13 1 -2 9 2 -1 22 8 2 6 14 5 4 5 11 -6 -1 -5 1 0 3 -3 -7 5 1 -12 -9 -5 -3 -4 6 7 -10 2 2 -3 -1 9 10
7036A0j0Ql%j1J8%nqJ0llJ0pPj2OrlJ0qLOJj4LmkMjL%JoMQlpjOmNJ1jMj9J6kj
$$ 10 0 8 5 5 -6 12 12 7 -1 9 6 3 13 6 13 1 7 -2 -5 5 -3 0 6 7 -7 -4 -8 -10 -6 -7 -4 -4 -3 -9 -5 3 0 -7 -8 -2 -6 -1 10 9 13 -6 10 8 7
7085GJmKkJ5j7On%oRmNj0jMlkOjPj4klJ8mj3QPJj1PknLNKJ0rk%LJ4j0pJ1jKj6
$$ 7 8 4 6 4 19 2 8 3 3 -3 6 2 7 -3 -4 0 -3 -5 1 0 7 -7 -9 -12 6 2 -11 -3 4 5 -6 1 -1 -6 -3 2 4 14 5 3 3 6 20 10 3 14 13 15 -1
7134aKMJjLmrJ0MnkjnNj0LoJ5j2J1pJ0qjOkKNj0QKMo%qJ9nqJ1omQpJ1onplJkk
$$ -1 1 5 6 5 8 4 -5 5 9 4 2 1 -4 1 -9 -6 -12 3 -9 2 -5 5 -3 -4 2 0 2 7 -3 5 7 11 5 5 -3 16 11 3 14 8 4 12 5 16 10 5 -2 -5 -4 -6 -8
7185hjJ0j4MJ2qkMQnljj0J6%oKJ1oJMnJRpjPqPj1QLk0J7rOjpmjOnJPJj1jj%Qr
$$ -8 -9 1 -13 -9 3 -5 -7 -3 5 0 -3 -4 -14 2 2 -4 -2 9 3 4 8 3 4 13 6 5 12 4 11 0 8 11 -9 8 -1 5 4 -3 -7 -8 -2 -7 -6 1 2 -9 -10 -11 -11 -3 -12
7236a2OQnlQj6J6jKkJlpJ3%NojOpOjpKLo%kJ0j3J1Nj3MlmM%JOqKj4jJ4nLkK8j7
$$ -12 -6 2 -3 -6 2 -14 2 1 3 1 2 -1 -8 5 5 10 4 3 9 2 8 7 0 2 5 -1 -1 -3 7 -6 5 10 -3 1 -2 -6 -2 -2 -1 5 -3 -1 -15 -16 -2 -7 -4 -6 22 5
7286EJOLkj2J2j3OmO%NlrOLJqmmjOnlPq%mLJ1jKJj1jJ6oqN%j4PJ0%Kq%QlMKkR
$$ 5 6 12 15 13 1 13 0 6 2 8 8 13 10 1 7 10 11 3 -1 -5 -6 0 -5 -8 -1 -9 -9 -13 -10 1 0 2 3 -8 -9 7 1 -7 -2 -2 -16 -9 1 1 3 -5 -5 3 0 4 6 4 13
7339A3Lj7J1lj0J3jk3J0N%j0LRj6J2J0j6jMLkJ1kmkJpJJ2mp%KNKLkj1J3mnmJ6
$$ 13 16 -1 10 7 -3 10 9 -14 -4 1 1 -9 -6 3 -13 -1 9 -7 -8 -4 -1 -3 8 6 2 0 1 -6 -5 7 3 -4 -4 -2 3 5 8 6 -5 8 4 -1 -5 11
7383A1kj0PjlMpMqOj5QJNnL%Kj4J0Oj7J5MknJ1j2LNlmLJ4j5QjJqMMNlKmMjqKr
$$ 11 9 -1 6 5 2 6 -1 3 -5 1 -14 -6 -5 0 -5 -2 -2 0 -14 -4 2 -15 0 4 2 -3 8 -4 -1 4 1 -3 0 14 -1 7 6 7 -1 3 7 12 9 11 7 11 10 2 4 -5
7433eRkrNoJJ0j4J1j4K5j1j4NjRn%RjpJ5onOmNJPqnJ4j8RJ0k5J0RlrJJ1rLmmO
$$ -5 4 2 -7 -2 -8 -7 3 -11 0 -14 11 0 -14 -9 -10 -1 -6 -6 3 2 -5 10 4 -1 5 1 6 7 14 6 1 15 -3 6 16 -9 1 10 7 -2 -1 10 1 4 0 -4 2
7480BlLj0%MoQJLj1J5JmLLj4jK3j2LqRRqNoKL%n%omJ1rKj6J6n%JMJn%j5J2LLp
$$ 2 -1 2 -8 -8 -4 -10 -2 -1 2 -9 6 7 3 6 9 -5 -6 17 5 8 0 9 18 10 15 9 11 14 14 9 9 3 -1 10 1 3 -13 3 -2 -2 -1 3 4 -1 -1 -16 -4 -1 2 -5
7530eJ0o%oJ2lQjMj3MRkrqJ9mnLLj3PR%kpnlonJ5%oPooQJMOlrqQKj1RMMmkJ5j1
$$ -5 5 -1 -1 -7 5 2 10 9 13 0 4 13 11 2 -6 13 9 4 7 10 -3 4 13 13 11 4 -1 -4 -10 -15 0 0 -6 1 -5 -11 -3 -2 2 8 5 -4 -12 -4 -2 -13 -4 0 4 0 -2 13 2
7583BLJ3j3J3j4LlRq%oNmr%J3q%%Nj5QRJnpMpPMkj0Rl%lQRnpJ4NlpJJ2pml%Qj
$$ 2 5 18 5 18 4 7 4 13 5 5 -1 4 0 -9 -9 4 -4 -4 -4 1 -14 -6 3 4 -1 -8 -4 -11 -4 0 -2 -12 -3 -6 -6 -9 -1 8 3 -4 10 15 12 5 6 18 11 7 4 4 12 11
7635A1mKj2kJ4nj0Rj8K3j5lMLNPk1PQpnOj%QjLJ1j0pJ5rOnjLRj4Nj1OJJmOMqn
$$ 11 7 9 -3 -5 9 4 -6 3 -15 8 -7 -10 -6 -3 2 9 -12 -5 3 -4 -9 -3 -4 -4 4 3 6 17 7 0 15 6 12 7 6 9 18 4 9 -2 4 5 6 2 8 12 4 -1
7683aRq%j0J4rjknK4j2rPjkJ3qKmJ2mj1J0J%Pj1J0Jnj1jOOj3mJ0qNPPj4RMj8J
$$ -1 8 0 0 -10 4 -5 -6 -8 -13 11 -1 -10 -3 -4 -6 7 -1 1 -3 9 5 -6 4 5 5 12 1 11 12 7 -4 -5 1 7 -6 -10 0 -8 -3 4 11 -3 6 10 -8 -7
7729gKJnjJ%oQKOmkMjk%nQKJjJ3j1JKlJ0j1LloJ%Kj%knJ1ol%JjOKj1RrPj3J6p
$$ -7 -5 -4 -9 -10 -9 -9 -15 -7 -5 1 -3 -5 -1 -2 -4 -4 -9 -1 1 2 1 14 3 4 6 3 13 2 5 2 -4 -3 -3 -1 -2 -2 -4 -9 2 -4 -7 -7 -6 -7 -1 1 -10 -1 -10 -3 -16 0 -7
7782gMoJ1jjlmMRKKrMNoQpnlJ5j4MK%nj0J5j2jKOmn%MKnLJ1nKj0MQpJ%LLMj4J5
$$ -7 -3 -9 2 1 0 -3 -7 -3 6 8 10 1 5 10 4 12 5 0 -3 12 -2 2 4 4 -1 -11 4 -8 -9 -7 -1 -5 -10 -10 -6 -4 -9 -6 5 0 2 -8 -4 4 -3 -2 -2 1 4 8 -6 9
7834Ikj3J1KPmJj1%LPpnqQjNjnlp%J0j0mKRoJ2onJ1kJJ3j2PmjQj4MLNrP%KpKK
$$ 9 7 -6 5 7 14 10 11 0 0 3 10 3 -2 -10 -2 -3 2 1 -4 -7 -14 -14 -4 -14 -18 -16 -7 -13 -1 -7 -12 -1 -3 -2 11 -1 6 2 1 9 -5 -1 2 7 -2 5 5 7 0 2 4
7885D%%Mj3J8k1KNnQj0NLl%qJ0j0pJ0oJ1j0K1qR%j1LNjkkKPlKLmlkKjNpj2L%J
$$ 4 4 4 8 -5 13 -8 -6 -1 -6 2 -8 -3 0 -3 -3 -11 -1 -11 -18 -8 -14 -3 -13 8 0 9 9 -2 1 6 5 3 1 3 10 7 9 12 8 5 3 5 4 9 2 -10 -7 -7 -6
7934fLmJ2j2lNpKJ5Kj4kPmRrOlK%OlPnpP%KkMk%PqnKNoJ3j2lmMrJ1JqJ0rK%mk
$$ -6 -3 -7 5 -7 -10 -5 -12 -10 5 7 -7 -9 -2 -6 3 -6 0 -3 -1 -1 5 2 9 4 -3 4 4 6 4 8 6 6 13 5 0 2 7 1 14 2 -1 -5 -1 -10 1 2 -6 4 -5 -3 -3 -7 -9
7987iRLmkqP%QknJ3kJ2Kj8oJ0ooJ4jjLmNojMpMj3jPPpjolMkNRojKj0J4j1LkJ2
$$ -9 0 3 -1 -3 -11 -4 -4 4 2 -3 10 8 20 22 4 -2 8 2 -4 10 9 8 11 7 12 6 5 9 2 6 -7 -8 -1 6 -1 -2 -8 -11 -7 -9 -4 5 -1 -2 0 -10 4 -7 -4 -6 6
8038FrPJOLj2kJPrPj1MJ2nl%p%Pkj7K1j3LlLJk%kJ1kKKj0QoMkkNrJ2Qj2KKJ1j6
$$ 6 -3 4 5 11 14 2 0 1 8 -1 6 -5 -1 11 6 3 3 -4 -4 3 1 -16 5 -8 -5 -8 -5 -4 -6 -6 -8 3 1 3 5 -5 3 -3 1 -1 -3 2 -7 5 13 1 3 5 16 0
8088@K%mPKRj6jkjk%oNNrrJ2kRnqlMQOj1OLJj1QNOm%KMo%J2j3kKLloKJRqkj2J0
$$ 0 2 2 -2 5 7 16 0 -1 -3 -4 -6 -6 -12 -7 -2 -11 -20 -8 -10 -1 -6 -14 -17 -13 -5 1 -10 -4 -1 0 -11 -3 2 8 4 4 6 10 4 4 16 3 1 3 6 3 -3 -1 0 9 1 -1 -13 -3
8142cPj3Rj5%rJ0J5j4KQrNLKlQlnMj0J5J2oj4J0j3RlPj3NjPljj0mJ6pJ1j3NmL
$$ -3 4 -9 0 -15 -15 -24 -14 1 -13 -11 -3 -12 -7 -4 -2 -5 3 0 -5 -1 -11 4 16 10 -4 6 -7 2 -1 6 -7 -2 -3 4 1 0 -10 -14 2 -5 6 -7 -2 -6 -3
8187cKj5J7j0
$$ -3 -1 -16 1 -9
8191i
$$ Imaginary data points
##PAGE= N=2
##DATA TABLE= (X++(I..I)), XYDATA
0@%%%%%%%%%%%%%%%qJ6j6J6j6K4l2L2m0M8n6O5p3Q8j04J20j36J52j69J93k17K42
$$ 0 0 0 0 0 0 0 0 0 0 0 0 0 0 0 0 -8 8 -8 8 -8 16 -16 16 -24 24 -32 33 -40 48 -56 64 -72 80 -89 104 -113 129
37A29k74L06l39L79m24M70n21N77o39P05p77Q56r42J039j146J261j390J535j697
$$ 129 -145 161 -178 201 -223 247 -274 303 -336 369 -408 448 -494 545 -601 660 -730 805 -892
56h92J883k094K338k624K963l377L895m560N445o702Q642j2033J9681o7776M848
$$ -892 991 -1103 1235 -1389 1574 -1803 2092 -2468 2977 -3725 4917 -7116 12565 -55211 -50363
71e0363J05018p2517l8227M9166M4026j1144J5059j1688l3458J6552M4717l7427
$$ -50363 54655 -17862 -56089 -6923 37103 25959 41018 29330 -4128 12424 57141 19714
83A9714n1662J9598L2481k1860j2609J2515J464R60J8571j1051k7029J3537K5203
$$ 19714 -31948 -12350 20131 -1729 -14338 -1823 -359 601 19172 8121 -18908 -5371 19832
96A9832l0702m0452J7556L7918j1307l5809M475M6916K7286j8629j8512K1076
$$ 19832 -10870 -51322 -33766 4152 -7155 -42964 -38489 8427 35713 17084 -1428 19648
108A9648K8620r92j9852j8667j0723P101Q988k2022l2666N530K7305L618j1710
$$ 19648 48268 47276 27424 8757 -1966 5135 14123 -7899 -40565 -35035 -7730 -4112 -15822
121a5822j694N756J3443J5620r140k2068P800J8931j3124j6414J3877Q451j2609
$$ -15822 -17516 -11760 1683 17303 8163 -13905 -6105 12826 -298 -16712 -2835 5616 -6993
134f993M509J9859J663n249M678m80j932N900j0797k5581j366J1135j3388j4132
$$ -6993 -2484 17375 19038 13789 18467 17987 16055 21955 11158 -14423 -15789 -4654 -18042 -32174
148c2174R000J942n061J9282J6265j4903p93K8850M299j9877M208Q877j7194o225
$$ -32174 -23174 -21232 -26293 -7011 9254 -5649 -6442 22408 26707 6830 11038 19915 2721 -3504
162c504J4956p697j8677J1041J3100j0510J068J4033j0424j3008J6604P133k4892
$$ -3504 11452 3755 -14922 -3881 9219 -1291 -223 13810 3386 -9622 6982 14115 -10777
175a0777j1674J2892N22q468M020P53m714J4811K0091n417j0571J1849J4211m292
$$ -10777 -22451 -9559 -9037 -17505 -13485 -12732 -17446 -2635 17456 12039 1468 13317 27528 23236
189B3236j0665o375l101O85j902j0584p571M210N285qk1R98K760O663J885p154
$$ 23236 12571 6196 3095 3780 1878 -8706 -16277 -12067 -6782 -6790 -6811 -5813 -3053 3610 5495 -1659
205a659k445O259n05q561j808N254L202J096k71k16P628J0859l071j1686J195
$$ -1659 -4104 2155 1650 -6911 -8719 -3465 -263 833 562 346 7974 18833 15762 4076 5271
220E271R264l576j4008q358L04L585O08o985o085P554J3340K740n134m86O727
$$ 5271 14535 10959 -3049 -11407 -11103 -7518 -6910 -13895 -19980 -12426 914 3654 -1480 -1966 4761
235D761Q651J022j1246q308Q302P816j0014j0608N206P862L78r84k464k073P844
$$ 4761 13412 14434 3188 -5120 3182 10998 984 -9624 -4418 3444 3822 2838 374 -1699 6145
250F145O786j1915j2366Q827P877j2556r910O982N017j495L424J852k618Q411
$$ 6145 12931 1016 -11350 -2523 5354 -7202 -17112 -10130 -5113 -6608 -3184 -1332 -3950 4461
264D461J2644o048j1653P426R967r071j1372J195J153k588J432j774p151M740
$$ 4461 17105 11057 -596 6830 16797 7726 -3646 -2451 -1298 -3886 -2454 -4228 -11379 -6639
278f639J3482k477j2704L954J3540k351j1624q95N209j43k354j228j503K716P473
$$ -6639 6843 4366 -8338 -4384 9156 6805 -4819 -5714 -505 -648 -3002 -4230 -5733 -3017 4456
293D456K030m433M51O338J975m179m173k364n19P65k857p062j988O319L967l864
$$ 4456 6486 2053 2504 8842 10817 6638 2465 101 -418 347 -2510 -9572 -11560 -5241 -1274 -5138
309e138k492O119P611k60n022J43N101m4o319k289L276l83l380J386K753j513
$$ -5138 -7630 -1511 6100 5840 818 961 6062 6018 -301 -2590 686 303 -3077 -1691 1062 -451
325d51N42M892l4m556J213L857l595o158l42J249j311r93r33n12M745N847k013
$$ -451 91 4983 4949 393 1606 5463 1868 -4290 -4632 -3383 -4694 -5687 -6620 -7132 -2387 3460 1447
342A447k859O148N555m268l911K543k16m721j127R31k890k234K583K419q46m05
$$ 1447 -1412 4736 10291 6023 2112 4655 4439 -282 -1409 -478 -3368 -5602 -3019 -600 -1446 -1851
358a851K088K247R8j624p73L77j459k518K32J153j312m05K851K250P78J612N76
$$ -1851 237 2484 2582 958 185 562 -897 -3415 -3183 -2030 -3342 -3747 -896 1354 2132 3744 4320
375D320l33K223P95m864l011K225j730n478L64K104k818M73N714l53k968N375
$$ 4320 3987 6210 7005 2141 -870 1355 -375 -5853 -5489 -3385 -6203 -5730 -16 -369 -3337 2038
391B038M255n201j327N633j938o381K104K487m528k68M067k132p90O952L58o622
$$ 2038 6293 1092 -235 5398 3460 -2921 -817 1670 -2858 -3126 941 -1191 -1981 4971 5329 -1293
407a293L189O033o415n543M989j186p761L091N154o932k519J0497K800p019K695
$$ -1293 1896 7929 1514 -4029 960 -226 -7987 -4896 258 -6674 -9193 1304 4104 -2915 -220
422b20P831k039l159K542j527l860K136n15o336R74N584l368l786O310L474n181
$$ -220 7611 5572 2413 4955 3428 -432 1704 1189 -5147 -4173 1411 -1957 -5743 567 4041 -1140
438a140K67N486k116m842J973J573m151k004K327J239o23j92J478L752K210k317
$$ -1140 -873 4613 2497 -2345 -372 1201 -2950 -4954 -2627 -1388 -2011 -2203 -725 3027 5237 2920
454B920r75L698O01m941k382J352j040k726r77J29J170J317p90O68M397N31l676
$$ 2920 1945 5643 6244 1303 -1079 273 -767 -3493 -4470 -4341 -3171 -1854 -2644 -1976 2421 2952 -724
471g24K361M339m796m905M960J670p205n21O503j032l650M063K753k548J505J985
$$ -724 1637 5976 1180 -3725 1235 2905 -4300 -4821 1682 650 -3000 1063 3816 1268 2773 4758
487D758m274o46M087m473o395N010K993q101l57R532j297o359O687O492o430k078
$$ 4758 484 -162 3925 -548 -6943 -1933 1060 -7041 -7398 2134 837 -5522 1165 7657 1227 -851
503h51P079j343o682K077K076n104m45L562k918j554N818M95m907L500N094m895
$$ -851 6228 4885 -1797 280 2356 -2748 -3193 369 -2549 -4103 1715 2210 -2697 803 5897 1002
519A002l450M994j59o256O19L606k835k081L610J487j305J771J937n51O89O48
$$ 1002 -2448 2546 2387 -3869 -3250 356 -2479 -4560 -950 537 -768 1003 2940 2389 3078 3726
535C726k262q99J212k052l017J129J097j899r7K268N81J12J325L97q5O37p66j453
$$ 3726 1464 565 1777 -275 -3292 -2163 -1066 -2965 -3062 -794 -213 -101 1224 1621 1536 2173 1407 -46
553d6M20m87k335N13J909j688q88L493J095k245J456K441k153j084K129j859l357
$$ -46 374 -113 -2448 -1935 -26 -1714 -2602 891 1986 -259 1197 3638 1485 401 2530 671 -2686
570b686K090R13m148K91M289j504k284M371J831l813J337L916l450l183L921J13
$$ -2686 -596 317 -3831 -3540 749 -755 -3039 1332 3163 -650 687 4603 1153 -2030 1891 2004
586B004n449Q81L876k805j996M254O73l062K555L007l520j296L806j041m251J391
$$ 2004 -3445 -2564 1312 -1493 -3489 765 1438 -1624 931 3938 418 -878 2928 1887 -2364 -973
602i73J801l105m78L092r52j786L111J714k543K81K511j319j821J293l22k240
$$ -973 828 -2277 -2755 337 -615 -2401 710 2424 -119 162 2673 1354 -467 826 504 -1736
618a736O20J097j657k60K273J59j055J380J226r91l11N68p76q65J50n48q46L52
$$ -1736 -1116 -19 -1676 -1936 337 496 -559 821 2047 1056 745 1313 537 -328 -178 -726 -1572 -1220
636a220K89k73N99O51j81O45J086m89p14N28q5r32q7l10r02P05J017j198l35K277
$$ -1220 -931 -1204 -605 46 -135 510 1596 1107 393 921 836 -96 -183 -493 -1395 -690 327 -871 -1206 1071
656A071L01j790R80J683j905j351J985k24k826M51J976j352j104J992O70j103
$$ 1071 1372 -418 562 2245 340 -1011 974 750 -2076 -1625 351 -1001 -2105 -113 557 -546
672e46J050J180j215lJ470j166j781J392O27k413m12K243l13j775J193J697r91
$$ -546 504 1684 469 466 1936 770 -1011 381 1008 -1405 -1817 426 113 -1662 -469 1228 237
689B37o81J300L32j143l30L96j58m63l79m1O74M04o01J01J288K43r56J52P88m95
$$ 237 -444 856 1188 45 -285 111 -47 -510 -889 -930 -256 148 -453 -352 936 1179 223 375 1163 668
709F68q97Q8O1n34k41Q5J12L67Q3k08P38R67p57r69J131Q65j688j190J353N48
$$ 668 -229 -141 -80 -614 -855 -770 -658 -291 -208 -416 322 1289 532 -437 694 1559 -129 -1319 34 582
729E82j531l79J290J78o83N07P74k75k19M39p0m94j42o5k63p0m1j82L67N92l34
$$ 582 -949 -1328 -38 140 -543 -36 738 463 244 683 613 119 -23 -88 -351 -421 -462 -644 -277 315 -19
750a9m14J036R43j120j203J056J101j362j596N95J118m12p83J81O34N05L70n6
$$ -19 -433 603 1546 426 -777 279 1380 18 -1578 -983 135 -277 -1060 -879 -245 260 630 574
768E74l23K48O01o3q21n17K18L34l76p71l1R01M41p88m80J037J079p77j474L62
$$ 574 251 499 1100 1037 216 -301 -83 251 -125 -896 -927 -26 415 -373 -853 184 1263 486 -988 -626
788f26J567k02j952m80J583Q78q48o23M81Q60P96Oj193n82J341P67j692j606O36
$$ -626 941 739 -1213 -1693 -110 768 -80 -703 -222 638 1434 1440 247 -335 1006 1773 81 -1525 -889
807h89R91m15r70l73P07J367M1j428K57K234J28k256j54K015N6j719m15P31M76
$$ -889 102 -313 -1283 -1656 -949 418 459 -969 -712 1522 1650 -606 -760 1255 1311 -408 -823 -92 384
826C84M09l50j265L81K146P0k350p09J546O28j115j325n09R57J443o37j774Q59
$$ 384 793 443 -822 -441 1705 1775 -575 -1284 262 890 -225 -1550 -2059 -1102 341 -296 -2070 -1211
844a211K605J47j717K28J687J95j170o55L13M50m52j224l43R90N43p91p28L61
$$ -1211 1394 1541 -176 52 1739 1934 764 109 422 872 420 -804 -1147 -157 386 -405 -1133 -772
862g72J018O67q42j562L72J988l6k224n77J779J156n29q12j2J300J441p34j791
$$ -772 246 913 71 -1491 -1119 869 833 -1391 -1968 -189 967 438 -374 -386 914 2355 1621 -170
880a70N78J677j034k061L36Q72j040q43N31J55k8P29pp21R45J659p35j657O22
$$ -170 408 2085 1051 -1010 -674 198 -842 -1685 -1154 -999 -1027 -298 -305 -1026 -81 1578 843 -814 -192
899a92J523k08j237n68M38J045M79j080r52J099J387o45j512j47P78k2r83p40
$$ -192 1331 1123 -114 -682 -244 801 1280 200 -752 347 1734 1089 -423 -570 208 186 -797 -1537
917a537K63M24k69j33O73N42j2L99N68J6K30M34p26r32P65O57j481j186R33O89
$$ -1537 -1274 -850 -1119 -1252 -579 -37 -49 350 918 934 1164 1598 872 -60 705 1362 -119 -1305 -372 317
937C17o12j86J47l28N12R97q37j312P87R89r96o43Q08P6n16Q44Q88n40j00R57
$$ 317 -295 -481 -334 -662 -150 847 10 -1302 -515 474 -522 -1165 -357 -281 -797 47 935 395 295 1252
957A252J82m44J75j78j002j88N55n92j181L6O36K7j33J97J64K36N40K57l03j65
$$ 1252 1434 990 1165 987 -15 -203 352 -240 -1421 -1385 -749 -722 -855 -658 -494 -258 282 539 236 71
977G1J96J19j68j68J8P2p1Q9N18K40n14k62N49K35o20p04l22n3K49p3r12l24J213
$$ 71 267 386 218 50 68 140 69 158 676 916 402 140 689 924 304 -400 -722 -775 -526 -599 -1511 -1835 -622
1000f22Q87o43k47J074O15k31J07O7m74k1L38n87p86M23L49p33k07Q26J50n61
$$ -622 265 -378 -625 449 1064 833 940 1007 533 512 850 263 -523 -100 249 -484 -691 135 285 -276
1020b76k6K88qM4k34p91n2J041J10j158n2J439O82n77j51O17L65m4k11m81m30
$$ -276 -302 -14 -22 22 -212 -1003 -1055 -14 96 -1062 -1114 325 1007 430 279 896 1261 1217 1006 525 95
1041I5K7Mn66o34N1M32J8l22J58O47K48k56l4L44K33j63m49j90N44M77n75n97
$$ 95 122 126 -440 -1074 -1023 -591 -573 -895 -737 -90 158 -98 -132 212 445 282 -167 -357 187 664 89 -508
1063e08P89R60m75p14M54M26n06l92k2n10m90L22P5o95j10Q28M09k03J91N47L18
$$ -508 281 1241 766 52 506 932 426 34 12 -498 -988 -666 -591 -1286 -1396 -568 -159 -362 -171 376 694
1084F94J36k9k39L8K76l99p02J73N20m55o54M57O02m24m44M32J81n55j75L09k18
$$ 694 830 801 562 600 876 477 -225 -52 468 13 -641 -184 418 -6 -450 -18 163 -392 -567 -258 -476
1105d76m94K17M89p6j55M27O06J94j2J15J81Q8j53m29l35pj70n70k78K62ql55
$$ -476 -970 -753 -264 -340 -495 -68 538 732 720 835 1016 1104 951 522 187 180 10 -560 -838 -576 -584 -939
1127i39K08N50j69k99N80N04n60m19O82M20o61k71O77L60l22qL60J15r3n4j89
$$ -939 -731 -181 -350 -649 -69 435 -125 -544 138 558 -103 -374 303 663 341 333 693 808 715 661 472
1148D72k31r9k91m61j58K5k18j30K81J86k7L55O13l5k71N31O41m71p35L92O39
$$ 472 241 142 -149 -610 -768 -743 -961 -1091 -810 -624 -651 -296 317 282 11 542 1183 712 -23 369 1008
1169A008m92p97J91N51j58m08%J25k4r2j56k34j05J3p8o3P5N5J58M08K30m0K97
$$ 1008 516 -281 -90 461 303 -105 -105 20 -4 -96 -252 -486 -591 -578 -656 -719 -644 -589 -431 -23 207 167 464
1192D64N93n3m76J52N07l83r41p0N25k32q35j70M85J95k51j58J38K45J68n9j22
$$ 464 1057 1004 528 680 1187 804 -137 -207 318 86 -749 -919 -434 -239 -490 -648 -510 -265 -97 -156 -278
1213b78N0J46O2J17Q7o4Q6M32K05l21q7L92J5o08k67K61j93p24k31L46N0l64r7
$$ -278 -228 -82 -20 97 184 120 206 638 843 522 435 827 842 234 -33 228 35 -689 -920 -574 -524 -888 -985
1236i85L68M05J47l2O8K93K97l2j73kP8o7k2K9j65j96J91K48k77l88J50J69l42
$$ -985 -617 -212 -65 -97 -29 264 561 529 356 354 432 365 343 372 207 11 202 450 173 -215 -65 104 -238
1259b38l56J01L5k84p0K89J75l2J36L31L05J65P7lJ0J01m0l10k61m6q6j64j32
$$ -238 -594 -493 -458 -742 -812 -523 -348 -380 -244 87 392 557 634 631 641 742 702 392 131 85 -1 -165 -297
1282b97k4j02K6K04Q0k07m6K44P9j70p5J41K8m5J61K24k8pK87K14j28j26N4q9
$$ -297 -321 -423 -397 -193 -113 -320 -366 -122 -43 -213 -288 -147 -119 -164 -3 221 193 186 473 687 559 433 487 398
1306C98k39j30j19l31j88J36Oj98J08K78P2N9K98J44j68M8K91j10l02L2J20j54
$$ 398 159 29 -90 -421 -609 -473 -467 -665 -557 -279 -207 -148 150 294 126 174 465 355 53 85 205 51
1328E1p9J77%j69J10K18j32k08P6k6k37o6J5k24j25K75J21j75J53M48O0p1K76
$$ 51 -28 149 149 -20 90 308 176 -32 44 18 -219 -285 -270 -494 -619 -344 -223 -398 -245 203 263 192 468
1351D68J76k60j15J90j57l89m9P2j80j11J41M0l2J70J32p2K4J31j32k01J28O0
$$ 468 644 384 269 459 302 -87 -136 -64 -244 -355 -214 -174 -206 -36 96 24 48 179 47 -154 -26 34
1373C4l39q5L52P0k79J74M48n0j93K33J59k91j70R6j71k87rj7j25J09J40n9J34
$$ 34 -305 -390 -38 32 -247 -73 375 325 132 365 524 233 63 159 -12 -299 -308 -325 -450 -341 -201 -260 -126
1396a26L90Qk25K28L08l77l64K66Q9m77j55L72L6k72J56L67l5r5J52Q0j63n8q5
$$ -126 264 272 47 275 583 206 -158 108 197 -280 -435 -63 -27 -299 -143 224 189 94 246 326 163 105 20
1419B0k15l9Q1j91j34L03K16k16R4N10Kl75J82L27l69m32J89R0m05j11K59J5p2
$$ 20 -195 -234 -153 -344 -478 -175 41 -175 -81 429 431 56 238 565 196 -236 -47 43 -362 -473 -214 -199 -271
1442b71K54J74l8J41J87k08r3J62j96m29J16K01l56j94M32J95k59J62M15r4k43
$$ -271 -17 157 119 260 447 239 146 308 112 -317 -201 0 -356 -550 -118 77 -182 -20 395 301 58
1463E8K41R0m15j62J62j64k44J49J39j66J62M05l7j24K99J46l40r3J68k66m05
$$ 58 299 389 -26 -188 -26 -190 -434 -285 -146 -312 -150 255 218 94 393 539 199 106 274 8 -397
1484c97J14J32l14m3L87O3j02L10K79k30m6L28j18m81jK08k75k87K26J83j53Q6
$$ -397 -283 -151 -465 -508 -121 -58 -160 150 429 199 153 481 363 -118 -119 89 -186 -473 -247 -64 -217 -131
1506a31L09M4n4J56Ok08l1rk93k06J90Kl18J73M64o1j92M69L45l66j52L65p4n18
$$ -131 178 222 168 324 330 122 91 82 -211 -417 -227 -225 -543 -370 94 33 -159 310 655 289 137 502 428 -90
1530i0q1J63k15k09J33N7J2K35P7r0K18K40k94k48L06k1n85l3M38j57m15L53M94
$$ -90 -171 -8 -223 -432 -299 -242 -230 5 82 -8 210 450 156 -92 214 193 -392 -425 13 -144 -559 -206 288
1553B88j86j71L95K39k61j30N1j30j49o8k12j37J93J00k24J59M50j3k44L25L16
$$ 288 102 -69 326 565 304 174 225 95 -54 -122 -334 -471 -278 -178 -402 -243 207 194 -50 275 591
1574E91m00k95L20N8n60j52L98J0l23J09L91P3j38O2J45Rj15j91j64K5M6k26k06
$$ 591 191 -104 216 274 -286 -438 -40 -30 -353 -244 147 220 82 144 289 298 183 -8 -172 -147 -101 -327 -533
1597e33K22K82o2n2L05K07j09K3J58j46k89K4P6k77k38J18J81o8m4J55K06Q6o4
$$ -533 -311 -29 -91 -143 162 369 260 283 441 295 6 30 106 -171 -409 -291 -110 -178 -222 -67 139 225 161
1620A61n8J09K5k28k26O7O5j56r4J00J54J22R7pM1J78O6k13j56K3q0j95o0J4j07
$$ 161 103 212 237 9 -217 -150 -85 -241 -335 -235 -81 41 138 131 172 350 416 203 47 70 -10 -205 -265 -251 -358
1645c58M3K43O2q0J74K79r1j66J20L9k71j22P1p3j45J02R3m2J08K18or7J26R2
$$ -358 -315 -72 -10 -90 84 363 272 106 226 265 -6 -128 -57 -130 -275 -173 -80 -122 -14 204 198 101 227 319
1669C19k07j98N0m5k07n7J04nJ4J49J31P3J06N5k0j6Qj11j67r5m4j3qn9J2K13
$$ 319 112 -86 -36 -81 -288 -345 -241 -246 -232 -83 48 121 227 282 262 246 254 143 -24 -119 -163 -176 -184 -243 -231 -18
1695a8J51q9%K30L7k37o3R6j51k11N3Kj06J62J86j37J3M28J21l51l0K83j49l15
$$ -18 133 44 44 274 311 74 11 107 -44 -255 -202 -200 -306 -144 42 -95 -82 346 467 116 86 369 220 -95
1719i5L2m4k99Q6L44k47k94M95M97l82k73N09K34m80k29K80m5l17k8N8l7J72J85
$$ -95 -63 -107 -406 -320 24 -223 -517 -22 475 93 -180 329 563 83 -146 134 89 -228 -256 -198 -235 -63 122
1742A22k10o2N13K48n28k45M36O4n04j45J57j98p1M06L0m67K16Q20m6o93J33O21
$$ 122 -88 -150 363 611 83 -162 274 338 -166 -311 -154 -352 -423 -17 13 -454 -238 582 536 -157 -24 597
1764E97j62o00l7K14o9j95j04K3L05K24k66j63N51L51n01l98L23K16l14k90n5
$$ 597 435 -165 -202 12 -57 -252 -356 -333 -28 196 -70 -233 318 669 168 -230 93 309 -5 -295 -350
1785c50MJ56K16j03j95K02M61J48k75l49J21M44j21p96j95O61J22o92o6P23J56
$$ -350 -346 -190 26 -77 -272 -70 391 539 264 -85 36 480 359 -437 -632 29 151 -541 -607 116 272
1806B72l88R2L66J9q3q9k92KL56k31o76J43O80n6m36J94L45l1J51J78m56l57N56
$$ 272 -116 -24 342 361 278 189 -103 -101 255 24 -652 -509 171 115 -321 -127 218 187 338 516 60 -297 259
1829B59K87q48n36O34M21m93k56M70K90j14P1J31j22J4J39k91l66K49K19n38l11
$$ 259 546 -302 -838 -204 217 -276 -532 -62 228 114 185 316 194 208 347 56 -310 -61 158 -380 -691
1850f91O09L94m53j69N08K29j80L5o5l47J27L52m15o10L10M97k37k41L06J65l0
$$ -691 -82 312 -141 -310 198 427 247 282 217 -130 -3 349 -66 -676 -366 131 -106 -347 -41 124 94
1871I4K40P4l76k3L66k01n16R0K54k27j89K22J72J9P0l7O1L59k8n62m2N01j51
$$ 94 334 408 32 9 375 174 -342 -252 2 -225 -414 -192 -20 -1 69 32 93 452 424 -138 -180 321 170
1894A70o00P2L76j92q1L67k1k42L27L58l50k53K68k7l10O9Ll55J01M68k19l99
$$ 170 -430 -358 18 -174 -255 112 91 -151 176 534 184 -69 199 172 -138 -69 -66 -421 -320 148 -71 -470
1916d70N37M97n25k85O82J35p94j11O37j43o92J47N08k14k63L91K21k78Q5L38
$$ -470 67 564 39 -246 436 571 -223 -334 303 160 -532 -385 123 -91 -354 37 258 -20 65 403
1936D03j97k73K28K5m39N4L27l57l36O07L27o61m5Q84k8q27K46O79m94o15M93
$$ 403 206 -67 161 186 -253 -199 128 -229 -565 42 369 -292 -337 547 519 -308 -62 617 123 -492 1
1957AK64o54q8O16r2m02L27L48k78l9L17j62k62K67K0m98J2M59j92m31L58L79
$$ 1 265 -389 -477 139 47 -355 -28 320 42 3 320 158 -104 163 183 -315 -303 156 -36 -467 -109 270
1979B70k98j46M20J16l51n9K60m8k72n9J00ro0qR2N8j1P0R8l1j21K7R0p6j30k4
$$ 270 -28 -174 246 362 11 -48 212 164 -108 -167 -67 -76 -136 -144 -52 6 -5 65 163 132 11 38 128 52 -78 -102
2005a02j2nR5lj33N6K46K7j88M8J31j01r3R9%k35j8K20K8j87kK01L0p5O7J3j42
$$ -102 -114 -119 -24 -27 -160 -104 142 169 -19 29 160 59 -34 65 65 -170 -188 32 60 -127 -129 72 102 27 94 107 -35
2032c5pJ83n7k68J0K14l9j46J14Q8j49N4K41p5k70J11J99j53j44J40l3j57J44
$$ -35 -42 141 84 -184 -174 40 1 -145 -31 57 -92 -38 203 128 -142 -31 168 15 -129 11 -22 -179 -35
2055c5K20k07j83K49J72j67o9J01q9o4J66Jk70j9K77Nj73NJ08j1L4N2q6p3O7N3
$$ -35 185 -22 -205 44 216 49 -20 81 -8 -72 94 95 -175 -194 83 88 -85 -80 28 17 51 103 17 -56 11 64
2081F4p9l0Nk6%Q5M1p4n7L0J12N6j10j53Q5J72o3j68K6P9l7M5J03j00j61J68K04
$$ 64 -15 -45 -40 -66 -66 19 60 -14 -71 -41 71 127 17 -136 -51 121 58 -110 -84 -5 -42 3 106 6 -155 13 217
2108B17j49k05R0J38o0o1Jk0J3Q0l0p2O6N4j24oK12m0l11M8L40m2l54O1K76n0
$$ 217 68 -137 -47 91 31 -30 -29 -49 -36 44 14 -58 8 62 -62 -68 144 104 -207 -159 181 139 -215 -154 122 72
2134G2j76J15J12j67o0K04N7k17r1J62J06r0j33%J28R6j11j26J10J35q2j48J26
$$ 72 -104 11 123 -44 -104 100 157 -60 -151 11 117 27 -106 -106 22 118 7 -119 -9 126 44 -104 22
2157B2J29j85j62K39J81k70k02K73K16k46j83K07J53k09r8J79N3j95n0J95O2j71
$$ 22 151 -34 -196 43 224 -46 -248 25 241 -5 -188 19 172 -37 -135 44 97 -98 -148 47 109 -62
2179f2j08J52J63o1j81K8J82J4j90j9J67J1j80k0K05lk29j1K72M5l01m3L09K7
$$ -62 -170 -18 145 84 -97 -69 113 127 -63 -82 85 96 -84 -104 101 98 -131 -142 130 175 -126 -169 140 167
2203A67k98l1K76j2k69O6K40q4j90J04J57o7q7L5J3L6K4j51m5J87K0k33K6K67
$$ 167 -131 -162 114 102 -167 -101 139 55 -135 -31 126 59 -28 7 20 56 80 -71 -116 71 91 -142 -116 151
2227A51r8k54J89K40k29k01K86J20k77p0K29Nj47K2Q8n1MK9m0J1O7n7r4J01N5
$$ 151 53 -201 -12 228 -1 -202 84 204 -73 -143 86 91 -56 -34 54 3 7 36 -4 7 74 17 -77 24 79
2252G9j37o0J49J1j30J0J40l2j01P0R0n9o1O7L8o5m0N4J1n5PL6j2k4K8j2j6L3
$$ 79 -58 -118 31 42 -88 -78 62 30 -71 -1 89 30 -31 36 74 9 -31 23 34 -21 -14 22 10 -14 14 2 -14 19
2280A9K2o1k5O7j8o2L0N2p8K5Q4l1q2J08P1j52k6J49k2j59N4J13j02o5R5K5j00
$$ 19 41 -20 -45 22 4 -58 -28 24 -54 -29 55 24 -58 50 121 -31 -57 92 70 -89 -35 78 -24 -89 6 31 -69
2307f9O7L4q0L4Q7o1p9J12K4j36M2J40j03j31J77Q9j87m1J81j5j45K6Q6n4n2M7
$$ -69 -2 32 -48 -14 73 12 -67 45 69 -67 -25 115 12 -119 58 147 -40 -81 100 85 -60 -34 52 -2 -54 -7
2333gk7rM5j8m4O9O9r9j8J17j1j15L4R6o6q7P5P0p5n0O1O2n1o0L7L3j3m3k0L3
$$ -7 -34 -43 2 -16 -60 9 78 -21 -39 78 67 -48 -14 82 16 -71 4 74 -1 -51 10 72 21 -39 -2 31 18 -25 -45 -12
2363a2J8j9k5K0N1Pn7K4N6lp7M2N5q5n8Q1K4j09J1J00l2n8N4K0m9J0M9o2k9J01
$$ -12 6 -13 -38 -18 33 40 -17 7 63 60 -17 25 80 -5 -63 18 42 -67 -56 44 12 -46 8 28 -21 -11 38 -24 -53 48
2393D8k0j01P0R5q9n2J27K1j01J0Q1p1l9N9l2p4M8N3j00j2R7Jo6M6M4n6j3Q4j4
$$ 48 28 -73 -3 92 3 -49 78 99 -2 8 89 18 -21 38 6 -68 -20 33 -67 -79 18 19 -47 -1 43 -13 -26 58 44
2422D4q8K0O3k0m9K1L1Qrj2kL7Jm8k4L7J2m8l8M8L3l1j8K9M4Jj4J3j6k6K9Pm2
$$ 44 -44 -24 39 19 -30 -9 22 30 21 9 7 44 45 -3 -27 10 22 -26 -64 -16 17 -14 -32 -3 41 42 28 41 25 -1 28 35 -7
2455go7M2P8k4q1KR1K8o0n6N2O3l0q4j7O3K4m4k2K4L9K1Nm2OO3J7o6o1L1N1j1
$$ -7 -74 -32 46 22 -59 -57 34 62 2 -54 -2 61 31 -53 -70 -7 17 -27 -49 -25 14 35 40 -2 4 67 84 18 -43 -12 39 28
2487B8p7n0O5J10m5j25L2J63jj55jR4J0m8l4l2J8J02qj18JJ41K6j05n5Q2N6l5
$$ 28 -49 -99 -34 76 31 -94 -62 101 100 -55 -56 38 48 0 -34 -66 -48 54 46 -72 -71 70 96 -9 -64 18 74 39
2515C9o7n7O1Q8l0j45J0J61M8j32m0R5P2m8o7qQM5Jr7n1R9J08p6j28P6J60n4j30
$$ 39 -28 -85 -24 64 34 -111 -101 60 108 -24 -64 31 103 55 -12 -20 -12 33 34 -63 -114 -15 93 17 -111 -35 125 71 -59
2544e9j3J15M5j04q2L7Q9K3r3n5R1J10n1j00L7O6J7o4m2j9M1M9k5j00J4J43M9
$$ -59 -72 43 88 -16 -98 -61 28 51 -42 -97 -6 104 53 -47 -10 56 73 9 -33 -52 -11 38 13 -87 -73 70 119
2571A19j58m9J56Q7j43j11Q8J18q2j24J4J04J8p7l9N5Q8Np5l0N6L9l0n3k6K1M9
$$ 119 -39 -88 68 155 12 -99 -11 107 25 -99 -85 19 37 -40 -79 -24 64 69 -6 -36 20 59 29 -24 -50 -29 20
2598B0J5p1n1R0J26o4j36M4J31j1j54k0J23J9j08o5R0P9m7p1K3P7J8m6k6L1K3
$$ 20 35 -36 -87 3 129 65 -71 -27 104 93 -61 -81 42 61 -47 -112 -22 57 10 -61 -38 39 57 11 -15 16 39
2625C9k2j8k6k5L0N4k2p7%J24L0j15o6J13P1p6j01M0P8j7n4lN9K0l8jN2K0n3j1
$$ 39 17 -1 -27 -52 -22 32 10 -67 -67 57 87 -28 -94 19 90 14 -87 -47 31 14 -40 -43 16 36 -2 -3 49 69 16 5
2655EM9k7n1J3L4o0k7N4K4m0l0L6M9j0m0%K7L3k5m6PN1j5k8J1K1j1jN3mp7PO8
$$ 5 54 27 -24 -11 23 -37 -64 -10 14 -26 -56 -20 29 19 -21 -21 6 39 14 -32 -25 26 11 -17 -6 15 4 3 56 52 -25 -18 50
2688E0jr1j5O5J8m8k2M0J7pJ0olK1Pl0j8L4%m5j2L2Kj7K1qk9M8M3o0o7P1P1q0
$$ 50 49 -42 -57 8 26 -22 -44 -4 13 6 16 10 7 28 35 5 -13 21 21 -24 -36 -4 -2 -19 2 -6 -35 13 56 -4 -71 0 71 -9
2722io5M1O2j8k1OJ0J8K6nn3OO8k0p6%N3j5n3J2K0PKJ8l1JM0J7o6k2P0K5p3k9
$$ -9 -74 -33 29 11 -10 -4 6 24 50 45 -8 -2 66 46 -30 -30 23 8 -45 -33 -13 -6 -4 14 -17 -16 24 41 -25 -47 23 48 -25 -54
2756e4P2J2m5%L5j9J3J8j3n0K3N2l6o6M3M1m1j9L9Nj7K2J4l7RN5k9o2K5O2m7m4
$$ -54 18 30 -15 -15 20 1 14 32 19 -31 -8 44 8 -58 -15 26 -15 -34 5 10 -7 15 29 -8 1 56 27 -35 -10 52 5 -39
2788c9K6L4qk9K2j0pK5J6n2nL7Nl9k1L5L1k7J0Oj5J4M3m6l5N5L0m6n7N3K5m2k4
$$ -39 -13 21 13 -16 6 -4 -11 14 30 -22 -27 10 15 -24 -45 -10 21 -6 4 10 -5 9 52 6 -29 26 56 10 -47 6 31 -11 -35
2821c5K5K1j4mOj5JN8k9m5J4M2j6l6J7KJ3Rj0l2K0M9no3LP2op3j1N9Ml1j5K8J3
$$ -35 -10 11 -3 -7 -1 -16 -15 43 14 -31 -17 25 9 -27 -10 -8 5 14 4 -28 -8 41 36 -27 -24 48 42 -31 -42 17 21 -10 -25 3 16
2856A6%rj6RK7J1l4k4J2K8k3poPL1Km9j5N8K5n8k7M4K9k7m4K7J9Kk5KJ8L0kl7
$$ 16 16 7 -9 0 27 38 4 -20 -8 20 -3 -10 -16 -9 22 24 -25 -40 18 43 -15 -42 2 31 4 -40 -13 6 8 -17 -15 3 33 31 -6
2891fmL9J4m0k2J8J7j3jj3mK9L6n2l1M1M7l2n4J3L2Pm0mK1J1j5nlL1Kk3j1K9J0
$$ -6 -10 29 43 3 -19 -1 16 3 2 -11 -15 14 50 -2 -33 8 55 23 -31 -18 14 21 -19 -23 -2 9 -6 -11 -14 17 19 -4 -15 14 24
2926B4k0k1RK0oj8O%J9K6j6m7K9L3om2j1K8Pqj9%J2J3Ok3J5Lrk0J2J4nl2LK3Q
$$ 24 4 -17 -8 12 6 -12 -6 -6 13 39 23 -24 5 38 32 -10 -21 7 14 6 -13 -13 -1 12 18 -5 10 13 4 -16 -4 10 5 -27 -24 -1 7
2963Gj0J%kL0mm0MM3pl4oK3lKj1J1pQJ8j7oK1lj5j8K4rj1%K3qj5K2oj8J6K7l4
$$ 7 -3 -2 -2 -4 26 22 -18 -14 29 22 -12 -18 5 2 4 -7 4 -3 5 23 6 0 21 18 3 -15 9 0 -11 -11 12 4 -11 11 5 -13 3 30 -4
3002dk0K6K0k3k8K2K1k4KJ0kj2K0Kj3LJ6j6kOQmj6J7Jk2J1J9j3oQQk8KL0j7k3
$$ -4 -24 2 22 -1 -29 -7 14 -10 -8 2 0 -12 8 10 -3 0 16 0 -2 4 12 8 -8 9 10 -12 -1 18 5 -1 7 15 -13 -11 19 2 -21
3039b1jL4qj9KJ5kqJ5j0jJ2Qk0KpLoK7lj6OJ1Jj8J4NKk5QJ3j7nJ0MqpPJ1pjnR
$$ -21 -22 12 4 -15 -13 2 0 -8 7 -3 -4 8 16 -4 -2 -9 -6 -12 15 12 -4 2 13 14 -4 10 15 17 -8 0 13 -4 -9 1 5 -3 -10 -3 8 1 0 -5 4
3082Dj0J1jj2qLJ%J0lPLKnqRJ3j2knJ3j4LmNQmoJ6ppJ3onoPpklJ2j1R%%jnM%j1
$$ 4 -6 5 4 -8 -16 -13 -12 -12 -2 -5 2 5 7 2 -6 3 16 4 2 -3 10 -4 -1 -5 0 8 4 -2 14 7 0 13 7 2 -4 3 -4 -6 -9 3 -8 1 1 1 0 -5 -1 -1 -12
3131a2PmJOpJ2qQMokLO%Kn%MMmoJmMoj2J6mlQj4J6qjLqj1J3J2j1NljmQ%klJ5j
$$ -12 -5 -9 -8 -2 -9 3 -5 3 7 1 -1 2 8 8 10 5 5 9 13 9 3 4 0 4 -2 -14 2 -2 -5 3 -11 5 -3 -4 -1 -9 -20 -7 5 -6 -1 -4 -5 -9 -1 -1 -3 -6 9 8
3181HpnJ7rjjJ1onKRj3J6j3RLj2KmJ4j7lJ0ompMJ8j8RkPlmlJ0qnPPlKoRJ1j1j3
$$ 8 1 -4 13 4 3 2 13 7 2 4 13 0 16 3 12 15 3 5 1 15 -2 -5 5 -1 -5 -12 -8 10 -8 1 -1 6 3 -1 -4 6 -2 -7 0 7 4 6 0 9 20 9 -4
3228dP%jOnKqJ7kJ0k8NKK1j7j0MRk2RNOj1qJ1LqOmP%j3J3J0j2j0MJ7qj0%L1j0
$$ -4 3 3 2 8 3 5 -3 14 12 22 -6 -1 1 22 5 -5 -1 8 -14 -5 0 6 -5 -13 -2 1 -7 -1 -5 2 2 -11 2 12 0 -10 -6 11 3 -7 -7 24 14
3271A4j7LJ2nmj2K1nj2lJ3J0j3qJ1kj0mMQj3pJ6J5j4j4J1J2j0KPJ0j8jlK9k7m
$$ 14 -3 0 12 7 3 -9 12 7 -5 -8 5 15 2 -6 5 3 -7 -11 -7 1 -12 -19 -3 12 -2 -16 -5 7 -3 -1 6 16 -2 -3 -6 23 -4 -8
3309hQJ5Mk1oQJ9k3jJ4qj3J7oNj1j0J3MloJ3J4qk2MJ1j3PLjMkkJ2j6lK7Rk1j1
$$ -8 0 15 19 -2 -8 0 19 -4 -5 9 1 -12 5 -1 4 -7 -17 -4 0 -3 -9 4 18 10 -12 -8 3 -10 -3 0 -1 3 1 -1 11 -5 -8 19 28 7 -4
3350dPJ2j0rLMOj2LNJ3k3kJ3J3j2j7J4pnnLkKJ4Pj0qJJ0lrJLJ3j3Lj2K4%j5mJ1
$$ -4 3 15 5 -4 -1 3 9 -3 0 5 18 -5 -7 6 19 7 -10 4 -3 -8 -13 -10 -12 -10 4 11 1 -7 -6 4 1 -8 -7 -4 9 -4 -1 -13 11 11 -4 -8 3
3393CJ4mqLLlnqNoljMJ4kj3ROQrk0KQKnj1JJ6JmMjKJ1qplJ0Jqj1kK1nJJ1m%lk
$$ 3 17 13 5 8 11 8 3 -5 0 -6 -9 -10 -6 8 6 -7 2 8 16 7 -13 -11 -3 -1 -6 -17 -16 0 1 -3 1 0 2 13 5 -2 -5 5 6 -2 -13 -15 6 1 2 13 9 9 6 4
3443DLNqnjMj1KoRJ1lNjnNkonjJ2j5NkJLQjoPJ3oj4PMnj7OMlpJ5Mj1J0Pnj3J5
$$ 4 7 12 4 -1 -2 2 -9 -7 -13 -4 7 4 9 8 3 8 6 0 -5 -6 6 -9 -4 -6 -5 -2 6 5 -1 6 19 13 -1 6 10 5 -12 -6 -2 -5 -12 3 7 -4 6 13 8 -5 10
3492A0j0j0pNOmjLJJ0Kj1nJ3J5j4j2LJ9j3l0K3J3pKOm%RRj9%%J0pk1KJ0mkLMJ5
$$ 10 0 -10 -17 -12 -6 -10 -11 -8 -7 3 5 -6 -11 2 17 3 -9 -6 13 0 -30 -7 6 -1 1 7 3 3 12 21 2 2 2 12 5 -16 -14 -4 -8 -10 -7 -3 12
3535A2j6Pj7J2Nmj1QJ8k5j4LK7jpLJ0qKOj7oJ8Ok5PJ1jnPpJ7%rj1lQRj9nJ1Pr
$$ 12 -4 3 -14 -2 3 -1 -12 -4 14 -11 -25 -22 5 4 -3 0 10 2 4 10 -7 -13 5 11 -14 -7 4 3 -2 5 -2 15 15 6 -5 -8 0 9 -10 -15 -4 3 -6
3578fj6K1J3j0mNJ2j3oMo%lNpJ5j4RNmNOJLpj9J5Qk1oJ9J0k0j1J9PmrJ0J8k6p
$$ -6 -22 -1 12 2 -2 3 15 2 -4 0 -6 -6 -9 -4 -11 4 -10 -1 4 0 5 11 12 15 8 -11 4 12 -9 -15 4 14 -6 -17 2 9 5 -4 6 24 -2 -9
3620i%J6j6JJ0kkKLmOQj3rJ7k1jmK6k2oK4J7j6mRK8l8%J6j6kqJ9mj0OJlkPLMo
$$ -9 -9 7 -9 -8 2 0 -2 0 3 -1 5 13 0 -9 8 -13 -14 -18 8 -14 -20 4 21 5 1 10 38 0 0 16 0 -2 -10 9 5 -5 1 2 -1 -3 4 7 11 5
3664Emk0RJ1j5nJ8J2k9ML0Mj9jJ7rj7J4mnj4NJ5npRlJ0%jOJj4LojMj0RJ3rj6J0
$$ 5 1 -19 -10 1 -14 -19 -1 11 -18 -14 16 20 1 0 17 8 -9 5 1 -4 -18 -13 2 -3 -10 -1 -4 6 6 5 11 12 -2 1 -5 -6 -2 -12 -3 10 1 -15 -5
3707eJ3mj3jJ5rnrJ2Kj3NQNnQ%M%J2oj8J2ompJ2Kq%M%KJ5ok2PJ1j1j6KJ3ojkK2
$$ -5 8 4 -9 -10 5 -4 -9 -18 -6 -4 -17 -12 -4 1 -4 4 4 8 8 20 14 -4 8 2 -2 -9 3 5 -3 -3 1 1 3 18 12 -10 -3 8 -3 -19 -17 -4 -10 -11 -13 9
3753IjpjJ0LNj3j0lQj1qJ6RprK0kpJ1nPrLJ3rk7K3lj8NOPqLRj5LQk0nJ6jqpJ1
$$ 9 8 1 0 10 13 18 5 -5 -8 0 -11 -19 -3 6 -1 -10 10 8 1 12 7 14 5 8 21 12 -15 8 5 -13 -8 -2 5 -3 0 9 -6 -3 5 -15 -20 -4 -5 -13 -20 -9
3799iJ9j2lJ9J4j9LNj2%K%rj8J8o%rK4krPJ5j4qOrj0KJ7j4JRJ0knOKqLlo%Mmp
$$ -9 10 -2 -5 14 28 9 12 17 5 5 7 7 -2 -20 -2 -8 -8 -17 7 5 -4 3 18 4 -4 2 -7 -17 -15 2 -12 -11 -2 8 6 1 7 9 1 4 1 -5 -5 -1 -5 -12
3845a2nJ3NkkJ4mJOKj5KJ0j3j1K6kj8nJ6J2k6J1PomOMk6J4Nk3J0%K5j7qK2jj3
$$ -12 -17 -4 1 -1 -3 11 7 8 14 16 1 3 13 0 -11 15 13 -5 -10 6 18 -8 3 10 4 0 6 10 -16 -2 3 -20 -10 -10 15 -2 -10 12 11 -2
3885bPJ6qj2K%polkLOLLKkM%kJ0j3RkMj2nROrnJ2lJKJqj1OJqoJ3kMMJ8nnRm%r
$$ -2 5 21 13 1 3 3 -4 -10 -13 -15 -12 -6 -3 0 2 0 4 4 2 12 -1 8 6 10 -2 -7 2 8 -1 -6 6 3 4 6 7 -1 -12 -6 -5 -13 -19 -6 -8 -4 0 18 13 8 17 13 13 4
3937D%q%Pkj3ONJOqJ1jooNkkKnqNNKKoJ2KJLmJj6J1j3qJ1PrjK4lj0mK0j0KrKJ8
$$ 4 4 -4 -4 3 1 -12 -6 -1 0 6 -2 9 8 2 -4 1 -1 -3 -1 -6 -14 -9 -4 -2 0 -6 6 8 9 12 8 9 -7 4 -9 -17 -6 1 -8 -9 15 12 2 -2 18 8 10 1 3 21
3987B1k4nJ6olJJ2mj2jK0jj7JKqLmlJ4kpNNJ6j9PJ4j4omJ2qj6RJ8j8nJ8jNj9J0
$$ 21 -3 -8 8 2 -1 0 12 8 -4 -5 15 14 -3 -2 0 -8 -5 -9 -12 2 0 -7 -2 3 19 0 7 21 7 1 -3 9 1 -15 -6 12 -6 -11 7 6 11 -8 2
4030BJ0p%mLql%J0J1j8JJ8Mpk5J7J9k2kNjj4%J6lLrJ6loJ0oL%j2nRJ3nrLPmn%
$$ 2 12 5 5 1 4 -4 -7 -7 3 14 -4 -3 15 19 12 -13 4 23 1 -1 4 3 -11 -11 5 2 5 -4 12 9 3 13 7 10 10 -2 -7 2 15 10 1 4 11 7 2 2
4076BJ3j4oK6k3j1J1kQlj0JJ3%oK3j1%j2J0qnmOMqkJ0JnnJ0%JJjRmj0knRLpJ6
$$ 2 15 1 -5 21 -2 -13 -2 -4 4 1 -9 -8 5 5 -1 22 11 11 -1 9 1 -4 -8 -2 2 -6 -8 2 3 -2 -7 3 3 4 5 4 13 9 -1 -3 -8 1 4 -3 13
4121A3j6J4kJj1JknRrmMQL%rOkRNnJ1k0OmQnnPkj0J2Ll%j1MJ1j4LjlJMj0QOOl
$$ 13 -3 11 9 10 -1 0 -2 -7 2 -7 -11 -7 1 4 4 -5 1 -1 8 13 8 19 -1 5 1 9 4 -1 6 4 -6 6 9 6 6 -5 -1 10 -4 -1 -2 -5 -4 0 -10 -2 4 10 7
4170GQqlklOKJj2jJ4qqNQj0KK5j9mnK6j8JM%j1kJ0%j6J5m%J4j0qrQNkqJ2oLqM
$$ 7 15 7 4 2 -1 5 7 8 -4 -5 9 1 -7 -2 6 -4 -2 23 4 0 -5 21 3 4 8 8 -3 -5 5 5 -11 4 0 0 14 4 -4 -13 -5 0 -2 -10 2 -4 -1 -9 -5
4217eJ3%jKnJj3J0NKJq%mPRmJ0j0j5nK4j6jNmnjPmJ1j1QKMlpLjLoK%poL0pmNQ
$$ -5 8 8 7 9 4 5 -8 2 7 9 10 2 2 -2 5 14 10 20 10 -5 -10 14 -2 -3 2 -2 -7 -8 -1 -5 6 -5 3 5 9 6 -1 2 1 4 -2 0 0 -7 -13 17 10 6 11 19
4267A9rrJmP%j1JJ0KojJ5j4nJ4Qqlomkm%kQ%QOpmJ2nRj3nJ3qnjJLPMjNjokNj7
$$ 19 10 1 2 -2 5 5 -6 -5 5 7 1 0 15 1 -4 10 18 10 7 1 -3 -5 -9 -9 -11 -3 -3 5 11 4 0 12 7 16 3 -2 11 3 -2 -3 -2 1 8 12 11 16 15 9 7 12 -5
4318ejJ1ojj4K0mlqJ6%Rj0%%qjlJ0mj0J2nNrJ1J6k5J4Lokk%PJqjNRj2KOmjqMJ
$$ -5 -6 5 -1 -2 -16 4 0 -3 -11 5 5 14 4 4 4 -4 -5 -8 2 -2 -12 0 -5 0 -9 2 18 -7 7 10 4 2 0 0 7 8 0 -1 4 13 1 3 9 5 4 -4 0 1
4366AoNolkQqKjNJ2j0J2j3JK%NpK%mQNj7J9pNpQj5J1%mj2RjjOKj2JJ4MqqNnKk
$$ 1 -5 0 -6 -9 -11 -3 -11 -9 -10 -5 7 -3 9 -4 -3 -1 -1 4 -3 -1 -1 -5 3 8 -9 10 3 8 1 9 -6 5 5 1 -11 -2 -3 -4 2 4 -8 -7 7 11 3 -5 0 -5 -3 -5
4416eJMnN%Nj%joPMJJj2J0qJkJnQOqOKJqJrOqKkMlLMOj4RQqMj3LMj2J4mNkOj0
$$ -5 -4 0 -5 0 0 5 4 4 3 -3 4 8 9 10 -2 8 0 1 -1 0 -5 3 9 1 7 9 10 2 3 -6 0 -8 -6 -8 -4 -7 -4 0 6 -8 1 9 1 5 -8 -5 -1 -13 1 -3 2 0 6 -4
4470dQJ1j5OkJKlJrRLj4J1KJj6J2J1j8J1koMl%j0MNqQJ3rPjpkpJ5j1JjJkRNj8
$$ -4 4 15 0 6 4 5 7 4 5 -4 5 8 -6 5 7 8 -8 4 15 -3 8 6 0 4 1 1 -9 -5 0 -8 0 13 4 11 10 3 1 -6 9 -2 -1 -2 -1 -3 6 11 -7
4517gQPoLmPj0jJ1nj1J2Mj2J3j5QPjj1pJ2Mj7QJ1ooJ0jj5K5j0%pJ3rlJ2Kj6KJ0
$$ -7 1 8 2 5 1 8 -2 -3 8 3 -8 4 8 -4 9 -6 2 9 8 -3 -10 2 6 -11 -3 8 2 -4 6 5 -10 15 5 5 -2 11 2 -1 11 13 -3 -1 9
4560InrRMrJ0Qj8OKj1PJlj6J2RroK1mojJ1j1NNj8K%J3k2NJ8j1jK3j9j1K0oj1O
$$ 9 4 -5 4 8 -1 9 17 -1 5 7 -4 3 4 1 -15 -3 6 -3 -9 12 8 2 1 12 1 6 11 -7 -5 -5 8 -14 -9 9 -2 -3 20 1 -10 10 4 -7 -1
4603aQoj0K7mk5J5J6j4j1J8Kj3JJ2j8j1K8j2qJ2pjKLKoQJljlm%%LpJ9orJ3jj2
$$ -1 7 1 -9 18 14 -11 4 20 6 -5 13 15 2 3 15 -3 -14 14 2 -6 6 -1 -2 0 3 5 -1 7 8 5 4 1 -3 -3 -3 0 -7 12 6 -3 10 9 -3
4646cKJ0nj3J5rnJ3Nj6j0K3Lj7K3mk4NK6j8j7K3rj4J5Noj5J6Ok4PP%LJ1qrJ0M
$$ -3 -1 9 4 -9 6 -3 -8 5 10 -6 -16 7 10 -7 16 12 -12 -7 19 1 -16 7 -2 -16 -1 4 -2 -17 -1 5 -19 -12 -5 -5 -2 9 1 -8 2 6
4686Fj4jK0j5kMJ1oKlrRkJj5J4okJ3lj3MK5j0j9J1K%lPpj0J2oqJ8LnKJ2j5mOr
$$ 6 -8 -9 11 -4 -6 -2 9 3 5 2 -7 2 0 1 -14 0 -6 -8 5 2 -11 -7 18 8 -11 0 2 2 -1 6 -1 -11 1 -5 -13 5 8 3 5 17 2 -2 4 -5
4730elJ0Nmj3PP%%Ok3J3RprJ2Nk5RNoj1J6Pj0jJ3rLJJnPmj4J2LnoJ4ojRlnnKk
$$ -5 -8 2 7 3 -10 -3 4 4 4 10 -13 0 9 2 -7 5 10 -15 -6 -1 -7 -18 -2 5 -5 -6 7 -2 1 2 3 -2 5 1 -13 -1 2 -3 -9 5 -1 -2 7 4 -1 -6 -4 -6
4778flKRj7J2PnjQLpoJ0j6JJ5j0j7RJ2mJmlRQpQrJkKPlnMQj7J2rJ4rJ2j2oJ1q
$$ -6 -9 -7 2 -15 -3 4 -1 -2 6 9 2 -4 6 -10 -9 6 -4 -21 -12 0 -4 -3 -7 -10 -1 7 0 8 -1 0 -2 0 7 4 -1 3 11 -6 6 -3 11 2 14 2 -4 7 -1
4825amPlkQpJ5j2%LNqOjrpJ0Qj1J0pjJKNMknMLj0j6RJ3Mj7J0j1lJ6NrljJ1k1l
$$ -1 -5 2 -1 -3 5 -2 13 1 1 4 9 1 7 6 -3 -10 0 8 -3 7 0 -1 0 2 7 11 9 4 8 11 1 -15 -6 7 11 -6 4 -7 -10 6 11 2 -1 -2 9 -12 -15
4872a5JJ4j0J0Oj4NLPqNlK%olkKJ3j2KJjLOMqkLJnKknQmoJJ0j0J0Qj3J7pKj1l
$$ -15 -14 0 -10 0 6 -8 -3 0 7 -1 4 1 3 3 -3 -6 -8 -6 7 -5 -3 -2 -3 0 6 10 2 0 3 4 -1 1 -1 -6 2 -2 -8 -7 3 -7 3 11 -2 15 8 10 -1 -4
4920dLmqRRj9J5J1j1NQj3oRjj8J2m%j3J9Pj6J2J0j6J0J3j9Lj5J2j5%J2%j6K0j
$$ -4 -1 -5 -13 -4 5 -14 1 12 1 6 14 1 -5 4 3 -15 -3 -7 -7 -20 -1 6 -10 2 12 -4 6 19 0 3 -12 0 -15 -15 -3 -3 -19 1 0
4959@j0J7MqoJ9qj8kJ4j8PJ5j1j2K4Jj6J9pjlK2j5j7K1k0lJK5oj8K3%k6K1Lrq
$$ 0 -10 7 11 3 -3 16 8 -10 -12 2 -16 -9 6 -5 -17 7 8 -8 11 4 3 0 22 7 -10 11 -9 -12 -11 14 8 -10 13 13 -13 8 11 2 -6
4998fJ7j3j3RKKj0J8j7QJ6Mk2LjmnL3k5j2J7LrOJ2j9LJ9j0oJ3krj6K0j5j2K1L
$$ -6 11 -2 -15 -6 -4 -2 -12 6 -11 -3 13 17 -5 -2 -3 -7 -12 21 -4 -16 1 4 -5 1 13 -6 -3 16 6 0 13 11 2 -14 6 -9 -21 0 3
5037Ck3K0K0l1RK1j3k2J1K5k5rK2k3rK9Jk1J5K0j7qK9ol9K3Qk0mK5rj6J9lj4J5
$$ 3 -20 0 20 -11 -2 19 6 -16 -5 20 -5 -14 8 -15 -24 5 6 -15 0 20 3 -5 24 18 -21 2 10 -10 -14 11 2 -14 5 2 -12 3
5073CRj4kK0rj6J1lj6NK3j3nJ0Jk1L2J0k8nL0j6j9J4Nj8mL7j7j5K5%k3K0Ql0J
$$ 3 12 -2 -4 16 7 -9 2 -1 -17 -12 11 -2 -7 3 4 -17 15 25 -3 -8 22 6 -13 1 6 -12 -16 21 4 -11 14 14 -9 11 19 -11 -10
5110a0J9rj5J3PpjJ8k1J0J8j2k1J0Pk7J3K1j6k0K2Lk4J4K1k1mK3pj7J3J4j9NP
$$ -10 9 0 -15 -2 5 -2 -3 15 -6 4 22 10 -11 -1 6 -21 -8 13 -3 -23 -1 2 -22 -8 13 -8 -12 11 4 -13 0 14 -5 0 7
5145Gj5j1K9kk2J0K3j9oJ0J0k4J2J0j4KkkpJ3jomJ9j8KJ5mj7J0Qj9OOLj0J7j2
$$ 7 -8 -19 10 8 -14 -4 19 0 -6 4 14 -10 2 12 -2 0 -2 -4 -11 2 1 -5 -9 10 -8 -6 9 5 -12 -2 6 -13 -7 -1 2 -8 9 -3
5183cj6K2Mj3rL0qj0NnJoQJj8J8Ok9K3lj5J2J3Jj7J0jk0J3KMrK4opNPk5PJ6lk7
$$ -3 -19 3 7 -6 -15 15 7 -3 2 -3 -2 -8 0 1 -17 1 7 -22 1 -2 -17 -5 8 9 -8 2 1 -19 -6 -4 0 -9 15 9 2 7 14 -11 -4 12 9 -18
5225a8K0J2k9J2NLj1J8Kj7LJ2j0rJ0r%jmNOMj0%K2rnkL%pPnrK0rj%JOj4J6jjN
$$ -18 2 14 -15 -3 2 5 -6 12 14 -3 0 12 2 -7 3 -6 -6 -7 -11 -6 0 4 -6 -6 16 7 2 0 3 3 -4 3 -2 -11 9 0 -1 -1 0 6 -8 8 7 6 11
5270A1nrO%JpJ1Lmj3J5j7NJO%j2KjlJ3kmRj3KJ0KorQQj4%KlJ1nmmMJ5j9J0QrM
$$ 11 6 -3 3 3 4 -3 8 11 7 -6 9 -8 -3 -2 4 4 -8 -6 -7 -10 3 1 -3 6 -7 -5 5 7 1 -8 0 8 -6 -6 -4 -7 4 -1 -5 -9 -5 10 -9 1 9 0 4
5317DmQonRJpnMRmOlokKOmmKqJ1jrnJ4lKOlL%j0kjJ1roMJ1oNL%j8J1Nlj1J2Lj5
$$ 4 0 8 2 -3 6 7 0 -5 -1 8 4 10 7 1 -1 1 7 3 -1 1 -7 4 3 -6 -11 3 0 2 8 5 8 8 -2 -4 -5 6 -3 -9 -5 6 0 5 8 8 -10 1 6 3 -8 4 7 -8
5369hMNj0J0Jj0J2Lj4NLMnqLPplKlRPnJlMj5J3nqK3j9Pj1J2J4k8RJ3poP%j4%J8
$$ -8 -4 1 -9 1 2 -8 4 7 -7 -2 1 5 0 -8 -5 2 -5 -8 -6 -9 0 7 2 3 0 4 -11 2 -3 -11 12 -7 0 -11 1 15 -13 -4 9 2 -4 3 3 -11 -11 7
5415Gj0jJ7j5mJ6Lj0MlnkJ4qj7J5MjnJ3j9J3Jlj9J8Qk1J0Qkk1J0MK%Rj6kK2k3
$$ 7 -3 -4 13 -2 -6 10 13 3 7 4 -1 -3 11 3 -14 1 5 4 -1 12 -7 6 7 4 -15 3 11 -10 0 8 6 -15 -5 -1 1 1 10 -6 -8 14 -9
5456iLJ3%k0OJ2oj0J5pj0MJ2koRJj8MJ6k0J4LnoJ0Nj8J5Nj5rK2j2mRMpKOmj4P
$$ -9 -6 7 7 -13 -7 5 -1 -11 4 -3 -13 -9 3 1 -5 4 5 -13 -9 7 -13 1 4 -1 -7 3 8 -10 5 10 -5 -14 8 -4 -8 1 5 -2 0 6 2 -12 -5
5499eJ5j7OJ8j1j8K2Lj6J8Mk7LJ8j3j3J9lQj9PmPkMk5J7Pj4J6jJj9J8jj3QJ6k0
$$ -5 10 -7 -1 17 6 -12 10 13 -3 15 19 -8 -5 13 0 -13 6 3 11 -8 -1 -5 2 0 4 -21 -4 3 -11 5 4 5 -14 4 3 -10 -2 14 -6
5538fjNLj0J0JlmJ8jj7J3Kj0lJ6j1j0J6%k2OJ6k0J3NJjQlj9K3lj5KK1j0j8J2O
$$ -6 -7 -2 1 -9 1 2 -1 -5 13 12 -5 8 10 0 -3 13 2 -8 8 8 -14 -8 8 -12 1 6 7 6 14 11 -8 15 12 -3 -1 20 10 -8 4 10
5578A0nPqLKJj5OkJ3j2qJ8oj2J0LoPMqqJ1lmlJ4k3K4Jj1oLJ3jNlmKjj0LJ1Jj4
$$ 10 5 12 4 7 9 10 -5 1 -1 12 0 -8 10 4 -8 2 5 -1 6 10 2 -6 5 2 -2 -5 9 -14 10 11 0 -6 -3 10 9 14 11 7 9 8 -2 1 12 13 -1
5623akQMj8J5JpmJ7j8LNkj0LR%kRj1kJ9j9LmJ1qjR%pJLoKkJ2rMJ0k0LLpKMj1P
$$ -1 -3 5 9 -9 6 7 0 -4 13 -5 -2 3 1 -9 -6 3 3 1 10 -1 -3 16 -3 0 -4 7 -1 -2 7 7 0 1 4 -2 0 -2 10 1 5 15 -5 -2 1 -6 -4 0 -11 -4
5671dLlpMJ5rKjm%RPj5QqMljJ9j1j8J3LpJ0qNQjj3NPj2RJnoPJ%oJ0j0OpLoPLJ
$$ -4 -1 -4 -11 -7 8 -1 1 0 -4 -4 5 12 -3 5 -3 1 -2 -3 16 5 -13 0 3 -4 6 -2 3 11 10 -3 2 9 -3 6 7 2 -4 3 4 4 -2 8 -2 4 -3 0 -6 1 4 5
5721EJqNNmj0J8nplmROJoKj0J1qLjkPpJ0qNJ1rM%mJ2nj7NKkloljJ2PmpQML%j0
$$ 5 6 -2 3 8 4 -6 12 7 0 -3 -7 2 8 9 3 5 -5 6 -2 1 0 -2 5 -2 8 0 5 16 7 11 11 7 19 14 -3 2 4 2 -1 -7 -10 -11 1 8 4 -3 5 9 12 12 2
5772BpJ7j3jNJKj1OO%NlklmmjOmOoJ4j1QkPRk3J4j3J1rJnOMmk%J0mlOnOj4QKr
$$ 2 -5 12 -1 -2 3 4 6 -5 1 7 7 12 9 7 4 0 -4 -5 1 -3 3 -3 11 0 8 6 13 22 -1 13 0 11 2 3 -2 4 8 4 2 2 12 8 5 11 6 12 -2 6 8 -1
5822aJ2j4kPQlkJ2jnj1qLJ6j0j7J3OnOKJKJPj1nkmJQQmj1K1j2oP%jMK%poOoNO
$$ -1 11 -3 -5 2 10 7 5 17 16 11 0 -8 -5 11 1 -16 -3 3 -2 4 6 7 9 10 17 6 1 -1 -5 -4 4 12 8 -3 18 6 0 7 7 6 10 12 12 5 -1 5 -1 4 10
5871A0pKLjjkJ0k0KJ3j5KKOnLNLj0MLpNJ2j0pNkrJ1j1KQlJ3mQj3%JJ0j8jQoJM
$$ 10 3 5 8 7 6 4 14 -6 -4 9 -6 -4 -2 4 -1 2 7 10 0 4 7 0 5 17 7 0 5 3 -6 5 -6 -4 4 1 14 10 18 5 5 6 16 -2 -3 5 -1 0 4
5918Dj1MRJMkKj1JQkJkkj2%NJ1Jlkj5RJ3OnqpLjkJ2pRklRj1L%kJrPj3J5j3mJ1
$$ 4 -7 -3 6 7 11 9 11 0 1 9 7 8 6 4 -8 -8 -3 8 9 6 4 -11 -2 11 17 12 4 -3 0 -1 -3 9 2 11 9 6 15 4 7 7 5 6 -3 4 -9 6 -7 -11 0
5967@jQj5Q%NKkKj0rNqJ1J1oLMmNLj1NjrJ3nj8J3rONQj1MQnknMkn%jNMllnJ1n
$$ 0 -1 7 -8 0 0 5 7 5 7 -3 -12 -7 -15 -4 7 1 4 8 4 9 12 1 6 5 -4 9 4 -14 -1 -10 -4 1 9 -2 2 10 5 3 -2 2 0 -5 -5 -6 -1 3 0 -3 -8 3 -2
6018bNmKj2KMMLj3J2oJ0qLP%Jj1J4qMrNoMLlLnlJ0j3J1ml%jjoNmMMlLkJ2j7J2
$$ -2 3 -1 1 -11 -9 -5 -1 2 -11 1 -5 5 -3 0 7 7 8 -3 11 3 7 -2 3 -3 1 4 1 4 -1 -4 6 -7 4 0 -3 -3 -4 -5 -11 -6 -10 -6 -2 -5 -2 -4 8 -9 3
6067CjkmMNjJj0J2r%kJ4kMj2jNo%njPkpJ1J0j4Oj1J8kj3KRlnQj1nQJpPLjKPkk
$$ 3 2 0 -4 0 5 4 5 -5 7 -2 -2 -4 10 8 12 0 -1 4 -2 -2 -7 -8 -1 -3 -10 1 11 -3 3 -8 10 8 -5 -3 6 3 -2 6 -5 -10 -2 -1 -8 -1 2 1 3 10 8 6
6117Fjj3MmpJ0Mp%RKOqJjpJk%r%NRmoK3oJNj2jLj5OKKmloK1J2j3kJ3plJrOKqL
$$ 6 5 -8 -4 -8 -15 -5 -1 -8 -8 1 3 9 1 2 1 -6 -5 -7 -7 -16 -16 -11 -2 -6 -12 11 5 6 11 -1 -2 1 -14 -8 -6 -4 -8 -11 -17 4 16 3 1 14 7 4 5 -4 2 4 -4 -1
6169aoRmRjKLj3J9j0lqrOjPKrJ1%J2j3KJ1oj4J1j5J2Kq%J1nlRqkMPj0Kj6MjN%
$$ -1 -7 2 -2 7 6 8 11 -2 17 7 4 -4 -13 -7 -8 -1 1 -8 3 3 15 2 4 15 9 -5 6 -9 3 5 -3 -3 8 3 0 9 1 -1 3 10 0 2 -14 -10 -11 -6 -6
6216fpJ5Lj5J2rJ2j6J0Rj3Qj0J4j2QknJ0rPQnrNKkj6K8rj1oJJ1jpOjKrOm%Rj0
$$ -6 -13 2 5 -10 2 -7 5 -11 -1 8 -5 3 -7 7 -5 3 1 -4 6 -3 4 12 7 -2 3 5 3 -13 15 6 -5 -11 -10 1 0 -7 -1 -2 0 -9 -3 -7 -7 2 -8
6261hoRJ0oj0J6n%jK%NLj8J2Jop%QLK%pR%Lj0mPKj3OrJ0LoPOj1QjKJpNqkMjmP
$$ -8 -14 -5 5 -1 -11 5 0 0 -1 1 1 6 9 -9 3 4 -2 -9 -9 -1 2 4 4 -3 6 6 9 -1 -5 2 4 -9 -3 -12 -2 1 -5 2 8 -3 5 4 6 7 0 5 -3 -5 -1 -2 -6 1
6313AJoNJ0rqM%KOj0lRmQpJJNKlJj5J1nOoj0J4kNLlKjKJnmmJ1j4RnoNJOM%%Oo
$$ 1 2 -4 1 11 2 -6 -2 -2 0 6 -4 -7 2 -2 6 -1 0 1 6 8 5 6 -9 2 -3 3 -3 -13 1 -1 4 7 4 6 5 7 8 3 -1 -5 6 -8 1 -4 -10 -5 -4 2 6 6 6 12 6
6366FjnLPklKmnKJ3ojj4J4qLnOj2MnJPjRo%MQjj2mNmJ1j9J0JnKORMj1J2j0KLj7
$$ 6 5 0 3 10 8 5 7 3 -2 0 13 7 6 -8 6 -2 1 -4 2 -10 -6 -11 -10 -3 -4 5 -1 -1 3 11 10 -2 -6 -1 -5 6 -13 -3 -2 -7 -5 1 10 14 3 15 5 7 10 -7
6416gnkJ1%NLj5OPnoPOj0JQKj3Nkj3J5PqQLPllMpkkLj0J2nrJ7lj2J6Kj2mJ0Kn
$$ -7 -12 -14 -3 -3 2 5 -10 -4 3 -2 -8 -1 5 -5 -4 4 6 -7 -2 -4 -17 -2 5 -3 5 8 15 12 9 13 6 4 2 5 -5 7 2 -7 10 7 -5 11 13 1 -3 7 9 4
6464Dkj0LPkNk3J3J0mMnLpj%QqkOjJ1rMLOqMqJ5j5Rj0kqJ0JmKR%kpj1J1Mpj3J5
$$ 4 2 -8 -5 2 0 5 -18 -5 5 1 5 0 3 -4 -5 -5 3 -5 -7 -1 -2 9 0 4 7 13 5 9 1 16 1 10 0 -2 -10 0 1 -3 -1 8 8 6 -1 -12 -1 3 -4 -17 -2
6513bPj8L%jMQJ0mmJ1j3oM%Oj9J8lkPMj0J7q%pnJ0noPj0J2mqkJ1KMkOmm%j5LO
$$ -2 5 -13 -10 -10 -11 -7 1 11 7 3 14 1 -5 -1 -1 5 -14 4 1 -1 6 10 0 17 9 9 2 -3 7 2 -4 3 -7 5 1 -7 -9 2 4 8 6 12 8 4 4 -11 -8 -2
6561brLJ0LkKNpJ1pLk%noKPjJmMj2JJ1omMOrNLj2NJqjPNlOj0NlJOjnj2K0lMj0
$$ -2 -11 -8 2 5 3 5 10 3 14 7 10 8 8 3 -3 -1 6 5 6 2 6 -6 -5 6 0 -4 0 6 -3 2 5 -7 -2 -1 -9 -10 -3 2 -1 5 -5 0 -3 -2 4 3 -2 -14 6 3 7 -3
6613cMLJ3j0rJ0nRqRrj0QnjJ%mOmJ4rPj1mRpJ2j1oRkM%kJ1JOj8MKnKnNk%KkQJ
$$ -3 1 4 17 7 -2 8 3 12 4 13 4 -6 2 -3 -4 -3 -3 -7 -1 -5 9 0 7 -4 -8 1 -6 6 -5 -11 -2 -4 0 0 -2 9 10 16 -2 2 4 -1 1 -4 1 -1 -1 1 -1 7 8
6664HkPpnpkJ0omolRjJQPj4J1pOj2%KJJMlOl%O%Oj4MJnmmJ1mjJ4knoOjOj6J0r
$$ 8 6 13 6 1 -6 -8 2 -4 -8 -14 -17 -8 -9 -8 0 7 -7 4 -3 3 -9 -9 -7 -6 -5 -1 -4 2 -1 -1 5 5 11 -3 1 2 -3 -7 -11 0 -4 -5 9 7 2 -4 2 1 7 -9 1 -8
6716hJ4qoMrJ3Oj3J6Pk0QLlloLJJJ1pMpKM%rJ7j8JNojNnJ1j1%LKnNKpPLj1J2j
$$ -8 6 -2 -8 -4 -13 0 6 -7 9 16 -4 4 7 4 1 -5 -2 -1 0 11 4 8 1 3 7 7 -2 15 -3 -2 3 -3 -4 1 -4 7 -4 -4 -1 1 -4 1 3 -4 3 6 -5 7 6
6765FkLj2LjLQQnqKJ4mmj1NkNjj0J2mj2J0jOmNJpkjOj0PrpJ1Qmj0J3mpRj7PlJ2
$$ 6 4 7 -5 -2 -3 0 8 16 11 3 5 19 15 11 0 5 3 8 7 -3 9 5 -7 3 2 8 4 9 10 3 1 0 6 -4 3 -6 -13 -2 6 2 -8 5 1 -6 3 -14 -7 -10 2
6814Bj2QQMpJJ3j1KMkj1%OooRmJJ1ojJ1q%oJ7j5lo%RqJ4qoJ9lj6K3j2nMPqj2J5
$$ 2 -10 -2 6 10 3 4 17 6 8 12 10 -1 -1 5 -1 -7 2 -2 -1 10 4 3 14 6 6 0 17 2 -1 -7 -7 2 -6 8 0 -6 13 10 -6 17 5 0 4 11 3 -9 6
6861Fj1LQJjmLNjlLj0KJ0j9MRNj6J0njLRj3QolMpNJ0j2%PoMJ5%j6RmKmJRj2J5
$$ 6 -5 -2 6 7 6 2 5 10 9 6 9 -1 1 11 -8 -4 5 10 -6 4 -1 -2 1 10 -3 5 -1 -4 0 -7 -2 8 -4 -4 3 -3 1 16 16 0 9 5 7 3 4 13 1 16
6909A6k1ONmLpRmNKj2j2J3%kpNmJJ7k4RJRqJKjlK0j5nJ0joKL%rJ0JrJ9qj0P%j0
$$ 16 -5 1 6 2 5 -2 7 3 8 10 -2 -14 -1 -1 -3 -10 -5 -9 -8 9 -15 -6 -5 4 -4 -3 -1 -2 -5 15 0 -5 5 4 -2 0 3 3 -6 4 5 -4 15 7 -3 4 4 -6
6957fLRmmqJ8nk3K5Kj4OlmNLj0jLJ3pJRj0JQLnpjPjlnkLJ0nOJqRj3J9j0rkOlM
$$ -6 -3 6 2 -2 -10 8 3 -20 5 7 -7 -1 -4 -8 -3 0 -10 -11 -8 5 -2 -1 8 -2 -1 7 10 5 -2 -3 4 3 0 -5 -7 -4 6 1 7 8 0 9 -4 15 5 -4 -6 0 -3 1
7007Alj0J0Lj0J6j%qLoOoJ1jj4J6oNnMkmkJ3jjkjqJ6rmJ3j7mJ0Okj3jOrJ2Jjo
$$ 1 -2 -12 -2 1 -9 7 6 6 -2 1 -5 1 -5 6 5 -9 7 1 6 1 5 3 -1 -3 10 9 8 6 5 -3 13 4 0 13 -4 -8 2 8 6 -7 -8 -2 -11 1 2 1 -5
7054eNjpmJ6%LMolMojJJ1prJ2Kj0MRj7KJ4j6MMOj0M%j5QQnpJ4j0NNj0j5MJ4lN
$$ -5 0 -1 -8 -12 4 4 7 11 5 2 6 0 -1 0 11 4 -5 7 9 -1 3 12 -5 -3 11 -5 -1 3 9 -1 3 3 -12 -4 4 -1 -8 6 -4 1 6 -4 -19 -15 -1 -4 1
7101AjmJOkqKlJ4KnokNjKkMj6jJ5Rj9RoNQLqOj3%kK%Okj0J7oqnJ5jLKj9MKKOm
$$ 1 0 -4 -3 3 1 -7 -5 -8 6 8 3 -3 -5 0 -1 1 -1 3 -13 -14 1 10 -9 0 -6 -1 7 10 2 8 -5 -5 -7 -5 -5 1 -1 -11 6 0 -8 -13 2 1 4 6 -13 -9 -7 -5 1 -3
7153cJ1KlMOpj6J7j7mJ1Pj9MLMLolj%LNqNKolLJ1jj0QJ0j0LoJpNJjRjrQKlPj1
$$ -3 8 10 7 11 17 10 -6 11 -6 -10 1 8 -11 -7 -4 0 3 -3 -6 -7 -7 -4 1 -7 -2 0 -6 -9 -6 5 4 -6 2 12 2 5 -1 0 -7 -2 -1 -2 7 6 -3 5 7 4 11 0
7203@PNqQj9OkNj2rK0j5J1%jQmnj3K2j8ORmmKMQj4QrJ1Nj3mJ1KLj2J5%j1JNMk
$$ 0 7 12 4 12 -7 -1 -3 2 -10 -19 1 -14 -3 -3 -4 4 0 -5 -18 4 -14 -8 1 -3 -7 -5 -1 7 -7 1 -8 3 8 -5 -9 2 4 7 -5 10 10 -1 0 5 9 7
7249G%j1mJ7j2lMkOOpj2PQk2J4Qjj1J2oKj2OP%JMJKkqQNOj4pJ6j8KJ1j0kJ0j6
$$ 7 7 -4 -8 9 -3 -6 -2 -4 2 8 1 -11 -4 4 -18 -4 4 3 -8 4 -2 0 -12 -6 1 1 2 6 7 9 7 -1 7 12 18 4 -3 13 -5 -3 8 -2 -4 6 -10
7294a0KKRpmJ0MmmLj8J0PPpOlqjJ1oRkjoj3QJPlJ0j3JRnJplKPNKqj2LpJ6lJMo
$$ -10 -8 -6 3 -4 -8 2 6 2 -2 1 -17 -7 0 7 0 6 3 -5 -6 5 -1 8 6 5 -1 -14 -6 -5 2 -1 9 -4 -3 6 1 2 -5 -8 -6 1 6 8 0 -12 -9 -16 0 -3 -2 2 -4
7345dlQNnrOlj1kJ3LlNJ1j6J1Oj9Q%j1jMOpJ5Lj1lMkJ%Pj3LJ1j2nMNnqJ4jj5J3
$$ -4 -7 1 6 1 -8 -2 -5 -16 -18 -5 -2 -5 0 11 -5 6 12 -7 1 1 -10 -11 -7 -1 -8 7 10 -1 -4 0 -2 -1 -1 6 -7 -4 7 -5 -10 -6 -1 -6 -14 0 -1 -16 -3
7392cJ2p%J0j7lK2j3nPRoNnlKJ9k1LJoKMJj1MQjj9LJ2j2MoJ3qM%pN%pKPoJNJ0
$$ -3 9 2 2 12 -5 -8 14 1 -4 3 12 6 11 6 3 5 24 3 6 7 1 3 7 8 -3 1 9 8 -11 -8 4 -8 -4 -10 3 -5 -1 -1 -8 -3 -3 -10 -8 -1 -7 -6 -1 9
7440Ij3J2LKj0Pjm%MLj2J0j1KJ0j3NkkQpnL%j0J1mJlPJKp%KNpkJ1Qj9QjkJ0qJ3
$$ 9 -4 8 11 13 3 10 9 5 5 9 12 0 10 -1 1 11 -2 3 1 -1 7 0 -5 -2 -2 -12 -1 -5 -4 -7 0 1 3 -4 -4 -2 3 -4 -6 5 13 -6 2 1 -1 9 1 14
7488A4j4lOOp%Mkm%rRJoK%Nkj1K2j3moLKQkqjORkmMoK%qNPj%kMNKpJ0pj4QmjJ
$$ 14 0 -3 3 9 2 2 6 4 0 0 -9 0 1 -5 -3 -3 2 0 -11 11 -2 -6 -12 -9 -7 1 -1 -9 -10 -4 5 3 -1 3 -3 -1 -1 -9 -4 3 2 2 0 4 9 11 4 14 7 -7 1 -3 -4 -3
7542c%omJ5kLKrmNlpKJJ1QoljJRj5K0jj3MjPnjj%%kmJ0j3J4n%OpljnPj4QKJ3q
$$ -3 -3 -9 -13 2 0 3 5 -4 -8 -3 -6 -13 -11 -10 1 9 3 0 -1 0 9 -6 14 13 0 4 3 10 5 4 3 3 3 1 -3 7 -6 8 3 3 9 2 -1 -2 -7 0 -14 -6 -4 9 1
7593AJnMKrJmJ1JlKOj3lNOJMpjMkNKj0PjmlJj0NmJ1rM%kJ1j1Oj1PkMjoJRj6J7
$$ 1 2 -3 1 3 -6 -5 -9 2 3 0 2 8 -5 -8 -3 3 4 8 1 0 4 2 7 9 -1 6 5 1 -2 -1 -11 -6 -10 1 -8 -4 -4 -6 5 -6 0 -11 -4 -6 -2 -3 -9 -8 1 -15 2
7644BmKj1J1nQ%MJj0oJ4oPjj2J3NKj1Kj%jpOjJJ%nJ0j0LloJ1jmLn%JjNKOr%Nj2
$$ 2 -2 0 -11 0 -5 3 3 7 8 -2 -8 6 0 7 6 -6 7 12 14 3 5 4 4 3 -4 2 1 2 3 3 -2 8 -2 1 -2 -8 3 2 -2 1 -4 -4 -3 -4 1 3 9 0 0 5 -7
7695gQQnLpnJ1jrJ0LqlJ2qKKr%Pj2OKmjmRMj3NkmJ%J1j3QJMNmojJ0qJ3kj1J0p
$$ -7 1 9 4 7 0 -5 6 5 -4 6 9 1 -2 10 2 4 6 -3 -3 4 -8 -2 0 -4 -5 -9 0 4 -9 -4 -6 -10 -9 -9 2 -11 -3 -2 2 7 3 -3 -4 6 -2 11 9 -2 8 1
7745AJqOlKJnJ1j3Qj3lJ1j2RLj1OJ9j6nJ4kQj1nlJ6loRMnj7J3rJ0Oj0QLj2lRj0
$$ 1 2 -6 0 -3 -1 0 -5 6 -7 1 -12 -15 -4 -16 -7 -4 -15 -9 10 -6 -11 3 1 9 -2 -7 -10 6 3 -3 6 10 5 -12 1 -8 2 8 -2 6 9 -3 -6 3 -7
7790gJ3j1qJQn%Kj1mK4%j1%mJ7j8J5lKl%mjJ0KKrmL%KPjJmj%kRj2KM%pPn%OlK
$$ -7 6 -5 -13 -12 -4 -9 -9 -7 -18 -22 2 2 -9 -9 -13 4 -14 1 -2 0 -3 -3 -7 -8 2 4 6 -3 -7 -4 -4 -2 5 4 5 1 0 0 -2 7 -5 -3 1 1 -6 1 -4 -4 2 -1 1
7841AnknPlkPKokqJ3%Pj1LJ1J0j8LNmJRj4j0LJ8qpKoMjJ4j2LQqj1J0Mj0jRj1O
$$ 1 -4 -6 -11 -4 -7 -9 -2 0 -6 -8 -16 -3 -3 4 -7 -4 7 17 -1 2 7 3 4 13 -1 -11 -8 10 2 -5 -3 -9 -5 -6 8 -4 -1 7 -1 -12 -2 2 -8 -9 0 -11 -5
7888emMl%nJJ7kpQ%Kj0kPknOjJ8j7pNLJj2MQpQpMj2QMKrJ0j0J1Mj3OmkJ1j3Po
$$ -5 -9 -5 -8 -8 -13 -12 5 3 -4 4 4 6 -4 -6 1 -1 -6 0 -1 17 0 -7 -2 1 2 -10 -6 2 -5 3 -4 0 -12 -4 0 2 -7 3 -7 4 8 -5 1 -3 -5 6 -7 0 -6
7937fMMkLlRkonJ0klpOO%pJjJ8k1PMo%lOnj0jMOkLJj3K0k2LJ0Kj2PPl%L%j4J8
$$ -6 -2 2 0 3 0 9 7 1 -4 6 4 1 -6 0 6 6 -1 0 -1 17 -4 3 7 1 1 -2 4 -1 -11 -12 -8 -2 -4 -1 0 -13 7 -15 -12 -2 0 -12 -5 2 -1 -1 2 2 -12 6
7987Fj6J0PqJ0jjj0JNj4RKJpMnMJkQrMJ%LoPj4ROj3MKK%JjNrnNNj0R%LKlNj6O
$$ 6 -10 0 7 -1 9 8 7 -3 -2 3 -11 -2 0 1 -6 -2 -7 -3 -2 -4 4 -5 -1 0 0 3 -3 4 -10 -1 5 -8 -4 -2 0 0 1 0 5 -4 -9 -4 1 -9 0 0 3 5 2 7 -9 -3
8039cKJ0j4LOj1Oj5J3nOqrJ2KqJ9ppMOj1LLlJ4o%J5j2M%pJ0j0LmNj7J5lnJ5j6
$$ -3 -1 9 -5 -2 4 -7 -1 -16 -3 -8 -2 -10 -19 -7 -5 -13 6 -1 -8 -4 2 -9 -6 -3 -6 8 2 2 17 5 9 9 2 12 2 5 1 6 -11 4 1 -4 11 -5
8083eO%oM%jolMMj0J5pkKlJ4omPqmQ%J8j3oQn%NJlmoLKnOnR%klkpJ4j0oKKJq%
$$ -5 1 1 -5 -1 -1 -2 -8 -11 -7 -3 -13 2 -5 -7 -5 -8 6 0 -4 3 -5 -9 -1 -1 17 4 -2 6 1 1 6 7 4 0 -6 -3 -1 -6 0 -5 4 4 2 -1 -3 -10 4 -6 -12 -10 -8 -7 -15 -15
8137a5J1kLpKJ6j0kkLloJ0pNJ5j5J0qMlj0J4qOmmJjPJpnLkj3J5Lj0Lj%jLmKpJ7
$$ -15 -4 -6 -3 -10 -8 8 -2 -4 -6 -3 -6 -12 -2 -9 -4 11 -4 6 -2 2 -1 -11 3 -5 1 -3 -7 -6 -7 0 1 -6 -11 -8 -10 -23 -8 -5 -15 -12 -13 -13 -14 -11 -15 -13 -20 -3
8185cjnKoRM
$$ -3 -4 -9 -7 -13 -4 0
8191@
##END NTUPLES=NMR FID
##END=
