##TITLE=1H_LY-cyclohexanone
 CDCl3, 8 sc, 
 31.5.2019
##JCAMPDX= 6.0         $$ Bruker NMR JCAMP-DX V2.0
##DATA TYPE= NMR FID
##DATA CLASS= NTUPLES
##ORIGIN= UXNMR, Bruker Analytische Messtechnik GmbH
##OWNER= root
$$ XWIN-NMR		Version 3.5
$$ Fri May 31 14:28:56 2019 Russian Standard Time (UT+4h)  she@DPX200
##.OBSERVE FREQUENCY= 200.13155
##.OBSERVE NUCLEUS= ^1H
##.DELAY= (6, 6)
##.ACQUISITION MODE= SIMULTANEOUS
##.ACQUISITION SCHEME= undefined
##.AVERAGES= 8
##.DIGITISER RES= 18
##SPECTROMETER/DATA SYSTEM= spect
##.PULSE SEQUENCE= zg30
##.SOLVENT NAME= CDCl3
##.SHIFT REFERENCE= (INTERNAL, CDCl3, 0, 15.7039)
##AUDIT TRAIL= $$ (NUMBER, WHEN, WHO, WHERE, WHAT)
$$ ##TITLE= Audit trail, XWIN-NMR		Version 3.5
$$ ##JCAMPDX= 5.01
$$ ##ORIGIN= Bruker BioSpin GmbH
$$ ##OWNER= she
$$ F:/spectra/data/she/nmr/H-F/1/audita.txt
$$ ##AUDIT TRAIL=  $$ (NUMBER, WHEN, WHO, WHERE, WHAT)
(   1,<2019-05-31 14:27:30.68 +0400>,<she>,<DPX200>,
      <created by zg, POWCHK disabled, PULCHK disabled
       configuration hash MD5:
       00 E9 B6 7A A2 85 ED C7 34 08 36 98 17 FE 4E 26
       data hash MD5: 16K
       FF 5D 72 EA 7A E9 27 C8 E6 0F 9C 98 7C 85 06 34>)
$$ ##END=
$$ 
$$ hash MD5
$$ B0 5B 30 28 CB 68 12 4B D9 48 9E 57 2D 63 42 C7
##$RELAX= 
##$RELAX= 
##$RELAX= 
##$RELAX= 
##$RELAX= 
##$RELAX= 
$$ Bruker specific parameters
$$ --------------------------
##$DU= <F:/spectra>
##$EXPNO= 1
##$NAME= <H-F>
##$PROCNO= 1
##$TYPE= <nmr>
##$USER= <she>
##$AMP= (0..31)
100 100 100 100 100 100 100 100 100 100 100 100 100 100 100 100 100 100 
100 100 100 100 100 100 100 100 100 100 100 100 100 100 
##$AQSEQ= 0
##$AQ_mod= 1
##$AUNM= <au_zg>
##$AUTOPOS= <>
##$BF1= 200.13
##$BF2= 200.13
##$BF3= 200.13
##$BF4= 200.13
##$BF5= 200.13
##$BF6= 200.13
##$BF7= 200.13
##$BF8= 200.13
##$BYTORDA= 1
##$CFDGTYP= 0
##$CFRGTYP= 5
##$CHEMSTR= <none>
##$CNST= (0..31)
1 1 145 1 1 1 1 1 1 1 1 1 1 1 1 1 1 1 1 1 1 1 1 1 1 1 1 1 1 1 1 1 
##$CPDPRG= <>
##$CPDPRG1= <>
##$CPDPRG2= <>
##$CPDPRG3= <>
##$CPDPRG4= <mlev>
##$CPDPRG5= <mlev>
##$CPDPRG6= <mlev>
##$CPDPRG7= <mlev>
##$CPDPRG8= <mlev>
##$CPDPRGB= <>
##$CPDPRGT= <>
##$D= (0..31)
0 1.2 0 0 0 0 0 0 0 0 0 0.03 0 0 0 0 0 0 0 0 0 0 0 0 0 0 0 0 0 0 0 0 
##$DATE= 1559298449
##$DBL= (0..7)
120 120 120 120 120 120 120 120 
##$DBP= (0..7)
150 150 150 150 150 150 150 150 
##$DBP07= 0
##$DBPNAM0= <>
##$DBPNAM1= <>
##$DBPNAM2= <>
##$DBPNAM3= <>
##$DBPNAM4= <>
##$DBPNAM5= <>
##$DBPNAM6= <>
##$DBPNAM7= <>
##$DBPOAL= (0..7)
0.5 0.5 0.5 0.5 0.5 0.5 0.5 0.5 
##$DBPOFFS= (0..7)
0 0 0 0 0 0 0 0 
##$DE= 6
##$DECBNUC= <off>
##$DECIM= 24
##$DECNUC= <off>
##$DECSTAT= 4
##$DIGMOD= 1
##$DIGTYP= 9
##$DL= (0..7)
0 120 120 120 120 120 120 120 
##$DP= (0..7)
150 150 150 150 150 150 150 150 
##$DP07= 0
##$DPNAME0= <>
##$DPNAME1= <>
##$DPNAME2= <>
##$DPNAME3= <>
##$DPNAME4= <>
##$DPNAME5= <>
##$DPNAME6= <>
##$DPNAME7= <>
##$DPOAL= (0..7)
0.5 0.5 0.5 0.5 0.5 0.5 0.5 0.5 
##$DPOFFS= (0..7)
0 0 0 0 0 0 0 0 
##$DQDMODE= 0
##$DR= 18
##$DS= 0
##$DSLIST= <SSSSSSSSSSSSSSS>
$$ [...]
##$SUBNAM2= <"">
##$SUBNAM3= <"">
##$SUBNAM4= <"">
##$SUBNAM5= <"">
##$SUBNAM6= <"">
##$SUBNAM7= <"">
##$SUBNAM8= <"">
##$SUBNAM9= <"">
##$SW= 24.9336996594482
##$SWIBOX= (0..15)
0 0 2 0 0 0 0 0 0 0 0 0 0 0 0 0 
##$SW_h= 4990.01996007984
##$TD= 16384
##$TD0= 1
##$TE= 0
##$TE2= 300
##$TE3= 300
##$TEG= 300
##$TL= (0..7)
0 120 120 120 120 120 120 120 
##$TP= (0..7)
150 150 150 150 150 150 150 150 
##$TP07= 0
##$TPNAME0= <>
##$TPNAME1= <>
##$TPNAME2= <>
##$TPNAME3= <>
##$TPNAME4= <>
##$TPNAME5= <>
##$TPNAME6= <>
##$TPNAME7= <>
##$TPOAL= (0..7)
0.5 0.5 0.5 0.5 0.5 0.5 0.5 0.5 
##$TPOFFS= (0..7)
0 0 0 0 0 0 0 0 
##$TUNHIN= 0
##$TUNHOUT= 0
##$TUNXOUT= 0
##$USERA1= <user>
##$USERA2= <user>
##$USERA3= <user>
##$USERA4= <user>
##$USERA5= <user>
##$V9= 5
##$VALIST= <valist>
##$VCLIST= <CCCCCCCCCCCCCCC>
##$VD= 0
##$VDLIST= <DDDDDDDDDDDDDDD>
##$VPLIST= <PPPPPPPPPPPPPPP>
##$VTLIST= <TTTTTTTTTTTTTTT>
##$WBST= 1024
##$WBSW= 4
##$XGAIN= (0..3)
0 0 0 0 
##$XL= 0
##$YL= 0
##$YMAX_a= 32958
##$YMIN_a= -31496
##$ZGOPTNS= <>
##$ZL1= 120
##$ZL2= 120
##$ZL3= 120
##$ZL4= 120
##$ABSF1= 10
##$ABSF2= 0
##$ABSG= 5
##$ABSL= 3
##$ALPHA= 0
##$AQORDER= 0
##$ASSFAC= 0
##$ASSFACI= 0
##$ASSFACX= 0
##$ASSWID= 0
##$AUNMP= <proc_1d>
##$AZFE= 0.1
##$AZFW= 0.1
##$BCFW= 1
##$BC_mod= 2
##$BYTORDP= 1
##$COROFFS= 0
##$CY= 11.3945322036743
##$DATMOD= 1
##$DC= 2
##$DFILT= <>
##$DTYPP= 0
##$F1P= 18.9103706918063
##$F2P= -1.10871071338519
##$FCOR= 0.5
##$FTSIZE= 0
##$FT_mod= 4
##$GAMMA= 1
##$GB= 0.15
##$INTBC= 1
##$INTSCL= 1
##$ISEN= 128
##$LB= 0.24
##$LEV0= 0
##$LPBIN= 0
##$MAXI= 10000
##$MC2= 0
##$MEAN= 0
##$ME_mod= 0
##$MI= 1.114404
##$NCOEF= 0
##$NC_proc= 0
##$NLEV= 6
##$NOISF1= 3.799351
##$NOISF2= 2.8
##$NSP= 1
##$NTH_PI= 0
##$NZP= 0
##$OFFSET= 15.70392
##$PC= 1
##$PHC0= -8586.147
##$PHC1= 25.20023
##$PH_mod= 1
##$PKNL= yes
##$PPARMOD= 0
##$PSCAL= 0
##$PSIGN= 0
##$REVERSE= no
##$SF= 200.130013532006
##$SI= 16384
##$SIGF1= 3
##$SIGF2= 2
##$SINO= 400
##$SIOLD= 16384
##$SREGLST= <1H.CDCl3>
##$SSB= 0
##$STSI= 0
##$STSR= 0
##$SW_p= 3612.71676300578
##$SYMM= 0
##$S_DEV= 0
##$TDeff= 0
##$TDoff= 0
##$TI= <>
##$TILT= no
##$TM1= 0
##$TM2= 0
##$TOPLEV= 0
##$USERP1= <user>
##$USERP2= <user>
##$USERP3= <user>
##$USERP4= <user>
##$USERP5= <user>
##$WDW= 1
##$XDIM= 8192
##$YMAX_p= 0
##$YMIN_p= 0
$$ End of Bruker specific parameters
$$ ---------------------------------
##NTUPLES= NMR FID
##VAR_NAME=  TIME,          FID/REAL,        FID/IMAG
##SYMBOL=    X,             R,               I
##VAR_TYPE=  INDEPENDENT,   DEPENDENT,       DEPENDENT
##VAR_FORM=  AFFN,          ASDF,            ASDF
##VAR_DIM=   8192,          8192,            8192
##UNITS=     SECONDS,       ARBITRARY UNITS, ARBITRARY UNITS
##FACTOR=    0.0002004,     1,               1
##FIRST=     0,             0,               0
##LAST=      1.6414764,     0,               0
##MIN=       0,             -31496,          0
##MAX=       1.6414764,     32958,           0
$$ Real data points
##PAGE= N=1
##DATA TABLE= (X++(R..R)), XYDATA
0@%%%%%%%%%%%%%%%%%%%%%%nJ3j6J6j6J6j6J6j6K2l0L2l2L3m0M7m9N5o2O6p3Q1
$$ 0 0 0 0 0 0 0 0 0 0 0 0 0 0 0 0 0 0 0 0 0 0 0 -5 8 -8 8 -8 8 -8 8 -8 14 -16 16 -16 17 -23 24 -25 30 -32 34 -39 42
44D2q9J00j11J24j39J55j77K04k37K78l33M09n23P18j096K091r118k3794L0707
$$ 42 -47 53 -58 66 -73 82 -95 109 -128 150 -183 226 -297 421 -675 1416 -7702 -31496 -789
63g89L0988k2143l5545J3650L6220m311l4872l318L0568R653k5252j3210J8949
$$ -789 30199 8056 -27489 -13839 22381 18070 -16802 -20120 10448 20101 -5151 -18361 588
76E88J4704j3375j3713Q756J1514o057q342N085N445o077l245Q344K717j1324
$$ 588 15292 1917 -11796 -3040 8474 2417 -5925 -840 4605 -1472 -4717 3627 6344 -4980
90d980l826J4070O731j6004j0927J6344J6009j4776k1069J1137K5421n713k8191
$$ -4980 -8806 5264 11995 -4009 -14936 1408 17417 2641 -18428 -7291 18130 12417 -15774
103a5774j024K8877Q226k7285j5153K3431K0991j7665k4948J0618K6535l226k5750
$$ -15774 -16798 12079 20305 -6980 -22133 1298 22289 4624 -20324 -9706 16829 13603 -12147
116a2147l743K2712R457j7956j3345J2125J5048o135j4584P65J2220L237q597
$$ -12147 -15890 6822 16279 -1677 -15022 -2897 12151 6016 -8568 -7803 4417 7654 -943
129i43n462M482N839n54m452k524J734M110J674l977m910K298P448O52q682m266
$$ -943 -6405 -1923 3916 3362 -1090 -3614 -1880 2230 3904 -73 -4983 -2685 4763 5415 -3267 -7533
145g533Q334P916o309j0912K945J2664J349j2749n829J1132R865p998j2879L649
$$ -7533 801 8717 2408 -8504 -5559 7105 8454 -4295 -10124 1008 10873 2875 -10004 -6355
159f355J4362J327j4032o216J1943J0362q425j3291L880J4566J046j4135n771
$$ -6355 8007 9334 -4698 -10914 1029 11391 2966 -10325 -6445 8121 9167 -4968 -10739
172a0739J2069R630q677j2242M530J3218k35j2707l668J0804O710p873q480M462
$$ -10739 1330 10960 2283 -9959 -5429 7789 7554 -5153 -8821 1983 8693 820 -7660 -3198
186c198Q845j166p935j540O007L289l491l841R01L230J317j552k643p90K865L288
$$ -3198 5647 4481 -3454 -4994 1013 4302 811 -3030 -2129 1101 2418 866 -1777 -2567 298 3586
202C586j879n367j15O757K859p071n902O152Q772m074j0969J109J2137K396j2088
$$ 3586 1707 -3660 -3775 2982 5841 -1230 -7132 -980 7792 3718 -7251 -6142 5995 8391 -3697
217c697n967J0783R116q405j1473N192J2696j612j2725j838J1557M789r546o930
$$ -3697 -9664 1119 10235 1830 -9643 -4451 8245 6633 -6092 -7930 3627 8416 -1130 -8060
231h060O857Q027l982q073J323P175Q01n628k155L726K610j816k275K45J275P51
$$ -8060 -1203 6824 2842 -5231 -3908 3267 4068 -1560 -3715 11 2621 805 -1470 -1225 50 801
247H01J82r79j667M47K921O94l648k248L762L945l107n441J821O535m6p022j944
$$ 801 983 4 -1663 -1216 1705 2399 -1249 -3497 265 4210 1103 -4338 -2517 4018 3972 -3050 -4994
264d994O792L905n833n539M307O677k359p170K90O882J644n980l212M591M227
$$ -4994 1798 5703 -130 -5669 -1362 5315 2956 -4214 -3924 2958 4602 -1378 -4590 1 4228
279D228k907m661J153M442L65l675j545K542K166j275k232L4J838Q95j058j484
$$ 4228 1321 -3340 -2187 2255 2620 -1055 -2600 -58 2108 833 -1399 -1365 473 1368 310 -1174
295a174N1J586R29j214j747N35K249L90k375j355K095K228j445k827N77L130M12
$$ -1174 -1123 463 1392 178 -1569 -1034 1215 1605 -770 -2125 -30 2198 753 -2074 -1497 1633 2045
312B045l028j332K575K111j884k575J018K750q4k577o96K111J317j465j686P38
$$ 2045 -983 -2315 260 2371 487 -2088 -1070 1680 1596 -981 -1677 434 1751 286 -1400 -662
328f62J738Jj548o03J135R93o21j156N4J059M34q08p88L86R65O1r52n19P33Q66
$$ -662 1076 1077 -471 -1074 61 1054 433 -723 -669 390 824 16 -772 -386 579 640 -312 -831 -98 768
348G68m01j069k4J107M44r98q19P66J057m22j182O4J198K58j036n23Q26O92n54
$$ 768 367 -702 -726 381 825 -173 -992 -226 831 409 -773 -709 489 747 -289 -812 14 706 152
367A52p69L00P49p8o15o9M92J65l16j92J92J66j03j26P1O7n2j5P3mj34j8J83M0
$$ 152 -617 -317 432 354 -261 -330 162 327 11 -181 11 177 74 -52 19 86 34 19 92 88 -46 -64 119 159
391A59k09j23K24J78k01k64J74K74j23l06O8K95l5k79J2K48l8k22M3K18p1k26
$$ 159 -50 -173 51 229 28 -236 -62 212 89 -217 -149 146 111 -168 -156 92 54 -168 -125 93 22 -204
413b04Q7K96r4l38P3L98Jm51r5M61K30m41l33L77M73k42n53Q2O19P0n86k70N31
$$ -204 -117 179 85 -253 -180 218 219 -232 -327 134 364 -77 -410 -33 440 198 -355 -273 346 416 -170 -440 91
436I1M40m11n44K38O13o1o05j02N03K61m06l17K30L35p6l06p2J77J78n0k25r5
$$ 91 531 120 -424 -186 427 366 -239 -341 162 423 17 -300 -70 265 189 -117 -189 -12 166 116 -109 -204
458b04J82K45j10l61o0M19K14m04l78L17N19j58o13k9O34K54n92m49M76O22k76
$$ -204 -22 223 113 -248 -308 111 325 -79 -457 -140 379 221 -392 -421 213 467 -125 -574 -98 524 248
479B48p19O1P85J74p57l77O45N82m78o92K69P75q0p36j23O36K86n03l82L19M19
$$ 248 -471 -410 375 549 -208 -585 60 642 164 -528 -259 516 436 -300 -423 213 499 -4 -386 -67 352
500C52j22m12l6L19J74k11k57M8K70J01k45k35J23L41K3l86j91L55L37k57m89
$$ 352 230 -182 -218 101 275 64 -193 -145 125 226 -19 -254 -131 210 233 -153 -344 11 348 91 -398
521c98J10N59J02n89l18N30N41m15p01K31Q36J4q71k86Q17N52o92p47M79R27k26
$$ -398 -288 271 373 -216 -534 -4 537 122 -579 -348 488 502 -369 -655 162 714 22 -725 -246 681 455
542D55r58p1R21L62p66n93N31P45k55p98o9P69L47o06n89L52P43n0p81k59O64
$$ 455 -503 -574 347 709 -57 -650 -119 626 371 -427 -496 273 620 14 -575 -223 520 470 -311 -570 94
563I4N40m78p55K01Q31J41q07m75O31P49l70r14K2R40L64q47p37O33J002k74j140
$$ 94 634 156 -599 -398 433 574 -233 -708 -77 672 302 -612 -590 350 714 -133 -870 -237 765 491 -649
584f49j32J114N59r27r17O18J174j92j246k86J141P48q43j123M37J314J02j331
$$ -649 -781 333 892 -35 -952 -334 840 648 -598 -884 257 1005 162 -961 -524 790 892 -439
602d39o34J148J112p75j441K43J592L45j523q90J207J361p36j672J51J695N09
$$ -439 -1073 75 1187 412 -1029 -786 806 1151 -372 -1262 -55 1306 570 -1102 -951 744 1253
619A253j528j062J098J481n50j704r0J641P41j358j255Q41J583k02j670m67J497
$$ 1253 -275 -1337 -239 1242 692 -1012 -1102 539 1280 -78 -1333 -492 1091 889 -781 -1248 249
636B49J061j077j492M66J694K47j624r12J260J487o95j797l7J874Q00j649j458
$$ 249 1310 233 -1259 -793 901 1148 -476 -1388 -128 1359 664 -1133 -1170 704 1504 -145 -1603
653a603J140J974m49k164l73K091J131j699j751J051K144k36k241o16J980J387
$$ -1603 -463 1511 1062 -1102 -1475 616 1747 48 -1703 -652 1492 1256 -985 -1601 379 1766
669A766j425j942O60K187K14k138j052J718J722j021k166J68K218P33j916j536
$$ 1766 341 -1601 -941 1246 1460 -678 -1730 -12 1710 689 -1477 -1309 909 1642 -274 -1810
685a810J319K094n06k335m31K210J345j726k060R37K496j7k536r59K235J820j596
$$ -1810 -491 1603 1097 -1238 -1669 541 1886 160 -1900 -963 1533 1516 -1020 -1979 256 2076 480
702D80k413O97K705L04k569j251K102J988j327k428L76K513O35k218j487J558
$$ 480 -1933 -1236 1469 1773 -796 -2047 55 2043 716 -1712 -1336 1177 1812 -406 -1893 -335
718c35K078o69k328k97K200J196j686j934R05K323M7k320j039J928J844j205k386
$$ -335 1743 1074 -1254 -1551 649 1845 159 -1775 -870 1453 1500 -820 -1859 69 1913 708 -1678
735a678K35K567P95k351j760J748K498q41k892k54K894J317k465k234J686K880
$$ -1678 -1443 1124 1919 -432 -2192 -444 2054 1213 -1679 -1933 961 2278 -187 -2421 -735 2145
751B145o66l120m63K943J510k329k337J440K826l67k887p22K547J673j839k305
$$ 2145 1479 -1641 -2104 839 2349 20 -2317 -877 1949 1582 -1305 -2027 520 2193 354 -1951
767a951Q77K555J89k408j138J887J862j063k246O4K234Q92j816j677J042K171
$$ -1951 -1074 1481 1670 -738 -1876 11 1873 810 -1436 -1372 862 1754 -62 -1739 -697 1474
783A474r7k257r03J935J787j264k438L23K664P57k514j773J940K584j064l067
$$ 1474 1377 -880 -1783 152 1939 675 -1763 -1440 1224 1981 -533 -2306 -366 2218 1154 -1913
799a913l5L145J180k795k178K041K934j036l298r1L255J202k797k148K014K782
$$ -1913 -1948 1197 2377 -418 -2596 -555 2379 1343 -1955 -2046 1209 2411 -386 -2534 -520 2262
815B262r99k994o6K820J042k285j755J492K162n64k173l34J800J070j139j495
$$ 2262 1263 -1731 -1797 1023 2065 -220 -1975 -483 1679 1115 -1058 -1392 408 1478 339 -1156
831a156L04J589N19j301j240O80J717J40j863j033J591J856r99k435J19K701Q60
$$ -1156 -852 737 1256 -45 -1285 -605 1112 1252 -611 -1644 -53 1803 804 -1631 -1512 1189 2049
848B049k595j850K102K680j296l229K57L424Q30l212j836K623K659j772l162P72
$$ 2049 -546 -2396 -294 2386 1090 -2139 -1882 1542 2372 -840 -2676 -53 2606 834 -2328 -1556
864a556L278K47l004j157K450J806j668k146Q14K141L9j831o84J274J082n74j163
$$ -1556 1722 1969 -1035 -2192 258 2064 396 -1750 -936 1205 1244 -587 -1271 3 1085 511 -652
881f52r7R29O94m73j048j69J141Q46r08j441M25J815K60j952j020J783J727j330
$$ -652 -749 180 874 401 -647 -816 325 1171 263 -1178 -753 1062 1322 -630 -1650 133 1860 530
899E30k296O20K618K00k634j066K355J785j785k357J045K620j99k603o19K279
$$ 530 -1766 -1146 1472 1672 -962 -2028 327 2112 327 -2030 -985 1635 1436 -1167 -1786 493
915D93J281j694j746J010J916k61j826m06J472R37r34j229L34J255K76j031p54
$$ 493 1774 80 -1666 -656 1260 999 -827 -1233 239 1176 242 -987 -653 602 878 -153 -907
932i07O36J028r7j109m32R47R15n92j200Q7J323M31j181r24Q78J269m21j470j09
$$ -907 -271 757 660 -449 -881 66 981 389 -811 -724 599 1030 -151 -1075 -197 1072 651 -819 -928
951i28J432O37j191j091Q07J351k94j459k30J309P31j022j093N62J289o3j283
$$ -928 504 1141 -50 -1141 -334 1017 723 -736 -966 343 1074 52 -1041 -479 810 747 -536
968e36m49J096Q62p55j149K97J272J83j200o35R90R72o34j152K17J192K17j076
$$ -536 -985 111 973 218 -931 -634 638 821 -379 -1014 -24 948 314 -838 -621 571 788 -288
986b88n77Q45Q20m91r24J48Q79J97p28m40M73O04j95n88j03M89L09k81m44K4M75
$$ -288 -865 -20 800 309 -615 -467 412 609 -119 -559 -86 518 323 -265 -368 121 430 149 -295 -271 204
1007B04K04l67m31J76N80O1o19l45N44N69l85p40J39Q31J15q32l88P23O20n47
$$ 204 408 41 -390 -214 366 427 -192 -537 7 576 191 -549 -410 421 536 -296 -684 39 659 112
1027A12p83L08Q61n9q18j91P14L97n73n02L52N69j51n49nM50J79l44k38K16K79
$$ 112 -671 -363 498 439 -379 -570 144 541 -32 -534 -182 387 236 -313 -318 132 311 -33 -271 -55 224
1048B24j04k33QJ77N3r2p2K7M7K4J6o8o9O3J30m4j72k1J99Q2k07j52J93J89j43
$$ 224 120 -113 -105 72 125 33 -39 -12 35 59 75 7 -62 1 131 87 -85 -106 93 175 -32 -184 9 198 55
1073E5k36Q0K25J1k45o8K03J08j64j27J12J37o7j40L7J28Mj17k5R6L0o7o2R3O5
$$ 55 -181 -101 124 135 -110 -178 25 133 -31 -158 -46 91 24 -116 -79 49 53 -64 -89 7 37 -30 -92 1 66
1098F6p7p3P5J09p2j12L5J48k0j29k8J35Q5j25j17Q6J50l5j62m0J64J08j39j72
$$ 66 -11 -84 -9 100 28 -84 -49 99 79 -50 -78 57 142 17 -100 -14 136 101 -61 -101 63 171 32 -140
1122a40O7K45k0k42r9K44J65j95k54J22K85l0l09o4K80J50k23k08J39K32k2k54
$$ -140 -73 172 152 -90 -189 55 220 25 -229 -107 178 148 -161 -225 55 205 -18 -226 -87 145 123 -131
1144a31o5K19J30j39j91O1J84M8j50j28R7J84jj80j04J56J98q1k58k7K88J68k64
$$ -131 -196 23 153 14 -177 -116 68 116 -34 -162 -65 119 118 -62 -166 -10 188 107 -151 -178 110 278 14
1167A4k89K07L96q9m69l5M50J95m17l27L29M28k10m73M3M87R2m34k25L21L04j79
$$ 14 -275 -68 328 239 -230 -265 185 380 -37 -364 -35 393 183 -290 -247 240 332 -102 -327 -6 298 119
1189A19l58K5L31R7k37k14J23K51J5k46j49J92K56q2l15o1L31K04k80l41J78M51
$$ 119 -239 -214 117 214 -23 -237 -114 137 152 -94 -243 -51 205 123 -192 -253 78 282 2 -339 -161 290
1211B90l3n00j22M90K85m28m00L02N16j81n31J3N27J36m54k43L41L16k26l18R0
$$ 290 257 -243 -365 125 410 -18 -418 -116 400 219 -312 -299 228 364 -90 -333 8 324 98 -220 -130
1232a30K88Qj96q5R0Q2N1p0j49j5K18J34k44k68J85M08j21m86k9N56J75n40l68
$$ -130 158 166 -30 -115 -25 57 108 38 -111 -126 92 226 -18 -286 -101 307 186 -300 -329 227 402 -138 -506
1255e06M92N15l85o24K21P16n4p38j13O93K85o13m25N10M87l42n28K14N03r1m34
$$ -506 -14 501 116 -508 -287 429 375 -363 -476 217 502 -111 -536 -26 461 119 -409 -195 308 217 -217
1276b17KL60N6k78o2J91O2j48NJ13o5j36J39J68j77k56K00L37j78m36J13N06r
$$ -217 -215 145 201 -77 -139 52 114 -34 -29 84 19 -117 22 190 13 -243 -43 294 116 -320 -207 299 290
1299B90n73j23O04K49n52l91M61N18l40o18K06O53m9o61r5O10K20n13l28M20L89
$$ 290 -283 -406 198 447 -105 -496 -35 483 143 -475 -269 384 335 -326 -421 189 409 -104 -432 -12 377
1320C77l03l90J71L88q2l26J5K39L8j64m4Q5K2j0K5l3q1M7J47j8k07l2K32J09
$$ 377 74 -316 -145 243 161 -165 -150 89 127 -37 -81 4 26 16 41 8 -73 -26 121 103 -104 -136 96 205
1344B05k44j91K22K71j81l39J10L63jl84r2L56J93l30k64K47L08j38l23L4L08
$$ 205 -39 -230 -8 263 82 -257 -147 216 215 -169 -261 95 288 -42 -306 -59 249 111 -212 -178 130
1365A30M3k51j32J76K07r8k01nJ68R0j07j40J2J66R1j68j64J13K65k6l23p6L48
$$ 130 173 -78 -210 -34 173 75 -126 -131 37 127 20 -120 -108 58 149 -19 -183 -70 195 169 -154 -230 118
1388A18J87l38k88K76L88j88m31L9M68P3m29j99L50L21k76l65J27L99j0l58j12
$$ 118 305 -33 -321 -45 343 155 -276 -237 231 304 -125 -324 26 347 71 -294 -167 232 222 -136 -248
1409b48K82J97j92k34P8K33K2j80j34J16J71Kj88j17J46K30o3k86m8K99J85k80
$$ -248 34 231 39 -195 -117 116 138 -42 -176 -60 111 113 -75 -192 -46 184 121 -165 -213 86 271 -9
1431il03J87M12n8m63q2M63K25m03l73L16M71j63n10j5M95K00m40l25L10M21j50
$$ -9 -312 -125 287 229 -234 -316 147 372 -31 -404 -88 383 220 -290 -305 190 390 -50 -375 -65 356 206
1453B06m68k5M28K13l59l31K19L89n4m08j00L42K52k56l45J05L94N9l66k19K78
$$ 206 -262 -287 141 354 -5 -336 -117 272 218 -190 -290 52 304 48 -297 -192 202 261 -105 -324 -46
1474d6L26j62l89LL98J52l38k84K23L72n6l84j09L53K47k40l53Q2M29Q4m01k63
$$ -46 280 118 -271 -268 130 282 -56 -340 -117 255 199 -185 -294 59 306 66 -287 -205 224 308 -93 -356
1496c56L01M09j51m91k1N22K22m84l95L53N43j76o26k1O04K20n21l92L75N27k24
$$ -356 -55 354 203 -288 -309 213 435 -49 -444 -91 452 276 -350 -371 233 453 -68 -460 -85 442 218
1517B18n61QN44J78m54l23K99M15j38m33l5L74J83k62k94J17L15O2k80k01J61
$$ 218 -343 -335 209 387 -67 -390 -91 324 186 -247 -282 92 275 13 -281 -164 151 213 -67 -268 -107
1538a07L33k3l74j45L48L29k54m57J13N30Q1n47k68M84M48l53n72J72O36K6o14
$$ -107 226 203 -171 -316 32 361 107 -350 -237 293 374 -173 -441 43 491 138 -434 -262 374 400 -214
1559b14k35N41L88l95m93K10N43ln18j80M06L03k69l61Q2L79Q1l29k08J93K95
$$ -214 -449 92 480 85 -408 -198 345 342 -176 -356 50 353 84 -277 -195 184 265 -64 -272 -79 216
1580B16m8l11j23K73K49j67l52K0L90J39l46l17K64M28j04m97n1N11K19m38l80
$$ 216 168 -143 -266 7 256 89 -263 -243 147 286 -60 -377 -113 315 211 -286 -337 174 393 -45 -425
1601d25L13M82j49n25rM84K13m18l30K92M16j29m20n2L92J92l01k86J56L33ml34
$$ -425 -112 370 221 -304 -313 171 384 -34 -364 -72 344 215 -205 -257 135 327 26 -260 -104 229 225 -109
1623a09j18K42K30j30k88pK97J36k54k34J19L26k0l41j34L01K63k20l51J03L88
$$ -109 -227 15 245 115 -173 -180 117 253 -1 -235 -116 210 190 -151 -285 16 279 59 -292 -189 199
1644A99N6l97j84L18L04k17l65P9L81P4l49k02K85K88j64l35M8L19R7k91j87K23
$$ 199 255 -142 -326 -8 296 79 -286 -207 174 248 -101 -303 -18 270 106 -229 -181 138 235 -56 -243 -20
1666b0K45r6k77NK55R7k08j56J10J93jk04p8J45J47o0k00k3J90J27j75j81R4K23
$$ -20 225 129 -148 -143 112 209 1 -155 -45 148 147 -57 -135 10 157 97 -103 -126 64 191 16 -165 -71 152
1690A52Nk58j01K25J72j66k31P5K71%k57j11K30J85j66k31P4K61Rk39r9J98J77
$$ 152 157 -101 -202 23 195 29 -202 -127 144 144 -113 -224 6 191 25 -206 -132 129 138 -101 -200 -2 175
1713A75j45j96P6J96J1j60p4J27J07p0j14JJ23M1p1q7M0R3Qp4o2O3Q7k5j11j5
$$ 175 30 -166 -90 106 117 -43 -117 10 117 47 -67 -66 57 98 27 -60 -20 73 81 7 -55 8 95 70 -41 -56
1739e6Q7P0p1j07L4J31j3j17n6J02P7n2j27J1J41K1j25p0R8R0n9j06J4J12K6r9
$$ -56 31 101 30 -77 -43 88 75 -42 -98 4 81 29 -98 -87 54 75 -50 -120 -22 68 9 -97 -83 29 55 -44
1765d4n0P1P3l4p2JQ1Ql8l7L2L9j0j4k2K1K4Jk0j5J4L6lm0j8L8L3j7o2MP2No0
$$ -44 -94 -23 50 16 -56 -55 26 34 -4 -41 -9 30 20 6 -16 5 29 30 10 -5 9 45 42 2 -16 22 55 38 -24 -20 52 57 -3
1798cm0N6M8m8m7J7M3K5p6j5K3J5Kk8j3lM9J1m4l8M1N2j6q3J0Q4K4r0n0Q4Q4o2
$$ -3 -43 13 61 13 -34 -17 26 51 -25 -40 -17 -2 0 -28 -41 -44 5 16 -28 -66 -25 27 11 -72 -62 22 46 -44 -94 -10 74 12
1830A2p6K6P9J2q9k1Q1N0n6n2L2L3J0k5qpJ4K0Nl5l2L9P2n8r0K8J23oj58m5J86
$$ 12 -64 -38 41 53 -36 -57 24 74 18 -34 -2 31 41 16 8 1 15 35 40 5 -27 12 84 26 -64 -36 87 81 -77 -122 64
1861F4Q7j85j46J66J82j26k09O4K33k4k28l1K16P0j95r5J40J24r0j44P1J33n4
$$ 64 151 -34 -180 -14 168 42 -167 -103 130 106 -122 -153 63 133 -62 -157 -17 107 17 -127 -56 77 23
1884B3j04L5P7k4m9N1K9o3j9Q9L1j14n9J37J05j34j44J11J99p6k51M4K79Nk70
$$ 23 -81 -46 31 7 -42 9 38 -25 -44 45 76 -38 -97 40 145 11 -133 -22 177 101 -150 -106 173 178 -92
1909i2q6K76J16k34j76J75K15j29k34Q4K15j1k16j5J66M3j15q1R5O1o3l7K5Qk0
$$ -92 -178 98 214 -20 -196 -21 194 65 -169 -85 130 119 -97 -112 54 97 -18 -99 -4 57 -6 -43 -18 -10 -30
1934c0L2L4o3m3O1R1o2j38N7J68l3j84%J95O2k00j12K06J44j55k02J22K28o8k07
$$ -30 2 36 -27 -70 -9 82 20 -118 -61 107 74 -110 -110 85 147 -53 -165 41 185 30 -172 -50 178 110 -97
1959i7j1K02L6j59p6J26Q5q4p2L2N7j8l4J0kj3L4L4p5m3P3P8p8j12N6J60l0j86
$$ -97 -108 94 130 -29 -105 21 106 22 -50 -18 39 21 -13 -3 -5 -18 16 50 -25 -68 5 83 5 -107 -51 109 79 -107
1987a07j3J82O3j91r3J60J41j22j58O2J95l6j93nJ86M8j45q4J06R1o6q6L7P3k
$$ -107 -120 62 125 -66 -159 1 142 20 -138 -76 119 83 -110 -115 71 119 -26 -110 -4 87 21 -65 -28 45 43
2012D3m9j0J9J7pJ3l2j7L7M1k3q3L1R5Jj41nJ24M6j24q2J05J03q8j14M7J27lj32
$$ 43 -6 -16 3 20 13 26 -6 -23 14 55 32 -51 -20 75 76 -65 -70 54 100 -24 -106 -1 102 14 -100 -53 74 71 -61
2041f1k5R6P0o7r5M9Q3j3p0l5P1N2l2o7mP8K0o1o1M7R3j9j06j8J16O1j02r6Q6
$$ -61 -86 10 80 13 -82 -33 50 37 -33 -68 3 55 23 -44 -48 30 50 -11 -72 -25 68 49 -57 -75 41 102 0 -96 -10
2070a0J09l6j50K4J31L1j32m7J02O9p3q4M3Q5k4p1lN9J1k5k5oQRK0l4l8L7O4k2
$$ -10 99 63 -87 -63 68 99 -33 -80 22 91 18 -66 -23 62 38 -33 -36 23 34 9 -16 -22 -14 -5 15 -19 -57 -20 44 22
2100B2q8J1R6L6j13o1J10J05r3j40P1J51j9j81j9J67P3j42j25J33J41q7j58K3
$$ 22 -66 -55 41 77 -36 -97 13 118 25 -115 -44 107 88 -93 -112 55 128 -14 -139 -6 135 48 -110 -87
2124h7J85Oj52m4J19P1q3r9O0Q9qq3j2K4N6k8l5j7L3L2j5m2k8O5N4m6q6J7J19
$$ -87 98 104 -48 -92 27 98 15 -84 -24 65 57 -26 -38 -14 42 14 -21 -38 -5 27 12 -30 -58 7 61 15 -71 -54 65
2153F5Nj14m5J04P8p9j15M9J33mj24p2J35R8r0j29N0J61j9j54m8J39R7r9j37P1
$$ 65 70 -44 -89 15 93 14 -101 -52 81 77 -47 -119 16 114 24 -105 -55 106 87 -67 -115 24 121 22 -115 -44
2179d4J40j6j34m4J27Q4r0j22N2J23Kj28l6Q3R3p4r1J8J04ko4n5M2Q2j5p1n3Q6
$$ -44 96 80 -54 -98 29 113 23 -99 -47 76 78 -50 -86 -3 90 16 -75 -57 47 45 -19 -74 -32 50 35 -36 -89 -3
2207cN5j6j09lJ01P4j10r5O7J31l3j48k4J55P1j12j22Q7J51m1j56qJ55N5j42r1
$$ -3 52 36 -73 -76 25 99 -11 -106 -39 92 59 -89 -113 42 113 1 -121 -34 117 76 -80 -88 67 122 -20 -111
2233a11R5J31m7j32oJ22M2j10n9N3R6k7p3m4Q3M7l2p7kQ5L2o8r3L8J17Nj26m8
$$ -111 -16 115 68 -64 -70 52 94 -16 -75 -22 74 47 -26 -70 13 60 28 -49 -51 34 66 -2 -95 -57 60 65 -61 -109
2261a09J14R4j07j08O2J37j3j49l1J52N7r9j05O9J14k2j09k1J01N4o6q7L3R3J0
$$ -109 5 99 -8 -116 -54 83 70 -79 -110 42 99 0 -105 -36 78 56 -53 -74 27 81 15 -72 -39 54 64
2286F4n7o0N1O4j7o7j9O3M7m2q7K1R2K7r4o7O8J03n2j27J2J34M2j41p8J21R6q2
$$ 64 7 -53 -2 62 45 -22 -41 22 69 27 -60 -39 53 80 -14 -81 -13 90 38 -89 -77 57 99 -42 -120 1 97 15
2314A5j15L6J22Mj20m8Q7R3o6o7QP4Rn6l7N3N1j8n5mL9L8k4n3J0M8K4l8m8K9O3
$$ 15 -100 -64 58 62 -58 -106 -19 74 8 -59 -51 23 32 -24 -61 -8 43 25 -30 -34 5 43 19 -34 -24 24 48 10 -38 -9 54
2345E4mo6l5Q3M2o0p2J5J13j0r4k9Q3N9o7r2M9R0j4q8j2O7L6n8o9N1O1j2o4j3
$$ 54 50 -16 -51 32 74 14 -58 -43 70 60 -34 -63 20 79 12 -80 -31 59 45 -43 -55 12 48 -10 -79 -28 33 21 -43 -56
2375e6M7L8n1k9J5N2lm5pJ5L6mk8nK1K4ql2qM9K0l4m6M4M0j7m5j4P0J3n2j6K9
$$ -56 -9 29 -22 -51 -36 16 13 -32 -39 -24 12 8 -20 -25 -4 20 12 -20 -28 21 41 7 -39 5 45 28 -17 -31 39 52 0 -16 13
2408A3K1nn0RM6rj5l4K4J4j2j3nK6j1Lj6qMJ8rk9QK5Rj6l0K0L0j0l5LL6qk2nL1
$$ 13 34 29 -21 -12 34 25 10 -24 0 14 2 -11 -16 10 -1 2 -14 -22 -18 0 -9 -38 -30 -5 4 -12 -42 -22 8 -2 -37 -34 2 -6 -28 -33 -2
2445bK7m5k3M6K8l1k2K9L5m2j8J6N0j8l6RM1j1m6OL6J2n3JM3J1n3k0M6J3k1m0
$$ -2 25 -20 -43 3 31 0 -22 7 42 0 -18 -2 48 30 -6 3 44 33 -13 -7 29 41 -12 -11 32 43 -10 -30 16 29 8 -32
2477c2L9L7l8m0J4L5on0ON8j2m0j1M5j0k9jL1Rn1JN5J3m1k6O2K2o1m0N4O0l9p1
$$ -32 7 44 6 -34 -20 15 9 -41 -35 23 11 -29 -40 5 -5 -34 -35 -4 5 -46 -45 10 23 -18 -44 18 40 -21 -61 -7 53 14 -57
2510e7M1P5j6p6oR1J6q5k3P8L0m6p0N3O8l2p4RO1J0n2k3M5J8m8k2L3K2m4JJ9J0
$$ -57 -16 59 43 -33 -39 52 68 -17 -40 38 68 22 -48 5 73 41 -33 -24 37 47 -5 -28 17 35 -13 -35 -2 20 -24 -23 -4 6
2542Fk1k2M3kl1j9M7J9n2j9L6N3n8m3L6O7l9o4J4P6K8r0k4P5N2n5p7L3R7k1q1
$$ 6 -15 -37 6 4 -27 -46 1 20 -32 -51 -15 38 -20 -63 -27 40 1 -63 -49 27 55 -35 -59 16 68 13 -64 -31 66 45 -36
2573c6nQ3L1p2n1P5M4m8n3J4N9ol6j5L6Lk0rNLOj0Nj7qK2Nk5j6J9M8m1l7PM6J3
$$ -36 -41 42 73 1 -50 25 69 21 -32 -18 41 35 -1 -16 20 23 3 -6 -1 2 8 -2 3 -14 -22 0 5 -20 -36 -17 31 -10 -47 -40 6 19
2609A9n6j8N5M0m6n3K1P8j1p2k2P9L7m7o0M7O7k7q1J5P2On5k5N0L4k9m6J4M4J0
$$ 19 -37 -55 0 40 -6 -59 -38 40 29 -43 -65 14 51 4 -56 -9 58 31 -50 -35 37 43 -12 -37 13 47 18 -28 -14 30 40
2640D0l9k2L2J3om0K8J8j1k4lK0mlpLoLQj1k3NL4Ol6k2M3M2m2n6K5O5j1q0PP9
$$ 40 1 -21 11 24 18 -22 6 24 13 -11 -14 6 2 -1 -8 -5 -11 -8 0 -11 -34 -29 5 11 -25 -47 -4 38 -4 -60 -35 30 19 -61 -54 25
2676B5K9p9m9Q0O2n4q0M1R9l0r3MQ8J7q2l2O0N3o0m5M3N8l2n3J2O3k1m7J7L4j5
$$ 25 54 -25 -74 6 68 14 -66 -25 74 44 -49 -45 43 60 -22 -54 6 59 -1 -46 -3 55 23 -30 -18 45 24 -23 -6 28 13
2707A3k8J7J5j4l4L3K5l9l1K0M9k6n2J0Q0pq2j5P8L8p4n8Q2O3m6q8M2R0l1q5m
$$ 13 -15 2 17 3 -31 2 27 -12 -43 -23 26 0 -52 -42 38 31 -51 -66 12 50 -24 -82 0 63 17 -71 -29 61 30 -55 -59
2738e9R8J0p2m3P3M9n3n6L5N2j2n1J2N1j0k2pJ2J%ljj6%K1Nj7j7L3J9m4k7L5M8
$$ -59 39 49 -23 -66 7 56 3 -53 -18 34 22 -29 -17 34 24 2 -5 7 8 8 5 4 -12 -12 9 14 -3 -20 13 32 -12 -39 -4 44
2772D4l2n8J7N4On2l0M8M4m2m7J7O0%n4j9M6K2k9m4J1O5Pm4l9M2M1j8m2j3P6R
$$ 44 12 -46 -29 25 31 -21 -51 -3 41 -1 -48 -31 29 29 -25 -44 2 24 -5 -49 -38 27 34 -10 -49 -7 34 16 -26 -39 37 46
2804D6n2m0M5M8k2p2K1O8J2p0l1N5L8m2m8K9M8mm9nK9J8j3j7jNQoj3j4J2M5j3
$$ 46 -6 -46 -1 47 25 -47 -26 42 54 -16 -47 8 46 4 -44 -15 33 29 -20 -25 4 22 9 -8 -9 -4 4 -2 -15 -29 -17 28 15
2837A5o8J5P0K7q2m5O8O5n7q2J8J04nq6l0R4N7q7o8P0Q1l6j05J4J03J0q4k7N2
$$ 15 -53 -38 32 59 -23 -68 0 65 8 -74 -56 48 43 -43 -73 21 78 -9 -77 -7 74 38 -67 -53 50 60 -24 -51 1
2866AM3k8m6K1L1nk2j8PK5Pnl0oL7J9l5l6L2N6k1q3J6P9J4p9m5P2N9m0q5L8P3
$$ 1 44 16 -30 -9 22 17 -5 -23 -16 9 16 11 -19 -25 12 31 -4 -40 -8 48 27 -56 -40 39 53 -26 -71 1 60 20 -65 -27 46
2899D6Oq8l1O7N4m8o3M5M7mo6oM3L3k2m6J6L5J3l8l1L1L8Nm9l6N5M4l1q4K2Q2
$$ 46 52 -36 -67 0 54 6 -57 -12 35 31 -35 -41 2 35 13 -33 -17 18 31 -7 -38 -7 31 36 -13 -49 6 50 19 -65 -43 39
2931C9Np0l0O5M8m1q0M8N3lo2j6M9L3l6l2NL7L2n0k4J5M1Jm3k3L1N7j9o0j3O9
$$ 39 44 -26 -56 9 57 16 -64 -16 37 34 -28 -44 5 38 2 -30 -25 12 44 -6 -30 -15 26 27 -16 -39 -8 49 30 -30 -43 26
2963B6L5o8m4N1P1l3q8%J04J3r6m7Q0O7n6p5L7N6Jp5j0O8J1k0m0J4K6oj4mORL1
$$ 26 61 -7 -51 0 71 38 -50 -50 54 67 -29 -76 4 71 15 -60 -23 33 34 -41 -51 17 28 8 -32 -18 8 2 -12 -16 -10 -1 30
2996C0l5k2%M4Ml2l5M3N1k7o8J3R1kq3j8N5O7o3o9L4Q7k7o7j2O2M4o8m5O0L6l7
$$ 30 -5 -27 -27 17 21 -11 -46 -3 48 21 -47 -34 57 55 -28 -46 9 76 13 -56 -22 65 38 -29 -41 21 65 -3 -48 12 48 11
3028A1m8K7L5jm3pK0J3j3nr%J4K3l3rMM0Jo2JM2L2m8l4L0P1m0o2NP4Nn5l1N4M4
$$ 11 -37 -10 25 24 -19 -26 -6 7 -6 -11 -20 -20 -6 17 -16 -25 -21 19 20 -42 -41 1 33 -15 -49 -19 52 12 -50 -45 29 34 -21 -52 2 46
3064D6l7o2L2O8l1l9KM8J5m1k3L8J6k1j9K2Lk6J3NmqRK4k2k8K6J9k8k7MM7%m1
$$ 46 9 -53 -21 47 16 -23 -21 27 42 1 -22 16 32 11 -8 14 17 -9 4 9 5 -3 6 30 8 -20 6 25 -3 -30 -26 21 21 -20
3098b0k4N2K6m9m1M5N3l5n5J7N7j3n3j5N8K4m7l9N3M3m8k9K8M1l0k0J2L6k7j2
$$ -20 -44 8 34 -15 -56 -11 42 7 -48 -31 26 13 -40 -55 3 27 -20 -59 -6 37 -11 -40 -12 29 -1 -21 -9 27 0 -12
3128a2J7J8j4k2J6K3j4l2K4L1k4l5K3L7mn9RO3j6m8l0P1K2o5k9M3M8m8n8L3O4
$$ -12 5 23 9 -13 3 26 12 -20 4 35 11 -24 -1 36 32 -27 -18 45 29 -19 -49 22 44 -21 -50 -7 41 -7 -65 -32 32
3159C2j9o2RO1nn2nN3Lm4k1M7K7l8k9L5M2l6l5L7J8j5l3L1K9k8l5L6M6l4j7J4
$$ 32 13 -49 -40 21 16 -36 -41 12 15 -29 -50 -3 24 -14 -43 -8 34 -2 -37 0 18 3 -30 1 30 2 -33 3 49 15 -2 12
3191A2L1l5k9J0N0Ko3MN4Po0OL2J6l5l8K4N0l2l8J9M6k1n3KM6Mk5j7J6K7k5k0
$$ 12 43 8 -21 -11 39 41 -22 -18 36 43 -17 -11 21 37 2 -36 -12 38 6 -32 -13 33 12 -41 -39 7 11 -14 -31 -15 12 -13 -33
3224c3J3J3Mk1rK9Oj6pJ2%MN%rROJ2j6%LJ9j5j1KJ4J3k3%NJ9ll2J8J6%l1qK5N
$$ -33 -20 -7 -3 -24 -33 -4 2 -14 -21 -9 -9 -5 0 0 -9 0 6 18 2 2 5 24 9 -2 0 14 27 4 4 9 28 25 -7 11 27 27 -4 -12 13 18
3264A8%l4PL1j1l3lK6J0l3jmL7kl2j6L3K5l1k4K3K8j2l7J2L1mk4j6L5Qj6KOK1
$$ 18 18 -16 -9 22 11 -22 -25 1 11 -22 -23 -27 10 8 -24 -40 -7 18 -13 -37 -14 14 2 -35 -23 8 4 -20 -36 -1 7 -9 -7 -1 20
3299B0rqNQjj9J4LpJ4J0j7lj9J8K3j7k8K7K6k9l0J6L6j1m3qM5Ml6k6L8M3l7m9
$$ 20 11 3 8 16 15 -4 10 13 6 20 30 13 10 -9 9 32 15 -13 14 40 11 -19 -3 33 22 -21 -29 16 20 -16 -42 -4 39 2 -47
3334d7J3N0j3k7j0M3Rm1j0RM3j5k9PL0lk2rJ7RnJlJ8j2J0pJNKRj0j1PJ7Mk9oK2
$$ -47 -34 16 3 -24 -34 9 18 -23 -33 -24 19 4 -25 -18 12 9 -13 -22 -5 4 -1 0 -3 15 3 13 6 7 12 14 23 13 2 9 26 30 1 -5 17
3373A7K1l8j2J3L2k2k6J5K3%m1j1M0Mj8l6K4L6k8k3mL1J3k7j1J9K8l4k0K2K0p
$$ 17 38 0 -12 1 33 11 -15 0 23 23 -18 -29 11 15 -3 -39 -15 21 -7 -30 -34 -3 10 -17 -28 -9 19 -15 -35 -13 7 0
3405@j5rK3olJ1olmJ9j5lJ7LJ3k2NJ6Ok6j1K2K7k6j9J0L3j4k6kK7Ql5j4J6L2j4
$$ 0 -15 -24 -1 -7 -10 1 -5 -8 -12 7 -8 -11 6 9 22 0 5 21 27 1 -10 12 39 13 -6 4 37 23 -3 -5 22 30 -5 -19 -3 29 15
3442A5l3J4J5Rl3P%KRk2lJ2Pmj5%J3Mrj9NK0J6j7j7K1K3k6l1K1L5kl5nL9J3l7
$$ 15 -18 -4 11 20 -13 -6 -6 -4 5 -17 -20 -8 -1 -5 -20 -20 -7 -3 -12 -31 -26 -6 10 -7 -24 -3 20 -6 -37 -16 19 17 -18 -23 16 29 -8
3479hk8M9K1k8j7J4K6%l9jK9Jk9kK9jj3rMj3lK5oj0lLJ1ok7K5J9j3k4j3M9Lk5
$$ -8 -36 13 34 6 -11 3 29 29 -10 -11 18 19 -10 -12 17 16 3 -6 -2 -15 -18 7 1 -9 -12 -9 2 -4 -31 -6 13 0 -24 -37 12 15 -10
3516a0l0L5K4l0n4M2N5k5m0J0N1kn6ML2K8l6l6L5K3k7j0J0K8j0j5Rj%nQr%MnJ3
$$ -10 -40 -5 19 -11 -65 -23 32 7 -33 -23 28 26 -30 -26 6 34 -2 -38 -3 20 -7 -17 -7 21 11 -4 5 4 4 -1 7 -2 -2 2 -3 10
3552A0k0PjK4k3k1L0Ok1j8J1L8J7n8j8N6J4m2m1L2L9j6l5lM6Mk6k1L3J6k2pnK4
$$ 10 -10 -3 -4 20 -3 -24 6 12 -9 -27 -16 22 39 -19 -37 19 33 -9 -50 -18 21 5 -30 -33 13 17 -9 -30 3 19 -3 -10 -15 9
3586ImkpmPRnk1PJ9Nj4j1J2K4mm6JM7%l0k1L0L8l1l0J0K5J1m7rL2L6l3l1J5L8
$$ 9 5 3 -4 -8 -1 8 3 -18 -11 8 13 -1 -12 0 24 20 -26 -25 22 22 -8 -29 1 39 8 -22 -12 13 24 -23 -32 0 36 3 -28 -13 25
3623B5j5k7LK0J4k8j3QK1jj9j2K1QKj9rJ4L0k2k5LJ7K7l4j2J7K2j2l0RM0mk5k1
$$ 25 10 -17 -14 6 20 -8 -21 -13 8 7 -12 -24 -3 5 7 -12 -21 -7 23 1 -24 -21 -4 23 -11 -23 -6 16 4 -26 -17 23 19 -6 -27
3658b7L7J5k9nOK3qrk9M1J4k1j6LK3rj8j3J3J8Nj8j0RJ4lj4mJ8J2j9j9J4L1j8
$$ -27 10 25 -4 -9 -3 20 12 3 -26 15 29 8 -8 -5 18 9 -9 -22 -9 9 14 -4 -14 -5 9 6 -8 -12 6 18 -1 -20 -6 25 7
3693Gj5j1K1L3l3k2OL7j3k5j0L6J2l2pmL7mk9oK4J9k7j1jL5mk6j0K4K4j9l0J5
$$ 7 -8 -19 2 35 2 -20 -14 23 10 -15 -25 11 23 -9 -16 -20 17 13 -16 -22 2 21 -6 -17 -18 17 13 -13 -23 1 25 6 -24 -9
3727iL4j1j4l%J4J3k2j7K3Omj8QJ1Omk7K7J2pl6PK6Ql1j0J3J2Qj6rK0%j4pJ5R
$$ -9 25 14 0 -3 -3 11 24 2 -15 8 14 10 -8 0 11 17 13 -14 13 25 18 -18 -11 15 23 -8 -18 -5 7 15 -1 -10 10 10 -4 -11 4 13
3765A3mk0MQJ1j4j2qK2Kj8MOJ4rj1QJ5qqlPKnj2J2J5%pqPkOj0pJ3MLj5LJ2Rj2
$$ 13 9 -11 -7 1 12 -2 -14 -22 0 2 -16 -12 -6 8 -1 -12 -4 11 3 -5 -8 -1 1 -4 -16 -4 11 11 4 -4 3 1 7 -3 -10 3 7 10 -5 -2 10 19 7
3808Gj1J1MNj4j1J7J0j5k0J1J6kj4kK3mj2j1J4Qj4nNJ1kk0OJ5oj6J6Ljj7MRJ0
$$ 7 -4 7 11 16 2 -9 8 18 3 -17 -6 10 8 -6 -8 15 11 -1 -12 2 10 -4 -9 -4 7 5 -15 -9 6 0 -16 0 3 2 -15 -11 -2 8
3846Hj4JPRj6QPrm%K4qj9kJ7MNk5J1J5nj6OJ5nk5LK7j3Jj5OJ2j4j1J4Qk0kLJ2
$$ 8 -6 -5 2 11 -5 3 10 1 -3 -3 21 13 -6 -8 9 13 18 -7 4 19 14 -2 4 19 14 -11 -8 19 6 7 -8 -2 10 -4 -15 -1 7 -13 -15 -12 0
3887@j1kJJ9j2j1J0Lj0nJ2KLj0J0pRj7QQMo%qJ0J0j0Pj%JjJ8%j5jMj2J8qjLqN
$$ 0 -11 -13 -12 7 -5 -16 -6 -3 -13 -18 -6 -4 -1 -11 -1 -8 1 -16 -8 0 4 -2 -2 -10 0 10 0 7 6 6 7 6 24 24 9 8 12 0 18 10 9 12 4 9
3931IkMPqqqJ4%j5pNJ4j7kJ0J1j7LOJ1k8K%RK0k3j7K4J4j6mLJ3oj2KJ8Pj7lJ3
$$ 9 7 11 18 10 2 -6 8 8 -7 -14 -9 5 -12 -14 -4 7 -10 -7 -1 10 -18 -16 -16 -7 13 -10 -27 -3 11 -5 -9 -6 7 1 -11 -9 9 16 -1 -4 9
3972IJ1rj5J3RpmQrJ0j0J3mKoj6K0%l6K2J6Jk4PJ1Jk1%J8J0l0j0J8Jkj6J0K3j4
$$ 9 20 11 -4 9 18 11 7 15 6 16 6 19 15 17 11 -5 15 15 -21 1 17 18 -6 1 12 13 -8 -8 10 20 -10 -20 -2 -1 -3 -19 -9 14 0
4011@k4mK7jj8qJ8J1oj8J6J0oj1j0L4Pj4j2KJ5%j8J6NlqNQrNnJ9j8OprJ2j1Lm
$$ 0 -24 -28 -1 -2 -20 -28 -10 1 -5 -23 -7 3 -3 -14 -24 10 17 3 -9 -7 8 8 -10 6 11 8 0 5 13 4 9 4 23 5 11 4 -5 7 -4 -1 -5
4052eJ2lj7J8Qj6j0LL1j8k4KRJ8k4nJ7J1k3j4K0QJl8K5K6j8j6JL5qk3kK5J1j0
$$ -5 7 4 -13 5 13 -3 -13 -10 21 3 -21 -19 -10 8 -16 -21 -4 7 -16 -30 -10 -2 -1 -39 -14 12 -6 -22 -21 14 6 -17 -19 6 17 7
4088Gk3J7K2mk3J5J4Kk9NRMj6mK0Kk0mJ4J2j9nJ6Pj7oJ0J4j4l7L6J0rl4J5J6R
$$ 7 -16 1 23 19 -4 11 25 27 -2 3 12 16 0 -4 16 18 -2 -6 8 20 1 -4 12 19 2 -4 6 20 6 -31 5 15 6 -28 -13 3 12
4125A2l5j1L4J1k3j8RK8j9k0J7K3jl8J1L3kj6j4K5Jj0OjQJj7J6J1%k7J2Rnj4P
$$ 12 -23 -34 0 11 -12 -30 -21 7 -12 -32 -15 8 7 -31 -20 13 11 -5 -19 6 7 -3 3 2 10 11 -6 10 21 21 -6 6 15 10 -4 3
4161CJ0pqJ2LKj3kJ9%j8oJ9%j1k2J1J8qj6jJ7Rk4lK3oj5j5K3J2k0k1K8lPj4QJ0
$$ 3 13 6 -2 10 13 15 2 0 19 19 1 -5 14 14 3 -19 -8 10 2 -14 -15 2 11 -13 -16 7 1 -14 -29 -6 6 -14 -35 -7 -10 -3 -17 -9 1
4200AKoj5K0J1j0j6J7QpJqK1j0qK0j0j2RnkRlJ1koj2J6Klk2MJ6j7Nj3JK6mk5K3
$$ 1 3 -3 -18 2 13 3 -13 4 12 5 6 -2 19 9 1 21 11 -1 8 3 1 10 7 18 16 10 -2 14 16 13 -9 -5 11 -6 -1 -14 -13 13 9 -16 7
4241GqqLj9K3lqN%J5j7j2j3L0Qqj7J1J1klqJ5Pj3OjJKjj1J0Rj0lJ8km%MjJj2j
$$ 7 -1 -9 -6 -25 -2 -5 -13 -8 -8 7 -10 -22 -35 -5 3 -5 -22 -11 0 -2 -5 -13 2 9 -4 2 1 2 4 3 -8 2 11 1 -2 16 14 10 10 14 13 14 2 1
4285AqJ2k%njPonmQQj2KnRkqrQK1qj6NJ2Ok6PrL5pk8J3J8oj0rJ4NoqKJ2Oj1lm
$$ 1 -7 5 3 3 -2 -3 4 -2 -7 -11 -3 5 -7 -5 -10 -1 -3 -11 -20 -12 9 1 -15 -10 2 8 -18 -11 -20 15 8 -20 -7 11 5 -5 -14 0 5 -1 -9 -7 5 11 0 -3 -7
4332gJ5qJ1onRMNk7RK1lj8mK0oj0j8J3K4kl0NJ6Kj4j1J7OoonK0j1orJ7Nj9nQK0
$$ -7 8 0 11 5 0 9 13 18 -9 0 21 18 0 -4 16 10 0 -18 -5 19 17 -13 -8 8 10 -4 -15 2 8 2 -4 -9 11 0 -6 -15 2 7 -12 -17 -9 11
4374A1nj6J2j2lJ3pmJ5%mJj4J8j1pjJ0J1J0k1j2QJ8j1j1nK2J5j6j4PJ9nj1nJ1
$$ 11 6 -10 2 -10 -13 0 -7 -11 4 4 0 1 -13 5 -6 -13 -14 -4 7 17 -4 -16 -8 10 -1 -12 -17 5 20 4 -10 -3 16 11 0 -5 6
4411FQj3j2J3Rpk6J9NmOk2RL1k3rqJ8Rj0pJLRj3oK8j1Nj7nROplJ0Nppj6J7Qnq
$$ 6 14 1 -11 2 11 4 -22 -3 2 -2 4 -18 -9 22 -1 -10 -18 0 9 -1 -8 -7 -4 5 -8 -14 14 3 8 -9 -14 -5 1 -6 -9 1 6 -1 -8 -24 -7 1 -4 -12
4455a2RJ7kj4nJ1Jm%PJ0kj3nJ3Prj2NRRk7%J5lj1J5k2K5j2jKMlrNjMjNkj8J0M
$$ -12 -3 14 12 -2 -7 4 5 1 1 8 18 16 3 -2 11 18 9 -3 2 11 20 -7 -7 8 5 -6 9 -13 12 0 -1 1 5 2 -7 -2 -3 1 0 5 3 -15 -5 -1
4499aRj4j2K3Qj3k2J7K3jk7LJ2Nk1j0L0Kj6j7J4J6Pk4%J1J1rk7K6Mj9J2jOJj5
$$ -1 8 -6 -18 5 13 0 -22 -5 18 17 -10 -7 5 10 -11 -21 9 11 -5 -22 -8 8 15 -9 -9 2 13 4 -23 3 7 -12 0 -1 5 6 -9
4536iOJ1MpJklL%nmqJ3Rj8nJ5J1j6mOPnk3J0RK1j8j4J6Qmj2LKPMj1NkqQnJ3pN
$$ -9 -3 8 12 5 6 4 1 4 4 -1 -5 -13 0 9 -9 -14 1 12 -4 -8 -2 5 0 -23 -13 -4 17 -1 -15 1 9 5 -7 -4 -2 5 9 -2 3 1 -7 1 -4 9 2 7
4582GJ5k2PJ1mmj1K4lj5p%K0mJk4K1Lj0k0J2K0kk1QN%j0jJ5j1PrNmlPprPjOj8
$$ 7 22 0 7 18 14 10 -1 23 20 5 -2 -2 18 14 15 -9 12 15 5 -15 -3 17 15 -6 2 7 7 -3 -4 11 0 7 -2 3 -1 -4 3 -4 -13 -6 -7 -1 -19
4625a9J4NJ0j3j5J4RPj2oNJ1j6oKK5jj3PkOj5kPJ7j0j0POJ3j8qJ9qrJ2KnpOKl
$$ -19 -5 0 10 -3 -18 -4 5 12 0 -6 -1 10 -6 -12 -10 15 14 1 8 6 12 -3 -5 2 19 9 -1 6 12 25 7 -1 18 10 1 13 15 10 3 9 11 8
4667Hj2Rj3KKnO%qmK3j8%OKMk0mK5%j0o%J9JpoJ1J0j4kM%Rj0j0RMJ0j2J4rMpq
$$ 8 -4 5 -8 -6 -4 -9 -3 -3 -11 -15 8 -10 -10 -4 -2 2 -18 -22 3 3 -7 -13 -13 6 7 0 -6 5 15 1 -1 3 3 12 2 -8 1 5 15 3 17 8 12 5 -3
4712cJ3oJ3j4j0J3llPkMqqJ0lJ1j0jJMmj2%kJ8jrnJ3j1j5J0NjOjlNkmOLNRk0Q
$$ -3 10 4 17 3 -7 6 3 0 7 5 9 1 -7 3 0 11 1 0 1 5 1 -11 -11 -13 5 4 -5 -10 3 -8 -23 -13 -8 -9 -3 -4 -7 -2 -4 -8 -2 1 6 15 -5 3
4758CJpJ5J2j6RrPLj7QNjlkJ4oj5ROpjkkRj5%MLJpLj0JJmNoLMRj8LkjJpQNpQ%
$$ 3 4 -3 12 24 8 17 8 15 18 1 9 14 13 10 8 22 16 1 10 16 9 8 6 4 13 -2 -2 2 5 6 -1 2 -8 -7 -6 -10 -5 -11 -8 -4 5 -13 -10 -12 -13 -12 -19 -11 -6 -13 -5 -5
4810ePppMK4j7pJ6KLj8ROOj0j9K4%nqJ5Qqj3J5KnrRKnlqJ7j3jrOJ0j6KkJ5j7N
$$ -5 2 -5 -12 -8 16 -1 -8 8 10 13 -5 4 10 16 6 -13 11 11 6 -2 13 21 13 0 15 17 12 3 12 14 9 6 -2 15 2 1 -8 -2 8 -8 -6 -8 7 -10 -5
4855eMlKnrOJ5j5J1Jj3MJ5oqmJJ0Qj1%J0qOj7J8J2j0Jj1OPnMJkJoJ1j4QmJ7j4
$$ -5 -1 -4 -2 -7 -16 -10 5 -10 1 2 -11 -7 8 2 -6 -10 -9 1 9 -2 -2 8 0 6 -11 7 19 9 10 -1 5 12 7 11 12 10 11 5 16 2 10 6 23 9
4899ImJ8j9rpK4nrj6J8J3pk0kK1j0rlK2Mj6rkK0jrMj%j1K9j8OpKLNmkJ7j1pJ2
$$ 9 5 23 4 -5 -12 12 7 -2 -18 0 13 6 -14 -16 5 -5 -14 -17 5 9 -7 -16 -18 2 1 -8 -4 -5 -5 -16 13 -5 1 -6 -4 -1 4 0 -2 15 4 -3 9
4942IJ3j8rJ7J9k4rOJ4J1k3oJ9mj5j7K2K5k9qlL1rk5ORknjJ2oj4KJ0Lj7J1%J5
$$ 9 22 4 -5 12 31 7 -2 4 18 29 6 0 19 15 0 -17 5 30 1 -7 -10 21 12 -13 -7 2 0 -5 -6 6 0 -14 -12 -2 1 -16 -5 -5 10
4981A0j8KLjkjMJ6j3k1J8J7j4j5NK0n%j2K1Oj9MJ9Qj5k3MK0%j3j0K5jj1mJ4Oj7
$$ 10 -8 -6 -3 -4 -6 -7 -3 13 0 -21 -3 14 0 -15 -10 10 5 5 -7 14 20 1 5 24 32 17 -6 -2 18 18 5 -5 20 19 8 4 18 24 7
5020Gj4J0oJ9j7OmQj1oNJnJK4k4PMNj5Pj7K1mrjJJ2Jmj6K1KrqK8j8lj3K6Roj0
$$ 7 -7 3 -3 16 -1 5 1 9 -2 -8 -3 -2 -7 -6 18 -6 1 5 10 -5 2 -15 6 2 -7 -8 -7 5 6 2 -14 7 9 0 -8 20 2 -1 -14 12 21 15 5
5063ERPpj4J3jNmk1K6%%j1nJ2rnNMOj1LkJj5J1pKnJ4kqLkJOk0mJ3QKj3RPjmmP
$$ 5 14 21 14 0 13 12 17 13 -8 18 18 18 7 2 14 5 0 5 9 15 4 7 5 6 -9 2 -5 -3 -8 6 4 -4 -1 -3 -2 4 -16 -20 -7 1 3 -10 -1 6 5 1 -3 4
5111DMj2j0KK5kj0NKMJp%Jj0J0LkKnpRj0J8klk0K4nJkj0LJ0j1ljQLqj0J7kJj2
$$ 4 8 -4 -14 -12 13 11 1 6 8 12 13 6 6 7 -3 7 10 8 10 5 -2 7 -3 15 13 10 -10 14 9 10 8 -2 1 11 0 -3 -4 4 7 -1 -11 6 4 5 -7
5156gPJ1j5oJ2QqKj0J5qJpJ6j1J5l2J6J0j1MKj6J9KlrMRj9J5Jj1%K3pj4LkPnj
$$ -7 0 11 -4 -10 2 10 2 4 -6 9 1 2 -5 11 0 15 -17 -1 9 -2 2 4 -12 7 9 6 -3 1 10 -9 6 7 -4 -4 19 12 -2 1 -1 6 1 0
5198@J7pJkj2Q%ljNLj1oJ1Lmn%N%Rj1Mj5J6opJOJ1k5QRJnLmQMpkj0J1OqmPQkj8
$$ 0 17 10 11 9 -3 5 5 2 1 6 9 -2 -8 3 6 2 -3 -3 2 2 11 0 4 -11 5 -1 -8 -7 -1 10 -15 -7 2 3 -2 1 -3 5 9 2 0 -10 1 7 -1 -5 2 10 8 -10
5248a0K3KqMj2LJjLj0K5j2pjLKlLj9K0oj2J9jJOnj5JkJ1Nj2LNJj9ONMr%NkLk1
$$ -10 13 15 7 11 -1 2 3 2 5 -5 20 8 1 0 3 5 2 5 -14 6 0 -12 7 6 7 13 8 -7 -6 -8 3 8 -4 -1 4 5 -14 -8 -3 1 -8 -8 -3 -5 -2 -23
5294b3J6Rkk0J8OJ0rj1%K2pj7NJ1Mr%J0pMj2J1%j1J0lrJ3pK3j5j1RMpj3mK0pr
$$ -23 -7 2 0 -20 -2 4 14 5 -6 -6 16 9 -8 -3 8 12 3 3 13 6 10 -2 9 9 -2 8 5 -4 9 2 25 10 -1 8 12 5 -8 -12 8 1 -8
5335hJ1MJrqJ2JqmPJ4j2j0nJ6Oj0p%J0J4l7K1J1oj3J2MkrqJ3lPJ1qqQRmj6LPO
$$ -8 3 7 8 -1 -9 3 4 -4 -8 -1 13 1 -9 -14 2 8 -2 -9 -9 1 15 -22 -1 10 4 -9 3 7 5 -4 -12 1 -2 5 16 8 0 8 17 13 -3 0 7 13
5379A3j%j5J8poqJ2%Qj4mJ0J0j9jJ1Qj7MpOKj9NJ0rPlj0K2Qj1qjMJlQqMJ2j2N
$$ 13 12 12 -3 15 8 2 -6 6 6 14 0 -4 6 16 -3 -4 7 15 -2 2 -5 1 3 -16 -11 -1 -10 -3 -6 -16 6 14 3 -5 -6 -2 -1 -4 4 -4 0 12 0 5
5423ELoLj4J1OjnrJ0M%pJ7kmLj1kRJj1lLPqmK3j2J0qlljnLjM%rJ0Kj5J0kkJ0j4
$$ 5 8 2 5 -9 2 8 7 2 -7 3 7 7 0 17 15 11 14 3 1 10 11 0 -3 0 7 -1 -5 18 6 16 8 5 2 1 -4 -1 -2 2 2 -7 3 5 -10 0 -2 -4 6 -8
5471hLJjNKrJ0kmMj2LJ1kJknOnJ2Mj3J4olKj%J4rKjNlmNkpmJ0J3k6rJ6M%pLj1
$$ -8 -5 -4 -5 0 2 -7 3 1 -3 1 -11 -8 3 1 2 0 -5 1 -4 8 12 -1 13 7 4 6 5 5 19 10 12 11 16 13 9 14 12 5 1 11 24 -2 -11 5 9 9 2 5 -6
5520fJ0pmNKj0NnJ4Jk6PJ0Lj0j2K2%Mj8J5Lj7%J9mKj0ROLj3j0K3MrJ3qj0Nj1K3
$$ -6 4 -3 -7 -2 0 -10 -5 -10 4 5 -21 -14 -4 -1 -11 -23 -1 -1 3 -15 0 3 -14 -14 5 1 3 -7 2 8 11 -2 -12 11 15 6 19 11 1 6 -5 18
5562A8mnoPLqlJ2pJ0j5Qj1J0jj1J0k0J9oMnk0jK4j3LnmRQj0LJ5k0LKNLlNrO%O
$$ 18 14 9 3 10 13 5 2 14 7 17 2 10 -1 9 8 -3 7 -13 6 0 4 -1 -21 -22 2 -11 -8 -13 -17 -8 0 -10 -7 8 -12 -9 -7 -2 1 -2 3 -6 0 0 6
5607FLkmjQkj2J9rk%LJ2j0qQj2J1%pOJ2j2Jj5kJ6olKJpjJpJ9j9%nJ0Mk0MJ2Pj5
$$ 6 9 7 3 2 10 8 -4 15 6 4 4 7 19 9 1 9 -3 8 8 1 7 19 7 8 -7 -9 7 1 -2 0 1 -6 -7 -6 -13 6 -13 -13 -18 -8 -4 -24 -20 -8 -1 -16
5653a6Nj0K1j9J2OoMnLJ0J1j1klOjpQoNj1K5j1rJ6j6JQJmnokLJ4lq%QlnKJ2j8
$$ -16 -11 -21 0 -19 -7 -1 -7 -3 -8 -5 5 16 5 3 0 6 5 -2 6 0 5 -6 19 8 -1 15 -1 0 8 9 5 0 -6 -8 -5 9 6 -2 -2 6 3 -2 0 12 -6
5698fL%mQrjj%Qk0K0nrJ0lLKjnLPmKLj1MKRKj3PLKNj2OnK0rOJ0j5Nj3jOj4J6o
$$ -6 -3 -3 -7 1 -8 -9 -10 -10 -2 -22 -2 -7 -16 -6 -9 -6 -4 -5 -10 -7 0 -4 -2 1 -10 -6 -4 5 7 -6 1 4 6 11 -1 5 0 20 11 17 27 12 17 4 3 9 -5 11 5
5747EJ1j2nQQj0pOLQj9JMlmPoKKmKnQPk1J3%knpkJ1MkJ5rJqMjJ0j0K%qQPj1QK0
$$ 5 16 4 -1 7 15 5 -2 4 7 15 -4 -3 1 -2 -6 1 -5 -3 -1 -5 -3 -8 0 7 -14 -1 -1 -3 -8 -15 -17 -6 -2 -4 11 2 3 -5 -1 -2 8 -2 0 0 -8 0 7 -4 4 24
5797B4j2o%pLQJj2M%Mk%kNoqK%mJ2j4JNkkMkoMkRnqMJ3j1LJ1o%rQnlkkK2njnM
$$ 24 12 6 6 -1 2 10 11 -1 3 3 7 5 5 3 8 2 -6 -4 -4 -8 4 -10 -9 -4 -6 -8 -4 -6 -12 -8 -10 -1 -6 -14 -10 3 -8 -5 6 0 0 -9 -1 -6 -9 -11 -13 9 4 3 -2 2
5849BpJ6j5JMJ3j4PrJ9j8j4K4qJ2%j0KoJ1KqlMj1PQj0MqJ4j2nKLOqlPjjLj0kp
$$ 2 -5 11 -4 -3 1 14 0 7 -2 17 -1 -15 9 1 13 13 3 5 -1 10 12 4 1 5 -6 1 9 -1 3 -5 9 -3 -8 -6 -3 3 -5 -8 -1 -2 -3 0 -10 -12 -19
5894a9QjlNJ1jLj1j1J5mPKKjJ3k0QoJLKJkJ6j0Jj7K4j6jnJ6Lj0%jQrkJ0j0LJq
$$ -19 -11 -12 -15 -10 1 0 3 -8 -19 -4 -8 -1 1 3 2 15 -5 3 -3 -2 1 3 4 2 18 8 9 -8 16 0 -1 -6 10 13 3 3 2 10 1 -1 9 -1 2 3 -5
5939emjJ7llJj3J1LpoQNqmlP%rJJ6Oj0j%J0mj5J5nOj4PJ1q%nLJ2j5lNK%MnQj4
$$ -5 -9 -10 7 4 1 2 -11 0 3 -4 -10 -2 3 -5 -9 -12 -5 -5 -14 -13 3 9 -1 -2 -2 8 4 -11 4 -1 5 -9 -2 9 1 1 -4 -1 11 -4 -7 -2 0 0 4 -1 7 -7
5987gOMpNlOQomKL%j7J2Nj0o%J1ljk2K3J3k7NJJ9lj8JJ6%lrP%%oOkJ0pmjRknj
$$ -7 -1 3 -4 1 -2 4 12 6 2 4 7 7 -10 2 7 -3 -9 -9 2 -1 -2 -24 -1 12 -15 -10 -9 10 7 -11 -10 6 6 3 -6 1 1 1 -5 1 -1 9 2 -2 -3 6 4 -1 -2
6036bJ1pMkoRnLLj5LOJ1qj0KOJ3j4QoPj7PJ1j5Pj9J5Mq%j3J6jNj3NJ3j0KqKkN
$$ -2 9 2 6 4 -2 7 2 5 8 -7 -4 2 13 5 -5 -3 3 16 2 10 4 11 -6 1 12 -3 4 -15 0 4 -4 -4 -17 -1 -2 3 -10 -5 8 -2 0 -8 -6 -8 -3
6081cJ1nj0qOJmJ4j2Rj4QPJ%kJ0Kj0PkpNnJLPrJNOoj5J6Qk1Jj1K1mj1JLJ1j2o
$$ -3 8 3 -7 -15 -9 -8 -12 2 -10 -1 -15 -7 0 1 1 -1 9 11 1 8 6 -1 4 -1 0 3 10 1 2 7 13 7 -8 8 16 -5 -4 -15 6 2 -9 -8 -5 6 -6 -12
6127a2J9j0J%mMMmLOj1Jj4K2j4MpmJ1OoOj1Kj2K3lPppOjpJ9KqJ1j1jJ0j2Rj2J0
$$ -12 7 -3 -2 -2 -6 -2 2 -2 1 7 -4 -3 -17 5 -9 -5 -12 -16 -5 1 -5 1 -10 -8 -20 3 0 7 0 -7 -1 -2 -9 10 12 4 15 4 3 13 1 10 -2 8
6171HjnnJ4Jj8J3%lOjmj1J%LPkpKnLOkpLqKMMlpKKJLmKnPrJ0JRj3PlNrRmPJjk
$$ 8 7 2 -3 11 12 -6 7 7 4 10 9 5 -6 -5 -5 -2 5 3 -4 -2 -7 -4 2 0 -7 -4 -12 -10 -6 -2 -5 -12 -10 -8 -7 -4 -8 -6 -11 -4 -13 -3 -2 7 -6 1 -2 3 -6 3 -1 6 7 6 4
6226DJj0jJ5Omj1J8%j4rPJ1j2%KNjoNj1J1jn%pPj5NMLJmRn%pjJrPJ1JmKPompR
$$ 4 5 -5 -6 9 15 11 0 18 18 4 -5 2 13 1 1 3 8 7 1 6 -5 6 5 0 0 -7 0 -15 -10 -6 -3 -2 -6 3 -2 -2 -9 -10 -9 -18 -11 0 1 -3 -1 6 0 -4 -11 -2
6276bJKj1J4%j0PPlkRnNj6J7j3J4j3JKlJ4j1oMrJ9k0J3%Mk1nK2mj5jJ5KPj9%R
$$ -2 -1 1 -10 4 4 -6 1 8 5 3 12 7 12 -4 13 0 14 1 2 4 1 15 4 -2 2 -7 12 -8 5 5 9 -12 -17 5 1 -14 -15 0 2 9 -10 -10 -1
6319ajppJ4kj4K1j2J3j0QKj1jJNQmmJ6qmmPpJ2llKmj6J9KnLNlqJqNQlqMNMrqP
$$ -1 -2 -9 -16 -2 -4 -18 3 -9 4 -6 2 4 -7 -8 -7 -2 6 2 -2 14 6 2 -2 5 -2 10 7 4 6 2 -14 5 7 2 5 10 7 -1 0 -8 -3 5 2 -6 -2 3 7 -2 -10 -3
6369cmJ6j4JKj4J3j5J2nMJ1j2Mj1JJ0LKj%mjpK8j4OoJ3j0kMoNkPlKpKlP%rJ0m
$$ -3 -7 9 -5 -4 -2 -16 -3 -18 -6 -11 -7 4 -8 -4 -15 -14 -4 -1 1 0 0 -4 -5 -12 16 2 8 2 15 5 3 7 1 6 4 11 8 10 3 5 2 9 9 0 10 6
6415FJ0klqj4PQ%rQPj0Kj1J0j1jQmPjmJqJ1mnJ4rOPj4O%J%pkJ6qRpkQnJ1mJOp
$$ 6 16 14 11 3 -11 -4 4 4 -5 3 10 0 2 -9 1 -10 -11 -3 -7 0 -1 -5 -4 -12 -1 -5 -10 4 -5 1 8 -6 0 0 1 1 -6 -8 8 0 9 2 0 8 3 14 10 11 17 10
6465A0j4OMK4k4J2mnmlPonJ2JQrlj2J6qQpnRn%j0J3nMpKqKM%KpJ4pj1KJ5q%Om
$$ 10 -4 2 6 30 6 18 14 9 5 2 9 3 -2 10 11 19 10 7 -5 11 3 11 4 -1 8 3 3 -7 6 1 5 -2 0 -8 -6 -2 -2 0 -7 7 0 -11 -9 6 -2 -2 4 0
6513@LjOmRj1PpKKpMLJ0j5Q%KllJ1j1kOj4NNMLj6LNJLqljOLmj3K3%j1j4J8JKj2
$$ 0 3 2 8 4 13 2 9 2 4 6 -1 3 6 16 1 9 9 11 8 5 16 5 3 9 -5 0 5 9 12 -4 -1 4 5 8 0 -3 -4 2 5 1 -12 11 11 0 -14 4 5 7 -5
6562ej0J8j6PjJ0oPNjOj1QRj8J8nj4ONrnJ7noM%jm%J2knkQnj2kJ3jm%Ll%Lj5J0
$$ -5 -15 3 -13 -6 -7 3 -3 4 9 8 14 3 11 20 2 20 15 1 7 12 3 -2 15 10 4 8 8 7 3 3 15 13 8 6 14 9 -3 -5 8 7 3 3 6 3 3 6 -9 1
6610ARkmQj1kpklK%MP%kLJmjmPloJ8%kOj4lJ2lrPRj1QLj4J0j1RNOj2J0j0jNj5
$$ 1 10 8 4 12 1 -1 -8 -10 -13 -11 -11 -7 0 0 -2 1 2 -2 -3 -7 0 -3 -9 9 9 7 13 -1 -4 8 5 -4 3 12 1 9 12 -2 8 -3 6 11 17 5 15 5 4 9 -6
6659fJ1lkllJ7qpMjPpLonKJ1j1NRmJnRlj5jJ6jmj2J7qJrQoPmj8L0qLLkM%QJnJ
$$ -6 5 2 0 -3 -6 11 3 -4 0 -1 6 -1 2 -4 -9 -7 4 -7 -2 7 3 4 -1 8 5 -10 -11 5 4 0 -12 5 -3 -2 -11 -3 -9 -2 -6 -24 6 -2 1 4 2 6 6 14 15 10 11
6710A1Nj5J3j4QNj9J5nKlqMjKjMQqQj1qPJ5j9OjnMoJ7j6KklRpLlmPlKNnLRnNj3
$$ 11 16 1 14 0 8 13 -6 9 4 6 3 -5 -1 -2 0 -1 3 11 3 11 0 -8 -1 14 -5 1 0 -5 -1 -7 10 -6 -4 -6 -9 0 -7 -4 -7 -11 -4 -7 -5 0 -5 -2 7 2 7 -6
6760flJ6Lj1JJLKoONj6%J0J1Ll1J7nPm%Kj9K3j4J2j8J5pKlj0K4j4KJN%j8J0OM
$$ -6 -9 7 10 -1 0 1 4 6 0 6 11 -5 -5 5 16 19 -12 5 0 7 3 3 5 -14 9 -5 7 -11 4 -3 -1 -4 -14 10 -4 -2 -1 4 4 -14 -4 2 6
6803FNj2oJ2j7RjqNJ1moQ%koNjMoqJ2J1j2KjJ5rokKOkLnNj0J6j5qJ9nLrOjjj6
$$ 6 11 -1 -7 5 -12 -3 -4 -12 -7 4 0 -6 2 2 0 -6 -1 -2 2 -4 -12 0 11 -1 1 0 15 6 0 -2 0 6 4 7 2 7 -3 13 -2 -10 9 4 7 -2 4 3 2 -14
6851a4J1J1j0mOKmN%j9J0PqKOo%mlnK0j1J7j2jKkQmJ5j5jOpM%Rj3jR%%kOOj0%
$$ -14 -3 8 -2 -6 0 2 -2 3 3 -16 -6 1 -7 -5 1 -5 -5 -9 -12 -17 3 -8 9 -3 -4 -2 -4 4 0 15 0 -1 5 -2 2 2 11 -2 -3 6 6 6 4 10 16 6 6
6898FKJ3rKKljoK%Qj3mJ0nnJnQKpjQr%%%LMllKkJKLnlRlLQJr%JOMj0oLlkRNJj9
$$ 6 8 21 12 14 16 13 12 6 8 8 16 3 -1 9 4 -1 0 -5 3 5 -2 -3 5 -4 -4 -4 -4 -1 3 0 -3 -1 -3 -2 0 3 -2 -5 4 1 4 12 13 4 4 5 11 15 5 -1 2 -1 -3 6 11 12 -7
6955gQJ0oLnKRj2J4j5PKMjl%j2J9rJq%J6j3nJnJMjqJ1oOonKMnJ1oKqNMn%J1lk
$$ -7 1 11 5 8 3 5 14 2 16 1 8 10 14 13 10 10 -2 17 8 9 1 1 17 4 -1 0 -5 -4 0 -1 -9 2 -4 2 -4 -9 -7 -3 -8 3 -3 -1 -9 -4 0 -5 -5 6 3 1
7005AQLj0j%%RjqKNJ0j2J0mnlQLk4K1j4J9kpj1Ok5K6OljJk1RPMj0JnJ1mlQlpm
$$ 1 9 12 2 1 1 1 10 9 1 3 8 18 6 16 12 7 4 12 15 -9 12 -2 17 15 8 -3 3 -22 4 10 7 6 7 -14 -5 2 6 -4 -3 -8 3 -1 -4 4 1 -6 -10
7052a0MoLPKKKlrRoLknOQLj3J1%MkqK1Jj4MjjrJ1Kr%kJ1lnjJLpKjqPj3J1J4j5
$$ -10 -6 -12 -9 -2 0 2 4 1 -8 1 -5 -2 -4 -9 -3 5 8 -5 6 6 10 8 0 21 22 8 12 11 10 1 12 14 5 5 3 14 11 6 5 6 9 2 4 3 -5 2 -11 0 14 -1
7102apl%J1j1LJJKNLj5J5qJ1mj4MMJ0jj3jJ7j3KNpL%RjjQo%J4j5KJrJ3njKjjr
$$ -1 -8 -11 -11 0 -11 -8 -7 -6 -4 1 4 -11 4 -4 7 3 -11 -7 -3 7 6 -7 -8 9 -4 -2 3 -4 -1 -1 8 7 6 14 8 8 22 7 9 10 1 14 9 8 10 9 8 -1
7150ajJ2nOj0J7j2mMj1LpOPqn%OKoJ4j2Pj1lJ0JnMQoj4jJ7jKMk4L3j1LklJJ6l
$$ -1 -2 10 5 11 1 18 6 2 6 -5 -2 -9 -3 4 -4 -9 -9 -3 -1 -7 7 -5 2 -9 -12 -2 -1 -6 -2 6 0 -14 -15 2 1 3 7 -17 16 5 8 6 3 4 20 17
7196A7loLnJ0K%%j0Pj5OqJoMNPqjLmOMj0lQrOmrPOkMKJ3j9J2MqKKj8kJ6j1MLn
$$ 17 14 8 11 6 16 18 18 18 8 15 0 6 -2 -1 -7 -3 2 9 1 0 3 -1 5 9 -1 -4 4 -5 1 -3 -12 -5 1 -1 3 5 18 -1 11 15 7 9 11 -7 -9 7 -4 0 3 -2
7246bR%mjNLmNLj1JJ0j4J7lj0J1klkqKPj2JlMJ1jMnkLnlkJLpoJ1j3RjkokRkJ6
$$ -2 7 7 3 2 7 10 6 11 14 3 4 14 0 17 14 4 15 13 10 8 0 2 9 -3 -2 -5 -1 10 9 13 8 6 9 4 1 -1 0 3 -4 -10 1 -12 -3 -4 -6 -12 -14 -5 -7 9
7296Ij3%P%Mj2KOnOqmJ1LNj4J8mLj6PMnK%PrM%Qj3j4K1Rj7KRj2N%j4J0n%Oj1P
$$ 9 -4 -4 3 3 7 -5 -3 3 -2 4 -4 -8 3 6 11 -3 15 11 14 -2 5 9 4 6 6 13 4 8 8 16 3 -11 10 19 2 4 13 1 6 6 -8 2 -3 -3 3 -8 -1
7343aOnpJ2lj7J4jQnLj1NJ5prPonJ4j1lJ9k0J5kKOj4J2j8K1qMJqJ3j1mLPj2Pl
$$ -1 5 0 -7 5 2 -15 -1 -2 6 1 4 -7 -2 13 6 -3 4 -2 -7 7 -4 -7 12 -8 7 5 7 13 -1 11 -7 14 6 10 11 3 16 5 1 4 11 -1 6 3
7387CRj1JljJ0oJlKkQqKnRj0j1OPoRj7LJ2L%oJ4pkj1NkMNLl%mQj0J4j0mJ9n%K
$$ 3 12 1 2 -1 -2 8 2 3 0 2 0 8 0 2 -3 6 -4 -15 -9 -2 -8 1 -16 -13 -1 2 2 -4 10 3 1 -10 -5 -7 -3 2 5 2 2 -2 6 -4 10 0 -4 15 10 10 12
7436A2knOqoQOKJ0j7nMJ0pJLqLlLJ0nojNpQpPj9K3rnmlJ1noJ1j0RkLQj2J0oqJ9
$$ 12 10 5 11 3 -3 5 11 13 23 6 1 5 15 8 9 12 4 7 4 7 17 12 6 5 10 3 11 4 11 -8 15 6 1 -3 -6 5 0 -6 5 -5 4 2 5 13 1 11 5 -3 16
7485A6k0jJ3oKlJ1Nk0J5qNj4J1Jp%LmjMKjJ1pj0PLJj9J9jj4J3oL%JjqJ0okpJ7
$$ 16 -4 -5 8 2 4 1 12 17 -3 12 4 9 -5 6 7 0 0 3 -1 -2 2 4 3 14 7 -3 4 7 8 -11 8 7 -7 6 0 3 3 4 3 -5 5 -1 -3 -10 7
7530Gj3OlQJLmk%Pj2MrJ2j%j3LRkJ1mlkoJ4jJ1k6KJQMj0llJ0PmMj1J5j4%Kj2K2
$$ 7 -6 0 -3 5 6 9 5 3 3 10 -2 2 -7 5 4 4 -9 -6 3 1 12 8 5 3 -3 11 10 21 -5 -3 -2 6 10 0 -3 -6 4 11 7 11 0 15 1 1 3 -9 13
7577A3oj2LJ6j9j%OnPnjJjJlR%Jj5JPlJ1lpMjRk0RMjKnJ6jj0j1J1mKMoMQmLRj
$$ 13 7 -5 -2 14 -5 -6 -6 0 -5 2 -3 -4 -3 -4 -3 -6 3 3 4 -11 -10 -3 -6 5 2 -5 -1 -2 7 -13 -4 0 -1 1 -4 12 11 1 -10 1 -3 -1 3 -3 1 9 5 8 17 16
7627A6orj2J5RjnMjj1RmLj6PQljkKj0NJ1qNopKRj0mMMnmJ8Knj8J7rJ0N%j8J3j
$$ 16 10 1 -11 4 13 12 7 11 10 -1 8 4 7 -9 -2 6 3 2 0 2 -8 -3 8 0 5 -1 -8 -6 3 -7 -11 -7 -3 -8 -12 6 8 3 -15 2 -7 3 8 8 -10 3 2
7674BP%oLrROj0%lJM%KPj0%kRmMpNmjJ1j8KJ5jj0lkLqOJkJN%rnJ4j3Q%Oj0%J2
$$ 2 9 9 3 6 -3 6 12 2 2 -1 0 4 4 6 13 3 3 1 10 6 10 3 8 4 3 14 -4 -2 13 12 2 -1 -3 0 -8 -2 -1 -3 -2 3 3 -6 -11 3 -10 -2 -2 4 -6 -6 6
7725Fqj2JqK1j5J7nJM%j3J5qkKPKj4J0MJ4k4OjjMj%J2pmOkq%OMojnlJ2%Mj3Mq
$$ 6 -2 -14 -13 -21 0 -15 2 -3 -2 2 2 -11 4 -4 -6 -4 3 5 -9 1 5 19 -5 1 0 -1 3 2 2 14 7 3 9 7 -1 -1 5 9 3 2 -3 -6 6 6 10 -3 1 -7
7773gMpKPj0J1jOk0J6pN%rLJ0ojjPj2J3Nlj0KJ8qonJ0Rj5Oj1PKPkRolmnKKqJ4
$$ -7 -3 -10 -8 -1 -11 0 -1 5 -15 1 -6 -1 -1 -10 -7 3 -3 -4 -5 2 -10 3 8 5 -5 -3 15 7 1 -4 6 15 0 6 -5 2 4 11 9 18 12 9 5 0 2 4 -4 10
7821A0Jj2%mOlLLj0QmOj2lJJ5nj2J3plJ2jqOkqJ1%lmQpQj%Oj1lKMOk0L0j6NjJ1
$$ 10 11 -1 -1 -5 1 -2 1 4 -6 2 -2 4 -8 -11 -10 5 0 -12 1 -6 -9 3 2 -6 0 -2 -10 1 1 -2 -6 2 -5 3 2 2 8 -3 -6 -4 0 6 -14 16 0 5 4 15
7869A5n%j0%JKMqKOJ0j9RoOj3%kJ5pJ3j9J4j1krKJPk%NqLnJ2nRnmj1PJ5lj5J3
$$ 15 10 10 0 0 1 3 7 -1 1 7 17 -2 7 1 7 -6 -6 -8 7 0 13 -6 8 -3 -5 -14 -12 -11 -4 -6 -6 -1 -9 -6 -11 1 -4 5 0 -4 -15 -8 7 4 -11 2
7915B%moMJ2qJ0j1LlMJlLpJ7mnRpkqpJ6Lmkj3QmLJ%NkroJ2%mJ0Kj2PpOp%Qj7J0
$$ 2 2 -2 -8 -4 8 0 10 -1 2 -1 3 4 1 4 -3 14 10 5 14 7 5 -3 -10 6 9 5 3 -10 -2 -6 -3 -2 -2 3 1 -8 -14 -2 -2 -6 4 6 -6 1 -6 0 -7 -7 1 -16 -6
7966fPj1LMjJ7j0%nK%NmOj5J5lkJ1kj8mMJ5j1kJ1JNmkLjnMmJ3j2Rj0pkOj%KNn
$$ -6 1 -10 -7 -3 -4 13 3 3 -2 0 0 5 1 7 -8 7 4 2 13 11 -7 -11 -7 8 -3 -5 6 7 12 8 6 9 8 3 7 3 16 4 13 3 -4 -6 0 -1 -1 1 6 1
8014AqkLJjNqJ0lpLJ0mPj4J7jrpRJOopPJ3k2kJ3Mj0mJ8krQQj9MLoKJ4qJpmlJ1
$$ 1 -7 -9 -6 -5 -6 -1 -9 1 -2 -9 -6 4 0 7 -7 10 9 0 -7 2 3 9 3 -4 3 16 -6 -8 5 9 -1 -5 13 11 2 10 18 -1 3 6 0 2 16 8 9 2 -2 -5 6
8063FrJ3j5QLkJMpoklJ1qJ0n%kj0J6qKJ1j0Mj3J1Ojj0RkoORjj0NmRkj1J3JnLM
$$ 6 -3 10 -5 3 6 4 5 9 2 -4 -6 -9 2 -6 4 -1 -1 -3 -13 3 -5 -3 8 -2 2 -11 0 6 5 -5 4 2 -4 2 11 10 0 5 1 10 8 -3 10 11 6 9 13
8110A3%qJ0kj3J2j0JJ6oonLPj9PqJ2n%RLj8J5Pk2KJlJ4qlQj2jKJ3mMj2MQkJ0J
$$ 13 13 5 15 13 0 12 2 3 19 13 7 2 5 12 -7 0 -8 4 -1 -1 8 11 -7 8 15 -7 -5 -4 -7 7 -1 -4 4 -8 -9 -7 6 2 6 -6 -2 6 4 14 15
8155A5j6O%jOrkJ1kpPPlMmj5JQKl%KNqM%JqkkmQNj3Pk
$$ 15 -1 5 5 4 10 1 -1 10 8 1 8 15 12 16 12 -3 -2 6 8 5 5 7 12 4 8 8 9 1 -1 -3 -7 1 6 -7 0 -2
8191b
$$ Imaginary data points
##PAGE= N=2
##DATA TABLE= (X++(I..I)), XYDATA
0@%%%%%%%%%%%%%%%Qj6J6j6J6j6J7k5L2l2M0m8M9n7O5p3Q4r3J05j19J32j46J62
$$ 0 0 0 0 0 0 0 0 0 0 0 0 0 0 0 0 8 -8 8 -8 8 -8 9 -16 16 -16 24 -24 25 -32 33 -40 44 -49 56 -63 69 -77 85
38H5j80K00k22K46k71L00l33L67m07M54n06N67o39P24q24R50j114J331j636K101
$$ 85 -95 105 -117 129 -142 158 -175 192 -215 239 -267 300 -339 385 -439 511 -603 728 -908 1193
58A193k908M683j4959J1595L3354k9719l1436J6290L7602j0027l4929m92L3680
$$ 1193 -1715 2968 -11991 -396 32958 3239 -28197 -11907 25695 15668 -19261 -19753 13927
71A3927O130k7476j2223K2577J3835j5678j4766J1168J2496o927j0196N545O647
$$ 13927 20057 -7419 -19642 2935 16770 1092 -13674 -2506 9990 3063 -7133 -1588 5059
84E059n206m336P201K655r697l153J2845M997j5123q739J6432J3362j5777j8628
$$ 5059 -147 -4483 2718 5373 -4324 -7477 5368 10365 -4758 -13497 2935 16297 520 -18108
98a8108J3241K3355q629k7048K469K8796M618k8374j1775K5627J8251k0783k3221
$$ -18108 -4867 18488 9859 -17189 -14720 14076 18694 -9680 -21455 4172 22423 1640 -21581
111b1581J4230K6045o923k6429l75K4502O794k0496j1679J5136J4473r106j5069
$$ -21581 -7351 18694 11771 -14658 -15033 9469 16263 -4233 -15912 -776 13697 4591 -10478
124a0478L321J3619J449j0518m570O578N868k446n340j131L235L510m9m240l342
$$ -10478 -7157 6462 7911 -2607 -7177 -599 5269 2823 -2517 -3648 -413 3097 3048 -1192 -4534
139d534L308O313r45q248k406Q704O127p527r527M762J1974q73j2937l614J2160
$$ -4534 -1226 5087 4142 -4106 -6512 2192 8319 792 -8735 -3973 8001 7128 -5809 -9423 2737
154B737P922r762j1530N926J3842j196j4425l837J3200Q409j0366j2002O239J4156
$$ 2737 10659 897 -10633 -4707 9135 7939 -6486 -10323 2877 11286 920 -11082 -4843 9313
168I313j442j4546l472J3282P834j0509j1124O681J2933k377j3141j764J1894
$$ 9313 7871 -6675 -10147 3135 10969 460 -10664 -3983 8950 6573 -6568 -8332 3562
181C562N333r432p756O187Q845k765q532k88P071K574m776l743K183L707K60k491
$$ 3562 8895 -537 -8293 -2106 6739 3974 -4558 -4846 2225 4799 23 -3720 -1537 2170 2430 -61
197f1k107M39K903K045k499m410R84O179J414p053m381O743P403n256r984K679
$$ -61 -2168 -1729 1174 3219 720 -3690 -2706 3473 4887 -2166 -6547 196 7599 2343 -7641 -4962
213d962J1695N97j2283m217J1577P620r727j0411O865J2245l420j2857j74J2283
$$ -4962 6733 7330 -4953 -9170 2407 10027 300 -10111 -3246 8999 5579 -7278 -7452 4831
227D831L387j0642n979Q257P612n410q158K597P726j77o457j557M695K489k753
$$ 4831 8218 -2424 -8403 -146 7466 2056 -6102 -3505 4221 4044 -2413 -3970 725 3214 461
242D61k521R85J840L44n70r54r45Q13K334O4l350j431L786L091l523m730K546
$$ 461 -2060 -1075 765 1109 539 -415 -1360 -547 1787 1851 -1499 -2930 856 3947 424 -4306 -1760
259a760O042r84o868r49P010K938o384m783N129O179l405p001J325P116O88o501
$$ -1760 4282 3298 -3570 -4519 2491 5429 -955 -5738 -609 5570 2165 -4836 -3511 3605 4293 -2208
275b208k481N328L779l764m533K017M627l59m113j002L150J902j885k279O26K094
$$ -2208 -4689 639 4418 654 -3879 -1862 2765 2406 -1707 -2709 441 2343 458 -1821 -1195 899
291H99M80j483j242N87J597M70j464j372R07K077j04k363q64K273J833j808k566
$$ 899 1379 -104 -1346 -759 838 1308 -156 -1528 -621 1456 1352 -1011 -1875 398 2231 423 -2143
308b143J036L038q3l128r10K851J748k246k382J462K694n68k706l28K372J030
$$ -2143 -1107 1931 1848 -1280 -2190 661 2409 163 -2219 -757 1937 1369 -1337 -1665 707 1737
324A737j805j538J101J738l73j669l22J363Q09q84j099L22J136K24r72o21O13
$$ 1737 -68 -1606 -505 1233 860 -809 -1131 232 1041 157 -942 -620 516 740 -232 -853 -240
341b40Q81j54r84k85Q42P25n69r87J91J128K44j074o40R12R24n78j140K46J212
$$ -240 641 487 -497 -782 60 785 216 -771 -580 548 792 -282 -922 -10 914 336 -804 -558 654
360F54J02j107m18R49O27o97p44M41P61j78o84j2N43J23l95j99K38J91j47j45
$$ 654 756 -351 -769 180 807 110 -634 -193 568 390 -294 -306 237 360 -35 -234 4 195 48 -97
380i7O9Q2o2k9O7j3j09oJ57J6j97r0K18J45k02k31J91K73j51k81Q5L02m0k85M4
$$ -97 -28 54 -8 -37 30 17 -92 -98 59 75 -122 -212 6 151 -51 -282 -91 182 31 -250 -165 137 97 -188 -144
405a44K65k6k41M8K22n8k23R7K66j04l03Q5L84n0m31l4M77J40m65k68M22M10l21
$$ -144 121 95 -146 -98 124 66 -157 -60 206 102 -201 -116 268 218 -213 -247 230 370 -95 -363 59 469 148
428A48n22J67N93oo18j85N69L48m74n12L35N62j41o20j8N59J82m69k89L10L44
$$ 148 -374 -207 386 380 -238 -423 146 494 20 -492 -157 405 264 -356 -374 185 367 -102 -391 -81 263
449B63j59l22k1K57J31j19k02k9K08J75j31l28M0M04J47m29k89L75M66k47n78
$$ 263 104 -218 -239 18 149 30 -172 -201 7 182 51 -277 -237 167 314 -115 -404 -29 437 190 -388
470c88Q1O36J39o23l56N47N52l89o88J79P68N2p69k89P04M96n83o30L72P29j98
$$ -388 -307 329 468 -155 -511 36 588 199 -489 -310 458 510 -259 -548 156 652 69 -561 -189 540 342
491C42p48k9P04J99n80l44M03M20k29m48N4L79R8k71k24J39K73K0k49j78J73L17
$$ 342 -406 -435 269 468 -112 -456 -53 367 138 -310 -256 123 221 -50 -274 -135 138 158 -91 -269 -96 221
513B21q1l56j02L78K65l12m14J93N38pn90j88N66M30m66o17L11P96j03q82j58
$$ 221 140 -216 -318 60 325 13 -401 -208 330 323 -267 -455 111 541 75 -542 -231 565 462 -420 -578
534e78Q80M24p80o60O03Q54l62r55P3R57K14q49n08O61O90l91q03R2P89K12o98
$$ -578 302 726 -54 -714 -111 743 381 -574 -501 456 670 -179 -687 -26 664 273 -530 -438 351 563 -135
555a35m86M87O70k18p57j14P27M10n97o50L46Q15k0q47l09P38O14n11q30J95R44
$$ -135 -621 -134 536 318 -439 -553 174 584 -13 -663 -317 498 478 -369 -678 60 674 163 -667 -472 472
576D72J86r21n55P62Q73m42j085M9J160L72j036p76Q06J063m16j219n6J217N24
$$ 472 658 -263 -818 -56 817 375 -710 -661 499 871 -165 -941 -135 928 512 -707 -763 454 978
595I78j004r60O49J238j69j356l65J277Q73r78j309N27J548K0j577o25J387J132
$$ 978 -26 -986 -337 901 732 -624 -989 288 1161 183 -1126 -599 949 969 -608 -1233 154 1286
613A286r97j518M35J716J70j650p84J333J295q40j619K37J692M38j522j035J118
$$ 1286 289 -1229 -794 922 1092 -558 -1342 -9 1286 446 -1173 -936 756 1194 -328 -1363 -245
630b45J475n51j654j38J629P94j315j310Q01J628j14j701n97J504J209r82j681
$$ -245 1230 679 -975 -1113 516 1310 -5 -1315 -514 1114 1000 -701 -1298 206 1415 433 -1248
647a248L31J879M16j803j146J438J734q19k119M9K177P40j908j475J406J984o80
$$ -1248 -917 962 1378 -425 -1571 -133 1601 782 -1337 -1288 889 1629 -279 -1754 -348 1636 956
664I56k235j83K153J012j745j692J048K122k26k221o30J966J410j395j981O08
$$ 956 -1279 -1462 691 1703 -42 -1734 -686 1436 1210 -1011 -1641 325 1735 340 -1641 -1033
680a033K226L03k109j163J652J854r42k241L5K322Q93k004j728J378K306m88k554
$$ -1033 1193 1496 -613 -1776 -124 1730 788 -1453 -1418 904 1797 -207 -1935 -557 1749 1261 -1293
697a293m72K441J400j947k167J177K608j95k693p80K374J656j750k250Q44K529
$$ -1293 -1765 676 2076 129 -2038 -861 1747 1552 -1141 -1921 453 2109 359 -1891 -1047 1482
713A482J26k415j085J936J815j154k256K03K292P59j974j600J331K165m41k374
$$ 1482 1608 -807 -1892 44 1859 705 -1551 -1348 944 1703 -271 -1871 -540 1625 1184 -1190
729a190n49K161J475j603k155P51K530K61k512j283K101K152j307k749L17K948
$$ -1190 -1739 422 1897 294 -1861 -1110 1420 1681 -831 -2114 -13 2139 832 -1917 -1600 1348
745A348P85k733j777K106K603j202l042R8L072J025k681j961J918K620r04k912
$$ 1348 2133 -600 -2377 -271 2332 1130 -1912 -1814 1258 2283 -398 -2359 -441 2179 1275 -1637
761a637j85K754J224k210k041J361K500l49k542o66K182J521j495k094N51K299
$$ -1637 -1822 932 2156 -54 -2095 -734 1766 1417 -1125 -1791 391 1912 417 -1677 -1126 1173
777A173M27k069j332J452J976n84k277m11K161J374j645k160Q09K603K24k636
$$ 1173 1600 -469 -1801 -349 1627 1043 -1234 -1645 516 1890 245 -1915 -1106 1497 1721 -915
793i15j296K276K208j533k847N21L164O06l015j695K454K612j570l152M76L323
$$ -915 -2211 65 2273 740 -2107 -1586 1578 2184 -831 -2526 -72 2540 970 -2182 -1706 1617
809A617O68l075j710K434K526j525k947M51K970N68k585j440J919J990j021k215
$$ 1617 2285 -790 -2500 -66 2460 935 -2012 -1561 1409 1977 -608 -2048 -129 1861 840 -1375
825a375Q1K029P42j500j349P45J594R2j480q92J017J513k88j828o04J776J459
$$ -1375 -1294 735 1477 -23 -1372 -627 967 1059 -421 -1313 -296 1217 929 -899 -1503 273 1732
842A732j317k195N85K619L69k712j359K394K308j724l024Q04L376K77l334j368
$$ 1732 415 -1780 -1195 1424 1793 -919 -2278 116 2424 700 -2324 -1520 1856 2133 -1201 -2569
858b569K960K294k239k944J294L262k39l196p17K764J516k082k019J251K199l88
$$ -2569 391 2685 446 -2498 -1204 2058 1819 -1377 -2094 670 2186 104 -1915 -664 1535 1147
874A147k039l86J589R08r32j153K25J071M12p20r15J70J127M85j054j144O80J655
$$ 1147 -892 -1278 311 1219 287 -866 -641 430 842 122 -793 -623 504 989 -65 -1209 -529 1126
892A126r1j931o43J919J365j566k055J009K502k26k679o34K543J434k091k101
$$ 1126 1035 -896 -1539 380 1745 179 -1876 -867 1635 1409 -1270 -1904 639 2073 -18 -2119
908b119J435K531o29k647k08K470R74k007j536J358J869o34j903q5J680O98j221
$$ -2119 -684 1847 1218 -1429 -1637 833 1807 -200 -1736 -378 1491 857 -1046 -1131 549 1247 26
925B6j114O52J255j1j172n32Q52R15l68j104j77J060O85p97j067L35J283J78j289
$$ 26 -1088 -436 819 808 -364 -896 -44 871 503 -601 -778 282 967 170 -897 -562 721 899 -390
944c90o86J050J123o84j384J44J480L92j353q72J011J225n50j424L3J400M95j193
$$ -390 -1076 -26 1097 413 -971 -827 653 1045 -308 -1180 -169 1056 506 -918 -885 515 1010 -183
962a83r18Q12J214l08j322j82J209O69r39j022N21J254m3j266m14J106Q19q12
$$ -183 -1101 -289 925 617 -705 -887 322 991 52 -970 -449 805 762 -504 -918 188 1007 195
980A95j076M20J209Kj171l87R69O99o63q91L12R05M2q25l35O07N28l29o09L0N61
$$ 195 -881 -461 748 750 -421 -808 161 860 197 -694 -382 523 565 -260 -595 12 540 211 -398 -368 193
1001A93K23m12l92J62M57Q7m18l36K83N11o5o04k07N87M55m58o69K74Q02mq55
$$ 193 416 4 -388 -226 231 318 -100 -436 -153 358 293 -311 -518 69 524 66 -603 -329 473 469 -386
1022c86k62P92N35o52p12M36Q37j86q46q1Q01K86o26m63M61N65k74n47O8N09R7
$$ -386 -648 144 679 27 -685 -249 588 402 -444 -525 276 562 -64 -527 -66 499 225 -322 -254 255 352
1043C52m20k02K95K55j71k55M2K16K3j51o6O2N7qj5n0m0O9Q5n1j65J0J97M3j97
$$ 352 -68 -270 25 280 109 -146 -104 112 135 -16 -82 -20 37 29 14 -36 -76 -7 78 27 -138 -128 69 112 -85
1068h5j17K01J64j40k30R9K39l3k37k8K22R1j87j13J27J47p4j46M5J32kj15k7
$$ -85 -202 -1 163 23 -207 -108 131 98 -139 -167 55 146 -41 -154 -27 120 46 -100 -55 77 75 -40 -67
1091f7J20L1q5n5Q1O7o9q0Q0Q7p6r6N0J18k0j44j0J39N8j36j00Q9J25k7j67m1
$$ -67 53 84 -1 -56 25 92 23 -57 23 110 34 -62 -12 106 86 -58 -68 71 129 -7 -107 -18 107 80 -87 -128
1117a28J77P2j38j67J14K01l8k35n5K40J40k33k12J75K63p1k94k0K98J02k41j94
$$ -128 49 121 -17 -184 -70 131 93 -142 -197 43 183 -50 -262 -87 176 105 -189 -209 89 191 -50 -244
1139b44J84K38p1k49k0K49J05j77j66Q1J96J0j91r1J40J58m2j98m2J67J65j14
$$ -244 -60 178 107 -142 -162 87 192 15 -151 -70 126 136 -55 -146 -6 152 110 -88 -130 37 202 88
1161H8k49K4K84R9k79k49K57L26j39m41J4M77J36m68k67L78L74k53m72J18M81
$$ 88 -161 -137 147 246 -33 -282 -25 301 162 -279 -265 212 348 -120 -387 -9 365 112 -360 -242 239
1182B39M1m67j65L76K69k33l47Q7L44M8k87j61J78K51m9k61p3K27K05j39k88J4
$$ 239 280 -187 -352 24 293 60 -287 -200 144 192 -95 -256 -78 173 124 -137 -210 17 222 83 -205 -191
1204a91L43J42l12k97K40M24j24m89l9N12K03m60l68L79M57k30n43Q6N51O8n07
$$ -191 152 294 -18 -315 -75 349 225 -264 -303 209 412 -48 -416 -37 420 190 -353 -267 284 352 -155
1225a55k01L97K87k77l25J39L00j1k58o1J26J24l4r5q8K5J95P4k48j96K33L19
$$ -155 -356 41 328 51 -274 -135 165 154 -104 -165 -39 85 51 -44 -132 -107 88 162 -86 -282 -49 270
1247B70j54m43M8N33R7n50k73N26M54m52n68K94O92j35p38k4P09K21o53l64N54
$$ 270 116 -327 -279 254 351 -199 -472 54 508 56 -512 -218 474 339 -399 -423 286 507 -146 -510 44
1268D4M66m21n11K85N01j43m75K2M15N5l46n3K40M4j67k5J17l5j25J23J29j82
$$ 44 510 89 -422 -137 364 221 -254 -232 183 238 -108 -161 79 123 -44 -69 48 13 -112 11 140 -42
1290d2j93J97K73j77l97J51M83n9n47n9N76K00n70l35N30M60m25n60K85O30j35
$$ -42 -235 -38 235 58 -339 -188 295 236 -311 -370 206 406 -164 -499 31 491 66 -494 -209 421 286
1311B86o47k5O38J74n75k69M59L56l41m03K42M00j21l67M1K78L3j94n9J11M0l3
$$ 286 -361 -386 252 426 -149 -418 41 397 56 -347 -105 295 174 -193 -152 126 159 -35 -94 17 57 24
1333B4qj7m6L8R4j4j80lK12O1k34j39K27K33k12l20J63L44o2l78m2L76J43l47
$$ 24 16 -1 -47 -9 85 71 -109 -112 100 161 -73 -212 15 248 36 -284 -121 223 161 -217 -259 117 260 -87
1357h7k18K72K96j89l04O3L29Rk70j02K29J73j59j86M1J86M9j35j14N3J69L9j76
$$ -87 -305 -33 263 74 -230 -167 162 171 -99 -201 28 201 42 -144 -103 83 132 -3 -117 -64 105 144 -32
1380c2j26J36K40r0l04k2L58J23l51k34K88L44k31m13J06M59J5m58j35M02K53
$$ -32 -158 -22 218 128 -176 -198 160 283 -68 -302 -14 330 99 -314 -208 251 266 -192 -327 75 328
1401C28l02l50J88L94p4l73o9L41J53k51k21J50K30j7k23p3J52J55n3j83n9J68
$$ 328 26 -324 -136 258 184 -189 -258 83 236 -15 -236 -86 144 127 -96 -169 -17 138 85 -98 -157 11
1423A1J68j00k60J2L07J08k88k69K77L67j57m38rM72J52m44k93L73M13k41m95
$$ 11 179 79 -181 -169 138 246 -42 -311 -34 333 176 -262 -271 201 353 -91 -384 -11 402 161 -334
1444c34P7N11R2m60k63L57L90k29m55O3M37J32l98k76K85L67j33m19j7L87J87
$$ -334 -257 254 346 -114 -377 -20 370 141 -314 -251 186 318 -80 -356 -71 296 163 -256 -273 114 301
1465C01l19l01J90L76k9l75j43L24K83k35l56Q3L90R0l56k35K73L35j32l92j4
$$ 301 -18 -319 -129 247 218 -157 -300 24 307 72 -284 -201 189 279 -77 -312 -39 296 164 -228 -242
1486b42L71J86l09l05J70L90jl99j98L57L51k42m58O6N21J18n06l10M17M74k63
$$ -242 129 315 6 -299 -129 261 260 -139 -337 20 371 129 -329 -263 258 376 -130 -440 -23 451 188
1507A88o00Q4O10J38n88l20M85M44l01n54J11N57R4m98k55L70L79k11m38M9M05
$$ 188 -412 -328 282 420 -168 -488 -3 441 140 -414 -303 254 348 -150 -405 -35 344 133 -305 -256 149
1528A49J31l28k45J79L34l4l01j27K32K70j14l50m3L67K33l18l78J73N07k1n43
$$ 149 280 -48 -293 -114 220 186 -115 -242 -10 260 146 -204 -247 120 353 35 -343 -170 337 316 -227
1549b27j72N26L47m27n16K60O25q5o33j22N71L14m69m52L05N32j04n53p1M60K47
$$ -227 -399 127 474 47 -469 -209 416 331 -302 -424 147 461 -8 -460 -155 377 273 -280 -351 109 356
1570C56l49l38J64L95k0l51j43K60K69j24l23l2K99J93k18l03R5L69P2l86k34
$$ 356 7 -331 -167 228 208 -143 -286 -26 243 119 -204 -236 63 256 38 -265 -170 199 271 -115 -349
1591c49L21L80j88m63K3N23J17m76k89L90M39k41n04M9N28J04m56k80L47L79k01
$$ -349 -28 352 164 -299 -276 247 364 -112 -401 -11 428 187 -317 -268 260 364 -92 -372 -25 354 153
1612A53m27K7M26J16l58k47K29L21p5l51m6K85J86k07k71P4L04N8k64j97J90K83
$$ 153 -274 -247 179 295 -63 -310 -81 240 165 -186 -232 53 239 32 -239 -165 139 197 -67 -264 -74 209
1634B09o8l35m5L17J79k40l12J58L77j2l97j18L60K42k60l44J40L92pl75j30L18
$$ 209 141 -194 -239 78 257 17 -295 -137 240 228 -169 -287 73 315 55 -289 -149 243 236 -139 -269 49
1656D9K49k25l13J03L44K5l29j49K71K29j58k77M3K77M1k14j58J68J81o8j97m4
$$ 49 298 73 -240 -137 207 232 -97 -246 25 254 96 -181 -138 139 180 -34 -192 -24 157 89 -108 -152
1678a52J60J35j10j86K0K04O1j75j55J32K04m4k50n1K64J37k07k07J19K63j6k87
$$ -152 8 143 33 -153 -133 71 132 -43 -198 -66 138 94 -156 -207 57 194 -13 -220 -101 162 146 -141
1700a41m4K54J38j91k06J07K62l5k43n8K20J33j65j91J00J87j5j88m1J53J04j11
$$ -141 -185 69 207 16 -190 -83 179 144 -99 -157 63 196 31 -160 -60 127 112 -76 -117 36 140 29
1722B9j10M1J16K0j06n4L4Q2Oj05m0Q4O6m6r1j0J10M0r5q5O6J14j4j19k9J02P1
$$ 29 -81 -40 76 96 -10 -64 -30 52 58 -47 -87 -3 63 17 -74 -84 26 66 -29 -114 -48 66 52 -67 -96 6 77
1749G7n9j35M9J31Kj20m9J03P8o8j05O3J03lr2l2Q3N8n3p5K4P4Ln4k2L3L7k5k9
$$ 77 18 -117 -68 63 65 -55 -104 -1 77 9 -96 -33 70 67 -25 -57 26 84 31 -44 -20 54 57 3 -19 14 51 26 -3
1778cJK5K6l2j1j0K2K1k2l4j4L9K6m0m3LM7K6o7k7N8M1l7o2K7N2Qm8k7M3K2j5
$$ -3 -2 23 49 17 6 -4 18 39 17 -17 -31 8 34 -6 -49 -46 1 27 -40 -67 -9 32 -5 -67 -40 12 20 -28 -55 -12 10 -5
1810ek5j2L3J4J1m4k7O1L3l4m9K5P6Oq3m8R3N1o1q5M0R6j1r0pP9L9p6m1M6L0q
$$ -5 -30 -42 -9 5 16 -28 -55 6 39 5 -44 -19 57 63 -20 -68 25 76 15 -70 -30 66 55 -35 -42 37 76 0 -41 5 35 27
1842B7m0lK5pJ0ok7k1M3L6n3p3M0J14k4j55j5J68O4j68j13J68J53j18k08J10K24
$$ 27 -13 -16 9 2 12 6 -21 -42 1 37 -16 -89 -49 65 41 -114 -129 39 103 -65 -178 -10 143 25 -183 -73 151
1869A51n1k36jK30N0k16q2J67J31j34j38R4J41m7j24M9Q6m4m3L2K9n6k4O1M5r3
$$ 151 100 -136 -137 93 143 -73 -155 12 143 9 -129 -35 106 59 -65 -16 70 26 -17 15 44 -12 -36 25 70 -23
1895b3o1J29P8j40j18J24J63q9k44Q3K52k2k78m7K77R1k49j64K22K04j74k26J13
$$ -23 -84 45 123 -17 -135 -11 152 63 -181 -98 154 132 -146 -193 84 175 -74 -238 -16 188 14 -212 -99
1918i9K34n7k14mJ95L1j47n7J21M4o0m4M1K2k3J9J8m0l2N9P2n5j26R0J43n3j81
$$ -99 135 78 -136 -140 55 86 -61 -118 3 47 -13 -57 -16 6 -17 2 20 -20 -52 7 79 24 -102 -12 131 78 -103
1945a03PK06M3k16q6J94J34j89j61J34K03q8k15K4K10J4j73n0J34P4j02r1O4P9
$$ -103 -96 110 153 -63 -149 45 179 -10 -171 -37 166 78 -137 -113 97 111 -62 -112 22 96 -6 -97 -33 46
1969D6l8m1JK0lJ2Mn3k3P5O8r1r6P6J24m9j47K1J93Oj77p8J79J13j36j57J06J79
$$ 46 8 -33 -32 -12 -15 -3 1 -52 -75 0 68 -23 -119 -43 81 32 -115 -94 99 105 -72 -150 29 142 6 -151 -45 134
1997A34m9j87MJ79M7j63q2J41Q2r1q5N8O8j1p3OK0J3nj4j4k1N4K1m2o4M9P9l2
$$ 134 85 -102 -98 81 128 -35 -117 24 106 15 -70 -12 56 45 -28 -22 -2 11 6 -8 -22 -43 11 32 -10 -74 -25 54 22
2026B2j00oJ24L1j23o3J24P2q4j18O4J27k1j28MJ07N0r8p3O7R1l1r8%P8N0n9o2
$$ 22 -78 -84 40 71 -52 -115 9 81 -3 -121 -57 70 49 -79 -75 32 82 -16 -89 -22 69 38 -60 -60 18 68 9 -53
2054e3K3P0J2p1m4O1O8k7r5jJ03N2j07p5Q3R9o5j25L1J31Oj20m8J13P1r4q5M9
$$ -53 -30 40 52 -19 -63 -2 66 39 -56 -57 46 98 -9 -84 -1 98 33 -92 -61 70 76 -44 -92 21 92 -2 -87 -38
2082c8R7k0j06J5O3J9m8k6K3J5nPk6j5K8M6k0p3J6R7K5j22n3J23R0j09j20Q0J56
$$ -38 59 39 -67 -52 11 30 -18 -44 -21 -6 -11 -4 -30 -45 -17 29 9 -64 -48 49 74 -48 -101 22 112 3 -117 -37 119
2111A19m9j72mJ81N1j66j02J46J37j08j57O2J78j3j70l0J43N4j10q1O5R8l1r0
$$ 119 70 -102 -106 75 126 -40 -142 4 141 33 -124 -62 116 103 -67 -97 46 100 -10 -91 -26 72 41 -49
2135d9oN8L0k9m1RL0K5k4m6jN0M3m5q4L2J00pj09l3J23O5r1j15O2J42k3j50pJ41
$$ -49 -55 3 33 4 -37 -28 2 27 3 -43 -44 6 49 4 -80 -48 52 45 -64 -97 26 91 0 -115 -53 89 66 -84 -91 50
2165E0N9j17j05P5J36k1j58k0J43P1j22j16R0J41m4j44kJ21O1r8j02O9J10j3j35
$$ 50 109 -8 -113 -38 98 77 -81 -101 42 113 -9 -125 -35 106 62 -82 -84 37 98 0 -102 -33 77 64 -71
2190g1j6R6P4q4j00M5J08kq1l3M5P5k9p3j8O7N9m4q1PJ02L0q5r0Q2J15n0j44M
$$ -71 -87 9 83 -1 -101 -56 52 50 -31 -64 -19 56 27 -46 -64 3 62 18 -63 -56 46 76 -9 -99 -17 98 48 -96 -92
2219i2J62L6j37r3J05J39n7j70J9J82Mj41q6J33J01o9j36K6J36K4j12n5O9P2k0
$$ -92 70 106 -31 -124 -19 120 63 -107 -88 94 98 -43 -129 4 105 36 -100 -74 62 86 -26 -81 -12 60 40
2244D0j02j6R1M6o2o1kQ8K7q2o1N6J09j1j45lJ10Q1j05j02P6J45n9j66K8J34N6
$$ 40 -62 -78 13 59 -3 -64 -66 22 49 -33 -94 -38 71 60 -85 -88 22 103 -2 -104 -28 117 58 -108 -80 54 110
2271A10j18r0Q4J13m5j15mJ06L2o9q2M8R1k3o0n0O7N7l0o9j7P4M6m2q4J8R4K1
$$ 110 -8 -98 -14 99 54 -61 -65 41 73 4 -78 -30 61 38 -22 -72 -5 52 22 -47 -64 10 56 14 -70 -52 42 63
2299F3j06l4P3Q9o5j17K3J43Jj31n5J27P5p7j17N9J18j5j12k3J14M1p1q8O1P0
$$ 63 -43 -77 -4 85 20 -97 -74 69 70 -61 -116 11 86 9 -108 -49 69 54 -58 -81 33 74 3 -85 -24 46
2325D6nq1j4P1M0l4l6j6M2K6l3l1OM7J7n7l0K3P2j0r4k2P6N8o8p1L8R0pj11nQ8
$$ 46 41 -40 -54 17 57 23 -13 -29 13 39 6 -25 -19 28 45 -12 -42 -19 53 43 -51 -73 3 61 -7 -78 -40 50 43 -68 -73 15
2357A5N1q7p5O2R4l7r4RR2K9p5n4M9O7k9o6RN5J3k9l1L1L3k4l1JK4K0j1k8RJ7
$$ 15 66 -21 -96 -34 60 23 -71 -62 30 59 -16 -70 -21 46 17 -49 -40 15 28 -1 -32 -1 32 8 -23 -22 2 22 11 -17 -8 9
2389IK3k8k1J1L2Km0rRM3k0m5NO2Oo0j7L6L9m1l7NM0Km7jJ6L2k6k3QK9Oj5qjL
$$ 9 32 4 -17 -6 26 28 -12 -21 -12 31 11 -34 -29 33 39 -21 -38 -2 37 -4 -41 -36 4 6 -41 -42 -26 6 -20 -43 -35 -6 0 -15 -23 -24 -21
2426b1K3j9j8K0K2J2l2lK1K1j4m0K6L4j0m1ML3J4l2k9M0J9k5l2J9M8l4k7K2J7
$$ -21 2 -17 -35 -15 7 19 -13 -16 5 26 12 -28 -2 32 22 -19 -15 18 32 0 -29 11 30 5 -27 -8 40 6 -21 1 18
2457A8j3k5J7L3k1l9J1M1%n9PL2Rm5j6M9K4m1l5M5L0j8n9K2M8j3m7NN0ql9%M1
$$ 18 5 -20 -3 30 9 -30 -19 22 22 -37 -30 2 11 -34 -50 -1 23 -18 -53 -8 22 4 -55 -33 15 2 -45 -40 10 2 -37 -37 4
2490DOl0j3N5%l2j1N0J4o0j3N9K7o1k1M2M9o1n3M4O8k3q8MR2mq4k7R1M1p1p1N9
$$ 4 10 -20 -33 22 22 -10 -21 29 43 -17 -30 29 56 -5 -26 16 65 4 -49 -5 63 40 -48 -44 48 44 -40 -67 24 65 -6 -77 -18
2523a8O7k6r4L2O5po2j3M9K6m8k3M1K6l4qJ3J5pk3K5J6m4LM1J4m8k9O2K9k7o6
$$ -18 49 23 -71 -39 26 19 -43 -56 -7 19 -29 -52 -11 15 -19 -27 -14 1 -6 -29 -4 12 -32 -29 12 26 -22 -51 11 40 13 -53
2555e3M9O5l0o7rQ8J0o9l3R5L8p0p5M8Q9l8r2J2Q4J1q4k7N4N8n1o4L2N2j8m7q
$$ -53 -4 61 31 -36 -45 43 53 -16 -49 46 84 14 -61 -13 76 38 -54 -42 42 53 -31 -58 -4 54 3 -61 -29 23 5 -42 -50
2586e0M8J2l1j5OJ0oqNlLL1j7k0kL9Lj4l1J9N4om7j8O1J8n7l9M2N9j6p2KQ8K7
$$ -50 -2 10 -21 -36 -30 -20 -26 -34 -29 -32 -29 2 -15 -35 -37 2 5 -9 -40 -21 33 27 -20 -38 23 41 -16 -55 -13 46 30 -42 -40 48 75
2621G5q5l3O6M8n7n6RO6J2o7j7N1K9l8n6K5O2k0l8j1M5J1l0k6OK7jl3RJ4Krj2
$$ 75 -10 -43 23 71 14 -42 -33 33 45 -22 -39 12 41 3 -53 -28 34 14 -24 -35 10 21 -9 -35 -29 -2 -3 -36 -27 -13 -11 -20 -32
2654c2J2jNJ1j1qjL3J3m6j1N7J8n4l9N6M2lq9J5Q7K0q8m3P5O8p5p1M5Q3j8r4N
$$ -32 -20 -21 -16 -5 -16 -24 -25 8 21 -25 -36 21 39 -15 -54 2 44 41 -48 -33 54 74 -14 -57 18 86 11 -60 -15 68 50 -44 -39
2687c9R1J5j11l1R1L2n4n2M4O0m3m5J7M7k2l5J8K5j0l2RL1k2k7K2M3m2m2M2L9
$$ -39 52 67 -44 -75 16 48 -6 -58 -14 46 3 -42 -25 22 0 -35 -17 8 -2 -34 -25 6 -16 -43 -21 22 -20 -62 -20 19
2717A9k1o4L9N9mp5oP9L2q0n3P8O2o2p0M5Q8j5j01J1R7Kq9j4P0M0n6o1M9M7k4
$$ 19 -2 -66 -27 32 28 -47 -53 26 58 -22 -75 3 65 3 -67 -22 66 51 -50 -39 58 60 -29 -43 27 67 11 -50 -1 46 22
2748B2n5J9L9Jm4PJ6nj9J0Pl1J6J0J2l7OL2J8l9l4M5L1k8n2RO2On6j3N4K8n1l1
$$ 22 -33 -14 25 26 -18 -11 5 0 -19 -9 -2 -33 -17 -7 5 -32 -26 6 24 -15 -49 -4 27 -1 -53 -44 18 24 -32 -45 9 37 -14 -45
2782d5L7L5Qo7oN2K0k9n1K6N3No0rM8L6m0m2J0N1K7o7l2N2L9m3n9J6O0Qo8k8N9
$$ -45 -8 27 35 -32 -38 14 34 5 -46 -20 33 38 -22 -31 17 53 13 -29 -19 32 59 -8 -40 12 51 8 -51 -35 25 33 -35 -63 -4
2815dL8n3l4L2M8j6m8kK9J9j9j9KJ7Rjk5pK6L3j6n0J0N9K5p2l6P4M5n2p3L4Q8
$$ -4 34 -19 -53 -21 27 11 -37 -39 -10 9 -10 -29 -27 -10 -1 -2 -27 -34 -8 25 9 -41 -31 28 53 -19 -55 19 64 12 -61 -27 61
2848F1l6q5j0J16L0j01m7P4O9m8r1M1P5Qq7j5P1L2n4m6K8K3J2l3j4MK5Rj1j7n
$$ 61 25 -60 -70 46 76 -25 -72 2 71 23 -68 -27 48 56 -31 -46 25 57 3 -43 -15 8 20 -13 -27 -23 2 11 0 -17 -22
2879b2K9J0m3j9L3M5l1o4L2O9%q9j8P9M6o0p1M0R6j8q8j2R2K2o9l4K6P2k5q3Q
$$ -22 7 17 -26 -45 -12 33 2 -62 -30 39 39 -50 -68 11 57 -3 -74 -34 62 44 -44 -56 36 58 -11 -45 -19 53 28 -55 -47
2910d7N9K7m8l6J8L6K1m3k6K3N8k1m9j5N6K9m6n2K6O7nq3qP6L9n8n0K7O0mo6%
$$ -47 12 39 -9 -45 -27 9 30 -13 -39 -16 42 21 -28 -43 13 42 -4 -56 -30 37 32 -51 -59 17 56 -2 -52 -25 35 31 -35 -35
2942c5M4K5l6l6J9L9Kl9l5L1M7j4m0k1N1L6l1n4PO2K7n9n2O8M8l3q2J6R0Or3l0
$$ -35 9 34 -2 -38 -19 20 22 -17 -52 -21 26 12 -28 -49 2 38 7 -47 -40 22 49 -10 -62 6 54 21 -61 -45 45 51 -42 -72
2974g2Q2N9o2p4M4P7k0p2j5P4K1n5m1L9L3jl0j0J7PQk5j0K3K9J1n4j6M2L7l3o6
$$ -72 10 69 7 -67 -23 54 34 -38 -53 21 42 -13 -54 -15 18 17 -13 -23 -6 1 9 -16 -26 -3 26 37 -17 -33 9 46 13 -53
3006e3K0Q7j9q4pP0M0o7o6O0O1l2p9J5R1Lp1l8O8N0m7m4K0M2nn1KL7Rj2j1PJ3
$$ -53 -33 54 35 -49 -56 14 54 -13 -79 -19 42 10 -69 -54 37 40 -31 -69 -1 49 2 -42 -22 20 15 -36 -34 3 12 0 -11 -4 9
3039InNj4j2J5K7j1l6j1N3Om5k9L5N2k0n5OP3Jp1k4O4M4o2l6M4M9k9m8nN9%n4
$$ 9 4 9 -5 -17 -2 25 14 -22 -33 20 26 -19 -48 -13 39 19 -36 -30 43 44 -27 -51 13 57 -5 -41 3 52 23 -25 -30 29 29 -25
3073b5JL4J5l4oQJ3pMj7LlRKrk8J1L8j8k7OM8qn3rN0L3m5m0N1M6k6n5J7N7ro2
$$ -25 -24 10 25 -9 -15 -7 6 -1 3 -14 -11 -14 -5 -3 -12 -40 -29 9 -9 -36 -30 18 10 -43 -52 -2 31 -14 -54 -3 43 17 -38 -21 36 27 -35
3110c5J2N3Nm9k1M2L9m3l1K5L0k5l0K6J9Jn0L0K2j5j4lL0j2l9L3K7j9l3J8M0k1
$$ -35 -23 30 35 -14 -35 7 46 3 -28 -3 27 2 -28 -2 17 18 -32 -2 20 5 -9 -12 18 6 -33 0 27 8 -25 -7 33 12
3142A2m9J1M1On9mM6K4n6l7N8N0m2n9M5M3k1n0J7O7j3n2PL9K0o4j5O6Pm2j7M1
$$ 12 -37 -26 15 21 -38 -42 4 28 -28 -65 -7 43 1 -58 -13 30 9 -41 -24 43 30 -22 -15 24 44 -20 -35 31 38 -4 -21 20
3174B0J8l0l3L8J8l3pRL7l3k4J2L5j6m1J7L7k5l2J3L5jm3%M6Kn2qM2K8m6l9L3
$$ 20 38 8 -25 13 31 -2 -9 0 37 4 -20 -8 27 11 -30 -13 24 -1 -33 -20 15 14 -29 -29 17 19 -33 -41 1 29 -17 -56 -23
3207b3N7l7m8J8N4j7m9RM5J6m8j9M1K5k1l2K7MRl2J4K3LrnQpRkqOjRjk4QQMj3
$$ -23 34 -3 -51 -33 21 4 -45 -36 9 25 -23 -42 -1 24 3 -29 -2 2 11 -21 -7 16 19 10 5 13 6 15 13 5 11 10 19 18 -6 2 10 14 1
3246Ak4K3J3j3qj5J7Qok3RK5Jl1nRK8j6k0J3K6j4l4j0M3Kj1m0L3K5J0n2J3M3m
$$ 1 -23 0 13 0 -8 -23 -6 2 -4 -27 -18 7 8 -23 -28 -19 9 -7 -27 -14 12 -2 -36 -46 -3 -1 -12 -52 -19 6 16 -36 -23 20 16
3281A6l1j5L9J7j6m5J7L9pk4pK6J9l1MmL2j0j6j2J9mPj1%lj9J3Nj5jPQj8rJ4J3
$$ 16 -15 -30 9 26 10 -35 -18 21 14 -10 -17 9 28 -3 1 -3 29 19 3 -9 10 6 13 2 2 -1 -20 -7 -2 -17 -18 -11 -3 -21 -30 -16 -3
3318cj6k4J5L7j2l6jM4J3o2JL4K8k9m0J9N4jn6QM5Kl0k5L5K6j9j1kK9pk1KJ8o
$$ -3 -19 -43 -28 9 -3 -39 -40 4 17 -45 -44 -10 18 -11 -51 -32 22 21 -35 -27 18 20 -10 -35 0 26 7 -4 -6 23 16 -5 -3 15 9
3353IqONoJj0J0j0J0Qj1jkqJ7ml8LL1Mk8j5K7K1k1l0J6L4k1l8MM6Ok6k3K3J3p
$$ 9 1 7 12 6 7 -3 7 -3 7 15 4 3 1 -7 10 6 -32 -29 2 6 -22 -37 -10 11 -10 -40 -24 10 -11 -49 -45 1 7 -19 -42 -19 -6 -13
3391a3k0PL2Kj7k1L4K7l2k0J9J9qj1mQRroJ0oK0j2ooJ0J3j6mj7L5rj9qJ4J0j7
$$ -13 -33 -26 6 8 -9 -30 4 31 -1 -21 -2 17 9 -2 -6 2 11 2 -4 6 0 20 8 2 -4 6 19 3 -1 -18 17 8 -11 -19 -5 5 -12
3428a2j8J3K9rl4nM4kl0j1L4J3k2k1J4J9mk0nK2J0k3j3PK9rj0QoQMjJj2K4Mj1
$$ -12 -30 -17 12 3 -31 -36 8 6 -24 -35 -1 12 -10 -31 -17 2 -2 -22 -27 -5 5 -18 -31 -24 5 -4 -14 -6 -12 -4 0 -1 0 -12 12 16 5
3465Ek4L2J9k9k4K9L0pl0oM7j5k8k8M5J5l0l2K9K3k7l4K1J5Jj5nK5nj1j0K2j5
$$ 5 -19 13 32 3 -21 8 38 31 1 -5 42 27 -1 -29 16 31 1 -31 -2 21 -6 -40 -19 -4 -3 -18 -23 2 -3 -14 -24 -2 -17
3498a7LRKk2PMK1pl2J9K2ol8MM3Km4j0N9J5l7m0M0M8l5n8L8M7jn2oM9J1n1j3L1
$$ -17 -14 -5 -3 -25 -18 -14 7 0 -32 -13 9 3 -35 -31 12 14 -30 -40 19 34 -3 -43 -3 45 10 -48 -10 37 36 -16 -22 27 38 -13 -26 5
3534EL3k2k2ML1j4j0j4PJ7k4KJ6k3MRLk7OK3Nk7k8K4L5l0k1J1N2on3JM4J5l8l2
$$ 5 38 16 -6 -2 29 15 5 -9 -2 15 -9 -7 9 -14 -10 -1 2 -25 -19 4 9 -18 -46 -22 13 -17 -38 -27 25 19 -34 -33 11 26 -12 -44
3570d4K5N2l3m7L1L5Pl8k1L9K0m1j0K5%J0l2lJ5K3rpnLJ2Nk0%OK5k0k0lL9j0k6
$$ -44 -19 33 0 -47 -16 19 26 -12 -33 6 26 -15 -25 0 0 10 -22 -25 -10 13 4 -3 -8 -5 7 12 -8 -8 -2 23 3 -17 -20 19 9 -17
3606a7oK8J2j7l1J5L7j2l9rM7J7l5k2J3K0kl3QL1Kj0k4J9RmmpNJ2J4k7oJ9J5j4
$$ -17 -23 5 17 0 -31 -16 21 9 -30 -39 8 25 -10 -32 -19 1 -1 -34 -26 5 7 -3 -27 -8 1 -3 -7 -14 -9 3 17 -10 -16 3 18 4
3642Dj9mL3Ll7oK7J5rl6J1M0ml3j2K2L1j7l1L4J9jl6j5K2J8k0j8J0K3Rl8rJ3J9
$$ 4 -15 -19 14 17 -20 -26 1 16 7 -29 -18 22 18 -15 -27 -5 26 9 -22 12 31 30 -6 -21 1 19 -1 -19 -9 14 23 -15 -24 -11 8
3677Hj1j4j3J9Q%k5PJ8Lj8rJ4J5kj7JK2J9k2l0K0L4j5k5j0L4jj6k2J0L5pl3kK7
$$ 8 -3 -17 -30 -11 -3 -3 -28 -21 -3 0 -18 -27 -13 2 0 -17 -16 6 25 3 -27 -7 27 12 -13 -23 11 10 -6 -28 -18 17 10 -23 -25 2
3713BJ4l3j3J5K3k1lnK5Qj9j1mK4%kk3J5K1j3roJ5J7j4k2J2NJ5k4qRJ8j7j0k1
$$ 2 16 -17 -30 -15 8 -13 -16 -21 4 12 -7 -18 -22 2 2 0 -23 -8 13 0 -9 -15 0 17 3 -19 -7 -2 13 -11 -19 -10 8 -9 -19 -40
3749d0M9j6j6kRK9j3k1mK4Kj3nK1Jpkj1J5Qj1j7J3J4Kj0j2K1J3rk9QJ7Lj4j2J1
$$ -40 9 -7 -23 -25 -16 13 0 -21 -25 -1 1 -12 -17 4 5 -2 -4 -15 0 8 -3 -20 -7 7 9 -1 -13 8 21 12 -17 -9 8 11 -3 -15 -4
3786dQmk4J3OOmoJ4%%nKj0J0Rk5J3mJ1pj5NJ6j3j6M%J3j1j1K0J1qmj0K4Pk3j0
$$ -4 4 0 -24 -11 -5 1 -3 -9 5 5 5 0 2 -8 2 11 -14 -1 -5 6 -1 -16 -11 5 -8 -24 -20 -20 -7 -18 -29 -9 2 -6 -10 -20 4 11 -12 -22
3826b2J3J7j8j3J2K8j6j0PJ3jj2J3kLj2jQpoNMonQO%oj6K4Jj5mOMKnLQk5lLJ9
$$ -22 -9 8 -10 -23 -11 17 1 -9 -2 11 10 -2 11 9 12 0 -1 7 0 -6 -1 3 -3 -8 0 6 6 0 -16 8 9 -6 -10 -4 0 2 -3 0 8 -17 -20 -17 2
3869BKl2PJ9Mk4J3MJ0j6k3L0lmJo%MJPJ0lj4J0J1pj1PQnLKj1%J7mLmPmoKnlKp
$$ 2 4 -28 -21 -2 2 -22 -9 -5 5 -11 -34 -4 -7 -11 -10 -16 -16 -12 -11 -4 6 3 -11 -1 10 3 -8 -1 7 2 5 7 -4 -4 13 9 12 8 15 11 5 7 2 -1 1 -6
3915fOrJ4kj5QRmmjpnOkonRJ1Ljj7K4%j5j0J8lppJ0J8k3jMK4nj9PRLj7mK6Rk1
$$ -6 0 -9 5 3 -12 -4 5 1 -3 -4 -11 -16 -10 -12 -18 -23 -14 -3 0 -1 -18 6 6 -9 -19 -1 -4 -11 -18 -8 10 -13 -14 -10 14 9 -10 -3 6 9 -8 -12 14 23 2
3960Bj2RK9j2k3RJ9k0pJ7Rnj8rL4ol4KK3joj8ORppJJ0j6k%K1j2j9QK8oj8J5ML
$$ 2 -10 -1 28 16 -7 2 21 1 -6 11 20 15 -3 -12 22 16 -18 -16 7 6 0 -18 -12 -3 -10 -17 -16 -6 -22 -24 -24 -3 -15 -34 -26 2 -4 -22 -7 -3 0
4001@k0jJ5J3rk2J2L7k9lLMJ0k6J1jK3pj1PJ8j7%mJ1J5l0KQJ2k4Rj2J3LmqJ3J
$$ 0 -20 -21 -6 7 -2 -24 -12 25 -4 -7 -4 0 10 -16 -5 -6 17 10 -1 6 24 7 7 3 14 29 -1 1 9 21 -3 6 -6 7 10 6 -2 11 12
4040A2j3pJ2ok0K0Jj1JpJ7rk2J6NQk1jK9Oj5j7J3K4ml0RJ8J1k5JJ1K5k3k2J1K7
$$ 12 -1 -8 4 -2 -22 -2 -1 -12 -11 -18 -1 -10 -32 -16 -11 -3 -24 -25 4 10 -5 -22 -9 15 11 -19 -10 8 19 -6 -5 6 31 8 -14 -3 24
4077B4ml4PL1jk5jJ7Rql0J5J9jk5J2J0pj8PJ7j2j4MJ4Kk6j0J6J2j5k4K4Lj5j9
$$ 24 20 -14 -7 24 23 -2 -3 14 23 15 -15 0 19 18 -7 5 15 8 -10 -3 14 2 -12 -8 6 8 -18 -28 -12 0 -15 -39 -15 -12 -27 -46
4113d6K5K4l1qRK1Kl6J9J6Jk5oL2J6k2qQK9k3k1J5L9k3j1rK5J6k4j3K6J5l9%J2
$$ -46 -21 3 -28 -36 -27 -6 -4 -40 -21 -5 -4 -29 -35 -3 13 -9 -17 -9 20 -3 -24 -9 30 7 -4 -13 12 28 4 -9 17 32 -7 -7 5
4148EJ7k7pPPNj8Q%Mk0J0K0lqj1Rnlj0J2Lk4QJ2J2k0j7L5Koj5mJ9Rk1kK3Lk6j4
$$ 5 22 -5 -12 -5 2 7 -11 -3 -3 1 -19 -9 11 8 0 -11 -2 -7 -10 -20 -8 -5 -29 -21 -9 3 -17 -34 1 3 -3 -18 -22 -3 6 -15 -17 6 9 -17 -31
4189c1L4Qpj8J0K9pk9K3LMj9JQOppJ4%j3mmOjjLOpLqRnj0k%qoJ6LLk2J6OOlrN
$$ -31 3 11 4 -14 -4 25 18 -11 12 15 19 0 1 9 15 8 1 15 15 2 -2 -6 0 -1 -2 1 7 0 3 -5 4 -1 -11 -13 -13 -21 -27 -11 -8 -5 -27 -11 -5 1 -2 -11 -6
4236fJ4j3mJpJ3j2rK9jk6KJ5J1j1oMKK3j6qJ6J1ro%MJ9pk6QK0j7j0%J4Qj7mLK
$$ -6 8 -5 -9 -8 -15 -2 -14 -23 6 5 -21 -19 -4 7 -4 -10 -6 -4 19 3 -5 11 22 13 7 7 11 30 23 -3 5 25 8 -2 -2 12 20 3 -1 2 4
4277Dqj0KJ2j%j4J1kpNj1KMJ3j4lPNlj1oJ5J5j0j6J4J4j0k2OK6lj0j7J9MmpKJ9
$$ 4 -4 -14 -12 0 -1 -1 -15 -4 -6 -13 -8 -19 -17 -13 0 -14 -17 -10 -5 -8 -19 -25 -10 5 -5 -21 -7 7 -3 -25 -19 7 4 -6 -23 -4 0 -4 -11 -9 10
4318A0J2k3k5L3Mj3lnJ5Nj7J1jLLjnkNlpj8K6Npj5NJ5nk1qJ1J8j1j7J0K7j4nj0
$$ 10 22 -1 -26 7 11 -2 -5 -10 5 10 -7 4 3 6 9 8 3 1 6 3 -4 -22 4 9 2 -13 -8 7 2 -19 -27 -16 2 -9 -26 -16 11 -3 -8 -18
4358a8K2Rj4%LRmj8J2J4Kj3j2KROMj4J0%krjJ0kRk4LJ4jmOqJ4mj1mJ0J3j5j2J3
$$ -18 4 13 -1 -1 2 11 7 -11 1 15 17 4 -8 -6 3 9 13 -1 9 9 7 -2 -3 7 5 14 -10 -7 7 6 2 8 0 14 10 -1 -5 5 18 3 -9 4
4400DJ0j1j6qK0Mj1Jj3K3pl7K0K1Oj8kPMLj7QpJ9j9j0J6jJ6j7lRJ1kojJ8%kk3
$$ 4 14 3 -13 -21 -1 3 -8 -7 -20 3 -4 -41 -21 0 6 -12 -14 -7 -3 0 -17 -9 -16 3 -16 -26 -10 -11 5 -12 -15 -6 5 3 -3 -4 14 14 12 -11
4440a1J2M%pKpJ1%r%J1mNj5LJ1N%k8K5MKk3kJ6Rk5j4K4LKk5MK5k1j1PJ6J1k6m
$$ -11 1 5 5 -2 0 -7 4 4 -5 -5 6 2 7 -8 -5 6 11 11 -17 8 12 14 -9 -11 5 14 -11 -25 -1 2 4 -21 -17 8 -13 -24 -17 -1 10 -16 -20
4481b0J0JmpPJkNpKJ2pJ0qJPNOk3%J4Lr%pL3j3j9jJ4J1j6j4K3Kj5j1J7K1j9k6
$$ -20 -10 -9 -13 -20 -13 -12 -14 -9 -16 -14 -2 -9 1 -7 -6 1 6 12 -11 -11 3 6 -3 -3 -10 23 10 -9 -10 4 15 -1 -15 8 10 -5 -16 1 22 3 -23
4522b3KL2j0j2qJ9lj9KJ1J3mnoNjJ2j5oKLqOlj1K7rmj5J3J3pnjJ3Lj9J2MJ5j7
$$ -23 -21 11 1 -11 -19 0 -3 -22 -20 -9 4 0 -5 -11 -6 -7 5 -10 -16 -14 -11 -19 -13 -16 -27 0 -9 -13 -28 -15 -2 -9 -14 -15 -2 1 -18 -6 -2 13 -4
4563dj7NL1pj6oK0Rj7MlQrjJjQj4NKj1NJkkNNrnNRjl2J2J8nkj1JK3%k9J2Mkoj1
$$ -4 -21 -16 15 8 -8 -14 6 15 -2 2 -1 7 -2 -3 -2 -3 5 -9 -4 -2 -13 -8 -7 -9 -11 -6 -1 -10 -15 -10 -1 -2 -34 -22 -4 -9 -11 -22 -21 2 2 -27 -15 -11 -13 -19 -30
4610c0L0mk1J7MPqJPj1LJ3pj5J4JJ6j2oJ4mJj6kJ8NOk0LPj3%qK6Kl3mOJ8j5jK
$$ -30 0 -4 -25 -8 -4 3 -5 -4 3 -8 -5 8 1 -14 0 1 17 5 -1 13 9 10 -6 -8 10 15 21 1 4 11 -2 -2 -10 16 18 -15 -19 -13 5 -10 -11 -9
4652iNOk3J0J0j0oNJ1rLNKj5MmKkP%Rlj2JQkkJ1oJ5k1nJ2J0Nk2J2OJ5k0JJ2j7
$$ -9 -4 2 -21 -11 -1 -11 -17 -12 -1 -10 -7 -2 0 -15 -11 -15 -13 -15 -8 -8 1 -2 -14 -13 -5 -7 -9 2 -4 11 -10 -15 -3 7 12 -10 2 8 23 3 4 16 -1
4695aOkJ5lJ0k4K%kmORj1Jlj1lJ5j5LMPj5J2j4mOjNjj4J0J9k2pK6oqLkJ1mJ0j0
$$ -1 5 3 18 15 25 1 3 3 1 -3 3 12 1 2 -1 -12 -15 0 -15 -12 -8 -1 -16 -4 -18 -22 -16 -17 -12 -13 -27 -17 2 -20 -27 -1 -7 -15 -12 -14 -3 -7 3 -7
4739g%QnjQMqnKlJ6lMqJ0jLKjqPnoQj9J9rqPMj6J0OmoLjj2PpKOj9Rj2J4Nk2K2
$$ -7 -7 1 -4 -5 3 7 -1 -6 -4 -7 9 6 10 2 12 11 14 16 15 7 14 9 3 11 -8 11 2 -6 1 5 -11 -1 5 1 -5 -2 -3 -15 -8 -15 -13 -7 -26 -17 -29 -15 -10 -32 -10
4788a0qjK%%PLrPM%j0J1kJ2qLRmqoJ1lOpjJ8k8RJ9Jj7lJ0Rj9j6K3Lj5j0J3J3p
$$ -10 -18 -19 -17 -17 -17 -10 -7 -16 -9 -5 -5 -15 -4 -6 6 -2 1 10 6 -2 -8 3 0 6 -1 -2 16 -12 -3 16 17 0 -3 7 16 -3 -19 4 7 -8 -18 -5 8 1
4832Aj9%J8Jj4kJ1jj5J0nJ0k2OLJ3jk5J3MMlMjJ2k1K0OoKqJ9ok1J2J5Lj5J2kk
$$ 1 -18 -18 0 1 -13 -15 -4 -5 -20 -10 -15 -5 -27 -21 -18 -5 -6 -31 -18 -14 -10 -13 -9 -10 2 -19 1 7 1 3 -5 14 8 -13 -1 14 17 2 14 12 10
4873A0nmJ5lljLLj2qJ0Rj0j8RJ%nkkQmj1Qj%K0j2j5nJ1Npj7QJ9j7kJK0onj0J3
$$ 10 5 1 16 13 10 9 12 15 3 -5 5 14 4 -14 -5 -4 -4 -9 -11 -13 -5 -9 -20 -12 -13 -13 7 -5 -20 -25 -14 -9 -16 -33 -25 -6 -23 -25 -24 -4 -10 -15 -25 -12
4917a2J9j9oJ8Lj1oJ6J5k1J7%lKk2K4j0OlOrm%J2J0k5LKNj7j2J7J5j6j1jK0Nl5
$$ -12 7 -12 -18 0 3 -8 -14 2 17 -4 13 13 10 12 -10 14 4 10 7 13 4 0 0 12 22 -3 0 2 7 -10 -22 -5 10 -6 -17 -18 2 7 -28
4956b8jK7Mrj0MK1k2joJ7mj2kJ1J3j0KLnpKNPkqJ3j7lNLJ7j5KJ8K6m6kJ1J3Jj5
$$ -28 -29 -2 2 -7 -17 -13 8 -14 -15 -21 -4 -8 -20 -22 -11 2 -8 -6 -3 -8 -15 -13 -8 -1 -3 -11 2 -15 -18 -13 -10 7 -8 -6 12 38 -8 -10 1 14 15 0
4998@NRK2l5j9K5jj2rLJ6qj2LJJ4pk7K4nLrpQOkoJ5lKoJ2j8lK0Qj3kJ0Lj1LrJ2
$$ 0 5 14 36 1 -18 7 6 -6 -15 -12 4 -4 -16 -13 -12 2 -5 -32 -8 -13 -10 -19 -26 -18 -12 -14 -20 -5 -8 -6 -12 0 -18 -21 -1 7 -6 -8 2 5 -6 -3 -12 0
5042@J2j0pRRj1knJ7lolJ5Nj2j1J7Rk1J2lMj1lk3L4Mk1pK2j4pMpJ0qMj0J2qRp
$$ 0 12 2 -5 4 13 2 0 -5 12 9 3 0 15 20 8 -3 14 23 2 14 11 15 4 1 -22 12 16 -5 -12 10 -4 -11 -7 -14 -4 -12 -8 -18 -6 -14 -5 -12
5084a2qQrJ5j1J0k2J9Oqr%K3Rk0oK1L%j1%J1pj6OJ1PorPJ1j3K%J4jj3j1kK3j1
$$ -12 -20 -12 -21 -6 -17 -7 -29 -10 -4 -12 -21 -21 2 11 -9 -15 6 9 9 -2 -2 9 2 -14 -8 3 10 4 -5 2 13 0 2 2 16 15 2 -9 -11 12 1
5125AjoQJjjpJjOkj1KklJmRmRk5J1J0oj5J0J4jlj2J8oJ1qj%J2mj0NJ7j8j0J9P
$$ 1 0 -6 2 3 2 1 -6 -5 -6 0 -2 -13 -11 -13 -16 -15 -19 -10 -14 -5 -30 -19 -9 -15 -30 -20 -6 -7 -10 -22 -4 -10 1 -7 -8 -8 4 0 -10 -5 12 -6 -16 3 10
5170A0mkMj4J4LpJOMj3mjpK2j0kj2J4klLJppJ1j1J6Kqj3RRk5QMJMj4JlJ2Lr%R
$$ 10 6 4 8 -6 8 11 4 5 11 15 2 -2 -3 -10 12 2 0 -12 2 0 -3 0 1 -6 -13 -2 -13 3 5 -3 -16 -7 2 -23 -15 -11 -10 -6 -20 -19 -22 -10 -7 -16 -16 -7
5216gJMj1NlNrkRN%LoOMj2K%J0J4j0n%J1j0j6QNjkKmJ4NomlOj5J6k3J9koLKpj1
$$ -7 -6 -2 -13 -8 -11 -6 -15 -17 -8 -3 -3 0 -6 0 4 -8 -6 -6 4 18 8 3 3 14 4 -12 -4 1 0 -2 0 -4 10 15 9 5 2 8 -7 9 -14 5 3 -3 0 2 -5 -16
5264a6mK1J1j7j3QjJ3prJjJ7pMlJNrj2J2lK0j8KjJ4j2nRJ9nj2%MJ6j5pKPjj3m
$$ -16 -20 1 12 -5 -18 -10 -11 2 -5 -14 -13 -14 3 -4 0 -3 -2 3 -6 -18 -6 -9 11 -7 -5 -6 8 -4 -9 0 19 14 2 2 6 22 7 0 2 9 8 -5 -9
5307iK0nj9LRRj3%oK5j5lojjLJ4j9lJ1J0j0j5J7j0LLRKJrk1J1J6pqOJ2%k0PQK
$$ -9 11 6 -13 -10 -1 8 -5 -5 -11 14 -1 -4 -10 -11 -12 -9 5 -14 -17 -6 4 -6 -21 -4 -14 -11 -8 1 3 4 -5 -26 -15 1 -6 -14 -8 4 4 -16 -9 -1 1
5350AnpRNPj6LJ5J0j5NJjjk9K4jNJmmM%NmmkjpQo%Jj7JnJ8j0%pJ3jmkJ4J0k1n
$$ 1 -4 -11 -2 3 10 -6 -3 12 22 7 12 13 12 11 -18 6 5 10 11 7 3 7 7 12 8 4 2 1 -6 2 -4 -4 -3 -20 -19 -24 -6 -16 -16 -23 -10 -11 -15 -17 -3 7 -14 -19
5398a9J2J1j0poK0Kk1J4jj0Rj4J7PNjLrKPj3JNrJ0MmnNNrjJ3%j1%PlPj4rJ5kl
$$ -19 -7 4 -6 -13 -19 1 3 -18 -4 -5 -15 -6 -20 -3 4 9 8 11 2 4 11 -2 -1 4 -5 5 9 5 0 5 10 1 0 13 13 2 2 9 6 13 -1 -10 5 3 0
5443@j6PlJJlpJ0p%MkKLkmPQNkj1J7j2jKjOp%J3ljoPnkJ4J%qpmLJ0LnnMMOnlj1
$$ 0 -16 -9 -12 -11 -10 -13 -20 -10 -17 -17 -13 -15 -13 -10 -12 -16 -9 -1 4 2 -9 8 -4 -5 -3 -4 2 -5 -5 8 5 4 -2 5 0 -2 12 13 13 5 -2 -6 -3 7 10 5 0 4 8 14 9 6 -5
5496enJ5J4pj1j2Njk0K1qlo%PJ1j4KLOlLmlJ3nlmJ4j4JK5j3j1K1j0Q%LRj6jqK0
$$ -5 -10 5 19 12 1 -11 -6 -7 -27 -6 -14 -17 -23 -23 -16 -5 -19 -17 -14 -8 -11 -8 -12 -15 -2 -7 -10 -14 0 -14 -13 12 -1 -12 9 -1 7 7 10 19 3 2 -6 14
5540A4jrj4J8kplJ7MpJKmLj0Pj0J3Jj6J2qrJK0qj6OjKnjK%lmj5K3JnnMMJ0k0J2
$$ 14 13 4 -10 8 6 -1 -4 13 17 10 11 13 9 12 2 9 -1 12 13 -3 9 1 -8 -7 13 5 -11 -5 -6 -4 -9 -10 -8 -8 -11 -15 -30 -7 -6 -11 -16 -12 -8 2 -18 -6
5586fLLkLOk0J6OlPqQJnjMllmNOmnj1QkJ1LoqPk2J0J1j2Nj0J1%j7JpJ0jMJJ6j2
$$ -6 -3 0 -2 1 7 -13 3 9 6 13 5 13 14 9 8 12 9 6 2 7 13 9 4 -7 1 -1 10 13 7 -1 6 -16 -6 5 -7 -2 -12 -1 -1 -18 -17 -24 -14 -15 -11 -10 6 -6
5634fNjkplPrJ6j4%%J4Rk3NQOj1NLJ6poJ4Lj0LoJ0%rnMMjj2J4KppJ2q%Jl%j0r
$$ -6 -1 -2 -4 -11 -14 -7 -16 0 -14 -14 -14 0 9 -14 -9 -1 5 -6 -1 2 18 11 5 19 22 12 15 9 19 19 10 5 9 13 12 0 14 16 9 2 14 6 6 7 4 4 -6 -15
5682a5J7orRJ%j3KjJ0lmJ6jl%jLmqlKJ8j0rRPKnLMjjoJQ%Pj2KnMJ2mj0NLPol%
$$ -15 2 -4 -13 -4 -3 -3 -16 -14 -15 -5 -8 -12 4 3 0 0 -1 2 -2 -10 -13 -11 7 -3 -12 -3 4 6 1 4 8 7 6 0 1 9 9 16 4 6 1 5 17 13 3 8 11 18 12 9 9
5733IOoj8J4MJj2Mjlj2QJrRpOJ1j8MLmlQnNMpj%QjloJ3j3J7mJ0j2oJ0KJj0JMJ3
$$ 9 15 9 -9 5 9 10 -2 2 1 -2 -14 -6 -5 -14 -5 -12 -6 5 -13 -9 -6 -10 -13 -5 -10 -5 -1 -8 -9 -9 -1 -2 -5 -11 2 -11 6 2 12 0 -6 4 6 7 -3 -2 2 15
5781A5j0%jqPPRqpknPj0J7jj0PqlMPkrJJjj3OoOoNoJJ1J1j6jNJkjJRj1J0oJ6%
$$ 15 5 5 4 -4 3 10 19 11 4 2 -3 4 -6 11 10 0 7 -1 -4 0 7 5 -4 -3 -2 -3 -16 -10 -16 -10 -16 -11 -17 -16 -5 6 -10 -11 -6 -5 -7 -8 -7 2 -9 1 -5 11 11
5830A1lKKpkRj0MMJ5j9PrN%mJmONqjNOj9J0kjjlJ1lkj0lJ3j0%k%OrLPj4RrJ1k
$$ 11 8 10 12 5 3 12 2 6 10 25 6 13 4 9 9 5 6 2 8 13 5 4 9 15 -4 6 4 3 2 -1 10 7 5 -5 -8 5 -5 -5 -7 -7 -1 -10 -7 0 -14 -5 -14 -3 -5
5879epjoLOMkPj8J5NLLjnQJLjpQlpKJ7j8kKnOmmjLJ2k1J4nNrJ3j0%jj1J1Np%L
$$ -5 -12 -13 -19 -16 -10 -6 -8 -1 -19 -4 1 4 7 6 1 9 10 13 12 5 13 10 3 5 22 4 2 4 -1 5 1 -3 -4 -1 11 -10 4 -1 4 -5 8 -2 -2 -3 -14 -3 2 -5 -5 -2
5929bkoNqJ1Pj6J3j0KKjLj4PkJ7oj7MMLJj0K5qJ2lmJ0Jj6j0J1J1j0JlKNlNmNq
$$ -2 -4 -10 -5 -13 -2 5 -11 2 -8 -6 -4 -5 -2 -16 -9 -11 6 0 -17 -13 -9 -6 -5 -15 10 2 14 11 7 17 18 2 -8 3 14 4 5 2 4 9 6 11 7 12 4
5974DkjLmlKQmj6OnRrPloJ3olQoQKpoJ0j6NkNQmoj4J1RjrLJ9j6RLnrJ2j0%LPo
$$ 4 2 1 4 0 -3 -1 7 3 -13 -7 -12 -3 -12 -5 -8 -14 -1 -7 -10 -2 -8 0 2 -5 -11 -1 -17 -12 -14 -9 -1 -5 -11 -25 -14 -5 -6 -15 -12 7 -9 0 3 -2 -11 1 -9 -9 -6 1 -5
6025eJ1jJklK3j1%J7k2mOj9J2pNqK0k3J9pNj0Jj2j2K3rnPOJj3MQkjj7J5pNnQJ2
$$ -5 6 5 6 4 1 24 13 13 30 8 4 10 -9 3 -4 1 -7 13 -10 9 2 7 -3 -2 -14 -26 -3 -12 -17 -10 -4 -3 -16 -12 -4 -6 -7 -24 -9 -16 -11 -16 -8 4
6069DPj7pJ1JpKMKJj0PKnpQJ1KmnQnL%J0lrjRlj5J0jKoOj3kJrPJ0jj3JQmj4J0
$$ 4 11 -6 -13 -2 -1 -8 -6 -2 0 1 -9 -2 0 -5 -12 -4 7 9 5 0 8 3 6 6 16 13 4 3 12 9 -6 4 3 5 -1 5 -8 -10 -9 -18 -11 -1 -2 -15 -14 -6 -10 -24 -14
6118a4KKlmJ1Nj1qKMOlmOJ9j4nrJ6oj1J9Qj1JjJoKJ0LlLpJ8rnQmNj1KROj3jnq
$$ -14 -12 -10 -13 -17 -6 -1 -12 -20 -18 -14 -8 -11 -15 -9 10 -4 -9 -18 -2 -8 -19 0 8 -3 -2 -3 -2 -8 -6 4 7 4 7 0 18 9 4 12 8 13 2 4 13 19 6 5 0 -8
6166hOLnkONk0J1llKnoOPrmPNj0lNnP%L%J2j2RonQkKOoRj3J7k0J0%QllLJj1J2
$$ -8 -2 1 -4 -6 0 5 -15 -4 -7 -10 -8 -13 -19 -13 -6 -15 -19 -12 -7 -17 -20 -15 -20 -13 -13 -10 -10 2 -10 -1 -7 -12 -4 -6 -4 2 -4 5 -8 9 -11 -1 -1 7 4 1 4 5 -6 6
6216Fl%nMm%RrlJ0j8RKJnmjKJ5j6lOkpq%J5j3kLJ3j0JKOQmqPjJ1Kkj2nJ6j2Pp
$$ 6 3 3 -2 2 -2 -2 7 -2 -5 5 -13 -4 -2 -1 -6 -10 -11 -9 6 -10 -13 -7 -9 -16 -24 -24 -9 -22 -24 -21 -8 -18 -17 -15 -9 -1 -5 -13 -6 -7 4 6 4 -8 -13 3 -9 -2 -9
6265iJ2OqPjqJ6j5R%NPj4qRNoj6KRmmRQj5Oj4J3Pj6Rm%pmPlrJJ9j6lKJ4oj1Qj4
$$ -9 3 9 1 8 7 -1 15 0 9 9 14 21 7 -1 8 13 7 -9 -7 2 -2 -6 3 11 -4 2 -12 1 8 -8 1 -3 -3 -10 -14 -7 -10 -19 -18 1 -15 -18 -16 -2 -8 -19 -11 -25
6313b5J0%POlLk7L0MNrrJ6rJ6mJNnmQPk7J3Jn%%lPj6J4j2J5j7POj4J5j3lPl%p
$$ -25 -15 -15 -8 -2 -5 -2 -29 1 5 10 1 -8 8 -1 15 11 12 17 12 8 16 23 -4 9 10 5 5 5 2 9 -7 7 -5 10 -7 0 6 -8 7 -6 -9 -2 -5 -5 -12
6358a2QkmnmJ5ljpJ2Jj4J0%loqK3mJkoJLJMkJ5nQj1QrNJKQooJ1%j5LPLpj%oj1
$$ -12 -4 -6 -10 -15 -19 -4 -7 -8 -15 -3 -2 -16 -6 -6 -9 -15 -23 0 -4 -3 -5 -11 -10 -7 -6 -2 -4 11 6 14 3 11 2 7 8 10 18 12 6 17 17 2 5 12 15 8 7 7 1 -10
6408a0J4Jj4QmJnj2J0Nj5NJ8j4LQj1Olj1NKOKKRrkkLProQjJ4%lKjmRqJ3rQnLN
$$ -10 4 5 -9 -1 -5 -4 -9 -21 -11 -6 -21 -16 2 -12 -9 -1 -12 -6 -9 -20 -15 -13 -7 -5 -3 6 -3 -5 -7 -4 3 -6 -12 -4 -5 9 9 6 8 7 3 12 4 17 8 16 11 14 19
6457A9MJj5M%%j0NqPnqJ4j0%Onnjj2K2j1p%KjMj2J2KpKmK0rJrJ6k1LQ%QqLjJ4
$$ 19 23 24 9 13 13 13 3 8 0 7 2 -6 8 -2 -2 4 -1 -6 -7 -19 3 -8 -15 -15 -13 -14 -10 -22 -10 -8 -15 -13 -17 3 -6 -5 -14 2 -19 -16 -8 -8 0 -8 -5 -6 8
6504Hk0J7klQjklJ0Oj5RLj3rRRmKnMLmpLqJOPj0j2PPmoLj0Oll%J3%pkmMm%J2K
$$ 8 -12 5 3 0 8 7 5 2 12 18 3 12 15 2 -7 2 11 7 9 4 8 11 7 0 3 -5 -4 2 9 -1 -13 -6 1 -3 -9 -6 -16 -10 -13 -16 -16 -3 -3 -10 -12 -16 -12 -16 -16 -4 -2
6555bj8J2NOJj2%L1k2j4J2nJ3j2LjJ5j0%N%kJ1Qj2k%Kj3pJ1kjJj3J2nK3j3oPk
$$ -2 -20 -8 -3 3 4 -8 -8 23 1 -13 -1 -6 7 -5 -2 -3 12 2 2 7 7 5 16 24 12 10 10 12 -1 -8 3 1 0 1 -12 0 -5 18 5 -1 6 4
6597Dpl%J3j6qPknlM%JnmK1jnmLjPqOO%qOkJ3pLoPJ8j1nJ1j7mjLKkRj2KJkNOj0
$$ 4 -3 -6 -6 7 -9 -17 -10 -12 -17 -20 -16 -16 -15 -20 -24 -3 -4 -9 -13 -10 -11 -4 -12 -6 0 0 -8 -2 -4 9 2 5 -1 6 24 13 8 19 2 -2 -3 0 2 0 9 -3 -1 0 -2 3 9 -1
6649aJoJ0j4%QMqKoKoMMJJj2LkJ2j7J5j6PMmQrkJ2oJ2%qlpJ7%mJ0J%%MkJppJ8
$$ -1 0 -6 4 -10 -10 -2 2 -6 -4 -10 -8 -14 -10 -6 -5 -4 -16 -13 -15 -3 -20 -5 -21 -14 -10 -14 -6 -15 -17 -5 -11 1 1 -7 -10 -17 0 0 -4 6 7 7 7 11 9 10 3 -4 14
6698A4j4Rj0QJmlk%rOjkNj1J4oNj1PrPJrMJ0j0kJ0oNMjrJ2j1kPMj4KJ1JpjJ1j1
$$ 14 0 9 -1 7 8 4 1 -1 -1 -10 -4 -5 -7 -2 -13 1 -5 0 -11 -4 -13 -6 -5 -14 -10 0 -10 -12 -2 -8 -3 1 0 -9 3 -8 -10 -3 1 -13 -11 0 1 -6 -7 4 -7
6745gJPMnJ1rJJ0pKJ1j9J4JrLrKnkOOKJ0onKj1J3lrJqJ4lj6RkmpJ0qJ4pjRqRn
$$ -7 -6 1 5 0 11 2 3 13 6 8 19 0 14 15 6 9 0 2 -3 -5 1 7 9 19 13 8 10 -1 12 9 0 1 -7 7 4 -12 -3 -5 -9 -16 -6 -14 0 -7 -8 1 -7 2 -3
6794cLk0K0Lj2jNOnj1kJ8Qj4JJ4LqlpPOoPj8J5nOKMpj5J4jRllJ0qplKqK1k0qJ2
$$ -3 0 -20 0 3 -9 -10 -5 1 -4 -15 -17 1 9 -5 -4 10 13 5 2 -5 2 8 2 9 -9 6 1 7 9 13 6 -9 5 4 13 10 7 17 9 2 -1 1 -7 14 -6 -14 -2
6841bOkqj2J8Jj2Oj5kQOmqRNJqOJJ2okOoOJNj1Oj0LJ1rJ4j3J2j0NJj2K0qj3kQ
$$ -2 4 2 -6 -18 0 1 -11 -5 -20 -22 -14 -8 -12 -20 -11 -6 -5 -13 -7 -6 6 0 -2 4 -2 4 5 10 -1 5 -5 -2 9 0 14 1 13 3 8 9 -3 17 9 -4 -6 2
6887B%K%pjRj0Kj0J1LoPoJJj1rMOKmOj2J2pmjMkOjNNknK%QolNJ5Lj8J8jj3kOJ7
$$ 2 2 4 4 -3 -4 5 -5 -3 -13 -2 1 -5 2 -4 -3 -2 -13 -22 -18 -12 -10 -14 -8 -20 -8 -15 -19 -20 -16 -18 -12 -13 -8 -3 -5 -10 -8 -8 0 -6 -9 -4 11 14 -4 14 13 0 -2 4 21
6938B1j9J0j%kmKnMKqMMmpkLNJ6j5m%j3PkJj0LOkkJ1jj5J6joj1MMoJ6j3LjNJL
$$ 21 2 12 11 11 9 5 7 2 6 8 0 4 8 4 -3 -5 -2 3 19 4 0 0 -13 -6 -8 -7 -17 -14 -8 -10 -12 -1 -2 -17 -1 -2 -8 -19 -15 -11 -17 -1 -14 -11 -12 -7 -6 -3
6986cpOlJ6nKKRrpLK0j2p%%J2qNj7MlMJ3j3LjkLjmpOOrnPqjqKMRj1KJMmJ%lrK3
$$ -3 -10 -4 -7 9 4 6 8 17 8 1 4 24 12 5 5 5 17 9 14 -3 1 -2 2 15 2 5 4 2 5 4 0 -7 -1 5 -4 -9 -2 -10 -11 -19 -17 -13 -4 -15 -13 -12 -8 -12 -11 -11 -14 -23 0
7039@jj3LoLlJMJ3jj8K3rNJ2j0J8jj8J5nj3J4rKj4K3Nj7JOj%j0oQmJlKnkoOj2
$$ 0 -1 -14 -11 -17 -14 -17 -16 -12 1 0 -18 5 -4 1 13 3 21 20 2 17 12 -1 13 4 6 -8 15 20 3 4 10 9 9 -1 -7 1 -3 -2 -5 -3 -8 -10 -16 -10 -22
7084b2J4llJ4j5mPlJ2mo%jJLqJLJ0mlnPnLJ1nJ7mj2MKPj2KMJ1j5j3J3J7rlQkk
$$ -22 -8 -11 -14 0 -15 -19 -12 -15 -3 -7 -13 -13 -14 -13 -10 -18 -17 -14 -4 -8 -11 -16 -9 -14 -11 0 -5 12 8 -4 0 2 9 -3 -1 3 14 -1 -14 -1 16 7 4 12 10 8
7130HjlRp%qjlnJ3qMpNKpj0NKMjj6J6nPk2K7lj5PmOMqjJ2rRNnLQk1OJ0NpOLpN
$$ 8 7 4 13 6 6 -2 -3 -6 -11 2 -6 -2 -9 -4 -2 -9 -19 -14 -12 -8 -9 -25 -9 -14 -7 -29 -2 -5 -20 -13 -17 -11 -7 -15 -16 -4 -13 -4 1 -4 -1 7 -14 -8 2 7 0 6 9 2 7
7181Gn%J2OqoLkKllKNj3PplNmNqNkj6J4Lj4qJ4J1j3Lj1Oj5K0j3RJ0Nj9OkPLPN
$$ 7 2 2 14 20 12 6 9 7 9 6 3 5 10 -3 4 -3 -6 -1 -5 0 -8 -3 -5 -21 -7 -4 -18 -26 -12 -1 -14 -11 -22 -16 -31 -11 -24 -15 -5 0 -19 -13 -15 -8 -5 2 7
7228Gj6J2rQpJ3p%KNmJ7%k1%J3j0Mk1K6qoJ6%kqJknJ0j0Nj5lJ3j5J0LmJRoj3%
$$ 7 -9 3 -6 2 -5 8 1 1 3 8 4 21 21 0 0 13 3 7 -14 12 4 -2 14 14 12 4 5 3 -2 8 -2 3 -12 -15 -2 -17 -7 -4 -8 -7 2 -4 -17 -17
7272a7Qj%JJ2l0LPj1J1jJ0lNkkpK7j7NnRPmNmjmLpKJ2j0lkjNMJ0j7J2kj0lQJ%
$$ -17 -9 -10 -10 -9 3 -27 -24 -17 -28 -17 -18 -8 -11 -6 -8 -10 -17 10 -7 -2 -7 2 9 5 10 6 5 1 4 -3 -1 11 1 -2 -4 -5 0 4 14 -3 9 7 -3 -6 2 3 3
7319Cpj4K0ojj1jOKkNKj0lJ0pj2K6j2J1mrPj2nKJ2jMMKpJ2qjQOj1OKKj1NnlJ5
$$ 3 -4 -18 2 -4 -5 -16 -17 -11 -9 -11 -6 -4 -14 -17 -7 -14 -26 0 -12 -1 -5 -14 -7 -19 -24 -22 -10 -11 -7 -3 -1 -8 4 -4 -5 3 9 -2 4 6 8 -3 2 -3 -6 9
7365I%JlkjkoK8l7L2j7j6RKj5NQrLJ0j5jQJ0j7OMJ0Jnjj1JnPQj5%QmNnLpJ1JJ
$$ 9 9 10 7 5 4 2 -4 24 -13 19 2 -14 -5 -3 -18 -13 -5 -14 -11 -1 -16 -17 -9 1 -16 -10 -6 4 5 0 -1 -12 -11 -16 -9 -1 -16 -16 -8 -12 -7 -12 -9 -16 -5 -4 -3
7412cJ2j2j2J6KnJ1olnQQ%kmJ6Kj4kOoMj2Rn%knK1j7qLJj4K1k1J1qK%MKj7J4m
$$ -3 9 -3 -15 1 3 -2 9 3 0 -5 3 11 11 9 5 21 23 9 7 13 7 11 -1 8 3 3 1 -4 17 0 -8 -5 -4 -18 3 -18 -7 -15 -13 -13 -9 -7 -24 -10 -14
7457a4o%J1mNj5J2kLRo%kRkKj4J1Pj3J4lNj3J1j4J9kpNmMjLKkLl%j1P%omJ1Ok0
$$ -14 -20 -20 -9 -13 -8 -23 -11 -13 -10 -1 -7 -7 -9 0 -2 0 -14 -3 4 -9 5 2 7 -6 5 -9 10 8 1 6 2 6 5 8 10 8 11 8 8 -3 4 4 -2 -6 5 11 -9
7504iKlJkjrJ3PplKloPmNPj3NmJ7j3Qj1J0J2nLj4MJ3j5QkoK%JJkMJ0jLmMj0J4
$$ -9 -7 -10 -9 -11 -12 -21 -8 -1 -8 -11 -9 -12 -18 -11 -15 -10 -3 -16 -11 -15 2 -11 -3 -14 -4 8 3 6 -8 -4 9 -6 2 0 -6 -4 -4 -3 -2 -4 0 10 9 12 8 12 2 16
7552A6nJ0j1MlMnjQj3Mq%J2%jlkqrK2j7oOj1Rj0Nj3NJ2kJ0j1K3j9MPlKLkkMj8
$$ 16 11 21 10 14 11 15 10 9 17 4 8 0 0 12 12 11 8 6 -2 -11 11 -6 -12 -6 -17 -8 -18 -13 -26 -21 -9 -11 -1 -12 11 -8 -4 3 0 2 5 3 1 5 -13
7597a3J4lr%J3LnJ1ojJ4j3%MPLlj6J7j1rOjLlNplPNrOj2NmlMjj0Pj5J2KKp%oJ5
$$ -13 1 -2 -11 -11 2 5 0 11 5 4 18 5 5 9 16 19 16 0 17 6 -3 3 2 5 2 7 0 -3 4 9 0 6 -6 -1 -5 -8 -4 -5 -15 -8 -23 -11 -9 -7 -14 -14 -20 -5
7645ek2OJ6jl%jmK4j2oLONoJJRnJNmklmJ6J1j2j1RJnnMkmj4J4LMj3NPj2kNmJ3
$$ -5 -27 -21 -5 -6 -9 -9 -10 -14 10 -2 -8 -5 1 6 0 1 2 11 6 7 12 8 6 3 -1 15 26 14 3 12 13 8 3 7 5 1 -13 1 4 8 -5 0 7 -5 -7 -2 -6 7
7693Gj5J5j6OqRj4J4jrOojPoRnnJ0jkkj0J1J0j3RjNj0J7pJ5rrPJ9prjjJ0kj1j0
$$ 7 -8 7 -9 -3 -11 -2 -16 -2 -3 -12 -6 -12 -13 -6 -12 -3 -8 -13 -3 -4 -6 -8 -18 -7 3 -10 -1 -2 3 -7 10 3 18 9 0 7 26 19 10 9 8 18 16 5 -5
7738ePklQJnjj1J6j6J1%krJ0Lj1Olop%Nj0KKJ0PkNjqk%J1j4OKQoo%J0j3K1ojJ2
$$ -5 2 0 -3 5 6 1 0 -11 5 -11 0 0 -2 -11 -1 2 -9 -3 -6 -12 -19 -19 -14 -24 -22 -20 -10 -3 -5 0 -1 -9 -11 -11 0 -14 -8 -6 2 -4 -10 -10 0 -13 8 2 1 13
7786A3rQj1jJ9mlJ3j6LpmRmKomkJ1j6jJ3j7J3pnKJJ1j5QlmqJ1mlMjQoRJoOj5N
$$ 13 4 12 1 0 19 15 12 25 9 12 5 1 10 6 8 2 -2 -4 7 -9 -10 3 -14 -1 -8 -13 -11 -10 1 -14 -6 -9 -13 -21 -10 -14 -17 -13 -14 -6 -12 -3 -2 -8 -2 -17 -12
7833a2JMoJ0qJPn%J2mKOlkONnPklMOj3klJ0j0KKKJnJ0j3pMmJMn%mkj2MqPPLnj2
$$ -12 -11 -7 -13 -3 -11 -10 -3 -8 -8 4 0 2 8 5 3 9 14 9 16 14 11 15 21 8 6 3 13 3 5 7 9 10 5 15 2 -5 -1 -5 -4 0 -5 -5 -9 -11 -23 -19 -27 -20 -13 -10 -15 -27
7885b7jJ3Qj5j1K2MQj6KJ0j0KJ8rLKj0LLJ3j5J%LJJ0j1J1lL%onPkrJ6j4QqOOn
$$ -27 -28 -15 -7 -22 -33 -11 -7 1 -15 -13 -3 -13 -11 7 -2 1 3 -7 -4 -1 12 -3 -2 -2 1 2 12 1 12 9 12 12 6 1 8 6 -3 13 -1 7 -1 5 11 6
7929FLKprk%pqJ9MroJ5j8QnrK3j9QJ0j1JJ2kOLqMlrOLoJ5mQrQpMNj6KKMKLlrJ6
$$ 6 9 11 4 -5 -7 -7 -14 -22 -3 1 -8 -14 1 -17 -9 -14 -23 0 -19 -11 -1 -12 -11 1 -1 5 8 0 4 1 -8 -2 1 -5 10 6 14 5 13 6 10 15 -1 1 3 7 9 12 9 0 16
7980A6j2PoQmmnN%kmJ2rj6J3NomJNjj9J0pJ0mm%J3klqjJ2j7RJ3rPkJJ1k1K2j2
$$ 16 4 11 5 13 9 5 0 5 5 3 -1 11 2 -14 -1 4 -2 -6 -5 0 -1 -20 -10 -17 -7 -11 -15 -15 -2 -4 -7 -15 -16 -4 -21 -12 1 -8 -1 -3 -2 9 -12 10 -2
8025bJ1j1K0j2KQj3J6j8J2j0M%RplmLLOn%moqLJ2qL%oNnMlqLLJOkj1Nj4J8mMj2
$$ -2 9 -2 18 6 8 16 3 19 1 13 3 7 7 16 9 6 2 5 8 14 9 9 5 -1 -9 -6 6 -2 1 1 -5 0 -5 -1 -4 -12 -9 -6 -5 1 -1 -12 -7 -21 -3 -7 -3 -15
8073a5OqJ5k%JJj4J1pQRj2J4Pj2lJ5rOJ6k1JJnpJ3Oj4nkKMRj3lMrLKkJ1rPqj9
$$ -15 -9 -17 -2 -4 -4 -3 -2 -16 -5 -12 -4 5 -7 7 14 2 -1 14 5 11 27 6 7 8 3 -4 9 15 1 -4 -6 -4 0 9 -4 -7 -3 -12 -9 -7 -9 2 -7 0 -8 -27
8119b7J6J1jj7J5koOJqKKQj4R%MoMj4J4JL%j3J3mJ4JMj2QkO%OoqPnKNj1RqOKj2
$$ -27 -11 0 -1 -18 -3 -5 -11 -5 -4 -12 -10 -8 0 -14 -5 -5 -1 -7 -3 -17 -3 -2 1 1 -12 1 -3 11 12 16 4 12 10 16 16 22 16 8 15 10 12 17 6 15 7 13 15 3
8167CkJ1jmj1RlNj1Pk8K5rjkqJ7j9J4lKJPq
$$ 3 1 12 11 7 -4 5 2 7 -4 3 -25 0 -9 -10 -12 -20 -3 -22 -8 -11 -9 -8 -1 -9
8191i
##END NTUPLES=NMR FID
##END=
