##TITLE=1H_LY-cycloPd250
 CDCl3,8 sc, 
 24.9.2021
##JCAMPDX= 6.0         $$ Bruker NMR JCAMP-DX V2.0
##DATA TYPE= NMR FID
##DATA CLASS= NTUPLES
##ORIGIN= UXNMR, Bruker Analytische Messtechnik GmbH
##OWNER= root
$$ XWIN-NMR		Version 3.5
$$ Fri Sep 24 09:18:15 2021 Russian Standard Time (UT+4h)  she@DPX200
##.OBSERVE FREQUENCY= 200.1314
##.OBSERVE NUCLEUS= ^1H
##.DELAY= (6, 6)
##.ACQUISITION MODE= SIMULTANEOUS
##.ACQUISITION SCHEME= undefined
##.AVERAGES= 8
##.DIGITISER RES= 18
##SPECTROMETER/DATA SYSTEM= spect
##.PULSE SEQUENCE= zg30
##.SOLVENT NAME= CDCl3
##.SHIFT REFERENCE= (INTERNAL, CDCl3, 0, 15.7039)
##AUDIT TRAIL= $$ (NUMBER, WHEN, WHO, WHERE, WHAT)
$$ ##TITLE= Audit trail, XWIN-NMR		Version 3.5
$$ ##JCAMPDX= 5.01
$$ ##ORIGIN= Bruker BioSpin GmbH
$$ ##OWNER= she
$$ F:/spectra/data/she/nmr/H-F/1/audita.txt
$$ ##AUDIT TRAIL=  $$ (NUMBER, WHEN, WHO, WHERE, WHAT)
(   1,<2021-09-24 09:17:08.54 +0400>,<she>,<DPX200>,
      <created by zg, POWCHK disabled, PULCHK disabled
       configuration hash MD5:
       00 E9 B6 7A A2 85 ED C7 34 08 36 98 17 FE 4E 26
       data hash MD5: 16K
       A6 C6 4F D5 42 8E B4 97 8F FC 1B 18 F0 C7 62 B6>)
$$ ##END=
$$ 
$$ hash MD5
$$ 12 D6 03 D0 2B 79 21 41 42 84 8A 18 4A 75 FE A1
##$RELAX= 
##$RELAX= 
##$RELAX= 
##$RELAX= 
##$RELAX= 
##$RELAX= 
$$ Bruker specific parameters
$$ --------------------------
##$DU= <F:/spectra>
##$EXPNO= 1
##$NAME= <H-F>
##$PROCNO= 1
##$TYPE= <nmr>
##$USER= <she>
##$AMP= (0..31)
100 100 100 100 100 100 100 100 100 100 100 100 100 100 100 100 100 100 
100 100 100 100 100 100 100 100 100 100 100 100 100 100 
##$AQSEQ= 0
##$AQ_mod= 1
##$AUNM= <au_zg>
##$AUTOPOS= <>
##$BF1= 200.13
##$BF2= 200.13
##$BF3= 200.13
##$BF4= 200.13
##$BF5= 200.13
##$BF6= 200.13
##$BF7= 200.13
##$BF8= 200.13
##$BYTORDA= 1
##$CFDGTYP= 0
##$CFRGTYP= 5
##$CHEMSTR= <none>
##$CNST= (0..31)
1 1 145 1 1 1 1 1 1 1 1 1 1 1 1 1 1 1 1 1 1 1 1 1 1 1 1 1 1 1 1 1 
##$CPDPRG= <>
##$CPDPRG1= <>
##$CPDPRG2= <>
##$CPDPRG3= <>
##$CPDPRG4= <mlev>
##$CPDPRG5= <mlev>
##$CPDPRG6= <mlev>
##$CPDPRG7= <mlev>
##$CPDPRG8= <mlev>
##$CPDPRGB= <>
##$CPDPRGT= <>
##$D= (0..31)
0 1.2 0 0 0 0 0 0 0 0.06 0 0.03 0 0 0 0 0.0002 0 0 0 0 0 0 0 0 0 0 0 0 
0 0 0 
##$DATE= 1632460627
##$DBL= (0..7)
120 120 120 120 120 120 120 120 
##$DBP= (0..7)
150 150 150 150 150 150 150 150 
##$DBP07= 0
##$DBPNAM0= <>
##$DBPNAM1= <>
##$DBPNAM2= <>
##$DBPNAM3= <>
##$DBPNAM4= <>
##$DBPNAM5= <>
##$DBPNAM6= <>
##$DBPNAM7= <>
##$DBPOAL= (0..7)
0.5 0.5 0.5 0.5 0.5 0.5 0.5 0.5 
##$DBPOFFS= (0..7)
0 0 0 0 0 0 0 0 
##$DE= 6
##$DECBNUC= <off>
##$DECIM= 32
##$DECNUC= <off>
##$DECSTAT= 4
##$DIGMOD= 1
##$DIGTYP= 9
##$DL= (0..7)
0 120 120 120 120 120 120 120 
##$DP= (0..7)
150 150 150 150 150 150 150 150 
##$DP07= 0
##$DPNAME0= <>
##$DPNAME1= <>
##$DPNAME2= <>
##$DPNAME3= <>
##$DPNAME4= <>
##$DPNAME5= <>
##$DPNAME6= <>
##$DPNAME7= <>
##$DPOAL= (0..7)
0.5 0.5 0.5 0.5 0.5 0.5 0.5 0.5 
##$DPOFFS= (0..7)
0 0 0 0 0 0 0 0 
##$DQDMODE= 0
##$DR= 18
##$DS= 0
##$DSLIST= <SSSSSSSSSSSSSSS>
$$ [...]
##$SUBNAM2= <"">
##$SUBNAM3= <"">
##$SUBNAM4= <"">
##$SUBNAM5= <"">
##$SUBNAM6= <"">
##$SUBNAM7= <"">
##$SUBNAM8= <"">
##$SUBNAM9= <"">
##$SW= 20.0188988654967
##$SWIBOX= (0..15)
0 0 2 0 0 0 0 0 0 0 0 0 0 0 0 0 
##$SW_h= 4006.41025641026
##$TD= 16384
##$TD0= 1
##$TE= 0
##$TE2= 300
##$TE3= 300
##$TEG= 300
##$TL= (0..7)
0 120 120 120 120 120 120 120 
##$TP= (0..7)
150 150 150 150 150 150 150 150 
##$TP07= 0
##$TPNAME0= <>
##$TPNAME1= <>
##$TPNAME2= <>
##$TPNAME3= <>
##$TPNAME4= <>
##$TPNAME5= <>
##$TPNAME6= <>
##$TPNAME7= <>
##$TPOAL= (0..7)
0.5 0.5 0.5 0.5 0.5 0.5 0.5 0.5 
##$TPOFFS= (0..7)
0 0 0 0 0 0 0 0 
##$TUNHIN= 0
##$TUNHOUT= 0
##$TUNXOUT= 0
##$USERA1= <user>
##$USERA2= <user>
##$USERA3= <user>
##$USERA4= <user>
##$USERA5= <user>
##$V9= 5
##$VALIST= <valist>
##$VCLIST= <CCCCCCCCCCCCCCC>
##$VD= 0
##$VDLIST= <DDDDDDDDDDDDDDD>
##$VPLIST= <PPPPPPPPPPPPPPP>
##$VTLIST= <TTTTTTTTTTTTTTT>
##$WBST= 1024
##$WBSW= 4
##$XGAIN= (0..3)
0 0 0 0 
##$XL= 0
##$YL= 0
##$YMAX_a= 81757
##$YMIN_a= -80928
##$ZGOPTNS= <>
##$ZL1= 120
##$ZL2= 120
##$ZL3= 120
##$ZL4= 120
##$ABSF1= 10
##$ABSF2= 0
##$ABSG= 5
##$ABSL= 3
##$ALPHA= 0
##$AQORDER= 0
##$ASSFAC= 0
##$ASSFACI= 0
##$ASSFACX= 0
##$ASSWID= 0
##$AUNMP= <proc_1d>
##$AZFE= 0.1
##$AZFW= 0.1
##$BCFW= 1
##$BC_mod= 2
##$BYTORDP= 1
##$COROFFS= 0
##$CY= 11.3945322036743
##$DATMOD= 1
##$DC= 2
##$DFILT= <>
##$DTYPP= 0
##$F1P= 2.36226072786647
##$F2P= -0.459571619588291
##$FCOR= 0.5
##$FTSIZE= 0
##$FT_mod= 4
##$GAMMA= 1
##$GB= 0.15
##$INTBC= 1
##$INTSCL= 1
##$ISEN= 128
##$LB= 0.24
##$LEV0= 0
##$LPBIN= 0
##$MAXI= 10000
##$MC2= 0
##$MEAN= 0
##$ME_mod= 0
##$MI= 1.114404
##$NCOEF= 0
##$NC_proc= 0
##$NLEV= 6
##$NOISF1= 3.799351
##$NOISF2= 2.8
##$NSP= 1
##$NTH_PI= 0
##$NZP= 0
##$OFFSET= 15.70392
##$PC= 1
##$PHC0= -14153.25
##$PHC1= 9.600879
##$PH_mod= 1
##$PKNL= yes
##$PPARMOD= 0
##$PSCAL= 0
##$PSIGN= 0
##$REVERSE= no
##$SF= 200.130013532006
##$SI= 16384
##$SIGF1= 3
##$SIGF2= 2
##$SINO= 400
##$SIOLD= 16384
##$SREGLST= <1H.CDCl3>
##$SSB= 0
##$STSI= 0
##$STSR= 0
##$SW_p= 3612.71676300578
##$SYMM= 0
##$S_DEV= 0
##$TDeff= 0
##$TDoff= 0
##$TI= <>
##$TILT= no
##$TM1= 0
##$TM2= 0
##$TOPLEV= 0
##$USERP1= <user>
##$USERP2= <user>
##$USERP3= <user>
##$USERP4= <user>
##$USERP5= <user>
##$WDW= 1
##$XDIM= 8192
##$YMAX_p= 0
##$YMIN_p= 0
$$ End of Bruker specific parameters
$$ ---------------------------------
##NTUPLES= NMR FID
##VAR_NAME=  TIME,          FID/REAL,        FID/IMAG
##SYMBOL=    X,             R,               I
##VAR_TYPE=  INDEPENDENT,   DEPENDENT,       DEPENDENT
##VAR_FORM=  AFFN,          ASDF,            ASDF
##VAR_DIM=   8192,          8192,            8192
##UNITS=     SECONDS,       ARBITRARY UNITS, ARBITRARY UNITS
##FACTOR=    0.0002496,     1,               1
##FIRST=     0,             0,               0
##LAST=      2.0444736,     0,               0
##MIN=       0,             -80928,          0
##MAX=       2.0444736,     81757,           0
$$ Real data points
##PAGE= N=1
##DATA TABLE= (X++(R..R)), XYDATA
$$ [...]
$$ plain form
1433 983 -485 4 316 -1311 -2599 -1922 -1565 -2962 -3765 -2700 -2061 -3022 -3277 -1837 -948 -1525 -1416 153
1451 153 1021 554 758 2069 2647 2068 2107 2978 3116 2317 2091 2528 2278 1313 891 1010 521 -473 -918 -893
1471 -893 -1375 -2201 -2463 -2262 -2503 -3013 -2898 -2319 -2204 -2340 -1833 -911 -539 -498 192 1245 1572 1476 1992 2843
1491 2843 2854 2324 2499 3019 2587 1661 1538 1803 1095 -72 -239 0 -794 -1874 -1841 -1478 -2118 -2914 -2542 -1936
1511 -1936 -2357 -2787 -2043 -1218 -1447 -1528 -477 419 247 350 1479 2174 1838 1904 2818 3063 2338 2189 2722 2427
1531 2427 1337 1002 1254 592 -640 -922 -689 -1384 -2392 -2328 -1893 -2377 -2965 -2469 -1793 -2009 -2203 -1389 -599
1550 -599 -695 -636 294 1017 898 1019 1822 2272 2006 2023 2528 2602 2094 1909 2065 1737 1009 647 518 -62 -836
1571 -836 -1180 -1350 -1839 -2343 -2425 -2358 -2529 -2602 -2271 -1916 -1717 -1411 -858 -352 12 449 956 1353 1613 1874 2088
$$ packed form
1433I83j468M89L12j627j288O77L57j397q03J065O39r61k55J440Q89n77J09J569
1451A53Q68m67K04J311N78n79L9Q71J38p99k26M37k50r65m22J19m89r94m45K5
1471h93m82q26k62K01k41n10J15N79J15j36N07R22L72M1O90J053L27r6N16Q51
1491B843J1n30J75N20m32r26j23K65p08j167j67K39p94j080L3L63o40p96L72O06
1511a936m21m30P44Q25k29q1J051Q96j72J03J129O95l36O6R14K45p25j49N33k95
1531B427j090l35K52o62j232k82K33o95j008O4M35m84n88M96O76k16j94Q14P90
1550e99r6N9R30P23j19J21Q03M50k66J7N05P4n08j85J56l28p28l62j29n80p74
1571h36l44j70m89n04q2O7j71p3L31L55J99L06N53N06L64M37N07L97K60K61K14
$$ plain form
1592 2088 2202 2273 2243 2110 1948 1813 1538 1143 819 582 160 -389 -716 -927 -1369 -1832 -1982 -2021 -2290 -2492 -2274
1613 -2274 -2028 -2032 -1858 -1289 -791 -604 -190 589 1055 1181 1561 2180 2330 2139 2270 2545 2254 1711 1636 1617 1013
1634 1013 306 171 58 -621 -1226 -1223 -1236 -1797 -2171 -1913 -1782 -2124 -2191 -1679 -1433 -1554 -1305 -604 -266 -223 260
1655 260 986 1248 1314 1767 2263 2234 2085 2336 2447 1959 1550 1519 1243 478 -62 -162 -548 -1319 -1678 -1580 -1806
1676 -1806 -2303 -2303 -1908 -1882 -2062 -1737 -1141 -958 -937 -481 149 358 455 870 1346 1461 1525 1792 2016 1962 1902 1933 1804
1699 1804 1537 1297 1058 625 193 -146 -527 -1053 -1448 -1633 -1881 -2200 -2300 -2138 -2064 -2042 -1774 -1326 -977 -691
1719 -691 -266 234 632 928 1212 1487 1712 1853 1866 1824 1841 1833 1600 1261 1148 1072 659 136 -13 -66 -576 -1160
1741 -1160 -1236 -1175 -1632 -2124 -1988 -1697 -1948 -2178 -1701 -1133 -1125 -1057 -344 354 445 649 1328 1816 1742 1782 2186 2242 1834
$$ packed form
1592B088J14P1l0j33j62j35k75l95l24k37m22n49l27k11m42m63j50l9k69k02K18
1613b274K46mJ74N69M98J87M14P79M66J26L80O19J50j91J31K75k91n43p5j9o04
1634A013p07j35j13o79o05Lj3n61l74K58J31l42o7N12K46j21K49P01L38M3M83
1655B60P26K62O6M53M96k9j49K51J11m88m09l1k76p65n40j00l86p71l59R8k26
1676a806m97%L95K6j80L25N96J83K1M56O30K09R7M15M76J15O4K67K24n4o0L1j29
1699A804k67k40k39m33m32l39l81n26l95j85k48l19j00J62P4K2K68M48L49K86
1719f91M25N00L98K96K84K75K25J41J3m2J7qk33l39j13p6m13n23j49n3n10n84
1741a160p6O1m57m92J36K91k51k30M77N68QO8P13O98R1K04O79M88p4M0M04N6m08
$$ plain form
1764 1834 1704 1790 1428 805 632 568 -25 -626 -606 -634 -1274 -1684 -1377 -1269 -1853 -2062 -1453 -1202 -1710 -1708 -857 -451
1786 -451 -880 -701 338 786 416 662 1660 1983 1509 1601 2315 2324 1607 1424 1761 1419 529 183 242 -237 -1037
1807 -1037 -1255 -1209 -1552 -1982 -1893 -1707 -1825 -1853 -1446 -1139 -1147 -906 -354 -42 -84 216 831 1012 867 1118 1675 1719
1829 1719 1378 1489 1927 1797 1219 1086 1331 1042 229 -146 -10 -323 -1174 -1600 -1365 -1429 -2086 -2344 -1800 -1471
1849 -1471 -1798 -1796 -1008 -384 -514 -437 395 1039 883 820 1468 1891 1559 1309 1694 1851 1336 1016 1213 1130 549
1870 549 235 349 75 -545 -719 -624 -1055 -1589 -1496 -1294 -1727 -2101 -1593 -1161 -1532 -1646 -733 -48 -403 -396 784
1891 784 1497 963 860 1958 2436 1551 1173 2044 2215 1019 419 1103 1100 -185 -778 -105 -121 -1261 -1633 -918
1911 -918 -877 -1750 -1878 -1127 -1044 -1620 -1495 -766 -678 -972 -574 137 194 99 696 1300 1186 1149 1751 2063 1594 1407
$$ packed form
1764A834j30Q6l62o23j73o4n93o01K0k8o40m10L07J08n84k09O09K51n08KQ51M06
1786d51m29J79J039M48l70K46R98L23m74R2P14Rp17j83L37l42q90l46N9m79q00
1807a037k18M6l43m30Q9J86j18k8M07L07qK41N52L12m2L00O15J81j45K51N57M4
1829A719l41J11M38j30n78j33K45k89q13l75J36l13q51m26K35o4o57k58N44L29
1849a471l27KP88O24j30P7Q32O44j56o3O48M23l32k50L85J57n15l20J97q3n81
1870E49l14J14k74o20j74R5m31n34R3K02m33l74N08M32l71j14R13O85l55PJ180
1891G84P13n34j03J098M78q85l78Q71J71j196o00O84lj285n93O73j6j140l72P15
1911i18M1q73j28P51Q3n76J25P29Q8k94L98P11N7r5N97O04j14l7O02L12m69j87
$$ plain form
1933 1407 1865 1810 944 558 909 620 -471 -898 -479 -697 -1719 -1959 -1261 -1204 -1981 -2023 -1086 -755 -1330 -1268
1953 -1268 -252 194 -282 -273 661 1129 651 546 1300 1698 1238 986 1514 1789 1252 849 1117 1189 564 36
1973 36 78 -32 -674 -1142 -1119 -1246 -1699 -1844 -1609 -1600 -1750 -1453 -956 -870 -828 -221 429 387 350 1029 1589 1210 936
1996 936 1561 1956 1243 699 1291 1618 681 21 627 929 -118 -862 -204 123 -956 -1676 -985 -638 -1577
2015 -1577 -2122 -1318 -838 -1525 -1771 -812 -193 -597 -572 447 987 716 843 1608 1820 1432 1478 1867 1636 1059
2035 1059 1034 1112 543 -49 52 41 -656 -1095 -740 -660 -1342 -1607 -990 -807 -1457 -1592 -777 -509 -1122 -1146 -224
2056 -224 203 -343 -304 666 1160 692 672 1531 1914 1387 1133 1677 1842 1141 640 822 787 43 -563 -537 -574 -1114
2078 -1114 -1566 -1450 -1299 -1499 -1618 -1358 -1041 -968 -888 -563 -243 -98 66 340 524 597 795 1007 1014 977 1193 1351
$$ packed form
1933A407M58n5q66l86L51k89j091m27M19k18j022k40O98N7p77m2R37L31n75O2
1953a268J016M46m76RR34M68m78j05P54L98m60k52N28K75n37m03K68P2o25n28
1973C6M2j10o42m68K3j27m53j45K35Rj50K97M97Q6M2O07O50m2l7O79N60l79k74
1996I36O25L95p13n44N92L27r37o60O06L02j047p44O58L27j079p20O91L47r39
2015a577n45Q04M80o87k46R59O19m04K5J019N40k71J27P65K12l88M6L89k31n77
2035A059k5P8n69n92J01j1o97m39L55Q0o82k65O17J83o50j35Q15K68o13k4R22
2056b24M27n46L9R70M94m68k0Q59L83n27k54N44J65p01n01J82l5p44o06K6l7n40
2078a114m52J16J51k00j19K60L17P3Q0L25L20J45J64K74J84P3J98K12Pl7K16J58
$$ plain form
2100 1351 1164 961 1152 1258 841 411 510 556 -71 -700 -600 -490 -1134 -1757 -1474 -1113 -1558 -1977 -1403 -730
2120 -730 -928 -1150 -422 421 290 68 728 1419 1169 825 1266 1687 1281 824 1058 1258 776 357 491 529
2140 529 58 -240 -152 -267 -694 -842 -775 -995 -1315 -1241 -1079 -1308 -1462 -1096 -748 -878 -825 -173 317 211 328
2161 328 1042 1453 1198 1133 1651 1825 1316 977 1238 1196 530 52 188 126 -470 -879 -730 -673 -1037 -1283 -1084
2182 -1084 -907 -1055 -1165 -976 -717 -713 -732 -556 -265 -83 -5 163 472 751 876 971 1175 1382 1401 1313 1287 1274 1099
2205 1099 792 508 287 11 -346 -662 -908 -1067 -1212 -1365 -1459 -1366 -1190 -1132 -1102 -829 -449 -315 -309 -32 407 486
2227 486 359 569 981 1003 729 859 1246 1181 805 828 1132 971 479 368 519 243 -341 -512 -458 -764 -1251
2248 -1251 -1329 -1212 -1335 -1522 -1366 -1083 -1001 -882 -501 -154 23 269 666 847 897 1085 1297 1204 1047 1129 1185 890
$$ packed form
2100A351j87k03J91J06m17m30R9M6o27o29J00J10o44o23K83L61m45m19N74O73
2120g30j98k22P28Q43j31k22O60O91k50l44M41M21m06m57K34K00m82m19J34L8
2140E29m71k98Q8j15m27j48O7k20l20P4J62k29j54L66L48j30N3O52M90j06J17
2161C28P14M11k55o5N18J74n09l39K61m2o66m78J36o2n96m09J49N7l64k46J99
2182a084J77j48j10J89K59Mj9J76K91J82P8J68L09K79J25R5K04K07J9q8k6j3j75
2205A099l07k84k21k76l57l16k46j59j45j53r4R3J76N8L0K73L80J34OK77M39P9
2227D86j27K10M12K2k74J30L87o5l76K3L04j61m92j11J51k76n84j71N4l06m87
2248a251p8J17j23j87J56K83Q2J19L81L47J77K46L97J81N0J88K12r3j57Q2N6k95
$$ plain form
2270 890 571 646 650 265 -62 39 41 -353 -656 -539 -529 -900 -1149 -1007 -938 -1178 -1289 -1043 -827 -859 -765 -394 -45
2293 -45 110 298 674 954 1107 1217 1338 1409 1374 1295 1111 916 744 527 188 -106 -254 -403 -680 -877 -881 -883 -1017
2316 -1017 -1096 -982 -852 -884 -863 -719 -542 -481 -418 -227 -36 125 267 444 650 860 1012 1056 1136 1296 1282 1094
2338 1094 972 942 761 342 49 -67 -302 -741 -1003 -993 -1081 -1347 -1395 -1159 -1035 -1084 -930 -574 -355 -322 -96 227
2360 227 364 383 565 753 758 755 901 960 849 840 964 891 652 610 674 440 77 -39 -32 -395 -824 -888 -851 -1128 -1439
2385 -1439 -1304 -1069 -1172 -1235 -850 -451 -383 -293 173 577 615 675 1005 1195 1074 997 1129 1088 824 701 687 506
2407 506 225 135 129 -109 -345 -345 -366 -627 -823 -740 -742 -1000 -1106 -923 -832 -995 -954 -586 -354 -367 -180 281 577 619
2431 619 764 1128 1288 1208 1169 1268 1221 932 721 588 403 85 -191 -353 -503 -678 -825 -907 -911 -906 -921 -903 -814 -699
$$ packed form
2270H90l19P5Ml85l27J01Kl94l03J17J0l71k49J42O9k40j11K46K16l2R4L71L49
2293d5J55J88L76K80J53J10J21P1l5p9j84j95j72k17l39k94j48j49k77j97mkj34
2316a017p9J14J30l2K1J44J77O1O3J91J91J61J42J77K06K10J52M4Q0J60j4j88
2338A094j22l0j81m19k93j16k35m39k62J0q8k66m8K36J24m9J54L56K19L3K26L23
2360B27J37J9J82J88NlJ46N9j11rJ24p3k39m2O4k34l63j16Pl63m29o4L7k77l11
2385a439J35K35j03o3L85L99O8R0M66M04L8O0L30J90j21p7J32m1k64j23j4j81
2407E06k81r0ok38k36%k1k61j96Q3kk58j06J83R1j63M1L68K32j3J87M61K96M2
2431F19J45L64J60q0l9R9m7k89k11j33j85l18k76j62j50j75j47q2mNj5J8Q9J15
$$ plain form
2455 -699 -641 -590 -469 -326 -208 -114 25 191 352 504 632 763 906 1035 1075 1036 1051 1068 916 631 463 389 79
2478 79 -353 -538 -565 -819 -1193 -1222 -1021 -1088 -1278 -1096 -685 -592 -686 -403 63 166 71 293 688 682 519 681 943
2501 943 851 668 785 915 738 567 637 619 354 182 179 -20 -387 -525 -515 -783 -1134 -1111 -951 -1122 -1302 -1040
2523 -1040 -647 -691 -731 -245 251 242 203 678 1090 947 763 1045 1278 958 643 780 869 491 138 204 251 -75
2545 -75 -355 -295 -281 -527 -729 -661 -675 -830 -908 -838 -828 -856 -762 -604 -537 -399 -127 109 230 415 745 940 953 1002
2569 1002 1200 1235 1027 860 870 765 399 77 18 -89 -413 -718 -725 -659 -832 -1016 -920 -693 -720 -856 -716 -386
2591 -386 -326 -478 -322 37 133 -5 142 528 667 532 639 968 1042 846 840 1012 932 620 473 452 212 -149
2613 -149 -329 -425 -701 -944 -957 -990 -1128 -1133 -898 -799 -852 -655 -249 -117 -195 61 502 533 317 539 934 829 511
$$ packed form
2455f99N8N1J21J43J18R4J39J66J61J52J28J31J43J29M0l9J5J7j52k85j68p4l10
2478G9m32j85k7k54l74k9K01o7j90J82M11R3r4K83M66J03r5K22L95oj63J62K62
2501I43r2j83J17J30j77j71P0j8k65j72lj99l67j38J0k68l51K3J60j71j80K62
2523a040L93m4m0M86M96rl9M75M12j43j84K82K33l20l15J37Q9l78l53O6M7l26
2545g5k80O0J4k46k02O8j4j55p8P0J0k8R4J58O7J38K72K36J21J85L30J95J3M9
2569A002J98L5k08j67J0j05l66l22n9j07l24l05pO6j73j84R6K27k7j36J40L30
2591c86O0j52J56L59R6j38J47L86J39j35J07L29P4j96oJ72q0l12j47k1k40l61
2613a49j80r6k76k43j3l3j38nK35R9n3J97M06J32p8K56M41L1k16K22L95j05l18
$$ plain form
2636 511 670 1003 824 428 544 833 578 128 180 382 67 -414 -416 -286 -594 -994 -963 -795 -979 -1168 -985
2657 -985 -724 -716 -664 -347 -34 52 223 546 730 755 869 1045 993 862 877 902 652 405 399 373 86 -180 -148 -118
2681 -118 -386 -630 -544 -470 -687 -878 -760 -613 -737 -886 -710 -468 -456 -493 -265 88 221 234 451 794 926 869
2703 869 921 1110 1120 882 726 738 615 253 -1 -57 -196 -503 -715 -695 -727 -881 -929 -805 -737 -757 -677 -489 -404 -385
2727 -385 -218 -27 -5 46 259 440 406 455 728 847 726 723 959 962 672 559 715 564 104 -96 -10 -216 -711
2750 -711 -867 -701 -810 -1159 -1143 -811 -766 -937 -746 -309 -173 -238 -18 365 450 377 546 781 744 626 727 813
2772 813 685 563 621 601 407 295 314 211 -61 -159 -182 -358 -627 -698 -667 -826 -1020 -954 -782 -818 -848 -630 -322
2795 -322 -220 -145 150 461 568 609 790 982 955 852 848 866 735 522 402 333 197 -14 -171 -217 -285 -438 -553
$$ packed form
2636E11J59L33j79l96J16K89k55m50N2K02l15m81kJ30l08m00L1J68j84j89J83
2657i85K61QN2L17L13Q6J71L23J84K5J14J76n2j31J5K5k50k47ok6k87k66L2L0
2681a18k68k44Q6P4k17j91J18J47j24j49J76K42J2l7K28L53J33J3K17L43J32n7
2703H69N2J89J0k38j56J2j23l62k54n6j39l07k12K0l2j54m8J24O8k0Q0J88Q5J9
2727c85J67J91K2N1K13J81l4M9K73J19j21lK36Lk90j13J56j51m60k00Q6k06m95
2750g11j56J66j09l49J6L32M5j71J91M37J36o5K20L83Q5p3J69K35l7j18J01Q6
2772H13j28j22N8k0j94j12J9j03k72r8k3j76k69p1L1j59j94O6J72l6l0K18L08
2795c22J02P5K95L11J07M1J81J92k7j03mJ8j31k13j20o9j36k11j57m6o8j53j15
$$ plain form
2818 -553 -574 -578 -665 -736 -716 -635 -660 -690 -582 -426 -364 -291 -109 108 225 343 569 731 807 865 956 980 869 810 763 595
2844 595 349 214 105 -163 -420 -487 -525 -750 -884 -789 -707 -808 -849 -611 -437 -514 -478 -186 -12 -82 -33 255 416
2867 416 323 383 653 754 642 684 858 854 650 622 668 519 217 116 46 -213 -481 -565 -626 -831 -963 -894 -848 -919
2891 -919 -861 -607 -463 -456 -266 31 186 192 338 610 648 562 647 796 748 590 610 675 560 357 335 346 179 -22
2915 -22 -87 -153 -308 -495 -563 -632 -737 -824 -839 -809 -791 -713 -593 -468 -309 -126 53 208 398 574 690 760 837 881
2939 881 854 788 719 651 508 370 231 101 -35 -164 -280 -391 -473 -513 -604 -692 -676 -612 -658 -704 -607 -473 -466 -455 -267
2964 -267 -49 22 44 291 544 591 591 787 944 862 746 804 820 590 360 327 226 -69 -280 -333 -441 -656 -763
2987 -763 -706 -745 -838 -755 -615 -595 -591 -404 -200 -203 -168 83 266 210 251 515 653 527 533 782 843 615 550 718 678 346
$$ packed form
2818e53k1mq7p1K0Q1k5l0J08J56O2P3J82K17J17J18K26J62P6N8R1K4j11n9m7j68
2844E95k46j35j09k68k57o7l8k25j34R5Q2j01m1K38J74p7L6K92J74p0M9K88J61
2867D16r3O0K70J01j12M2J74mk04k8M6j49l02j01p0k59k68q4o1k05j32O9M6p1
2891i19N8K54J44PJ90K97J55OJ46K72L8q6Q5J49m8j58K0O5j15k03k2J1j67k01
2915b2o5o6j55j87o8o9j05q7j5L0J8P8J20J25J59J83J79J55J90J76J16P0P7M4
2939H81k7o6o9o8j43j38j39j30j36j29j16j11q2m0r1q8J6O4m6m6R7J34PJ1J88
2964b67K18P1K2K47K53M7%J96J57q2j16N8J6k30k30l3j01k95k11n3j08k15j07
2987g63N7l9r3Q3J40K0MJ87K04lL5K51J83n6M1K64J38j26OK49O1k28o5J68m0l32
$$ plain form
3013 346 206 289 150 -206 -392 -327 -467 -782 -862 -742 -771 -894 -841 -626 -539 -504 -332 -95 23 120 288 454 500
3036 500 571 681 724 643 664 707 614 467 440 460 289 94 43 42 -142 -369 -413 -396 -542 -745 -774 -661 -693 -807 -754
3061 -754 -510 -413 -406 -290 7 207 255 328 584 776 739 690 808 898 753 545 526 548 334 70 21 11 -173 -423
3085 -423 -449 -404 -536 -679 -650 -593 -649 -663 -574 -500 -488 -383 -209 -149 -96 115 313 342 381 644 811 692 637 834 903
3110 903 633 430 564 570 133 -155 -35 -51 -465 -741 -551 -485 -808 -947 -678 -481 -682 -723 -387 -169 -286 -249
3132 -249 45 240 177 222 460 585 521 563 704 688 599 642 648 496 381 386 279 15 -137 -114 -261 -582 -676 -558
3156 -558 -650 -899 -878 -612 -572 -728 -608 -220 -87 -182 -46 330 483 347 413 694 792 602 539 702 728 517 358
3179 358 408 417 195 -15 -16 -12 -210 -433 -477 -441 -562 -708 -723 -651 -639 -672 -611 -457 -336 -261 -131 32 190 338 471
$$ packed form
3013C46j40Q3j39l56j86O5j40l15q0J20k9j23N3K15Q7L5J72K37J18R7J68J66M6
3036E00P1J10M3q1K1M3r3j47k7K0j71j95n1jj84k27m4J7j46k03k9J13l2j14N3
3061g54K44R7PJ16K97K00M8P3K56J92l7m9J18R0j45k08j9K2k14k64m9j0j84k50
3085d23k6M5j32j43K9N7n6j4Q9P4J2J05J74O0N3K11J98K9L9K63J67j19n5J97O9
3110I03k70k03J34Om37k88J20j6m14k76J90O6l23j39K69J97k01m1L36K18j17L7
3132b49K94J95o3M5K38J25o4M2J41j6q9M3Oj52j15Nj07k64j52K3j47l21r4J18
3156e58r2k49K1K66M0j56J20L88J33r5J36L76J53j36O6K81R8j90o3J63K6k11j59
3179C58N0Rk22k10jMj98k23m4L6j21j46j5P2J2l3O1J54J21P5J30J63J58J48J33
$$ plain form
3204 471 558 632 749 806 724 654 692 671 444 269 267 250 -39 -279 -242 -187 -467 -701 -564 -436 -647 -837 -611 -376
3228 -376 -531 -661 -382 -86 -182 -255 58 354 299 244 531 761 660 573 743 819 648 510 560 480 240 101 46
3251 46 -132 -355 -422 -439 -615 -756 -672 -600 -728 -738 -521 -373 -464 -409 -92 82 -29 16 354 506 364 376 653
3274 653 762 562 486 674 717 471 314 399 355 90 -114 -98 -164 -387 -566 -576 -581 -684 -764 -698 -622 -585 -532 -413 -273
3299 -273 -133 -16 96 226 371 470 521 590 646 685 644 596 553 526 448 319 211 154 67 -88 -241 -286 -328 -480 -613
3324 -613 -608 -565 -636 -728 -634 -454 -451 -496 -318 -51 22 -10 187 462 509 448 587 793 753 580 609 710 557 322 296
3349 296 299 107 -135 -177 -198 -380 -521 -507 -517 -624 -660 -563 -530 -594 -502 -327 -277 -283 -129 108 134 127 353 565 535 470
3375 470 646 784 650 500 591 638 400 186 219 193 -81 -302 -281 -316 -533 -671 -598 -567 -659 -690 -552 -458 -461 -389 -218
$$ packed form
3204D71Q7P4J17N7q2p0L8k1k27j75kj7k89k40L7N5k80k34J37J28k11j90K26K35
3228c76j55j30K79K96r6p3L13K96n5n5K87K30j01q7J70P6j71j38N0q0k40j39n5
3251D6j78k23o7j7j76j41Q4P2j28j0K17J48r1N5L17J74j11M5L38J52j42J2K77
3274F53J09k00p6J88M3k46j57Q5m4k65k04J6o6k23j79j0nj03q0O6P6L7N3J19J40
3299b73J40J17J12J30J45R9N1O9N6L9m1m8m3k7p8j29j08n7q7j55j53m5m2j52j33
3324f13NM3p1r2R4J80Lm5J78K67P3l2J97K75M7o1J39K06m0j73K9J01j53k35k6
3349B96Lj92k42m2k1j82j41J4j0j07l6R7L3o4R2J75N0oJ54K37K6pK26K12l0o5
3375D70J76J38j34j50R1M7k38k14L3k6k74k21K1l5k17j38P3L1r2l1J38R4lP2J71
$$ plain form
3400 -218 -91 -32 76 225 312 377 473 560 573 577 629 629 549 505 469 399 245 144 76 -47 -215 -321 -369 -474 -577 -637
3426 -637 -634 -624 -634 -615 -511 -405 -315 -244 -109 49 163 224 331 482 570 542 566 660 661 535 473 503 434 246 137 152
3452 152 38 -172 -266 -251 -365 -534 -589 -527 -572 -658 -612 -491 -458 -460 -315 -149 -105 -28 168 330 352 409 593 655 588
3477 588 582 689 630 457 406 440 296 61 5 15 -153 -383 -404 -359 -491 -644 -591 -499 -556 -615 -481 -328 -335 -311 -129
3502 -129 30 54 111 303 427 429 474 601 637 577 569 597 517 390 342 274 139 -22 -92 -173 -341 -458 -480 -509 -609 -647
3528 -647 -565 -528 -547 -483 -337 -244 -203 -104 56 163 201 310 438 501 503 546 580 596 550 496 447 397 301 186 78 -5 -94
3555 -94 -229 -361 -419 -459 -551 -609 -598 -555 -576 -555 -439 -336 -271 -190 -46 97 143 251 382 455 492 546 609 586 526 523 511
3582 511 404 285 260 190 13 -104 -124 -221 -403 -475 -436 -478 -615 -602 -486 -492 -547 -449 -265 -211 -226 -57 147 189 211
$$ packed form
3400b18J27N9J08J49Q7O5R6Q7J3MN2%q0m4l6p0j54j01o8j23j68j06m8j05j03o0
3426f37LJ0j0J9J04J06R0P1J35J58J14O1J07J51Q8k8K4R4Jj26o2L0o9j88j09J5
3452A52j14k10r4J5j14j69n5O2m5q6M6J21L3kJ45J66M4P7J96J62K2N7J84O2o7
3477E88oJ07n9j73n1L4j44k35n6J0j68k30k1M5j32j53N3R2n7n9J34J53pK4J82
3502a29J59K4N7J92J24KM5J27L6o0qK8q0j27m8o8j35j61p0q1j68j17k2k9j00l8
3528f47Q2L7j9O4J46R3M1R9J60J07L8J09J28O3KM3L4J6m6n4m9n0r6j15j08q3q9
3555i4j35j32n8m0r2n8J1M3k1K1J16J03O5Q1J44J43M6J08J31P3L7N4O3k3o0lj2
3582E11j07j19k5p0j77j17k0r7j82p2L9m2j37J3J16on5R8J84N4j5J69K04M2K2
$$ plain form
3607 211 364 538 522 488 595 660 562 453 481 460 273 150 145 43 -158 -253 -263 -351 -502 -538 -476 -534 -610 -535 -419
3632 -419 -436 -428 -280 -133 -108 -52 121 276 267 318 486 579 532 508 594 611 478 401 407 325 157 45 6 -96 -259 -353
3658 -353 -375 -461 -553 -571 -545 -547 -534 -486 -389 -324 -241 -148 -40 53 143 247 332 393 474 512 535 538 550 501 459 409 345 244 162
3687 162 71 -51 -157 -238 -315 -423 -493 -498 -519 -567 -569 -480 -438 -431 -359 -194 -101 -76 39 228 304 302 402 548 567 474 520 588
3715 588 523 373 345 377 219 38 7 -10 -182 -349 -346 -357 -484 -569 -504 -463 -549 -553 -392 -314 -339 -258 -54 44 45 155 351
3742 351 399 372 463 605 559 462 513 547 415 263 264 252 67 -90 -95 -156 -326 -448 -417 -427 -564 -591 -487 -453 -494 -452
3768 -452 -293 -220 -197 -112 58 152 179 272 418 470 448 511 558 529 468 456 411 323 223 157 74 -48 -152 -230 -294 -400
3794 -400 -464 -512 -511 -522 -536 -485 -439 -376 -302 -226 -114 -24 61 144 252 349 378 438 519 533 500 478 503 453 344 279 254 152
$$ packed form
3607B11J53J74j6l4J07O5r8j09K8k1j87j23nj02k01r5j0q8j51l6O2n8p6P5J16
3632d19j7QJ48J47K5N6J73J55rN1J68R3m7k4Q6J7j33p7Oq2j68j12l9j02j63r4
3658c53k2q6r2j8K6kJ3M8R7O5Q3R3J08R3R0J04Q5O1Q1L8K3LJ2m9m2n0o4j01q2
3687A62r1j22j06q1p7j08p0nk1m8kQ9M2PP2J65R3K5J15J89P6kJ00J46J9r3M6O8
3715E88o5j50k8L2j58j81l1j7j72j67Lj1j27q5O5M1q6mJ61P8k5Q1K04R8JJ10J96
3742C51M8k7R1J42m6r7N1L4j32j52Jj2j85j57no1j70j22L1j0j37k7J04L4m1M2
3768d52J59P3K3Q5J70R4K7R3J46N2k2O3M7k9o1j2m5q8j00o6q3j22j04p8o4j06
3794d00o4m8Jj1j4N1M6O3P4P6J12R0Q5Q3J08R7K9O0Q1J4l3k2K5n0j09o5k5j02
$$ plain form
3822 152 -4 -91 -131 -235 -377 -423 -401 -481 -577 -538 -449 -470 -487 -373 -213 -205 -172 2 153 165 204 356 481 443 429 537
3848 537 564 448 404 450 393 217 143 135 23 -155 -208 -206 -336 -471 -486 -423 -498 -588 -480 -378 -397 -403 -248 -91 -104 -51
3874 -51 145 269 258 295 468 537 464 461 548 536 404 347 355 264 118 39 1 -112 -252 -309 -327 -422 -502 -487 -464 -485 -486 -409
3902 -409 -341 -301 -241 -118 -16 30 129 239 315 358 425 480 507 505 494 476 428 356 286 215 125 30 -71 -161 -244 -315 -401 -457
3930 -457 -472 -466 -502 -501 -430 -372 -352 -286 -166 -61 -33 51 203 282 291 365 482 503 451 468 508 455 351 318 302 194 54 5
3958 5 -43 -181 -294 -325 -338 -466 -524 -462 -433 -514 -480 -341 -275 -284 -201 -38 51 62 169 344 379 366 432 525 506 422 445 480
3986 480 360 240 244 195 49 -78 -107 -153 -288 -393 -388 -409 -493 -517 -448 -417 -440 -382 -271 -208 -174 -48 72 125 184 305
4012 305 395 415 443 499 506 459 429 421 367 267 185 138 39 -75 -152 -222 -297 -373 -415 -444 -480 -472 -444 -438 -401 -330 -264 -210 -134 -5
$$ packed form
3822A52j56q7m0j04j42m6K2q0r6L9Q9k1j7J14J60QL3J74J51J2L9J52J25l8j4J08
3848E37K7j16m4M6n7j76p4qj12j78n3Kj30j35j5O3p5r0J08J02j9oJ55J57j3N3
3874e1J96J24j1L7J73O9p3lQ7j2j32n7Qr1j46p9l8j13j40n7j8r5q0J5K3k1jP7
3902d09O8M0O0J23J02M6R9J10P6M3O7N5K7kj1j8m8p2p0p1r0r5j01r0q3p1q6n6
3930d57j5Ol6JP1N8K0O6J20J05K8Q4J52P9RP4J17K1n2J7M0n3j04l3j6j08j40m9
3958Em8j38j13l1j3j28n8O2K9q1L4J39O6rQ3J63Q9J1J07J75L5j3O6R3j9q4K3L5
3986D80j20j20Mm9j46j27k9m6j35j05Nk1q4k4O9L1k3N8J11O3L4J26J20N3N9J21
4012C05R0K0K8N6Pm7l0qn4j00q2m7r9j14p7p0p5p6m2k9l6QK8OL7P1O6N4P6J29
$$ plain form
4042 -5 78 138 223 332 377 390 452 513 487 442 440 439 328 239 202 129 5 -118 -144 -212 -342 -419 -400 -419 -511 -503 -412 -395 -405 -326
4072 -326 -203 -149 -126 5 135 179 206 316 429 417 405 471 507 419 367 380 352 205 121 107 32 -110 -201 -209 -288 -417
4098 -417 -449 -425 -467 -503 -457 -377 -357 -347 -225 -114 -73 1 131 239 253 311 400 465 434 459 470 442 367 329 300 219 106
4125 106 35 -16 -124 -228 -270 -308 -385 -434 -450 -447 -451 -440 -384 -324 -286 -202 -121 -37 41 148 229 279 343 424 458 450 477 479 432 350
4155 350 332 286 172 87 19 -53 -164 -242 -286 -349 -413 -438 -426 -436 -469 -410 -339 -307 -273 -170 -64 -37 47 171 258 270 325
4182 325 431 457 420 423 477 434 324 293 288 187 52 -12 -32 -148 -276 -304 -328 -405 -467 -435 -410 -433 -420 -325 -250 -234 -158 -29
4210 -29 47 68 173 284 325 321 392 472 436 402 417 428 324 253 229 176 50 -44 -85 -149 -279 -349 -347 -384 -463 -472 -408 -395 -418
4239 -418 -340 -239 -181 -136 -37 63 110 175 284 361 364 398 452 456 408 399 392 314 223 171 127 21 -82 -133 -176 -284 -357 -370 -388
$$ packed form
4042eQ3O0Q5J09M5J3O2O1k6m5kjj11q9l7p3j24j23k6o8j30p7J9j9r2QR1J7j0P9
4072c26J23N4K3J31J30M4K7J10J13j2j2O6L6q8n2J3k8j47q4j4p5j42r1qp9j29
4098d17l2K4m2l6M6Q0K0J0J22J11M1P4J30J08J4N8Q9O5l1K5J1k8p5l8k9q1j13
4125A06p1n1j08j04m2l8p7m9j6LmJ1N6O0L8Q4Q1Q4P8J07Q1N0O4Q1L4qK7Km7q2
4155C50j8m6j14q5o8p2j11p8m4o3o4k5J2j0l3N9P1L2L4J03J06K7Q4J24Q7J2N5
4182C25J06K6l7LN4m3j10l1nj01j35o4k0j16j28k8k4p7o2L2K5k3J3R5P5J6P6J29
4210b9P6K1J05J11M1mP1Q0l6l4J5J1j04p1k4n3j26r4m1o4j30p0Kl7p9rO4J3k3
4239d18P8J01N8M5R9J00M7O5J09P7LL4N4Mm8rpp8r1n2m4j06j03n1m3j08p3j3j8
$$ plain form
4268 -388 -427 -447 -406 -377 -377 -314 -239 -186 -122 -30 64 126 203 289 357 375 415 453 445 413 396 377 303 214 175 108 -11 -97 -155 -215
4298 -215 -304 -365 -375 -396 -438 -426 -387 -362 -349 -287 -194 -154 -87 8 98 136 198 305 358 359 379 444 450 378 352 372 281 172 138 107
4328 107 5 -140 -194 -205 -308 -402 -396 -373 -438 -460 -392 -328 -325 -284 -170 -93 -72 6 132 192 212 293 387 386 352 401 446 384 304
4357 304 318 291 180 71 65 18 -128 -216 -219 -264 -374 -427 -389 -383 -450 -427 -330 -280 -270 -209 -70 -13 22 112 214 279 302 361
4385 361 409 418 390 404 383 326 280 236 170 69 9 -38 -123 -209 -264 -286 -355 -408 -401 -381 -395 -383 -339 -280 -232 -167 -93 -20 73 134
4415 134 213 264 344 380 383 399 430 424 352 303 286 230 119 49 5 -59 -197 -255 -251 -316 -398 -401 -365 -362 -399 -360 -276 -243 -226 -133 -18
4446 -18 23 44 151 243 279 303 378 418 378 364 398 371 269 239 245 137 2 -32 -42 -167 -306 -312 -284 -372 -457 -412 -335 -377
4474 -377 -413 -276 -157 -172 -158 -13 107 103 129 256 333 318 316 400 419 352 329 340 295 201 156 125 43 -68 -106 -166 -255 -317
$$ packed form
4268c88l9k0M1K9%O3P5N3O4R2R4O2P7Q6O8J8M0L8ql2j7j9p4q9l9o7j19q6n8o0
4298b15q9o1j0k1m2J2L9K5J3O2R3M0O7R5R0L8O2J07N3JK0O5Op2k6K0r1j09l4l1
4328A07j02j45n4j1j03r4OK3o5k2O8O4LM1J14P7K1P8J26O0K0Q1R4jl4M9M5o2q0
4357C04J4k7j11j09om7j46q8lm5j10n3L8Oo7K3R7N0J0O1J39N7L5R0J02O5K3N9
4385C61M8Rk8J4k1n7m6m4o6j01o0m7q5q6n5k2o9n3PK0j4J2M4N9M8O5P4P3R3O1
4415A34P9N1Q0L6LJ6L1op2m9j7n6j11p0m4o4j38n8Mo5q2lL6Ll7L9Q4L3J7R3J15
4446a8M1K1J07R2L6K4P5M0m0j4L4k7j02l0Oj08j35l4j0j25j39oK8q8q5M5P7m2
4474c77l6J37J19j5J4J45J20mK6J27P7j5kQ4J9o7k3J1m5r4m5l1q2j11l8o0q9o2
$$ plain form
4502 -317 -324 -345 -414 -429 -385 -351 -365 -314 -198 -141 -128 -48 79 152 170 238 335 366 347 365 406 396 339 278 266 217 138 58 3
4531 3 -48 -125 -205 -262 -275 -315 -384 -398 -361 -350 -364 -341 -249 -184 -170 -114 1 86 123 165 274 341 348 356 406 392 379 336 321 256 179
4562 179 124 75 -35 -109 -132 -219 -302 -340 -300 -337 -414 -399 -310 -300 -333 -258 -127 -106 -125 -10 138 156 136 241 369 355 303
4589 303 375 438 374 279 293 290 198 77 39 22 -105 -203 -219 -253 -337 -377 -364 -365 -395 -370 -296 -271 -251 -147 -62 -44 5 121 195
4618 195 201 239 327 382 340 325 384 391 289 232 245 215 79 7 -8 -66 -177 -249 -277 -310 -370 -402 -370 -354 -348 -324 -278 -211 -137 -97
4648 -97 -31 55 132 180 208 287 354 370 346 346 365 340 271 230 213 144 53 -6 -46 -112 -187 -235 -269 -311 -343 -347 -363 -354 -328 -298 -276 -221
4680 -221 -126 -66 -43 29 154 212 222 267 371 383 337 339 397 354 237 211 220 151 5 -55 -41 -134 -240 -280 -261 -315 -386 -358
4708 -358 -315 -334 -325 -269 -213 -177 -140 -35 15 55 138 213 245 256 311 374 335 311 344 357 285 186 183 166 42 -62 -81 -116 -231
$$ packed form
4502c17pk1o9j5M4L4j4N1J16N7J3Q0J27P3J8O8R7L1j9J8M1j0n7o1j2m9p9q0n5
4531Cn1p7q0n7j3m0o9j4L7J1j4K3R2O5J4N6J15Q5L7M2J09O7PQN0j4j3m3j5o5p7
4562A79n5m9j10p4k3q7q3l8M0l7p7J5Q9J0l3P5J31K1j9J15J48J8k0J05J28j4n2
4589C03P2O3o4r5J4lr2j21l8j7j27r8j6l4q4m0J3jl0K5P4K5K0J04Q5J8M9J16P4
4618A95OL8Q8N5m2j5N9Pj02n7J3l0j36p2j5n8j11p2k8l3o0l2L2J6OK4M6O7P4M0
4648i7O6Q6P7M8K8P9O7J6k4%J9k5o9m1j7o9r1n9m0o6p5m8l4m2l2mj6RK6L0K2N5
4680b21R5O0K3P2J25N8J0M5J04J2m6KN8m3j17k6Ro9j46o0J4r3j06m0J9n4p1K8
4708c58M3j9RN6N6L6L7J05N0M0Q3P5L2J1N5O3l9k4L3J3p2r9lj7j24j04j9l5j15
$$ plain form
4737 -231 -313 -297 -291 -362 -411 -353 -301 -314 -285 -200 -122 -94 -50 50 104 149 191 237 290 313 341 339 322 327 315 261 189 167 125 34 -41
4768 -41 -75 -116 -211 -284 -293 -302 -369 -395 -350 -313 -310 -278 -194 -129 -80 -23 36 117 180 235 270 302 344 366 317 312 317 304 206 143 151 100 -1
4801 -1 -81 -84 -114 -224 -298 -271 -284 -349 -368 -318 -279 -302 -270 -174 -99 -89 -35 63 130 169 230 289 313 322 352 354 315 296 290 233 139 102
4833 102 77 -7 -98 -137 -152 -214 -313 -293 -274 -319 -363 -308 -236 -238 -245 -154 -60 -40 -23 64 157 186 200 276 327 324 323 334 337 291 261 234
4865 234 181 104 58 -11 -109 -155 -188 -239 -314 -324 -308 -325 -355 -319 -244 -235 -224 -160 -54 -16 -8 74 166 193 198 253 307 316 294 302 307 266
4897 266 234 185 139 85 46 -23 -97 -144 -182 -242 -293 -317 -307 -332 -353 -310 -244 -232 -211 -126 -43 4 27 104 198 232 230 276 328 315
4927 315 288 295 303 253 203 169 129 57 2 -49 -108 -180 -196 -223 -289 -326 -281 -298 -326 -297 -239 -194 -192 -139 -32 10 21 95 212 246
4957 246 222 270 348 330 294 288 319 251 186 133 119 55 -42 -89 -121 -180 -222 -243 -270 -300 -305 -291 -292 -279 -240 -169 -157 -118 -27 43 48 92
$$ packed form
4737b31q2J6Op1m9N8N2j3K9Q5P8K8M4J00N4M5M2M6N3K3K8kj7Nj2n4p2k2m2r1p5
4768d1l4m1r5p3rro7k6M5L7LL2Q4O5M9N7N9Q1O3N5L5L2M2K2m9nNj3r8o3Qn1j01
4801aq0ll0j10p4K7j3o5j9N0L9k3L2R6P5J0N4R8O7L9O1N9K4RL0Kl9j9on7r4l7
4833A02k5q4r1l9j5o2r9K0J9m5m4N5P2kpR1R4K0J7Q7R3K9J4P6N1ljJ1Lm6l0k7
4865B34n3p7m6o9r8m6l3n1p5j0J6j7l0L6P5RJ1O4J06L8QQ2R2K7NN5N4Rk2QNm1
4897B66l2m9m6n4l9o9p4m7l8o0n1k4J0k5k1M3O6J2K1Q5Q3M7K3P7R4L4kM6N2j3
4927C15k7PQn0n0l4m0p2n5n1n9p2j6k7o6l7M5j7k8K9N8M5KN3J07M2J1P4J17L4
4957B46k4M8P8j8l6oL1o8o5n3j4o4r7m7l2n9m2k1k7l0nJ4jJ3L9P1J2L9R1P0NM4
$$ plain form
4989 92 187 234 238 261 329 334 305 281 291 266 183 135 104 55 -52 -99 -131 -190 -245 -279 -300 -311 -300 -295 -286 -271 -218 -166 -136 -99 -16 50
5021 50 73 118 191 236 231 253 308 318 261 262 273 232 152 114 95 38 -47 -98 -122 -183 -245 -273 -291 -313 -308 -296 -276 -259 -222 -138 -109 -89
5053 -89 -1 81 107 123 215 272 251 256 311 316 261 229 247 222 129 76 79 26 -63 -117 -121 -170 -250 -272 -257 -282 -308 -299 -252 -251 -223 -157 -101
5086 -101 -67 -20 71 119 144 195 262 274 275 297 325 279 242 225 224 149 67 42 17 -63 -151 -147 -158 -230 -278 -262 -260 -283 -288 -241 -204 -187
5118 -187 -148 -82 -36 14 64 115 146 183 240 256 271 291 303 287 244 233 205 136 76 31 -4 -67 -149 -182 -193 -241 -288 -279 -265 -273 -277
5149 -277 -226 -194 -164 -116 -66 -5 21 76 122 165 195 246 258 266 290 290 268 221 202 200 126 44 27 12 -77 -168 -172 -176 -249 -306 -275 -250
5181 -250 -287 -296 -236 -172 -169 -135 -52 16 45 79 166 201 213 244 282 273 264 268 259 217 177 162 110 32 -3 -23 -76 -161 -190 -179 -227 -274 -286
5214 -286 -243 -261 -273 -251 -167 -150 -132 -65 15 54 78 149 205 224 247 268 277 283 263 245 208 179 145 89 29 -16 -51 -105 -170 -201 -192
$$ packed form
4989I2R5M7MK3O8Nk9k4J0k5q3m8l1m9j07m7l2n9n5l4k1j1J1NRJ5N3N2L0L7Q3O6
5021E0K3M5P3M5nK2N5J0n7JJ1m1q0l8j9n7q5n1k4o1o2k8j8k2NJ2K0J7L7Q4K9K0
5053h9Q8Q2K6J6R2N7k1NN5Nn5l2J8k5r3n3Ln3q9n4mm9q0k2J5k5k6RM7JK8O6N6
5086a01L4M7R1M8K5N1O7J2JK2K8m6l7j7jp5q2k5k5q0q8Mj1p2m8J6Kk3nM7L7J7
5118a87L9O6M6N0N0N1L1L7N7J6J5K0J2j6m3j1k8o9o0m5l5o3q2l3j1m8m7RJ4qm
5149b77N1L2L0M8N0O1K6N5M6M3L0N1J2QK4%k2m7j9kp4q2j7j5q9r1mmp3n7L1K5
5181b50l7rO0O4LL4Q3O8K9L4Q7L5J2L1L8rrMrm2m0j5n2p8l5k0n3q5k9J1m8m7j2
5214b86M3j8j2K2Q4J7J8O7Q0L9K4P1N6J9K3K1ROk0j8l7k9l4n6o0m5l5n4o5l1R
$$ plain form
5245 -192 -230 -275 -271 -239 -239 -253 -231 -154 -115 -111 -64 6 61 66 136 183 219 230 265 272 280 258 236 200 175 127 83 13 -45 -53 -109 -179 -197
5278 -197 -213 -238 -287 -276 -236 -239 -248 -207 -133 -102 -96 -30 54 85 83 141 212 231 219 241 288 260 237 230 213 153 103 83 32 -40 -74 -112
5310 -112 -168 -206 -227 -232 -271 -297 -253 -229 -242 -219 -126 -77 -94 -34 61 117 99 152 231 265 232 242 275 271 217 183 197 160 98 49 20
5341 20 -23 -83 -122 -154 -200 -211 -221 -245 -266 -250 -232 -212 -204 -139 -82 -72 -36 46 115 122 145 224 265 229 228 258 268 226 187 176 144 76
5373 76 33 -11 -46 -99 -132 -174 -200 -222 -236 -258 -257 -236 -218 -209 -188 -129 -81 -59 -26 57 109 107 143 215 255 227 228 277 269 205 180 174 142
5406 142 64 9 -8 -58 -118 -154 -164 -212 -241 -243 -256 -252 -229 -192 -175 -167 -110 -46 -26 -6 71 137 138 147 208 246 229 216 260 259 206 145 156
5439 156 149 58 -2 -16 -49 -130 -171 -189 -198 -253 -254 -244 -246 -241 -209 -178 -160 -105 -54 -6 22 75 134 160 154 202 252 238 213 224 241 199 146
5472 146 125 117 55 -13 -38 -53 -106 -192 -192 -192 -224 -253 -260 -227 -228 -217 -180 -142 -101 -59 -2 30 68 131 160 173 203 245 249 224 230 240 191
$$ packed form
5245a92l8m5ML2%j4K2P7L9MM7P0N5NP0M7L6J1L5PQk2k2l6k5m8m4p0n8qn6p0j8
5278a97j6k5m9J1M0lrM1P4L1OO6Q4L1kN8P1J9j2K2M7k8k3pj7o0n0k0n1p2l4l8
5310a12n6l8k1nl9k6M4K4j3K3R3M9j7O0R5N6j8N3P9L4l3J0L3mn4l4J4l7o2m9k9
5341B0m3o0l9l2m6j1j0k4k1J6J8K0QO5N7J0L6Q2O9PK3P9M1l6jL0J0m2l9j1l2o8
5373G6m3m4l5n3l3m2k6k2j4k2JK1J8RK1N9M8K2L3Q3N2kL6P2M0k8JM9qo4k5ol2
5406A42p8n5j7n0o0l6j0m8k9kj3MK3L7J7QN7O4K0K0P7O6JRO1L8j7j3M4jn3o1J1
5439A56pr1o0j4l3q1m1j8rn5jJ0kNL2L1J8N5N1M8K8N3N9K6oM8N0j4k5J1J7m2n3
5472A46k1qo2o8k5j5n3q6%%l2k9pL3jJ1L7L8M1M2N7L2L8O3K9J3L0M2Mk5OJ0m9
$$ plain form
5505 191 143 128 106 44 -26 -57 -69 -122 -184 -193 -198 -230 -242 -230 -221 -211 -194 -154 -118 -90 -51 -10 33 78 129 156 173 209 246 234 221
5536 221 232 236 191 134 104 97 21 -38 -61 -76 -146 -205 -209 -206 -240 -258 -232 -204 -203 -181 -146 -91 -74 -40 24 60 88 131 181 195 199 228 249
5569 249 235 211 209 196 136 84 80 41 -43 -78 -92 -131 -204 -222 -199 -224 -274 -253 -195 -195 -193 -142 -85 -61 -43 20 87 121 122 177 219 214 213
5602 213 234 229 204 172 182 124 72 45 17 -40 -88 -104 -135 -178 -202 -205 -213 -234 -231 -208 -185 -165 -145 -84 -46 -25 21 76 109 137 171 214
5634 214 214 229 235 221 201 182 163 118 63 42 -5 -55 -91 -124 -138 -192 -218 -207 -208 -239 -230 -184 -180 -180 -120 -65 -36 -11 32 94 114 140 177
5667 177 219 219 217 243 229 185 171 157 116 60 23 0 -46 -118 -137 -140 -194 -225 -222 -212 -225 -237 -198 -157 -157 -132 -56 -13 4 33 107 143
5699 143 131 172 202 227 200 222 222 196 148 129 127 77 11 -6 -32 -119 -134 -157 -170 -217 -227 -209 -211 -210 -210 -146 -127 -109 -57 -7 18 52
5731 52 102 144 155 162 207 223 194 197 217 180 146 117 97 67 6 -18 -54 -98 -130 -157 -175 -198 -214 -217 -206 -217 -189 -156 -129 -100 -56 -8
$$ packed form
5505A91m8j5k2o2p0l1j2n3o2rnl2j2J2RJ0J7M0L6K8L9M1M3M5N1K7J7L6L7j2j3
5536B21J1Mm5n7l0pp6n9k3j5p0n9mLl4j8K6K8JK2L5N5J7L4O4L6K8M3N0J4MK9K1
5569B49j4k4kj3o0n2ml9q4l5j4l9p3j8K3k5n0K1N8%KN1N7K4J8O3O7L4JN5M2nj
5602B13K1nk5l2J0n8n2k7k8n7m8j6l1m3k4lqk1LK3K3K0K0O1L8K1M6N5L3K8L4M3
5634B14%J5Oj4k0j9j9m5n5k1m7n0l6l3j4n4k6J1jl1RM6M%O0N5K9K5M3O2K0K6L7
5667A77M2%kK6j4m4j4j4m1n6l7k3m6p2j9ln4l1LJ0j3j2L9M1%K5P6M3J7K9P4L6
5699A43j2M1L0K5k7K2%k6m8j9kn0o6j7k6q7j5k3j3m7j0J8kJ%O4J9J8N2N0K5L4
5731E2N0M2J1PM5J6k9LK0l7l4k9k0l0o1k4l6m4l2k7j8k3j6lJ1j1K8L3K7K9M4M8
$$ plain form
5763 -8 21 63 96 143 155 178 219 216 203 199 200 184 135 111 98 46 -14 -30 -52 -106 -145 -161 -168 -201 -221 -207 -198 -217 -189 -132 -115 -100 -49
5796 -49 4 34 58 100 160 170 165 200 226 207 181 201 193 142 97 91 50 -21 -52 -72 -92 -166 -179 -166 -198 -223 -212 -182 -189 -186 -138 -89 -73
5829 -73 -43 27 59 65 84 152 175 167 183 226 208 173 175 178 138 92 77 48 -8 -59 -91 -102 -155 -176 -183 -187 -208 -216 -187 -178 -170 -140 -85 -62 -40
5864 -40 11 54 73 112 143 172 182 188 214 202 192 168 166 130 94 67 34 0 -59 -86 -105 -133 -171 -172 -182 -212 -203 -183 -183 -166 -132 -96 -55
5897 -55 -30 12 69 84 105 153 183 184 202 208 209 187 165 158 115 76 53 19 -20 -78 -98 -106 -149 -183 -187 -189 -200 -212 -175 -164 -164 -135 -74 -43
5931 -43 -42 10 73 88 103 143 196 181 184 197 202 186 147 153 140 79 24 17 0 -77 -111 -121 -132 -189 -190 -186 -187 -196 -193 -147 -137 -106 -80 -36 -17
5966 -17 18 60 108 115 151 172 186 187 189 195 185 128 134 120 66 23 0 -8 -60 -97 -111 -138 -172 -206 -191 -177 -196 -187 -142 -123 -113 -70 -24 15
6000 15 37 72 108 137 138 179 196 181 187 182 174 138 130 107 61 16 -9 -23 -74 -106 -120 -144 -173 -203 -189 -186 -195 -191 -151 -106 -112 -66 -11 12 40
$$ packed form
5763hK9M2L3M7J2K3M1lj3mJj6m9k4j3n2o0j6k2n4l9j6pl3k0J4Rj9K8N7J7J5N1
5796d9N3L0K4M2O0J0nL5K6j9k6K0qn1m5om1p1l1k0k0p4j3J3l2k5J1L0pLM8M9J6
5829g3L0P0L2OJ9O8K3qJ6M3j8l5KLm0m6j5k9n6n1l2j1n3k1pmk1qK9RQL0N5K3K2
5864d0N1M3J9L9L1K9J0OK6j2j0k4kl6l6k7l3l4n9k7j9k8l8jj0l0RK0%J7L4L6M1
5897e5K5M2N7J5K1M8L0JJ8OJk2k2pm3l9k3l4l9n8k0qm3l4mkj1j2L7J1%K9O1L1
5931d3JN2O3J5J5M0N3j5LJ3Nj6l9Oj3o1n5pj7p7l4j0j1n7jMjrLM6J0L1K6M4J9
5966a7L5M2M8PL6K1J4JKOj0n7Oj4n4m3k3qn2l7j4k7l4l4J5J4j9RM5J9J0M3M6L9
6000A5K2L5L6K9JM1J7j5Onql6qk3m6m5k5j4n1l2j4k4k9l0J4LrMM0M5oM6N5K3K8
$$ plain form
6035 40 86 131 133 146 180 195 192 188 194 168 144 111 97 67 17 -18 -33 -71 -132 -145 -146 -166 -193 -199 -165 -178 -185 -145 -109 -99 -68 -15 32 40
6069 40 68 124 148 160 169 192 203 178 172 178 131 103 86 58 14 -25 -49 -91 -126 -143 -147 -172 -201 -193 -175 -155 -157 -131 -95 -70 -53 -7 31
6102 31 47 70 120 145 149 169 185 191 172 160 150 135 98 73 48 4 -30 -51 -86 -131 -155 -148 -168 -195 -193 -175 -159 -174 -132 -70 -75 -47 1
6135 1 56 58 80 116 150 153 172 195 191 166 157 158 134 83 58 42 5 -45 -69 -85 -142 -163 -164 -171 -191 -192 -176 -156 -156 -136 -88 -50 -47 -6 51 75
6171 75 72 115 163 173 161 176 189 181 155 151 127 86 46 28 -8 -43 -85 -83 -114 -158 -156 -159 -179 -175 -162 -152 -141 -129 -86 -33 -27 -3 36 86
6205 86 87 126 161 167 158 181 189 171 150 140 121 90 49 10 -1 -40 -81 -99 -116 -149 -168 -178 -164 -173 -168 -134 -129 -116 -67 -35 -7 5 48 84
6239 84 94 128 158 177 172 161 185 175 139 122 116 87 44 20 -9 -39 -80 -107 -117 -156 -160 -160 -171 -182 -166 -133 -125 -101 -59 -29 -17 6 52
6272 52 101 108 112 148 177 160 165 178 170 142 117 113 84 30 7 -13 -41 -73 -107 -129 -142 -163 -168 -166 -171 -179 -138 -117 -103 -71 -28 -7 29 59 96
$$ packed form
6035D0M6M5KJ3L4J5lmOk6k4l3j4l0n0l5j5l8o1j3jk0k7oL4j3pM0L6J0L1N3M7Q
6069D0K8N6K4J2RK3J1k5oOm7k8j7k8m4l9k4m2l5j7mk5k9QJ8K0kK6L6K5J7M6L8
6102C1J6K3N0K5MK0J6Oj9j2j0j5l7k5k5m4l4k1l5m5k4Pk0k7KJ8J6j5M2O2nK8M8
6135AN5KK2L6L4LJ9K3mk5rJk4n1k5j6l7n0k4j6n7k1jpk0jJ6K0%K0M8L8LM1N7K4
6171G5lM3M8J0j2J5J3qk6mk4m1m0j8l6l5m2Kl1m4Klk0MJ3J0J1J2M3N3OK4L9N0
6205H6JL9L5OrK3Qj8k1j0j9l1m1l9j1l9m1j8j7l3j9j0J4rNL4NJ3M9L2K8J2M3L6
6239H4J0L4L0J9nj1K4j0l6j7ok9m3k4k9l0m1k7j0l9m%j1j1J6L3QK4M2L0J2K3M6
6272E2M9PML6K9j7NJ3qk8k5mk9n4k3k0k8l2l4k2j3k1nKnqM1K1J4L2M3K1L6L0L7
$$ plain form
6307 96 116 116 148 172 168 152 161 176 133 109 101 73 34 -11 -16 -40 -84 -111 -119 -126 -166 -167 -157 -155 -162 -127 -106 -82 -69 -27 11 36 59 106 135
6342 135 124 138 164 168 152 163 146 118 92 73 73 29 -7 -47 -58 -87 -131 -121 -143 -160 -162 -151 -153 -146 -128 -87 -75 -52 -17 24 36 68
6374 68 96 121 125 140 167 161 145 149 148 131 105 74 64 30 -26 -39 -52 -94 -122 -133 -156 -175 -169 -157 -150 -144 -133 -84 -68 -49 -12 25 47 57
6408 57 92 128 132 136 154 184 158 138 141 129 88 68 53 31 -26 -53 -61 -96 -140 -138 -147 -156 -161 -161 -159 -150 -123 -93 -59 -41 -7 37 54 70 102 131
6444 131 139 144 152 179 157 144 129 121 82 46 38 19 -22 -70 -83 -87 -126 -151 -146 -159 -162 -150 -128 -122 -110 -78 -50 -26 -7 40 73 89 106 133
6478 133 162 147 142 161 156 132 118 115 88 41 17 -8 -39 -81 -93 -105 -125 -157 -145 -146 -162 -155 -134 -112 -102 -77 -55 -22 -7 32 78 88
6510 88 104 127 149 152 146 160 171 137 111 106 68 42 21 -9 -52 -71 -94 -99 -132 -151 -144 -143 -152 -139 -124 -103 -108 -78 -35 -17 19 40 81 94
6544 94 102 139 156 152 148 150 150 129 112 106 80 36 7 -13 -43 -78 -96 -103 -136 -148 -157 -149 -145 -146 -129 -93 -82 -77 -33 0 18 40 75 106 113 130 140
$$ packed form
6307I6K0%L2K4mj6RJ5m3k4qk8l9m5nk4m4k7qpm0jJ0KpL5K1K4J3M2L8K5K3M7K9
6342A35j1J4K6Mj6J1j7k8k6j9%m4l6m0j1k9m4J0k2j7kJ1kPJ8M1J2K3L5M1J2L2
6374F8K8K5MJ5K7oj6Mjj7k6l1j0l4n6j3j3m2k8j1k3j9OJ2POJ1M9J6J9L7L7K2J0
6408E7L5L6MMJ8L0k6k0Lj2m1k0j5k2n7k7ql5m4Krrn%KRK7L0L4J8L4M4J7J6L2K9
6444A31QNQK7k2j3j5ql9l6qj9m1m8j3ml9k5Nj3lJ2K2OJ2L2K8K4J9M7L3J6J7K7
6478A33K9j5nJ9nk4j4lk7m7k4k5l1m2j2j2k0l2J2jj6PK1K2J0K5K2L3J5L9M6J0
6510H8J6K3K2LoJ4J1l4k6nl8k6k1l0m3j9k3nl3j9PJrJ3J5K1nL0M3J8L6K1M1J3
6544I4QL7J7mmK%k1j7ok6m4k9k0l0l5j8pl3j2rQMjJ7L6J1NM4L3J8K2L5L1PJ7J0
$$ plain form
6581 140 150 136 143 154 130 91 87 65 31 -5 -15 -38 -67 -106 -115 -116 -137 -150 -146 -140 -140 -116 -92 -77 -64 -28 13 33 57 84 119 112 133 148
6615 148 146 150 136 133 115 96 86 70 26 -15 -35 -47 -74 -107 -116 -123 -140 -152 -143 -135 -150 -127 -88 -61 -56 -39 4 31 33 75 105 111 122 146 146
6650 146 140 141 138 115 79 67 54 34 -16 -31 -49 -77 -121 -115 -118 -131 -155 -142 -127 -130 -120 -86 -64 -52 -29 14 47 57 73 107 123 108 137
6683 137 165 136 129 119 121 91 59 47 29 -15 -41 -69 -74 -114 -129 -129 -144 -162 -149 -118 -114 -113 -80 -51 -39 -17 17 54 70 88 103 130 124
6716 124 127 147 137 120 100 106 83 56 27 17 -11 -55 -60 -83 -108 -129 -120 -134 -152 -142 -120 -110 -104 -86 -44 -22 -16 31 64 67 87 120 136
6749 136 130 134 147 149 125 117 104 74 45 22 5 -27 -56 -82 -78 -123 -129 -126 -138 -146 -141 -123 -107 -102 -84 -40 -22 -6 27 52 78 84 102 128 134 135
6785 135 134 148 121 106 89 89 54 30 4 -18 -55 -80 -79 -112 -122 -127 -132 -137 -142 -129 -93 -94 -83 -39 -15 -3 25 52 78 90 103 125 144 130
6819 130 124 136 122 100 84 55 38 25 -13 -31 -58 -78 -87 -108 -118 -132 -129 -133 -130 -115 -84 -79 -66 -35 -7 9 38 60 92 103 114 133 137
$$ packed form
6581A40J0j4PJ1k4l9mk2l4l6j0k3k9l9rjk1j3MO%K4K4J5J3L6M1K0K4K7L5pK1J5
6615A48kMj4lj8j9j0j6m4m1k0j2k7l3rpj7j2RQj5K3L9K7NJ7M3K7KM2L0OJ1K4%
6650A46oJlk3l6j2j3k0n0j5j8k8m4Olj3k4J3J5lJ0L4K2J2K3M3L3J0J6L4J6j5K9
6683A37K8k9pj0Kl0l2j2j8m4k6k8nm0j5%j5j8J3L1MJL3K9J2K2L4L7J6J8J5K7o
6716A24LK0j0j7k0Ok3k7k9j0k8m4nk3k5k1Rj4j8J0K2J0OJ8M2K2OM7L3LK0L3J6
6749A36oMJ3Kk4qj3l0k9k3j7l2k9k6Mm5oLj2qNJ8J6NJ8M4J8J6L3K5K6OJ8K6OJ
6785A35jJ4k7j5j7%l5k4k6k2l7k5Jl3j0nnnnJ3L6jJ1M4K4J2K8K7K6J2J3K2J9j4
6819A30oJ2j4k2j6k9j7j3l8j8k7k0rk1j0j4LmLJ5L1NJ3L1K8J6K9K2L2J1J1J9M
$$ plain form
6852 137 127 110 128 110 88 74 63 33 -2 -20 -43 -63 -77 -86 -106 -139 -144 -135 -124 -110 -112 -90 -76 -69 -36 -9 14 34 54 99 98 101 133
6885 133 145 139 119 125 120 83 60 63 41 4 -39 -27 -58 -87 -108 -113 -128 -135 -127 -120 -124 -107 -87 -65 -52 -45 -4 30 41 61 102 114 105 120 142
6920 142 128 114 110 114 88 60 45 28 3 -34 -43 -59 -91 -104 -105 -124 -128 -131 -130 -119 -105 -86 -55 -40 -21 15 31 58 73 93 107 99 122 126
6954 126 123 104 104 96 70 56 36 24 -7 -43 -64 -76 -96 -117 -123 -127 -128 -131 -115 -114 -94 -80 -52 -36 -14 24 55 64 71 101 102 122 124 131 139 98 99
6991 99 102 76 54 21 12 -8 -47 -67 -75 -104 -111 -125 -123 -128 -135 -114 -101 -92 -71 -53 -24 -9 7 41 62 72 96 119 109 110 126 126 123 93 86 79 44
7028 44 32 8 -14 -45 -62 -72 -80 -106 -114 -125 -113 -127 -118 -86 -86 -64 -40 -26 0 14 47 61 73 90 108 115 120 119 117 107 84 81 71 46 5
7063 5 -10 -21 -49 -79 -88 -88 -116 -115 -107 -121 -119 -100 -90 -77 -58 -42 -8 10 17 41 65 87 98 117 136 122 121 117 108 79 68 65 31 9 -14 -38
7099 -38 -61 -82 -102 -106 -125 -130 -114 -125 -115 -105 -79 -68 -67 -27 -1 15 10 41 79 94 85 111 117 115 101 107 110 86 72 48 18 4 -14 -34 -53
$$ packed form
6852A37j0j7J8j8k2j4j1l0l5j8k3k0j4rk0l3nRJ1J4kK2J4PL3K7K3K0K0M5jLL2
6885A33J2ok0Onl7k3Lk2l7m3J2l1k9k1nj5pQPmJ7K0K2J3PM1L4J1K0M1J2rJ5K2
6920A42j4j4mMk6k8j5j7k5l7rj6l2j3jj9mlJJ1J4J9L1J5J9L6J6K7J5K0J4qK3M
6954A26lj9%qk6j4k0j2l1l6k1j2k0k1omjlJ6JK0J4K8J6K2L8L1RPL0JK0KPQm1J
6991I9Lk6k2l3rk0l9k0qk9pj4KnpK1J3RK1J8K9J5J6L4K1J0K4K3j0JJ6%ll0ppl5
7028D4j2k4k2l1j7j0qk6qj1J2j4RL2%K2K4J4K6J4L3J4J2J7J8PNjkj0k3lj0k5m1
7063Ej5j1k8l0r%k8JQj4KJ9J0J3J9J6L4J8PK4K4K2J1J9J9j4jmrk9j1ll4k2k3k4
7099c8k3k1k0mj9nJ6j1J0J0K6J1JM0K6J6nL1L8J5rK6Okj4OLk4j4k4l0j4j8k0j9
$$ plain form
7134 -53 -90 -78 -104 -110 -126 -106 -111 -110 -100 -82 -74 -60 -40 -10 15 23 55 74 87 97 110 122 122 117 113 101 88 57 50 32 7 -27 -37 -52 -62
7169 -62 -84 -102 -101 -109 -106 -101 -101 -91 -76 -42 -37 -21 5 25 37 57 85 100 99 121 125 127 94 98 97 71 44 22 19 -7 -35 -52 -61 -87 -102 -109 -114 -119
7207 -119 -119 -108 -98 -90 -63 -36 -39 -29 19 30 46 58 77 101 108 103 123 109 103 80 82 78 36 21 10 -21 -40 -61 -69 -83 -98 -118 -110 -115 -124 -109
7243 -109 -97 -88 -80 -53 -31 -33 -1 38 55 62 80 99 109 100 107 110 94 79 86 65 47 22 14 -7 -27 -55 -67 -83 -91 -101 -101 -109 -113 -112 -96 -83 -71
7280 -71 -45 -37 -16 4 26 57 70 81 101 97 85 101 111 88 70 73 60 43 18 -7 -18 -42 -70 -72 -76 -102 -120 -101 -100 -109 -99 -82 -66 -58
7314 -58 -40 -13 2 12 42 61 68 84 97 103 107 109 108 83 71 63 55 31 5 -13 -21 -50 -81 -82 -84 -107 -110 -101 -108 -112 -98 -74 -68 -55 -31 -3 4 28
7352 28 47 70 81 86 93 107 107 84 101 89 74 55 40 25 -2 -25 -20 -61 -73 -87 -84 -107 -112 -111 -99 -108 -94 -74 -58 -40 -27 -4 15 17 46
7387 46 61 82 83 80 86 92 83 87 78 77 52 41 19 3 -8 -25 -52 -75 -78 -80 -94 -105 -106 -96 -93 -95 -68 -61 -35 -19 -5 27 20 39 60 68 80 93
$$ packed form
7134e3l7J2k6oj6K0nJJ0J8QJ4K0L0K5QL2J9J3J0J3J2%nmj2j3l1pj8k5l4j0j5j0
7169f2k2j8JqLN%J0J5L4NJ6K6K0J2K0K8J5jK2MKl3Mjk6k7k2lk6k8j7rk6j5pnn
7207a19%J1J0QK7K7lJ0M8J1J6J2J9K4PnK0j4ok3Kmm2j5j1l1j9k1qj4j5k0QnrJ5
7243a09J2RQK7K2kL2L9J7PJ8J9J0rPLj6j5Pk1j8k5qk1k0k8j2j6qj0%qmJJ6J3J2
7280g1K6QK1K0K2L1J3J1K0mj2J6J0k3j8Lj3j7k5k5j1k4k8kmk6j8J9JrJ0J7J6Q
7314e8J8K7J5J0L0J9PJ6J3OMKjk5j2qqk4k6j8qk9l1jkk3lRpmJ4K4OJ3K4K8PK4
7352B8J9K3J1NPJ4%k3J7j2j5j9j5j5k7k3Nm1j2j4Lk3nJJ2rJ4K0J6J8J3K3J9KK9
7387D6J5K1JlOOrMrjk5j1k2j6j1j7k7k3lkj4j1jJ0LkK7PK6J6J4L2pJ9K1QJ2J3
$$ plain form
7425 93 93 100 97 87 84 61 39 29 15 -12 -39 -40 -61 -74 -95 -95 -100 -106 -114 -106 -89 -95 -67 -48 -32 -12 -6 28 40 50 64 90 100 94 101 111 88
7462 88 69 75 55 39 24 5 -9 -32 -37 -58 -96 -101 -106 -109 -103 -103 -93 -94 -74 -67 -50 -32 -9 0 26 50 64 74 93 96 83 106 93 88 74 70 56
7499 56 29 25 -6 -11 -31 -56 -63 -83 -88 -105 -109 -98 -100 -85 -73 -70 -55 -43 -25 -14 10 34 49 61 72 89 86 81 78 101 75 64 66 38 29 12
7535 12 -3 -9 -30 -72 -62 -65 -86 -100 -95 -93 -105 -95 -80 -58 -54 -19 -13 9 25 33 47 70 74 98 89 82 88 94 76 66 47 46 23 -6 -5 -10 -41 -55
7573 -55 -79 -82 -96 -92 -106 -95 -92 -94 -77 -59 -49 -36 -16 4 18 40 60 67 79 94 99 86 80 96 75 54 48 42 22 -1 -22 -37 -41 -67 -72 -82
7609 -82 -82 -105 -104 -89 -94 -84 -65 -47 -43 -18 -7 14 24 36 52 59 82 82 89 87 93 90 76 58 34 30 18 -21 -23 -26 -32 -71 -77 -74 -90 -92 -100 -72 -76 -72
7649 -72 -56 -44 -38 -21 -6 27 34 48 60 76 80 74 77 83 76 72 65 50 26 19 7 -7 -39 -39 -50 -73 -95 -91 -74 -101 -94 -71 -79 -75 -64 -42 -19 -4
7687 -4 8 20 43 52 70 79 75 72 94 83 90 70 59 57 25 16 2 -11 -28 -47 -64 -64 -83 -94 -92 -101 -95 -92 -66 -66 -63 -43 -23 3 7 28 48 46 56
$$ packed form
7425I3%Plj0lk3k2j0j4k7k7jk1j3k1%noqQJ7oK8J9J6K0OL4J2J0J4K6J0oPJ0k3
7462H8j9Ok0j6j5j9j4k3nk1l8nnlO%J0jK0PJ7J8K3RK6K4J4J0J9Lj3K3j3nj4mj4
7499E6k7ml1nk0k5pk0nj7mJ1kJ5J2LJ5J2J8J1K4K4J5J2J1J7lnlK3k6j1Kk8rj7
7535A2j5ok1m2J0lk1j4NKj2J0J5K2ML5OK2J6QJ4K3MK4rpOOj8j0j9jk3k9Jnl1j4
7573e5k4lj4Mj4J1LkJ7J8J0J3K0K0J4K2K0PJ2J5Nj3oJ6k1k1ook0k3k1j5mk6nj0
7609h2%k3JJ5nJ0J9J8MK5J1K1J0J2J6PK3%PkOlj4j8k4mj2l9klol9oLj6kqK8mM
7649g2J6J2OJ7J5L3PJ4J2J6MoLOpmpj5k4pj2j4l2%j1k3k2MJ7k7PK3qMJ1K2K3J5
7687dJ2J2K3RJ8RmlK2j1Pk0j1kl2rj4j3j7j9j7%j9j1KrOLK6%LK0K0K6MK1K0kJ0
$$ plain form
7726 56 73 80 81 80 88 75 57 52 49 22 9 -4 -11 -23 -43 -53 -75 -82 -83 -88 -85 -90 -64 -65 -63 -60 -35 -14 -7 -1 29 47 53 51 70 80 64 77 68 71 57
7767 57 43 28 18 3 -11 -19 -39 -55 -51 -70 -87 -90 -76 -77 -74 -72 -65 -43 -45 -25 -8 -10 11 18 47 67 64 76 79 76 61 67 70 52 42 23 14 -6
7805 -6 -10 -30 -52 -59 -55 -78 -74 -101 -85 -89 -93 -78 -57 -50 -45 -21 0 1 15 29 54 71 68 80 94 80 80 71 67 46 29 23 18 0 -25 -38 -36 -65 -62
7844 -62 -72 -91 -88 -91 -84 -83 -65 -53 -37 -26 -24 4 18 26 38 55 62 71 78 83 66 78 55 62 51 33 18 3 -14 -19 -26 -51 -55 -77 -64 -74 -96
7881 -96 -77 -73 -52 -60 -39 -26 -22 -13 7 19 37 44 65 67 73 74 77 84 60 52 54 29 29 8 -5 -23 -33 -39 -50 -62 -77 -70 -76 -79 -75 -73 -54 -51 -41 -29
7921 -29 -12 4 5 23 35 48 67 75 70 72 86 82 66 53 54 43 13 -4 -10 -17 -39 -57 -56 -73 -69 -72 -83 -84 -83 -75 -61 -60 -56 -39 -19 -10 10 23 35
7960 35 47 58 69 76 81 65 75 58 47 54 44 26 -2 -4 -19 -26 -42 -56 -59 -75 -81 -78 -79 -76 -77 -53 -42 -39 -28 -14 5 -1 26 42 47 53 67 71
7998 71 64 64 66 52 46 35 24 17 -2 -8 -15 -38 -60 -61 -54 -68 -66 -80 -63 -71 -66 -56 -34 -23 -19 3 9 18 38 41 52 67 69 66 74 56 63 59 41 28 25
$$ packed form
7726E6J7PJjQj3j8nlk7j3j3pj2k0j0k2pjnLnK6jKLK5K1POL0J8OkJ9J0j6J3rLj4
7767E7j4j5j0j5j4qk0j6Mj9j7lJ4jLKPK2kK0J7kK1PK9K0lJ2Llj5OLj8j0j9rk0
7805fmk0k2pMk3Mk7J6mmJ5K1PNK4K1JJ4J4K5J7lJ2J4j4%rmk1j7onj8k5j3Kk9L
7844f2j0j9LlPJJ8J2J6J1KK8J4QJ2J7PRPNj7J2k3Pj1j8j5j5j7npk5mk2J3j0k2
7881i6J9MK1qK1J3MRK0J2J8PK1KOJLPk4qKk5%k1j3j8j0oj1j2j5PolMKJ9LJ0J2
7921b9J7J6JJ8J2J3J9QnKJ4mj6j3Jj1l0j7opk2j8Jj7Mlj1jJQJ4JMJ7K0RK0J3J2
7960C5J2J1J1PNj6J0j7j1Pj0j8k8kj5pj6j4lj6oLjLjK4J1LJ1J4J9oK7J6NOJ4M
7998G1p%Kj4oj1j1pj9opk3k2jPj4Kj4J7qNJ0K2J1MK2ORK0LJ1J5KlQj8Pmj8j3l
$$ plain form
8039 25 4 1 -19 -26 -41 -58 -64 -64 -75 -68 -63 -67 -73 -43 -50 -30 -25 -7 4 20 24 39 55 58 60 67 69 69 59 67 68 44 39 18 12 -12 -12 -28 -35 -50 -68
8080 -68 -69 -63 -72 -78 -63 -58 -58 -51 -28 -26 -15 4 19 37 25 42 51 64 53 64 72 62 54 52 45 23 17 8 -11 -34 -36 -48 -56 -67 -72 -57 -61 -66 -67 -52 -52
8121 -52 -42 -12 -9 -8 8 21 32 35 56 57 57 69 67 72 58 52 46 23 9 13 -5 -26 -42 -37 -45 -71 -77 -52 -68 -73 -71 -57 -53 -42 -36 -30 3 4 20 35
8161 35 24 49 51 62 69 64 65 60 56 36 27 31 16 -14 -11 -10 -37 -40 -58 -54 -69 -78 -65 -71 -60 -66 -55 -62 -40 -27
$$ packed form
8039B5k1lk0pj5j7o%j1PNmoL0pK0NJ8J1J6MJ5J6LKPK%j0QJk4nk1ok4%j6pj5j8
8080f8jOroJ5N%PK3KJ1J9J5J8j2J7RJ3j1J1Qj0qkpk2orj9k3kj2qj1nJ5mnjJ5%
8121e2J0L0LJJ6J3J1LK1J%J2kNj4ook3j4Mj8k1j6Nqk6oK5j6nKJ4MJ1OOL3JJ6J5
8161C5j1K5KJ1PnJnmk0rMj5l0LJk7lj8Mj5rJ3oJ1oJ1pK2J3
8191b7
$$ Imaginary data points
##PAGE= N=2
##DATA TABLE= (X++(I..I)), XYDATA
$$ plain form
0 0 0 0 0 0 0 0 0 0 0 0 0 0 0 0 0 -1 8 -8 8 -8 8 -10 16 -16 18 -24 25 -32 34 -41 48 -56 62 -70 80 -89 98 -111
38 -111 123 -139 155 -171 189 -210 232 -258 282 -314 346 -379 419 -460 508 -559 617 -685 758
57 758 -847 947 -1066 1208 -1382 1601 -1888 2280 -2847 3756 -5428 9556 -41859 -37150 32471
72 32471 -41507 -80928 -13911 51769 -3813 -48094 7179 65332 19595 -27099 9776 55526
84 55526 20938 -19545 3117 37276 17353 -8289 5299 26296 17972 8206 12881 14807 9558
97 9558 12375 8443 -11197 -18380 -2377 -7640 -42564 -49519 -15435 -11130 -51708 -56209 -3660 14609
111 14609 -28349 -35761 25902 52949 4028 -15436 42927 72029 16285 -18045 31662 62630
123 62630 7241 -35441 7608 44069 -1890 -44875 -7223 33698 -162 -40737 -11988 26577
$$ packed form
0@%%%%%%%%%%%%%%%jRj6J6j6J6j8K6l2L4m2M9n7O6p5Q9j04J18j32J50j69J87k09
38a11K34k62K94l26L60l99M42m90N40n96O60p25P98q79R68j067J176j302J443
57G58j605J794k013K274k590K983l489M168n127O603r184J4984n1415M709O9621
72C2471p3978l9421O7017O5680n5582m4281N5273N8153m5737m6694L6875M5750
84E5526l4588m0483K2662L4159j9923k5642J3588K0997q324r766M675J926n249
97I558K817l932j9640p183J6003n263l4924o955L4084M305m0578m501N2549J8269
111A4609m2958p412O1663K7047m8921j9464N8363K9102n5744l4330M9707L0968
123F2630n5389m2682M3049L6461m5959m2985L7652M0921l3860m0575K8749L8565
$$ plain form
135 26577 1839 -36124 -19049 11718 -5294 -36521 -27572 -4255 -11501 -29112 -21705 -4438 -2285
148 -2285 -3900 4079 11870 16290 25588 31150 23382 20943 34966 36745 12429 290 18612 21869
162 21869 -12037 -29758 -3398 8660 -26450 -45785 -10960 11685 -21656 -43666 -6023 22814
174 22814 -9969 -37281 -2883 27909 -3434 -34377 -4545 27608 1802 -27593 -1165 31741
186 31741 13661 -11479 9941 38849 25430 3100 15658 34281 21382 1245 4559 11449
198 11449 -517 -14278 -14476 -14939 -22212 -23798 -20790 -24423 -25837 -14397 -6726 -14273 -14346 4776 13955
213 13955 -566 -4931 16311 25141 3832 -6000 15912 26330 2686 -10164 12880 27002 4633
226 4633 -10098 12064 28230 7054 -10919 6406 21332 873 -20272 -8727 4770 -12161
$$ packed form
135B6577k4738l7963J7075L0767j7012l1227Q949K3317p246j7611P407J7267K153
148b285j615P979P791M420R298N562p768k439J4023J779k4316j2139J8322L257
162B1869l3906j7721K6360J2058l5110j9335L4825K2645l3341k2010L7643K8837
174B2814l2783k7312L4398L0792l1343l0943K9832L2153k5806k9395K6428L2906
186C1741j8080k5140K1420K8908j3419k2330J2558J8623j2899k0137L314O890
198A1449j1966j3761j98m63p273j586L008l633j414J1440P671p547p3J9122R179
213A3955j4521m365K1242Q830k1309r832K1912J0418k3644j2850K3044J4122k2369
226D633j4731K2162J6166k1176j7973J7325J4926k0459k1145J1545J3497j6931
$$ plain form
238 -12161 -32115 -23068 -8107 -17288 -31023 -21357 -4313 -5460 -12542 -3727 11194 13144 8783 13023
252 13023 20703 20601 16414 15397 14932 12111 9831 7482 2320 -977 1561 1947 -5102 -8479 -1367 2212
268 2212 -6933 -12657 -3746 1671 -9994 -19190 -9695 -1821 -13630 -24105 -12619 -110 -8771 -17999
282 -17999 -4194 12491 6919 -2089 10761 27230 21175 9222 16929 28798 19991 4759 7085
295 7085 14450 5030 -9375 -8452 -2347 -8624 -17913 -15058 -8649 -11133 -14743 -10400 -5708 -7069 -7318
310 -7318 -3471 -2706 -4958 -3012 537 -1794 -4401 791 5883 2443 408 8711 15454 10669 7486
325 7486 16043 21762 13663 6809 12525 15448 4102 -5836 -2390 -299 -11141 -20309 -15802 -11058 -17504
340 -17504 -22638 -15562 -7688 -9599 -11593 -4303 3485 2962 1108 5436 10255 8992 6177 7357 9422
$$ packed form
238a2161j9954R047J4961r181j3735R666J7044j147p082Q815J4921J950m361M240
252A3023P680j02m187j017m65k821k280k349n162l297K538L86p049l377P112L579
268B212r145n724Q911N417j1665r196R495P874j1809j0475J1486J2509q661r228
282a7999J3805J6685n572r008J2850J6469o055j1953P707J1869q807j5232K326
295G085P365r420j4405R23O105o277r289K855O409k484l610M343M692j361k49
310g318L847P65k252J946L549k331k607N192N092l440k035Q303O743m785l183
325G486Q557N719q099o854N716K923j1346r938L446K091j0842r168M507M744o446
340a7504n134P076P874j911j994P290P788n23j854M328M819j263k815J180K065
$$ plain form
355 9422 8224 6031 6064 7080 7091 6545 6314 6316 6469 6265 4736 2433 957 -205 -3183 -7409 -9994 -10753
373 -10753 -12653 -15881 -16938 -14773 -12848 -12776 -11263 -6126 -955 1087 2737 7565 12634 13292 11847 13444
389 13444 16069 14065 9195 7901 9140 6387 695 -910 1201 -199 -4757 -5367 -2245 -2507 -6283
404 -6283 -6818 -4029 -4545 -8367 -9246 -7142 -7706 -10484 -10228 -7428 -6534 -6632 -3982 62 2342 4257 7992
421 7992 11283 12333 13510 15503 15368 13005 11716 11037 7574 2729 518 -680 -4575 -8837 -9264 -8402
437 -8402 -10463 -12471 -10339 -7484 -8043 -8677 -5702 -2794 -3414 -4112 -1767 294 -585 -1156 968 2830 2673
454 2673 3179 5542 7430 7957 8981 10552 11044 10622 10364 9410 7149 4872 2946 -141 -3982 -6424 -7998
471 -7998 -10649 -13259 -13365 -12324 -12554 -12484 -9768 -6464 -5083 -3689 -267 2886 3639 4245 6383 7720 6981
$$ packed form
355I422j198k193L3J016J1n46k31KJ53k04j529k303j476j162k978m226k585p59
373a0753j900l228j057K165J925P2J513N137N171K042J650M828N069O58j445J597
389A3444K625k004m870j294J239k753n692j605K111j400m558o10L122k62l776
404f283n35K789n16l822q79K104n64k778K56K800Q94r8K650M044K280J915L735
421G992L291J050J177J993j35k363j289o79l463m845k211j198l895m262m27Q62
437h402k061k008K132K855n59o34K975K908o20o98K345K061q79n71K124J862j57
454B673N06K363J888N27J024J571M92m22k58r54k261k277j926l087l841k442j574
471g998k651k610j06J041k30P0K716L304J381J394L422L153P53O06K138J337p39
$$ plain form
488 6981 6526 7362 7354 6112 5699 6180 5755 4810 4872 5029 3907 2763 2546 1504 -1008 -2873 -3617 -5564 -8621
507 -8621 -10002 -9865 -10945 -12567 -11679 -9186 -8154 -7489 -4376 -305 1745 3048 6162 9341 10014 9860
523 9860 10990 11635 10099 8259 7562 6388 3986 2132 1235 -146 -1881 -2579 -2851 -3915 -4765 -4505 -4651
540 -4651 -5984 -6557 -5903 -6214 -7680 -7706 -6233 -5949 -6561 -5175 -2278 -856 -251 2303 5786 7319 7812
557 7812 9710 11776 11576 10366 10157 9630 7266 4573 2899 913 -1972 -4136 -5283 -6833 -8364 -8489
573 -8489 -8052 -8482 -8456 -6797 -5416 -5559 -5031 -2800 -1500 -2105 -1681 675 1830 1029 1606 4185 5414 4770
591 4770 5450 7857 8753 7649 7530 8582 8030 5744 4125 3337 1428 -1519 -3737 -5208 -6962 -8712
607 -8712 -9743 -10205 -10239 -9581 -8587 -7651 -6104 -3744 -1803 -728 870 3273 4629 4630 5182 6649 7030 6005
$$ packed form
488F981m55Q36qj242m13M81m25r45O2J57j122j144k17j042k512j865p44j947l057
507h621j381J37j080j622Q88K493J032O65L113M071K050J303L114L179O73j54
523I860J130O45j536j840o97j174k402j854q97j381j735o98k72j064q50K60j46
540d651j333n73O54l11j466k6J473K84o12J386K897J422O05K554L483J533M93
557G812J898K066k00j210k09n27k364k693j674j986k885k164j147j550j531j25
573h489M37m30K6J659J381j43N28K231J300o05M24K356J155q01N77K579J229o44
591D770O80K407Q96j104j19J052n52k286j619p88j909k947k218j471j754j750
607h712j031m62l4O58R94R36J547K360J941J075J598K403J356JN52J467L81j025
$$ plain form
625 6005 5692 6452 6310 5015 4421 4729 4337 3086 2211 1766 839 -562 -1914 -3278 -4564 -5566 -6721
642 -6721 -8205 -8900 -8361 -8152 -8698 -7883 -5221 -3412 -3092 -1320 2447 4572 4390 5584 8688 9630 7796
659 7796 7404 9034 8400 5198 3807 4518 3297 19 -1224 -470 -1537 -4004 -4460 -3569 -4383 -6002 -5818
676 -5818 -5042 -5819 -6583 -5695 -4940 -5467 -5012 -3025 -2010 -2030 -269 2691 3690 3618 5707 8504 8408 7131 8310
695 8310 9823 7890 4948 4890 5146 2133 -1477 -1870 -1649 -4303 -7117 -6662 -5542 -6909 -8299 -6891 -5004
712 -5004 -5239 -5611 -3960 -2086 -1845 -1766 -356 1131 1615 2024 3059 4082 4711 5299 5837 6216 6557 6782
730 6782 6390 5599 5033 4385 2959 1111 -288 -1432 -3106 -5010 -6195 -6711 -7326 -8057 -8184 -7430 -6399
747 -6399 -5677 -4912 -3394 -1400 -28 584 1789 3761 4779 4414 4622 6126 6627 5237 4575 5716 5882
$$ packed form
625F005l13P60j42j295n94L08l92j251q75m45r27j401j352j364j286j002j155
642f721j484o95N39K09n46Q15K662J809L20J772L767K125j82J194L104R42j834
659G796l92J630o34l202j391P11j221l278j243P54j067k467m56Q91q14j619J84
676e818P76p77p64Q88P55n27M55J987J015k0J761K960R99p2K089K797r6j277J179
695H310J513j933k942n8K56l013l610l93K21k654k814M55J120j367j390J408J887
712e004k35l72J651J874K41P9J410J487M84M09J035J023O29N88N38L79L41K25
730F782l92p91n66o48j426j848j399j144j674j904j185n16o15p31j27P54J031
747f399P22P65J518J994J372O12J205J972J018l65K08J504N01j390o62J141J66
$$ plain form
764 5882 3868 2698 3628 3561 1073 -533 178 -194 -2930 -4565 -3908 -4241 -6574 -7583 -6341 -6022 -7179
781 -7179 -6808 -4628 -3476 -3407 -1860 745 1924 2427 4218 6039 6117 5999 7164 7587 6095 5154 5680 4951
799 4951 2462 1304 1834 731 -2029 -2797 -1777 -2724 -5183 -5327 -3807 -4447 -6458 -6042 -4060 -4275 -5619
816 -5619 -4539 -2174 -1810 -2311 -678 1879 2569 2540 4062 5982 6276 5981 6621 7173 6448 5420 4880 4031
834 4031 2533 1175 67 -1379 -2816 -3631 -4331 -5360 -5961 -5738 -5611 -5929 -5623 -4536 -3811 -3598 -2862 -1523
852 -1523 -573 -150 665 1898 2783 3253 3818 4530 5111 5421 5450 5348 5339 5218 4432 3277 2600 2070 619 -1286
872 -1286 -2168 -2569 -3957 -5654 -5939 -5414 -6046 -6935 -6126 -4509 -4256 -4336 -2749 -644 -84 79 1745 3551
890 3551 3686 3539 4662 5664 5147 4589 5130 5232 4127 3375 3448 2816 1330 540 327 -830 -2427 -2913
$$ packed form
764E882k014j170R30o7k488j606P11l72k736j635O57l33k333j009J242L19j157
781g179L71K180J152O9J547K605J179N03J791J821P8j18J165M23j492r41N26p29
799D951k489j158N30j103k760p68J020r47k459j44J520o40k011M16J982k15j344
816e619J080K365L64n01J633K557O90k9J522J920K94k95O40N52p25j028n40q49
834D031j498j358j108j446j437q15p00j029o01K23J27l18L06J087P25K13P36J339
852a523R50M23Q15J233Q85M70N65P12N81L10K9j02rj21p86j155o77n30j451j905
872a286q82m01j388j697k85N25o32q89Q09J617K53q0J587K105N60J63J666J806
890C551J35j47J123J002n17n58N41J02j105p52P3o32j486p90k13j157j597m86
$$ plain form
908 -2913 -3076 -4303 -5501 -5263 -4914 -5736 -6127 -4862 -3755 -3921 -3457 -1440 111 259 1045 3125 4335
925 4335 4121 4499 5848 6174 5250 4885 5233 4652 3235 2413 2087 1083 -334 -1163 -1685 -2627 -3511 -3895 -4263
944 -4263 -4775 -4910 -4733 -4794 -4772 -4102 -3340 -3043 -2522 -1261 -97 401 1173 2614 3660 3889 4344 5299 5675
963 5675 5255 5017 5086 4559 3505 2691 2003 895 -332 -1231 -2149 -3155 -3849 -4210 -4758 -5228 -4991 -4613 -4717
982 -4717 -4571 -3540 -2604 -2440 -1921 -420 717 867 1401 2914 3805 3577 3835 4929 5249 4494 4238 4649
1000 4649 4214 2966 2273 2007 992 -471 -1249 -1781 -2903 -3903 -4165 -4465 -5138 -5232 -4635 -4465 -4564 -3700 -2373
1019 -2373 -1940 -1692 -265 1337 1605 1709 3127 4368 4023 3657 4661 5348 4317 3433 3951 3959 2406 1238
1037 1238 1383 932 -799 -1893 -1833 -2396 -3812 -4315 -3998 -4339 -5049 -4725 -3915 -3885 -3773 -2600 -1472 -1228 -593
$$ packed form
908b913j63j227j198K38L49q22l91J265J107j66M64K017J551J48P86K080J210
925D335k14L78J349L26r24l65L48n81j417q22l26j004j417q29n22r42q84l84l68
944d263n12j35J77o1K2O70P62K97N21J261J164M98P72J441J046K29M55R55L76
963E675m20k38O9n27j054q14o88j108j227q99r18j006o94l61n48m70K37L78j04
982d717J46J031R36J64N19J501J137J50N34J513Q91k28K58J094L20p55k56M11
1000D649m35j248o93k66j015j463p78n32j122j000k62l00o73r4N97J70r9Q64J327
1019b373M33K48J427J602K68J04J418J241l45l66J004O87j031q84N18Qj553j168
1037A238J45m51j731j094O0n63j416n03L17l41p10L24Q10L0J12J173J128K44O35
$$ plain form
1056 -593 1100 2156 2103 2742 4268 4716 3967 4154 5208 4867 3363 3048 3594 2684 718 146 490 -577
1074 -577 -2490 -2913 -2419 -3188 -4555 -4548 -3719 -3920 -4586 -4082 -2924 -2580 -2577 -1716 -376 281 673 1601 2652 3207
1094 3207 3530 4051 4434 4442 4336 4264 3904 3273 2703 2167 1302 252 -541 -1111 -1957 -2963 -3509 -3569 -3878 -4473
1114 -4473 -4555 -3860 -3488 -3720 -3404 -2103 -1144 -1211 -833 804 1987 1733 1822 3363 4372 3605 3149 4329 4952
1133 4952 3540 2485 3250 3395 1467 2 522 414 -1683 -3031 -2370 -2422 -4139 -4816 -3714 -3450 -4528
1150 -4528 -4364 -2725 -2238 -2783 -1831 104 432 88 1468 3177 2905 2356 3719 4868 3711 2775 4029
1167 4029 4552 2589 1292 2473 2551 -42 -1427 -125 -203 -2927 -4017 -2367 -2274 -4649 -5168 -3004 -2552
1184 -2552 -4358 -4185 -1631 -842 -2182 -1513 1173 1910 807 1571 3783 4006 2819 3314 4720 4255 2788
$$ packed form
1056e93J693J056n3O39J526M48p49J87J054l41j504l15N46r10j966n72L44j067
1074e77j913m23M94p69j367PQ29k01o66N04J158L44LQ61J340O57L92R28J051N55
1094C207L23N21L83Qj06p2l60o31n70n36q65j050p93n70q46j006n46o0l09n95
1114d473q2O95L72k32L16J301R59o7L78J637J183k54Q9J541J009p67m56J180O23
1133D952j412j055P65J45j928j465N20j08k097j348O61n2j717o77J102K64j078
1150d528J64J639M87n45R52J935L28l44J380J709k72n49J363J149j157r36J254
1167D029N23j963j297J181P8k593j385J302p8k724j090J650R3k375n19K164M52
1184b552j806J73K554P89j340O69K686P37j103P64K212K23j187M95J406m65j467
$$ plain form
1201 2788 2949 3606 2446 869 898 1050 -473 -1910 -1618 -1553 -3032 -3954 -3146 -2849 -4042 -4354 -2945 -2259
1219 -2259 -3171 -3028 -1078 -68 -840 -530 1633 2683 1749 1831 3759 4492 3155 2689 4155 4454 2598
1236 2598 1563 2571 2553 343 -1016 -188 -233 -2344 -3529 -2505 -2262 -3925 -4548 -3123 -2519 -3645 -3655
1253 -3655 -1844 -1017 -1799 -1325 689 1348 588 1312 3164 3255 2241 2979 4392 3700 2275 2938 3928 2423
1271 2423 588 1280 1957 -152 -2112 -1158 -459 -2735 -4391 -2849 -1860 -3914 -5024 -2810 -1415 -3172
1287 -3172 -3721 -972 616 -1001 -1220 1673 3014 1321 1144 3673 4388 2443 2159 4117 4107 1886 1485
1304 1485 2912 2291 -59 -377 731 -327 -2485 -2364 -1361 -2525 -4121 -3384 -2218 -3230 -4183 -2722
1320 -2722 -1328 -2188 -2625 -596 936 44 -154 2028 3297 2115 1777 3660 4412 2769 2069 3491 3739
$$ packed form
1201B788J61O57j160j577K9J52j523j437K92O5j479r22Q08K97j193l12J409O86
1219b259r12J43J950J010p72L10K163J050r34Q2J928P33j337m66J466K99j856
1236B598j035J008j8k210j359Q28m5k111j185J024K43j663o23J425O04j126j0
1253c655J811Q27p82M74K014O59p60P24J852R1j014P38J413o92j425O63R90j505
1271B423j835O92O77k109j960R54O99k276j656J542R89k054j110K214J395j757
1287c172n49K749J588j617k19K893J341j693j77K529P15j945k84J958j0k221m01
1304A485J427o21k350l18J108j058k158J21J003j164j596P37J166j012r53J461
1320b722J394q60m37K029J532q92j98K182J269j182l38J883P52j643p00J422K48
$$ plain form
1337 3739 1691 635 1687 1668 -509 -1626 -670 -657 -2579 -3447 -2331 -2075 -3489 -3917 -2545 -1960 -2871
1354 -2871 -2890 -1269 -443 -1022 -733 935 1693 1167 1530 2968 3329 2534 2681 3728 3469 2206 2128 2767 1941
1373 1941 295 137 657 -496 -2206 -2071 -1337 -2451 -3893 -3180 -2001 -2892 -3940 -2626 -1051 -1762 -2524
1390 -2524 -803 959 205 -449 1398 2972 1972 1216 2897 4018 2633 1712 3058 3663 1861 777
1406 777 1826 1909 -139 -1142 -216 -450 -2395 -2996 -1920 -2165 -3703 -3603 -2203 -2293 -3314 -2546 -835 -853
1424 -853 -1526 -303 1410 1176 579 1859 3250 2573 1790 2869 3744 2570 1565 2390 2792 1281 149
1441 149 815 946 -684 -1717 -1072 -998 -2416 -3132 -2326 -2084 -3112 -3354 -2272 -1773 -2330 -2091 -826 -155
1459 -155 -365 93 1329 1884 1693 2030 2883 3059 2595 2583 2940 2663 1872 1541 1546 1001 43 -368 -400 -967 -1815
$$ packed form
1337C739k048j056J052j9k177j117R56J3j922q68J116K56j414m28J372N85r11
1354b871j9J621Q26n79K89J668P58n26L63J438L61p95J47J047k59j263p8O39q26
1373A941j646j58N20j153j710J35P34j114j442P13J179q91j048J314J575p11p62
1390b524J721J762p54o54J847J574j000p56J681J121j385r21J346O05j802j084
1406G77J049Q3k048j003R26k34j945o01J076k45j538J00J400r0j021P68J711j8
1424h53o73J223J713k34n97J280J391o77p83J079Q75j174j005Q25M02j511j132
1441A49O66J31j630j033O45P4j418p16Q06K42j028k42J082M99n57K39J265O71
1459a55k10M58J236N55j91L37Q53J76m64j2L57k77p91l31Nn45r58m11l2n67q48
$$ plain form
1480 -1815 -2056 -1875 -2205 -2823 -2746 -2203 -2240 -2580 -2180 -1298 -1101 -1269 -622 463 725 551 1225 2281 2351 1942
1500 1942 2420 3189 2854 2066 2226 2597 1827 727 672 801 -214 -1323 -1289 -1164 -2068 -2863 -2449 -2106 -2726
1519 -2726 -3020 -2182 -1593 -1953 -1829 -708 -97 -374 -34 1129 1539 1170 1520 2483 2559 1943 2172 2825 2462
1538 2462 1606 1659 1973 1237 208 140 225 -703 -1656 -1624 -1533 -2306 -2901 -2526 -2206 -2622 -2720 -1952 -1398 -1461 -1166 -211
1560 -211 388 398 807 1630 1955 1836 2083 2548 2492 2115 2101 2188 1804 1266 1081 899 362 -198 -465 -718 -1229
1581 -1229 -1650 -1815 -1967 -2257 -2376 -2315 -2235 -2162 -1946 -1621 -1269 -864 -397 50 531 1042 1458 1753 2060 2381 2482
1602 2482 2393 2360 2347 2048 1573 1313 1076 509 -81 -343 -612 -1163 -1596 -1647 -1761 -2128 -2271 -2017 -1913 -2099 -1925
1623 -1925 -1404 -1184 -1186 -755 -54 205 274 836 1515 1640 1611 2079 2532 2312 2017 2238 2290 1684 1125 1091 836 -12
$$ packed form
1480a815k41J81l30o18P7N43l7l40M00Q82J97j68O47J085K62j74O74J056P0m09
1500A942M78P69l35p88J60L71p70j100n5J29j015j109L4J25r04p95M14L43o20
1519b726k94Q38N89l60J24J121O11k77L40J163M10l69L50R63P6o16K29O53l63
1538B462q56N3L14p36j029o8Q5r28r53L2R1p73n95L75L20m16r8P68N54o3K95R55
1560b11N99J0M09Q23L25j19K47M65n6l77j4Q7l84n38j85j82n37n60k67k53n11
1581a229m21j65j52k90j19O1Q0P3K16L25L52M05M67M47M81N11M16K95L07L21J01
1602B482q9l3j3k99m75k60k37n67n90k62k69n51m33n1j14l67j43K54J04j86J74
1623a925N21K20kM31P01K59O9N62O79J25k9M68M53k20k95K21N2o06n59l4k55q48
$$ plain form
1645 -12 -629 -710 -1013 -1744 -2083 -1933 -2054 -2446 -2364 -1902 -1815 -1863 -1424 -799 -640 -506 84 669 729 864 1439 1790
1667 1790 1651 1686 2107 2191 1791 1670 1895 1674 1028 754 742 295 -486 -813 -864 -1329 -1947 -2102 -1991 -2209 -2444
1688 -2444 -2233 -1858 -1720 -1558 -1072 -535 -199 172 663 1085 1330 1600 1867 1951 1966 2019 1964 1723 1523 1425 1167
1709 1167 745 445 269 -47 -520 -820 -969 -1230 -1604 -1782 -1817 -1913 -2002 -1970 -1832 -1607 -1365 -1093 -773 -296 195
1730 195 549 822 1313 1800 1926 1891 2145 2366 2105 1662 1623 1630 1068 379 227 193 -458 -1109 -1117 -1024 -1512 -1959 -1742
1753 -1742 -1488 -1772 -1955 -1522 -1169 -1304 -1228 -652 -275 -294 10 655 923 928 1336 1866 1848 1703 2037 2280 1822
1774 1822 1394 1572 1490 625 17 152 -85 -1082 -1607 -1260 -1334 -2174 -2371 -1686 -1501 -2071 -1949 -993 -648 -1034
1794 -1034 -760 243 572 226 481 1313 1490 1108 1288 1866 1857 1422 1482 1766 1505 1016 935 902 415 -110 -267
$$ packed form
1645a2o17q1l03p31l39J50j21l92Q2M62Q7m8M39O25J59J34N90N85O0J35N75L51
1667A790j39L5M21Q4m00j21K25k21o46k74j2m47p81l27n1m65o18j55J11k18k35
1688b444K11L75J38J62M86N37L36L71M91M22K45K70K67Q4J5N3n5k41k00r8k58
1709A167m22l00j76l16m73l00j49k61l74j78l5r6q9L2J38K25K42K72L20M77M91
1730A95L54K73M91M87J26l5K54K21k61m43l9Pn62o89j52l4o51o51qR3m88m47K17
1753a742K54k84j83M33L53j35P6N76L77j9L04O45K68NM08N30j8j45L34K43m58
1774A822m28J78q2q65o08J35k37r97n25L47p4q40j97O85J85n70J22R56L45l86
1794a034K74J003L29l46K55Q32J77l82J80N78rm35O0K84k61m89q1l3m87n25j57
$$ plain form
1815 -267 -496 -1067 -1454 -1472 -1653 -2111 -2153 -1816 -1758 -1929 -1614 -909 -652 -663 -201 626 913 784 1100 1771 1893
1836 1893 1491 1487 1942 1882 1235 970 1263 1146 401 -31 200 152 -619 -1120 -842 -787 -1464 -1905 -1535 -1298 -1771
1857 -1771 -2025 -1474 -988 -1199 -1202 -448 166 134 291 1037 1525 1413 1527 2021 2100 1724 1667 1836 1452 840 745 753
1879 753 83 -619 -494 -429 -1175 -1698 -1253 -1000 -1717 -2067 -1282 -842 -1543 -1752 -705 -146 -848 -961 270 890
1899 890 180 111 1350 1909 1133 992 2045 2339 1388 1070 1781 1726 606 141 552 250 -824 -1192 -859
1918 -859 -1165 -1903 -1911 -1463 -1624 -1935 -1529 -994 -1066 -1085 -392 107 -87 4 786 1132 716 761 1535 1709 1076 1022
1940 1022 1741 1762 916 719 1340 1205 159 -210 309 130 -973 -1428 -924 -959 -1873 -2207 -1533 -1256 -1837 -1915
1960 -1915 -1031 -454 -723 -689 240 881 678 653 1331 1776 1454 1253 1580 1744 1291 955 1071 1006 503 215 256
$$ packed form
1815b67k29n71l87j8j81m58m2L37N8j71L15P05K57j1M62Q27K87j29L16O71J22
1836A893m02mM55o0o47k65K93j17p45m32K31m8p71n01K78N5o77m41L70K37m73
1857a771k54N51M86k11lP54O14l2J57P46M88j12J14M94P9l76n7J69l84o12r5Q
1879G53o70p02J25O5p46n23M45K53p17l50P85M40p01k09J047N59p02j13J231O20
1899H90p10o9J239N59p76j41J053K94r51l18P11n5j120m65M11l02j074l68L33
1918h59l06p38qM48j61l11M06N35p2j9O93M99j94R1P82L46m16M5P74J74o33n4
1940A022P19K1q46j97O21j35j046l69N19j79j103m55N04l5r14l34O74K77n81p8
1960a915Q84N77k69L4R29O41k03k5O78M45l22k01L27J64m53l36J16o5n03k88M1
$$ plain form
1981 256 25 -450 -582 -515 -850 -1292 -1194 -1024 -1428 -1783 -1373 -995 -1370 -1569 -813 -174 -517 -614 419 1209 767
2002 767 568 1598 2251 1542 1040 1843 2263 1206 445 1029 1236 67 -742 -205 10 -1036 -1654 -1026 -739
2021 -739 -1502 -1833 -1135 -813 -1338 -1403 -688 -437 -792 -608 61 209 -7 396 1007 962 845 1344 1764 1430 1203
2042 1203 1654 1776 1066 631 967 855 -162 -674 -298 -431 -1427 -1825 -1231 -1110 -1860 -2015 -1156 -771 -1277
2061 -1277 -1263 -308 179 -215 -238 600 1055 656 531 1125 1476 1084 860 1219 1457 1094 764 913 1004 614 189
2082 189 139 57 -338 -766 -910 -1038 -1308 -1531 -1541 -1549 -1572 -1427 -1162 -1002 -826 -384 54 216 392 873 1287 1199
2104 1199 1090 1445 1711 1314 915 1142 1326 744 163 385 631 -12 -645 -378 -53 -650 -1295 -989 -587 -1099
2124 -1099 -1675 -1281 -779 -1141 -1515 -977 -356 -498 -642 15 677 630 614 1178 1583 1447 1349 1625 1644 1262 1054
$$ packed form
1981B56k31m75j32O7l35m42R8J70m04l55M10L78l75j99P56O39l43r7J033P90m42
2002G67j99J030O53p09n02Q03M20j057p61N84K07j169q09N37K15j046o18O28K87
2021g39p63l31O98L22n25o5P15K51l55J84O69J48k16M03O11m5j17M99M20l34k27
2042A203M51J22p10m35L36j12j017n12L76j33r96l98N94J21p50j55Q59L85n06
2061a277J4R55M87l94k3Q38M55l99j25N94L51l92k24L59K38l63l30J49R1l90m25
2082A89n0q2l95m28j44j28k70k23j0qk3J45K65J60J76M42M38J62J76M81M14q8
2104A199j09L55K66l97l99K27J84n82n81K22K46o43o33K67L25n97o45L06M02n12
2124a099n76L94N02l62l74N38O21j42j44O57O62m7j6N64M05j36r8K76J9l82k08
$$ plain form
2145 1054 1052 737 230 45 -29 -477 -905 -838 -792 -1191 -1438 -1100 -883 -1220 -1328 -806 -515 -830 -862 -261 106 -190
2167 -190 -205 440 836 587 560 1126 1470 1209 1052 1393 1557 1149 802 859 783 294 -188 -339 -475 -860 -1238
2188 -1238 -1346 -1319 -1376 -1475 -1433 -1176 -956 -827 -675 -351 -21 159 273 473 730 854 842 909 1040 1086 1032 970 971
2211 971 950 871 703 536 435 332 52 -276 -441 -520 -823 -1228 -1293 -1179 -1307 -1573 -1451 -1021 -914 -1007 -682 -31
2233 -31 199 141 474 1079 1193 960 1128 1513 1414 1006 956 1136 899 433 319 380 130 -260 -331 -298 -535 -785
2255 -785 -792 -807 -1003 -1091 -1011 -1029 -1137 -1018 -792 -753 -711 -359 23 105 233 686 1086 1075 1060 1398 1611 1358 1107 1221
2279 1221 1189 704 305 267 146 -349 -710 -702 -735 -1037 -1215 -1085 -975 -1062 -1059 -887 -719 -658 -569 -396 -230 -96 47
2302 47 190 344 555 727 806 905 1098 1215 1163 1099 1142 1105 838 575 436 239 -129 -478 -668 -843 -1088 -1295
$$ packed form
2145A054kl15n07j85p4m48m28O7M6l99k47L38K17l37j08N22K91l15l2O01L67k96
2167a90j5O45L96k49k7N66L44k61j57L41J64m08l47N7p6m89m82j51j36l85l78
2188a238j08K7n7r9M2K57K20J29J52L24L30J80J14K00K57J24j2O7J31M6n4o2J
2211I71k1p9j68j67j01j03k80l28j65p9l03m05o5J14j28k66J22M30J07r3L25O51
2233c1K30n8L33O05J14k33J68L85r9m08n0J80k37m66j14O1k50l90p1L3k37k50
2255g85pj5j96q8Q0j8j08J19K26L9M2L52L82Q2J28M53M00j1j5L38K13k53k51J14
2279A221l2m85l99l8j21m95l61Ql3l02j78J30J10q7LJ72J68O1Q9J73J66J34J43
2302D7J43J54K11J72P9R9J93J17n2o4M3l7k67k63j39j97l68l49j90j75k45k07
$$ plain form
2324 -1295 -1328 -1293 -1273 -1219 -1086 -875 -642 -428 -254 -14 273 466 511 621 854 945 830 844 1007 1015 812 706 848
2347 848 804 496 343 386 239 -117 -349 -376 -569 -918 -1081 -1068 -1171 -1328 -1293 -1126 -1054 -945 -637 -356 -182 85
2369 85 480 711 781 986 1262 1261 1077 1110 1220 998 646 597 632 295 -81 -80 -10 -325 -650 -579 -470 -758 -1007 -867
2393 -867 -738 -966 -1091 -875 -713 -783 -754 -411 -162 -103 112 519 718 793 1028 1281 1284 1189 1265 1268 999 698 646 479
2417 479 35 -292 -318 -454 -838 -1031 -899 -878 -1110 -1119 -850 -708 -815 -757 -437 -261 -315 -231 53 231 225 322 578
2440 578 737 779 838 972 1068 1056 995 960 875 723 509 272 59 -176 -445 -709 -910 -1032 -1160 -1236 -1235 -1162 -1048 -917
2464 -917 -749 -542 -289 -53 122 267 476 682 743 717 807 957 896 716 740 885 765 475 450 590 406 0
2486 0 -50 46 -207 -656 -738 -624 -853 -1234 -1203 -962 -1028 -1195 -969 -567 -463 -413 -59 383 493 566 869 1108 1049
$$ packed form
2324a295l3L5K0N4J33K11K33K14J74K40K87J93M5J10K33R1j15J4J63Qk03j06J42
2347H48m4l08j53M3j47l56k32k7j93l49j63J3j03j57L5J67P2J09L08K81J74K67
2369H5L95K31P0K05K76jj84L3J10k22l52m9L5l37l76JP0l15l25P1J09k88k49J40
2393h67J29k28j25K16J62p0K9L43K49N9K15M07J99P5K35K53Lr5P6Lk69l01n2j67
2417D79m44l27k6j36l84j93J32K1k32rK69J42j07N8L20J76n4Q4K84J78oR7K56
2440E78J59M2N9J34R6j2o1l5q5j52k14k37k13k35k69k64k01j22j28p6JP3J14J31
2464i17J68K07K53K36J75J45K09K06O1k6R0J50o1j80K4J45j20k90k5J40j84m06
2486@n0R6k53m49q2J14k29l81L1K41o6j67K26M02J04N0L54M42J10P3L03K39n9
$$ plain form
2509 1049 1025 1178 1138 863 745 783 552 176 105 164 -122 -478 -422 -291 -576 -902 -726 -520 -792 -1075 -813 -536
2531 -536 -773 -949 -585 -222 -319 -381 63 513 468 441 847 1183 1074 984 1146 1247 991 721 680 550 210 -80
2553 -80 -204 -399 -659 -800 -847 -942 -1005 -940 -836 -862 -791 -575 -434 -440 -331 -70 95 57 119 409 572 524 547 783
2577 783 958 872 761 897 1014 814 545 504 530 225 -205 -351 -344 -611 -1016 -1106 -943 -999 -1233 -1160 -794 -643 -722
2600 -722 -545 -75 136 79 245 611 733 610 683 895 884 722 713 793 680 509 515 493 265 114 147 5 -320
2623 -320 -437 -389 -569 -935 -958 -776 -905 -1187 -1036 -615 -640 -814 -467 101 166 19 415 959 935 681 917 1290
2645 1290 1099 691 756 926 620 178 166 258 -39 -400 -387 -317 -527 -750 -676 -609 -757 -817 -693 -651 -725 -675 -481
2668 -481 -426 -401 -173 100 163 228 531 807 808 790 1015 1174 995 792 863 864 511 171 114 43 -290 -648 -679 -638 -829
$$ packed form
2509A049k4J53m0k75j18L8k31l76p1N9k86l56N6J31k85l26J76K06k72k83K62K77
2531e36k37j76L64L63r7o2M44M50m5k7M06L36j09r0J62J01k56k70m1j30l40k90
2553h0j24j95k60j41m7r5o3O5J04k6P1K16J41oJ09K61J65l8O2K90J63m8K3K36
2577G83J75q6j11J36J17k00k69m1K6l05m30j46Pk67m05r0J63n6k34P3L66J51p9
2600g22J77M70K11n7J66L66J22j23P3K12j1j62rQ0j13j71Ok2k28j51L3j42l25
2623c20j17M8j80l66k3J82j29k82J51M21k5j74L47N68O5j47L96N44k4k54K36L73
2645A290j91m08O5J70l06m42j2R2k97l61J3P0k10k23P4O7j48o0J24M2p4N0J94
2668d81N5K5K28K73O3O5L03K76Jj8K25J59j79k03P1Jl53l40n7p1l33l58l1M1j91
$$ plain form
2693 -829 -1039 -964 -768 -764 -851 -716 -420 -311 -368 -261 52 192 142 198 453 618 533 549 770 879 767 709 818
2716 818 835 617 455 415 282 6 -191 -305 -511 -760 -868 -905 -1012 -1107 -976 -849 -858 -743 -427 -194 -178 -18
2738 -18 352 547 448 526 860 907 654 644 881 832 480 405 633 528 126 40 219 94 -320 -415 -258 -452 -808
2761 -808 -843 -685 -793 -1030 -936 -696 -679 -714 -444 -132 -36 78 389 641 686 768 972 1045 904 868 922 772 495
2784 495 405 397 151 -141 -201 -186 -389 -618 -603 -515 -654 -811 -713 -576 -637 -726 -608 -426 -406 -419 -230 3 109 188
2808 188 371 604 724 768 844 957 1000 898 787 741 631 417 167 10 -129 -353 -582 -684 -717 -841 -922 -884
2830 -884 -789 -770 -714 -557 -409 -340 -234 -47 64 125 224 408 471 468 588 723 714 636 741 811 679 526 553 542 270
2855 270 30 -6 -98 -438 -678 -655 -698 -946 -1057 -881 -787 -898 -824 -492 -292 -289 -136 225 391 366 495 739 766
$$ packed form
2693h29k10P5J96Mq7J35K96J09n7J07L13J40n0N6K55J65q5J6K21J09j12n8J09
2716H18J7k18j62m0j33k76j97j14k06k49j08l7j07r5J31J27rJ15L16K33J6J60
2738a8L70J95r9P8L34M7k53j0K37m9l52p5K28j05m02q6J79j25m14r5J57j94l56
2761h08l5J58j08k37R4K40J7l5K70L12R6J14L11K52M5Q2K04P3j41l6N4j50k77
2784D95r0qk46k92o0J5k03k29J5Q8j39j57R8J37o1q9J18J82K0j3J89K33J06P9
2808A88J83K33J20M4P6J13M3j02j11m6j10k14k50j57j39k24k29j02l3j24q1L8
2830h84R5J9N6J57J48O9J06J87J11O1R9J84O3lJ20J35rp8J05P0j32j53K7j1k72
2855B70k40l6r2l40k40K3m3k48j11J76R4j11P4L32K00LJ53L61J66k5J29K44K7
$$ plain form
2878 766 656 714 817 721 541 568 572 401 232 234 175 -40 -191 -182 -280 -526 -630 -586 -662 -858 -862 -727 -715 -797 -638 -377
2904 -377 -272 -223 6 319 437 487 693 879 898 827 868 896 769 600 500 409 217 40 -88 -202 -352 -456
2926 -456 -531 -601 -646 -672 -672 -693 -655 -594 -543 -526 -421 -297 -208 -117 30 184 309 422 568 693 767 820 846 835 808 739
2952 739 609 425 307 182 -37 -290 -397 -460 -659 -827 -815 -750 -813 -871 -709 -512 -502 -496 -262 -16 -14 0 223 424
2976 424 395 389 585 706 638 586 720 745 604 539 567 461 241 136 78 -125 -366 -436 -491 -704 -865 -801 -750 -883
3000 -883 -901 -653 -471 -534 -418 -59 146 92 196 560 692 550 587 833 850 616 544 698 633 347 248 323 206
3023 206 -60 -163 -142 -255 -478 -547 -536 -625 -752 -737 -681 -718 -681 -547 -442 -368 -214 7 140 223 422 649 714 688
3047 688 805 920 830 664 635 656 478 216 112 99 -84 -337 -446 -415 -476 -686 -732 -613 -567 -686 -708 -533 -394
$$ packed form
2878G66j10N8J03r6j80K7Mj71j69Kn9k15j51Rr8k46j04M4p6j96mJ35J2q2J59K61
2904c77J05M9K29L13J18N0K06J86J9p1M1K8j27j69j00r1j92j77j28j14j50j04
2926d56p5p0m5k6%k1L8O1N1J7J05J24Q9R1J47J54J25J13J46J25P4N3K6j1k7o9
2952G39j30j84j18j25k19k53j07o3j99j68J2O5o3n8J62J97J0OK34K46KJ4K23K01
2976D24k9oJ96J21o8n2J34K5j41o5K8j06k20j05n8k03k41p0n5k13j61O4N1j33
3000h83j8K48J82o3J16L59K05n4J04L64J32j42L7K46J7k34p2J54o5k86r9P5j17
3023B06k66j03K1j13k23o9J1q9j27J5N6l7L7J34J05P4J54K21J33Q3J99K27O5k6
3047F88J17J15r0j66k9K1j78k62j04j3j83k53j09L1o1k10m6J19M6j19k2J75J39
$$ plain form
3070 -394 -425 -447 -222 8 13 16 231 491 520 490 645 847 807 681 711 776 635 418 336 274 63 -167 -260 -382 -549
3095 -549 -668 -691 -739 -824 -730 -621 -654 -629 -410 -202 -241 -211 102 326 214 206 526 721 518 431 735 851 568 398
3119 398 638 709 338 90 257 261 -148 -402 -278 -293 -650 -836 -692 -631 -831 -852 -638 -505 -536 -421 -167 -17
3141 -17 55 227 430 470 526 693 750 654 624 743 681 435 364 477 350 18 -59 51 -71 -415 -483 -322 -422 -739
3165 -739 -784 -557 -547 -771 -751 -461 -329 -437 -375 -37 188 150 211 497 711 674 623 754 876 757 580 563 570 395
3189 395 154 53 0 -135 -339 -451 -465 -532 -629 -671 -645 -629 -605 -570 -518 -449 -323 -200 -157 -86 112 294 286 320 541
3214 541 736 635 559 727 857 630 424 523 584 259 -67 -3 37 -311 -641 -536 -424 -692 -917 -719 -516 -643
3236 -643 -759 -481 -219 -264 -289 -15 225 186 205 434 568 503 534 654 668 564 580 618 478 331 334 305 54 -123
$$ packed form
3070c94l1k2K25K30NLK15K60K9l0J55K02m0j26L0O5j41k17q2o2k11k30r3j22j67
3095e49j19k3m8q5R4J09l3K5K19K08l9L0L13K24j12qL20J95k03q7L04J16k83j70
3119C98K40P1l71k48J67Mm09k54J24j5l57j86J44O1k00k1K14J33l1J15K54J50
3141a7P2J72K03M0N6J67N7r6l0J19o2k46p1J13j27l32p7J10j22l44o8J61j00l17
3165g39m5K27J0k24K0K90J32j08O2L38K25l8O1K86K14l7n1J31J22j19j77j7Pj75
3189C95k41j01n3j35k04j12j4o7r7m2K6J6K4L5N2O9J26J23M3P1J98J82qL4K21
3214E41J95j01p6J68J30k27k06R9O1l25l26O4M0l48l30J05J12k68k25J98K03j27
3236f43j16K78K62m5k5K74K40l9J9K29J34o5L1J20J4j04J6L8j40j47Lk9k51j77
$$ plain form
3260 -123 -101 -156 -466 -625 -521 -532 -779 -872 -618 -527 -679 -658 -322 -137 -221 -148 213 404 332 355 629 756 606
3283 606 559 685 722 540 415 422 389 199 40 -28 -74 -222 -380 -432 -483 -546 -623 -651 -659 -616 -588 -548 -479 -368 -244 -150
3309 -150 -43 115 270 389 459 538 657 713 694 642 654 655 510 348 299 249 53 -172 -227 -241 -390 -607 -605 -502 -574
3334 -574 -750 -666 -453 -474 -572 -427 -164 -121 -174 -8 259 293 256 413 618 631 542 629 730 618 495 507 472 273
3358 273 112 89 -32 -271 -378 -378 -506 -678 -670 -573 -647 -737 -589 -411 -433 -429 -213 21 0 -4 255 463 401 373 571
3383 571 711 596 489 609 660 465 317 363 329 102 -67 -75 -150 -357 -473 -490 -544 -642 -689 -637 -629 -607 -520 -415 -346
3408 -346 -241 -80 60 132 260 405 491 541 584 669 652 595 555 542 474 345 244 172 72 -62 -186 -267 -324 -443
3432 -443 -539 -575 -570 -582 -648 -609 -502 -432 -428 -343 -149 -29 3 113 325 446 438 506 669 695 604 569 632 583 408 307 282
$$ packed form
3260a23K2n5l10j59J04j1k47r3K54R1j52K1L36J85q4P3L61J91p2K3K74J27j50
3283F06m7J26L7j82j25Pl3j90j59o8m6j48j58n2n1o3p7k8qM3K8M0O9J11J24R4
3309a50J07J58J55J19P0P9J19N6j9n2J2Jj45j62m9n0j96k25n5j4j49k17KJ03p2
3334e74j76Q4K13k1r8J45K63M3n3J66K67L4l7J57K05J3q9Q7J01j12j23J2l5j99
3358B73j61k3j21k39j07%j28j72QR7p4r0J48J78k2MK16K34k1mK59K08o2k8J98
3383E71J40j15j07J20N1j95j48M6l4k27j69qp5k07j16j7n4r8m7N2QK2Q7J05O9
3408c46J05J61J40P2J28J45Q6N0M3Q5j7n7m0j3o8j29j01p2j00j34j24q1n7j19
3432d43r6l6Nj2o6L9J07P0MQ5J94J20L2J10K12J21qO8J63K6r1l5O3m9j75j01k5
$$ plain form
3459 282 165 -39 -134 -174 -300 -466 -491 -492 -580 -645 -576 -518 -541 -523 -360 -261 -265 -179 49 141 129 259 464 506 448 539 682
3486 682 642 491 514 582 438 234 211 206 1 -222 -241 -260 -440 -589 -563 -530 -629 -676 -549 -462 -476 -418 -246 -133 -82
3511 -82 27 198 284 312 432 540 555 521 581 608 517 441 443 409 241 126 87 -2 -167 -288 -335 -399 -535 -589 -561 -579
3537 -579 -615 -589 -493 -426 -371 -269 -139 -5 76 193 304 408 487 523 558 603 618 553 493 467 407 300 166 110 31 -108
3563 -108 -231 -279 -348 -464 -539 -535 -547 -587 -586 -499 -446 -431 -341 -196 -92 -34 101 238 296 363 488 577 549 550 618 600 472
3590 472 419 427 317 122 29 23 -98 -304 -367 -338 -443 -601 -585 -491 -540 -610 -497 -342 -344 -350 -182 9 27 61 238 390
3616 390 375 405 540 605 534 513 583 527 388 318 309 167 0 -74 -91 -250 -411 -427 -449 -553 -640 -568 -495 -555 -528 -374
3642 -374 -257 -250 -183 17 142 138 219 393 477 455 480 577 589 500 459 473 401 289 192 153 39 -99 -185 -263 -356 -445 -501
$$ packed form
3459B82j17k04r5m0j26j66k5jq8o5O9N8k3J8J63R9mQ6K28R2j2J30K05M2n8R1J43
3486F82m0j51K3O8j44k04k3nk05k23j9j9j80j49K6L3r9m7J27Q7j4N8J72J13N1
3511h2J09J71Q6K8J20J08J5l4O0K7r1p6Kl4j68j15l9q9j65j21m7o4j36n4K8j8
3537e79l6K6R6O7N5J02J30J34Q1J17J11J04P9L6L5M5J5o5o0k6o0j07j34n6p9j39
3563a08j23m8o9j16p5Mj2m0JQ7N3J5R0J45J04N8J35J37N8O7J25Q9k8JO8j8j28
3590D72n3Qj10j95r3oj21k06o3K9j05j58J6R4m9p0J13J55koJ68J91J8L4J77J52
3616C90j5L0J35O5p1k1P0n6j39p0rj42j67p4j7j59j61j6k2j04q7P2P3o0K7J54
3642c74J17PO7K00J25mQ1J74Q4k2K5R7J2q9m1J4p2j12r7l9j14j38q6p8r3q9n6
$$ plain form
3669 -501 -532 -563 -566 -552 -513 -469 -398 -293 -216 -113 0 95 206 299 390 445 511 558 556 547 527 503 417 335 291 207 82 -46
3697 -46 -90 -175 -323 -409 -415 -461 -564 -570 -487 -483 -525 -452 -298 -247 -241 -121 92 148 147 286 452 468 436 530 625 558 436 479 468
3726 468 314 176 179 117 -86 -223 -209 -277 -451 -521 -459 -487 -592 -560 -424 -409 -452 -332 -153 -124 -112 42 225 247 250
3751 250 411 535 485 447 551 590 469 370 406 378 177 64 56 -23 -229 -331 -310 -375 -525 -549 -489 -504 -571 -514 -399
3776 -399 -340 -329 -216 -83 -4 46 163 296 351 401 475 529 522 508 496 486 401 337 278 201 90 -15 -97 -184 -278 -373 -417
3803 -417 -465 -510 -544 -548 -514 -467 -442 -374 -256 -173 -105 -12 136 240 271 352 477 504 475 501 563 519 395 362 377 263 97
3830 97 48 24 -106 -280 -310 -296 -418 -532 -501 -446 -507 -548 -424 -320 -339 -301 -115 10 13 85 276 363 334 389 539 551
3856 551 459 470 531 452 298 274 281 130 -43 -73 -90 -255 -406 -394 -378 -500 -583 -491 -424 -489 -484 -336 -219 -246 -173 24
$$ packed form
3669e01l1l1lJ4L9M4P1J05P7J03J13R5J11R3R1N5O6M7krk0k4q6q2m4q4j25j28
3697d6m4q5j48q6om6j03oQ3Mm2P3J54N1OJ20K13N6jJ39J66J6l2R4R5o7j22M3j1
3726D68j54j38Lo2k03j37J4o8j74p0O2k8j05L2J36J5m3J20J79K9J2J54J83K2L
3751B50J61J24n0l8J04L9j21r9L6k8k01j13qp9k06j02K1o5j50k4O0j5o7N7J15
3776c99N9J1J13J33P9N0J17J33N5N0P4N4pj4j2j0q5o4n9p7j11j05q2q7r4r5m4
3803d17m8m5l4mL4M7K5O8J18Q3O8R3J48J04L1Q1J25K7k9K6O2m4j24l3J5j14j66
3830I7m9k4j30j74l0J4j22j14L1N5o1m1J24J04j9L8J86J25LP2J91Q7k9N5J50J2
3856E51r2J1O1p9j54k4Pj51j73l0j7j65j51J2J6j22q3R2O7o5NJ48J17k7P3J97
$$ plain form
3882 24 126 122 205 354 419 397 447 536 525 457 434 447 353 238 184 129 -1 -123 -174 -241 -355 -429 -458 -481 -530 -518 -471 -440
3910 -440 -416 -337 -249 -164 -89 8 110 200 275 347 402 456 484 484 480 470 450 380 302 248 170 65 -51 -94 -164 -306 -370 -409 -428
3939 -428 -512 -534 -457 -438 -459 -412 -251 -196 -188 -82 87 154 179 286 414 438 415 467 539 487 400 423 401 267 164 131 79
3966 79 -80 -179 -198 -258 -397 -457 -405 -442 -535 -507 -387 -381 -387 -295 -150 -109 -77 60 223 241 247 372 490 462 436 500 515 424
3994 424 349 350 295 157 58 17 -66 -208 -287 -295 -374 -469 -483 -451 -470 -486 -425 -357 -323 -271 -158 -58 -6 70 197 270 310 375
4022 375 431 464 465 479 475 431 356 329 253 167 71 -8 -109 -196 -275 -332 -414 -466 -464 -475 -493 -470 -396 -352 -331 -241 -118 -55 -15 105
4052 105 236 270 305 401 484 450 435 472 475 372 318 310 252 103 22 -5 -99 -237 -303 -307 -388 -490 -483 -428 -461 -487 -404 -289 -292
4081 -292 -270 -121 -2 39 88 235 341 349 368 476 502 446 420 460 417 287 234 213 117 -26 -76 -112 -217 -338 -355 -373
$$ packed form
3882B4J02mQ3J49O5k2N0Q9j1o8k3J3r4j15n4n5j30j22n1o7j14p4k9k3m9J2M7L1
3910d40K4P9Q8Q5P5R7J02R0P5P2N5N4K8%mj0k0p0p8n4p8j05j16m3p0j42o4l9j9
3939d28q4k2P7J9k1M7J61N5QJ06J69O7K5J07J28K4k3N2P2n2q7K3k2j34j03l3n2
3966G9j59r9j9o0j39o0N2l7r3K8J20OoR2J45M1L2J37J63J8OJ25J18k8k6O4J5r1
3994D24p5Jn5j38r9m1q3j42p9qp9r5j4L2j9j6O1O8L4N2J13J00N2P6J27P3M0O5
4022C75N6L3JJ4mm4p5k7p6q6r6p9j01q7p9n7q2n2Kj1j8K3P4M4K1R0J23O3M0J20
4052A05J31L4L5R6Q3l4j5L7Lj03n4qn8j49q1k7r4j38o6mq1j02PN5l3k6Q3J15l
4081b92K2J49J19M1M9J47J06QJ9J08K6n6k6M0m3j30n3k1r6j43n0l6j05j21j7j8
$$ plain form
4107 -373 -436 -477 -461 -412 -431 -407 -302 -222 -208 -133 3 86 129 211 335 391 404 442 501 481 427 414 384 305 226 150 90 -14
4135 -14 -113 -165 -248 -329 -375 -400 -443 -455 -448 -435 -419 -358 -278 -230 -174 -78 34 87 150 251 334 365 380 448 481 452 415 417 361 268
4165 268 216 170 80 -36 -110 -162 -262 -359 -370 -393 -450 -487 -433 -410 -412 -366 -251 -191 -139 -75 80 148 166 251 374 404 369 418
4193 418 489 444 372 369 364 263 159 123 77 -45 -154 -179 -241 -363 -401 -386 -424 -482 -453 -382 -369 -366 -269 -147 -100 -52 70 197
4221 197 227 262 370 421 412 405 463 466 371 314 317 264 130 57 36 -58 -181 -237 -277 -331 -422 -421 -418 -449 -446 -378 -331 -316 -242 -147 -72 -24
4253 -24 69 174 251 276 332 426 424 414 441 454 387 315 297 231 140 44 -5 -91 -190 -257 -305 -357 -416 -432 -412 -432 -408 -357 -320 -275
4283 -275 -208 -108 -50 19 92 197 248 284 348 415 418 404 437 442 363 313 278 222 122 40 -12 -98 -211 -277 -304 -374 -436 -426 -411
4312 -411 -440 -427 -340 -291 -270 -194 -69 -1 37 121 240 287 290 360 446 415 370 404 420 342 254 234 204 99 -26 -43 -98 -207
$$ packed form
4107c73o3m1J6M9j9K4J05Q0J4P5J36Q3M3Q2J24N6J3L8N9k0n4j3l0p9p9p6o0j04
4135a4r9n2q3q1m6k5m3j2PJ3J6O1Q0M8N6R6J12N3O3J01Q3L1J5O8L3k9l7Kn6r3
4165B68n2m6r0j16p4n2j00r7j1k3n7l7N4K3kM6J15O0N2O4J55O8J8Q5J23L0l5M9
4193D18P1m5p2lnj01j04l6m6j22j09k5o2j22l8J5l8n8K9P1J3LR7J22M7M8J22J27
4221A97L0L5J08N1rpN8Lr5n7Ln3j34p3k1r4j23n6m0n4r1JLl1LO8M7J5P4R5P5M8
4253b4R3J05P7K5N6R4kj0K7J3o7p2j8o6r1r6m9q6r9o7m8n2n9j6K0k0K4N1L7M5
4283b75O7J00N8O9P3J05N1L6O4O7Lj4L3Np9n0l5n6j00q2n2q6j13o6k7p0o2J0J5
4312d11k9J3Q7M9K1P6J25O8L8Q4J19M7LP0Q6l1m5L4J6p8q8k0l0j05j25j7n5j09
$$ plain form
4340 -207 -299 -307 -339 -428 -444 -384 -383 -412 -359 -260 -213 -199 -88 37 82 109 230 331 338 337 423 466 405 352 389 365 241 165 168 102
4370 102 -43 -124 -134 -189 -312 -359 -342 -370 -424 -429 -362 -344 -339 -284 -192 -147 -88 -3 99 155 203 300 352 366 396 430 425 377 358 334
4400 334 262 183 112 72 -27 -116 -181 -227 -304 -361 -390 -394 -400 -390 -379 -348 -287 -233 -192 -122 -24 46 88 147 256 316 317 349 411 431 369
4431 369 346 372 329 212 150 129 53 -73 -145 -166 -236 -346 -383 -361 -392 -435 -395 -330 -340 -307 -208 -115 -90 -14 111 162 180 248
4459 248 354 376 331 378 445 377 289 293 314 206 83 76 69 -60 -193 -205 -195 -317 -426 -378 -335 -418 -451 -354 -271 -290 -262 -128
4487 -128 -32 -17 60 178 246 262 324 392 406 376 394 398 331 249 259 208 83 16 -7 -70 -187 -257 -252 -285 -381 -397 -353 -352 -396 -365
4517 -365 -278 -232 -217 -146 -51 35 80 140 227 310 329 333 394 407 397 352 319 302 261 156 79 55 -18 -116 -212 -226 -256 -339 -388 -352
4547 -352 -351 -377 -380 -304 -245 -235 -185 -90 -12 20 86 181 227 257 325 362 347 354 384 379 295 258 262 185 70 17 -3 -104 -241 -264 -237
$$ packed form
4340b07r2ql2q9j6O0Jk9N3R9M7J4J11J25M5K7J21J01PjQ6M3o1n3L7k4j24p6Lo6
4370A02j45q1j0n5j23m7J7k8n4nO7J8NN5R2M5N9Q5J02N6M8R7N2J4L0L4nm8j9k4
4400C34p2p9p1m0r9q9o5m6p7n7k9moJ0J1L1O1N4M1P0R8P0M2N9J09O0JL2O2K0o2
4431C69k3K6m3j17o2k1p6j26p2k1p0j10l7K2l1m3M0O5j0L3R9R3K5P6J25N1J8O8
4459B48J06K2m5M7O7o8q8MK1j08j23ppj29j33j2J0j22j09M8M3q3l3R7Q3j9K8J34
4487a28R6J5P7J18O8J6O2O8J4l0J8Mo7q2J0n1j25o7k3o3j17p0Nl3r6j6M4Jm4L1
4517c65Q7M6J5P1R5Q6M5O0Q7Q3J9MO1J3j0m5l3j7m1j05p7k4p3r8r6j4l0q3m9L6
4547c52Jk6lP6N9J0N0R5P8L2O6R5M6L0O8L7j5PL0nq4l7Mp7j15n3k0j01j37k3K7
$$ plain form
4578 -237 -320 -427 -408 -330 -372 -410 -337 -199 -181 -205 -75 48 69 72 199 298 295 289 356 405 361 316 330 317 246 180 166 112 2
4607 2 -52 -92 -184 -279 -288 -295 -370 -413 -357 -330 -366 -349 -234 -161 -154 -104 33 124 111 172 301 358 333 340 401 409 326 294 291 266 169 82
4639 82 56 -2 -78 -156 -210 -231 -281 -326 -365 -365 -346 -333 -340 -287 -218 -180 -150 -60 37 92 122 203 283 323 336 351 394 377 344 319 282
4670 282 227 158 97 30 -41 -97 -168 -229 -283 -292 -323 -376 -371 -319 -307 -328 -282 -174 -120 -135 -63 56 128 107 182 303 328 285 326
4699 326 407 378 300 294 304 248 128 88 55 -31 -134 -175 -217 -302 -337 -344 -344 -388 -372 -304 -293 -287 -204 -101 -73 -49 68 166 164 185
4729 185 287 370 330 297 364 394 311 238 258 243 126 37 26 -1 -128 -204 -219 -246 -315 -355 -344 -339 -364 -335 -292 -243 -198 -127 -65
4758 -65 -11 66 149 195 239 298 345 349 327 355 354 295 238 224 205 114 26 -9 -37 -132 -193 -220 -243 -296 -327 -332 -332 -315 -293 -278 -234 -167
4790 -167 -106 -61 -10 88 161 182 226 306 359 329 316 366 370 281 217 244 202 75 1 -8 -44 -160 -238 -232 -257 -343 -352 -317 -317 -327 -298
$$ packed form
4578b37q3j07J9P8m2l8P3J38J8k4J30J23K1LJ27R9loO7M9m4m5J4j3p1o6j4n4j10
4607Bn4m0r2r5rpp5m3N6K7l6J7J15P3PN0J37R1j3O1J29N7k5PO1Qq3l2lk5r7q7
4639H2k6n8p6p8n4k1n0m5l9%J9J3pN3O9L8L0R0R7N5L0Q1Q0M0J3J5M3j7l3k5l7
4670B82n5o9o1o7p1n6p1o1n4rl1n3NN2J2k1M6J08N4j5P2J19P2k1P5J21K5m3M1
4699C26Q1k9p8oJ0n6j20m0l3q6j03m1m2q5l5p%m4J6O8J1OQ3J03K8K4J17R8kK1
4729A85J02Q3m0l3O7L0q3p3K0j5j17q9j1k7j27p6j5k7o9m0J1Nk5K9M3M9M5P1O2
4758f5N4P7Q3M6M4N9M7Mk2K8jn9n7j4j9r1q8l5k8r5o1k7k3n3l1n%J7K2J5M4O7
4790a67O1M5N1R8P3K1M4Q0N3l0j3N0Mq9o4K7m2j27p4rl6j16p8Ok5q6rL5%j0K9
$$ plain form
4821 -298 -246 -196 -166 -85 -30 13 64 160 203 208 273 334 346 297 321 349 293 211 194 196 90 -10 -39 -50 -165 -275 -270 -250 -328
4850 -328 -376 -341 -299 -315 -321 -226 -156 -129 -96 4 81 105 154 223 264 285 308 326 318 297 295 266 209 160 154 90 -4 -61 -78 -138 -225
4881 -225 -264 -274 -303 -361 -346 -308 -300 -291 -232 -164 -113 -78 -9 78 137 173 219 272 302 326 308 306 291 283 237 190 144 129 37 -53 -76 -95
4913 -95 -173 -243 -262 -258 -304 -354 -318 -271 -281 -277 -202 -127 -88 -69 13 92 133 165 248 287 299 318 329 314 297 281 242 189 119 106 35
4944 35 -63 -124 -127 -180 -276 -293 -261 -289 -330 -316 -243 -246 -257 -204 -98 -57 -60 18 122 157 158 234 293 300 292 323 334 294 252 247 186 120 73
4977 73 28 -43 -117 -149 -189 -267 -303 -298 -280 -328 -327 -264 -224 -235 -190 -91 -34 -25 33 121 187 187 212 277 302 289 284 303 289 238 199 175 118
5010 118 60 0 -47 -107 -148 -194 -241 -291 -282 -295 -322 -319 -266 -237 -224 -177 -96 -46 -11 50 140 186 200 237 291 297 290 278 294 259 198 184
5042 184 142 91 18 -15 -71 -133 -165 -181 -231 -282 -283 -267 -300 -309 -247 -218 -212 -176 -77 -22 -10 33 140 197 200 226 290 332 298 278 305
$$ packed form
4821b98N2N0L0Q1N5M3N1R6M3NO5O1J2m9K4K8n6q2j7Kj06j00k9j1j15j10NK0p8
4850c28m8L5M2j6oR5P0K7L3J00P7K4M9O9M1K1K3J8qk1kk9n7m9oo4r4n7j7o0q7
4881b25l9j0k9n8J5L8QRN9O8N1L5O9Q7N9L6M6N3L0K4j8kj5qm6m7m6j5r2r0k3j9
4913i5p8p0j9Mm6n0L6M7j0MP5P5L9J9Q2P9M1L2Q3L9J2J9J1j5j7j6l9n3p0j3p1
4944C5r8o1ln3r6j7L2k8m1J4P3lj1N3J06M1lP8J04L5JP6N9PqL1J1m0m2no1o6m7
4977G3m5p1p4l2m0p8l6NJ8m8JO3M0j1M5R9N7RN8Q8O6%K5O5K5j3nJ9j4n1l9k4n7
5010A18n8o0m7o0m1m6m7n0Rj3k7LN3K9J3M7Q1N0L5O1R0M6J4L7N4Opj2J6l5o1j4
5042A84m2n1p3l3n6o2l2j6n0n1jJ6l3rO2K9OL6R9N5J2M3J07N7LK6O4M2l4k0K7
$$ plain form
5073 305 270 209 149 145 89 1 -44 -88 -140 -206 -215 -233 -282 -310 -283 -282 -288 -254 -196 -171 -156 -84 -7 38 58 125 209 216 213 272 318 286 261
5106 261 276 280 201 149 127 97 17 -61 -88 -127 -206 -254 -266 -278 -299 -302 -282 -267 -237 -195 -158 -117 -51 9 53 79 140 197 211 230 278
5137 278 299 271 255 261 241 178 124 114 86 4 -48 -82 -130 -184 -243 -241 -270 -293 -283 -281 -274 -238 -192 -156 -116 -54 23 65 90 164 232 232
5169 232 227 281 308 270 229 237 241 160 90 78 84 -14 -91 -97 -120 -211 -250 -237 -241 -280 -297 -258 -236 -238 -193 -137 -97 -50 25 80 100 148 223
5202 223 259 243 270 316 289 236 225 234 175 91 57 45 -21 -106 -131 -149 -191 -271 -267 -243 -268 -297 -268 -211 -195 -178 -118 -73 -33 10 68
5233 68 108 152 195 246 247 267 283 271 244 227 233 187 114 63 40 -29 -104 -147 -169 -199 -265 -275 -255 -253 -274 -251 -206 -180 -158 -96 -51 9
5265 9 36 75 138 168 208 227 235 258 284 267 228 205 202 165 82 48 47 -21 -112 -148 -152 -191 -266 -267 -235 -265 -291 -249 -194 -167 -149 -89 -19
5298 -19 12 46 98 155 182 196 243 260 243 254 266 223 191 176 142 74 16 15 -20 -116 -164 -157 -186 -252 -274 -232 -231 -274 -259 -180 -146 -163
$$ packed form
5073C05l5o1o0mn6q8m5m4n2o6rj8m9k8K7JoL4N8K5J5P2P7M5K0O7Q4PlN9M6l2k5
5106B61J5Mp9n2k2l0q0p8k7l9p9m8j2j2k1lK0J5L0M2L7M1O6O0M4K6O1N7J4J9M8
5137B78K1k8j6Ok0o3n4j0k8q2n2l4m8n4n9Kk9k3J0KPL6M6L6M0O2P7M2K5P4O8%
5169B32nN4K7l8m1QMq1p0j2Or8p7ok3r1l9J3ml9j7L9K2kM5N6M0M7P5N5K0M8P5
5202B23L6j6K7M6k7n3j1Rn9q4l4j2o6q5k5j8m2q0MK4k5k9K9N7J6J7O0M5M0M3N8
5233F8M0M4M3N1JK0J6j2k7j7Om6p3n1k3o9p5m3k2l0o6j0K0Kk1K3M5K6K2O2M5O0
5265IK7L9O3L0M0J9QK3K6j7l9k3ll7q3l4jo8r1l6ml9p5jL2l0k6M2N5K7J8O0P0
5298a9L1L4N2N7K7J4M7J7j7J1J2m3l2j5l4o8n8jl5r6m8Pk9o6k2M2Jm3J5P9L4j7
$$ plain form
5330 -163 -97 -21 27 40 98 166 205 210 241 277 287 258 240 248 196 160 127 81 13 -17 -52 -124 -174 -182 -194 -238 -272 -248 -219 -241 -242 -174
5362 -174 -132 -129 -93 -19 56 51 79 145 198 209 222 249 260 256 234 221 199 161 126 67 15 -21 -65 -127 -180 -195 -206 -258 -275 -232 -225 -249
5394 -249 -229 -159 -119 -99 -79 8 62 66 105 174 209 213 219 253 261 221 212 206 182 144 107 59 6 -31 -65 -126 -174 -195 -199 -241 -271 -233 -215
5427 -215 -244 -233 -162 -105 -88 -75 14 78 91 110 190 234 225 223 264 272 228 185 200 166 110 74 49 9 -38 -92 -120 -166 -210 -193 -222
5458 -222 -254 -241 -219 -222 -216 -178 -113 -82 -65 0 86 104 99 179 235 225 226 246 264 235 189 174 174 111 52 23 -5 -48 -110 -142 -152 -198
5490 -198 -225 -239 -243 -232 -225 -212 -197 -152 -104 -56 -33 25 71 106 126 164 228 226 213 236 251 224 190 172 155 109 50 23 -18 -78 -123
5521 -123 -150 -182 -205 -233 -232 -245 -239 -219 -192 -175 -133 -74 -47 -20 34 91 127 130 177 234 210 196 226 239 211 157 168 157 89 32 11
5552 11 -18 -84 -127 -148 -181 -208 -239 -229 -224 -253 -229 -199 -169 -139 -83 -29 0 24 93 131 156 177 231 240 215 222 246 214 150 139 139 99
$$ packed form
5330a63O6P6M8J3N8O8L9NL1L6J0k9j8Qn2l6l3m6o8l0l5p2n0qj2m4l4K4K9k2jO8
5362a74M2LL6P4P5nK8O6N3J1J3K7J1mk2j3k2l8l5n9n2l6m4o2n3j5j1n2j7M3Pk4
5394b49K0P0M0K0K0Q7N4ML9O9L5MOL4Qm0rok4l8l7m8n3l7l4o1m8k1mm2l0L8J8
5427b15k9J1P1N7J7J3Q9O4J3J9Q0M4rkM1Qm4m3J5l4n6l6k5m0m7n4k8m6m4J7k9
5458b22l2J3K2lOL8O5L1J7O5Q6J8nQ0N6j0JK0J8k9m6j5%o3n9k9k8m3o2l2j0m6
5490a98k7j4mJ1PJ3J5M5M8M8K3N8M6L5K0L8O4kj3K3J5k7l4j8j7m6n9k7m1o0m5
5521a23k7l2k3k8Jj3OK0K7J7M2N9K7K7N4N7L6LM7N7k4j4L0J3k8n4J1j1o8n7k1
5552A1k9o6m3k1l3k7l1J0Nk9K4L0L0L0N6N4K9K4O9L8K5K1N4Rk5PK4l2o4j1%m0
$$ plain form
5584 99 27 -12 -24 -72 -142 -166 -172 -211 -244 -246 -225 -226 -230 -184 -136 -126 -88 -28 8 34 88 130 172 183 218 242 237 218 232 225 176 129 119
5617 119 75 16 -33 -42 -93 -134 -178 -176 -200 -223 -229 -198 -209 -208 -168 -127 -103 -67 -25 24 54 88 138 166 196 213 220 226 225 216 193 159 130 111
5651 111 77 12 -33 -70 -101 -161 -164 -182 -206 -238 -238 -205 -192 -201 -170 -111 -88 -58 -2 46 65 96 148 177 189 200 239 233 212 203 208 157 118
5684 118 103 59 10 -43 -48 -91 -144 -190 -191 -196 -233 -232 -212 -187 -188 -180 -100 -84 -63 -14 72 89 97 153 195 210 201 225 238 207 183 189 153 112
5718 112 68 58 13 -53 -81 -102 -133 -187 -198 -182 -209 -225 -213 -181 -191 -175 -115 -63 -59 -17 44 84 105 141 181 206 206 226 243 211 179
5749 179 178 143 104 63 32 3 -51 -81 -102 -137 -172 -180 -195 -200 -223 -200 -182 -183 -143 -88 -59 -40 1 67 86 109 147 183 192 180 213 229
5781 229 206 184 169 133 94 48 37 4 -55 -98 -102 -150 -186 -192 -187 -207 -228 -204 -164 -156 -140 -87 -41 -28 20 64 110 113 144 181 204 197 205
$$ packed form
5584I9p2l9j2m8p0k4ol9l3kK1jmM6M8J0L8O0L6K6N4M2M2J1L5K4nj9J4pm9m7j0
5617A19m4n9m9rn1m1m4Kk4k3oL1j1JM0M1K4L6M2M9L0L4N0K8L0J7POjrk3l4k9j9
5651A11l4o5m5l7l1o0lj8k4l2%L3J3rL1N9K3L0N6M8J9L1N2K9J2J1L9ok1rNn1l9
5684A18j5m4m9n3nm3n3m6jnl7JK0K5jQQ0J6K1M9Q6J7QN6M2J5rK4J3l1k4Ol6m1
5718A12m4j0m5o6k8k1l1n4j1J6k7j6J2L2j0J6O0N2MM2O1M0K1L6M0K5%K0J7l2l2
5749A79jl5l9m1l1k9n4l0k1l5l5qj5nk3K3J8jM0N5K9J9M1O6J9K3L8L6Rj2L3J6
5781B29k3k2j5l6l9m6j1l3n9m3mm8l6oNk0k1K4M0QJ6N3M6J3M8M4M6LL1L7K3pQ
$$ [...]
8191f1
##END NTUPLES=NMR FID
##END=
