##TITLE=1H_LY-choral.3
 CDcl3, 8 sc, 
 23.10.2020
##JCAMPDX= 6.0         $$ Bruker NMR JCAMP-DX V2.0
##DATA TYPE= NMR FID
##DATA CLASS= NTUPLES
##ORIGIN= UXNMR, Bruker Analytische Messtechnik GmbH
##OWNER= root
$$ XWIN-NMR		Version 3.5
$$ Fri Oct 23 13:44:14 2020 Russian Standard Time (UT+4h)  she@DPX200
##.OBSERVE FREQUENCY= 200.1315066352
##.OBSERVE NUCLEUS= ^1H
##.DELAY= (6, 6)
##.ACQUISITION MODE= SIMULTANEOUS
##.ACQUISITION SCHEME= undefined
##.AVERAGES= 8
##.DIGITISER RES= 18
##SPECTROMETER/DATA SYSTEM= spect
##.PULSE SEQUENCE= zg30
##.SOLVENT NAME= D2O
##.SHIFT REFERENCE= (INTERNAL, D2O, 0, 15.7039)
##AUDIT TRAIL= $$ (NUMBER, WHEN, WHO, WHERE, WHAT)
$$ ##TITLE= Audit trail, XWIN-NMR		Version 3.5
$$ ##JCAMPDX= 5.01
$$ ##ORIGIN= Bruker BioSpin GmbH
$$ ##OWNER= she
$$ F:/spectra/data/she/nmr/H-F/1/audita.txt
$$ ##AUDIT TRAIL=  $$ (NUMBER, WHEN, WHO, WHERE, WHAT)
(   1,<2020-10-23 13:43:08.12 +0400>,<she>,<DPX200>,
      <created by zg, POWCHK disabled, PULCHK disabled
       configuration hash MD5:
       00 E9 B6 7A A2 85 ED C7 34 08 36 98 17 FE 4E 26
       data hash MD5: 16K
       78 ED 68 30 91 D0 28 10 2A E0 A9 83 95 84 2E 6C>)
$$ ##END=
$$ 
$$ hash MD5
$$ FD 31 FC 54 ED F9 CB 36 DD 30 2E E1 9D 86 6D 5C
##$RELAX= 
##$RELAX= 
##$RELAX= 
##$RELAX= 
##$RELAX= 
##$RELAX= 
$$ Bruker specific parameters
$$ --------------------------
##$DU= <F:/spectra>
##$EXPNO= 1
##$NAME= <H-F>
##$PROCNO= 1
##$TYPE= <nmr>
##$USER= <she>
##$AMP= (0..31)
100 100 100 100 100 100 100 100 100 100 100 100 100 100 100 100 100 100 
100 100 100 100 100 100 100 100 100 100 100 100 100 100 
##$AQSEQ= 0
##$AQ_mod= 1
##$AUNM= <au_zg>
##$AUTOPOS= <>
##$BF1= 200.13
##$BF2= 200.13
##$BF3= 200.13
##$BF4= 200.13
##$BF5= 200.13
##$BF6= 200.13
##$BF7= 200.13
##$BF8= 200.13
##$BYTORDA= 1
##$CFDGTYP= 0
##$CFRGTYP= 5
##$CHEMSTR= <none>
##$CNST= (0..31)
1 1 145 1 1 1 1 1 1 1 1 1 1 1 1 1 1 1 1 1 1 1 1 1 1 1 1 1 1 1 1 1 
##$CPDPRG= <>
##$CPDPRG1= <>
##$CPDPRG2= <>
##$CPDPRG3= <>
##$CPDPRG4= <mlev>
##$CPDPRG5= <mlev>
##$CPDPRG6= <mlev>
##$CPDPRG7= <mlev>
##$CPDPRG8= <mlev>
##$CPDPRGB= <>
##$CPDPRGT= <>
##$D= (0..31)
0 1.2 0 0 0 0 0 0 0 0.06 0 0.03 0 0 0 0 0.0002 0 0 0 0 0 0 0 0 0 0 0 0 
0 0 0 
##$DATE= 1603446187
##$DBL= (0..7)
120 120 120 120 120 120 120 120 
##$DBP= (0..7)
150 150 150 150 150 150 150 150 
##$DBP07= 0
##$DBPNAM0= <>
##$DBPNAM1= <>
##$DBPNAM2= <>
##$DBPNAM3= <>
##$DBPNAM4= <>
##$DBPNAM5= <>
##$DBPNAM6= <>
##$DBPNAM7= <>
##$DBPOAL= (0..7)
0.5 0.5 0.5 0.5 0.5 0.5 0.5 0.5 
##$DBPOFFS= (0..7)
0 0 0 0 0 0 0 0 
##$DE= 6
##$DECBNUC= <off>
##$DECIM= 32
##$DECNUC= <off>
##$DECSTAT= 4
##$DIGMOD= 1
##$DIGTYP= 9
##$DL= (0..7)
0 120 120 120 120 120 120 120 
##$DP= (0..7)
150 150 150 150 150 150 150 150 
##$DP07= 0
##$DPNAME0= <>
##$DPNAME1= <>
##$DPNAME2= <>
##$DPNAME3= <>
##$DPNAME4= <>
##$DPNAME5= <>
##$DPNAME6= <>
##$DPNAME7= <>
##$DPOAL= (0..7)
0.5 0.5 0.5 0.5 0.5 0.5 0.5 0.5 
##$DPOFFS= (0..7)
0 0 0 0 0 0 0 0 
##$DQDMODE= 0
##$DR= 18
##$DS= 0
##$DSLIST= <SSSSSSSSSSSSSSS>
$$ [...]
##$SUBNAM2= <"">
##$SUBNAM3= <"">
##$SUBNAM4= <"">
##$SUBNAM5= <"">
##$SUBNAM6= <"">
##$SUBNAM7= <"">
##$SUBNAM8= <"">
##$SUBNAM9= <"">
##$SW= 16.880792210976
##$SWIBOX= (0..15)
0 0 2 0 0 0 0 0 0 0 0 0 0 0 0 0 
##$SW_h= 3378.37837837838
##$TD= 16384
##$TD0= 1
##$TE= 0
##$TE2= 300
##$TE3= 300
##$TEG= 300
##$TL= (0..7)
0 120 120 120 120 120 120 120 
##$TP= (0..7)
150 150 150 150 150 150 150 150 
##$TP07= 0
##$TPNAME0= <>
##$TPNAME1= <>
##$TPNAME2= <>
##$TPNAME3= <>
##$TPNAME4= <>
##$TPNAME5= <>
##$TPNAME6= <>
##$TPNAME7= <>
##$TPOAL= (0..7)
0.5 0.5 0.5 0.5 0.5 0.5 0.5 0.5 
##$TPOFFS= (0..7)
0 0 0 0 0 0 0 0 
##$TUNHIN= 0
##$TUNHOUT= 0
##$TUNXOUT= 0
##$USERA1= <user>
##$USERA2= <user>
##$USERA3= <user>
##$USERA4= <user>
##$USERA5= <user>
##$V9= 5
##$VALIST= <valist>
##$VCLIST= <CCCCCCCCCCCCCCC>
##$VD= 0
##$VDLIST= <DDDDDDDDDDDDDDD>
##$VPLIST= <PPPPPPPPPPPPPPP>
##$VTLIST= <TTTTTTTTTTTTTTT>
##$WBST= 1024
##$WBSW= 4
##$XGAIN= (0..3)
0 0 0 0 
##$XL= 0
##$YL= 0
##$YMAX_a= 270537
##$YMIN_a= -258028
##$ZGOPTNS= <>
##$ZL1= 120
##$ZL2= 120
##$ZL3= 120
##$ZL4= 120
##$ABSF1= 10
##$ABSF2= 0
##$ABSG= 5
##$ABSL= 3
##$ALPHA= 0
##$AQORDER= 0
##$ASSFAC= 0
##$ASSFACI= 0
##$ASSFACX= 0
##$ASSWID= 0
##$AUNMP= <proc_1d>
##$AZFE= 0.1
##$AZFW= 0.1
##$BCFW= 1
##$BC_mod= 2
##$BYTORDP= 1
##$COROFFS= 0
##$CY= 11.3945322036743
##$DATMOD= 1
##$DC= 2
##$DFILT= <>
##$DTYPP= 0
##$F1P= 16.9975609425685
##$F2P= -3.02152046262296
##$FCOR= 0.5
##$FTSIZE= 0
##$FT_mod= 4
##$GAMMA= 1
##$GB= 0.15
##$INTBC= 1
##$INTSCL= 1
##$ISEN= 128
##$LB= 0.24
##$LEV0= 0
##$LPBIN= 0
##$MAXI= 10000
##$MC2= 0
##$MEAN= 0
##$ME_mod= 0
##$MI= 1.114404
##$NCOEF= 0
##$NC_proc= 0
##$NLEV= 6
##$NOISF1= 3.799351
##$NOISF2= 2.8
##$NSP= 1
##$NTH_PI= 0
##$NZP= 0
##$OFFSET= 15.70392
##$PC= 1
##$PHC0= -10686.85
##$PHC1= 8.200877
##$PH_mod= 1
##$PKNL= yes
##$PPARMOD= 0
##$PSCAL= 0
##$PSIGN= 0
##$REVERSE= no
##$SF= 200.130013532006
##$SI= 16384
##$SIGF1= 3
##$SIGF2= 2
##$SINO= 400
##$SIOLD= 16384
##$SREGLST= <1H.CDCl3>
##$SSB= 0
##$STSI= 0
##$STSR= 0
##$SW_p= 3612.71676300578
##$SYMM= 0
##$S_DEV= 0
##$TDeff= 0
##$TDoff= 0
##$TI= <>
##$TILT= no
##$TM1= 0
##$TM2= 0
##$TOPLEV= 0
##$USERP1= <user>
##$USERP2= <user>
##$USERP3= <user>
##$USERP4= <user>
##$USERP5= <user>
##$WDW= 1
##$XDIM= 8192
##$YMAX_p= 0
##$YMIN_p= 0
$$ End of Bruker specific parameters
$$ ---------------------------------
##NTUPLES= NMR FID
##VAR_NAME=  TIME,          FID/REAL,        FID/IMAG
##SYMBOL=    X,             R,               I
##VAR_TYPE=  INDEPENDENT,   DEPENDENT,       DEPENDENT
##VAR_FORM=  AFFN,          ASDF,            ASDF
##VAR_DIM=   8192,          8192,            8192
##UNITS=     SECONDS,       ARBITRARY UNITS, ARBITRARY UNITS
##FACTOR=    0.000296,      1,               1
##FIRST=     0,             0,               0
##LAST=      2.424536,      0,               0
##MIN=       0,             -258028,         0
##MAX=       2.424536,      270537,          0
$$ Real data points
##PAGE= N=1
##DATA TABLE= (X++(R..R)), XYDATA
$$ [...]
$$ plain form
2862 4416 7162 7957 6142 1925 -2212 -5628 -8013 -6889 -3439 286 4730 7695 7488 5588 2249
2877 2249 -2670 -6385 -7396 -6565 -3883 1155 5007 6767 7691 5332 1057 -2989 -5996 -7864 -6597
2892 -6597 -2935 804 4831 7837 6953 4657 1153 -3217 -6878 -7304 -6009 -3525 1389 5375 6851
2907 6851 6838 4631 289 -3551 -6215 -7651 -6187 -2215 1499 5164 7167 7049 3915 467 -3504 -7088
2923 -7088 -7282 -5492 -2492 2004 5751 7273 6690 4119 51 -4080 -6282 -7195 -5654 -1612 2377 5376
2939 5376 7305 6732 3515 162 -3488 -6982 -6734 -4690 -1629 2481 6205 7392 6206 4001 -705
2954 -705 -4440 -6334 -6751 -5416 -1175 3058 5695 7200 6536 3092 -1024 -4353 -6956 -7075 -4526 -1274
2970 -1274 2685 6146 6880 5569 3041 -1170 -5119 -6544 -6729 -4930 -898 3414 5734 6748 5836 2181
$$ packed form
2862D416K746P95j815m217m137l416k385J124L450L725M444K965k07j900l339
2877B249m919l715j011Q31K682N038L852J760R24k359m275m046l007j868J267
2892f597L662L739M027L006q84k296l504m370l661m26J295K484M914L986J476
2907F851j3k207m342l840k664j436J464L972L714L665K003j18l134l448l971l584
2923g088j94J790L000M496L747J522n83k571m068m131k202r13J541M042L989K999
2939E376J929n73l217l353l650l494K48K044L061M110L724J187j186k205m706
2954g05l735j894m17J335M241M233K637J505o64l444m116l329k603j19K549L252
2970a274L959L461P34j311k528m211l949j425j85J799M032M312K320J014r12l655
$$ plain form
2986 2181 -1776 -4706 -7161 -6936 -4097 -717 3257 6527 7237 5337 2447 -1548 -5429 -6643 -6309 -4110
3002 -4110 -70 4052 5947 6957 5726 1816 -1901 -4629 -6767 -6538 -3461 268 3710 6632 7079
3017 7079 4917 2050 -1807 -5660 -6943 -5702 -3636 359 4413 6239 6634 5255 1682 -2716 -5149
3032 -5149 -6620 -6367 -2859 975 3705 6534 6819 4478 1190 -2134 -5930 -6814 -5475 -3172 543 4706
3048 4706 6151 5906 4449 683 -3387 -5879 -6740 -5635 -2760 1220 4090 6530 6342 3609 396 -2944
3064 -2944 -5925 -6780 -4884 -2549 1093 4889 6374 5414 4010 286 -3697 -5962 -6050 -5020 -1766 1896
3080 1896 4604 6441 6140 3384 -67 -3056 -5898 -6690 -4563 -1393 1571 5547 6697 5609 3383
3095 3383 80 -4113 -5522 -5811 -4373 -1334 2735 4855 6069 5902 2871 -582 -3422 -5913 -6155 -3928
$$ packed form
2986B181l957k930k455K25K839L380L974L270P10j900k890l995l881j214L34K199
3002d110M040M122J895J010j231l910l717k728k138K29L077L729L442K922M47
3017G079k162k867l857l853j283J241K066L995M054J826L95j379l573m398k433
3032e149j471K53L508L834K730K829K85k341l288l324l796q84J339K303L715M163
3048D706J445k45j457l766m070k492q61J105K875L980K870K440j88k733l213l340
3064b944k981q55J896K335L642L796J485r60j404l724l983k265q8J030L254L662
3080A896K708J837l01k756l451k989k842p92K127L170K964L976J150j088k226
3095C383l303m193j409k89J438L039M069K120J214j67l031l453k840k491k42K227
$$ plain form
3111 -3928 -1208 2025 5507 6461 5212 2513 -367 -4320 -6124 -5973 -4291 -1154 2872 5166 5860 5348
3127 5348 2331 -1352 -4177 -5873 -6284 -3998 -572 2288 5313 6376 4675 2063 -1038 -4592 -6332
3142 -6332 -5597 -3928 -821 3346 5405 5826 4991 2165 -1587 -4562 -5985 -5955 -3138 382 3270 5654
3158 5654 6668 4559 1596 -1097 -4579 -6482 -5281 -3140 7 3630 6049 6080 4605 1483 -2162
3173 -2162 -4737 -5703 -5474 -2628 1031 3506 5666 6435 4403 1085 -1837 -4703 -6190 -5129 -2663 167
3189 167 4042 6167 5671 3829 1128 -2510 -5087 -5727 -5362 -2773 1175 3787 5457 5728 3604 411
3205 411 -2484 -4920 -6326 -4998 -2098 735 4161 6083 5369 3524 391 -3130 -5584 -5843 -4774 -2015
3221 -2015 1590 4221 5517 5512 3420 -233 -3215 -5036 -6083 -4457 -1142 1385 4292 6042 4870 3018
$$ packed form
3111c928K720L233L482R54j249k699k880l953j804J51J682L137M026K294O94n12
3127E348l017l683k825j696m11K286L426K860L025J063j701k612l101l554j740
3142f332P35J669L107M167K059M21q35k826l752k975j423L0K817L520K888K384
3158E654J014k109k963k693l482j903J201K141L147L623K419L1j475l122l645
3173b162k575r66K29K846L659K475K160P69k032l318k922k866j487J061K466K830
3189A67L875K125m96j842k701l638k577o40L65K589L948K612J670K71k124l193
3205D11k895k436j406J328K900K833L426J922p14j845l133l521k454k59J069K759
3221b015L605K631J296nk092l653k982j821j047J626L315K527K907J750j172j852
$$ plain form
3237 3018 141 -3210 -5326 -5287 -4110 -1624 1895 4565 5625 5018 3228 -592 -3250 -4994 -5712 -3931
3253 -3931 -936 1913 4359 5961 4851 2545 -76 -3690 -5603 -5352 -3706 -1330 2283 4859 5333
3268 5333 4655 2488 -965 -3806 -5337 -5561 -4002 -581 2104 4380 5851 4825 1887 -679 -3909
3283 -3909 -6012 -5465 -3478 -1113 2471 5146 5336 4352 2292 -1370 -4106 -5470 -5294 -3384 -17 2918
3299 2918 4733 5678 4597 1618 -1199 -3704 -5684 -5277 -2704 -316 2901 5414 5601 4183 1666 -1598
3315 -1598 -4586 -5212 -5046 -3056 468 3115 4949 5532 4572 1044 -1832 -3971 -5580 -4764 -2263 291
3331 291 3175 5384 5333 3424 1129 -1806 -4590 -5330 -4494 -2637 721 3489 5100 5074 3779 574 -2310
3348 -2310 -4120 -5575 -4842 -2159 819 3332 5122 4977 3027 600 -2180 -4911 -5152 -4189 -2249 847
$$ packed form
3237C018k877l351k116L9J177K486L519K670J060o07j790l820k658j744p18J781
3253c931K995K849K446J602j110k306k621l614j913K51J646K376L613K576M74
3268E333o78k167l453k841j531k24J559L421K685K276J471j026k938k566l230
3283c909k103N47J987K365L584K675J90r84k060l662k736j364J76J910L367K935
3299B918J815R45j081k979k817k505j980M07K573K388L217K513J87j418k517l264
3315a598k988o26J66J990L524K647J834N83r60l528k876k139j609Q16K501K554
3331B91K884K209n1j909k295k935k784p40Q36J857L358K768J611k6j295l205k884
3348b310j810j455P33K683K978K513J790j45j950k427k780k731k41R63J940L096
$$ plain form
3364 847 3940 5015 4663 3265 -101 -2855 -4505 -5154 -4342 -1380 1437 3634 5197 4865 2529 229
3380 229 -2722 -5161 -5055 -3500 -1211 1390 4338 5186 4420 2911 -10 -2951 -4386 -4970 -3858 -780
3396 -780 1802 3759 5208 4731 2259 -532 -2644 -4892 -5223 -3417 -815 1466 4226 5293 4035 2663
3412 2663 -564 -3305 -4794 -5042 -3714 -807 2403 4268 4889 4657 1762 -835 -3277 -4959 -5006 -2924
3428 -2924 -922 1710 4696 4892 3775 1980 -678 -3927 -4795 -4464 -3565 -544 2825 4323 4999 4298
3444 4298 1756 -1299 -3365 -5074 -4772 -2886 -142 2258 4709 4951 3668 1830 -1102 -3876 -4837 -4377
3460 -4377 -2818 22 2904 4617 4693 3997 1251 -1573 -3425 -4836 -4411 -2452 22 2655 4820 5209
3476 5209 3573 1347 -1217 -4243 -5023 -4202 -2628 23 3217 4563 4591 3431 728 -1950 -3618 -4838
$$ packed form
3364H47L093J075l52j398l366k754j650o49Q12K962K817K197J563l32k336k300
3380B29k951k439J06J555K289K601K948Q48p66j509k921k941j435n84J112L078
3396g80K582J957J449m77k472k791k112k248l31J806K602K281K760J067j258j372
3412B663l227k741j489k48J328K907L210J865O21k32k895k597k442j682m7K082
3428b924K002K632K986J96j117j795k658l249q68L31Q99L021L369J498O76p01
3444D298k542l055k066j709L02J886K744K400K451K42j283j838k932k774r61M60
3460d377J559K840K882J713P6o96k746k824j852j411M25J959K474K633K165L89
3476E209j636k226k564l026p80Q21J574K651L194J346K8j160k703k678j668j220
$$ plain form
3492 -4838 -4351 -1958 737 2589 4396 4634 3106 578 -1688 -4322 -5007 -3726 -2079 518 3347 4649
3508 4649 4290 3323 746 -2472 -4379 -4764 -4272 -1740 961 3293 4677 4606 2618 99 -2128 -4241
3524 -4241 -4763 -3234 -1453 838 3437 4726 4261 2384 90 -2506 -4118 -4329 -3602 -1299 1796 3421
3540 3421 4685 4413 2404 -362 -2465 -4155 -4779 -3305 -1086 1444 3920 4772 4219 2513 21 -2885
3556 -2885 -4366 -4260 -3368 -956 2064 3589 4514 4199 2171 -768 -2693 -4267 -4674 -3090 -826 1575
3572 1575 3656 4789 3785 1850 -379 -3244 -4621 -4302 -3384 -943 2343 3700 4106 3656 1928 -1034
3588 -1034 -3024 -4312 -4625 -2825 -216 2077 3722 4707 3611 1356 -674 -3123 -4541 -3888 -2542 -322
3604 -322 2425 4282 4472 3660 1636 -1613 -3492 -4152 -4165 -2683 408 2425 4193 4665 3430 1230 -945
$$ packed form
3492d838M87K393K695J852J807K38j528k528k266k634o85J281J647K597K829J302
3508D649l59r67k577l218j907l85M92K532K701K332J384p1j988k519k227k113
3524d241n22J529J781K291K599J289m65j877k294k596j612k11P27K303L095J625
3540C421J264k72k009k766k103j690o24J474K219K530K476Q52n53j706k492k906
3556b885j481J06Q92K412L020J525R25l15k028k939j925j574m07J584K264K401
3572A575K081J133j004j935k229k865j377L19R18K441L286J357M06m50j728k962
3588a034j990j288l13J800K609K293J645R85j096k255k030k449j418O53J346K220
3604c22K747J857J90q12k024l249j879o60j3J482L091K017J768M72j235k200k175
$$ plain form
3621 -945 -3358 -5005 -3627 -2131 137 2904 4562 4280 3257 1396 -1861 -3510 -3870 -4011 -2119 747
3637 747 2664 4116 4280 3137 585 -1389 -3487 -4500 -3863 -1776 510 2647 4206 3944 2795 787
3653 787 -1865 -3832 -4057 -3615 -1615 836 3118 3735 3839 2540 -56 -2184 -3535 -4556 -3364 -1387
3669 -1387 892 2955 4473 3849 2346 280 -2143 -4014 -4096 -3296 -1630 1064 3184 4190 4026 2447
3685 2447 -446 -2189 -3717 -4304 -2973 -737 1134 3450 4137 3966 2371 -80 -2436 -4065 -3719 -2913
3701 -2913 -1035 1607 3432 4093 3470 2460 -452 -2783 -3431 -4008 -2772 -580 1470 3253 4438 3602
3717 3602 1478 -221 -2601 -4190 -3800 -2698 -725 1758 3628 4149 3473 1416 -898 -2992 -4149 -4198
3733 -4198 -2880 -502 1717 3279 4309 3613 1178 -587 -2732 -4313 -4196 -2588 -531 2118 3894
$$ packed form
3621i45k413j647J378J496K268K767J658k82j023j861l257j649l60j41J892K866
3637G47J917J452J64j143k552j974k098j013O37K087K286K137J559k62j149k008
3653G87k652j967k25M42K000K451K282O17J04j299k596k128j351j021J192J977
3669a387K279K063J518o24j503k066k423j871q2Q00J666K694K120J006j64j579
3685B447k893j743j528n87J331K236J871K316O87j71j595k451k356j629L46Q06
3701b913J878K642J825O61o23j010k912k331o48n77J236K192K050J783J185q36
3717C602k124j699k380j589L90J102J973K483J870N21o76k057k314k094j157m9
3733d198J318K378K219J562J030o96k435j765k145j581J17J608K057K649J776
$$ plain form
3748 3894 4009 3404 1785 -933 -3337 -4048 -3862 -2348 161 2319 3389 4084 3309 932 -1026 -2921
3764 -2921 -4083 -3784 -1762 58 2159 4067 4227 2944 1304 -1086 -3364 -4104 -3573 -2174 400 2461
3780 2461 3489 4027 3195 706 -1584 -2903 -3826 -3489 -1746 549 2548 3801 3879 2330 736 -1579
3796 -1579 -3540 -4041 -3285 -1991 485 2816 3731 3695 2636 417 -2003 -3360 -4033 -3806 -1274 489 2567
3813 2567 3921 3649 2021 180 -1632 -3504 -3828 -3057 -1669 807 3085 3861 3450 2359 -15 -2136
3829 -2136 -3437 -3974 -3364 -1012 1238 2799 4023 3912 1873 205 -2221 -3620 -3995 -2774 -959 1170
3845 1170 3160 3776 3320 1858 -43 -2308 -3320 -3712 -2845 -682 1607 3247 3785 3598 1647 -570
3861 -570 -2232 -3708 -3945 -2548 -533 1245 3351 3976 3082 1799 -304 -2915 -3753 -3201 -2774 -639 1809
$$ packed form
3748C894J15o05j619k718k404p11J86J514K509K158J070O95p75k377j958j895
3764b921j162K99K022J820K101J908J60j283j640k390k278p40N31J399K574K061
3780B461J028N38q32k489k290j319r23L37J743K295J999J253P8j549j594k315
3796a579j961n01P56J294K476K331R15l6j059k219k420j357o73K27K532J763K078
3813B567J354k72j628j841j812j872l24P71J388K476K278P76m11j091k374k121
3829b136j301n37O10K352K250J561J224j11k039j668k426j399l75J221J815K129
3845A170J990O16m56j462j901k265j012l92Q67K163K289J640N38j87j951k217
3861e70j662j476k37J397K015J778K106O25q94j283k103k611q38N52M27K135K448
$$ plain form
3878 1809 3195 3846 3513 1217 -693 -2598 -3776 -3742 -2338 -420 1557 3270 3878 3055 1326 -769
3894 -769 -2844 -3858 -3309 -2159 -392 2062 3273 3731 3216 1289 -1052 -2649 -3570 -3798 -2087 301
3910 301 2268 3375 4027 2828 1034 -892 -2982 -3660 -3227 -1962 120 2244 3703 3730 2674 1009
3926 1009 -1404 -2890 -3699 -3373 -1687 406 2208 3404 3597 2656 648 -1108 -3110 -3742 -2901 -1619
3942 -1619 410 2561 3605 3505 2374 393 -1692 -3163 -3710 -3152 -1298 716 2172 3524 3606 1954
3958 1954 114 -1556 -3026 -3715 -3012 -1248 446 2657 3510 3083 2070 162 -2028 -3154 -3482 -2885
3974 -2885 -1239 1100 2556 3426 3355 1662 -43 -1723 -3300 -3494 -2495 -599 1203 2740 3659 2797 1811
3991 1811 -60 -2178 -3430 -3201 -2471 -865 1396 2963 3582 3435 1867 -285 -1882 -3136 -3693 -2324
$$ packed form
3878A809J386O51l33k296j910j905j178L4J404J918J977J713O08q23j729k095
3894g69k075j014N49J150J767K454J211M58n15j927k341j597r21k28J711K388
3910C01J967J107O52j199j794j926k090o78M33J265K082K124J459K7j056j665
3926A009k413j486q09L26J686K093J802J196J93r41k008j756k002o32Q41J282
3942a619K029K151J044j00j131j981k085j471n47N58J854K014J456J352Q2j652
3958A954j840j670j470o89P03J764J694K211Q53m27j013j908k190j126l28N97
3974b885J646K339J456Q70p1j693j705j680j577j94R99J896J802J537R19q62r86
3991A811j871k118j252K29P30J606K261J567O19j47j568k152j597j254n57J369
$$ plain form
4007 -2324 -388 1202 2728 3881 2975 1311 -195 -2298 -3394 -3235 -2124 -612 1202 3013 3375 2904
4023 2904 1633 -718 -2288 -3318 -3491 -2418 -234 1612 2963 3847 2641 1247 -276 -2805 -3767 -3184
4039 -3184 -2109 -454 1545 3101 3514 2773 1158 -1344 -2651 -3295 -3250 -1884 49 1886 3062 3582
4055 3582 2735 777 -782 -2451 -3546 -2806 -1603 117 1911 3334 3536 2571 1127 -1105 -2582 -3318
4071 -3318 -2812 -1638 449 2090 2955 3427 2592 548 -1215 -2380 -3601 -2783 -1453 387 2210 3290
4087 3290 3233 1924 881 -1357 -3185 -3201 -2848 -1672 645 2084 3174 3278 2202 275 -1556 -2813
4103 -2813 -3248 -2699 -1130 483 2117 3286 3220 1962 336 -1678 -3147 -3245 -2398 -1271 766 2417 2942
4120 2942 3084 1975 -4 -2039 -2719 -3347 -2605 -848 889 2493 3474 3008 1748 219 -1780 -3156
$$ packed form
4007b324J936J590J526J153r06j664j506k103j096J59J111J512J814J811L62m71
4023B904j271k351j570j030j73J073K184J846J351Q84j206j394j523k529r62N83
4039c184J075J655J999J556M13p41j615k502j307o44M5J366J933J837J176N20
4055C582q47j958j559j669j095P40J203J720J794J423K02r65j444k232j477p36
4071c318N06J174K087J641Q65M72q35k044j763j165j221Q18J330J840J823J080
4087C290n7j309j043k238j828j6L53J176K317J439J090J04j076j927j831j257
4103b813m35N49J569J613J634J169o6j258j626k014j469r8Q47J127K037J651N25
4120B942J42j109j979k035o80o28P42J757J737J604R81m66j260j529j999j376
$$ plain form
4136 -3156 -3265 -2120 -1081 1038 2737 2879 2913 1774 -401 -2072 -2929 -3086 -2251 -512 1194 2548 3645
4153 3645 2812 1378 -340 -2039 -3116 -3060 -2016 -617 1261 2779 3120 2585 1536 -616 -2008 -3120
4169 -3120 -3108 -2163 -179 1368 2488 3175 2617 1269 -638 -2102 -3185 -2978 -1914 -343 1488 2952
4185 2952 3038 2424 1085 -1025 -2759 -3060 -2795 -2044 -160 1750 2864 3247 2702 980 -814 -2226 -3301
4202 -3301 -3024 -1710 -190 1485 3203 2963 2293 1036 -873 -2647 -2874 -2521 -1850 274 2222 2795 3341
4219 3341 2408 968 -1242 -2376 -3165 -2681 -1392 316 1995 3175 3073 1927 847 -905 -2498 -3076
4235 -3076 -2381 -1434 268 2006 2864 2925 2185 498 -1471 -2539 -2826 -2530 -1011 468 1836 3252 2893
4252 2893 1562 494 -1299 -2885 -3208 -2452 -1076 515 2066 2864 2701 1882 44 -1676 -2671 -2995 -2452
$$ packed form
4136c156j09J145J039K119J699J42L4j139k175j671q57j57Q35J739J706J354J097
4153C645q33j434j718j699j077N6J044J399J878J518L41n35j049k152j392j112
4169c120J2R45J984J547J120O87n58j348j907j464j083K07J064J571J831J464
4185B952Q6o14j339k110j734l01K65P51J884J910J114L83n45j722j794j412j075
4202c301K77J314J520J675J718k40o70j257j909j774k27L53O71K124J948N73N46
4219C341r33j440k210j134p89M84J289J708J679J180j02j146j080j752j593n78
4235c076O95R47J702J738Q58O1p40j687j969j068k87K96J519J479J368J416l59
4252B893j331j068j793j586l23P56J376J591J551P98j63q19j838j720r95l24N43
$$ plain form
4269 -2452 -878 839 2192 3142 2951 1604 -58 -1535 -2918 -2864 -2010 -841 884 2632 2933 2392 1718
4286 1718 -308 -1846 -2709 -3002 -2313 -686 930 2364 2986 3149 1318 -232 -1268 -2831 -3013 -1787
4302 -1787 -356 1040 2538 3024 2151 1362 -294 -1836 -2851 -2744 -2023 -375 1391 2314 2732 2772 1234
4319 1234 -606 -1947 -2947 -2947 -1791 -254 1228 2555 2808 2150 967 -582 -2149 -2619 -2968 -1810 -168
4336 -168 1486 2439 2761 2361 843 -995 -2081 -2915 -2574 -1612 123 1379 2598 3129 2422 859 -722
4353 -722 -2003 -3020 -2508 -1541 -3 1687 2678 2808 2142 968 -1103 -2139 -2597 -2608 -1424 239 1472
4370 1472 2766 2904 1911 551 -986 -2255 -2929 -2201 -1011 344 1919 2785 2698 2049 369 -1182 -2360
4387 -2360 -2593 -2656 -1124 732 1727 2417 2754 1686 108 -1095 -2499 -2791 -2115 -1088 581 2099 2804
$$ packed form
4269b452J574J717J353R50j91j347j662j477j383N4Q54J169J725J748L01n41o74
4286A718k026j538q63k93O89J627J616J434O22J63j831j550j036j563j82J226
4302a787J431J396J498M86q73p89j656j542j015J07P21J648J766R23M18M0j538
4319A234j840j341j000%J156J537J482J327K53o58j183j549j567m70l49J158J642
4336a68J654R53L22m00j518j838j086q34L41R62J735J256J219N31p07j563j581
4353g22j281j017N12R67J538J690R91J30o66j174k071j036m58j1J184J663J233
4370A472J294J38r93j360j537j269o74P28J190J355J575Q66q7o49j680j551j178
4387b360k33o3J532J856R95O90L37j068j578j203j404k92O76J027J669J518P05
$$ plain form
4404 2804 2250 1547 321 -1355 -2334 -2433 -2415 -965 810 2096 2701 2454 1388 -100 -1434 -2343 -2885 -2018
4422 -2018 -624 663 1928 2709 2420 1413 216 -1639 -2491 -2491 -1924 -706 896 2106 2895 2467 1415
4439 1415 -348 -1609 -2464 -2481 -2045 -207 901 2251 2907 2329 1268 -469 -1694 -2751 -2444 -2064 -451
4456 -451 1179 2184 2440 2276 1086 -763 -1737 -2501 -2550 -2087 -149 1110 2217 2913 2098 666 -511
4473 -511 -1809 -2657 -2322 -1588 -296 1298 2386 2601 2151 828 -846 -1850 -2590 -2558 -1806 -15 1411
4490 1411 2234 2432 1892 538 -545 -2058 -2776 -2562 -1396 -172 1479 2524 2553 1816 684 -906 -2042
4507 -2042 -2383 -2353 -1324 255 1476 2230 2625 1838 604 -815 -1974 -2670 -2124 -928 459 1413 2490
4524 2490 2484 1728 486 -1076 -2375 -2598 -2284 -1209 413 1705 2342 2295 1835 -10 -1355 -1940 -2600 -2124
$$ packed form
4404B804n54p03j226j676r79r9J8J450J775J286O05k47j066j488j334r09n42Q67
4422b018J394J287J265P81k89j007j197j855q52%N67J218J602J210P89m28j052
4439A415j763j261q55j7M36J838J108J350O56n78j061j737j225j057L07L80J613
4456d51J630J005K56j64j190j849r74p64m9M63J938J259J107O96q15j432j177
4473e11j298q48L35P34J292J594J088K15m50j323j674j004p40L2P52J791J426
4490A411Q23J98n40j354j083j513p18K14J166J224J651J045K9p37j132j590j136
4507b042l41L0J029J579J221P54L95p87j234j419j159o96N46J196J387R54J077
4524B490op56j242j562j299k23L14J075J622J292O37m7m60j845j345n85o60M76
$$ plain form
4542 -2124 -683 313 1695 2638 2146 1412 249 -1458 -2279 -2391 -1755 -904 498 1972 2047 2085 1384 16
4560 16 -1388 -1944 -2674 -2023 -697 526 1725 2421 2319 848 -57 -1345 -2378 -2594 -1643 -686 819 2019
4578 2019 2439 2123 1319 -213 -1489 -2130 -2369 -1907 -390 974 1596 2540 2263 1031 -38 -1301 -2276
4595 -2276 -1984 -1540 -469 884 1911 2468 2039 1299 -345 -1641 -2151 -2160 -1396 70 1167 1904 2406 1992
4613 1992 709 -418 -1424 -2700 -2386 -1448 -364 1132 2294 2266 1983 656 -568 -1959 -2169 -2210 -1497
4630 -1497 155 1428 2171 2156 1856 573 -854 -1684 -2319 -2207 -1210 -136 1110 2010 2340 1698 624 -571
4648 -571 -2102 -2371 -1993 -1267 -55 1460 2092 2252 2064 422 -979 -1575 -2174 -2093 -1002 295 1361 2206
4666 2206 2466 1675 570 -836 -2002 -2307 -1768 -1052 247 1667 1953 2086 1371 307 -1035 -1631 -2152
$$ packed form
4542b124J441R96J382R43m92p34j163j707q21j12O36Q51J402J474P5L8p01j368
4560A6j404n56p30O51J326J223J199O96j02j471r05j288j033k16R51R57J505J200
4578B019M20l16q04j532j276o41k39M62J517J364O22R44k77j232j069j263r75
4595b276K92M44J071J353J027N57m29p40j644j296n10rP64J466J097P37N02m14
4613A992j283j127j006j276L14R38J084J496J162k8k83j327j224j391k10m1P13
4630a497J652J273P43j5l00j283j427q30o35J12R97J074J246R00L30o42j074j195
4648e71j531k69L78P26J212J515O32J60j88j642j401n96n99Q1J091J297J066Q45
4666B206K60p91j105j406j166l05N39P16J299J420K86J33p15j064j342n96n21
$$ plain form
4683 -2152 -2058 -1097 406 1461 2308 2309 1214 324 -1161 -2245 -2300 -1918 -727 512 1664 2080 2230 1485
4701 1485 10 -1372 -2055 -2102 -2006 -583 598 1540 1953 1883 882 -96 -1067 -2320 -2569 -1647 -644 521
4719 521 1798 1978 1853 975 -24 -1435 -2166 -2073 -1724 -608 983 1796 2313 2121 1010 -349 -1113 -1891
4737 -1891 -2114 -1374 -438 777 1770 2457 1596 810 -155 -1574 -2068 -1989 -1528 -413 1055 1827 1881 2027 894
4756 894 -451 -1619 -2248 -2190 -1513 -234 1114 1930 2322 1601 535 -501 -1602 -2110 -2005 -1214 -262 1109
4774 1109 1904 1970 1903 778 -653 -1538 -2087 -2189 -1014 144 1404 1752 2081 1396 793 -643 -1646 -2161
4792 -2161 -1781 -1284 -68 1242 2076 1940 1653 453 -1056 -1833 -2074 -2051 -1006 207 1105 1780 2136 1116
4810 1116 572 -734 -1440 -2116 -1670 -736 248 1399 2301 1807 1470 626 -1072 -1517 -1827 -1808 -964 578 1353
$$ packed form
4683b152R4R61J503J055Q47Jj095q90j485j084n5L82J191J239J152M16J50p45
4701A485j475j382o83m7R6J423J181R42M13p0j001r78r71j253k49R22J003J165
4719E21J277J80j25q78r99j411p31R3L49J116J591Q13N17j92j111j359p64p78
4737a891k23P40R36J215R93O87q61p86r65j419m94P9M61J115J468P72N4J46j133
4756H94j345j168o29N8O77J279J348Q16L92p21j066j036j101n08J05P91R52J371
4774A109P95O6o7j125j431q85n49j02J175J158J260L48L29o85o03j436j003n15
4792b161L80M97J216J310Q34j36k87j200j509p77k41K3J045J213Q98O75L56j020
4810A116n44j306p06o76M46R34R84J151R02m94l37q44j698m45l10J9Q44J542P75
$$ plain form
4829 1353 1840 2099 1342 497 -1013 -1668 -2138 -1600 -500 51 1418 1988 1797 951 336 -1042 -1824 -2100
4847 -2100 -1730 -836 628 1528 1923 1948 1351 18 -955 -1882 -1958 -1700 -562 241 1484 1880 1484 913 195
4866 195 -1284 -1745 -1484 -1478 -539 643 1342 1801 1630 1128 -331 -1332 -1576 -2092 -1322 -84 659 1729 1982
4885 1982 1624 864 167 -1078 -1915 -1590 -1074 -641 940 1780 1878 1767 929 -237 -1462 -1760 -1963 -978 -118
4904 -118 778 1419 1995 1545 578 -184 -1386 -1803 -1748 -1324 -464 1007 1847 1930 1743 795 -389 -1424 -1760
4923 -1760 -1595 -1210 -110 1041 1594 1787 1383 315 -440 -1165 -1939 -1640 -904 -121 898 1753 1835 1487 673
4942 673 -500 -1689 -1731 -2044 -1172 -21 1082 1444 1989 1290 290 -628 -1503 -1934 -1687 -1208 -162 1139
4960 1139 1795 1818 1171 359 -629 -1514 -1517 -1566 -796 209 1365 1585 1824 1204 116 -485 -1544 -1687 -1593 -319
$$ packed form
4829A353M87K59p57q45j510o55m70N38J100N51J367N70j91q46o15j378p82k76
4847b100L70Q94J464R00L95K5n97j333r73r27p6K58J138Q03J243L96l96n71p18
4866A95j479m61K61OR39J182O99M59j71n02j459j001k44n16P70J238P43J070K53
4885A982l58p60o97j245q37L25N16M33J581Q40R8j11q38j166j225k98k03R85Q60
4904a18Q96O41N76m50r67p62j202m17N5M24Q60J471Q40Q3j87r48j184j035l36
4923a760J65L85J100J151N53J93m04j068p55p25p74K99P36P83J019Q55Q2l48q14
4942F73j173j189m2l13Q72J151J103L62N45o99j000r18q75m31K47M79J046J301
4960A139O56K3o47q12r88q85lm9P70J005J156K20K39o20j088o01j059j43R4J274
$$ plain form
4980 -319 260 1089 1621 1802 978 313 -730 -1584 -1709 -1330 -734 547 1325 1792 1522 1484 -116 -882 -1504
4999 -1504 -1811 -1475 -548 485 1017 1848 1626 1052 -208 -944 -1523 -1717 -1433 -722 578 1432 1816 1389 947
5018 947 -44 -1196 -1511 -1696 -1173 -509 504 1432 2069 1499 761 -239 -1314 -1978 -1705 -1006 -149 718 1665
5037 1665 1719 1521 1148 -250 -1106 -1687 -1818 -1411 -202 252 1267 1512 1369 788 -255 -914 -1798 -1593 -951
5056 -951 -217 753 1661 1816 1297 805 -335 -1222 -1548 -1333 -1143 -193 1026 1566 1595 1493 593 -479 -1241
5075 -1241 -1822 -1487 -868 -195 712 1287 1631 1152 752 -351 -1169 -1491 -1619 -871 -14 961 1356 1453 1102 94
5095 94 -789 -1052 -1722 -1576 -639 7 751 1669 1546 1102 414 -277 -1334 -1626 -1514 -552 196 1075 1557 1488
5115 1488 1172 445 -845 -1209 -1569 -1383 -584 276 1097 1668 1691 1032 188 -597 -1224 -1487 -1217 -490 187 1340
$$ packed form
4980c19N79Q29N32J81q24o65j043q54j25L79N96J281P78M67k70l8j600p66o22
4999a504l07L36R27J033N32Q31k22n74j260p36n79j94K84P11J300Q54L84m27m42
5018I47r91j152l15j85N23O64J013R28O37n70p38j000j075o64K73O99Q57Q67R47
5037A665N4j98l73j398q56n81j31M07J209M54J015K45j43n81j043o59q84K05O42
5056i51P34R70R08J55n19m92j140q87l26K15J90R50J219N40K9j02r00j072p62
5075a241n81L35O19O73R07N75L44m79m00j103q18l22j28P48Q57R75L95R7l51j008
5095I4q83k63o70J46R37O46P44R18j23m44o88o91j057k92J12R62P48Q79M82o9
5115A488l16p27j290l64l60J86P99Q60Q21N71K3o59q44p85o27k63K70P27O77J153
$$ plain form
5135 1340 1487 1489 818 172 -856 -1407 -1407 -1403 -624 366 921 1643 1351 960 -86 -586 -1192 -1588 -1180 -622 448
5156 448 963 1591 1376 919 135 -931 -1410 -1381 -1124 -547 462 1198 1401 1453 695 -228 -721 -1255 -1537 -1098
5176 -1098 -443 231 1240 1478 1606 754 -111 -1282 -1270 -1355 -1138 -162 526 1360 1752 1351 845 -207 -975
5195 -975 -1436 -1272 -777 -5 488 1339 1601 1139 798 -98 -1180 -1616 -1333 -1100 -244 729 1316 1416 1115 493
5215 493 -115 -978 -1687 -1624 -991 -336 728 1188 1509 1023 226 -68 -1058 -1392 -1184 -654 -97 1097 1340 1569
5235 1569 930 207 -338 -942 -1533 -1204 -767 -90 643 1129 1318 954 473 -293 -1158 -1647 -1257 -651 -25 1059
5255 1059 1367 1574 830 396 -740 -983 -1270 -1293 -622 107 1041 1021 1523 1107 304 -599 -1195 -1431 -1285 -438
5275 -438 239 1054 1709 1407 746 431 -582 -1133 -1495 -1228 -419 320 1010 1321 1307 703 -108 -679 -1261 -1372
$$ packed form
5135A340J47Ko71o46j028n51%MP79R90N55P22k92l91j046n00o06l96M08N58J070
5156D48N15O28k15m57p84j066m79K9K57N77J009P36K03N2p58r23m93n34k82M39
5176a098O55O74J009K38J28q52q65j171J2q5K17R76O88Q34L92m01n06j052p68
5195i75m61J64M95P72M93Q51K62m62l41q96j082m36K83K33Q56R73N87J00l01o22
5215D93o08q63p09O3O33O55J064M60L21m86p97k94r90l34K08N30N57J194K43K29
5235A569o39p23n45o04n91L29M37O77P33M86J89l64m81p66q65m89L90O06O26J084
5255A059L08K07p44m34j136k43k87k3O71P29R34k0N02m16q03r03n96k36J46Q47
5275d38O77Q15O55l02o61l15j013n51l62K67Q09P39O90L11j4o04q11n71n82j11
$$ plain form
5295 -1372 -1070 -543 163 979 1542 1171 630 143 -772 -1305 -1114 -967 -511 383 907 1195 1148 734 -41 -729
5315 -729 -1075 -1481 -719 -412 340 1092 1146 1111 620 -157 -899 -1351 -1325 -973 -86 666 1023 1436 1080 457 -365
5336 -365 -771 -1226 -1165 -846 31 656 1051 1365 1081 514 26 -747 -1282 -1219 -758 -125 501 1224 1222 967 616
5357 616 -311 -667 -1001 -1212 -718 98 563 821 1359 1105 287 -233 -1068 -1187 -1319 -490 -49 850 1043 1359
5377 1359 1067 375 -341 -1205 -1180 -1008 -813 14 581 1224 1350 784 179 -362 -901 -1338 -1188 -719 214 620
5397 620 1249 1240 1046 184 -287 -957 -1469 -1150 -648 222 826 1140 1551 635 116 -419 -890 -1295 -1071 -509 185
5418 185 685 1088 1229 723 366 -309 -930 -1098 -951 -562 316 1017 1115 1086 734 258 -764 -978 -1319 -1113
5438 -1113 -520 235 957 1218 1023 710 230 -557 -959 -1313 -881 -441 324 981 1251 1134 579 160 -807 -1159
$$ packed form
5295a372L02N27P06Q16N63l71n41m87r15n33J91J47M56Q94N24K88m7m14p75o88
5315g29l46m06P62L07P52P52N4l5m91p77p42m52K6L52Q87P52L57M13l56o23q22
5336c65m06m55O1L19Q77O25L95L14k84n67m88p73n35O3M61O33O26P23kk55l51
5357F16r27l56l34k11M94Q16M65K58N38k54q18n20q35j19j32Q29M41Q99J93L16
5377A359k92o92p16q64K5J72J95Q27N67O43J26n66o05n41n39m37J50M69R33M06
5397F20O29rj94q62m71o70n12L19N02Q70O04L14M11r16n19n35m71m05K24N62O94
5418A85N00M03J41n06l57o75o21j68J47L89Q78P01R8k9l52m76j022k14l41K06
5438a113N93P55P22K61j95l13m80p87m02l54M32M40P65O57K70j17n55m19r67l52
$$ plain form
5458 -1159 -1321 -1079 -196 315 738 1379 996 498 -121 -770 -931 -995 -815 -123 473 942 920 893 459 -42 -814
5479 -814 -1116 -1016 -1076 -308 620 933 974 1039 521 -223 -696 -1025 -1165 -644 -203 243 967 1042 850 427 -104
5500 -104 -857 -1171 -1141 -846 -114 659 816 986 1216 272 -48 -685 -1370 -1082 -783 62 801 1085 1245 881
5520 881 434 -90 -1094 -1118 -943 -862 -187 442 1043 1141 997 158 -299 -869 -1277 -1000 -562 -70 685 1002 1164
5541 1164 698 222 -347 -800 -914 -791 -543 -28 904 1229 1250 822 310 -297 -958 -1083 -838 -344 145 928
5561 928 1024 1215 751 103 -683 -1160 -1037 -761 -440 257 763 1024 984 729 133 -368 -498 -1024 -785 -217 368
5582 368 679 813 1105 745 321 -335 -1023 -930 -838 -365 205 881 1085 947 599 5 -757 -928 -1296 -825 -392
5603 -392 482 643 1047 1069 475 33 -394 -723 -952 -837 34 220 923 919 805 360 -179 -463 -1107 -813 -1041
$$ packed form
5458a159j62K42Q83N11M23O41l83m98o19o49j61o4J80O92N96M69k2k7m34n01p72
5479h14l02J00o0P68R28L13M1O5n18p44m73l29j40N21M41M46P24P5j92m23n31
5500a04p53l14L0K95P32P73J57J70K30r44l20o37o85K88K99Q45P39K84J60l64
5520H81m47n24j004k4J75Q1O75O29O01R8j44q39m57n70m08K77M38M92P55L17J62
5541A164m66m76n69m53j14J23K48N15R32L25K1m28n12o07o61j25K45M94M89P83
5561I28R6J91m64o48p86m77J23K76L21O97N06K61m0k55n96n01j30n26K39N68N85
5582C68L11J34K92l60m24o56o88R3R2M73N70O76K04j38l48n94p62j71l68M71M33
5603c92Q74J61M04K2n94m42m27l29k29J15Q71J86P03mj14m45n39k84o44K94k28
$$ plain form
5624 -1041 -508 318 534 1186 977 474 -42 -563 -969 -1078 -522 -238 305 824 1039 847 687 -87 -884 -780
5644 -780 -988 -556 -55 172 1100 925 804 446 -234 -401 -908 -794 -538 27 541 1135 1050 657 392 -268
5664 -268 -479 -926 -1076 -800 55 172 913 1107 761 461 -113 -472 -941 -895 -586 -55 480 918 1174 978
5684 978 277 -299 -631 -846 -853 -867 -78 581 824 920 554 380 -240 -451 -727 -927 -598 242 696 1024 1195
5705 1195 884 244 -251 -762 -1132 -927 -194 -27 749 684 926 269 107 -265 -659 -917 -829 -598 163 589
5725 589 778 929 475 1 -458 -511 -839 -696 -240 111 640 885 811 629 -167 -603 -827 -988 -739 -597 204
5746 204 747 869 826 411 189 -552 -878 -783 -276 -427 312 776 678 834 395 101 -719 -711 -887 -613 -228 289
5768 289 570 920 922 481 8 -775 -1107 -870 -563 -358 370 589 1019 700 377 -37 -715 -748 -1028 -522 -205
$$ packed form
5624a041N33Q26K16O52k09n03n16n21m06j09N56K84N43N19K15j92j60p74p97J04
5644g80k08M32N01K27R28j75j21l58o80j67n07J14K56N65N14N94q5l93k65o60
5664b68k11m47j50K76Q55J17P41J94l46l00n74l59m69M6L09N31N35M38K56j96
5684I78p01n76l32k15pj4P89O59K43R6l66j74o20k11k76k00L29Q40M54L28J71
5705A195l11o40m95n11l70K05P33J67P76o5K42o57j62l72l94k58Q8K31P61M26
5725E89J89J51m54m74m59n3l28J43M56L51N29K45p4j82p96m36k24j61K49J42Q01
5746B04N43J22m3m15k22p41l26R5N07j51P39M64r8J56m39k94q20Qj76K74L85N17
5768B89K81L50Km41m73p83l32K37L07K05P28K19M30l19l23m14o78l3k80N06L17
$$ plain form
5789 -205 523 754 1040 813 654 27 -541 -677 -1123 -648 -66 570 860 1084 853 293 -261 -483 -763 -876
5809 -876 -474 13 453 865 915 937 261 -120 -582 -883 -896 -632 -216 607 870 889 471 33 -65 -499 -949 -849
5831 -849 -540 -92 376 637 658 464 49 -276 -529 -1010 -748 -667 -190 514 695 1055 464 381 -401 -545 -831
5852 -831 -964 -494 -8 653 1097 962 547 144 -13 -770 -650 -427 -494 132 438 686 989 613 -44 -294
5872 -294 -633 -429 -724 -174 -52 364 917 796 442 159 -430 -786 -797 -475 -452 30 471 598 316 564 330
5893 330 -507 -686 -816 -713 -532 365 299 928 869 374 31 -529 -614 -873 -650 -391 -154 706 733 567 674
5914 674 -13 -502 -720 -612 -557 -296 183 720 876 493 166 -493 -328 -827 -804 -690 -5 327 651 657 504
5935 504 213 -263 -355 -388 -671 -586 32 455 734 715 575 697 -80 -491 -514 -869 -503 -142 172 614 833 420
$$ packed form
5789b05P28K31K86k27j59o27n68j36m46M75N82O36K90K24k31n60n54k22k80j13
5809h76M02M87M40M12N0K2o76l81m62l01j3K64M16Q23K63J9m18m38r8m34m50J00
5831h49L09M48M68K61K1j94m15l25k53m81K62Q1M77P04J81L60n91q3p82j44k86
5852h31j33M70M86O61M44j35m15m03j57p57J20K23o7O26L06K48L03l76o57k50
5872b94l39K04k95N50J22M16N53j21l54k83n89l56j1L22K3M82M41J27k82K48k34
5893C30q37j79j30J03J81Q97o6O29n9m95l43n60q5k59K23K59K37Q60K7j66J07
5914F74o87m89k18J08N5K61M79N37J56l83l27o59J65m99K3J14O85L32L24Oj53
5935E04k91m76r2l3k83Q5O18M23K79j9j40J22p77m11k3l55L66L61L14M42K19m13
$$ plain form
5957 420 392 -87 -647 -725 -665 -384 -264 363 508 788 564 38 -164 -554 -769 -745 -553 -50 0 661 829 572
5979 572 264 -151 -553 -590 -910 -622 0 223 796 849 342 -11 -248 -615 -629 -944 -512 180 541 680 737
6000 737 404 250 -440 -344 -785 -429 -422 -73 564 533 827 468 206 -195 -605 -713 -683 -350 356 402 754 789
6022 789 624 192 -168 -736 -816 -507 -228 156 530 495 814 458 -35 -78 -709 -451 -596 -318 124 630 482
6043 482 769 470 -107 -508 -667 -869 -626 -154 407 592 547 341 383 119 -616 -753 -760 -600 -245 353 563
6064 563 525 810 366 143 -439 -530 -788 -427 -58 130 659 820 654 316 24 -334 -666 -783 -500 -173 173
6085 173 603 974 844 445 -238 -105 -628 -670 -394 -206 300 458 880 815 648 -99 -437 -605 -773 -567 -35
6106 -35 457 529 818 653 494 -263 -408 -640 -542 -384 -73 324 554 507 745 56 -143 -559 -732 -727 -172 -23
$$ packed form
5957D20k8m79n60p8O0K81J20O27J45K80k24n26k02l90k15K4J92N03N0O61J68k57
5979E72l08m15m02l7l20K88O22K23N73N3n07l53k37l67j4l15M32O92L61J39N7
6000G37l33j54o90R6m41L56PL49O37l1K94l59k62m01m10j08L0L33P06M6L52L5
6022G89j65m32l60n68q0L09K79L84L74l5L19l56m93m3o31K58j45K78M42N06j48
6043D82K87k99n77m01j59k02K43M72N61J85m5k06M2k64p35j37pJ60L55N98K10
6064E63l8K85m44k23n82r1k58L61L69J88N29J61j66l38k92l58l32j17K83L27L46
6085A73M30L71j30l99o83J33n23m2K76J88N06J58M22o5j67p47l38j68j68K06N32
6106c5M92P2K89j65j59p57j45k32R8J58L11L97K30m7K38o89j99m16j73NN55J49
$$ plain form
6128 -23 183 383 889 447 379 -229 -630 -690 -644 -367 254 -58 652 652 488 307 -87 -312 -861 -275 -390 -88
6150 -88 254 500 560 386 -50 -140 -532 -510 -474 -370 -20 314 321 1094 625 358 -212 -581 -763 -551 -323 34
6172 34 220 373 741 372 68 -86 -305 -649 -886 -310 1 501 388 704 456 -64 -55 -757 -712 -590 -67
6193 -67 -279 370 755 585 172 205 -267 -443 -522 -612 -462 149 471 501 573 128 226 -218 -618 -606 -443 -98 -34
6216 -34 449 441 511 423 193 -245 -401 -818 -488 -43 463 579 532 361 134 173 -478 -586 -697 -415 -131 305
6238 305 673 780 725 335 -152 -276 -618 -654 -504 -366 443 395 781 360 531 38 -456 -522 -693 -317 -125
6259 -125 244 603 436 708 406 48 -354 -569 -217 -322 -182 315 381 691 256 451 73 -651 -397 -506
6279 -506 -569 16 283 248 462 504 77 -196 -219 -445 -641 -379 -133 158 629 514 537 220 -94 -416 -767 -387
$$ packed form
6128b3K06K00N06m42o8o08m01o0M6K77O21l12P10%j64j81l94k25n49N86j15L02
6150h8L42K46O0j74m36r0l92K2L6J04L50L34PP73m69k67n70l69j82K12K28L57
6172C4J86J53L68l69l04j54k19l44k37N76L11N00j13L16k48n20Rp02M5J22N23
6193f7k12O49L85j70m13L3m72j76p9r0J50O11L22L0P2m45R8m44m00J2J63L45O4
6216c4M83qP0q8k30m38j56m17L30M45N06J16m7j71k27L9o51j08j11K82K84M36
6238C05L68J07n5l90m87j24l42l6J50J38Q09m8L86m21J71m93m94o6j71L76J92
6259a25L69L59j67K72l02l58m02k15L52j05J40M97O6L10m35J95l78p24K54j09
6279e06o3N85K67l5K14M2m27k73k3k26j96K62K46K91M71j15K3l17l14l22l51L80
$$ plain form
6301 -387 -354 113 242 625 381 468 260 -92 -214 -690 -781 -317 -67 326 556 426 232 -109 -108 -502 -522 -379
6323 -379 -423 75 509 370 581 447 25 -185 -341 -420 -359 -316 38 237 304 780 376 73 -79 -559 -589 -495
6345 -495 -184 360 548 571 296 346 -83 -157 -126 -354 -452 -260 288 160 518 206 136 83 -325 -336 -626 -561 -171
6368 -171 -23 360 618 871 293 -166 -247 -504 -334 -539 -217 105 398 631 578 321 140 -195 -579 -791 -487
6389 -487 -152 376 417 454 523 269 92 -284 -556 -578 -491 -17 104 395 654 693 213 193 -413 -624 -664 -377 -75
6412 -75 105 445 505 135 437 -158 -199 -648 -409 -476 -59 313 560 493 288 153 -112 -352 -358 -574 -372 -30
6434 -30 312 516 725 245 150 227 -698 -624 -452 -384 64 153 508 511 302 273 -151 -226 -491 -454 -270 137 410 352
6458 352 395 496 -8 61 -412 -739 -403 -232 -45 551 442 457 431 -69 -79 -369 -470 -638 -258 177 535 394
$$ packed form
6301c87L3M67J29L83k44Q7k08l52j22m76r1M64K50L93K30j30j94l41Jl94k0J43
6323c79m4M98M34j39K11j34m22k10j56p9O1M3L54J99O7M76m04l03j52m80l0R4
6345d95L11N44J88K3k75N0m29p4L1k28r8J92N48j28L58l12p0n3m08j1k90O5L90
6368a71J48L83K58K53n78m59q1k57J70k05L22L22K93K33n3k57j81l35l84k12L04
6389d87L35N28M1L7O9k54j77l76k72k2Q7M74J21K91K59L9m80k0o06k11m0K87L02
6412g5J80L40O0l70L02n95m1m49K39o7M17L72K47o7k05j35k65k40ok16K02L42
6434c0L42K04K09m80r5P7r25P4J72O8M48Q9L55Lk09k9m24p5k65L7J84M07K73n8
6458C52M3J01n04O9m73l27L36J71J87N96j09J5k6n00j0k90j01j68L80M35L58j41
$$ plain form
6480 394 663 459 169 -213 -664 -437 -488 52 -29 378 476 648 296 -129 -316 -121 -335 -433 -3 109 471
6501 471 396 584 581 99 -268 -261 -596 -169 -78 33 551 529 526 451 171 79 -291 -380 -466 -214 165 355 281 451 31
6526 31 152 -106 -521 -480 -337 24 79 439 356 372 403 183 -265 -390 -434 -465 -179 292 533 242 250 290 -169 -245
6550 -245 -430 -469 -253 16 -92 320 388 444 332 0 -391 -491 -575 -285 -333 300 667 669 355 101 -98 -279
6572 -279 -333 -358 -232 35 116 376 401 433 -8 71 -351 -469 -426 -232 -47 464 311 194 347 129 77 -262 -244
6595 -244 -728 -123 23 440 324 400 404 60 -418 -413 -324 -265 -177 -4 172 561 632 501 170 -55 -380 -329 -451
6618 -451 -219 120 280 358 569 384 80 -45 -613 -426 -354 -43 -192 407 606 537 220 -57 -136 -510 -403
6639 -403 -419 -111 24 259 462 454 520 -94 1 -383 -563 -339 -105 305 314 558 724 198 12 -144 -200 -302 -269
$$ packed form
6480C94K69k04k90l82m51K27n1N40q1M07R8J72l52m25j87J95k14r8M30J12L62
6501D71p5J88lm82l67Pl35M27R1J11N18k2lp5k80r2l70q9q6K52L79J90p4J70m20
6526C1J21k58m15M1J43L61N5L60q3J6L1k20m48j25m4l1K86M71K41k91QM0m59p6
6550b45j85l9K16K69j08M12O8N6j12l32l91j00q4K90m8O33L67Kl14k54j99j81
6572b79n4k5J26K67Q1K60K5L2m41P9m22j18M3J94J85N11j53j17J53k18n2l39J8
6595b44m84O05J46M17j16P6Ml44m78NQ9N9Q8J73J76L89P1j31l31k25l25N1j22
6618d51K32L39J60P8K11j85l04j25n68J87P2L11j49N99J99o9l17k77p9l74J07
6639d03j6L08J35K35K03qO6o14R5l84j80K24K34M10RK44J66n26j86j56n6j02L3
$$ plain form
6662 -269 -112 85 328 195 457 505 14 -165 -490 -653 -316 21 -47 273 352 463 117 28 -238 -450 -373 -106
6684 -106 -299 -99 371 463 124 282 -51 -569 -465 -335 -450 152 208 130 425 546 326 -1 -203 -603 -541
6705 -541 -300 -58 -54 445 454 538 104 298 -136 -236 -652 -240 67 163 137 349 322 11 12 -124 -463 -587 -359
6728 -359 -52 258 165 422 208 53 -326 -141 -337 -437 -131 204 236 247 482 557 282 -219 -137 -475 -523 -288
6750 -288 -126 48 449 569 317 58 127 -335 -257 -364 -222 7 229 285 427 246 204 96 -337 -415 -316 -407
6772 -407 -69 316 425 340 218 70 -117 -355 -420 -331 -22 -110 203 324 526 179 24 -276 -450 -348 -383 -234
6794 -234 -181 177 136 381 313 32 -359 -257 -427 -332 -231 76 228 185 531 296 -15 -175 -255 -526 -83 -238
6816 -238 225 10 338 482 334 -21 -137 -236 -431 -198 -185 233 348 535 362 315 283 -182 -363 -524 -396
$$ packed form
6662b69J57J97K43j33K62M8m91j79l25j63L37L37o8L20P9J11l46q9k66k12P7K67
6684a06j93K00M70R2l39J58l33n18J04J30j15O02N6p8K95J21k20l27k02m00O2
6705e41K41K42MM99RQ4m34J94m34j00m16M12L07R6k6K12k7l11Jj36l39j24K28
6728c59L07L10r3K57k14j55l79J85j96j00L06L35L2J1K35P5k75n01Q2l38m8K35
6750b88J62J74M01J20k52k59O9m62P8j07J42K29K22N6J42j81m2j08m33p8R9r1
6772d07L38L85J09q5j22j48j87k38o5Q9L09q8L13J21K02l47j55l00j74J02l5J49
6794b34N3L58m1K45o8k81l91J02j70R5J01L07J52m3L46k35l11j60q0k71M43j55
6816b38M63k15L28J44j48l55j16r9j95K33J3M18J15J87j73m7l2m65j81j61J28
$$ plain form
6837 -396 -297 167 340 184 504 117 39 -167 -380 -398 -97 -204 369 140 626 252 72 1 -139 -316 -140
6858 -140 -398 -321 194 173 53 406 222 80 -156 -530 -444 -243 -47 -110 388 381 418 152 62 -196 -285 -660 -185
6881 -185 -131 42 308 299 195 87 -52 -126 -211 -528 -267 -40 340 257 451 314 173 -113 -237 -198 -48 -240
6903 -240 -30 -25 557 451 137 38 -114 -214 -277 -220 -159 28 321 -26 375 180 -105 -96 -228 -203 -291 -620 181
6926 181 83 306 442 238 211 -237 -290 -326 -513 -196 169 214 252 497 82 75 -37 -221 -484 -467 -402 9 268
6949 268 353 392 326 147 -112 -269 -289 -295 -253 -215 47 322 474 86 62 -94 31 -558 -190 123 -15 50 295
6972 295 369 213 143 -128 -154 -472 -256 -187 -75 280 315 377 368 23 -275 -296 -126 -258 -98 -24 147 394 308 18
6996 18 126 -184 -509 -414 -306 -33 -121 222 220 464 287 313 -120 -195 -415 -271 127 264 309 109 557 95 3
$$ packed form
6837c96R9M64J73j56L20l87p8k06k13j8L01j07N73k29M86l74j80p1j40j77J76
6858a40k58P7N15k1j20L53j84j42k36l74Q6K01J96o3M98pL7k66r0k58q9l75M75
6881a85N4J73K66rj04j08j39p4q5l17K61K27L80q3J94j37j41k86j24L9J50j92
6903b40K10NN82j06l14r9j52j00o3N7O1J87K93l47M01j95k85Rj32K5q8l29Q01
6926A81r8K23J36k04k7m48n3l6j87L17L65M5L8K45m15pj12j84k63J7O5M11K59
6949B68Q5L9o6j79k59j57k0oM2L8K62K75J52l88k4j56J25n89L68L13j38O5K45
6972B95P4j56p0k71k6l18K16O9J12L55L5O2rl45k98k1J70j32J60P4J71K47q6k90
6996A8J08l10l25R5J08K73q8L43kK44j77K6m33p5k20J44L98J37M5k00M48m62r2
$$ plain form
7019 3 -193 -217 -421 -206 -88 -110 -68 302 162 186 56 -62 -461 -333 -399 -65 127 137 291 234 382 -76 -256
7042 -256 -206 -369 -411 -152 68 220 228 440 0 67 -103 -173 -292 -385 65 238 488 387 281 88 -81 -380
7064 -380 -192 -229 -81 -193 -108 258 127 297 128 -155 -38 -350 -293 -166 -87 75 178 256 198 31 87 -159
7086 -159 -244 -211 -111 65 131 299 420 385 184 -260 -141 -218 -316 -99 -183 253 55 294 91 -78 -369 -233
7108 -233 -156 -402 -171 -76 377 476 516 156 184 8 -165 -200 -326 54 -27 188 346 153 173 6 -212 -109 -394
7131 -394 -325 -41 343 463 51 78 147 -36 -422 -373 -272 -297 -34 -57 116 158 167 414 -280 -39 -453 -352 -193
7154 -193 -33 156 82 50 -76 144 -9 -242 -358 -149 -389 -105 210 23 202 328 23 -20 -57 -532 -396
7175 -396 -81 -172 131 300 417 99 170 -4 149 -196 -356 -156 -199 -23 186 409 219 51 45 -255 -599 -292
$$ packed form
7019Cj96k4k04K15J18k2M2L70j40K4j30j18l99J28o6L34J92J0J54n7J48m58j80
7042b56N0j63m2K59K20J52QK12m40O7j70p0j19r3M50J73K50j01j06j93j69k99
7064c80J88l7J48j12Q5L66j31J70j69k83J17l12N7J27P9J62J03P8n8j67N6k46
7086a59q5L3J00J76O6J68J21l5k01m44J19p7r8K17q4M36j98K39k03j69k91J36
7108b33P7k46K31R5M53R9M0l60K8j76j73l5j26L80q1K15J58j93K0j67k18J03k85
7131c94O9K84L84J20m12K7O9j83l86M9J01k5K63k3J73M2RK47o94K41m14J01J59
7154a93J60J89p4l2j26K20j53k33j16K09k40K84L15j87J79J26l05m3l7m75J36
7175c96L15r1L03J69J17l18P1j74J53l45j60K00m3J76K09K23j90j68ol00l44L07
$$ plain form
7197 -292 -6 -47 207 247 517 323 136 216 -140 -157 -293 -50 -205 10 311 321 172 -15 163 -409 -280 -190
7219 -190 -267 -84 313 245 411 342 -6 -126 -30 -70 -457 19 23 53 64 330 338 30 49 -229 -273 -336 -157 30 284
7244 284 215 148 -27 202 -2 -275 -225 -464 -357 37 13 -62 80 59 -103 -8 -121 -323 -186 -150 -140 -50 263
7267 263 -106 396 2 -282 -313 -294 -394 -130 139 238 223 89 223 -123 -103 -295 -323 -229 -244 242 399 77 167
7290 167 186 -14 -41 -307 -325 -272 -141 56 40 8 134 97 -33 -187 -158 -180 -103 -226 36 112 10 269 158 -55
7314 -55 -240 -131 -376 -482 -247 108 -73 210 139 142 151 -29 -122 -260 -430 27 -106 20 240 398 132 48 -325
7337 -325 -257 -323 -260 -145 72 44 380 268 204 43 -446 -32 -238 -131 -64 163 61 429 247 20 -10 -382
7359 -382 -42 -121 -153 -158 45 272 130 248 59 -102 -218 -7 -245 -135 -35 73 18 512 247 391 -182 -361
$$ packed form
7197b92K86m1K54M0K70j94j87Q0l56j7j36K43j55K15L01J0j49j87J78n72J29R0
7219a90p7J83L97o8J66o9l48j20R6m0l87M76ML0J1K66Ql08J9k78m4o3J79J87K54
7244B84o9o7j75K29k04k73N0k39J07L94k4p5J42k1j62R5j13k02J37L6J0R0L13
7267B63l69N02l94k84l1J9j00K64K69R9j5j34J34l46K0j92k8R4j5M86J57l22R0
7290A67J9k00k7k66j8N3J31J97j6l2J26l7j30j54K9k2P7j23K62P6j02K59j11k13
7314e5j85J09k45j06K35L55j81K83p1LRj80r3j38j70M57j33J26K20J58k66q4l73
7337c25O8o6O3J15K17k8L36j12o4j61m89M14k06J07O7K27j02L68j82k27l0l72
7359c82L40p9l2nK03K27j42J18j89j61j16K11k38J10J00J08n5M94k65J44n73j79
$$ plain form
7381 -361 -255 -329 -135 27 240 299 561 304 -57 -287 -271 -320 -378 -242 -112 269 242 497 341 -68 -17 -127
7403 -127 -205 -338 -149 32 53 335 319 113 -103 -132 -88 -191 -328 -258 161 161 101 202 4 135 18 -43 -316
7426 -316 -95 -34 34 82 164 300 160 18 -353 42 -129 -220 -338 -103 132 103 311 298 157 -97 -244 -345
7448 -345 -461 26 -172 117 279 285 155 46 -327 -122 -381 -95 82 315 365 295 321 14 -208 -112 -247 -314
7470 -314 -244 -267 295 141 269 356 155 -83 -106 -84 -308 -187 176 170 142 314 239 313 114 -361 -262 -78 -289 -18
7494 -18 256 494 217 83 112 323 -227 -326 -378 -156 -24 145 173 450 -33 -61 -209 -294 -263 -112 -104 -56 187 35
7518 35 323 98 89 112 -183 -237 -371 131 -121 384 276 301 133 134 33 -237 -143 -106 97 47 -2 145 173 73
7542 73 211 -164 -68 -135 -155 -144 94 233 187 108 233 157 -173 -330 -176 -338 60 -119 84 450 200 132 269
$$ packed form
7381c61J06p4J94J62K13N9K62k57l61k30J6m9n8J36J30L81k7K55j56m09N1j10
7403a27p8j33J89J81K1K82j6k06k16k9M4j03j37P0M19%o0J01j98J31j17o1k73
7426c16K21O1O8M8Q2J36j40j42l71L95j71r1j18K35K35k9K08j3j41k54j47j01
7448c45j16M87j98K89J62Oj30j09l73K05k59K86J77K33N0p0K6l07k22R6j35o7
7470c14P0k3N62j54J28Q7k01k38k3K2k24J21L63ok8J72p5P4j99m75R9J84k11K71
7494a8K74K38k77j34K9K11n50r9n2K22J32J69K8K77m83k8j48q5L1J51QM8K43j52
7518C5K88k25rK3k95n4j34N02k52N05j08K5j68Jj01k70R4L7K03n0m9J47K8j00
7542G3J38l75R6o7k0J1K38J39m6p9J25p6l30j57J54j62L98j79K03L66k50o8J37
$$ plain form
7565 269 -92 -106 55 -170 121 77 307 46 479 177 37 -287 -327 -139 -11 -53 85 -183 49 429 292
7586 292 94 -302 -205 -265 -223 -74 122 290 128 164 27 -97 -133 -295 -268 -267 162 10 146 200 206 181 131 129 -68
7611 -68 65 -395 -52 -10 223 -20 -54 118 61 19 -311 -126 -183 -70 72 40 228 360 187 -84 -253 -169 -234
7634 -234 -283 -70 -119 231 220 205 251 -142 9 -344 -470 -220 81 99 234 132 423 187 -48 -127 -318 -243 -273
7657 -273 -104 185 280 446 271 -20 -165 -26 -140 -290 -269 -237 26 292 361 -54 -118 106 -36 -63 -273 84
7679 84 111 301 262 62 62 391 46 -172 -94 -2 32 66 319 87 206 414 49 -52 -110 -321 68 -32 -163
7702 -163 186 94 354 212 -30 -69 -77 -261 -326 120 -145 159 217 64 110 14 137 -133 -85 -148 -196 -58 15 202
7726 202 256 161 46 -85 -139 34 -197 25 -167 12 102 115 150 1 -134 -118 -101 -113 -23 -17 291 267 68 133 120
$$ packed form
7565B69l61j4J61k25K91m4K30k61M33l02j40l24m0J88J28m2J38k68K32L80j37
7586B92j98l96R7o0M2J49J96J68j62L6j37j24l6j62K7JM29j52J36N4Ok5n0kj97
7611f8J33m60L43M2K33k43l4J72n7m2l30J85n7J13J42l2J88J32j73k71j69Q4o5
7634b34m9K13m9L50j1j5M6l93J51l53j26K50L01J8J35j02K91k36k35p9j91P5l0
7657b73J69K89R5J66j75k91j45J39j14j50K1L2K63K66O9m15o4K24j42k7k10L57
7679H4K7J90l9k00%L29l45k18P8R2L4L4K53k32J19K08l65j01n8k11L89j00j31
7702a63L49r2K60j42k42l9qj84o5M46k65L04N8j53M6r6J23k70M8o3m8J38P3J87
7726B02N4r5j15j31n4J73k31K22j92J79R0J3L5j49j35J6J7j2R0OL08k4j99O5j3
$$ plain form
7751 120 33 1 -389 -244 46 -63 93 -16 181 -19 200 -62 -202 68 -154 -26 -76 141 59 -14 113 23
7773 23 -17 -76 121 -190 -80 76 239 132 -27 79 188 -133 -169 -122 -159 -180 242 163 229 279 276 49 -83 -301
7797 -301 -262 -171 52 -101 296 286 295 3 -42 -159 -207 -96 36 192 149 328 9 -132 240 -84 40 -110 -10
7820 -10 -12 99 -87 190 330 -92 -27 186 -250 -24 -77 99 18 168 114 163 163 -150 -40 -151 -460 -268 -304 -158
7844 -158 30 134 259 266 127 67 -280 90 12 -205 47 508 100 289 126 232 188 -231 -107 -90 -69 117
7866 117 68 97 108 164 -75 -74 -123 -266 -39 27 -119 209 318 -119 235 92 31 -60 -250 -264 164 -253 246 210
7890 210 140 55 135 -77 -120 -72 -154 90 43 -79 146 107 -4 192 -80 -17 -204 -65 -244 267 45 7 98 143
7914 143 -258 -301 -225 -222 -380 -133 64 176 -13 90 253 -111 -166 -84 -194 -33 -67 -113 -106 170 245 124 7 -32
$$ packed form
7751A20q7l2l90J45K90j09J56j09J97k00K19k62j40K70k22J28n0K17q2p3J27r0
7773B3m0n9J97l11J10J56J63j07j59J06J09l21l6M7l7k1M22p9O6N0lk27j32k18
7797c01L9R1K23j53L97j0Rk92m5j17m8J11J32J56m3J79l19j41L72l24J24j50J00
7820a0kJ11j86K77J40m22O5K13m36K26n3J76q1J50n4M9%l13J10j11l09J92l6J46
7844a58J88J04J25Pj39o0l47L70p8k17K52M61m08J89j63J06m4m19J24J7K1J86
7866A17m9K9J1N6k39Jm9j43K27O6j46L28J09m37L54j43o1r1j90j4M28m17M99l6
7890B10p0q5Q0k12m3M8q2K44m7j22K25l9j11J96k72O3j87J39j79N11k22l8R1M5
7914A43m01m3P6Lj58K47J97J12j89J03J63l64n5Q2j10J61l4m6PK76P5j21j17l9
$$ plain form
7938 -32 26 126 59 -96 169 169 -44 128 22 57 -176 -314 -39 105 -113 29 277 85 217 111 -133 -199
7960 -199 -67 -60 129 -161 12 108 210 2 79 -80 -218 -321 -200 -188 -30 347 192 359 53 108 -266 -402
7982 -402 -12 -87 -9 38 287 206 214 186 -138 169 -171 -22 -39 -220 166 -77 -136 116 71 126 127 -221 -94 -294
8006 -294 -197 -44 -26 125 291 -154 7 -118 47 -158 -170 127 -3 141 196 65 146 -26 60 -138 -236 84
8028 84 -202 58 73 3 203 229 -139 210 -172 -149 86 131 -73 264 234 62 153 -106 -20 -38 -58 -270 -14 36
8052 36 56 308 57 136 -80 81 -293 -18 -221 -142 -126 -199 31 166 -214 77 69 -252 -176 -73 -59 -105 156 6
8076 6 142 -2 39 -331 -91 -292 -134 -1 208 51 238 143 202 -285 -186 -71 -12 -15 20 -86 230 197 70 191
8100 191 -7 -280 -195 -158 -321 -15 -25 133 192 -144 111 14 -59 -184 -189 -149 -299 253 235 305 176 -48 -85 16
$$ packed form
7938c2N8J00o7j55K65%k13J72j06L5k33j38K75J44k18J42K48j92J32j06k44o6
7960a99J32PJ89k90J73R6J02k08P7j59j38j03J21J2J58L77j55J67l06N5l74j36
7982d02L90p5P8M7K49q1Qk8l24L07l40J49j7j81L86k43n9K52m5N5Jl48J27k00
8006b94R7J53J8J51J66m45J61j25J65k05j2K97j30J44N5j31Q1j72Q6j98r8L20
8028H4k86K60J5p0K00K6l68L49l82K3K35M5k04L37l0j72R1k59Q6j8k0k12K56N0
8052C6K0K52k51P9k16J61l74K75k03P9J6p3K30J35l80K91ql21P6J03J4m6K61j50
8076FJ36j44M1l70K40k01J58J33K09j57J87r5N9m87R9J15N9lL5j06L16l3j27J21
8100A91j98k73Q5L7j63L06j0J58N9l36K55r7p3j25nM0j50N52j8P0j29k24l7J01
$$ plain form
8124 16 -5 -23 -63 -29 326 79 197 -20 -171 69 -72 -226 -48 -329 -220 116 -129 -12 -53 -10 81 -64 52
8147 52 -155 -114 -187 -25 -93 36 30 101 -122 -8 -364 -168 -7 -54 -48 217 168 100 56 -223 -144 -113 -29 61 -77 250
8173 250 237 220 188 -49 58 -217 -4 -44 -117 47 127 143 144 -24 102 -60 -137 -254
$$ packed form
8124A6k1j8m0L4L55k47J18k17j51K40j41j54J78k81J09L36k45J17m1M3R1j45J16
8147E2k07M1p3J62o8J29oP1k23J14l56J96J61m7OK65m9o8m4k79P9L1Q4R0j38L27
8173B50j3j7l2k37J07k75K13m0p3J64Q0J6Jj68J26j62p7j17
8191b54
$$ Imaginary data points
##PAGE= N=2
##DATA TABLE= (X++(I..I)), XYDATA
$$ plain form
0 0 0 0 0 0 0 0 0 0 0 0 0 8 -8 8 -8 8 -16 16 -16 24 -24 32 -40 46 -53 61 -72 81 -96 108 -123 143 -159 182
34 182 -206 230 -260 289 -325 361 -403 447 -495 550 -607 672 -740 815 -898 989 -1091 1201
52 1201 -1324 1463 -1615 1789 -1986 2214 -2476 2788 -3162 3622 -4204 4965 -6005 7532 -9985
67 -9985 14589 -26280 123895 177505 -56563 -147171 -247117 -252163 -180232 -43578 93040 233183
79 233183 270537 203630 98553 -2293 -155579 -245986 -224681 -153855 -43276 105874 193460
90 193460 232042 222980 110114 -53183 -154493 -218439 -240110 -161991 -20595 104090 204178
101 204178 241357 176608 71198 -34187 -166889 -239182 -197299 -126336 -28938 104206 186099
112 186099 201219 171178 72479 -61810 -151891 -195340 -207913 -133396 3978 104993 177158
$$ packed form
0@%%%%%%%%%%%Qj6J6j6J6k4L2l2M0m8N6p2Q6r9J14j33J53j77K04k31K66l02L41
34A82l88M36m90N49o14O86p64Q50r42J045j157J279j412J555j713J887k080K292
52A201k525K787l078L404l775M200m690N264n950O784p826R169j0970J3537j7517
67i985K4574m0869J50175N3610k34068r0608r9946n046P1931J36654J36618J40143
79B33183L7354o6907j05077j00846j53286r0407K1305P0826J10579J49150Q7586
90A93460L8582r062j12866j63297j01310o3946k1671P8119J41396J24685J00088
101B04178L7179o4749j05410j05385j32702p2293M1883P0963R7398J33144Q1893
112A86099J5120l0041r8699j34289r0081m3449j2573P4517J37374J01015P2165
$$ plain form
123 177158 211644 150884 47809 -51811 -159932 -212856 -169473 -93640 -4881 111879 188924
134 188924 183970 139142 54581 -65487 -147966 -175822 -173548 -100739 25702 114721 167875 193021
146 193021 135153 29679 -62759 -146484 -187087 -144378 -64113 19269 117103 181717 163579 107712
158 107712 34233 -73476 -148494 -160521 -144848 -75953 37665 118021 158155 170722 115416
169 115416 8916 -79612 -144267 -178450 -136949 -49240 31626 116299 170644 143784 81161 10864
181 10864 -84727 -151870 -151731 -121907 -58169 42303 116410 143453 144341 92782 -7742 -89741
193 -89741 -139424 -165760 -125696 -34848 44787 117815 164338 135459 67143 -5093 -90928 -151148
205 -151148 -144461 -100718 -37640 53643 124901 140414 128431 78419 -16422 -91742 -128237 -144875
$$ packed form
123A77158L4486o0760j03075r9620j08121n2924M3383P5833Q8759J16760P7045
134A88924m954m4828q4561j20068q2479k7856K274P2809J26441Q9019N3154K5146
146A93021n7868j05474r2438q3725m0603M2709Q0265Q3382R7834O4614j8138n5867
158A07712p3479j07709p5018j2027J5673O8895J13618Q0356M0134J2567n5306
169A15416j06500q8528o4655l4183M1501Q7709Q0866Q4673N4345k6860o2623p0297
181A0864r5591o7143J39K9824O3738J00472P4107K7043Q88n1559j00524q1999
193h9741m9683k6336M0064R0848P9635P3028M6523k8879o8316p2236q5835o0220
205a51148O687M3743O3078R1283P1258J5513j1983n0012r4841p5320l6495j6638
$$ plain form
217 -144875 -105345 -16588 59303 118402 155443 127390 55112 -16007 -90141 -144134 -132500 -80609
229 -80609 -19823 63073 129957 136617 113617 63892 -25076 -97152 -125476 -131256 -92539 -7139
241 -7139 66746 114136 140942 114201 39352 -31291 -92977 -139427 -124533 -67481 -8124 64624
253 64624 123891 123742 91585 41930 -36744 -103596 -123847 -118295 -80469 -469 71526 109285 127739
266 127739 101558 26366 -43291 -96418 -135387 -118616 -56110 5081 69951 122013 118345 77235
278 77235 26851 -43217 -104119 -116012 -98683 -60898 12176 79757 107318 116452 90421 18319
290 18319 -48565 -92864 -123165 -106157 -43347 19668 77399 123464 118442 70805 16997 -47154
302 -47154 -105410 -112811 -86346 -46080 22464 86072 107464 106078 77734 9511 -55614 -92581
$$ packed form
217a44875L9530Q8757P5891N9099L7041k8053p2278p1119p4134n3993J1634N1891
229h0609O0786Q2896O6884O660k3000m9725q8968p2076k8324n780L8717Q5400
241g139P3885M7390K6806k6741p4849p0643o1686m6450J4894N7052N9357P2748
253F4624N9267j49l2157m9655p8674o6852k0251N552L7826Q0000P1995L7759J8454
266A27739k6181p5192o9657n3127l8969J6771O2506O1191O4870N2062l668m1110
278G7235n0384p0068o0902j1893J7329L7785P3074O7581K7561R134k6031p2102
290A8319o6884m4299l0301J7008O2810O3015N7731M6065n022m7637n3808o4151
302d7154n8256p401K6465M0266O8544O3608K1392j386k8344o8223o5125l6967
$$ plain form
314 -92581 -113216 -96180 -34188 28705 77453 115816 109398 57827 2595 -55459 -108791 -113479
326 -113479 -79516 -36205 27667 88254 105864 94742 63136 -1943 -66987 -98307 -109014 -90808
338 -90808 -28787 35954 78357 109405 100986 46853 -9592 -61422 -107258 -108948 -69948 -22898
350 -22898 35161 90711 104479 84713 50943 -8669 -71376 -96939 -98774 -77922 -18222 45740
362 45740 83770 107175 97753 43922 -15826 -63452 -102667 -103440 -60498 -9489 43562 94531 105625
375 105625 78242 40820 -14224 -72635 -93927 -86651 -63502 -7758 52538 84301 98577 87060
387 87060 35112 -24165 -66646 -97914 -98504 -54424 -1490 46566 92663 102202 70052 28850 -23306
400 -23306 -78087 -96540 -82992 -55181 -3594 54675 82858 87442 73622 24678 -33718 -70086
$$ packed form
314i2581k0635J7036O1992O2893M8748L8363o418n1571n5232n8054n3332m688
326a13479L3963M3311O3872O0587J7610j1122l1606o5079o5044l1320j0707J8206
338i0808O2021O4741M2403L1048q419n4133n6445n1830m5836j690L9000M7050
350b2898N8059N5550J3768j9766l3770n9612o2707k5563j835K0852N9700O3962
362D5740L8030K3405r422n3831n9748m7626l9215p73M2942N1009N3051N0969J1094
375A05625k7383l7422n5044n8411k1292P276K3149N5744O0296L1763J4276j1517
387H7060n1948n9277m2481l1268n90M4080N2934M8056M6097R539l2150m1202n2156
400b3306n4781j8453J3548K7811N1587N8269K8183M584j3820m8944n8396l6368
$$ plain form
412 -70086 -93633 -91778 -47642 5259 48183 87141 94845 60917 17287 -30074 -78984 -95920
424 -95920 -76433 -44804 3267 59297 85075 83096 65944 19469 -38328 -71122 -87380 -83054
436 -83054 -39113 14819 54287 86531 92243 56985 10511 -33157 -75972 -91023 -66280 -31095
448 -31095 12807 64629 87146 78254 57729 13545 -41548 -72196 -81859 -74110 -32783 21950 59647
461 59647 84730 89099 53119 3406 -38469 -77705 -91367 -63871 -24760 17818 66013 86363
473 86363 71956 45998 3622 -48777 -77087 -78749 -66612 -27332 26255 60726 78494 80052
485 80052 44634 -6937 -45608 -78732 -91016 -62542 -19210 22636 67020 87129 69404 37986
497 37986 -3035 -53498 -80448 -76422 -59124 -20602 32514 65342 76399 73746 39224 -12306
$$ packed form
412g0086k3547J855M4136N2901M2924L8958P704l3928m3630m7361m8910j6936
424i5920J9487L1629M8071N6030K5778j979j7152m6475n7797l2794j6258M326
436h3054M3941N3932L9468L2244N712l5258m6474m3668m2815j5051K4743L5185
448c1095M3902N1822K2517q892k0525m4184n5093l0648r663P749M1327N4733L7697
461E9647K5083M369l5980m9713m1875l9236j3662K7496L9111M2578M8195K0350
473H6363j4407k5958m2376n2399k8310j662J2137L9280N3587L4471J7768J558
485H0052l5418n1571l8671l3124j2284K8474M3332M1846M4384K0109j7725l1418
497C7986m1021n0463k6950M026J7298L8522N3116L2828J1057k653l4522n1530
$$ plain form
509 -12306 -48400 -74630 -83193 -54258 -9013 30667 68882 87252 67007 31432 -7784 -54240
521 -54240 -80119 -71135 -49166 -11899 39313 70727 76594 69189 34901 -16051 -52073 -72327 -77351
534 -77351 -48839 -1722 35867 67908 83498 61700 22772 -14622 -56525 -79760 -67372 -40952
546 -40952 -5428 41603 70507 70194 57395 25113 -23781 -57923 -71686 -72687 -45590 1984 38427
559 38427 65207 78237 56007 15055 -22132 -59102 -80519 -65881 -35197 -154 43105 70385
571 70385 66795 48534 17648 -28334 -59908 -67661 -63887 -37263 9091 43255 64175 72983 51772
584 51772 9869 -25675 -57395 -76392 -61344 -27139 7697 47350 73886 67261 44609 13496
596 13496 -30671 -61629 -64847 -56084 -29381 15881 49173 64484 68109 46569 4571 -30395 -56165
$$ packed form
509a2306l6094k6230q563K8935M5245L9680L8215J8370k0245l5575l9216m6456
521e4240k5879Q984K1969L7267N1212L1414N867p405l4288n0952l6022k0254n024
534g7351K8512M7117L7589L2041J5590k1798l8928l7394m1903k3235J2388K6420
546d0952L5524M7031K8904l13j2799l2282m8894l4142j3763j001K7097M7574L6443
559C8427K6780J3030k2230m0952l7187l6970k1417J4638L0684L5043M3259K7280
571G0385l590j8261l0886m5982l1574p753L774K6624M6354L4164K0920Q808k1211
584E1772m1903l5544l1720j8997J5048L4205L4836L9653K6536o625k2652l1113
596A3496m4167l0958l218Q763K6703M5262L3292J5311L625k1540m1998l4966k5770
$$ plain form
609 -56165 -71565 -56410 -19676 14210 48831 72753 63989 37462 6162 -34999 -64860 -65806 -51885
622 -51885 -25040 18217 51935 63295 62516 41200 -1961 -37327 -59025 -70661 -55049 -16810
634 -16810 17672 48543 69791 59808 29877 -1871 -39224 -66758 -64905 -46051 -18851 21611
646 21611 54469 61632 56175 35005 -6331 -41309 -58576 -66424 -50342 -11714 23277 50829 69502
659 69502 59672 27307 -5438 -39106 -65857 -62566 -39312 -11299 27270 58415 62621 51858 29793
672 29793 -10033 -43563 -56307 -58393 -42349 -4542 29609 52145 66232 55870 22402 -10802
684 -10802 -40366 -64320 -60427 -34290 -5598 29802 59502 61727 46848 22831 -14715 -47709
696 -47709 -57989 -55144 -37752 -714 33169 50588 59573 48444 14372 -18086 -43547 -62820
$$ packed form
609e6165j5400J5155L6734L3886L4621K3922q764k6527l1300m1161k9861r46J3921
622e1885K6845M3257L3718J1360p79k1316m3161l5366k1698j1636J5612L8239
634a6810L4482L0871K1248r983k9931l1748l7353k7534J853J8854K7200M0462
646B1611L2858P163n457k1170m1336l4978j7267p848J6082L8628L4991K7552J8673
659F9502r830l2365l2745l3668k6751L291K3254K8013L8569L1145M206j0763k2065
672B9793l9826l3530j2744k086J6044L7807L4151K2536J4087j0362l3468l3204
684a0802k9564k3954L893K6137K8692L5400K9700K225j4879k4017l7546l2994
696d7709j0280K845J7392L7038L3883J7419Q985j1129l4072l2458k5461j9273
$$ plain form
708 -62820 -57367 -29344 -121 31175 57728 58372 39112 14600 -20058 -51382 -58802 -50618 -32428
721 -32428 3198 36948 51421 55909 43820 10033 -22843 -44446 -59691 -53461 -23938 6711
733 6711 34528 57942 57318 35271 9161 -22234 -51326 -56415 -43507 -23357 9968 41900 53602
746 53602 52531 39370 6512 -26390 -45136 -55438 -48810 -18858 12984 37729 58072 57173 32368
759 32368 4945 -24725 -52677 -56618 -40225 -18390 13268 44841 54077 48146 32553 592 -32173
772 -32173 -47851 -53138 -45098 -15023 17181 38540 54958 52692 26537 -2685 -29385 -54059 -57903
785 -57903 -38863 -14446 15461 45560 54525 44725 26911 -3657 -36488 -50610 -51357 -41136 -11333
798 -11333 21402 40693 52418 48967 22266 -7699 -31822 -52564 -54434 -33405 -7326 20029
$$ packed form
708f2820N453K8023K9223L1296K6553O44j9260k4512l4658l1324p420Q184J8190
721c2428L5626L3750J4473M488j2089l3787l2876k1603j5245O230K9523L0649
733F711K7817K3414o24k2047k6110l1395k9092n089J2908K0150L3325L1932J1702
746E3602j071j3161l2858l2902j8746j0302O628K9952L1842K4745K0343q99k4805
759C2368k7423k9670k7952l941J6393K1835L1658L1573R236n931j5593l1961l2765
772c2173j5678n287Q040L0075L2204K1359J6418k266k6155k9222k6700k4674l844
785e7903J9040K4417K9907L0099Q965r800j7814l0568l2831j4122p47J0221K9803
798a1333L2735J9291J1725l451k6701k9965k4123k0742j870K1029K6079K7355
$$ plain form
810 20029 47668 55418 42236 22514 -6319 -38071 -50795 -47318 -34950 -5932 26696 44447
822 44447 51787 46371 20579 -11127 -33033 -49905 -51260 -28810 -1307 23991 47944 54609 38450
835 38450 16231 -10585 -39646 -50416 -43128 -28289 -1431 29857 45353 47226 40217 14933 -16574
848 -16574 -36325 -48921 -49168 -26724 1925 24952 45884 51844 34520 10677 -14987 -41840 -51877
861 -51877 -41877 -24523 951 31411 45281 43189 33610 9336 -21373 -38795 -46590 -44602 -22426
874 -22426 6732 27994 44722 49224 31492 6054 -17243 -41493 -51253 -38861 -19391 5021
886 5021 34175 47876 43236 31296 7601 -22937 -39999 -43856 -39384 -17720 12121 32027 44857
899 44857 47431 28758 2197 -19785 -40579 -48798 -34886 -13087 9798 36272 48752 41311 26943
$$ packed form
810B0029K7639P750j3182j9722k8833l1752j2724L477J2368K9018L2628J7751
822D4447P340n416k5792l1706k1906j6872j355K2450K7503K5298K3953O665j6159
835C8450k2219k6816k9061j0770P288J4839K6858L1288J5496J873p009k5284l1507
848a6574j9751j2596k47K2444K8649K3027K0932N960j7324k3843k5664k6853j0037
861e1877J0000J7354K5474L0460J3870k092r579k4274l0709j7422p795J988K2176
874b2426K9158K1262J6728M502j7732k5438k3297k4250r760J2392J9470K4412
886E021K9154J3701m640j1940k3695l0538j7062l857M472K1664K9841J9906J2830
899D4857K574j8673k6561k1982k0794q219J3912K1799K2885K6474J2480p441j4368
$$ plain form
912 26943 3661 -25883 -42177 -43154 -36240 -14724 14962 34217 43656 44506 25786 -2474 -23700
925 -23700 -41607 -48808 -34023 -10550 12184 35858 47808 38380 20573 -1851 -29629 -45133
937 -45133 -42593 -32277 -11701 17298 35910 41952 39929 21772 -6614 -27522 -41668 -47006 -32358
950 -32358 -6941 15051 36432 47802 37630 17744 -3811 -30058 -45508 -40660 -27803 -7075
962 -7075 21477 39020 41601 36923 18613 -9494 -28892 -39344 -41664 -26899 -1120 19613 37179
975 37179 46482 35851 14307 -6382 -30074 -44497 -38612 -23583 -3657 23484 40764 41047 33432
988 33432 15411 -12071 -31677 -38863 -39156 -24220 1845 21965 35871 43108 31664 8970 -11427
1001 -11427 -31640 -44181 -37002 -20172 -551 23554 40054 38317 27958 10527 -15832 -34622
$$ packed form
912B6943k3282k9544j6294r77O914K1516K9686J9255R439Q50j8720k8260k1226
925b3700j7907p201J4785K3473K2734K3674J1950r428j7807k2424k7778j5504
937d5133K540J0316K0576K8999J8612O042k023j8157k8386k0908j4146n338J4648
950c2358K5417K1992K1381J1370j0172j9886k1555k6247j5450M848J2857K0728
962g075K8552J7543K581m678j8310k8107j9398j0452k320J4765K5779K0733J7566
975C7179R303j0631k1544k0689k3692j4423N885J5029J9926K7141J7280K83p615
988C3432j8021k7482j9606p186k93J4936K6065K0120J3906P237j1444k2694k0397
1001a1427k0213j2541P179J6830J9621K4105J6500j737j0359j7431k6359j8790
$$ plain form
1013 -34622 -39101 -36704 -22320 3583 23912 35080 40384 28994 5344 -14529 -32087 -43015
1025 -43015 -35282 -16054 3261 25099 40710 36966 24295 6919 -17864 -35806 -37675 -31845 -17005
1038 -17005 8276 27785 36228 38503 27041 2920 -17023 -31734 -40462 -32884 -12196 7188 27295
1051 27295 41816 37835 22469 4732 -18631 -36481 -37400 -28532 -13191 11010 30736 36508 35461
1064 35461 23338 -872 -21019 -32415 -38664 -30513 -9138 10728 27635 40319 35641 18468
1076 18468 234 -21306 -38360 -38277 -27405 -11498 12106 31757 36156 32378 20100 -4307 -24732
1089 -24732 -34299 -37884 -29001 -6608 13587 28419 38417 33097 14769 -4224 -23005 -38517 -37161
1102 -37161 -23479 -7292 14714 33670 36958 29996 17106 -5998 -26226 -33980 -35178 -25507 -3244
$$ packed form
1013c4622m479K397J4384K5903K0329J1168N304j1390k3650j9873j7558j0928
1025d3015P733J9228J9315K1838J5611l744j2671j7376k4783j7942j869N830J4840
1038a7005K5281J9509Q443K275j1462k4121j9943j4711q728P578K0688J9384K0107
1051B7295J4521l981j5366j7737k3363j7850r19Q868J5341K4201J9726N772j047
1064C5461j2123k4210k0147j1396o249Q151K1375J9866J6907J2684m678j7173
1076A8468j8234k1540j7054Q3J0872J5907K3604J9651M399l778j2278k4407k0425
1089b4732r567l585Q883K2393K0195J4832R998n320j8328j8993j8781j5512J356
1102c7161J3682J6187K2006J8956L288o962j2890k3104k0228p754j198R671K2263
$$ plain form
1115 -3244 17476 29898 38009 32548 13135 -6132 -23157 -36855 -34947 -19720 -2506 17789 35212
1128 35212 37099 27435 13294 -8435 -28243 -33854 -31075 -21105 280 20563 30831 35379 29704
1141 29704 9400 -10149 -24730 -36032 -33719 -17999 -195 18011 34281 35424 23934 9154
1153 9154 -10979 -30108 -35224 -29466 -18483 2035 22391 30537 31969 24833 4950 -14352 -26716
1166 -26716 -35066 -31845 -14756 3463 19066 33228 33993 20973 5846 -12766 -31037 -34850 -27348
1179 -27348 -15561 4163 24242 31577 30928 23057 3837 -16300 -27094 -32792 -28757 -11059 7733
1192 7733 21799 33720 33458 19195 2647 -14041 -30314 -33814 -23852 -10865 7489 26907 33527
1205 33527 29848 20639 1904 -18596 -28397 -31330 -26788 -9180 10425 23574 32911 32074 17291
$$ packed form
1115c244K0720J2422Q111n461j9413j9267j7025j3698J908J5227J7214K0295J7423
1128C5212J887r664j4141k1729j9808n611K779R970K1385K0283J0268M548n675
1141B9704k0304j9549j4581j1302K313J5720J7804J8206J6270J143j1490j4780
1153I154k0133j9129n116N758J0983K0518K0356Q146J432p136j9883j9302j2364
1166b6716q350L221J7089J8219J5603J4162P65j3020j5127j8612j8271l813P502
1179b7348J1787J9724K0079P335o49p871j9220k0137j0794n698M035J7698J8792
1192G733J4066J1921k62j4263j6548j6688j6273l500R962J2987J8354J9418O620
1205C3527l679r209j8735k0500r801k933M542J7608J9605J3149R337q37j4783
$$ plain form
1218 17291 -699 -16258 -31034 -34127 -22913 -8306 9409 27800 33168 26983 16376 -1818
1230 -1818 -21824 -30535 -30702 -24888 -7284 12595 24529 31054 29531 14023 -4391 -19060 -31717
1243 -31717 -33809 -21825 -5979 10290 27576 33116 25507 13691 -4020 -23218 -31647 -29351 -21359
1256 -21359 -4142 15933 26806 30609 27385 11754 -7371 -20123 -29976 -31139 -18115 -1305 13714
1269 13714 28637 33523 24560 11440 -5104 -23470 -31083 -27113 -18050 -1838 17913 28146 29575
1282 29575 25598 10273 -9351 -21333 -28560 -29146 -15707 1592 15538 28014 31799 21765 6962
1295 6962 -8003 -24421 -31311 -25642 -15061 145 18865 28396 27483 21707 6896 -12121 -23794
1308 -23794 -28826 -27729 -14801 3257 16253 26530 29867 19161 3768 -10174 -24882 -31464 -24432
$$ packed form
1218A7291j7990j5559j4776l093J1214J4607J7715J8391N368o185j0607j8194
1230a818k0006q711j67N814J7604J9879J1934O525j523j5508j8414j4669j2657
1243c1717k092J1984J5846J6269J7286N540p609j1816j7711j9198q429K296P992
1256b1359J7217K0075J0873L803l224j5631j9125j2752r853j163J3024J6810J5019
1269A3714J4923M886q963j3120j6544j8366p613L970R063J6212J9751J0233J429
1282B9575l977j5325j9624j1982p227n86J3439J7299J3946J2476L785j0034j4803
1295F962j4965j6418o890N669J0581J5206J8720R531r13n776j4811j9017j1673
1308b3794n032J097J2928J8058J2996J0277L337j0706j5393j3942j4708o582P032
$$ plain form
1321 -24432 -12415 2150 19680 28701 25922 18751 4387 -14254 -25224 -27565 -25004 -11812 6466
1334 6466 18531 26840 28885 18168 2078 -11089 -24072 -30071 -22448 -9614 4389 21080 29852
1347 29852 26244 17308 3393 -14636 -25511 -25911 -22103 -9483 9174 20885 26980 27372 16417
1360 16417 -444 -13621 -23950 -29083 -21101 -7101 6715 21397 29833 25133 14480 1336 -16262
1373 -16262 -27058 -26641 -20997 -8454 9659 22013 26137 25249 14289 -3150 -16490 -25116 -28728
1386 -28728 -20282 -4877 8231 21402 28843 23145 11230 -2009 -18299 -28350 -25833 -18427 -6225
1399 -6225 11426 23311 25439 23464 12436 -5105 -17798 -24612 -27065 -18311 -2631 10765 21871
1412 21871 28520 22534 10046 -2978 -17772 -27439 -24465 -15468 -3314 13696 25330 25637 21147
$$ packed form
1321b4432J2017J4565J7530R021k779p171j4364j8641j0970k341K561J3192J8278
1334F466J2065Q309K045j0717j6090j3167j2983n999P623J2834J4003J6691Q772
1347B9852l608q936j3915j8029j0875m00L808J2620J8657J1711O095L92j0955
1360A6417j6861j3177j0329n133P982J4000J3816J4682Q436m700j0653j3144j7598
1373a6262j0796M17N644J2543J8113J2354M124q88j0960j7439j3340q626l612
1386b8728Q446J5405J3108J3171P441n698j1915j3239j6290j0051K517P406J2202
1399f225J7651J1885K128j975j1028j7541j2693o814k453Q754J5680J3396J1106
1412B1871O649n986j2488j3024j4794r667K974Q997J2154J7010J1634L07m490
$$ plain form
1425 21147 10593 -6933 -19086 -24065 -24144 -15794 508 13349 22209 27521 21333 7519 -5364
1438 -5364 -18059 -27115 -23780 -13390 -1486 13725 25233 24887 18942 8236 -8605 -20969 -24197
1451 -24197 -23119 -14136 1919 14781 22106 25035 18402 3896 -8659 -19109 -26760 -22958 -11200
1464 -11200 717 14036 24665 23689 16475 5485 -9997 -21796 -24279 -21388 -12570 3382 16436
1477 16436 22337 23880 17175 2570 -10324 -19709 -25200 -20819 -8645 3360 15998 25639 23486
1490 23486 14329 3659 -10810 -22507 -23672 -18870 -9498 5800 18589 23212 23083 16182 1159
1503 1159 -11963 -19678 -24111 -19834 -6799 5811 16807 25300 23315 13084 1595 -11664 -23109
1516 -23109 -23814 -17388 -7636 7040 20095 23438 21083 13684 -1456 -14622 -21239 -23725 -18884 -5294
$$ packed form
1425B1147j0554j7526j2153m979p9Q350J6302J2841Q860N312o188j3814j2883
1438e364j2695r056L335J0390J1904J5211J1508l46n945j0706j6841j2364l228
1451b4197J078Q983J6055J2862P325K929o633j4506j2555j0450p651L802J1758
1464a1200J1917J3319J0629r76p214j0990j5482j1799k483K891Q818J5952J3054
1477A6436N901J543o705j4605j2894r385n491M381J2174J2005J2638R641k153
1490B3486r157j0670j4469j1697j165M802R372J5298J2789M623j29o901j5023
1503A159j3122p715m433M277J3035J2610J0996Q493j985j0231j1489j3259j1445
1516b3109p05O426R752J4676J3055L343k355p399j5140j3166o617k486M841J3590
$$ plain form
1530 -5294 7754 16944 23978 21730 10641 -1050 -13160 -23936 -24265 -16503 -6761 7365 20155
1543 20155 22905 19654 11687 -2980 -16427 -21987 -22541 -17418 -3113 10082 18278 23557 20329 8653
1557 8653 -3688 -14368 -23133 -23001 -14096 -3588 9241 21250 23685 18595 10394 -3246 -16634
1570 -16634 -21501 -20695 -14972 -1597 12364 19273 22813 19842 7568 -4937 -14572 -22342 -21477 -11859
1584 -11859 -805 10594 21483 23137 16822 7461 -5263 -18064 -22004 -19489 -12780 -17 13466
1597 13466 19600 21132 17616 5232 -7640 -15856 -22054 -21165 -10830 455 10940 20547 21996 14487
1611 14487 4917 -6860 -19092 -22697 -18314 -11171 1313 14697 19917 19753 15596 3041 -10128
1624 -10128 -17385 -21442 -19569 -8999 3312 12631 20719 21626 13292 3130 -7482 -18709 -22178 -16705
$$ packed form
1530e294J3048R190P034k248j1089j1691j2110j0776l29P762R742J4126J2790
1543B0155K750l251p967j4667j3447n560n54N123J4305J3195Q196N279l228j1676
1557H653j2341j0680q765J32Q905J0508J2829J2009K435n090q201j3640j3388
1570a6634m867Q06N723J3375J3961O909L540k971j2274j2505r635p770Q65R618
1584a1859J1054J1399J0889J654o315r361j2724j2801l940K515O709J2763J3483
1597A3466O134J532l516j2384j2872q216o198Q89J0335J1285J0485R607J449p509
1611A4487r570j1777j2232l605M383P143J2484J3384N220j64m157j2555j3169
1624a0128p257m057J873J0570J2311R319Q088R07q334j0162j0612j1227l469N473
$$ plain form
1638 -16705 -8870 3024 15673 21121 19535 14230 2784 -10469 -17801 -20323 -17922 -6821 5858
1651 5858 14574 20955 21520 12248 1124 -9070 -18887 -21764 -15579 -6941 4320 16582 21692 18793
1665 18793 12867 1598 -11777 -19077 -20092 -17117 -6387 6687 14896 20291 20075 10771 -1174 -10953
1679 -10953 -19627 -22186 -15082 -5260 5430 16745 21502 17564 10172 -1064 -13567 -20319 -19953 -15717
1693 -15717 -5095 8192 15980 19577 18448 9281 -2958 -12027 -19346 -21295 -13908 -3346 6357 16950
1707 16950 21302 16938 8606 -1516 -13944 -19965 -18650 -13401 -2923 10134 17773 19678 17604 8425
1721 8425 -4537 -13085 -18699 -19499 -12149 -879 8528 17399 21149 16055 7358 -2730 -14019 -19790
1735 -19790 -17579 -11568 -1790 10813 18131 18657 15895 6602 -6360 -14588 -18325 -18441 -10672 1013
$$ packed form
1638a6705P835J1894J2649N448j586n305j1446j3253p332k522K401J1101J2679
1651E858Q716O381N65r272j1124j0194r817k877O185Q638J1261J2262N110k899
1665A8793n926j1269j3375p300j015K975J0730J3074Q209N395k16r304j1945r779
1679a0953q674k559P104R822J0690J1315M757l938p392j1236j2503o752L66M236
1693a5717J0622J3287P788L597j129r167j2239r069p319j949P387J0562R703J0593
1707A6950M352m364q332j0122j2428o021J315N249J0478J3057P639J905k074r179
1721H425j2962q548n614q00P350J1270R407Q871L750n094q697j0088j1289n771
1735a9790K211O011R778J2603P318N26k762r293j2962q228l737j16P769J1685
$$ plain form
1749 1013 9845 17098 20130 14114 4263 -5385 -15347 -20483 -16902 -10108 -730 11078 18170 17835 13779
1764 13779 4863 -7615 -15596 -18139 -17537 -9857 2173 10946 16501 18981 13080 2438 -6550 -15326
1778 -15326 -20128 -16057 -7666 1295 12489 19071 17596 12251 3759 -8697 -16472 -17883 -15839 -7834
1792 -7834 4203 12882 17427 18729 12674 1344 -7346 -14961 -19460 -14916 -6029 2950 12821 19848
1806 19848 17551 11194 2448 -9264 -17210 -17591 -14476 -6570 5501 14394 17546 17515 10934 -655 -9444
1821 -9444 -15841 -19084 -14205 -4580 3996 12938 18892 16330 9259 793 -10201 -17943 -18080 -13747 -6160
1836 -6160 5696 14667 17011 16185 9767 -2037 -10999 -16178 -18660 -13714 -2926 6025 13523 18836
1850 18836 15648 7230 -1088 -11103 -18142 -17274 -11763 -4116 6761 15911 17262 15042 8908 -2748
$$ packed form
1749A013Q832P253L032o016r851r648r962n136L581O794R378J1808P092l35m056
1764A3779q916j2478p981k543O02P680J2030Q773N555K480n901j0642q988q776
1778a5326m802M071Q391Q961J1194O582j475n345q492j2456p775j411K044Q005
1792g834J2037Q679M545J302o055j1330q690p615m499M544Q887Q979R871P027
1806A9848k297o357q746j1712p946l81L115P906J2071Q893L152l1o581j1589q789
1821i444o397l243M879R625Q576Q942N954k562p071q466j0994p742j37M333P587
1836f160J1856Q971K344q26o418j1804q962n179k482M946J0788Q951P498N313
1850A8836l188q418q318j0015p039Q68N511P647J0877R150J351k220o134j1656
$$ plain form
1864 -2748 -11650 -15690 -16918 -12103 -1517 7583 14062 18493 15151 6228 -2220 -10814 -17350 -16232 -9834
1879 -9834 -1989 8275 16356 17416 13832 7195 -4027 -12803 -16235 -15825 -10607 -6 8796 14454
1893 14454 17337 13783 4659 -4080 -11648 -17326 -15816 -8799 -1282 8234 16007 16306 11868 5249 -4982
1908 -4982 -14007 -16307 -15182 -9623 778 9856 14406 16294 12572 2680 -6065 -12524 -17357 -15535 -7262
1923 -7262 523 8885 15777 16234 10886 4369 -5530 -14200 -16281 -13885 -8439 1702 10940 15183 15776
1938 15776 12033 2514 -6865 -12480 -16522 -13992 -5903 2582 10490 16806 16235 10075 2706 -6326 -14601
1953 -14601 -16148 -12627 -6677 2856 12090 15553 15150 11162 1414 -8040 -13223 -16148 -13288 -5108 3838
1968 3838 10403 16178 15670 8641 751 -7311 -15267 -16330 -11931 -5768 3684 12673 15671 14097 9426
$$ packed form
1864b748q902m040j228M815J0586R100O479M431l342q923q448q594o536J118O398
1879i834P845J0264Q081J060l584o637j1222q776l432M10N218J0601Q802N658
1893A4454K883l554r124q739p568n678J510P017P517R516P773K99m438o619j0231
1908d982r025k300J125N559J0401R078M550J888l722r892q745o459m833J822Q273
1923g262P785Q362O892M57n348o517r899q670k081K396N446J0141R238M243N93
1938A5776l743r519r379n615m042K530Q089Q485P908O316n71o160p369r032q275
1953a4601j547L521N950R533R234L463m03l988r748r454n183k925K860Q180Q946
1968C838O565N775n08p029p890q062p956j063M399O163R452Q989K998j574m671
$$ plain form
1983 9426 -58 -9661 -14295 -15916 -12890 -4101 4965 10892 15194 14836 7786 -721 -8099 -15342 -16214
1998 -16214 -10880 -4438 4390 13038 15691 12921 8179 -1055 -10325 -14502 -14896 -11477 -2602 6862 12204
2013 12204 15573 14268 6411 -2209 -8644 -14962 -15431 -9278 -2002 5608 13563 15732 12298 7007 -1435
2028 -1435 -10473 -14274 -13381 -10040 -1725 7900 12864 14940 13017 5384 -3750 -9906 -14750 -14737 -8289 -561
2044 -561 6890 13823 15305 10968 4829 -3038 -11914 -14951 -13316 -9266 -946 8406 12799 13710 11741
2059 11741 4007 -4932 -10774 -14558 -13993 -7591 398 7161 13150 14599 9847 3338 -4019 -12148 -15187
2074 -15187 -12509 -7649 365 9122 13807 13517 10687 3199 -6239 -11468 -14080 -13358 -6651 2121 8252
2089 8252 13710 14583 9498 2149 -4473 -11938 -14816 -11319 -5986 1501 10089 14390 13293 10104 2633
$$ packed form
1983I426r484r603m634j621L026Q789R066N927M302l58p050q507p378p243q72
1998a6214N334O442Q828Q648K653k770m742r234r270m177l94L419Q875R464N342
2013A2204L369j305p857q620o435o318m69O153P276P610P955K169l434n291q442
2028a435r038l801Q93L341Q315R625M964K076j923p633r134o156m844J3O448P728
2044e61P451O933J482m337o139p867q876l037J635M050Q320R352M393R11j969
2059A1741p734q939n842l784N65O402P989O763N989J449m752o509p357q129l039
2074a5187K678M860Q014Q757M685k90k830p488r438n229k612P22O707Q772O131
2089H252N458Q73n085p349o622p465k878L497N333P487Q588M301j097l189p471
$$ plain form
2104 2633 -6796 -11978 -13677 -12193 -5406 3676 9694 13902 14348 8655 764 -6092 -12266 -15003 -11124
2119 -11124 -4896 2381 10342 14203 12523 8498 1264 -7920 -12746 -13570 -11367 -4985 4030 10287 13394
2134 13394 13496 7549 -978 -7509 -12781 -14801 -10504 -3634 3217 10511 14100 11571 6854 143 -8413
2149 -8413 -13620 -13276 -10474 -3917 4897 10843 13238 12559 6924 -1494 -7881 -12184 -13937 -9167 -1863
2164 -1863 4458 11066 14465 11552 5810 -862 -8603 -13432 -12109 -8760 -2205 6619 12065 13016 11816
2179 11816 5888 -3002 -9020 -12182 -12968 -8266 -295 5660 11339 13968 10644 4419 -2051 -9110 -13476
2194 -13476 -11829 -7538 -1596 6753 11831 12335 10173 4513 -3935 -9812 -12314 -12440 -7521 630 6708
2209 6708 11188 13281 9623 2584 -3790 -9853 -13519 -11441 -6757 -353 7142 12238 11799 9181 3617
$$ packed form
2104B633r429n182j699J484O787R082O018M208M46n693p891o856o174k737L879
2119a1124O228P277P961L861j680m025p234r184m826q24K203O382R015O257L107
2134A3394J02n947q527o531n272k020M297O870O851P294L589k529m717o711q556
2149h413n207L44K802O557Q814N946K395o79n635q418o387m303j753M770P304
2164a863O321O608L399k913n742o672p741m829J323L349O555Q824N446R51j200
2179A1816n928q890o018l162p86M702P971N955N679K629l324o225o470p059m366
2194a3476J647M291N942Q349N078N04k162n660q448n877k502j26M919Q151O078
2209F708M480K093l658p039o374o063l666K078M684O404P495N096m39k618n564
$$ plain form
2224 3617 -4599 -10495 -12107 -11668 -6801 1378 7564 11360 12882 9242 1716 -4555 -9935 -13451 -10669
2239 -10669 -4986 879 7992 12700 12119 8472 2829 -5243 -10975 -11888 -10359 -5802 2529 8811 11764
2254 11764 12858 8902 1085 -5207 -9898 -12877 -10200 -3883 2287 8387 12886 11615 7257 1413 -5700
2269 -5700 -12035 -12414 -9592 -4877 3565 9730 11834 11759 7607 -515 -7059 -10974 -12949 -9935 -3133 3144
2285 3144 8467 12777 10928 5681 55 -6756 -12246 -12290 -9017 -3861 4040 10255 11803 10624 6204
2300 6204 -1392 -8083 -10984 -12148 -9224 -1988 4753 9667 12648 10622 4767 -960 -7220 -11956 -11631
2315 -11631 -7337 -2328 4690 10753 11814 9847 5844 -1785 -8059 -10623 -11271 -8048 -866 5969 9824
2330 9824 12385 10234 3993 -2285 -7585 -11769 -10997 -6431 -850 5687 11158 11582 8737 4474 -2988
$$ packed form
2224C617q216n896j612M39M867Q179O186L796J522l640p526o271n380l516K782
2239a0669N683N865P113M708n81l647n643q072n732r13J529M557Q331O282K953
2254A1764J094l956p817o292m691k979K677O317O170O100M499j271m358n844p113
2269e700o335l79K822M715Q442O165K104p5m152q122o544l915j975L014O802O277
2285C144N323M310j849n247n626o811n490m4L273N156P901O215J548j179m420
2300F204p596o691k901j164K924P236O741M914K981k026n855n727o260m736L25
2315a1631M294N009P018O063J061j967m003p629o274k564o48L223P182O835L855
2330I824K561k151o241o278n300m184P72M566N581O537N471M24k845m263p462
$$ plain form
2345 -2988 -9081 -11064 -10498 -7084 30 6474 9959 11272 9011 2603 -3548 -8067 -11770 -11002 -5863
2360 -5863 -153 5603 10553 11062 7604 2954 -3599 -10003 -11450 -10151 -6451 545 7312 10152 11023
2375 11023 8530 1997 -4542 -8671 -11500 -10326 -4749 1279 6367 11179 11241 7201 2251 -3788 -9555
2390 -9555 -10889 -8791 -5245 1308 8110 10712 10924 8146 1381 -5270 -9192 -11083 -9876 -3885 2513
2405 2513 7201 11525 11131 6353 1451 -4280 -10134 -11428 -8722 -4314 1955 8458 10635 9911 7158
2420 7158 728 -5862 -9606 -10963 -9519 -3347 2892 7477 10704 10577 5492 -148 -5463 -10384 -11751
2435 -11751 -7978 -3452 2582 8630 10998 9138 5973 -307 -6951 -10049 -10788 -8559 -2877 3867 7779
2450 7779 10510 9929 4930 -921 -5722 -10311 -11135 -7130 -2090 3261 9157 11215 8793 5166 -481
$$ packed form
2345b988o093j983N66L414P114O444L485J313k261o408o151m519l703P68N139
2360e863N710N756M950N09l458m650o553o404j447J299L700O996O767K840Q71
2375A1023k493o533o539m129k829J174N577O028N088M812O2m040m950o039n767
2390i555j334K098L546O553O802K602K12k778o765o651l922j891J207N991O398
2405B513M688M324l94m778m902n731n854j294K706M408O269O503K177p24k753
2420G158o430o590l744j357J444O172O239M585L227j27n085n640n315m921j367
2435a1751L773M526O034O048K368j860l165o280o644l098p39K229N682O744L912
2450G779K731n81m999n851m801m589q24M005N040N351N896K058k422l627n647
$$ plain form
2465 -481 -7142 -10224 -9985 -7370 -1656 5113 8881 10640 9377 4206 -2171 -6188 -9803 -10533 -6237 -871
2481 -871 4113 9435 10755 8169 4467 -1157 -7218 -9988 -9191 -6578 -1117 5437 8802 9816 8746
2496 8746 3731 -2914 -7243 -10217 -10536 -5635 11 4716 9245 10423 7449 2813 -2204 -7982 -10570
2511 -10570 -9062 -5870 -479 5654 8968 9162 7655 2796 -3485 -7518 -9746 -9555 -5227 685 5342
2526 5342 9019 10379 6953 1866 -3164 -8180 -10633 -8337 -4702 189 6728 9763 9529 7299 2162
2541 2162 -4221 -8162 -9277 -9073 -4444 1763 6214 9330 10330 6645 1111 -3496 -7960 -10348 -7782
2556 -7782 -3732 1331 7046 9927 9176 6506 1598 -5099 -8903 -9687 -8583 -3755 2533 6767 9344
2571 9344 9994 5957 -93 -4516 -8309 -10614 -7561 -3052 1485 6929 9956 8456 5153 726 -5089
$$ packed form
2465d81o661l082K39K615N714O769L768J759j263n171o377m017l615p30M296N366
2481h71M984N322J320k586l702n624o061k770P97K613N461O554L365J014j070
2496H746n015o645m329k974l19M901N646M705M529J178k974m636n017n778k588
2511a0570J508L192N391O133L314J94j507m859o281m033k228J91M328N912M657
2526E342L677J360l426n087n030n016k453K296L635M891O539L035k34k230n137
2541B162o383l941j115K04M629O207M451L116J000l685n534m607m464k388K566
2556g782M050N063N715K881p51k670m908o697l804p84J104M828O288M234K577
2571I344O50m037o050m423l793k305L053M509M537N444L027j500l303m427n815
$$ plain form
2586 -5089 -9262 -9394 -7533 -3432 2877 7132 9132 8938 5165 -809 -5576 -8688 -10320 -7219 -2227
2601 -2227 2643 7432 10154 8357 4564 -110 -5608 -9474 -8914 -6769 -2509 3610 7772 9048 8355
2616 8355 4911 -1267 -5706 -8356 -9509 -6317 -888 3665 7711 9960 7942 3755 -434 -5940 -9013
2631 -9013 -8584 -5641 -1284 4432 8513 8972 7711 4148 -2076 -6655 -8455 -8773 -5972 -439 4231 7509
2647 7509 9440 7125 2567 -1721 -6578 -9288 -8157 -4759 -876 4445 8310 8742 6691 3018 -2793
2662 -2793 -7254 -8812 -8754 -5210 278 5168 7699 9089 6733 1823 -2493 -6787 -9450 -8184 -4274
2677 -4274 169 4785 8498 8475 6076 2698 -3036 -7217 -8516 -7677 -4888 1193 5817 8089 9164 6589
2693 6589 1383 -3615 -6930 -9083 -7621 -3281 863 5698 9111 8680 5687 1845 -3599 -7625 -8322
$$ packed form
2586e089m173j32J861M101O309M255K000j94l773n974m767l112j632L101M992
2601b227M870M789K722j797l793m674n498l866N60K145M260O119M162J276o93
2616H355l444o178m439k650j153L192N429M553M046K249k018m187m189n506l073
2631i013M29K943M357N716M081M59j261l563o224m579j800l18K801N533M670L278
2647G509J931k315m558m288m857k710J131L398L883N321L865M32k051l673n811
2662b793m461j558N8L544N488M890K531J390k356m910m316m294k663J266L910
2677d274M443M616L713k3k399l378n734m181j299Q39K789O081M624K272J075k575
2693F589n206m998l315k153J462M340M144M835L413m31k993l842n444m026o97
$$ plain form
2708 -8322 -6953 -4024 1543 6250 8099 8426 6145 637 -4197 -7170 -8999 -7418 -2698 1612 5970
2723 5970 9087 8212 4929 1031 -4077 -8318 -8893 -6751 -3382 2073 6729 8010 7948 5320 19 -5151
2739 -5151 -7549 -8581 -7033 -2211 2133 5974 8635 7752 3928 -140 -4504 -8235 -8466 -5965 -2565
2754 -2565 2585 6943 8167 7210 4543 -456 -5368 -7566 -8218 -6466 -1546 3053 6496 8737 7791 3326
2770 3326 -689 -4718 -7957 -7978 -5002 -1481 2866 7364 8359 6665 4096 -859 -5695 -7434 -7408 -5603
2786 -5603 -776 4121 6374 8154 7320 2767 -1837 -5187 -8114 -8125 -4564 -872 3452 7493 8130 6213
2802 6213 2816 -1696 -6201 -7890 -7066 -5042 -290 4413 6913 7581 6326 1935 -2452 -5524 -8031
2817 -8031 -7522 -4203 44 3837 7205 8035 5432 1928 -2304 -6412 -7981 -6752 -4413 184 5117
$$ packed form
2708h322J369K929N567M707J849L27k281n508m834k973j829J581M720M310M358
2723E970L117q75l283l898n108m241n75K142L369N455M656J281o2k628n301n170
2739e151k398j032J548M822M344L841K661q83l824m068m364l731k31K501L400
2754b565N150M358J224r57k667m999m912k198o52J752M920M599L443K241r46m465
2770C326m015m029l239k1K976L521M347M498R95j694k569m955m836j739K6J805
2786e603M827M897K253J780q34m553m604l350k927j1L561L692M324M041O37j917
2802F213l397m512m505j689Q24K024M752M703K500O68j255m391m387l072k507
2817h031N09L319M247L793L368Q30k603l504m232m108j569J229K339M597M933
$$ plain form
2832 5117 7231 7544 5960 1638 -2902 -5956 -7653 -7227 -3343 935 4477 7832 8170 5021 1631 -2394
2848 -2394 -6822 -7683 -6261 -3604 713 5727 7585 7632 5614 1775 -3424 -6128 -7562 -6944 -2929 1556
2864 1556 5198 7615 8049 4796 527 -3194 -6860 -8156 -5985 -2777 1079 5580 7568 6595 4718
2879 4718 794 -4044 -6858 -7567 -6232 -2616 2176 5040 7227 7343 3973 -161 -3654 -7129 -8045 -5693
2895 -5693 -2278 1618 5988 7896 6320 3890 115 -4788 -6941 -7191 -5797 -2141 2744 5688 7217
2910 7217 6780 3339 -812 -4287 -6735 -7539 -4713 -1320 2333 6037 7823 5932 3347 -260 -4699
2925 -4699 -7009 -6654 -4953 -1173 3447 6415 6992 6639 3254 -1465 -4507 -6840 -7153 -4432 -622 2878
2941 2878 6228 7431 5492 2483 -1057 -4962 -7084 -6642 -4504 -1063 3578 6162 6480 5845 2291 -2077
$$ packed form
2832E117K114L13j584m322m540l054j697M26L884M278L542L355L38l149l390m025
2848b394m428q61J422K657M317N014J858M7k018l839n199k704j434O18M015M485
2864A556L642K417M34l253m269l721l666j296K171L208L856M501J988r73j877
2879D718l924m838k814p09J335L616M792K864K187J16l370m134l493l475r16K352
2895e693L415L896M370J908j576k430l775m903k153k50J394L656M885K944J529
2910G217m37l441m151l475k448q04K826L393L653L704J786j891k585l607m439
2925d699k310L55J701L780M620K968N77l53l385m719l042k333l13K721L810L500
2941B878L350J203j939l009l540l905k122M42K138L441M641K584L18o35l554m368
$$ plain form
2957 -2077 -5294 -6827 -7129 -4203 -18 3354 6281 7410 5203 1842 -1648 -5516 -7266 -6259 -3657
2972 -3657 -427 3988 6479 6436 5481 1932 -2722 -5425 -6737 -6544 -3753 695 4185 6456 7231 5222
2988 5222 1311 -2008 -5499 -7175 -5911 -3158 383 4479 6946 6605 4825 1772 -2793 -5873 -6479
3003 -6479 -6252 -2986 1142 4703 6412 6940 4668 596 -2680 -5515 -7402 -5395 -2473 689 4585
3018 4585 7010 6531 4246 1176 -3485 -6296 -6942 -5762 -2756 1545 4795 6498 6973 4261 -105 -3487
3034 -3487 -5993 -7052 -5540 -2093 1368 4835 6668 5796 3453 642 -3455 -6436 -6326 -5249 -2384
3049 -2384 2078 5056 6486 6262 3819 -397 -3619 -5954 -6601 -5162 -1162 2013 5273 7130 5891
3064 5891 2955 -338 -3685 -6364 -5846 -4336 -1810 2258 5630 6166 5809 3349 -895 -4147 -5496 -6236
$$ packed form
2957b077l217j533l02K926M185L372K927J129k207l361l490l868j750J007K602
2972c657L230M415K491m3r55l549m654k703j312J93K791M448L490K271P75k009
2988E222l911l319l491j676J264K753L541M096K467l41j780l053m565l080o06
3003f479K27L266M128L561J709N28k272m072l276k835j887K007K922L162L896
3018D585K425m79k285l070m661k811o46J180L006M301L250J703M75k712m366l382
3034c487k506j059J512L447L461L467J833q72k343k811m097k981J10J077K865
3049b384M462K978J430k24k443m216l222k335o47J439M000L175L260J857j239
3064E891k936l293l347k679N18J510K526M068L372N36l57k460m244l252j349p40
$$ plain form
3080 -6236 -4431 -645 2699 5201 6714 5825 2393 -997 -4367 -6451 -5965 -3914 -988 2993 5857
3095 5857 6019 5187 2655 -1625 -4379 -5943 -6084 -4173 -89 3265 5313 6165 5045 1632 -1698 -4405
3111 -4405 -6546 -5779 -3341 -458 3013 5919 5977 4475 1947 -1741 -5148 -6111 -5661 -3980 168 3706
3127 3706 5338 6263 4766 1277 -2146 -4450 -6390 -5530 -2905 310 3560 5717 5847 4232 1617 -1910
3143 -1910 -5056 -5888 -5409 -3326 967 4043 5839 6189 4895 1142 -2325 -4619 -6383 -5344 -2207 827
3159 827 3946 6292 6069 3845 718 -2508 -5056 -6174 -4790 -2745 1195 4362 5494 5721 4005 588
3175 588 -3020 -5028 -6199 -5232 -1851 1371 4031 5962 5615 3155 175 -2966 -5774 -6200 -4482 -1994
3191 -1994 1420 4613 5519 5151 3686 -53 -3754 -5160 -6070 -4841 -1617 1797 3898 5796 5457 2841
$$ packed form
3080f236J805L786L344K502J513q89l432l390l370k084M86K051K926L981K864
3095E857J62q32k532m280k754j564j41J911M084L354K048Q52j120l413l330k707
3111d405k141P67K438K883L471K906N8j502k528l688l407r63M50J681M148L538
3127C706J632R25j497l489l423k304j940Q60K625L215L250K157J30j615k615l527
3143a910l146q32M79K083M293L076J796L50j294l753l467k294j764J039L137L034
3159H27L119K346k23k224l127l226k548j118J384K045L940L167J132K27j716l417
3175E88l608k008j171R67L381L222K660J931l47k460k980l141k808m26J718K488
3191a994L414L193R06l68j465l739l701j406r10J229L224L414K101J898l39k616
$$ plain form
3207 2841 -382 -3042 -5608 -6017 -3845 -1756 1788 5073 5983 4959 3115 -213 -3881 -5353 -5390 -4174
3223 -4174 -728 2683 4624 5948 5426 2363 -795 -3225 -5355 -5690 -3373 -801 2197 5317 5831 4510
3239 4510 2506 -793 -4151 -5351 -5165 -4100 -467 2936 4761 5867 4932 2067 -1233 -3840 -5717
3254 -5717 -5528 -3085 -242 2500 4972 5617 4269 1946 -1218 -4358 -5412 -4874 -3285 -215 2927 4868
3270 4868 5443 4443 1732 -1620 -4172 -5858 -5439 -2673 252 2906 5142 5920 4336 1402 -1673 -4533
3286 -4533 -5676 -4508 -2884 453 3792 5090 5373 4238 1205 -2329 -4384 -5243 -4780 -2273 937 3270
3302 3270 5361 5726 3329 888 -1962 -4686 -5831 -4402 -2503 683 3991 5606 5220 3843 841
3317 841 -2569 -4755 -5365 -5115 -2251 1406 3730 5303 5410 3191 100 -2602 -4949 -5581 -4118 -1899
$$ packed form
3207B841l223k660k566m09K172K089L544L285R10j024j844l328l668j472l7J216
3223d174L446L411J941J324n22l063l158k430k130l35K317K572K998L120N14j321
3239D510k004l299l358j200J86J065L633L403J825J106r35k865l300k607j877
3254e717J89K443K843K742K472O45j348k323l164l140j054N38J589L070L142J941
3270D868N75j000k711l352k552j686M19K766K925K654K236P78j584k934l075k860
3286d533j143J168J624L337L339J298K83j135l033l534k055q59M63K507L210K333
3302C270K091L65k397k441k850k724j145J429J899L186L308J615l86j377l002
3317H41l410k186o10K50K864L657K324J573J07k219l091k702k347o32J463K219
$$ plain form
3333 -1899 951 3900 5475 4357 3061 287 -3102 -4840 -5107 -4429 -1564 1827 3706 5026 5254 3042
3349 3042 -473 -2788 -5092 -5536 -3789 -1294 1536 3870 5547 4434 2661 -120 -3446 -5059 -4841
3364 -4841 -3856 -1223 2144 3928 4944 4881 2492 -761 -3286 -4824 -5229 -3278 -870 2059 4413 5645
3380 5645 4244 2208 -478 -3440 -5020 -4909 -3196 -890 2290 4434 4932 4400 2151 -957 -3579 -4955
3396 -4955 -5182 -2803 -382 2143 4252 4872 4051 1493 -969 -3566 -5203 -4688 -3007 -792 2624 4332
3412 4332 4824 3875 1917 -1545 -4049 -4913 -4899 -3093 274 2614 4326 5311 3874 845 -1526 -3773
3428 -3773 -5118 -4305 -2311 -102 3031 4721 4596 3902 1516 -1774 -4066 -4688 -4466 -2769 359 2889
3444 2889 4536 5220 3904 1083 -1827 -3662 -5471 -4303 -2331 258 3386 5252 4688 3182 938
$$ packed form
3333a899K850K949J575j118j296k774l389j738k67O78K865L391J879J320K28k212
3349C042l515k315k304m44J747K495K830K334J677j113j773k781l326j613K18
3364d841R85K633L367J784J016o3k389l253k525j538m05J951K408K929K354J232
3380E645j401k036k686k962j580J11J713K306L180K144M98n32k249l108k622j376
3396d955k27K379K421K525K109O20q21k558k462k597j637N15J681K215L416J708
3412D332M92r49j958l462k504q64J4J806L367K340J712R85j437l029k371k247
3428c773j345Q13J994K209L133J690j25o94k386l290k292o22K22J697L128K530
3444B889J647O84j316k821k910j835j809J168J972K589L128J866n64j506k244
$$ plain form
3459 938 -1891 -4237 -4729 -3898 -2348 893 3298 4663 4889 3394 533 -2038 -4089 -5009 -4093 -1698
3475 -1698 947 3191 5062 4536 3151 587 -2287 -4419 -4870 -3875 -1928 1039 3787 4479 4707 2960
3491 2960 -381 -2713 -4070 -5053 -4010 -1234 1105 3218 4994 4157 2314 269 -2717 -4948 -4512 -3434
3507 -3434 -1427 1271 3836 4758 4255 2575 -203 -2573 -4241 -4835 -3602 -860 1753 3696 4816 4102
3523 4102 1713 -246 -2599 -4449 -4312 -2909 -866 1930 4105 4507 3871 2231 -421 -2994 -4370 -4394
3539 -4394 -3247 -326 2016 3926 4829 3940 1602 -826 -3216 -4624 -4742 -2874 -451 2277 4358 4246
3555 4246 3529 1864 -1013 -3431 -4225 -4488 -3018 -258 2338 3716 4554 3806 1225 -1458 -3271 -4856
3571 -4856 -4535 -2588 -250 2126 4414 4744 2910 1376 -1104 -3702 -4316 -4154 -2705 51 2699 4181
$$ packed form
3459I38k829k346m92Q31J550L241K405J365K26j495k861k571k051r20R16K395
3475a698K645K244J871n26j385k564k874k132m51R95J947K967K748O92K28j747
3491B960l341k332j357r83J043K776K339K113J776q37j843k045k986k231M36J078
3507c434K007K698K565R22n03j680k778k370j668n94J233K742K613J943J120p14
3523D102k389j959k353j850J37J403K043K796K175M02o36j640k652k573j376k4
3539d394J147K921K342J910R03q89k338k428k390j408j18J868K423K728K081j12
3555D246p17j665k877k418p94k63J470K760K596J378Q38p48k581k683j813j585
3571d856L21J947K338K376K288L30j834j534k480k598o14J62J449K756K648J482
$$ plain form
3587 4181 4730 3531 1244 -1488 -3175 -4441 -3996 -2018 354 2597 4630 4560 3228 988 -1662 -3864
3603 -3864 -4604 -3753 -2279 532 3036 4089 4292 3265 736 -1589 -3475 -4586 -3745 -1642 784 2900
3619 2900 4526 4330 2749 657 -1643 -4190 -4566 -3353 -1870 611 3287 4297 3764 2652 108 -2531
3635 -2531 -4017 -4511 -3959 -1459 1168 2782 4243 4026 2120 132 -1921 -4331 -4548 -2956 -1493 1071
3651 1071 3551 4494 3815 2441 -45 -2457 -3822 -4001 -3596 -984 1546 3415 4355 4025 2280 -540
3667 -540 -2512 -4048 -4127 -2700 -672 1693 3779 4378 3587 2111 25 -2887 -4103 -4093 -2873 -539 2213
3684 2213 3552 3997 3846 1466 -915 -2638 -4094 -4113 -2591 -558 1729 3622 4261 3103 1533 -672
3700 -672 -2823 -4364 -3850 -2944 -647 2193 3600 4100 3382 1325 -1214 -3128 -3983 -4134 -2436 -100 1813
$$ packed form
3587D181N49j199k287k732j687j266M45J978K372K243K033p0j332k240k650k202
3603c864p40Q51J474K811K504J053K03j027k529k325j886j111Q41K103K426K116
3619B900J626j96j581k092k300k547l76J213J483K481K676J010n33j112k544k639
3635b531j486m94N52K500K627J614J461k17j906j988k053k410k17J592J463K564
3651A071K480R43o79j374k486k412j365j79M05K612K530J869R40l30j745k820
3667e40j972j536p9J427K028K365K086N99p91j476k086k912j216J0J220K334K752
3684B213J339M45j51k380k381j723j456j9J522K033K287J893O39j158j570k205
3700f72k151j541N14R06K297K840J407N00p18k057k539j914q55j51J698K336J913
$$ plain form
3717 1813 3714 4188 3073 1296 -1020 -3423 -4063 -3669 -2409 91 2336 3855 3888 3036 1217 -1487
3733 -1487 -3218 -4003 -4122 -2089 436 2216 3739 4289 3111 1078 -1342 -3381 -4093 -3534 -1947 220
3749 220 2755 3881 4096 3108 1211 -1679 -3364 -3761 -3763 -1876 822 2707 3691 4254 2460 354 -1421
3766 -1421 -3468 -3905 -3233 -1743 365 2853 4131 3677 2462 651 -1841 -3363 -4069 -3361 -1520 882
3782 882 2659 3762 3965 2122 -70 -1991 -3352 -4328 -3081 -1139 701 3048 4015 3647 2228 195
3798 195 -2395 -3705 -3511 -3183 -1108 1263 2990 3927 3689 1963 -166 -2472 -3290 -3882 -3017 -684 1233
3815 1233 3052 4165 3487 1742 -331 -2747 -3822 -3571 -2550 -805 1896 3331 3641 3517 1915 -670
3831 -670 -2449 -3625 -4056 -2595 -160 1671 3332 4207 3330 1566 -370 -2477 -4144 -3699 -2228 -532
$$ packed form
3717A813J901M74j115j777k316k403o40L94J260K500K245J519L3q52j819k704
3733a487j731p85j19K033K525J780J523N50j178k033k420k039p12N59J587K167
3749B20K535J126K15r88j897k890j685l97kJ887K698J885R84N63j794k106j775
3766a421k047m37O72J490K108K488J278m54j215j811k492j522p06P08J841K402
3782H82J777J103K03j843k192j921j361r76J247J942J840K347R67l68j419k033
3798A95k590j310J94L28K075K371J727R37k38j726k129k306q18n92Q65K333J917
3815A233J819J113o78j745k073k416j075K51J021J745K701J435L10j24j602k585
3831f70j779j176m31J461K435J831J661Q75q77j764j936k107j667M45J471J696
$$ plain form
3847 -532 1636 3416 3750 3196 1516 -817 -2779 -3508 -3665 -2248 -70 1895 3189 3974 2858 1082
3863 1082 -874 -2774 -4069 -3531 -2107 -403 2108 3728 3468 3064 1226 -1046 -3256 -3677 -3749 -2182
3879 -2182 261 2119 3161 3838 2862 837 -1197 -2806 -4126 -3126 -1647 152 2220 3603 3774 2759
3895 2759 1308 -1495 -3135 -3609 -3143 -2068 682 2747 3751 3524 2654 495 -1233 -3091 -4090 -3180
3911 -3180 -1516 413 2539 3936 3740 2363 830 -1639 -3482 -3543 -2937 -1487 927 2658 3732 3564
3927 3564 2352 149 -1775 -3376 -3965 -3196 -1207 797 2436 3847 3437 1859 149 -2065 -3525 -3503
3943 -3503 -2706 -1382 1106 2879 3305 3229 1914 -165 -2134 -3338 -3685 -2908 -547 1231 2788 3600 3377
3960 3377 1727 -91 -2066 -3395 -3656 -2166 -879 1389 3067 3454 3116 1828 -546 -2268 -2971 -3314
$$ packed form
3847e32K168J780L34n54j680k333j962p29j57J417K178J965J294P85j116j776
3863A082j956j900j295N38J424J704K511J620k60m04j838k272k210m21p2J567
3879b182K443J858J042O77r76k025k034j609j320J000J479J799K068J383J71j015
3895B759j451k803j640m74M66J075K750K065J004k27q70k159j728j858r99R10
3911c180J664J929K126J397j96j377j533k469j843o1O06J450K414J731J074j68
3927C564j212k203j924j601n89P69J989K004J639J411m10j578j710k214j460K2
3943c503P97J324K488J773M26p6j315k079j969j204l47P77K361J778J557Q12k23
3960C377j650j818j975j329k61J490J287K268J678L87l38j288k374j722p03l43
$$ plain form
3976 -3314 -2679 -411 1637 3011 3721 3321 1358 -703 -2050 -3426 -3276 -1927 -263 1539 3173 3608
3992 3608 2829 1219 -918 -2830 -3521 -3230 -2252 -460 1874 3099 3640 2828 911 -1022 -2481 -3731
4008 -3731 -3327 -1927 -362 1592 3179 3610 2459 750 -947 -2957 -3299 -3280 -2132 -143 2048 3011
4024 3011 3455 2563 654 -1331 -2893 -3632 -3089 -1901 156 1840 3298 3487 2516 989 -1250 -3181
4040 -3181 -3511 -2800 -1688 567 2458 3431 3406 2680 609 -1400 -2771 -3297 -3078 -1204 367 2224 3272
4057 3272 3434 2188 302 -1200 -2835 -3297 -2577 -1368 294 2629 3383 3220 2194 383 -1648 -2995
4073 -2995 -3328 -2716 -1269 1125 2194 3264 3249 2027 -49 -1540 -3333 -3407 -2564 -1006 685 2340 3245
4090 3245 2665 1801 -139 -1945 -3135 -3158 -2753 -1062 1158 2272 3382 3008 1445 -500 -1826 -3352
$$ packed form
3976c314O35K268K048J374P10m00j963k061j347j376J50J349J664J802J634M35
3992C608p79j610k137j912o91K91R78J792K334J225N41q12j917j933j459j250
4008c731M04J400J565J954J587M31j151j709j697k010l42J9J148J989K191R63
4024C011M44q92j909j985j562p39N43J188K057J684J458J89r71j527k239j931
4040c181l30P11J112K255J891R73k5p26k071k009j371n26K19J874J571J857J048
4057C272J62j246j886j502j635m62P20J209J662K335P54j63j026j811k031j347
4073b995l33O12J447K394J069J070j5j222k076j491j793p4Q43J558J691J655R05
4090C245n80q64j940j806j190k3M05J691K220J114J110l74j563j945j326j526
$$ plain form
4106 -3352 -3347 -2354 -474 1094 2792 3377 2614 1606 -148 -1892 -3033 -2873 -2238 -390 1382 2658 2998
$$ packed form
4106c352NR93J880J568J698N85p63j008j754j744j141J60O35J848J772J276L40
$$ [...]
8191A46
##END NTUPLES=NMR FID
##END=
