##TITLE=1H_LY-cholo
 CDCl3, 8 sc, 
 5.7.2019
##JCAMPDX= 6.0         $$ Bruker NMR JCAMP-DX V2.0
##DATA TYPE= NMR FID
##DATA CLASS= NTUPLES
##ORIGIN= UXNMR, Bruker Analytische Messtechnik GmbH
##OWNER= root
$$ XWIN-NMR		Version 3.5
$$ Fri Jul  5 13:54:52 2019 Russian Standard Time (UT+4h)  she@DPX200
##.OBSERVE FREQUENCY= 200.13155
##.OBSERVE NUCLEUS= ^1H
##.DELAY= (6, 6)
##.ACQUISITION MODE= SIMULTANEOUS
##.ACQUISITION SCHEME= undefined
##.AVERAGES= 8
##.DIGITISER RES= 18
##SPECTROMETER/DATA SYSTEM= spect
##.PULSE SEQUENCE= zg30
##.SOLVENT NAME= CDCl3
##.SHIFT REFERENCE= (INTERNAL, CDCl3, 0, 15.7039)
##AUDIT TRAIL= $$ (NUMBER, WHEN, WHO, WHERE, WHAT)
$$ ##TITLE= Audit trail, XWIN-NMR		Version 3.5
$$ ##JCAMPDX= 5.01
$$ ##ORIGIN= Bruker BioSpin GmbH
$$ ##OWNER= she
$$ F:/spectra/data/she/nmr/H-F/1/audita.txt
$$ ##AUDIT TRAIL=  $$ (NUMBER, WHEN, WHO, WHERE, WHAT)
(   1,<2019-07-05 13:52:33.39 +0400>,<she>,<DPX200>,
      <created by zg, POWCHK disabled, PULCHK disabled
       configuration hash MD5:
       00 E9 B6 7A A2 85 ED C7 34 08 36 98 17 FE 4E 26
       data hash MD5: 16K
       42 9F C3 14 1B 30 B2 43 14 34 F2 EB 36 43 65 43>)
$$ ##END=
$$ 
$$ hash MD5
$$ 09 E9 AF 17 E2 B0 0B 27 62 AA 78 69 B7 CE 84 2B
##$RELAX= 
##$RELAX= 
##$RELAX= 
##$RELAX= 
##$RELAX= 
##$RELAX= 
$$ Bruker specific parameters
$$ --------------------------
##$DU= <F:/spectra>
##$EXPNO= 1
##$NAME= <H-F>
##$PROCNO= 1
##$TYPE= <nmr>
##$USER= <she>
##$AMP= (0..31)
100 100 100 100 100 100 100 100 100 100 100 100 100 100 100 100 100 100 
100 100 100 100 100 100 100 100 100 100 100 100 100 100 
##$AQSEQ= 0
##$AQ_mod= 1
##$AUNM= <au_zg>
##$AUTOPOS= <>
##$BF1= 200.13
##$BF2= 200.13
##$BF3= 200.13
##$BF4= 200.13
##$BF5= 200.13
##$BF6= 200.13
##$BF7= 200.13
##$BF8= 200.13
##$BYTORDA= 1
##$CFDGTYP= 0
##$CFRGTYP= 5
##$CHEMSTR= <none>
##$CNST= (0..31)
1 1 145 1 1 1 1 1 1 1 1 1 1 1 1 1 1 1 1 1 1 1 1 1 1 1 1 1 1 1 1 1 
##$CPDPRG= <>
##$CPDPRG1= <>
##$CPDPRG2= <>
##$CPDPRG3= <>
##$CPDPRG4= <mlev>
##$CPDPRG5= <mlev>
##$CPDPRG6= <mlev>
##$CPDPRG7= <mlev>
##$CPDPRG8= <mlev>
##$CPDPRGB= <>
##$CPDPRGT= <>
##$D= (0..31)
0 1.2 0 0 0 0 0 0 0 0 0 0.03 0 0 0 0 0 0 0 0 0 0 0 0 0 0 0 0 0 0 0 0 
##$DATE= 1562320352
##$DBL= (0..7)
120 120 120 120 120 120 120 120 
##$DBP= (0..7)
150 150 150 150 150 150 150 150 
##$DBP07= 0
##$DBPNAM0= <>
##$DBPNAM1= <>
##$DBPNAM2= <>
##$DBPNAM3= <>
##$DBPNAM4= <>
##$DBPNAM5= <>
##$DBPNAM6= <>
##$DBPNAM7= <>
##$DBPOAL= (0..7)
0.5 0.5 0.5 0.5 0.5 0.5 0.5 0.5 
##$DBPOFFS= (0..7)
0 0 0 0 0 0 0 0 
##$DE= 6
##$DECBNUC= <off>
##$DECIM= 24
##$DECNUC= <off>
##$DECSTAT= 4
##$DIGMOD= 1
##$DIGTYP= 9
##$DL= (0..7)
0 120 120 120 120 120 120 120 
##$DP= (0..7)
150 150 150 150 150 150 150 150 
##$DP07= 0
##$DPNAME0= <>
##$DPNAME1= <>
##$DPNAME2= <>
##$DPNAME3= <>
##$DPNAME4= <>
##$DPNAME5= <>
##$DPNAME6= <>
##$DPNAME7= <>
##$DPOAL= (0..7)
0.5 0.5 0.5 0.5 0.5 0.5 0.5 0.5 
##$DPOFFS= (0..7)
0 0 0 0 0 0 0 0 
##$DQDMODE= 0
##$DR= 18
##$DS= 0
##$DSLIST= <SSSSSSSSSSSSSSS>
##$DSPFIRM= 0
$$ [...]
##$SUBNAM2= <"">
##$SUBNAM3= <"">
##$SUBNAM4= <"">
##$SUBNAM5= <"">
##$SUBNAM6= <"">
##$SUBNAM7= <"">
##$SUBNAM8= <"">
##$SUBNAM9= <"">
##$SW= 24.9336996594482
##$SWIBOX= (0..15)
0 0 2 0 0 0 0 0 0 0 0 0 0 0 0 0 
##$SW_h= 4990.01996007984
##$TD= 16384
##$TD0= 1
##$TE= 0
##$TE2= 300
##$TE3= 300
##$TEG= 300
##$TL= (0..7)
0 120 120 120 120 120 120 120 
##$TP= (0..7)
150 150 150 150 150 150 150 150 
##$TP07= 0
##$TPNAME0= <>
##$TPNAME1= <>
##$TPNAME2= <>
##$TPNAME3= <>
##$TPNAME4= <>
##$TPNAME5= <>
##$TPNAME6= <>
##$TPNAME7= <>
##$TPOAL= (0..7)
0.5 0.5 0.5 0.5 0.5 0.5 0.5 0.5 
##$TPOFFS= (0..7)
0 0 0 0 0 0 0 0 
##$TUNHIN= 0
##$TUNHOUT= 0
##$TUNXOUT= 0
##$USERA1= <user>
##$USERA2= <user>
##$USERA3= <user>
##$USERA4= <user>
##$USERA5= <user>
##$V9= 5
##$VALIST= <valist>
##$VCLIST= <CCCCCCCCCCCCCCC>
##$VD= 0
##$VDLIST= <DDDDDDDDDDDDDDD>
##$VPLIST= <PPPPPPPPPPPPPPP>
##$VTLIST= <TTTTTTTTTTTTTTT>
##$WBST= 1024
##$WBSW= 4
##$XGAIN= (0..3)
0 0 0 0 
##$XL= 0
##$YL= 0
##$YMAX_a= 3014
##$YMIN_a= -4598
##$ZGOPTNS= <>
##$ZL1= 120
##$ZL2= 120
##$ZL3= 120
##$ZL4= 120
##$ABSF1= 10
##$ABSF2= 0
##$ABSG= 5
##$ABSL= 3
##$ALPHA= 0
##$AQORDER= 0
##$ASSFAC= 0
##$ASSFACI= 0
##$ASSFACX= 0
##$ASSWID= 0
##$AUNMP= <proc_1d>
##$AZFE= 0.1
##$AZFW= 0.1
##$BCFW= 1
##$BC_mod= 2
##$BYTORDP= 1
##$COROFFS= 0
##$CY= 11.3945322036743
##$DATMOD= 1
##$DC= 2
##$DFILT= <>
##$DTYPP= 0
##$F1P= 18.9103706918063
##$F2P= -1.10871071338519
##$FCOR= 0.5
##$FTSIZE= 0
##$FT_mod= 4
##$GAMMA= 1
##$GB= 0.15
##$INTBC= 1
##$INTSCL= 1
##$ISEN= 128
##$LB= 0.24
##$LEV0= 0
##$LPBIN= 0
##$MAXI= 10000
##$MC2= 0
##$MEAN= 0
##$ME_mod= 0
##$MI= 1.114404
##$NCOEF= 0
##$NC_proc= 0
##$NLEV= 6
##$NOISF1= 3.799351
##$NOISF2= 2.8
##$NSP= 1
##$NTH_PI= 0
##$NZP= 0
##$OFFSET= 15.70392
##$PC= 1
##$PHC0= -8662.342
##$PHC1= 23.60096
##$PH_mod= 1
##$PKNL= yes
##$PPARMOD= 0
##$PSCAL= 0
##$PSIGN= 0
##$REVERSE= no
##$SF= 200.130013532006
##$SI= 16384
##$SIGF1= 3
##$SIGF2= 2
##$SINO= 400
##$SIOLD= 16384
##$SREGLST= <1H.CDCl3>
##$SSB= 0
##$STSI= 0
##$STSR= 0
##$SW_p= 3612.71676300578
##$SYMM= 0
##$S_DEV= 0
##$TDeff= 0
##$TDoff= 0
##$TI= <>
##$TILT= no
##$TM1= 0
##$TM2= 0
##$TOPLEV= 0
##$USERP1= <user>
##$USERP2= <user>
##$USERP3= <user>
##$USERP4= <user>
##$USERP5= <user>
##$WDW= 1
##$XDIM= 8192
##$YMAX_p= 0
##$YMIN_p= 0
$$ End of Bruker specific parameters
$$ ---------------------------------
##NTUPLES= NMR FID
##VAR_NAME=  TIME,          FID/REAL,        FID/IMAG
##SYMBOL=    X,             R,               I
##VAR_TYPE=  INDEPENDENT,   DEPENDENT,       DEPENDENT
##VAR_FORM=  AFFN,          ASDF,            ASDF
##VAR_DIM=   8192,          8192,            8192
##UNITS=     SECONDS,       ARBITRARY UNITS, ARBITRARY UNITS
##FACTOR=    0.0002004,     1,               1
##FIRST=     0,             0,               0
##LAST=      1.6414764,     0,               0
##MIN=       0,             -4598,           0
##MAX=       1.6414764,     3014,            0
$$ Real data points
##PAGE= N=1
##DATA TABLE= (X++(R..R)), XYDATA
$$ plain form
0 0 0 0 0 0 0 0 0 0 0 0 0 0 0 0 0 0 0 0 0 0 0 0 0 3 -8 8 -8 8 -8 8 -8 9 -12 16 -16 16 -18 22 -24 25 -28 31 -36 39
44 39 -44 48 -52 59 -66 75 -84 93 -108 127 -149 180 -226 298 -435 779 -4598 -2436 2186 -697
64 -697 -2409 -873 1490 -651 -2146 -404 1526 -240 -1650 -218 1515 213 -1088 -91 1425 618
80 618 -510 173 1538 1009 -219 105 1551 1321 -80 -22 1312 1309 -78 -129 1255 1197 -267 -459 834
99 834 987 -382 -727 452 690 -484 -973 -34 429 -586 -1243 -414 285 -539 -1503 -779 196 -393 -1579
118 -1579 -1000 295 -216 -1577 -872 616 75 -1329 -709 898 395 -1194 -492 1108 630 -817 -186
135 -186 1361 842 -524 57 1464 951 -334 101 1400 1123 -182 128 1299 1046 -134 -99 979 970
153 970 -220 -343 637 768 -396 -697 350 514 -571 -875 69 278 -742 -1139 -210 123 -762 -1194 -427
$$ packed form
0@%%%%%%%%%%%%%%%%%%%%%%%Lj1J6j6J6j6J6j6J7k1K8l2L2l4M0m6M9n3N9o7P5
44C9q3R2j00J11j25J41j59J77k01K35k76L29m06N24p33J214n377K162M622k883
64f97j712J536K363k141j495J742J930j766j410J432J733j302j301R97J516q07
80F18j128O83J365n29j228L24J446k30j401N8J334lj387n1J384n8j464j92J293
99H34J53j369l45J179K38j174m89R39M63j015o57Q29O99q24r64P24R75n89j186
118a579N79J295n11j361P05J488n41j404O20J607n03j589P02J600m78j447O31
135a86J547n19j366N81J407n13j285M35J299k77j305L10J171k53j180L5J078r
153I70j190j23R80J31j164l01J047J64j085l04R44K09j020l97R29L33q85m32P67
$$ plain form
172 -427 -28 -790 -1200 -456 68 -507 -1002 -444 147 -209 -751 -353 390 137 -518 -223 617 539 -254 -158 870
193 870 780 -53 74 991 1002 -29 127 1027 1000 75 40 1063 964 -7 -68 741 835 -176 -306 467 528 -296
215 -296 -508 259 361 -596 -750 12 165 -680 -955 -232 64 -720 -1065 -269 55 -652 -1087 -337 147 -595
235 -595 -919 -219 254 -277 -681 -145 338 -35 -397 129 519 199 -105 213 739 472 71 324 760 645
255 645 189 335 721 725 254 165 720 729 128 8 532 512 -16 -215 244 398 -200 -486 1 207 -378 -720
277 -720 -246 70 -382 -788 -326 1 -564 -896 -404 -63 -505 -813 -341 -4 -421 -764 -162 156 -156 -578
297 -578 -45 441 8 -333 91 559 231 -109 337 707 398 55 315 843 495 126 357 811 565 179
317 179 230 605 430 71 113 501 310 -30 -41 185 156 -217 -250 -13 10 -363 -430 -192 -149 -411 -648 -324 -232
$$ packed form
172d27L99p62m10P44N24n75m95N58N91l56n42L98P43k53o55K95Q40p8p93R6J028
193H70r0q33J27R17J1j031J56R00k7r25l5J023r9r71o1Q09R4j011j30P73O1q24
215b96k12P67J02r57j54P62J53q45k75P23K96p84l45P96L24p07m35P50M84p42
235e95l24P00M73n31m04N36M83l73l62N26L90l20l04L18N26k67m01K53M36j15
255F45m56J46L86Mm71q9N55Ro01j20N24k0n28j99M59J54n98k86M87K06n85l42
277g20M74L16m52m06M62L27n65l32M92L41m42l08M72L37m17l43O02L18l12m22
297e78N33M86m33l41M24M68l28l40M46L70l09l43K60N28l48l69K31M54k46l86
317A79N1L75j75l59M2L88j91l40j1K26k9l73l3K37K3l73o7K38M3k62k37L24R2
$$ plain form
340 -232 -545 -688 -398 -149 -460 -640 -354 -79 -300 -495 -258 80 -104 -409 -90 208 114 -242 110 434 320
361 320 -67 159 601 383 120 304 699 479 110 336 722 510 175 235 590 457 4 120 394 242 -128
382 -128 -50 260 147 -277 -201 13 -92 -449 -459 -131 -165 -506 -582 -277 -206 -536 -501 -268 -324 -423 -512 -290 -141 -292
406 -292 -403 -209 -88 -103 -220 -75 152 105 -19 76 299 302 127 234 417 389 200 295 496 472 157 325 556
429 556 508 185 173 416 409 115 87 327 325 -85 -188 67 134 -196 -327 -73 24 -307 -496 -202 -173 -408 -535 -294
453 -294 -192 -443 -585 -293 -233 -424 -428 -227 -53 -307 -378 -74 67 -172 -124 4 155 -54 13 205 316 202
475 202 155 301 435 314 194 386 436 351 256 384 418 482 207 294 343 343 120 113 130 193 -16 -90 39 44 -139 -263
501 -263 -149 -116 -315 -415 -251 -179 -324 -534 -261 -270 -397 -491 -291 -165 -288 -428 -246 -52 -220 -330 -187 21
$$ packed form
340b32l13j43K90K49l11j80K86K75k21j95K37L38j84l05L19K98r4l56L52L24j14
361C20l87K26M42k18k63J84L95k20l69K26L86k12l35O0L55j33m53J16K74j52l70
382a28P8L10j13m24P6K14j05l57j0L28l4l41p6L05P1l30L5K33n6r9q9K22J49j51
406b92j11J94J21j5j17J45K27m7j24R5K23Lj75J07J83k8j89R5K01k4l15J68K31
429E56m8l23j2K43pk94k8K40km10j03K55O7l30j31K54R7l31j89K94K9k35j27K41
453b94J02k51j42K92O0j91mK01J74k54p1L04J41k39M8J28J51k09O7J92J11j14
475B02m7J46J34j21j20J92N0q5r5J28L4O4k75Q7M9%k23pJ7O3k09p4J29Nj83j24
501b63J14L3j99j00J64P2j45k10K73rj27r4K00J26j23j40J82J94j68j10J43K08
$$ plain form
523 21 -84 -191 -21 163 44 -59 151 313 183 75 311 422 367 175 352 503 326 296 251 416 308 172
545 172 266 324 179 72 164 182 109 -14 -55 3 -74 -136 -211 -118 -153 -321 -302 -220 -227 -320 -417 -311 -321 -359 -396 -345 -223 -249
573 -249 -315 -258 -180 -175 -206 -91 2 -3 -145 24 177 107 60 132 244 273 228 253 413 274 239 326 397 370 233 240 410
600 410 283 148 219 327 174 82 113 170 65 -69 -58 45 -80 -183 -189 -149 -182 -293 -310 -258 -262 -436 -343 -304 -373 -390
626 -390 -329 -260 -271 -311 -204 -172 -185 -219 -163 -54 -29 -91 -7 -8 90 88 26 169 269 196 197 242 283 341 249 282 316 339 316 279
656 279 258 292 211 198 209 194 76 69 150 109 -63 -151 -26 -83 -209 -218 -168 -187 -330 -346 -249 -194 -347 -403 -217 -250 -377
683 -377 -367 -247 -185 -283 -337 -150 -77 -209 -207 -4 5 -66 -3 106 104 93 145 155 216 246 224 301 289 256 260 284 389 316 286
712 286 324 285 240 199 145 205 143 126 71 22 -55 -20 -57 -57 -158 -164 -211 -158 -224 -287 -314 -311 -230 -281 -329 -311 -247 -242 -306 -256 -144
$$ packed form
523B1j05j07J70J84j19j03K10J62j30j08K36J11n5j92J77J51j77l0m5J65j08j36
545A72R4N8j45j07R2J8p3j23m1N8p7o2p5R3l5j68J9Q2pr3r7J06j0l8l7N1J22k6
573b49o6N7P8Nl1J15R3nj42J69J53p0m7P2J12K9m5K5J60j39l5Q7P1k7j37PJ70
600D10j27j35P1J08j53r2L1N7j05j34J1J03j25j03oM0l3j11j7N2mj74R3L9o9j7
626c90O1O9j1m0J07L2j3l4N6J09K5o2Q4jR8ko2J43J00p3JM5M1N8r2L3L4K3k3l7
656B79k1L4q1j3J1j5j18pQ1m1j72q8J25n7j26rN0j9j43j6R7N5j53n6J86l3j27
683c77J0J20O2r8n4J87P3j32KK03Rp1O3J09kj1N2J0O1L0k2P7j2l3MK4J05p3l0
712B86L8l9m5m1n4O0o2j7n5m9p7L5l7%j01om7N3o6o3k7LQ1n1m8J8O4No4N0J12
$$ plain form
743 -144 -274 -274 -205 -60 -136 -136 -110 94 -39 8 133 100 137 33 194 241 194 160 303 373 261 213 276 317 292 230 283
770 283 241 175 177 199 201 68 68 80 55 3 -44 -82 -62 -149 -207 -121 -211 -135 -252 -186 -233 -282 -265 -252 -304 -294 -211 -214 -180 -287 -92
801 -92 -235 -150 -89 -99 -88 -5 10 -10 34 46 143 118 182 159 289 264 222 213 310 296 257 292 315 289 243 303 242 173 65 142
831 142 233 67 64 -10 28 7 -150 -107 -10 -90 -190 -186 -178 -146 -299 -296 -228 -215 -342 -270 -274 -204 -258 -234 -285 -168 -172 -168 -133 -165 -151
862 -151 -61 26 30 40 3 72 137 173 205 249 148 205 245 201 218 284 244 248 246 250 319 241 168 268 149 116 148 41 5 21
892 21 -19 38 -72 -78 -75 -49 -179 -220 -234 -246 -254 -295 -255 -216 -250 -301 -274 -167 -315 -289 -197 -169 -187 -235 -120 -27 -86 -55 23 6
922 6 110 48 167 171 106 142 195 203 196 223 256 233 205 275 325 285 232 203 172 190 101 167 87 149 89 89 -48 -45 -30 -105 -117 -85
954 -85 -148 -170 -181 -169 -236 -250 -224 -222 -221 -247 -261 -195 -257 -196 -224 -233 -113 -124 -99 -133 1 -20 -35 7 92 77 49 135 96 139 126
$$ packed form
743a44j30%O9J45p6%K6K04j33M7J25l3L7j04J61M7m7l4J43P0j12m8O3M1k5o2N3
770B83m2o6KK2Kj33%J2k5n2m7l8K0q7n8Q6r0P6j17O6m7m9J7J3n2J0Q3lL4j07J95
801i2j43Q5O1j0J1Q3J5k0M4J2R7k5O4k3J30k5m2rR7j4l9L5K3k6m6O0o1o9j08P7
831A42R1j66lp4L8k1j57M3R7q0j00MQL2j53LO8J3j27P2mP0n4K4n1J17mML5l2J4
862a51R0Q7MJ0l7O9O5L6L2M4j01N7M0m4J7O6m0MkMO9p8p3J00j19l3L2j07l6J6
892B1m0N7j10oLK6j30m1j4j2qm1M0L9l4n1K7J07j48K6R2K8j8m8J15R3n9L1P8j7
922FJ04o2J19Mo5L6N3QpK7L3k3k8P0N0m0n3k9l1J8q9O6q0O2o0%j37LJ5p5j2L2
954h5o3k2j1J2o7j4K6KJk6j4O6o2O1k8rJ20j1K5l4J34k1j5M2Q5j5k8Q6l9M3j3
$$ plain form
985 126 225 229 218 143 226 290 248 174 237 263 167 154 215 163 147 96 76 97 3 48 -16 -51 -138 -118 -100 -144 -242 -244 -180 -205 -176
1016 -176 -237 -294 -299 -210 -277 -232 -241 -130 -251 -115 -150 -90 -120 -111 -97 -14 7 30 63 90 85 147 162 197 176 175 168 210 250 198 172
1047 172 262 297 216 253 209 184 165 177 165 112 21 103 84 49 -69 -25 -44 -120 -193 -218 -144 -122 -232 -187 -203 -174 -247 -232 -224
1076 -224 -216 -197 -271 -176 -213 -215 -116 -155 -107 -117 -35 -108 -50 4 21 63 81 86 110 248 190 159 160 222 187 189 219 241 218 235 174 224
1108 224 182 161 225 178 113 137 33 56 66 -9 -17 -168 -109 -151 -141 -210 -132 -132 -153 -193 -226 -275 -239 -300 -227 -222 -212 -241 -196 -258
1138 -258 -179 -135 -104 -128 -125 -42 -42 29 72 65 128 57 143 99 206 171 186 132 151 194 232 258 181 166 178 257 123 202 126 113
1168 113 133 117 70 60 83 17 14 -28 -65 -109 -95 -60 -146 -223 -218 -186 -168 -221 -261 -118 -188 -190 -215 -249 -166 -173 -147 -188 -129 -47 -114
1199 -114 -103 -56 -67 53 29 43 99 118 110 167 150 225 201 226 226 217 189 252 170 217 145 236 193 160 140 85 134 83 55 22 6
$$ packed form
985A26R9Mj1p5Q3O4m2p4O3K6r6j3O1n2j6n1k0K1r4M5o4l5q7K0J8m4r8kO4k5K9
1016a76o1n7nQ9o7M5rJ11j21J36l5O0l0RJ4Q3K1K3L3K7nO2J5L5k1jpM2M0n2k6
1047A72R0L5q1L7m4k5j9J2j2n3r1Q2j9l5j18M4j9p6p3k5P4K2j10M5j6K9p3J5Q
1076b24QJ9p4R5l7kR9l9M8j0Q2p3N8N4J7M2J8NK4J38n8l1JO2l5KL0K2k3J7o1N0
1108B24m2k1O4m7o5K4j04K3J0p5qj51N9m2J0o9P8%k1m0l3m9L6o1P3NJ0k9M5o2
1138b58P9M4L1k4LQ3%P1M3pO3p1Q6m4J07l5J5n4J9M3L8K6p7j5J2P9j34P9p6j3
1168A13K0j6m7j0K3o6lm2l7m4J4L5q6p7NL2J8n3m0J43p0kk5l4Q3pK6m1N9Q2o7
1199a14J1M7j1J20k4J4N6J9qN7j7P5k4K5%rk8O3q2M7p2R1m3l3k0n5M9n1k8l3j6
$$ plain form
1230 6 28 -4 -47 -85 -67 -149 -140 -182 -134 -225 -153 -169 -210 -211 -226 -226 -205 -223 -204 -130 -200 -146 -99 -115 -124 -75 12 -3 -7 62 5 19 118
1263 118 51 142 130 162 162 167 194 190 209 174 157 260 165 191 153 83 170 137 138 141 127 68 -7 21 43 20 -100 -21 -129 -120 -188
1294 -188 -207 -106 -215 -218 -178 -159 -201 -185 -147 -178 -203 -139 -192 -119 -133 -124 -87 -65 -65 -77 0 49 29 69 158 140 78 103 137 138 254
1325 254 168 255 222 139 215 158 183 183 160 194 89 175 153 123 76 51 42 28 -34 4 -27 -53 -122 -124 -111 -174 -157 -182 -171 -176 -217
1356 -217 -197 -182 -207 -222 -164 -181 -141 -133 -147 -72 -146 -125 -88 -80 42 32 -31 35 29 77 72 95 156 80 216 214 176 186 208 166 127
1387 127 168 158 174 121 142 138 123 101 111 55 4 31 -9 20 -19 -122 -117 -55 -116 -146 -162 -143 -156 -146 -100 -138 -165 -142 -124 -132 -142
1418 -142 -257 -152 -96 -111 -84 -91 -58 -27 -40 7 -15 50 21 6 75 44 105 142 162 73 118 170 220 166 209 181 145 144 149 140 155
1449 155 123 132 87 65 33 31 -11 33 -45 -72 -114 -142 -118 -141 -102 -91 -140 -125 -183 -145 -142 -187 -207 -203 -179 -129 -162 -187 -133 -57 -95 -79
$$ packed form
1230FK2l2m3l8J8q2Rm2M8r1P2j6m1jj5%K1j8J9P4p0N4M7j6rM9Q7j5mO9n7J4R9
1263A18o7R1j2L2%NK7mJ9l5j7J03r5K6l8p0Q7l3JLj4n9p5K8K2k3j20P9j08Ro8
1294a88j9J01j09lM0J9m2J6L8l1k5O4n3P3j4RL7K2%j2P7M9k0M0Q9j8o2K5L4JJ16
1325B54q6Q7l3q3P6n7K5%k3L4j05Q6k2l0m7k5rj4o2L8l1k6o9kJ3o3J7k5J1nm1
1356b17K0J5k5j5N8j7M0Qj4P5p4K1L7QJ22j0o3O6oM8nK3O1p6J36kl8J0K2m2l9
1387A27M1j0J6n3K1mj5k2J0n6n1K7m0K9l9j03NO2o1l0j6J9j3J0M6l8k7K3J8qj0
1418a42j15J05N6j5K7pL3L1j3M7k2O5k9j5O9l1O1L7K0q9M5N2N0n4M3k8l6jNrJ5
1449A55l2Rm5k2l2km2M4p8k7m2k8K4k3L9J1m9J5n8L8Lm5k0MK4N0l3k5N4P6l8J6
$$ plain form
1481 -79 -27 -131 -7 21 -43 51 81 43 101 58 75 155 128 102 211 190 148 186 133 104 133 123 136 150 165 65 37 61
1509 61 81 11 -23 -53 -42 -21 -62 -113 -71 -130 -80 -148 -81 -151 -200 -155 -203 -181 -162 -199 -214 -157 -124 -144 -107 -90 -43 -52 -83 -69 -9
1540 -9 -83 37 3 77 32 137 67 55 114 79 125 122 91 155 168 112 119 174 144 109 145 89 110 107 27 20 77 35 -32 -32 -90 -64
1572 -64 -66 -78 -111 -89 -158 -117 -89 -98 -107 -171 -202 -99 -214 -139 -116 -171 -144 -129 -77 -109 -72 -78 -7 -12 3 18 58 41 89 37 81 98
1604 98 140 160 85 94 166 151 132 104 151 114 92 137 123 141 123 143 46 21 59 42 -17 -71 16 -10 -49 -47 -111 -115 -159 -120 -68 -143
1636 -143 -157 -171 -156 -190 -149 -135 -111 -82 -144 -85 -122 -65 -84 -56 -26 -46 7 6 50 64 36 98 87 65 102 57 144 63 128 138
1666 138 160 136 132 175 172 160 165 144 125 65 33 60 68 7 35 34 -55 -66 -90 -71 -55 -29 -134 -63 -113 -83 -142 -117 -111 -173 -149 -166
1698 -166 -153 -94 -91 -164 -62 -167 -75 -56 -35 -34 28 4 -24 25 32 100 40 66 87 123 111 133 152 131 157 164 152 83 201 168
$$ packed form
1481g9N2j04J24K8o4R4L0l8N8m3J7Q0k7k6J09k1m2L8n3k9K9j0J3J4J5j00k8K4
1509F1K0p0l4l0J1K1m1n1M2n9N0o8O7p0m9M5m8K2J9l7j5N7L3k0L7J7M7rl1J4O0
1540ip4J20l4P4m5J05p0j2N9l5M6ll1O4J3n6PN5l0l5L6n6K1lq0pN7m2o7%n8K6
1572f4kj2l3K2o9M1K8rro4l1J03j15P5K3n5K7J5N2l2L7oP1nJ5J5M0j7M8n2M4J7
1604I8M2K0p5RP2j5j9k8M7l7k2M5j4J8j8K0r7k5L8j7n9n4Q7k6l9Ko4mm4L9N2p5
1636a43j4j4J5l4M1J4K4K9o2N9l7N7j9K8L0k0N3jM4J4k8O2j1k2L7m5Q7q1O5J0
1666A38K2k4mM3lj2Nk1j9o0l2K7Qo1K8jq9j1k4J9J6K6j05P1n0L0n9K5Oo2K4j7
1698a66J3N9Lp3J02j05R2J9K1JO2k4k8M9PO8o0K6K1L6j2K2J9k1K6Pj2o9J18l3
$$ plain form
1728 168 152 103 98 94 75 -34 -20 28 29 62 -5 -38 13 -97 -35 -45 -105 -136 -127 -124 -155 -113 -194 -163 -122 -164 -195 -99 -145 -122 -126 -98
1760 -98 -76 -98 -42 4 -35 -3 42 12 47 -3 43 82 117 117 126 99 143 105 134 140 189 194 144 166 103 29 113 75 6 87 48 60
1792 60 36 46 45 -4 -13 -28 -90 -130 -28 -88 -129 -136 -125 -128 -118 -158 -89 -142 -153 -131 -89 -83 -63 -28 -111 -70 -68 -21 -43 10 -43 -34 54
1825 54 88 112 103 35 148 107 100 97 92 90 90 124 132 167 162 85 103 99 106 129 31 42 71 11 27 23 19 41 -30 -62 -53 -98 -101 -110 -60 -149 -97
1862 -97 -86 -154 -128 -104 -140 -111 -143 -138 -170 -73 -31 -132 -42 -69 -45 -57 -76 -36 46 -10 45 31 97 39 109 115 121 91 100 164 138 167
1894 167 122 151 168 121 122 166 109 80 97 5 71 41 16 44 -28 -24 55 -45 -62 -119 -83 -54 -135 -122 -117 -168 -118 -153 -153 -108 -133
1925 -133 -173 -115 -54 -128 -87 -27 -59 12 -78 -27 29 65 -41 131 43 17 25 65 40 65 159 132 107 57 136 87 133 158 59
1954 59 85 46 76 62 -20 48 51 67 54 -6 -17 -33 -97 -119 -44 -54 -86 -57 -104 -111 -71 -139 -159 -124 -108 -105 -115 -166 -132 -128 -58 -106
$$ packed form
1728A68j6m9nmj9j09J4M8JL3o7l3N1j10O2j0o0l1RLl1M2q1L1M1m2l1R6m6K3mK8
1760i8K2k2N6M6l9L2M5l0L5n0M6L9L5%Rk7M4l8K9OM9Nn0K2o3p4Q4l8o9Q1l9J2
1792F0k4J0jm9rj5o2m0J02o0m1pJ1lJ0m0O9n3j1K2M2OK0L5q3M1KM7k2N3n3RQ8
1825E4L4K4ro8J13m1plnk%L4QL5np7J8mPK3r8J1K9o0J6mmK2p1l2Rm5lrN0q9N2
1862i7J1o8K6K4l6K9l2Nl2R7M2j01R0k7K4j2j9M0Q2n6N5j4O6n8P0OOl0RO4k6K9
1894A67m5K9J7m7JM4n7k9J7r2O6l0k5K8p2MP9j00j7n7L6K9q1J3Nn1N0l5%M5k5
1925a33m0N8O1p4M1O0l2P1r0N1N6L6j06J72q8k6QM0k5K5R4k7k5n0P9m9M6K5r9
1954E9K6l9L0j4q2O8LJ6j3o0j1j6o4k2P5j0l2K9m7pM0o8k0L5J6Lj0n1L4MP0m8
$$ plain form
1986 -106 -75 -47 -71 13 -5 28 43 34 23 49 64 74 122 145 67 109 142 89 119 78 110 71 96 96 105 164 109 64 116 71 25
2017 25 29 24 -23 -2 19 -15 -11 -37 -72 -110 -94 -114 -121 -102 -125 -151 -93 -114 -139 -123 -111 6 -113 -121 -81 -44 -64 -65 -57 -23 22 -58 15
2050 15 17 46 43 -5 27 64 43 87 6 94 142 80 171 95 91 146 89 100 83 39 150 35 -6 41 10 27 -76 7 -38 8
2080 8 -4 -89 -54 -20 -29 -92 -60 -88 -156 -95 -123 -121 -104 -107 -119 -96 -104 -130 -36 -58 -128 -57 -36 11 60 -37 -29 -4 50 97 64 126 100
2113 100 117 109 87 109 109 119 67 104 85 114 135 46 76 36 11 98 73 23 45 11 12 64 -80 -115 -68 -30 -56 -100 -120 -163 -119
2144 -119 -75 -84 -101 -122 -173 -128 -115 -70 -89 -97 -102 -113 -47 -116 -54 14 -41 44 51 0 24 55 36 74 48 93 127 89 97 113 145 92
2176 92 76 109 86 140 55 92 159 -20 74 42 26 52 53 -11 -70 68 -31 -16 -95 -69 -72 -84 -118 -93 -81 -86 -157 -75 -128 -75 -100
2207 -100 -95 -77 -28 -16 -88 -43 -59 -26 -40 1 2 17 14 87 107 53 84 54 66 107 126 95 176 48 140 108 33 116 115 72 153
$$ packed form
1986a06L1K8k4Q4j8L3J5rj1K6J5J0M8K3p8M2L3n3L0m1L2l9K5%RN9n5m5N2m5m6
2017B5Mnm7K1K1l4Mk6l5l8J6k0pJ9k3k6N8k1k5J6J2J17j19qM0L7k0jQL4M5q0P3
2050A5KK9lm8L2L7k1M4q1Q8M8o2R1p6mN5n7J1j7m4J11j15m1M7l1J7j03Q3m5M6
2080Hj2q5L5L4ro3L2k8o8O1k8KJ7lj2K3qk6R4k2p0P1K1M7M9r7QK5N4M7l3O2k6
2113A00J7qk2K2%J0n2L7j9K9K1q9L0m0k5Q7k5n0K2l4JN2j44l5M7L8k6m4k0m3M4
2144a19M4rj7k1n1M5J3M5j9qnj1O6o9O2O8n5Q5Pn1K4L1j9L8k6M5L4l8QJ6L2n3
2176I2j6L3k3N4q5L7O7j79R4l2j6K6Jo4n9J38r9J5p9K6lj2l4K5J2np1Q2n3N3k5
2207a00NJ8M9J2p2M5j6L3j4M1JJ5lP3K0n4L1l0J2M1J9l1Q1j28R2l2p5Q3jm3Q1
$$ plain form
2238 153 100 80 31 37 28 49 2 2 -35 1 -88 -69 -44 -23 -155 -110 -62 -93 -123 -109 -51 -111 -90 -74 -84 -51 -67 -149 -85 -60 -78
2269 -78 -24 -96 -39 -80 -6 23 35 14 69 53 61 121 64 85 83 47 73 119 109 87 61 36 69 76 38 140 80 66 -15 11 93
2300 93 74 -14 46 -8 -35 -69 -34 -104 -14 -59 -92 -70 -141 -69 -114 -32 -74 -35 -108 -112 -69 -101 -78 -36 -66 -118 28 -31 35 -7
2330 -7 -23 81 15 31 15 43 32 82 129 121 64 104 149 70 67 71 33 99 75 47 19 80 82 61 26 91 -5 0 4 -33 -26 -18 -29 -55
2364 -55 -101 -51 -109 -70 -91 -92 -115 -119 -82 -117 -140 -113 -105 -66 -93 -106 -58 -28 -14 -56 -15 -47 -16 80 11 28 52 53 41 91 80 130
2396 130 93 52 53 57 125 65 100 144 89 96 83 128 32 71 -44 25 6 18 -40 -18 3 -61 -48 -40 -56 -78 -31 -80 -112 -128 -146
2427 -146 -127 -70 -111 -100 -54 -111 -83 -120 -79 -72 -75 -94 -34 -86 -2 -10 91 -2 33 4 55 59 31 51 69 70 90 116 100 101 102 91 99
2460 99 148 73 90 63 86 54 52 88 57 11 44 -37 -2 -21 3 -22 31 -54 -39 -74 -7 -106 -105 -68 -56 -94 -49 -89 -32 -18 -78
$$ packed form
2238A53n3k0m9OrK1m7%l7L6q9J9K5K1j32M5M8l1l0J4N8o0K1J6j0L3j6q2O4K5j8
2269g8N4p2N7m1P4K9J2k1N5j6QO0n7K1kl6K6M6j0k2k6k5L3Pl8J02o0j4q1K6Q2
2300I3j9q8O0n4k7l4L5p0R0m5l3K2p1P2m5Q2m2L9p3mM3l2K3M2l0n2J46n9O6m2
2330gj6J04o6J6j6K8j1N0M7qn7M0M5p9lMl8O6k4k8k8O1Kk1l5O5r6NMl7PQj1k6
2364e5m6N0n8L9k1jk3mL7l5k3K7QL9k7j3M8L0J4m2M1l2L1R6o9J7K4Jj2N0j1N0
2396A30l7m1JMO8o0L5M4n5Pj3M5r6L9j15O9j9J2n8K2K1o4J3Qj6k2M7m9l2j6j8
2427a46J9N7m1J1M6n7K8l7M1Plj9O0n2Q4qJ01r3L5k9N1Mk8K0J8JK0K6j6JJj1Q
2460I9M9p5J7k7K3l2kL6l1m6L3q1L5j9K4k5N3q5J5l5O7r9JL7J2l8M5m0N7J4o0
$$ plain form
2491 -78 -35 -36 -9 -2 -98 -41 -39 14 -37 -20 23 7 14 72 65 57 34 64 89 120 50 40 63 145 87 44 57 60 71 135 42 11 -69 35
2525 35 8 -38 3 4 -18 -61 -47 -60 -14 -70 -103 -77 -35 -29 -33 -131 -57 -103 -132 -86 -75 -95 -1 -71 -19 -5 -58 -13 -8 -61 6 43
2557 43 -5 23 51 -6 58 -7 31 78 106 24 122 52 127 99 87 166 162 134 72 65 31 88 34 24 35 26 -6 -12 26 -7 -55 -32
2589 -32 -43 -76 -24 -50 -100 -92 -11 -127 -98 -42 -101 -47 -94 -25 -145 -88 -23 -60 -46 -67 -42 9 0 -74 -18 8 -1 4 86 11 11 22
2621 22 73 62 86 74 122 127 60 83 82 70 38 43 117 85 41 86 -12 43 55 12 -38 -31 -7 -49 -57 -69 -82 -17 -58 -87 -83 -43 -66
2654 -66 -44 -72 -38 -73 -139 -24 -67 -79 -99 -34 -43 -71 -10 9 -65 39 31 37 41 50 87 15 32 16 76 146 162 108 98 121 44 142
2686 142 54 73 145 37 41 26 31 59 48 15 51 -11 -9 23 -22 -96 -34 17 3 -26 -92 -47 -69 -98 -80 -76 -90 -88 -93 -96 -109 -140 -43
2719 -43 -71 -26 -11 0 47 -33 -15 31 50 25 43 47 71 25 31 73 46 45 100 92 67 56 95 12 19 59 97 50 54 98 -17 37 95
$$ packed form
2491g8M3jK7Pr6N7KN3n1J7M3j6PN8pqk3L0K5L1p0j0K3Q2n8m3J3LJ1O4r3l1q0J04
2525C5k7m6M1Jk2m3J4j3M6n6l3K6M2Omr8P4m6k9M6J1k0R4p0N2J4n3M5Nn3O7L7
2557D3m8K8K8n7O4o5L8M7K8q2R8p0P5k8j2P9mk8o2pl4N7n4j0J1rl2oL8l3m8K3
2589c2j1l3N2k6n0QQ1j16K9N6n9N4m7O9j20N7O5l7J4k1K5N1rp4N6K6rNQ2p5%J1
2621B2N1j1K4j2M8No7K3jj2l2NP4l2m4M5r8N5J2m3n0PK4m2qj2j3O5m1k9MM0k3
2654f6K2k8L4l5o6J15m3j2k0O5rk8O1J9p4J04qOMRL7p2J7j6O0P0J6n4j0K3p7R8
2686A42q8J9P2j08Mj5NK8j1l3L6o2KL2m5p4O2N1j4k9o6M5k2k9J8Mj4Knlj3l1R7
2719d3k8M5J5J1M7q0J8M6J9k5J8MK4m6OM2k7jN5qk5j1L9q3PM0L8m7MM4j15N4N8
$$ plain form
2752 95 -16 -22 -10 -17 -46 -18 -98 -70 -35 -95 -89 -19 -97 -64 -65 -82 -6 -105 -73 -107 -68 -124 5 -89 -69 -23 -69 -53 -21 66 28
2783 28 -2 22 49 66 -11 -4 81 31 105 53 37 72 38 118 49 43 30 43 37 56 46 28 50 42 11 7 -7 -22 -32 -110 -47 -56 8
2816 8 -84 -53 -109 -40 -28 -46 -36 -24 -51 -66 -43 4 -75 -55 -66 -84 -78 -3 -17 16 -40 7 24 -40 28 15 -8 51 50 54 90 52
2848 52 62 29 56 78 65 38 34 48 95 82 78 104 54 -21 81 53 30 -47 -17 22 -4 -46 -48 -17 -17 -7 -137 -41 -38 -32 -24 -72 -68
2881 -68 -11 -27 -158 18 -55 -64 -42 -66 -62 -77 -36 1 2 -37 66 26 19 70 44 8 15 13 59 98 12 131 106 21 17 84 79 77 83
2914 83 16 118 94 60 9 17 42 9 21 -29 -39 43 25 -58 -39 -96 -48 -98 -67 -61 25 -61 -102 -22 -60 -51 -75 -58 -69 -93 32
2945 32 -33 -14 -18 -27 30 -30 -40 -55 42 53 27 87 26 38 98 26 96 42 133 75 70 47 85 57 113 21 33 15 19 38 -41 0
2977 0 -2 -3 -75 33 -29 -3 -8 -49 -45 -83 -25 -70 -55 -96 -86 -61 -21 -68 -23 -110 -30 -8 -22 -67 -94 -25 -4 25 26 -18 70 14 -8
$$ packed form
2752I5j11oJ2pk9K8q0K8L5o0OP0p8L3jj7P6r9L2l4L9n6J29r4K0M6m6J6L2Q7l8
2783B8l0K4K7J7p7PQ5n0P4n2j6L5l4Q0o9oj3J3oJ9j0j8K2ql1mj4j5j0p8O3rO4
2816Hr2L1n6O9J2j8J0J2k7j5K3M7p9K0j1j8OP5j4L3n6M7J7o4O8j3k3N9jML6l8
2848E2J0l3K7K2j3k7mJ4M7j3mK6n0p5J02k8k3p7L0L9k6m2kL1%J0j30R6LOQm8M
2881f8N7j6j31J76p3rK2k4Mj5M1L7Jl9J03m0pN1k6l6PkM6L9q6J19k5q5mO7nkO
2914H3o7J02k4l4n1QK5l3J2n0j0Q2j8q3J9n7M8n0L1OQ6q6m1Q0l8Rk4J7j1k4J25
2945C2o5J9mrN7o0j0j5R7J1k6O0o1J2O0p2P0n4R1n8nk3L8k8N6r2J2j8MJ9p9M1
2977@kjp2J08o2K6nm1Ml8N8m5J5m1J0K5M0m7M5q7Q0K2j4m5k7O9K1K9Jm4Q8n6k2
$$ plain form
3010 -8 -27 70 23 46 86 74 81 46 20 68 113 3 72 77 70 30 89 3 11 68 52 -20 21 -24 -5 -8 -60 -77 -76 -12 -17 3 27 -33
3044 -33 -35 -57 -84 26 -92 -87 -35 -55 -44 -69 -55 -55 -55 -26 -10 -38 -15 -36 -29 0 15 29 0 27 24 18 16 51 34 83 52 20 89
3077 89 76 62 -27 62 42 123 76 75 22 56 23 88 22 -2 -28 25 29 -9 -13 36 -75 8 -75 -8 -125 -48 -55 -63 -98 -84 -64 -124
3109 -124 -50 -22 13 -59 -14 -41 -79 -35 24 -11 -15 45 -2 -68 65 65 -27 76 26 -19 102 36 53 43 34 65 98 71 102 106
3139 106 124 46 36 41 -10 -53 -51 14 18 7 -25 9 100 20 -24 -43 -65 -30 -62 -78 -65 -5 -80 -7 -17 -53 -76 -67 -26 5 -88 -25
3171 -25 -39 20 -33 -2 -6 31 -1 45 11 25 24 48 75 87 114 -5 44 70 123 49 54 56 63 79 68 4 10 20 82 11 68 11 39
3204 39 26 -6 6 -6 -28 -22 -8 -48 -5 27 -39 -39 -42 -66 -47 -47 -120 -41 -37 -43 0 -49 -74 -51 4 31 26 -27 36 25 29 -36 10 43
3238 43 8 63 -67 22 59 40 65 34 80 34 35 8 46 110 9 64 1 27 -8 49 -25 -33 90 -34 -46 -12 -6 10 -27 -70
$$ packed form
3010hj9R7m7K3M0j2Pl5k6M8M5j10O9Npm0N9q6QN7j6p2M1m5J9ln2j7JO4nK0K4o0
3044c3kk2k7J10j18NN2k0J1k5J4%%K9J6k8K3k1PK9J5J4k9K7lokL5j7M9l1l2O9
3077H9j3j4q9Q9k0Q1m7jn3L4l3O5o6k4k6N3Ml8mM9j11Q3q3O7j17P7pql5J4K0o0
3109a24P4K8L5p2M5k7l8M4N9l5mO0m7o6J33%r2J03n0m5J21o6J7j0rL1L3k7L1M
3139A06J8p8j0Nn1m3KO5Mj1l2L4R1q0m4j9k2L5l2j6J3O0p5P3j0l6k3RM1L1r3O3
3171b5j4N9n3L1mL7l2M6l4J4jK4K7J2K7j19M9K6N3p4NKPJ6j1o4OJ0O2p1N7n7K8
3204C9j3l2J2j2k2OJ4m0M3L2o6%lk4J9%p3P9MoM3m9k5K3N5K7nn3O3j1Mo5M6L3
3238D3l5N5j30Q9L7j9K5l1M6m6Jk7L8O4j01N5o3K6l5N7p4qJ23j24j2L4OJ6l7m3
$$ plain form
3268 -70 -27 -74 -42 -10 -53 -30 -63 -83 -40 -36 -64 -122 -22 -50 -71 -78 -38 -5 -35 11 -51 -23 53 25 18 -4 40 30 20 20 29 46
3300 46 8 82 83 70 42 35 27 18 23 72 49 77 2 119 95 -2 33 -1 8 -18 -30 -34 -11 -18 3 -76 -43 -87 -92 -75 -73 -21 -1 -50 -97
3335 -97 -46 -2 -70 -56 -12 -65 -77 5 -76 26 15 16 2 52 -6 20 54 -36 41 35 92 19 35 12 141 15 -10 15 53 74
3365 74 21 59 30 41 6 19 69 33 3 14 4 -22 -16 -6 -29 -50 -59 -35 -16 -15 -16 -47 -25 -48 21 -33 -106 -35 35 -58 -7 -16 -25
3398 -25 -57 -55 18 -22 24 -82 15 64 -36 39 44 16 22 36 123 -20 18 79 11 26 57 28 143 35 60 32 35 3 -3 41
3428 41 -17 5 63 -22 77 -16 -64 -40 -34 -46 -84 -68 -16 -13 -29 -35 -70 -33 -18 -24 -100 -70 47 -77 -43 -60 -12 63 -6 -45 28
3459 28 18 -61 21 68 67 13 -29 31 39 17 5 83 84 50 80 48 63 69 49 45 5 37 64 17 81 -20 15 38 -3 -23 -43 1
3491 1 -21 -34 -84 13 -21 -19 -25 -47 -90 -64 -45 -50 -88 -51 -81 -9 23 -52 -11 -37 -4 55 25 25 59 35 22 13 6 3 43 33 27 45 69
$$ packed form
3268g0M3m7L2L2m3K3l3k0M3Mk8n8J00k8k1pM0L3l0M6o2K8P6k8pk2M4j0j0%RJ7
3300D6l8P4Jj3k8pqrNM9k3K8p5J17k4r7L5l4Rk6j2mK3pK1p9L3m4nJ7KN2K0m9m7
3335i7N1M4o8J4M4n3j2Q2q1J02j1Jj4N0n8K6L4r0P7oN7p3J6k3J29j26k5K5L8K1
3365G4n3L8k9J1l5J3N0l6l0J1j0k6OJ0k3k1rK4J9Jjl1K2k3O9n4p3P1P0r3N1rr
3398b5l2KP3m0M6j06R7M9j00P5Nk8OJ4Q7j43L8O1o8J5L1k9J15j08K5k8Ll2oM4
3428D1n8K2N8q5R9r3m8K4Oj2l8J6N2Lj6ol5L7J5op6L0J17j24L4j7M8P5o9l9P3
3459B8j0p9Q2M7jn4m2O0Qk2j2P8Jl4L0l2J5Ok0mm0L2K7m7O4j01L5K3m1k0k0M4
3491Ak2j3n0R7l4Kok2m3K6J9nl8L7l0P2L2p5M1k6L3N9l0%L4k4j3rplM0j0oJ8K4
$$ plain form
3526 69 36 33 22 86 -14 60 57 12 55 60 16 20 71 -1 66 60 -34 52 19 9 -40 -57 -17 -6 -69 -36 -90 -15 -41 -24 -28 -95 -29
3559 -29 -11 -5 -53 -41 -65 -14 11 -42 2 -38 14 52 -44 1 36 21 53 -17 65 1 69 29 70 -4 32 46 53 -2 15 76 35
3590 35 81 67 12 31 20 30 -21 24 25 17 12 -19 -29 -57 -47 -69 -61 -70 -2 -41 -57 -40 -99 -36 -88 -66 -113 -27 -76 -68 -30 -30 5 -31
3624 -31 -8 3 36 17 6 16 24 78 -9 44 83 53 73 27 78 44 59 48 87 23 89 103 6 18 -37 50 84 55 40 0 -33
3655 -33 27 -41 35 29 22 -41 -17 -55 -100 -3 51 -111 -53 -39 -46 3 -16 -19 10 -11 -58 -100 19 -32 -17 30 5 14 -19 39 54 30
3687 30 -13 12 26 -1 57 18 74 23 70 85 76 77 69 49 79 23 19 29 61 -10 75 -29 -39 26 73 59 45 0 21 -6 -50 -8
3719 -8 -78 -13 -37 58 -75 -67 -73 11 -41 -23 -30 -81 -66 21 -41 -20 -45 -37 -32 45 -8 47 -9 28 9 77 20 50 48 5 35 95 8
3752 8 -17 107 -9 55 106 65 28 31 -7 10 82 8 68 1 0 -36 -26 8 -53 1 24 -38 17 51 -71 -33 -10 -25 -4 -65
$$ packed form
3526F9l3lj1O4j00P4lm5M3Nm4MN1p2O7or4Q6l3j0m9j7M0J1o3L3n4P5k6J7mo7O6
3559b9J8Om8J2k4N1K5n3M4m0N2L8r6M5L5j5L2p0Q2o4O8m0M1p4L6J4Pn5J7O1m1
3590C5M6j4n5J9j1J0n1M5Jqnl1j0k8J0k2QrO8l9j6J7n9O3n2K2m7Q6m9QL8%L5l6
3624c1K3J1L3j9j1J0QN4q7N3L9l0K0m6N1l4J5j1L9o4O6J4r7J2n5Q7L4k9j5m0l3
3655c3O0o8P6opo3K4l8m5R7N4j62N8J4pM9j9lK9k1m7m2J19n1J5M7k5Rl3N8J5k4
3687C0m3K5J4k7N8l9N6n1M7J5rJqk0L0n6mJ0L2p1Q5j04j0O5M7j4j4m5K1k7m4M2
3719hp0O5k4R5j33QoQ4n2J8pn1J5Q7o2K1k5QNP7n3N5n6L7j9O8n7L0km3L0O0q7
3752Hk5J24j16O4N1m1l7Ll8J7P2p4O0o7jl6J0L4o1N4K3o2N5L4j22L8K3j5K1o1
$$ plain form
3782 -65 -18 -117 -41 -90 -51 -27 18 -134 -61 -32 -38 -26 -30 -43 -61 44 -46 51 26 84 -19 6 4 93 51 12 65 18 19 67 -21
3813 -21 75 31 34 -13 -6 9 -2 76 60 10 27 14 -13 51 26 52 35 -30 -57 -69 -82 22 -67 -81 15 14 -13 -9 1 -26 -15 -40
3845 -40 -35 -34 -50 -1 -75 -2 -35 -43 -30 51 -56 52 25 -14 53 20 65 21 9 53 84 82 128 43 111 48 67 77 66 73 61 46
3877 46 19 -13 17 24 -5 42 2 -41 -40 -94 -3 44 -31 67 -65 -38 -2 -59 -33 5 35 -21 -39 -36 -13 -29 -15 -43 9 60 18
3908 18 1 -33 35 33 0 42 43 86 -34 20 -23 8 36 45 59 82 37 28 41 16 52 52 -55 21 13 66 47 -2 -7 58 54 -3 54
3941 54 44 -50 -8 14 -70 -9 -91 -58 -11 27 -50 -57 -58 -71 42 -40 13 -11 -3 -14 -50 -23 -5 -19 -24 66 -35 12 25 6 26
3972 26 67 51 -12 31 79 39 41 -8 85 80 -43 44 37 19 22 -8 52 -21 -6 82 27 9 26 91 -37 51 -22 1 -19 -47 40
4003 40 -54 -46 -7 -35 -45 -61 25 -76 26 -10 -30 3 -7 23 -8 -69 52 11 -3 -36 17 17 4 51 73 75 34 -20 15 45
$$ packed form
3782f5M7r9P6m9L9K4M5j52P3K9oJ2mj3j8J05r0R7k5N8j03K5kQ9m2l9N3m7JM8q8
3813b1R6m4Lm7PJ5j1P8j6n0J7j3k7O4k5K6j7o5k7j2j3J04q9j4R6jk7MJ0k7J1k5
3845d0NJj6M9p4P3l3qJ3Q1j07J08k7l9O7l3M5m4j2M4L1kM6q5O8o3J9J0j1Pj2j5
3877D6k7l2L0Pk9M7m0m3Jn4R1M7p5R8j32K7L6n7K6L8L0n6j8LK3j6J4k8N2N1m2
3908A8j7l4O8kl3M2JM3j20N4m3L1K8RJ4K3m5rJ3k5L6%j07P6qN3j9m9nO5mn7N7
3941E4j0r4M2K2q4O1q2L3M7L8p7pjj3J13q2N3k4Qj1l6K7J8j4nR0j01M7J3j9K0
3972B6M1j6o3M3M8m0Km9R3nj23Q7pj8Ll0O0p3J5Q8n5j8J7O5j28Q8p3K3k0k8Q7
4003D0r4QL9k8j0j6Q6j01J02l6k0L3j0L0l1o1J21m1j4l3N3%j3M7K2Km1n4L5L0
$$ plain form
4033 45 83 49 15 55 26 67 23 40 70 20 32 80 -44 -21 48 13 9 -22 49 3 -34 -12 -73 -39 -54 -35 11 -24 -25 -68 21
4064 21 -22 -58 -21 46 -9 -16 -27 -15 -32 -54 -38 32 -57 -23 -7 9 -8 -50 0 59 97 -1 37 16 7 6 59 16 9 51 71 37
4096 37 20 12 16 -26 -41 38 14 -17 12 -5 -2 18 -20 21 12 9 37 -24 -9 -70 -60 24 -62 -21 -38 -52 -1 -29 14 -11 34 -22 19
4129 19 -7 -27 15 -9 -48 28 15 29 -9 28 -9 37 42 -4 90 63 74 68 45 69 54 28 48 81 2 60 -20 30 -9 12 31
4160 31 -16 40 -13 84 20 3 -11 -34 2 -13 -47 7 -6 41 -5 3 17 -53 -14 -24 -4 -38 -86 32 -35 -36 18 12 15 22 41 -22
4192 -22 51 14 -19 -18 72 9 36 5 2 43 65 34 53 4 48 72 66 37 54 -42 2 -25 28 -21 17 -4 -31 48 -24 -23 11 -23
4224 -23 -57 -13 -104 -11 -25 -17 -33 13 37 -1 -31 -41 -31 -80 -46 -10 -14 -17 -2 -27 -26 -5 -46 -49 57 -24 -36 -47 -22 31 44 8
4256 8 -18 47 31 39 9 65 54 41 -5 55 55 80 42 23 25 43 32 -17 10 27 8 -97 -11 -60 44 -11 28 -45 -73 -19 -39
$$ packed form
4033D5L8l4l4M0k9M1m4J7L0n0J2M8j24K3O9l5ml1P1m6l7K2o1L4j5J9M6l5jm3Q9
4064B1m3l6L7O7n5pj1J2j7k2J6P0q9L4J6J6j7m2N0N9L8r8L8k1rjN3m3pM2K0l4
4096C7j7qMm2j5P9k4l1K9j7LK0l8M1rlK8o1J5o1J0Q4q6M1j7j4N1k8M3k5M5n6M1
4129A9k6k0M2k4l9P6j3J4l8L7l7M6Nm6R4k7J1ok3K4j5k6K0L3p9N8q0N0l9K1J9
4160C1m7N6n3R7o4j7j4k3L6j5l4N4j3M7m6QJ4p0L9j0K0l4m8J18o7jN4oLPJ9o3
4192b2P3l7l3JR0o3K7l1lM1K2l1J9m9M4K4ok9J7r6M4k7N3m9L8k1k7P9p2JL4l4
4224b3l4M4r1R3j4Qj6M6K4l8l0j0J0m9L4L6mlJ5k5JK1m1lJ06q1j2j1K5N3J3l6
4256Hk6O5j6Ql0N6j1j3m6O0%K5l8j9KJ8j1m9K7J7j9j05Q6m9J04n5L9p3k8N4k0
$$ plain form
4287 -39 -52 -32 -45 -76 -33 -34 27 -2 20 -82 -13 11 -49 -6 -71 -3 19 -24 6 2 21 -10 -41 14 92 41 44 37 24 38 74 -39
4319 -39 28 65 -17 115 29 25 33 6 14 18 -32 5 26 -29 29 -7 4 19 -47 0 9 -22 -13 -32 3 -48 20 -111 -2 -15 -48 23
4351 23 -29 12 -83 -60 -48 6 -25 15 -22 39 -8 4 -36 6 -6 59 15 17 -7 4 40 14 26 70 54 -13 44 23 16 119 25
4382 25 -64 72 38 84 33 -12 38 -72 -23 30 -18 -16 -1 -39 -23 -18 -37 -38 -26 -38 12 -2 14 -48 11 -11 -40 -37 -34 44 -21 -39
4414 -39 -47 -7 -29 29 64 1 -17 -1 36 26 71 30 56 23 -7 40 87 11 23 48 44 1 24 14 54 69 38 56 48 8 2 8 -21
4447 -21 16 -87 59 -22 -36 -4 -16 -46 -2 -63 -41 76 -42 -46 -22 -17 -7 -21 -18 -25 -73 -40 -35 -8 14 -6 -28 15 13 1 24
4478 24 44 6 69 -1 34 17 6 21 24 -66 35 -8 58 43 0 1 51 14 83 -3 29 15 17 27 -22 -14 -71 20 -92 39 -118
4509 -118 23 -20 -35 24 10 -8 -19 -7 -34 -25 -28 -35 9 52 -17 -60 0 -29 5 38 -43 4 1 -37 25 34 1 -4 -89 -12 -15 -10 19
$$ packed form
4287c9j3K0j3l1M3jO1k9K2j02O9K4o0M3o5O8K2m3L0mJ9l1l1N5P8n1Lpj3J4L6j13
4319c9O7L7q2J32q6mQk7QMn0L7K1n5N8l6J1J5o6M7Rl1Rj9L5n1O8j31J09j3l3P1
4351B3n2M1r5K3J2N4l1M0l7O1m7J2m0M2j2O5m4Kk4J1L6k6J2M4j6o7N7k1pJ03r4
4382B5q9J36l4M6n1m5N0j10M9N3m8KJ5l8J6Nj9jJ2j2N0j4J6o2N9k2k9LLP8o5j8
4414c9qM0k2N8L5o3j8J6L7j0M5m1K6l3l0M7M7p6J2K5mm3K3j0M0J5l1J8qm0oOk9
4447b1L7j03J46q1j4L2j2l0M4o1K2J17j18mK4NJ0j4Lpm8L3NK7K2k0k2M3kj2K3
4478B4K0l8O3p0L5j7j1J5Lr0J01m3O6j5m3JN0l7O9q6L2j4KJ0m9Qn7R1j12J31j57
4509a18J41m3j5N9j4j8j1J2k7RlpM4M3o9m3O0k9L4L3q1M7ll8O2Rl3nq5P7lNK9
$$ plain form
4542 19 -9 -15 99 46 2 46 -7 54 14 7 28 11 53 -46 12 74 -2 22 -44 11 -10 -66 3 -36 -28 56 -42 -22 13 -23 -33
4573 -33 -87 -52 5 -84 -39 -66 -44 -15 -53 14 -4 -7 -35 -37 15 -25 14 30 26 55 32 31 -57 56 -25 11 6 13 23 53 13 -17 26
4606 26 -39 35 14 71 22 -36 -17 33 -85 -17 54 -42 -9 -37 20 -27 -51 5 -27 8 -21 13 48 -61 -88 -1 -38 4 -8
4635 -8 -49 -34 -44 33 -75 -27 33 -33 -1 54 -15 0 -61 33 13 -24 -19 32 32 34 26 36 46 0 -29 3 29 64 80 -18 -19 42 26
4668 26 -8 32 0 3 -3 -5 3 -2 -33 -24 15 -45 -22 0 -98 -42 -76 -9 7 -75 -5 -52 -57 -24 -13 38 23 -22 -12 -25 12 -36 -4 -62
4702 -62 38 -47 65 16 26 68 -45 40 21 39 -7 8 -21 7 15 18 18 10 -59 52 -4 -8 -9 -14 66 -58 -29 -27 0 5 -47 -24
4734 -24 17 -7 30 -81 -3 -45 12 38 -48 -69 -31 -6 -41 24 15 21 -28 -47 10 -15 52 -20 15 25 14 -12 38 7 18 -50 15
4765 15 23 48 126 -23 -17 58 24 30 -49 3 26 -66 1 29 -3 -43 -3 12 37 12 -49 9 -3 -35 -43 -34 -29 7 -38 -30 9 -1 -28
$$ packed form
4542A9k8oJ14n3m4M4n3O1m0pK1j7M2r9N8O2p6K4o6N5k1n6O9l9QQ4r8K0L5l6j0
4573c3n4L5N7q9M5k7K2K9l8O7j8lk8kN2m0L9J6mK9k3jq8J13q1L6nPJ0L0m0l0M3
4606B6o5P4k1N7m9n8J9N0j18O8P1r6L3k8N7m7k4N6l2L5k9L4L5j09k7Q7l7M2j2
4635hm1J5j0P7j08M8O0o6L2N5o9J5o1R4k0l7NN1%KqJ0J0m6k9L2K6L5J6r8jO1j6
4668B6l4M0l2LokQnl1RL9o0K3K2r8N6l4O7J6q2P0m7nL3J1N1j5m5J0j3L7m8L2n8
4702f2J00q5J12m9J0M2j13Q5j9J8m6J5k9K8QL%qo9J11n6mjnQ0j24K9KK7Nn2K3
4734b4M1k4L7j11P8m2N7K6q6k1L8K5l5O5rOm9j9N7k5O7p2L5J0j1k6N0l1J1o8O5
4765A5QK5P8j49OP5l4Op9N2K3r2O7K8l2m0M0J5K5k5o1N8j2l2qRNL6m5QL9j0k7
$$ plain form
4798 -28 -3 -29 -9 -26 -18 -24 -3 20 2 9 66 -6 19 56 -12 -12 -42 22 -18 -4 70 -38 39 43 38 30 -35 12 85 11 40 77 -57
4831 -57 -42 -55 -24 21 50 15 43 -19 -24 -5 8 -57 -27 -2 -65 -53 40 8 -76 8 8 -10 -23 -17 1 -27 -55 -19 -45 -39 -64 35
4863 35 7 17 -46 -8 -3 -13 87 -7 80 53 76 33 24 8 -19 -23 24 36 61 19 -8 23 34 -9 71 40 -27 -45 84 79 -45
4894 -45 15 33 40 61 -5 -31 -47 14 -52 19 36 -30 -17 18 -2 -2 -69 -54 -73 -97 -23 67 -54 -11 -12 -7 -24 -3 4 63 14 -43
4926 -43 -32 48 23 15 -3 63 41 71 43 64 -9 3 -6 82 81 46 3 17 53 85 11 47 68 30 38 -22 65 -56 -3 7 -44 -47
4958 -47 2 -40 -8 -48 -19 -45 -10 -70 -36 6 3 -7 -19 -36 5 -27 -38 4 11 16 38 13 40 5 59 -5 12 33 22 54 -1 12
4990 12 42 46 3 25 53 41 79 42 59 61 25 64 79 -5 -10 42 -6 26 -35 11 23 -16 14 2 -12 -2 -48 -20 -21 -15 -12 12 -63
5023 -63 -81 -68 -12 34 -17 47 -18 -31 8 -31 18 16 -67 15 3 55 -32 42 11 101 -2 -36 37 40 49 38 23 -37 2 38 35 -13
$$ packed form
4798b8K5k6K0j7QoK1K3j8PN7p2K5L7o8%l0O4m0J4P4j08P7Mnqo5M7P3p4K9L7j34
4831e7J5j3L1M5K9l5K8o2nJ9J3o5L0K5o3J2R3l2q4Q4%j8j3OJ8k8k8L6k6Ok5R9
4863C5k8J0o3L8Nj0J00r4Q7k7K3m3rj6k7mM7J2K5m2k7L1J1m3Q0l1o7j8J29nj24
4894d5O0J8PK1o6k6j6O1o6P1J7o6J3L5k0%o7J5j9k4P4R0j21M3jNj7K1PN9m9n7
4926d3J1Q0k5qj8O6k2L0k8K1p3J2rQ8jl5m3J4L6L2p4L6K1l8Qo0Q7j21N3J0n1l
4958d7M9m2L2m0K9k6L5o0L4M2lj0j2j7M1l2j1M2PNK2k5K7l5N4o4J7K1j1L2n5J3
4990A2L0Mm3K2K8j2L8l7J7Kl6L9J5q4nN2m8L2o1M6J2l9L0j2j4J0m6K8jOLK4p5
5023f3j8J3N6M6n1O4o5j3L9l9M9kq3Q2j2N2q7P4l1R0j03l4P3LRj1j5o0L9L6lm8
$$ plain form
5055 -13 30 -3 16 39 24 -1 -34 -31 34 -3 0 4 13 -10 6 -2 24 16 2 90 -93 7 -29 -12 -9 -26 0 24 -17 2 -29 -22 -30 -59
5089 -59 -24 -44 -7 -4 36 -34 -2 65 -41 14 36 19 37 38 8 28 -39 29 51 36 5 27 -10 23 20 8 29 -18 33 -14 -37
5120 -37 -23 29 48 3 94 -6 -26 -4 -19 -16 -46 -44 8 -64 -30 -82 1 0 2 -13 12 -36 -48 -34 -10 -19 68 -4 17 -35 -1 2 -12
5153 -12 -14 -36 39 89 33 24 6 10 6 -77 53 -10 84 21 60 21 21 -11 55 78 -25 -29 44 -14 -6 56 86 -32 33 28 18 -6 -15
5186 -15 41 -6 49 -22 39 -12 -9 24 25 46 14 -24 -15 -2 42 -44 -33 -18 30 3 -30 0 15 16 -49 52 21 10 -13 -6 0 9 16 52
5220 52 69 8 -6 20 35 17 47 23 -7 33 72 -3 3 -14 26 -8 17 20 21 69 -38 9 -13 9 -27 -49 -15 40 -47 -44 6 -26
5252 -26 25 -31 -64 -30 -68 -59 -12 13 6 6 -79 33 29 6 -21 37 16 -82 -18 -11 -6 -1 77 33 -20 55 86 12 -20 40 24 -30 9
5285 9 45 30 -3 32 30 36 25 19 -19 79 34 3 -1 -3 -8 -3 5 -14 -17 9 43 4 25 -78 0 36 37 22 10 -22 -22 40 9 10 39 6
$$ packed form
5055a3M3l3J9K3j5k5l3LO5l7LMRk3J6qK6qj4Q8j83J00l6J7Lj7K6K4m1J9l1Pqk9
5089e9L5k0L7LM0p0L2O7j06N5K2j7J8Jl0K0o7O8K2j5l1K2l7L3lj2K1m7N1m7k3
5120c7J4N2J9m5R1j00k0K2j5Ll0KN2p2L4n2Q3jKj5K5m8j2J4K4rQ7p2K1n2L4Lj4
5153a2kk2P5N0n6rj8Mmq3J30o3R4o3L9l9%l2O6K3j03mP3n8QO2L0j18O5nj0k4r
5186a5N6m7N5p1O1n1LL3JK1l2l8RJ3M4q6J1J5M8k7l3L0J5Jo5J01l1j1k3PORPL6
5220E2J7o1j4K6J5j8L0k4l0M0L9p5Oj7M0l4K5LJM8j07M7k2K2l6k2L4N5q7LN0l2
5252b6N1n6l3L4l8RM7K5p%q5J12mk3k7N8k1r8O4PNNP8m4n3P5L1p4l2O0j6n4L9
5285IL6j5l3L5kOj1ol8R8m5l1mknNQj9lK6L4l9K1j03P8L6Jj5j2l2%O2l1JK9l3
$$ plain form
5321 6 23 46 -45 25 6 11 49 -33 43 9 37 40 -1 -46 44 40 -45 -14 7 -1 -13 -32 14 83 42 -31 -12 12 -24 -82 -6 -37 -43
5354 -43 -6 34 -39 -14 -4 -25 42 0 14 16 -52 10 19 -3 -36 -25 2 -37 -7 69 45 29 -15 -55 56 2 11 71 74 25 18 -28
5386 -28 -19 54 36 -10 -19 26 4 18 39 1 -10 -22 20 9 35 92 27 -36 3 43 0 -20 -15 52 -20 1 11 -12 -20 30 79 17
5418 17 -26 -44 -7 -39 -16 -4 9 -79 -16 -10 -65 -1 51 51 34 -27 9 8 34 -36 -22 35 -35 27 -10 21 -28 35 44 29 -17 23
5450 23 25 77 30 -27 27 -42 -31 11 22 -44 13 -10 67 19 -34 33 -53 -14 22 58 -35 7 -89 28 -56 20 -2 8 -26 -20 -11
5481 -11 -2 75 46 -42 -20 -38 2 -4 12 -14 -47 -7 18 -31 14 -42 4 -5 44 64 6 27 12 53 18 -2 -30 18 4 52 11 5
5513 5 29 -6 -18 10 17 5 -1 -9 -3 -27 14 -73 -4 -69 -11 -32 -17 6 -11 14 -75 -29 -31 -50 -16 -23 -35 44 3 -68 -32 -45 -2 -9
5547 -9 69 14 -8 55 -1 26 23 -50 28 2 -27 16 -9 -7 28 -9 57 55 23 70 -41 46 -1 -29 -26 -17 -34 8 80 40 17 54 -47
$$ packed form
5321FJ7K3r1P0j9NL8q2P6l4K8Lm1m5R0mq5L1K1qj2j9M6O9m1p3J9K4l6n8P6l1o
5354d3L7M0p3K5J0k1O7m2J4Ko8O2Rk2l3J1K7l9L0P6k4j6m4m0J11n4RO0Lm9pm6
5386b8RP3j8m6rM5k2J4K1l8j1j2M2j1K6N7o5o3L9M0m3k0NO7p2K1J0k3qN0M9o2
5418A7m3j8L7l2K3J2J3q8O3On5O4N2%j7o1L6jK6p0J4N7p0O2l7L1m9O3Rj5m6M0
5450B3KN2m7n7N4o9J1M2J1o6N7k3P7m8n3O7q6L9L6L6r3M2r6J17q4P6k2J0l4OR
5481a1RP7k9q8K2j8M0oJ6k6l3M0K5m9M5n6M6rM9K0n8K1j5M1l5k0k8M8j4M8m1o
5513EK4l5j2K8Pj2oqOk4M1q7O9o5N8k1J5K3j7K5q9M6kj9L4pj2P9m1p1L6j3M3p
5547iP8n5k2O3n6K7lp3P8k6k9M3k5KL5l7O6kl2M7j11Q7m7k8LRj7M2P2m0k3L7j01
$$ plain form
5580 -47 -6 -11 34 23 40 -39 -4 24 -13 -36 -21 -15 -71 -51 22 -24 31 -18 -20 -25 9 -5 59 -28 53 84 4 19 -15 2 -62 3
5612 3 106 16 45 21 48 40 -48 91 48 35 8 40 -3 -37 37 41 22 -13 37 -18 -15 24 -29 -7 -46 23 14 -3 40 -53 -23 23
5644 23 -29 30 19 -5 -20 7 -45 62 -44 -57 -42 -4 8 -62 35 17 20 -9 10 -6 53 -5 37 -45 61 -49 -24 13 -4
5673 -4 23 40 19 35 61 30 -19 -8 0 59 -23 12 60 63 55 -21 -12 -20 -23 -32 -10 12 -3 60 -44 -54 7 -4 -19 -84 49 -25 57
5706 57 14 -29 7 49 -18 24 -59 -7 2 -10 -67 75 42 88 23 76 48 -18 -4 50 42 -16 -9 -58 15 68 0 -4 8 9 90 25
5738 25 22 70 22 6 14 35 -44 -9 -15 -46 68 -36 -32 11 7 38 -49 -42 15 -6 5 17 6 -7 -12 -22 -20 -28 -1 57 16 -47 -40 53
5772 53 -10 27 31 63 5 7 61 -27 14 29 6 -34 26 27 -7 36 56 -35 -8 25 47 -33 -6 51 -79 1 -1 -27 12 1 -2 -40
5804 -40 15 -54 -22 28 -5 -14 -47 12 -11 -73 5 -34 8 -21 2 42 17 11 -3 8 -57 9 -9 -38 -67 23 -14 26 -1 14 40
$$ packed form
5580d7M1nM5j1J7p9L5K8l7k3J5On6K0P3m6N5m9knL4j4O4q7Q1L1q0J5l4J7o4O5
5612CJ03r0K9k4K7qq8J39m3j3k7L2m3l4P4Mj9l5N0n5LL9n3K2l9O9rj7M3r3L0M6
5644B3n2N9j1k4j5K7n2J07j06j3J5L8J2p0R7j8Lk9J9j6N9n8M2q2J06j10K5L7j7
5673dK7J7k1J6K6l1m9J1QN9q2L5M8Lqp6RqlrK2K2j5O3j04j0O1j1j5o5J33p4Q2
5706E7m3m3L6M2o7M2q3N2Rj2n7J42l3M6o5N3k8o6J4N4qn8Pm9P3N3o8mJ2JQ1o5
5738B5lM8m8j6QK1p9L5ol1J14j04MM3mL1q7PN7k1J1J2j1j3nj0KqK7N8m1o3PR3
5772E3o3L7ML2n8KN4q8M1J5k3m0O0Jl4M3K0r1K7L3K2q0K7N7j30Q0kk6L9j1ll8
5804d0N5o9L2N0l3rl3N9k3o2P8l9M2k9K3M0k5oj4J1o5O6j8k9k9R0l7M0k7J5K6
$$ plain form
5835 40 21 23 -17 10 7 -4 -34 41 37 12 25 29 1 -8 16 30 22 11 44 102 70 -50 2 5 6 -24 -32 -21 11 18 65 -35 1 49
5869 49 -38 7 10 21 -24 -25 -55 -10 -20 -20 -9 11 22 2 -64 -74 -28 -52 -17 46 -46 -41 -20 -51 5 14 74 36 28 58 9 -41 17
5902 17 -3 -6 -24 -40 32 24 -37 -8 -9 71 0 81 66 -39 11 8 5 -28 -16 25 22 -41 -12 -25 25 0 10 -25 -27 4 -35 -14 -33
5935 -33 -47 17 -41 11 -10 -26 -2 -29 38 -26 42 30 -18 25 -28 83 -6 -7 35 2 21 -14 -26 -9 -1 -11 12 23 24 12 -91
5966 -91 -58 -9 -36 11 -6 -14 47 -42 -16 -5 -28 -1 -5 14 -6 9 -42 32 27 -57 6 -39 -17 18 11 82 -16 7 66 -37 -79 13
5998 13 -8 47 9 4 -8 40 27 -55 3 71 36 43 -3 40 -26 55 44 7 -79 2 59 36 67 -52 -8 -3 -27 -18 -53 -103 -56 0
6030 0 -1 3 -31 62 24 -25 -45 -20 27 -36 -26 -56 -91 27 -78 -12 15 -2 32 -22 43 -34 41 -40 3 37 -4 -7 -31 -20 11
6061 11 56 -69 16 -12 -10 92 -15 48 -18 36 14 79 -11 75 -62 -7 23 -17 -18 -21 67 -35 -55 -45 -11 20 26 -42 -70 -24
$$ packed form
5835D0j9Km0K7lj1l0P5mk5J3Mk8rK4J4qj1L3N8l2j20N2LJl0qJ1L2PM7j00L6M8
5869D9q7M5LJ1m5jl0M5j0%J1K0J1k0o6j0M6k4L5O3r2NK1l1N6RO0l8qL0m9n0N8
5902A7k0lj8j6P2qo1K9jQ0p1Q1j5j05N0lll3J2M1lo3K9j3N0k5J0l5kL1l9K1j9
5935c3j4O4n8N2k1j6K4k7O7o4O8j2m8M3n3J11q9jM2l3J9l5j2J7Qj0K3J1Jj2j03
5966i1L3M9k7M7j7qO1q9K6J1k3K7mJ9k0J5n1P4nq4O3m5K2L5pP1r8K3N9j03m2R2
5998A3k1N5l8nj2M8j3q2N8O8l5Pm6M3o6Q1j1l7q6Q1N7k3L1j19M4Nk4Rl5n0M7N6
6030@jMl4R3l8m9k0K5M7o3J0l0l5J18j05O6K7j7L4n4O5p7P5q1M3L4m1lk4J1L1
6061A1M5j25Q5k8KJ02j07O3o6N4k2O5r0Q6j37N5L0m0jlQ8j02k0J0L4L1Oo8k8M6
$$ plain form
6091 -24 -30 -18 -33 37 -9 -86 37 -38 -34 32 103 -75 -14 -22 -16 21 50 43 -4 33 -32 125 48 0 27 20 14 -21 5 27 20 67 33
6124 33 -3 38 8 -13 32 19 -60 0 15 -8 5 -38 -25 13 17 -54 -60 -36 -11 47 21 9 9 -25 -22 29 -40 -42 -82 41 53 -55
6156 -55 1 -13 -37 -54 43 -2 -19 -18 43 56 19 -34 1 58 9 0 44 -19 69 39 -1 -12 22 47 39 84 6 -6 -54 -3 54 -25
6188 -25 47 15 11 63 -28 40 -40 -19 49 -12 7 9 -7 -29 -47 55 -19 0 10 18 25 28 49 47 -13 -2 -14 -18 -17 45 17 11 -37 5
6222 5 -67 -5 45 -41 -39 -10 -11 -7 -10 45 70 -65 31 10 72 -80 47 -32 -5 13 40 -14 -8 65 7 17 21 -9 -8 55 -24 -4 19
6255 19 35 -39 -9 -55 23 -40 -34 -106 2 -34 -6 -83 -18 -13 -13 -38 -3 33 -53 21 19 -52 -7 -46 -4 28 -34 46 -42 -52 39 16
6287 16 -18 31 10 9 0 -13 0 -28 65 -12 31 -31 94 -12 -29 33 -28 56 35 -27 60 72 5 -57 15 -20 -34 44 31 -18
6317 -18 -45 20 -24 -42 32 30 -48 -15 -43 15 -14 -3 -23 -7 19 15 -65 28 -61 10 32 25 0 63 -10 -44 51 -72 18 15 -56 78
$$ packed form
6091b4oJ2j5P0m6p7J23p5MO6P1j78O1qOL7K9pm7L7o5J57p7m8K7pol5K6K2pM7l4
6124C3l6M1l0k1M5j3p9O0J5k3J3m3J3L8Mp1oK4K5N8k6j2%l4LN1o9km0J23J2j08
6156e5N6j4k4j7R7m5j7JO1J3l7n3L5N7m9rM4o3Q8l0m0j1L4K5qM5p8j2m8N1N7p9
6188b5P2l2mN2r1O8q0K1O8o1J9Kj6k2j8J02p4J9J0QPLK1ko0J1j2mJO2k8om8M2
6222Ep2O2N0q6KK9jMlN5K5j35R6k1O2j52J27p9K7J8K7n4OP3n8J0Ml0JO3p9K0K3
6255A9J6p4L0m6P8o3Op2J08l6K8p7O5N%k5L5L6q6P4kp1M5l9M2L2o2Q0q8j0R1k3
6287A6l4M9k1jrj3J3k8R3p7M3o2J25j06j7O2o1Q4k1o2Q7J2o7o2P2l5j4P8j3m9
6317a8k7O5m4j8P4kp8L3k8N8k9J1k0J6K6mq0R3q9P1K2pk5O3p3l4R5j23R0lp1J34
$$ plain form
6349 78 -18 29 7 16 -3 25 88 21 -63 28 5 27 54 -1 38 10 11 2 35 6 -36 4 -19 9 39 17 -3 55 49 10 -10 2
6381 2 -2 -47 -9 -16 -26 39 84 -1 57 7 9 -44 12 51 -38 -24 -23 18 28 21 -3 0 36 -40 13 12 21 26 54 -17 21 62 0 -40 74
6416 74 -29 -55 27 -26 10 -33 50 -37 24 64 8 22 27 -53 -4 -27 -8 57 31 -18 -8 16 -81 -25 -46 -13 -33 -18 -20 -22 57
6447 57 4 -54 -63 12 -29 -93 28 66 46 39 18 -32 -77 17 -7 -21 38 -39 -25 28 0 -42 -10 29 -22 -39 -15 19 -15 -3 -48
6478 -48 47 10 -42 83 4 -2 1 -18 11 -3 -20 29 87 5 -65 -8 -11 16 -1 -35 39 0 37 15 42 -27 -6 53 -6 58 32
6509 32 -5 7 23 8 1 31 11 -24 59 10 -11 31 -19 9 46 18 22 4 1 43 -1 -36 51 -4 -9 8 -51 12 10 34 -83 -10
6541 -10 14 -34 -28 -58 -4 -25 -13 -2 45 -49 26 -6 38 26 52 -31 15 1 46 34 -14 -26 -65 8 -68 -18 32 46 -65 -31
6571 -31 43 42 43 -25 27 24 -28 28 55 31 16 -37 81 17 64 -6 -15 8 -48 9 -15 -79 25 22 -57 -21 -99 -24 -12 -10 -5 -43 -29
$$ packed form
6349G8r6M7k2Rj9K8O3o7q4R1k3K2K7n5L9k8JrL3k9m2M0k3K8L0k2k0N8ol9k0J2
6381Bmm5L8pj0O5M5q5N8n0Kn3N6L9q9J4JM1J0pk4LL6p6N3jRNK8p1L8M1o2m0J14
6416G4j03k6Q2n3L6m3Q3q7O1M0n6J4Nq0M9k3J9O5k6m9J0K4r7N6k1L3k0J5kkP9
6447E7n3n8rP5m1o4J21L8k0pk1n0m5R4k4j4N9p7J4N3k8m2L2L9n1j7K4L4l4J2m5
6478d8R5l7n2J25p9oLj9K9j4j7M9N8q2p0N7lK7j7l4P4l9L7k2K7o9K1N9n9O4k6
6509C2l7J2J6j5pL0k0l5Q3m9k1M2n0K8L7k8Mj8lM2m4l5Q7n5nJ7n9O3kK4j17P3
6541a0K4m8Ol0N4k1J2J1M7r4P5l2M4j2K6q3M6j4M5j2m8j2l9P3p6N0N0J4j11L4
6571c1P4jJo8N2ln2N6K7k4j5n3J18o4M7p0rK3n6N7k4o4J04lp9L6p8P5J2KNl8J4
$$ plain form
6604 -29 -53 17 -48 18 -50 30 -7 10 -6 -12 7 27 -77 -84 -31 -5 28 -4 54 31 59 -19 -38 -10 34 21 45 -24 2 -21 -2
6635 -2 -6 3 -14 8 16 -30 -55 34 61 -3 41 4 -3 -7 47 -4 -18 33 10 -53 -18 -19 23 79 -1 -77 -2 29 2 -24 73 -40 19
6668 19 64 26 0 25 28 -5 -48 46 21 10 28 20 3 37 -14 20 22 -9 21 -6 3 35 -12 -28 -23 -39 -22 -28 3 17 54 -4 -14
6701 -14 23 4 67 -65 -10 66 -22 -44 20 31 5 10 -66 -39 18 42 -26 -89 -7 -86 -5 -6 -6 4 32 -17 9 -36 40 21 -13
6732 -13 3 45 11 14 54 7 -4 -5 21 31 8 53 -11 -35 -70 6 -44 10 -19 58 6 -33 19 19 -12 -51 12 -33 23 -43 6 19
6764 19 -5 14 -18 -14 -48 -14 -20 18 23 9 -9 41 43 -41 -7 -4 -45 -55 -48 -39 15 17 -7 58 62 7 -19 21 -1 20 -23 18 -11 32 64
6799 64 37 21 33 61 8 54 -32 40 -3 82 -20 -82 7 7 53 -6 -46 -21 5 4 -7 1 1 -40 -48 -67 10 -45 -84 27 -43 8
6831 8 -12 -20 -13 -9 -12 -16 -8 9 -23 -80 33 -15 -15 -4 62 -40 -2 113 77 -59 -10 -9 -49 -54 15 -37 1 38 -35 -36 34 43 -4 13
$$ packed form
6604b9k4P0o5O6o8Q0l7J7j6oJ9K0j04pN3K6L3l2N8k3K8p8j9K8M4j3K4o9K6k3J9
6635bmRj7K2Qm6k5Q9K7o4M4l7pmN4n1j4N1k3o3L5jM2N6q0p6P5L1k7k6R7j13N9
6668A9M5l8k6K5Ll3m3R4k5j1J8qj7L4n1L4Kl1L0k7RL2m7j6Nj6J7oL1J4L7n8j0
6701a4L7j9O3j32N5P6q8k2O4J1k6Np6K7N7K4o8o3Q2p9Q1j%J0K8m9K6m5P6j9l4
6732a3J6M2l4LM0m7j1jK6J0k3M5o4k4l5P6n0N4k9P7n2l9N2%l1l9O3m5N6o6M9J3
6764A9k4J9l2Ml4L4oL8Nj4j8N0Kq4L4Lm1j0PRN4Kk4O5Mn5k6M0k2K1m3M1k9M3L2
6799F4k7j6J2K8n3M6q6P2m3Q5j02o2Q9%M6n9m0K5K6jj1Q%m1qj9P7n5l9J11p0N1
6831Hk0qPMlmQJ7l2n7J13m8%J1O6j02L8J15l6j36M9Jm0nO9n2L8L7p3jP0Rm7J7
$$ plain form
6865 13 0 21 -29 12 -8 8 -36 75 -47 14 35 -4 -44 15 24 -10 25 70 -32 -42 -15 -87 30 4 -38 10 2 26 65
6894 65 -34 -52 50 8 -3 -9 -49 -3 -26 -14 -45 -2 2 22 -56 73 49 22 15 -33 -9 12 -11 -18 -28 5 48 -6 47 39 2 -72
6926 -72 -33 20 23 -31 10 -18 -20 -79 36 -88 42 -44 -14 102 14 -42 7 -51 18 13 -20 50 14 -2 8 -30 -56 -43 -44 39
6956 39 -4 -11 23 35 -13 21 -10 24 -13 -29 25 17 -1 -18 37 27 53 -13 -2 -25 30 28 37 44 49 -26 0 -10 -22 -24 -27 15 -52 -51 -8
6991 -8 70 14 32 -2 -97 11 49 94 10 -5 20 29 -7 -27 -63 4 -47 13 49 21 -58 2 40 -10 -12 -4 12 -13 40 -18 -29 51
7023 51 6 40 45 35 2 29 30 19 32 22 -21 41 7 -2 -9 54 -14 -56 38 -6 24 20 -68 -21 -22 -32 9 17 20 40 28 -6 11 22
7057 22 35 -13 6 56 -9 -18 -28 -66 -9 -24 14 -48 17 11 -14 -64 -52 -46 29 -51 26 -24 -22 -20 5 -5 -1 -27 7 32 12 3 -16 -2
7091 -2 -27 12 39 63 -47 76 5 -10 -40 92 53 19 10 9 30 84 -100 -46 2 -39 -33 24 22 -22 -78 -82 7 3 -1 41 14 -24
$$ packed form
6865A3j3K1n0M1k0J6m4J11j22O1K1l9m0N9Rl4L5M5j02j0K7p2J17k6m2M8qK4L9
6894F5r9j8J02m2j1om0M6k3J2l1M3MK0p8J29k4k7pm8K4K1k3pj0L3M3n4N3ql7p4
6926g2L9N3Ln4M1k8kn9J15j24J30q6L0J16q8n6M9n8O9nl3P0l6j6J0l8k6J3jQ3
6956C9m3pL4J2m8L4l1L4l7j6N4qj8j7N5j0K6o6J1k3N5kRPNp5K6j0j2klM2o7JM3
6991hP8n6J8l4r5J08L8M5q4j5K5Rl6k0l6O7n1O0L6k8p9O0L8n0kQJ6k5N3n8j1Q0
7023E1m5L4Nj0l3K7Jj1J3j0m3O2l4rpO3o8m2R4m4L0mq8M7jj0M1QLK0j2l4J7J1
7057B2J3m8J9N0o5rj0l8N7j5L8o2O5ok5n0J2OP5q0P7n0KKK5j0Mk6L4K5k0rj9J4
7091bk5L9K7K4j10J23p1j5l0J32l9l4rjK1N4j84N4M8m1ON7km4n6mQ9mmM2k7l8
$$ plain form
7123 -24 0 54 -30 -1 -44 -56 -30 -64 -7 29 11 -45 31 13 -19 -6 3 -32 3 2 -22 0 45 37 14 16 16 76 -38 0 -53 -64
7155 -64 -74 17 44 64 17 52 -10 22 13 43 29 26 -44 9 -38 14 -79 20 1 -42 -60 -25 59 -11 -30 -6 1 -63 -47 -32 11 29
7187 29 2 40 16 -31 79 37 -10 13 60 4 5 20 21 -37 61 -12 27 15 -55 -20 40 -17 0 -5 -40 -5 -37 6 -25 -50 11
7218 11 -6 -2 -46 7 -44 72 -36 -1 -20 28 14 25 -9 -25 57 -3 29 -30 -53 32 36 13 1 -24 76 41 14 18 15 -13 4
7249 4 30 3 20 1 -3 40 -12 -13 24 30 -25 16 -3 -31 -30 8 -57 -36 7 -49 -8 48 25 -52 -35 -21 43 30 -33 57 -38 -19 65
7282 65 -13 12 79 14 30 23 13 -28 3 -31 13 26 21 -12 8 -20 -33 9 36 10 30 63 -33 -2 63 -12 54 10 14 33 54 51
7314 51 -67 -21 -31 -75 -20 -3 -13 -6 -32 1 -23 -17 -50 -35 41 19 -16 87 87 3 -15 -45 4 -8 -10 54 63 20 -13 1 -5 34
7346 34 18 -40 -22 -22 25 73 -35 20 41 0 -48 49 24 113 -51 -18 -3 -17 14 25 21 28 -37 -16 44 1 2 -15 6 54 69
$$ packed form
7123b4K4N4q4K9m3j2K6l4N7L6j8n6P6j8l2J3Rl5L5jk4K2M5qk3K%O0j14L8n3j1
7155f4j0R1K7K0m7L5o2L2rL0j4lp0N3m7N2r3R9j9m3j8L5Q4p0j9K4Po4J6J5M3J8
7187B9k7L8k4m7J10m2m7K3M7n6JJ5Jn8R8p3L9j2p0L5O0n7J7nl5L5l2M3l1k5O1
7218A1j7Mm4N3n1J16j08L5j9M8j4J1l4j6Q2o0L2n9k3Q5Mk3j2k5J00l5k7Mlk8J7
7249DK6k7J7j9mM3n2jL7On5M1j9k8JL8o5K1M3n6M1N6k3p7J7J4O4j3o3R0r5J9Q4
7282F5p8K5O7o5J6pj0m1L1l4M4J3nl3K0k8j3M2K7k6K0L3r6L1O5p5O6m4MJ9K1l
7314E1j18M6j0m4N5J7j0Pk6L3k4Ol3J5P6k2l5J03%q4j8l0M9j2kO4Rm3l3J4oL9
7346C4j6n8J8%M7M8j08N5K1m1m8R7k5Q9j64L3J5j4L1J1mPo5K1O0m3Jj7K1M8J5
$$ plain form
7377 69 -46 0 -49 5 13 -57 -40 -2 -30 2 -73 4 13 3 -25 41 59 -11 34 -1 -60 -59 -40 -1 -8 -37 -8 -2 49 -43 -17 -43
7409 -43 13 59 -10 -31 35 6 9 -18 -46 67 40 22 22 57 -39 43 -54 18 -39 4 -29 58 28 -60 -55 -9 -11 5 12 -35 -7 14
7441 14 -11 -37 44 -10 5 -1 91 -11 -11 -65 -6 17 -25 59 -82 -9 40 0 -11 -50 1 -77 -19 -18 -113 48 13 -3 -7 -9 17
7472 17 -6 24 -3 17 40 18 14 76 60 33 -31 -4 29 -6 2 11 14 31 54 -18 2 23 32 -73 -34 15 24 -40 -33 -41 -4 -18 -35 6
7506 6 -11 51 -17 5 -55 38 -30 -12 -63 -66 -21 9 -29 46 -34 12 0 12 -18 -11 -13 -8 27 -12 -24 9 -40 15 35 51 -6 -39 39
7539 39 79 2 -6 20 3 -14 -11 -10 -17 59 -1 9 35 -14 -6 33 -63 -80 -16 -72 -6 -2 -13 -33 -8 -19 2 3 7 28 -7 24 -27 -38
7573 -38 1 -18 -65 32 23 -41 -21 -78 13 68 33 -41 -34 56 17 24 -7 -20 15 -28 71 67 103 -20 -11 23 3 26 43 30 -10 -44
7605 -44 29 43 -11 25 6 8 -24 12 5 -35 1 16 -8 -11 4 0 4 -9 12 5 -41 -64 -26 -16 -32 -40 16 39 11 -29 14 -15 -8 -33
$$ packed form
7377F9j15M6m9N4Qp0J7L8k8L2p5P7Rj0k8O6J8p0M5l5n9JJ9L9pk9K9ON1r2K6k6
7409d3N6M6o9k1O6k9Lk7k8J13k7j8%L5r6Q2r7P2n7M3l3Q7l0q8NM6kJ6Pm7K8K1
7441A4k5k6Q1n4J5oR2j02%n4N9K3m2Q4j41P3M9m0j1l9N1p8N8Jr5J61l5j6mkK6
7472A7k3L0k7K0K3k2mO2j6k7o4K7L3l5QRLJ7K3p2K0K1Rj05L9M9Ro4PqL7j4j7M1
7506Fj7O2o8K2o0R3o8J8n1lM5L0l8P5q0M6j2J2l0PkNL5l9j2L3m9N5K0J6n7l3P8
7539C9M0p7qK6j7j7LJpP6o0J0K6m9QL9r6j7O4n6O6Mj1k0K5j1K1JMK1l5L1n1j1
7573c8L9j9m7R7ro4K0n7R1N5l5p4PR0l9Pl1j3L5m3R9mL6j23RL4k0K3J7j3m0l4
7605d4P3J4n4L6j9Kl2L6pm0L6J5k4lJ5mMj3K1pm6k3L8J0j6qN6K3k8m0M3k9Pk5
$$ plain form
7639 -33 -40 -13 -7 -16 10 5 3 -3 -20 -11 28 -4 14 5 11 14 29 -8 23 -4 -61 38 -17 -23 6 -6 0 51 53 30 31 -2 80 -29 -35 -20 42
7676 42 18 50 48 -23 42 22 -9 -31 35 -26 -88 -50 13 -10 8 -19 15 35 58 -3 31 13 -51 23 -23 -43 1 41 -22 21 26
7707 26 2 16 -1 -17 31 -25 -22 20 -2 11 -58 -26 31 -14 32 -27 22 42 -3 -22 20 31 -28 -57 -59 -59 12 14 47 -77 -12 -16
7739 -16 -29 -52 64 26 -44 33 18 7 -86 -2 -36 -8 -46 24 -32 25 -59 -44 -17 -25 38 -43 17 6 34 -26 40 -3 -2 -18 18
7770 18 41 52 37 -8 15 -27 40 -6 -39 -2 7 -6 25 46 -41 0 -7 53 10 -45 18 45 -72 -20 23 -14 -37 -56 4 23 18
7801 18 -20 19 29 -80 -31 83 6 49 0 26 -45 33 -57 -45 -15 56 -8 83 -16 -21 51 26 25 -41 8 -91 -35 9 48 6
7831 6 25 -29 33 18 -36 20 -8 27 19 24 6 -37 -1 11 11 -50 -16 20 49 -39 -53 -29 18 16 -4 -34 36 8 -8 -2 -22 25 -49
7864 -49 7 -35 -5 -28 10 17 14 47 -24 38 0 12 18 5 -20 16 -13 -23 -8 -26 26 -16 -2 -9 -16 -6 -3 16 62 68 -27 41 -42 -8
$$ packed form
7639c3pK7OrK6nkoj7RL9l2J8rOLJ5l7L1k7n7R9n5oK9j2ON1Kk3Jl3Q2j09oJ5O2
7676D2k4L2kp1O5k0l1k2O6o1o2L8O3k3J8k7L4K0K3o1L4j8o4P4m6k0M4M0o3M3N
7707B6k4J4j7j6M8n6LM2k2J3o9L2N7m5M6n9M9K0m5j9M2J1n9k9k%P1KL3j24O5m
7739a6j3k3J16l8p0P7j5j1r3Q4l4K8l8P0n6N7q4J5K7qO3q1O0j1K8o0O6m3Jj6L6
7770A8K3J1j5m5K3m2O7m6l3L7Rj3L1K1q7M1pO0m3n5O3K7j17N2M3l7k3j9O0J9n
7801A8l8L9J0j09M9J14p7M3m9K6p1P8r0J2L0P1o4R1r9nP2k5jo6M9r9N6M4L9m2
7831FJ9n4O2j5n4N6k8L5qNj8m3L6J2%o1L4L6K9q8j4K4M7kk0l0P0k8j6Ok0M7p4
7864d9N6m2L0k3L8PlL3p1O2l8J2Oj3k5L6k9j0J5j8N2m2J4ppJ0LJ9M6Or5O8q3L4
$$ plain form
7898 -8 -68 1 7 11 -9 -10 -12 36 -11 -67 -1 30 5 -9 11 21 -14 5 26 38 -24 -20 55 8 -9 25 -16 13 -25 9 -43 54 77
7931 77 49 -46 42 18 15 30 -15 8 -1 5 19 40 -28 -32 -77 -39 -19 36 -1 -7 23 -23 22 -30 17 59 13 -28 21 -14 -15 -5 -4 -82
7965 -82 -22 13 -13 -32 25 8 13 20 46 -22 -53 65 10 -14 51 44 57 -7 26 -8 -6 37 -36 68 35 -23 -6 15 45 19 42
7996 42 20 75 -20 89 25 -30 4 -62 10 -10 -12 13 -9 -36 -56 -39 28 -4 -30 1 35 24 -3 -4 0 -40 -15 -75 -6 -58 -58 -40
8028 -40 -63 0 -53 42 38 9 16 43 -1 33 -25 -17 56 -21 -21 17 42 -20 39 3 -28 21 67 34 38 58 22 18 11 -23 -49 6 -21 -7
8062 -7 -45 69 -29 -20 -18 -9 -41 -12 -84 -18 47 20 11 -23 22 -18 -30 -41 -7 7 18 -4 10 -61 8 62 -27 -36 -18 8 -50 31 18
8095 18 8 71 3 -6 36 77 11 72 19 -46 15 -43 41 75 20 -53 54 60 47 43 9 -62 4 48 47 -3 -75 25 22 -31 -24 16
8127 16 -15 -52 -69 -10 -33 -11 39 2 -13 -16 -11 -48 -12 -37 -29 -46 90 -5 0 43 -17 0 -18 27 -20 -5 24 21 -16 -5 -26 -13
$$ packed form
7898ho0O9OMk0jkM8m7n6O6L1k5j4K0J0l5J9K1J2o2MP5m7j7L4m1K9l8L4n2R7K3
7931G7k8r5Q8k4lJ5m5K3rOJ4K1o8mm5L8K0N5l7oL0m6M5n2M7M2m6m1M9l5jJ0Jp8
7965h2O0L5k6j9N7j7NPK6o8l1J18n5k4O5pJ3o4L3l4KM3p3J04l3n8J7K1L0k6K3
7996D2k2N5r5J09o4n5L4o6P2k0kK5k2k7k0J7O7l2k6L1L4j1k7jMm0K5o0O9n2%J8
8028d0k3O3n3R5mk9PK7m4L4n8QP3p7%L8K5o2N9l6l1M9M6l3MK0l6mpl4k6N5k7J4
8062gl8J14r8RKRl2K9p2O6O5k7rl4M5m0j2j1L4J4J1k2J4p1O9N4q9rJ8K6n8Q1j3
8095A8j0O3o8rM2M1o6O1n3o5O1n8Q4L4n5p3J07Oj3ml4p1O6M4jn0p2J00ln3PM0
8127A6l1l7j7N9k3K2N0l7j5lNl7L6k5Qj7J36r5NM3o0J7j8M5m7J5K9ll7J1k1J3
$$ plain form
8159 -13 -18 -30 41 -14 36 44 9 12 -43 7 26 29 -13 -32 -4 28 41 39 6 3 -17 23 20 2 -5 -12 16 -7 73 -36 52 12
$$ packed form
8159a3nj2P1n5N0Ql5Ln5N0J9Lm2j9K8L2J3kl3lk0M0lj8ppK8k3Q0j09Q8m0
8191A2
$$ Imaginary data points
##PAGE= N=2
##DATA TABLE= (X++(I..I)), XYDATA
$$ plain form
0 0 0 0 0 0 0 0 0 0 0 0 0 0 0 0 0 0 0 0 0 0 0 0 0 0 0 0 0 0 0 0 0 0 0 0 0 0 0 0 1 -1 1 -1 1 -1 1 -1 2 -2 2 -1 1 -1 2 -2 4 -4 7 -11 23 -53
60 -53 -258 3014 715 -1879 222 2387 562 -1329 643 2403 584 -1014 635 2247 804 -644
76 -644 398 1753 854 -495 247 1463 729 -632 -258 1076 791 -776 -691 615 496 -959 -1071 346
94 346 283 -1170 -1365 77 196 -1135 -1482 -203 53 -1043 -1461 -417 155 -806 -1235 -343 409 -285 -1074
113 -1074 -330 761 207 -812 -153 1105 589 -637 -70 1412 906 -573 118 1605 1096 -446 88
130 88 1680 1016 -447 208 1554 977 -506 -35 1333 816 -608 -307 995 510 -756 -571 570 291
148 291 -984 -868 257 125 -979 -1139 -61 120 -1032 -1205 -202 36 -1023 -1259 -129 253 -841
165 -841 -1053 -34 328 -445 -816 101 508 -204 -502 185 725 143 -207 389 858 482 16 442 1017 758
$$ packed form
0@%%%%%%%%%%%%%%%%%%%%%%%%%%%%%%%%%%%%%%JkKkKkKkLmMlKkLmOqJ1j8L4p6
60e3k05L272k299k594K101K165j825j891J972J760j819j598J649J612j443j448
76f44J042J355q99j349P42J216p34j361L74J334k85j567Q5J306j19j455j12J417
94C46o3j453j95J442J19j331l47J279K56j096m18J044N72r61m29Q92P52o94p89
113a074P44J091n54j019O59J258n16j226N67J482n06j479O91J487n09j542N34
130H8J592o64j463O55J346n77j483M71J368n17j424L01J302m85j266J85J141k79
148B91j275J16J125j32j104j60J078J81j152j73J003K38j059k36J130L82j094
165h41k12J019L62p73l71R17M07p12k98O87N40n82l50N96M69l76m66M26N75k59
$$ plain form
185 758 47 346 989 843 -10 117 1018 828 -124 -64 825 668 -334 -368 566 524 -473 -618 338 264 -703
206 -703 -886 78 52 -938 -928 -20 35 -908 -1105 -174 37 -825 -994 -131 103 -652 -870 -33 227 -340 -741
227 -741 141 558 -148 -413 337 821 147 -234 474 866 413 -53 518 947 437 108 526 884 546 69
247 69 390 768 448 -10 232 558 247 -206 -117 352 205 -360 -422 83 24 -517 -567 -124 -130 -698 -800 -220 -87
270 -87 -682 -822 -290 -39 -603 -794 -263 12 -488 -712 -73 227 -247 -525 51 401 73 -251 212 647 182
291 182 -84 380 762 409 -4 433 892 451 157 438 905 492 53 395 778 321 -112 204 573 235
311 235 -239 -52 298 22 -342 -244 66 -170 -545 -445 -153 -235 -616 -594 -255 -352 -678 -643 -257 -239 -463 -518 -310
334 -310 -166 -349 -476 -86 60 -146 -279 43 301 50 -137 198 482 262 -11 251 633 408 102 403
$$ packed form
185G58p11K99O43j46q53J27R01j90r52O0Q89j57j002l4R34m2r97j45R56p4r67
206g03j83R64k6r90J0R08N5r43j97R31K11q62j69Q63K34p55k18Q37K60n67m01
227g41Q82M17p06k65P50M84o74l81P08L92m53m66N71M29n10l29M18L58l38m77
247F9L21L78l20m58K42L26l11m53Q9M69j47n65o2N05n9n41n0M43on68j02N80J33
270h7n95j40N32K51n64j91N31K75n00k24O39L00m74k78N76L50l28l24M63M35m65
291A82k66M64L82l53m13M37M59m41k94K81M67m13m39L42L83m57m33L16L69l38
311B35m74J87L50k76l64R8L10k36l75J00K92q2l81K2L39r7l26L5L86J8k24n5K08
334c10J44j83j27L90J46k06j33L22K58k51j87L35K84k20k73K62L82k25l06L01
$$ plain form
354 403 726 456 152 328 697 461 99 277 553 414 -74 86 466 265 -145 -86 197 52 -395 -224 35
375 35 -97 -545 -305 -113 -237 -596 -476 -191 -324 -630 -562 -185 -244 -526 -559 -128 -95 -412 -380 -4 98 -174
397 -174 -168 109 204 4 -10 303 403 234 166 342 450 370 216 420 562 488 289 373 468 387 202 216 424 354
421 354 48 69 294 173 -120 -109 135 56 -251 -308 -44 -103 -501 -457 -153 -227 -499 -512 -225 -291 -498 -515 -294 -121
445 -121 -419 -431 -129 -76 -273 -405 -17 104 -167 -182 197 273 -38 75 282 305 132 171 426 442 283 246 474
468 474 502 324 220 421 481 234 185 258 366 228 42 114 151 48 -47 -59 -21 -56 -201 -254 -118 -158 -360 -328 -310
493 -310 -266 -431 -506 -348 -239 -402 -357 -309 -217 -328 -355 -208 -84 -183 -269 -102 76 -37 -94 145 277 89 -52
516 -52 206 384 195 116 323 494 299 180 386 525 347 156 349 416 206 146 227 341 201 -3 73 256
$$ packed form
354D03L23k70l04J76L69k36l62J78K76j39m88J60L80k01m10N9K83j45m47J71K59
375C5j32m48K40J92j24l59J20K85j33l06O8L77n9k82l3M31L3l17L2L76J02k72
397a74OK77R5k00j4L13J00j69o8J76J08q0j54K04J42p4j99Q4R5q1j85J4K08p0
421C54l06K1K25j21k93J1K44p9l07n7K64n9l98M4L04p4k72j3K87o6k07j7K21J73
445a21k98j2L02N3j97j32L88J21k71j5L79P6l11J13K07K3j73L9K55J6j59l7K28
468D74K8j78j04K01O0k47m9P3J08j38j86P2L7j03r5j2L8l5j45n3J36m0k02L2J8
493c10M4j65p5J58J09j63M5M8R2j11k7J47J24r9q6J67J78j13n7K39J32j88j41
516e2K58J78j89p9K07J71j95j19K06J39j78j91J93O7k10o0Q1J14j40k04P6J83
$$ plain form
538 256 80 -149 -54 38 -89 -221 -185 -64 -241 -461 -339 -206 -385 -445 -333 -251 -247 -360 -443 -260 -229 -283 -293 -175
562 -175 -126 -216 -139 -79 60 -24 -55 78 202 182 171 190 266 259 202 264 425 358 268 358 462 307 297 279 330 284 147
589 147 215 296 161 49 85 156 39 -105 -93 51 -125 -225 -282 -205 -179 -394 -299 -191 -260 -431 -327 -262 -283 -351 -299
614 -299 -252 -190 -264 -241 -137 -79 -220 -142 -66 -19 -5 45 165 107 89 172 211 303 232 214 303 265 321 329 392 383 341 294 317 257
644 257 255 254 176 146 231 95 66 122 35 -31 -197 -59 -102 -175 -146 -166 -198 -319 -324 -291 -242 -345 -346 -257 -256 -362 -359 -269 -181 -227
674 -227 -198 -108 -30 -143 -122 -19 77 -37 20 175 179 80 132 192 243 222 221 259 336 267 197 296 282 292 189 257 260 157 135
703 135 214 118 117 16 16 91 -43 -124 -55 -126 -196 -216 -222 -258 -283 -283 -399 -261 -276 -338 -353 -274 -270 -294 -239 -230 -240 -222 -202 -135 -78
734 -78 -67 -53 40 27 68 20 77 261 137 100 260 365 270 240 295 317 237 205 325 316 282 220 218 268 178 118 185 177 91 58
$$ packed form
538B56j76k29R5R2j27j32L6J21j77k20J22J33j79o0J12Q2Mj13q3J83L1n4j0J18
562a75M9r0P7O0J39q4l1J33J24k0j1J9P6pn7O2J61o7r0R0J04j55j0j8N1m6j37
589A47O8Q1j35j12L6P1j17j44J2J44j76j00n7P7K6k15R5J08o9j71J04O5k1o8N2
614b99M7O2p4K3J04N8j41P8P6M7J4N0J20n8j8Q3L9R2p1j8Q9l8N6QO3rm2m7K3o0
644B57kjp8l0Q5j36k9N6q7o6j66J38m3p3K9k0l2j21nL3M9j03jQ9Jj06LR0Q8m6
674b27K9R0P8j13K1J03R6j14N7J55Mr9N2O0N1k1jL8P7o9p0R9j4J0j03O8Lj03k2
703A35P9r6jj01%P5j34q1O9p1p0k0ol6k5%j16J38j5o2j5P9Mk4N5Rj0J8K0O7N7
734g8J1J4R3j3M1m8N7J84j24l7J60J05r5l0N5K2q0l2J20rl4o2kN0r0o0O7qq6l3
$$ plain form
764 58 105 15 -75 -124 -130 -80 -233 -213 -175 -202 -232 -241 -341 -227 -270 -260 -303 -277 -266 -329 -190 -289 -161 -205 -152 -86 -84 -86 -59 31
794 31 -7 57 88 88 180 154 174 195 235 222 242 319 312 257 127 271 258 305 204 162 241 235 102 149 124 117 28 1 -20 -47 -131
825 -131 -138 -126 -192 -251 -266 -200 -271 -307 -344 -249 -226 -377 -290 -162 -162 -246 -193 -149 -159 -131 -135 -85 -61 -91 -26 14 23 50 105 164 118
856 118 135 199 238 267 205 301 276 333 237 218 263 292 268 281 239 117 218 142 73 41 113 25 15 16 -131 -104 -166 -146 -190
885 -190 -215 -222 -200 -204 -273 -264 -240 -256 -196 -263 -196 -224 -243 -275 -189 -148 -141 -118 -57 19 -36 -6 -8 84 102 124 179 188 199 172 260 303 272
918 272 178 311 316 206 266 305 235 217 160 229 144 101 104 96 97 21 17 -6 -23 -93 -106 -84 -165 -125 -189 -215 -155 -227 -259 -262 -291 -226
950 -226 -267 -240 -231 -257 -223 -140 -106 -123 -94 -39 -53 -54 -16 -46 -13 94 122 153 224 189 244 183 204 262 207 239 275 282 230 266 181
981 181 244 205 173 178 175 153 37 139 65 17 -74 -90 5 -110 -127 -84 -157 -155 -232 -206 -209 -310 -230 -224 -214 -213 -271 -177 -222 -224 -200 -132
$$ packed form
764E8M7r0r0m9oN0j53K0L8k7l0rj00J14m3J0m3K6J1o3J39r9J28m4N3O6KkK7R0
794C1l8O4L1%R2k6K0K1M0j3K0P7pn5j30J44j3M7j01m2P9oj33M7k5pq9k7k1k7q4
825a31pJ2o6n9j5O6p1l6l7R5K3j51Q7J28%q4N3M4j0K8mN0K4l0O5M0RK7N5N9m6
856A18J7O4L9K9o2R6k5N7r6j9M5K9k4J3m2j22J01p6o9l2P2q8j0Jj47K7o2K0m4
885a90k5pK2mo9RK4j6O0o7O7k8j9l2Q6M1PK3O1P6n5L0kR2J8K2N5RJ1k7Q8M3l1
918B72r4J33Nj10O0L9p0j8n7O9q5m3LqJp6mk3j7p0j3K2q1M0o4k6O0p2l2lk9O5
950b26m1K7Rk6L4Q3L4j7K9N5j4jL8l0L3J07K8L1P1l5N5o1K1N8n5L2L6Pn2L6q5
981A81O3l9l2Nlk2j16J02p4m8r1j6R5j15j7M3p3Kp7K6lj01Q0OJ0Jn8R4m5kK4O8
$$ plain form
1013 -132 -83 -128 -89 -40 -76 36 23 78 65 48 161 121 182 195 214 230 219 212 233 267 273 214 207 240 198 165 217 248 94 94
1043 94 155 112 100 29 22 -53 -70 -62 -127 -156 -249 -129 -164 -210 -231 -227 -198 -243 -284 -157 -249 -271 -216 -197 -201 -216 -118 -58 -72 -56 -51 -66
1075 -66 -33 -6 46 7 30 178 118 125 191 175 173 204 169 261 350 222 263 150 205 186 142 183 124 133 118 94 106 41 1 28
1105 28 -50 -98 -76 -111 -119 -180 -174 -126 -178 -230 -243 -149 -252 -221 -289 -178 -216 -145 -153 -154 -143 -110 -133 -45 -18 -66 2 31 43 58 105
1136 105 166 162 133 110 185 170 134 253 153 171 199 239 177 155 136 142 149 121 137 111 110 111 71 6 -15 -56 -48 -65 -83 -204 -116
1167 -116 -194 -219 -229 -171 -219 -232 -244 -228 -174 -206 -175 -211 -194 -187 -172 -130 -100 -35 -83 -14 54 -31 21 70 99 65 149 163 126 118 264
1198 264 217 186 221 205 214 181 206 172 186 171 168 164 157 140 132 97 52 36 -74 14 -124 -70 -88 -94 -137 -220 -126 -156 -173 -211 -181 -176
1230 -176 -254 -233 -203 -179 -212 -127 -154 -135 -112 -109 -109 -123 -32 33 -9 80 41 12 25 152 157 157 116 190 214 178 183 186 227 238 146 145 161
$$ packed form
1013a32M9m5L9M9l6J12j3N5j3j7J13m0O1J3J9J6j1pK1L4On9pL3m2l3N2L1j54%
1043I4O1m3j2p1pp5j7Qo5k9r3J20l5m6k1MK9m5m1J27r2k2N5J9mj5R8O0j4J6Nj5
1075f6L3K7N2l9K3J48o0PO6j6kL1l5R2Q9j28M1j13N5j9m4M1n9Rj5k4J2o5m0K7
1105B8p8m8K2l5qo1OM8n2n2j3R4j03L1o8J11l8P1qjJ1L3k3Q8K7m8O8K9J2J5M7
1136A05O1mk9k3P5j5l6J19j00J8K8M0o2k2j9OPk8J6k6jJm0o5k1m1Qj7j8j21Q8
1167a16p8k5j0N8m8j3j2J6N4l2L1l6J7PJ5M2L0O5m8O9O8q5N2M9K9l4Q4J4l7qJ46
1198B64m7l1L5j6Rl3K5l4J4j5lmpj7ql5m5j6j10Q8j38N4j8om3q3R4l0j7l8L0N
1230a76p8K1L0K4l3Q5k7J9K3L%j4R1O5m2Q9l9k9J3J27N%m1P4K4l6NLM1J1r2jJ6
$$ plain form
1263 161 131 85 149 160 50 86 66 3 88 119 -71 -61 -30 -54 -138 -101 -57 -136 -182 -165 -188 -147 -186 -146 -167 -215 -129 -130 -163
1292 -163 -161 -80 -118 -91 -82 -108 -42 -58 20 25 76 75 4 96 112 82 150 227 185 156 148 172 216 151 160 130 158 173 122 146 107 109 95
1325 95 94 19 29 3 6 -47 -54 -8 -2 -168 -74 -96 -163 -137 -228 -206 -160 -180 -180 -232 -192 -221 -174 -128 -149 -164 -121 -79 -102 -95 12 3 -31
1358 -31 5 99 115 62 158 126 108 143 166 162 134 164 190 217 140 188 109 194 180 143 130 125 140 42 -25 53 28 0 1 -36 -21 -67
1390 -67 -113 -125 -151 -160 -182 -212 -174 -229 -165 -207 -166 -164 -153 -206 -166 -133 -113 -65 -99 -41 -53 -17 60 -28 60 29 49 30 98 116 130
1421 130 109 157 144 138 212 203 206 195 204 249 151 190 126 75 41 88 75 66 68 14 5 -77 -35 -61 -78 -54 -110 -134 -92 -140 -140 -185 -108 -158
1455 -158 -198 -198 -195 -143 -151 -137 -160 -168 -101 -66 -114 -70 -89 -72 -13 13 16 25 39 85 40 116 125 162 182 133 190 176 209 226 175 123 153
1488 153 159 144 101 80 85 57 65 2 -26 -32 -45 -34 -67 -106 -98 -127 -142 -200 -45 -118 -166 -173 -173 -149 -165 -153 -188 -138 -163 -75 -54 -112 -156
$$ packed form
1263A61l0m6O4J1j10L6k0o3Q5L1j90J0L1k4q4L7M4p9m6J7k3M1l9M0k1m8Q6jl3
1292a63KQ1l8K7Rk6O6j6P8NN1jp1R2J6l0O8P7m2k9qK4M4o5Rl0K8J5n1K4l9Kj4
1325I5jp5J0k6Ln3pM6Oj66R4k2o7K6r1K2M6k0%n2M0k9M7M6k1j5M3M2k3PJ07rl4
1358c1L6R4J6n3R6l2j8L5K3mk8L0K6K7p7M8p9Q5j4l7j3nJ5r8o7P8k5k8Jl7J5m6
1390f7m6j2k6rk2l0L8n5O4m2M1KJ1n3M0L3K0M8l4N8j2L6P7q8Q8l1K0j9O8J8J4
1421A30k1M8j3oP4rLj1RM5r8L9o4n1l4M7j3rKn4rq2M2k6j7K4n6k4M2m8%m5P7n0
1455a58m0%LN2qJ4k3qO7L5m8M4j9J7N9K6LRJ4M6m5P6RL7K0m9N7j4L3J7n1n2L0
1488A53Oj5m3k1Nk8Qo3k8oj3J1l3l9Qk9j5n8J55p3m8p%K4j6J2l5N0k5Q8K1n8m4
$$ plain form
1521 -156 -93 -84 -31 -33 -11 -74 7 83 21 98 174 170 86 141 181 137 188 162 147 156 136 169 121 148 155 137 68 116 61 153 48 42
1553 42 64 3 -20 -21 -51 -10 -96 -65 -79 -142 -108 -94 -113 -122 -132 -141 -157 -196 -184 -99 -122 -98 -183 -114 -73 -144 -92 -32 -43 -19 32 0
1585 0 39 51 92 92 108 89 71 146 150 197 146 256 155 138 183 131 82 152 99 132 137 76 32 26 9 -6 -20 19 -15 -111 10
1616 10 -124 -79 -131 -144 -145 -139 -147 -150 -123 -126 -126 -87 -159 -143 -85 -120 -79 -157 -89 -58 -47 -11 2 12 42 47 24 45 91 63 68 69 111 163
1650 163 127 162 131 139 163 154 133 145 160 210 162 119 208 98 57 9 26 -26 -23 -50 -58 -40 -66 -103 -128 -102 -128 -157 -147 -169 -159
1681 -159 -203 -157 -119 -114 -90 -117 -29 -96 -72 -120 -50 -53 -103 -57 5 59 66 -14 4 77 85 78 120 126 107 128 133 169 128 157 128 174 171 88
1715 88 52 111 54 99 65 34 0 51 25 4 -42 -68 -3 -68 -174 -60 -128 -168 -206 -123 -119 -108 -148 -124 -134 -118 -81 -113 -119 -71
1745 -71 -80 -104 -55 -123 -14 -8 -46 18 35 20 43 14 69 170 70 111 157 174 157 55 145 117 190 160 169 169 159 107 98 72 25
$$ packed form
1521a56O3RN3kK2o3Q1P6o2P7P6mq4N5M0m4N1k6j5Rk0L3m8K7Pj8o9M8n5R2j05o
1553D2K2o1k3jl0M1q6L1j4o3L4J4j9rj0rj6l9J2Q5k3K4q5O9M1p1N2O0j1K4N1l2
1585@L9J2M1%J6j9j8P5MM7n1J10j01j7M5n2m9P0n3L3No1m4oj7j5j4L9l4r6J21
1616A0j34M5n2j3jOqlK7l%L9p2J6N8l5M1p8O8L1J1L6J3J0L0Nk3K1M6k8NJM2N2
1650A63l6L5l1QK4rk1J2J5N0m8m3Q9j10m1m8J7n2Lk7qJ8k6l7k5K6k6k9J0k2J0
1681a59m4M6L8NK4k7Q8o7K4m8P0ln0M6O2N4Pq0J8P3QpM2Oj9K1NL6m1K9k9M6lq3
1715H8l6N9n7M5l4l1l4N1k6k1m6k6O5o5j06J14o8m0l8Q3MJ1m0K4j0J6L7l2oM8
1745g1rk4M9o8J09Ol8O4J7j5K3k9N5J01j00M1M6J7j7j02R0k8P3l0R%j0n2rk6m7
$$ plain form
1776 25 51 27 -17 77 -19 -4 5 -76 -43 -89 -96 -100 -121 -100 -106 -131 -128 -136 -181 -161 -123 -147 -91 -154 -157 -100 -156 -88 -78 -23 -12 -31 -110 -30
1810 -30 31 17 -9 100 43 74 91 -8 135 106 146 144 104 177 143 94 104 110 97 47 90 86 41 11 8 -19 6 5 -58 15 -50 -92
1842 -92 -83 -78 -78 -76 -105 -119 -78 -122 -171 -141 -87 -147 -96 -155 -66 -127 -93 -99 -96 -105 58 -6 -24 -10 3 117 33 112 73 60 85 81 138
1875 138 131 197 170 113 115 105 116 113 69 139 143 90 113 101 49 -21 -32 14 52 -52 -22 -63 -50 -101 -145 -124 -88 -171 -152 -88 -104
1906 -104 -105 -143 -111 -104 -131 -84 -32 -66 -98 -94 -111 -47 -64 46 9 46 13 -5 97 24 140 96 104 95 41 141 149 146 91 149 148 104
1938 104 121 122 117 83 110 72 103 93 95 -21 -10 36 -64 -38 -16 -53 -105 -136 -39 -41 -108 -121 -98 -136 -172 -148 -100 -155 -139 -113 -132
1969 -132 -31 -128 6 -130 -52 -17 -24 -26 41 4 38 75 -12 82 73 37 85 166 71 156 111 88 134 107 160 141 97 147 107 103
1999 103 63 80 72 38 65 -12 -21 -61 -19 -10 7 -131 -110 -109 -50 -115 -120 -127 -154 -123 -123 -124 -136 -119 -107 -70 -130 -78 -71 -22 -89 -40 -17 38
$$ packed form
1776B5K6k4m4R4r6J5Rq1L3m6pmk1K1ok5Lqm5K0L8k4N6o3lN7n6O8J0N5J1j9p9Q0
1810c0O1j4k6J09n7L1J7r9J43k9M0km0P3l4m9J0Oj3n0M3mm5l0lk7K5jo3P3o5m2
1842i2RN%Kk9j4M1m4m9L0N4o0N1n9Q9o1L4oLrJ63o4j8J4J3J14q4P9l9j3K5mN7
1875A38pO6k7n7Kj0J1lm4P0Mn3K3j2n2p0j1M6L8j04L0m1J3n1m4K1L6q3J9O4j6
1906a04jl8L2Pk7M7N2l4l2Mj7O4j7J10l7L7l3j8J02p3J16m4Qrn4J00Qln5N8jm4
1938A04J7Jnl4K7l8L1j0Kj16J1M6j00K6K2l7n2l1R7ko7j3K3l8l6K4M8n5J6K6j9
1969a32J01r7J34j36P8L5pkO7l7L4L7q7R4rl6M8Q1r5Q5m5k3M6k7N3j9m4N0m0m
1999A03m0J7ql4K7p7rm0M2RJ7j38K1JN9o5npk7L1%jj2J7J2L7o0N2PM9o7M9K3N5
$$ plain form
2033 38 15 25 12 58 22 42 32 56 49 101 71 117 137 127 99 159 104 53 100 148 85 67 94 57 69 26 91 0 35 7 22
2064 22 -66 -44 -81 -161 -70 -120 -106 -99 -109 -105 -144 -187 -139 -139 -123 -133 -114 -86 -132 -22 -88 -61 -37 -7 -110 -21 -35 51 76 30 42
2095 42 74 61 169 128 47 141 105 116 95 104 118 145 77 105 110 77 48 48 107 84 105 69 18 19 -44 -43 -14 0 -57 -124 -116 -72 -36
2128 -36 -102 -109 -176 -130 -67 -132 -112 -104 -126 -116 -110 -104 -72 -84 1 -76 -64 6 -59 -34 53 78 46 52 35 64 116 90 111 87 98 123 125
2161 125 137 165 79 142 114 98 117 45 109 74 2 81 29 15 33 -19 -11 -13 -95 -103 -73 -114 -118 -100 -118 -112 -85 -141 -116 -101 -134 -37
2193 -37 -96 -143 -11 -70 -84 -54 -28 -90 -15 -37 37 18 44 75 27 44 93 82 95 112 103 128 85 74 102 39 145 92 42 100
2223 100 67 78 142 85 55 23 10 87 17 43 -52 -17 -73 -56 -37 -44 -66 -70 -44 -113 -126 -103 -123 -150 -139 -88 -89 -143 -73 -89 -61
2254 -61 -77 -118 -34 -18 -26 -28 20 45 16 -32 68 43 42 34 44 108 29 96 148 53 92 105 100 113 86 87 75 48 23 97 14 41 31
$$ packed form
2033C8k3J0j3M6l6K0j0K4pN2l0M6K0j0k8O0n5n1M7M8o3j8K7l7J2m3O5r1L5k8J5
2064B2q8K2l7q0R1n0J4Pj0Ml9m3M8%J6j0J9K8m6J10o6K7K4L0j03Q9j4Q6K5m6J2
2095D2L2j3J08m1q1R4l6J1k1RJ4K7o8K8Nl3k9%N9k3K1l6n1Jo3JK9J4n7o7QM4L6
2128c6o6po7M6O3o5K0Qk2J0OOL2j2Q5p7J2P0o5K5Q7K5l2Oj7K9N2k6K1k4J1K5K
2161A25J2K8q6O3k8j6J9p2O4l5p2P9n2j4J8n2Qkq2qL0m1mJ8j8OK7n6K5J5l3R7
2193c7n9m7J32n9j4L0K6o2P5k2P4j9K6L1m8J7M9j1J3J7rK5m3j1K8o3J06n3n0N8
2223A00l3J1O4n7l0l2j3P7p0K6r5L5n6J7J9pk2mK6o9j3K3k0k7J1N1jn4P0j6K8
2254f1j6m1Q4J6qkM8K5k9m8J00k5jqJ0O4p9O7N2r5L9J3nJ3k7Jj2k7k5P4q3K7j0
$$ plain form
2287 31 57 -58 -21 -32 -49 -31 -72 -75 -67 -46 -74 -88 -87 -78 -97 -76 -65 -89 -51 -78 -91 -101 -124 -123 -32 -35 5 -57 -26 -13 2 30 20
2320 20 61 34 119 67 57 55 88 126 20 134 143 129 56 75 69 144 113 21 53 93 71 31 66 11 4 -68 -16 1 10 -97 -43
2351 -43 -121 -95 -63 -78 -97 -87 -85 -93 -56 -168 -55 -71 -135 -102 -33 -73 -60 -87 -12 -30 1 -70 76 43 -9 0 20 43 88 50
2381 50 67 115 119 74 61 20 104 122 77 52 73 63 97 99 54 64 -11 0 15 -82 15 15 -9 -16 -114 -70 -60 -114 -102 -79 -119 -89
2413 -89 -42 -106 -72 -91 -116 -88 -91 -68 -54 -32 -112 -21 -19 -35 -13 -57 7 92 71 99 24 11 58 61 33 100 83 28 69 82 176 87
2445 87 55 40 90 107 51 62 59 75 26 8 -77 1 -49 -37 -48 -44 14 -83 -60 -22 -90 -55 -119 -79 -31 -77 -85 -55 -72 -32 -102 -113
2477 -113 -73 -87 -45 -32 -111 -40 -59 -62 -31 18 49 58 9 18 45 52 69 84 73 92 125 -35 70 91 142 26 62 85 92 68 34
2508 34 77 -8 -15 -26 29 -52 -20 -13 5 -14 -70 -49 -38 -72 -81 -114 -89 -16 -55 -66 -96 -46 -80 -85 -48 -93 -124 -11 -46 14 34 -87
$$ packed form
2287C1K6j15L7j1j7J8m1lQK1k8j4JRj9K1J1k4L8k7j3j0k3JR1lM0o2L1J3J5K8j0
2320B0M1k7Q5n2j0kL3L8j06J14Rj4p3J9oP5l1r2L2M0k2m0L5n5pp2N2J7Rj07N4
2351d3p8K6L2j5j9J0KqL7j12J13j6o4L3O9m0J3k7P5j8L1p1J46l3n2RK0K3M5l8
2381E0J7M8Mm5j3m1Q4J8m5k5K1j0L4Km5J0p5J1J5r7R7%k4pr8M4J0n4J2K3m0L0
2413h9M7o4L4j9k5K8lK3J4K2q0R1Kj6K2m4O4Q5k1K8p5j3M7Lk8O7j7n5M1J3R4q9
2445H7l2j5N0J7n6J1lJ6m9j8q5P8n0J2j1MN8r7K3L8o8L5o4M0M8m6qL0j7M0p0j1
2477a13M0j4M2J3p9P1j9lL1M9L1Rm9RK7PJ7J5j1J9L3j60J05K1N1j16L6K3Pk4l4
2508C4M3q5pj1N5q1L2PJ8j9n6K1J1l4rl3K5P3l9j1l0N0l4nL7m5l1J13l5O0K0j21
$$ plain form
2540 -87 -35 -25 2 -71 54 38 7 45 107 68 131 -4 118 72 33 135 108 63 92 85 57 80 21 20 83 65 60 18 13 -41
2570 -41 -25 -24 3 -31 -53 -61 -69 -54 -68 -101 -34 -82 -99 -50 -90 -33 -86 18 -77 -48 -92 -55 -54 -23 24 -44 -28 30 24 23 70 2 34
2603 34 42 16 16 77 79 73 80 93 53 83 89 106 34 2 95 126 80 41 32 24 3 -7 34 14 -41 -68 -72 -52 11 -17 -38 -118 -72 -90 -110
2638 -110 -61 -77 -31 -92 -121 -111 -81 -79 -44 -68 -49 -72 -38 36 -35 -36 -26 11 60 31 90 108 58 17 42 83 118 37 55 104 68
2669 68 53 98 102 -15 93 82 16 32 88 22 59 50 0 -16 -6 -33 -58 -78 -90 -63 -108 -96 -36 -88 -125 -62 -52 -52 -59 -92 -72
2700 -72 -58 -74 -30 -34 50 -1 10 -34 -23 -31 22 46 -1 -3 -1 -6 27 52 62 36 84 43 53 47 47 88 53 102 105 112 65 91 125 36 112
2735 112 28 9 1 -4 -41 -1 36 12 -3 -62 -25 -76 -35 1 -38 -61 -90 -100 -89 -117 -121 -40 -67 -76 -74 -29 -88 -32 30 19 27 -43 -46
2768 -46 -22 37 10 24 56 20 110 83 34 75 46 60 72 94 11 29 20 81 64 15 1 38 28 4 -22 30 -44 -53 -12 39 -14
$$ packed form
2540h7N2J0K7p3J25j6l1L8O2l9O3j35J22m6l9J02k7m5K9pk8K3n9jO3j8nm2nn4
2570d1J6JK7l4k2qqJ5j4l3O7m8j7M9m0N7n3J04r5K9m4L7JL1M7o8J6N8ojM7o8L2
2603C4Qk6%O1KoPJ3m0L0OJ7p2l2R3L1m6l9rqk1j0M1k0n5k7mK0O3k8k1q0M6j8k0
2638a10M9j6M6o1k9J0L0KL5k4J9k3L4P4p1jJ0L7M9k9N9J8n0m1K5M1L5q1J8M9l6
2669F8j5M5Mj17J08j1o6J6N6o6L7rn0j6J0k7k5k0j2K7m5J2O0n2l7O3J0%pl3K0
2700g2J4j6M4mQ4n1J1m4J1qN3K4m7kKnL3K5J0k6M8m1J0o%M1l5M9LPm7K6L4q9P6
2735A12q4j9qnl7M0L7k4j5n9L7n1M1L6l9k3k9j0J1k8mQ1k7rKM5n9N6O2j1Qp0l
2768d6K4N9k7J4L2l6R0k7m9M1k9J4J2K2q3J8rO1j7m9j4L7j0k4k6N2p4rM1N1n3
$$ plain form
2799 -14 53 -5 12 -80 -52 -29 -41 -104 -73 -70 -55 -54 -157 -43 -55 -33 -33 -77 -50 -55 -64 -3 -37 4 11 16 28 30 29 45 -28 97 45
2832 45 55 27 51 56 64 12 135 41 13 105 58 16 99 28 108 58 64 51 16 49 28 21 5 -64 -43 -7 -52 -81 -76 -33 -68 -56
2864 -56 -78 -13 -48 -79 -122 -76 -75 -70 -111 -78 -41 -52 -41 -41 -35 -20 39 37 6 11 -25 24 79 57 20 -1 58 57 46 46 39 65 68 45 52 51
2900 51 78 85 63 75 89 -23 13 -16 -7 7 -54 -52 -90 28 -17 -88 -31 -48 -88 -64 -72 -34 -50 -87 -97 -39 -60 -11 -110 -32 -35 -89
2932 -89 19 -62 -28 57 -37 27 82 63 34 -17 90 -19 36 67 50 18 33 45 122 25 66 57 55 79 72 112 98 21 -11 88
2962 88 -15 15 11 32 -33 -16 -24 10 3 -42 -42 -60 -50 -41 6 -60 -66 -48 -45 -123 -18 -37 -87 -12 -80 -62 -8 1 -18 -16 30 0 36 31
2996 31 81 70 55 27 52 66 34 58 46 44 31 59 60 113 86 38 71 54 70 -16 98 42 -1 -6 -30 34 -12 -63 -37 -6 -21
3027 -21 3 -16 -7 -85 -49 -43 -12 -9 -59 -50 -97 -72 -71 -31 -65 10 36 -20 -130 15 -61 -23 -11 53 -8 4 15 67 38 51 59 31
$$ packed form
2799a4O7n8J7r2K8K3j2o3L1LJ5Jj03J14j2K2%m4K7nrO1l4M1PNJ2KjJ6p3J25n2
2832D5J0k8K4NQn2J23r4k8R2m7m2Q3p1Q0n0Oj3l5L3k1pj6o9K1L6m5k9NM3l5J2
2864e6k2O5l5l1m3M6JNm1L3L7j1J1%OJ5N9kl1Nl6M9N5k2l7k1N9jj1%pK6Lk3Pj
2900E1K7Pk2J2J4j12L6k9RJ4o1Kl8J18m5p1N7j7m0K4qL8j6l7j0N8k1M9r9P8ln4
2932h9J08q1L4Q5r4O4N5j9k9n1J07j09N5L1j7l2J5J2P7r7M1rkK4pM0j4p7l2R9
2962H8j03L0mK1o5J7qL4pm5%j8J0RM7o6oJ8Lp8J05j9n0P5o8J8N4Rj9KM6l0L6n
2996C1N0j1j5k8K5J4l2K4j2kj3K8JN3k7m8L3j7J6q6J14n6m3nk4O4m6n1K6L1j5
3027b1K4j9Rp8L6OL1Ln0Rm7K5JM0l4P5K6n6j10J45p6L8J2O4o1J2J1N2k9J3Qk8
$$ plain form
3059 31 37 136 86 80 0 41 124 56 85 11 3 68 51 -8 55 28 24 42 -53 2 23 8 -58 -49 -57 -92 -40 -39 -46 -82 -93 -51 -59 -76 -43
3094 -43 -106 -60 -65 -80 31 4 -41 -31 54 -5 -28 8 15 -26 19 31 -6 51 48 67 67 31 97 24 79 107 47 78 26 41 64 51
3126 51 92 28 23 44 -22 57 -10 -16 2 3 -35 -11 -80 -38 -46 -11 -21 -38 -69 -56 -74 -71 -46 -56 -40 -17 -54 -1 -55 -23 1 -44 13
3159 13 -9 41 67 -2 3 26 79 67 -37 69 37 44 56 96 52 42 24 -17 130 102 91 66 27 40 37 15 -27 39 -1 -41
3189 -41 -5 33 -37 -45 -51 29 -6 -64 -44 -54 -52 -55 -21 -54 -94 -44 -57 -32 -29 -27 -13 -60 -92 -55 4 25 -8 -23 -11 -1 46 -21 75
3222 75 15 10 1 117 58 33 59 33 71 -28 50 17 75 19 60 -11 96 -25 30 -2 25 23 57 -24 -3 -11 -45 4 -53 10 -45
3253 -45 -93 -10 41 -88 -74 -77 -57 -73 -42 -60 -154 -45 45 -75 14 -20 -98 -48 -23 27 -36 13 -9 33 29 73 66 7 49 47 27
3284 27 32 60 87 32 75 7 65 68 66 16 65 47 -8 -36 66 12 46 -3 -27 17 -61 28 -23 30 23 -17 -61 -81 -51 -59 -76 -99
$$ packed form
3059C1OR9n0oq0M1Q3o8K9p4qO5j7n9O3k7mJ8r5N5K1j5o6Rql5N2Jpl6j1M2qj7L3
3094d3o3M6nj5J11k7m5J0Q5n9k3L6Pm1M5J2l7N7lJ9%l6O6p3N5K8o0L1n2J5K3j3
3126E1M1o4nK1o6P9o7oJ8Jl8K4o9M2qL5j0j7l1J3j8LK5j0J6K3l7N3n4L2K4m5N7
3159A3k2N0K6o9NK3N3j2j04J06l2PJ2M0m4j0j8m1J47k8j1k5l9J3lk2m2O6m0m0
3189d1L6L8p0qoQ0l5n8K0j0KlL4l3m0N0j3K5LKJ4m7l2L7N9K1l3j5J2J0M7o7R6
3222G5o0nrJ16n9k5K6k6L8r9P8l3N8n6M1p1J07j21N5l2K7kL4q1K1ql4M9n7O3n5
3253d5m8Q3N1j29J4lK0j6L1j8r4J09R0j20Q9l4p8N0K5N0o3M9k2M2mM4pn9M2kk0
3284B7NK8K7n5M3o8N8Lkn0M9j8n5k8J02n4L4m9k4M4p8Q9n1N3pm0m4k0L0qj7k3
$$ plain form
3316 -99 -43 -14 -83 -50 -38 -31 -94 -45 -71 -49 -54 -39 26 -16 -11 -41 -11 42 6 51 10 52 32 33 -13 63 70 39 68 20 58 43 3
3349 3 23 95 68 28 -9 61 42 3 62 17 10 -13 13 -80 -37 -21 -17 -48 -46 -40 -69 -61 -42 -52 -68 -82 -109 -13 -92 19 -98 1
3381 1 66 -100 -32 11 -6 36 -4 -15 44 -15 21 49 29 27 26 2 68 78 68 57 35 71 -36 45 65 27 82 36 69 88 66
3412 66 83 -52 -55 36 -41 78 -3 -29 13 11 17 -14 -69 -63 -5 -10 -55 -96 -30 -8 -88 -84 -34 5 20 -60 4 -15 -30 -112 3 2
3444 2 -92 1 -24 19 1 47 88 17 34 72 43 90 80 123 57 124 -48 -14 51 83 23 -34 -6 -7 43 16 5 12 41 52 3
3475 3 -50 -13 33 -65 -35 -28 -5 -52 -39 -36 -41 -19 -35 3 -54 -50 -23 -87 -50 -46 -35 18 -45 -1 9 -36 2 10 79 42 21 3 44 35
3509 35 45 82 62 129 29 42 121 92 40 60 55 30 23 -4 63 27 63 40 25 -7 52 -21 -24 -30 -58 -26 13 20 -46 -82 -100 -37
3541 -37 -82 -81 12 -60 -42 -34 -34 -22 -54 -17 21 -16 -51 -13 -34 -77 -3 -23 -39 -51 -6 50 16 59 0 -47 27 69 8 47 48 74
$$ packed form
3316i9N6K9o9L3J2Po3M9k6K2nJ5O5m2Nl0L0N3l6M5m1M2k0Jm6P6Pl1K9m8L8j5m0
3349CK0P2k7m0l7P0j9l9N9m5pk3K6r3M3J6Ml1KOk9QJ9j0j6j4k7R6p9J11j17R9
3381AO5j66O8M3j7M2m0j1N9n9L6K8k0kjk4O6J0j0j1k2L6j07Q1K0l8N5m6L3J9k2
3412F6J7j35lR1p7J19q1k6M2kOl1n5ON8nm5m1O6K2q0MN0L9J5q0O4j9j5q2J15j
3444Br4R3k5M3j8M6M1p1J7L8k9M7j0M3o6O7j72L4O5L2o0n7K8jN0k7j1PK9J1m9
3475Cn3L7M6r8L0PK3m7J3LnK2j6L8n7MK7o4L7MJ1N3o3M4J0m5L8QO9l7k1j8M1r
3509C5J0L7k0O7j00J3P9k9n2K0nk5pk7O7l6L6k3j5l2N9p3lok8L2L9Po6l6j8O3
3541c7m5JR3p2J8Q%J2l2L7L8l7l5L8k1m3P4k0j6j2M5N6l4M3n9m7P4M2o1L9JK6
$$ plain form
3573 74 73 5 55 55 0 25 49 29 -32 3 62 -31 -23 -23 -38 -59 4 -34 3 -18 17 -34 -107 -41 -53 -28 -36 -25 -85 -8 -88 -62 -74
3606 -74 18 -26 -14 -14 -11 -32 -32 3 -12 32 42 75 -24 14 41 71 -6 20 49 50 61 31 37 38 68 66 83 12 10 69 -8 6 18 -26
3640 -26 -26 -52 -9 -2 -11 -9 38 -4 8 -56 13 -58 -45 -53 -88 -50 -75 -11 -26 -28 -33 7 -21 -41 50 -38 -47 -18 -36 -29 -35 -32 -53 -10 40 -20
3676 -20 102 41 -1 32 61 -2 32 11 5 66 34 43 39 13 61 65 34 -16 -22 -33 78 16 17 -12 6 9 -76 35 5 -1 -46 -46 -94
3709 -94 -54 -48 -48 3 -58 -117 -42 -10 -27 -51 -26 -50 1 -55 -40 -6 7 34 40 69 21 17 8 -9 54 53 30 18 71 54 32 -8 44
3742 44 68 -13 22 8 -30 43 -23 -79 9 101 3 -2 -21 11 -30 -74 -79 -81 -23 -14 -23 -8 -17 -119 -49 -64 -12 -57 -45 -26 -70 -70 -73 -40
3776 -40 -41 19 37 -22 -17 -27 10 92 -32 -11 -13 50 34 109 76 30 2 24 28 72 74 46 23 26 70 53 25 17 3 52 42 0 52
3809 52 38 18 -13 9 19 -29 73 -2 -21 -95 -33 11 -12 -82 -90 -33 -92 -65 -22 -70 -34 -15 9 -52 -64 -56 -50 24 -8 -8 -45 23
$$ packed form
3573G4jo8N0%n5K5K4k0o1L5N9r3Q%j5k1O3l8L7k1L5n1p3O6j2K5qJ1o0P7q0K6j2
3606g4R2m4J2%Lk1%L5j5M4J0L3r9L8K7L0p7K6K9JJ1l0OJL0kJ7p1kN9p7J4J2m4
3640b6%k6M3PrKM7m2J2o4O9p1J3ql5L8k5O4j5knM0k8k0R1q8rK9j8PoLk1M3N0o0
3676b0J22o1m2L3K9o3L4k1oO1l2Rmk6M8Ml1n0oj1J11o2Jk9J8Lq5J11l0om5%m8
3709i4M0O%N1o1n9P5L2j7k4K5k4N1n6J5L4J3K7OK9m8mrj7O3jk3j2N3j7k2m0N2
3742D4K4q1L5j4l8P3o6n6Q8R2r8nj9L2m1m4nkN8RrJ5rj02P0j5N2m5J2J9m4%lL3
3776d0jO0J8n9Nj0L7Q2j24K1kO3j6P5l3m6k8K2MM4Kk8k3LM4j7k8qj4M9j0m2N2
3809E2j4k0l1K2J0m8J02p5j9p4O2M4k3p0qN7n9K7M3m8L6J9K4o1j2QOP4l2%l7O8
$$ plain form
3841 23 45 -12 64 32 35 15 23 14 -14 28 -4 15 -47 84 81 125 55 13 19 41 6 -4 33 -37 -64 -25 -43 -32 -33 -47 16 -27 7
3874 7 -49 -60 -50 -3 -56 -25 -31 -20 -85 -24 -38 -12 -23 0 -56 -36 -24 -20 -26 -2 -3 3 54 -24 13 11 33 63 40 28 28 47 42 80 53
3909 53 70 74 80 49 -23 36 -12 79 85 65 60 -20 -5 28 49 12 15 7 -33 -15 18 -3 9 -42 -64 19 -135 -51 -36 -32 -47 -73 13
3942 13 -36 -76 -3 17 33 45 -8 9 -14 6 7 76 68 9 54 2 -43 25 3 57 71 110 53 20 -24 11 65 55 32 88 69
3973 69 64 -5 -3 44 -14 24 23 -37 48 7 -35 -39 26 -37 -17 -33 -45 -38 -23 -11 -85 -64 -89 -62 -37 -21 -64 -31 -60 6 -72 25 -30
4006 -30 -19 -24 -18 68 95 32 5 -1 10 3 78 22 54 44 -26 -20 14 107 -11 50 107 43 89 37 0 47 30 -5 53 -29 -59 -60 -15
4039 -15 -12 -57 28 -1 29 24 -33 -53 -25 -78 -88 -11 21 14 -30 -113 -15 -19 19 -78 -38 -35 -73 17 7 69 -7 -12 -11 42 15 105 29 30
4073 30 33 25 44 29 22 14 37 14 36 10 19 37 64 47 91 21 76 18 5 53 -26 -56 -39 -44 -9 -7 9 -50 -93 -57 -20 -40 -39 -16
$$ packed form
3841B3K2n7P6l2Lk0Qrk8M2l2J9o2J31lM4p0m2OK2l5j0L7p0k7L9j8J1jj4O3m3L4
3874Gn6j1J0M7n3L1oJ1o5O1j4K6j1K3n6K0J2MoK4jON1p8L7kK2L0k3j2%J9nL8k7
3909E3J7MOl1p2N9m8R1Ok0nq0J5L3K1l7Lqm0J8L3k1J2n1k2Q3j54Q4J5Mj5k6Q6
3942A3m9m0P3K0J6J2n3J7k3K0JO9qn9M5n2m5O8k2N4J4L9n7l3m4L5N4j0k3N6j9
3973F9no9KM7n8L8jo0Q5m1m2mO5o3K0j6j2PJ5J2p4K1k5K7K5J6m3L3k9O6p8R7n5
4006c0J1nOQ6K7o3k7oJ1pP5n6L2j0p0OL4R3j18O1N7o4M6n2l7M7j7l5N8q2l0jM5
4039a5Lm5Q5k9L0nn7k0K8n3j0P7L2pm4q3R8mL8r7M0Ll8R0j0O2p6nJN3k7R0p6J
4073C0LqJ9j5pqK3k3K2k6RJ8K7j7M4p0N5n8j3M8p9l0J7nL5KJ6n9m3L6L7k0JK3
$$ plain form
4107 -16 -13 -125 10 -19 5 -40 -75 -78 -70 36 -59 -37 23 -1 2 40 -21 87 30 41 8 25 -25 -34 67 14 -27 66 71 -16 35
4138 35 46 39 -47 0 40 44 62 32 2 18 -16 -23 28 -1 -10 53 -66 39 -38 -16 -20 -45 -60 -9 -3 33 -84 -98 -13 -23 11 39
4170 39 -29 -50 -42 -100 9 -18 29 49 38 0 29 72 -17 48 17 10 71 -62 0 4 20 54 -18 61 22 44 -14 -24 -16 18 15 -22
4202 -22 32 59 -14 -41 41 -63 38 -25 14 19 -25 -10 -85 -7 35 -76 -27 29 -39 -7 -63 -47 -21 11 20 -55 -20 -57 -46 5
4232 5 10 7 52 21 12 39 -49 -8 43 -11 53 36 20 12 82 -1 -20 78 35 54 12 45 65 84 -5 42 -25 35 37 -11 8 45 29
4265 29 22 -30 -13 -14 -14 -16 -18 -25 48 4 -12 -66 -33 -45 -16 -58 -39 -29 57 -20 15 -33 -37 -14 -15 -4 -6 18 -24 31 35 -15 -36 76 21
4300 21 66 33 81 25 24 10 -22 38 45 58 3 27 33 -57 40 -46 -13 27 -30 9 -3 1 -3 -41 -31 -47 8 -21 36 -24 -81 28
4332 28 24 -24 14 -17 -50 -31 -46 -27 -63 -29 -10 -5 -67 17 39 -30 27 38 76 11 52 -29 57 -5 7 56 63 35 65 -10 49 20
$$ packed form
4107a6Lj12J35k9K4m5l5lQJ06r5K2O0k4LL8o1J08n7J1l3J7n0rJ01n3m1R3Nq7N1
4138C5J1pq6M7M0MJ8l0l0J6l4pN1k9rO3j19J05p7K2mk5j5N1OL6j17j4Q5j0L4K8
4170C9o8k1Qn8J09k7M7K0j1l8K9M3q9O5l1pO1j33O2MJ6L4p2P9l9K2n8j0QL4ll7
4202b2N4K7p3k7Q2j04J01o3L9Nm4J5p5P8M2j11M9N6o8L2n6J6K6L2Rp5L5l7J1N1
4232ENlM5l1rK7q8M1N1n4O4j7j6qP0q3j9R8m3J9m2L3K0J9q9M7o7O0Km8J9L7j6
4265B9pn2J7j%kkpP3m4j6n4L3j2K9m2J9J0Q6p7L5m8mK3jJ1kK4m2N5Mn0k1J12n5
4300B1M5l3M8n6jj4l2O0PJ3n5K4Or0R7q6L3M0n7L9j2Mml8J0j6N5k9N7o0n7J09
4332B8mm8L8l1l3J9j5J9l6L4J9No2Q4K2o9N7J1L8o5M1q1Q6o2J2M9Pk8L0p5N9k9
$$ plain form
4364 20 -26 68 28 62 -52 -12 72 -4 -26 33 25 -6 1 -18 -35 46 -24 13 13 26 -71 -24 -51 18 -23 -15 -35 -15 -18 0 13 -3
4396 -3 -32 -4 -31 -43 -10 4 10 21 -20 -25 68 1 -10 32 -22 0 -34 -1 64 16 81 23 50 18 -19 -50 44 24 -21 83 -16
4427 -16 122 -29 15 20 -5 -18 -65 -11 -7 -24 1 -41 -34 -34 -12 -74 -23 -12 -23 -15 -23 -36 -11 -54 -17 -38 -4 62 -2 23 -30 63
4459 63 4 -26 56 38 39 37 30 -18 55 52 32 11 13 7 -16 41 30 8 43 -13 38 113 68 19 -32 46 2 -59 -3 1 -22 -7 28 -10
4493 -10 -17 -15 -25 -74 -23 -55 2 -36 -23 -11 -1 -41 -13 -9 9 -35 -24 -10 -13 73 -14 0 101 63 14 12 102 1 11 34 44 45
4525 45 67 -19 -5 41 91 34 67 115 11 42 -11 61 24 48 -6 20 -64 11 -66 -20 -13 20 -25 -9 39 -46 -16 -34 44 -84
4555 -84 5 -42 -55 -61 -58 -57 17 23 28 -32 -70 -8 1 -17 -41 32 40 -68 -22 -30 66 6 41 -34 0 55 30 18 81 31 4 30 -42 42
4589 42 42 28 5 34 10 82 -4 42 24 3 -12 -36 20 82 -13 -9 -63 -8 -34 -24 -12 3 -29 -38 -26 -103 -31 -18 -18 -54 -48 -59 -42
$$ packed form
4364B0m6R4m0L4j14M0Q4p6k2N9ql1Pj9j7Q1p0L7%J3r7M7k7O9m1Qk0K0lJ8J3j6
4396ck9K8k7j2L3J4OJ1m1nR3o7j1M2n4K2l4L3O5m8O5n8K7l2l7l1R4k0m5J04r9
4427a6J38j51M4Nk5j3m7N4Mj7K5m2P%K2o2N1J1j1Qqj3K5m3L7k1L4O6o4K5n3R3
4459F3n9l0Q2j8Jkpm8P3lk0k1Kok3N7j1k2L5n6N1P5m5m9n1P8m4o1N6Mk3J5L5l8
4493a0pKj0m9N1l2N7l8J3J2J0m0K8MJ8m4J1J4lQ6q7J4J01l8m9kR0j01J0K3J0J
4525D5K2q6J4M6N0n7L3M8j04L1n3P2l7K4n4K6q4P5p7M6PL3m5J6M8q5L0j8P8j28
4555h4Q9m7j3oLJP4ONo0l8O2Rj8k4P3Qj08M6qR6o0L5p5L4N5k5j2O3n0k7K6p2Q4
4589D2%j4k3K9k4P2q6M6j8k1j5k4N6O2r5Mn4N5k6J0J2J5l2rJ2p7P2J3%l6Oj1J7
$$ plain form
4622 -42 0 20 -60 18 8 -14 -9 21 -1 0 -40 61 4 10 20 32 3 72 14 70 77 79 43 8 -5 -40 26 83 64 51 30 61
4654 61 -69 19 24 67 -8 -49 -41 -57 -30 -60 -36 -8 24 -69 25 13 28 18 39 33 -32 -78 31 -55 6 14 -4 -3 15 29 -67 59
4686 59 -51 -14 49 1 27 29 -12 22 3 33 61 41 33 34 -1 23 39 74 3 75 46 20 18 10 20 -27 35 -29 -15 37 -1 31
4718 31 -8 54 -27 20 20 -29 -71 -66 -37 17 -17 17 -16 -41 -15 -66 -5 -52 5 -82 25 -14 7 88 -58 9 11 -3 17 -17 -4
4749 -4 78 24 50 75 8 9 55 -20 94 -30 46 3 14 19 48 -6 38 54 -7 31 -4 65 -11 -3 -16 -21 -29 5 -65 -76 5 -80
4781 -80 29 9 -51 -2 -53 -14 -57 -56 -12 -28 -60 -47 35 -14 -44 39 3 -31 1 57 10 42 3 15 89 -67 43 49 27 3
4811 3 -21 40 47 97 83 59 57 9 -2 18 38 -5 -18 -11 -18 40 75 0 -20 3 -10 -6 -44 -24 -12 -20 15 -11 33 43 5 11 -5 4 -15
4846 -15 19 -46 -16 49 -7 22 -22 -42 -22 -19 -35 11 -16 8 0 12 21 2 51 35 33 67 47 -2 43 50 12 -64 77 11 -27 24
$$ packed form
4622d2M2K0q0P8j0k2NL0k2Jm0J01n7OJ0J2k9O9n8N6PKl6l5j3l5O6N7j9j3k1L1
4654F1j30Q8NM3p5m1Qj6K7l0K4K8L2r3R4j2J5j0K1oo5m6J09q6O1Qj8JJ8J4r6J26
4686E9j10L7O3m8K6Km1L4j9L0K8k0qJl5K4J6L5p1P2k9k6kqJ0m7O2o4J4N2l8L2
4718C1l9O2q1M7%m9m2NK9N4l4L4l3k5K6n1O1m7N7q7J07l9K1Q1j46O7Kj4K0l4J3
4749dQ2n4K6K5o7JM6p5J14j24P6m3J1NK9n4M4J6o1L8l5O9p6Qj3nqL4p0j1Q1q5
4781h0J09k0o0M9n1L9m3JM4j6l2J3Q2m9l0Q3l6l4L2N6m7L2l9J2P4j56J10Ok2k4
4811Ck4O1PN0j4k4km8j1K0K0m3j3PpN8L5p5k0K3j3Ml8K0J2qL5k6M4J0l8Oj6Rj9
4846a5L4o5L0O5n6K9m4k0K0Lj6M6k7K4qJ2Rj9M9j6kL4k0m9M5Pl8p6J41o6l8N1
$$ plain form
4878 24 -45 48 -24 11 35 -14 -13 -25 -14 -19 16 -5 -11 -19 -15 -36 -47 -10 -41 -2 -29 -57 18 36 -78 15 -5 32 -46 -15 28 -11
4910 -11 35 -16 -15 42 51 10 25 72 35 0 -28 23 11 5 -9 -22 -12 -33 -48 10 53 69 -45 28 -1 47 2 -74 9 -33 -38 52
4942 52 -13 8 -24 -9 100 -17 -34 -10 3 15 28 -26 -43 -29 -103 -14 44 -35 -39 15 -7 -22 3 -13 -46 -28 1 57 -47
4971 -47 17 89 -27 -15 43 30 -60 8 86 15 -2 50 14 16 -6 31 -38 16 30 -2 8 17 7 -12 3 14 76 13 -43 -22 -35
5002 -35 -89 -64 -7 -33 -52 -8 24 -16 20 17 -33 -86 15 21 6 35 52 -89 -19 -45 -10 55 -42 5 -63 31 94 55 27 11
5032 11 35 58 -26 26 -17 -11 -18 -18 43 17 44 43 7 -38 -29 -40 13 -27 -27 14 -2 4 -11 -11 -41 -58 -64 -96 -5 -3 60 -3 9 -73 -9
5067 -9 -15 -50 4 -11 -72 -34 -40 7 25 -25 2 -13 53 33 14 -30 14 18 25 20 8 -8 63 -47 0 67 36 -15 20 -18 51 -70
5099 -70 9 13 21 -22 5 -44 57 37 -30 23 38 22 -26 15 34 14 -24 -54 -21 -50 -19 11 -1 -4 -58 -42 -23 -69 -18 -12 -33 -51
$$ packed form
4878B4o9R3p2L5K4m9Jj2J1nL5k1oqMk1j1L7l1L9k7k8P5J8j14R3k0L7p8L1M3l9
4910a1M6n1JN7Rm1J5M7l7l5k8N1j2oj4j3J0k1j5N8M3J6j14P3k9M8m5p6Q3m2nR0
4942E2o5K1l2J5J09j17j7K4J3J2J3n4j7J4p4Q9N8p9mN4k2j5K5j6l3J8K9N6j04
4971d7O4P2j16J2N8j3r0O8P8p1j7N2l6Kk2L7o9N4J4l2J0Rj0j9J5J1O2o3n6K1j3
5002c5n4K5N7k6j9M4L2m0L6ln0n3J01Oj5K9J7j41P0k6L5O5r7M7o8R4O3l9k8j6
5032A1K4K3q4N2m3Op%O1k6K7jl6m5Rj1N3m0%M1j6Oj5%l0j7ol2R1KO3o3J2q2O4
5067iol5N4j5o1L8oM7J8n0K7j5O6k0j9m4M4MPnj2j6P1j10M7O7l1n1L5l8O9j21
5099g0P9MQm3K7m9J01k0o7N3J5j6m8M1J9k0l8l0L3k9L1L0j2ln4J6J9m6N1Ok1j8
$$ plain form
5131 -51 -5 45 -70 36 60 25 -48 -34 26 20 -31 -27 11 59 21 43 24 13 18 -8 23 35 16 44 63 35 75 -13 8 10 46
5162 46 36 -3 -17 32 -27 -28 14 24 -42 -66 54 -47 -22 -24 -47 13 -28 -23 -1 -46 35 -26 -55 -32 -35 -79 -50 -10 14 58 48
5193 48 -27 -55 32 -10 61 -10 23 12 14 25 52 36 18 17 -37 19 52 17 -33 51 73 25 66 -28 51 33 62 -5 -37 16 37
5224 37 2 10 3 -39 -2 -35 -30 0 -40 -4 54 -44 -9 14 -90 -10 -6 -77 -4 54 12 9 6 -76 -30 -2 -49 27 -22 25 0 20 71
5257 71 -54 15 17 48 17 -14 40 18 -71 36 44 8 22 -89 -22 -36 -19 78 5 20 53 47 9 -25 11 12 0 -20 -99 -23 -27
5288 -27 -62 -56 -56 -12 -61 -35 -69 -42 19 -106 -79 -63 30 -7 -18 41 -36 62 -11 -23 17 -24 7 -10 32 39 -22 -2 -13 -52 69
5319 69 -11 10 -16 36 37 2 20 95 -1 18 13 -37 6 -6 -19 -1 14 -28 -2 -49 -39 -12 -49 1 39 87 -66 -16 -17 -21 -12 -13 -36
5352 -36 5 -39 -5 -52 -22 29 -2 -12 -83 -77 -8 -8 -5 31 17 81 -16 24 -6 -36 -11 -59 30 40 -34 32 80 29 -3 38 16 -39
$$ packed form
5131e1M6N0j15J06K4l5p3J4O0on1ML8M8l8K2j9j1Nk6L1J2j9K8J9k8M0q8K1KL6
5162D6j0l9j4M9n9jM2J0o6k4J20j01K5kk3O0m1NK2m5Q1o1k9K3lm4K9M0K4M4j0
5193D8p5k8Q7m2P1p1L3j1KJ1K7j6j8jn4N6L3l5n0Q4K2m8M1r4P9j8K9o7l2N3K1
5224C7l5Qpm2L7l3NL0m0L6N8r8L5K3j04Q0Mp1P3N8m2llq2M6K8m7P6m9M7k5K0N1
5257G1j25O9KL1l1l1N4k2q9J07Ql6J4j11O7j4J7R7p3J5L3ol8l4L6Jj2k0p9P6m
5288b7l5O%M4m9K6l4K7O1j25K7J6R3l7j1N9p7R8p3j2M0m1L1j7M2Po1K0j1l9J21
5319F9q0K1k6N2Jl5J8P5r6J9nn0M3j2j3J8J5m2K6m7J0K7l7N0L8M8j53N0jmRjk3
5352c6M1m4L4m7L0N1l1j0p1OO9%LL6j4O4r7M0l0l0K5m8Q9J0p4O6M8n1l2M1k2n5
$$ plain form
5384 -39 33 44 25 -59 44 34 -62 30 14 22 -35 -15 7 84 15 -39 24 -43 -9 -8 -29 -25 -48 -23 -34 -17 37 -37 -18 40 12
5415 12 47 -10 -16 61 -16 43 17 27 -1 -1 8 -31 -9 25 11 -8 55 -82 14 48 46 15 -54 5 17 36 38 60 43 -37 5 -5
5447 -5 -68 -5 7 -43 -23 -27 39 12 -45 -44 -53 7 -79 26 3 15 -29 -48 -16 -18 -46 -85 -10 -34 -31 19 49 -37 -34 -55 -19 0 -12
5480 -12 5 -17 118 5 2 2 -5 -26 -27 -69 -8 17 30 40 21 41 11 -37 18 56 70 29 -29 -16 55 -32 41 17 11 43 17 34
5512 34 -10 2 35 -28 -38 60 -44 -4 24 -2 -29 -23 9 31 -8 65 -9 -39 17 -20 -13 -13 -14 -4 48 4 -47 65 9 23 9
5543 9 29 28 4 -9 -44 2 22 10 -28 20 36 32 57 -10 -76 -30 -27 -26 -8 88 14 -4 -36 89 -20 -13 1 4 38 -10 -33 -38 -2
5576 -2 3 19 0 -4 24 -9 59 101 -14 33 38 23 -16 44 28 54 -66 72 7 -54 69 64 44 71 85 -3 0 18 -4 1 56 -33
5608 -33 30 51 -57 20 -30 20 5 -28 -51 3 41 -73 -13 64 2 28 -60 1 -24 19 6 -12 -34 16 -13 -64 18 -43 11
$$ packed form
5384c9P2J1j9q4J03j0r6R2j6Qn7K0K2P7o9n4O3o7L4Jk1Mk3K5j1J7N4p4J9N8k8
5415A2L5n7oP7p7N9k6J0k8%Rl9K2L4j4j9O3j37R6L4kl1o9N9J2J9KK2j7q0M2j0
5447eo3O3J2n0K0mO6k7n7JrO0q6J05k3J2m4j9L2kk8l9P5k4LN0L0q6Lk1L6J9j2
5480a2J7k2J35j13l%pk1jm2O1K5J3J0j9K0l0m8N5L8J4m1n8J3P1q7P3k4oL2k6J7
5512C4m4J2L3o3j0R8j04M0K8k6k7OL2K2l9P3p4l0N6l7P%jJ0N2m4n1J12n6J4j4
5543IK0jk4j3l5M6K0j2l8M8J6mK5o7o6M6LJJ8R6p4j8l2J25j09PJ4LL4m8k3nL6
5576bNJ6j9mK8l3O8M2j15M7Nj5l9O0j6K6j20J38o5o1J23nk0K7J4q8LJ8k2NN5q9
5608c3O3K1j08P7n0N0j5l3k3N4L8j14O0P7o2K6q8O1k5M3j3j8k2N0k9n1Q2o1N4
$$ plain form
5637 11 19 7 84 3 -90 -5 -31 4 32 -6 -22 -10 90 5 -1 77 43 -5 26 -3 3 13 -31 -5 50 -9 24 -11 20 45 24
5668 24 -53 -4 3 -13 -24 -19 -42 -39 10 39 -10 27 -21 -61 -88 -46 -23 -80 15 12 18 3 -71 3 0 23 4 54 -2 -5 70 31 23 -32
5702 -32 102 -40 1 24 16 42 46 -70 -20 -2 -3 54 60 3 -8 0 20 -27 5 8 -22 40 -23 -7 39 -15 -3 -35 -6 -6 -50 -109
5734 -109 -15 -57 -26 29 -44 -44 -14 28 -89 -86 9 -24 -13 -29 -12 -17 -2 -29 10 16 -31 -20 -40 -29 26 -33 -8 -11 -35 -10 31 31
5766 31 42 -12 -42 12 10 55 20 -11 44 25 -1 35 39 -3 19 4 -4 -33 -68 39 -3 2 -19 -24 -46 8 -33 -43 29 -72 7 12
5798 12 -46 -72 -16 55 6 -37 7 -45 25 6 20 18 -34 -19 -46 28 -16 7 -21 0 31 -39 14 37 13 3 -31 30 44 -9 67
5829 67 -29 -27 -7 -10 -20 16 -9 -39 2 -4 -27 -7 -32 66 29 -44 -7 -10 -43 -7 -11 5 -20 3 -4 -55 -35 -55 -27 -5 -2 30 -46 -56
5863 -56 -34 38 -25 -10 -15 36 10 -5 -31 44 38 -7 -24 16 57 30 3 14 28 21 -18 -24 31 8 20 22 -7 5 -50 5 -1 49 8
$$ packed form
5637A1Qj2P7q1r3Q5k6L5K8l8j6J2J00q5oP8l4m8L1k9OJ0m4K6N5n9L3l5L1K5k1
5668B4p7M9Pj6j1Nk3LM9K9m9L7m8m0k7M2K3n7R5lOj5p4P4lK3j9N0n6lP5l9qn5
5702c2J34j42M1K3qK6Mj16N0J8jN7On7j1QK0m7L2Ll0O2o3J6M6n4J2l2K9%m4n9
5734a09R4m2L1N5p3%L0M2j17LR5l3J1j6J7nJ5k7L9Om7J1k0J1N5n9K5lk4K5M1%
5766C1J1n4l0N4kM5l5l1N5j9k6L6Mm2K2j5qk9l5J07m2Nk1nk2N4m1j0P2j01P9N
5798A2n8k6N6P1m9m3M4n2P0j9J4kn2J5k7P4m4K3k8K1L1p0N3K3k4j0l4O1J4n3P6
5829F7r6KK0lj0L6k5l0M1ok3K0k5R8l7p3L7ll3L6mJ6k5K3pn1K0k0K8K2LL2p6j0
5863e6K2P2o3J5nN1k6j5k6P5om5j7M0M1k7k7J1J4pl9oN5k3J2Kk9J2n5N5oN0m1
$$ plain form
5896 8 -42 -72 19 5 -6 -22 50 91 -5 12 -18 -79 -30 94 -16 -34 9 -46 -39 -55 4 1 -105 23 -31 44 -21 -23 48 12
5926 12 -34 53 18 -40 14 44 -18 25 45 74 11 26 -31 32 6 -22 37 84 67 -17 41 20 5 -10 -8 46 -19 -58 11 36 58
5957 58 0 -44 12 -21 -89 -58 -10 -84 -34 -64 13 25 28 -28 -26 -6 -27 21 41 13 -79 42 13 -30 -53 33 14 21 31 -38 -31 61
5989 61 -16 -30 36 18 72 -2 90 20 -17 7 52 -2 -17 -1 30 22 19 10 1 9 0 35 10 -10 29 -7 -16 27 -36 8 -35 -64 10 -16
6023 -16 23 -27 -11 -16 -58 60 -41 -87 44 -5 -6 -24 -59 -35 -4 -26 -13 -5 44 10 11 -18 -14 25 -5 19 4 26 -48 2 39
6054 39 41 6 23 60 21 44 53 18 -19 -54 9 18 -8 -61 -35 -13 -19 -15 -44 53 47 19 5 -40 -16 3 -29 14 45 -16 38 -19 -18 20
6088 20 15 -36 63 4 45 3 7 36 -21 -13 26 -26 -17 13 11 -9 61 -18 -56 21 45 12 25 18 -12 32 42 64 61 6 24 57 1 47
6122 47 17 -7 -23 63 26 -9 97 33 24 -33 5 15 -27 35 31 37 25 13 23 -29 43 -42 -86 74 19 23 -15 36 7 21 -1
$$ packed form
5896Hn0l0R1j4j1j6P2M1r6J7l0o1M9J24j10j8M3n5Pj6N9lj06J28n4P5o5kP1l6
5926A2m6Q7l5n8N4L0o2M3K0K9o3J5n7O3k6k8N9M7j7q4N8k1j5j5KN4o5l9O9K5K2
5957E8n8m4N6l3o8L1M8p4N0l0P7J2Ln6KK0k1M8K0k8r2J21k9m3k3Q6j9PJ0o9PR2
5989F1p7j4O6j8N4p4R2p0l7K4M5n4j5J6L1qlrrQrL5k5k0L9l6rM3o3M4m3k9P4k6
6023a6L9n0J6nm2J18j01m6J31m9jj8l5K4L1k2J3QM9l4Jk9ML9l0K4j5K2p4N0L7
6054C9Kl5J7L7l9K3Rl5l7l5O3Rk6n3K6K2oMk9R7ok8j4m5K4J9l2M3L1o1N4n7JL8
6088B0nn1R9n9M1m2MK9n7QL9n2RL0kk0P0p9l8P7K4l3J3pl0M4J0K2ln5J8L3n6M6
6122D7l0k4j6Q6l7l5J06o4rn7L8J0m2O2mOj2j2J0n2P2q5m4J60n5Ml8N1k9J4k2
$$ plain form
6153 -1 -59 -13 -26 -8 49 18 -25 -15 -15 15 55 2 22 -6 -34 -35 23 45 7 -13 49 20 -43 7 -6 92 -3 -2 4 -11 -19 -13 -21 -23 -13
6188 -13 9 18 -22 11 40 -20 -58 -47 -3 -25 -55 48 -21 -3 19 -7 60 -69 40 -23 5 -14 -22 13 25 62 32 -42 -22 74
6218 74 4 -9 49 -17 22 -20 7 -5 63 -28 -3 19 12 -16 -5 7 42 -45 -26 8 -6 6 50 -8 13 -27 -42 18 -5 68 9
6249 9 0 39 11 -32 -66 -69 31 -25 24 -1 87 31 12 61 4 32 9 24 -44 41 0 -2 33 4 -34 50 17 -21 -11 24 47 10
6281 10 30 37 -5 27 -56 90 10 55 14 30 35 20 -25 -67 -4 57 -46 -62 -79 -27 -53 -25 11 34 -1 -13 -18 -4 -27 -47 -9
6312 -9 43 6 -8 -27 -72 -26 46 0 -5 31 -18 12 -29 21 40 19 7 -24 -9 40 -6 -14 -24 -33 -56 32 6 44 18 -36 -1 -4 -2
6345 -2 75 -47 -12 -10 14 6 -45 -43 -12 -2 4 -47 0 -32 32 38 3 23 -1 -2 34 -3 5 1 -50 -47 -54 59 6 -50 11 -24 -54 40 0
6380 0 66 -4 -54 49 2 37 7 9 77 19 -46 26 21 4 8 -31 12 39 -33 55 21 -27 -4 27 2 13 -49 6 -41 -12 -6 12
$$ packed form
6153an8M6j3J8N7l1m3J0%L0M0n3K0k8k8jN8K2l8k0O2k9o3N0j3R8r5JOj5qOqkJ0
6188a3K2Rm0L3K9o0l8J1M4k2l0J03o9J8K2k6O7j29J09o3K8j9qL5J2L7l0p4K0R6
6218G4p0j3N8o6L9m2K7j2O8r1K5K2pk8J1J2L5q7J9L4j4J2M4n8K1m0j5O0k3P3n9
6249IrL9k8m3l4lJ00n6M9k5Q8n6j9M9n7K8k3J5o8Q5m1kL5k9l8Q4l3l8J0L5K3l7
6281A0K0Pm2L2q3J46q0M5m1J6Nj5m5m2O3O1j03j6j7N2k6K8L6K3l5j2nJ4k3k0L8
6312iN2l7j4j9m5M6P2m6nL6m9L0m1N0J9k1j2l1J5M9m6qj0rk3Q8k6L8k6n4L5lK
6345bP7j22L5KK4qn1KL1J0On1M7l2O4Ol5K0k4jL6l7Qmn1LpJ13n3n6O1l5l0R4m0
6380@O6p0n0J03m7L5l0KO8n8o5P2nj7Ml9M3K7p2Q8l4m8K3L1k5J1o2N5m7K9OJ8
$$ plain form
6412 12 -23 31 50 52 20 8 -120 -47 19 -15 28 9 8 -43 -7 -42 -1 20 -26 4 22 -19 -23 9 -10 -14 -29 61 26 47 -60
6443 -60 -2 6 -60 -16 40 53 22 -29 -29 19 -37 -4 -1 10 30 7 -63 16 20 -22 3 -64 -14 17 -22 -30 -77 5 -53 -10 1 48 -37
6476 -37 -53 80 34 -5 -31 -48 -20 11 -33 -68 -67 -48 -18 -12 -54 3 -8 -15 48 -3 30 45 2 35 35 5 25 -10 33 1 20 -32
6508 -32 -7 52 28 -34 -22 -30 -22 -4 47 -12 23 16 -8 -14 -41 94 -40 18 39 -41 -25 0 -30 21 -23 -12 -49 -4 -62 -18 -1
6539 -1 -74 -54 -16 21 -17 8 14 56 4 2 2 -43 25 43 51 4 -8 39 37 -8 19 -18 -4 32 -43 55 -12 26 14 45 30 -45 27
6572 27 -42 3 -71 25 1 24 59 8 -35 23 -15 -31 -19 -17 -28 -31 28 -19 -72 -13 -53 -5 -15 0 -27 -56 5 6 -28 -14 33 -11
6604 -11 12 71 -11 40 -22 -51 7 -2 9 36 0 39 -20 40 -24 -7 30 46 7 67 -38 -8 28 -24 39 13 -4 56 27 -13
6634 -13 66 -6 -33 -62 16 -2 -3 1 2 16 -52 -54 28 -24 -32 -16 -5 -50 -29 -7 -9 -20 -3 -8 -10 -11 -33 7 34 113 39 -41 25 -22 -11
$$ packed form
6412A2l5N4J9Kl2j2j28P3O6l4M3j9jn1L6l5M1K1m6L0J8m1mL2j9mj5R0l5K1j07
6443f0N8Qo6M4N6J3l1n1%M8n6L3LJ1K0k3p0P9Mm2K5o7N0L1l9qm7Q2n8M3J1M7q5
6476c7j6J33m6l9k6j7K8L1m4l5JJ9L0Om2N7j1pO3n1L3J5m3L3%l0K0l5M3l2J9n2
6508c2K5N9k4o2J2qQJ8N1n9L5pk4ok7J35j34N8K1q0J6K5l0N1m4J1l7M5n8M4J7
6539ap3K0L8L7l8K5OM2n2k%m5O8J8Qm7j2M7km5K7l7J4L6p5R8o7L8j2L1j5p5P2
6572B7o9M5p4R6k4K3L5n1m3N8l8j6J2Kj1lN9m7n3N9m0M8j0J5k7k9O1Jl4J4M7m4
6604a1K3N9q2N1o2k9N8rJ1K7l6L9n9O0o4J7L7J6l9O0j05L0L6n2O3k6j7O0k9m0
6634a3P9p2k7k9P8j8jMJJ4o8kQ2n2qJ6J1m5K1K2kj1J7nkjk2M0K7P9p4q0O6m7J1
$$ plain form
6669 -11 15 10 -10 -3 31 33 43 -29 26 73 -15 12 -26 54 75 -8 -34 45 48 19 -30 -24 29 -4 -52 5 31 -59 -17 -4 18 31 -1
6702 -1 -13 6 -27 -14 -3 34 -34 -40 -28 -19 -26 -32 6 26 -48 -40 10 -32 -67 -55 -9 10 -7 18 -36 8 24 -11 -48 39 14 -32 -46
6735 -46 -1 -64 51 -97 16 20 -24 13 -19 -40 -3 -16 10 -29 -38 -4 36 -36 18 19 34 20 -46 -4 14 1 -56 29 -50 56
6765 56 -1 40 19 46 15 -8 -10 -25 -36 -62 -14 0 -15 75 -38 24 -21 32 24 11 -36 110 20 -22 -14 30 -2 -62 26 19 44
6796 44 -34 25 -24 55 65 -23 62 28 49 -74 -12 19 -51 -27 64 51 -40 -21 41 7 35 -39 10 31 47 -26 -23 -1 4 -35 -26
6827 -26 9 29 35 -16 -13 -79 -32 -4 -6 30 -1 35 -25 -25 21 -3 -18 -42 17 -3 -9 9 -6 -24 -2 -35 56 31 59 4 52 -16 24
6860 24 56 -18 -20 48 -49 10 28 8 39 -21 -28 -89 2 36 26 -6 -9 5 -20 11 -40 38 17 9 -2 -19 26 14 22 -32 -3 -24 -46
6893 -46 45 -2 8 -26 18 5 33 29 34 0 39 36 -29 45 2 65 3 11 23 -19 26 10 27 -53 -36 -17 51 -21 -28 23 -3 72 15
$$ packed form
6669a1K6nk0PL4KJ0p2N5M7q8K7l8Q0K1q3k6P9Lk9m9ON3l3m8N7K6r0M2J3K2J3l2
6702aj2J9l3J3J1L7o8oJ2RpoL8K0p4QN0m2l5J2M6J9j7K5n4M4J6l5l7Q7k5m6j4
6735d6M5o3J15j48J13Mm4L7l2k1L7j3K6l9rL4M0p2N4JJ5j4o6M2J8j3n7Q5p9J06
6765E6n7M1k1K7l1k3kj5j1k6M8J4j5R0j13O2m5N3qj3m7J46r0m2QM4l2o0Q8pK5
6796D4p8N9m9P9J0q8Q5l4K1j23O2L1p0K4R1j3r1J9O2l4K8p4M9K1J6p3LK2Nl9R
6827b6L5K0On1Lo6M7K8kL6l1L6o0%M6k4j5k4N9k0oJ8j5j8K2l3R1k5K8n5M8o8M0
6860B4L2p4kO8r7N9J8k0L1o0po1R1L4j0l2lJ4k5L1n1P8k1qj1j7M5j2Qn4K9k1k2
6893d6R1m7J0l4M4j3K8mNl4L9lo5P4m3O3o2QJ2m2M5j6J7q0J7J9O8p2pN1k6P5n7
$$ plain form
6926 15 11 -16 -29 -12 14 6 -75 -28 -3 16 -56 -10 -37 37 16 -14 -33 18 26 -15 19 -22 69 17 -25 6 -19 47 16 11 2 -42 72
6959 72 22 -9 49 -17 44 61 41 -47 -17 -20 -22 3 -36 -1 -24 -41 -9 -8 -9 -13 62 -18 10 49 -30 45 27 22 -44 -4 34 53 44 22
6993 22 -3 26 -47 -40 -17 22 32 22 -21 49 38 -49 39 47 9 1 -58 22 95 40 69 77 58 62 -1 -52 1 109 -21 9 -40 8
7025 8 7 0 52 21 32 77 -19 41 -14 30 -23 27 -8 -63 -18 -10 -10 -33 -55 12 -32 31 -65 -71 -64 50 14 -47 29 58 42 21 -2
7058 -2 -26 -11 50 120 8 2 13 6 -18 -26 -6 44 -49 -12 18 -13 8 23 16 16 0 -53 -16 49 20 60 -29 40 -24 53 8 -46 54
7091 54 13 57 -34 -24 14 -56 25 -40 0 -52 10 -58 33 36 -43 -11 59 -38 36 43 -32 16 -5 -2 -35 -7 28 -10 16 8 12 -30 63
7124 63 10 -24 12 94 52 -5 -64 -7 0 22 17 0 107 13 3 44 -25 -14 14 -8 -7 56 17 -37 8 -47 14 2 -30 -11 -37
7155 -37 -1 -14 13 -34 -1 -23 -28 -24 82 -41 -16 30 -83 -5 41 3 18 20 -42 9 -22 -17 45 -3 7 -49 31 -30 -12 56 -29
$$ packed form
6926A5mk7j3J7K6qq1M7K5J9p2M6k7P4k1l0j9N1Qm1L4m1R1n2m2L1k5O6l1nrm4J14
6959G2n0l1N8o6O1J7k0q8L0lkK5l9L5k3j7L2JjmP5q0K8L9p9P5j8no6M0L8J9rk2
6993B2k5K9p3PK3L9J0j0m3P0j1q7Q8Ql8qn9Q0P3n5K9Qj9Mo3n1N3J08j30L0m9M8
7025HjpN2l1J1M5r6O0n5M4n3N0l5n5M5Q%k3k2O7m4O3r6oPJ14l6o1P6K9j6k1k3
7058bk4J5O1P0j12oJ1pk4qK0N0r3L7L0l1K1J5p%j6n3L7O5k9M0q9O9o4P7m5n4J00
7091E4m1M4r1J0L8p0Q1o5M0n2O2o8R1Lp9L2P0r7P4Pp5M8k1Ll3K8L5l8K6qMm2R3
7124F3n3l4L6Q2m2n7n9N7PK2nj7J07r4j0M1o9J1K8k2JO3l9n4M5n5O1j2l2J9k6
7155c7L6j3K7m7L3k2nMJ06j23K5M6j13P8M6l8J5Ko2N1l1NO2m8J0n6Q0o1J8O8q5
$$ plain form
7186 -29 33 -44 53 22 33 4 14 -14 -24 30 -30 15 5 -25 -68 -52 -31 48 -58 -9 -5 -10 59 -15 -23 9 -6 -14 -3 -8 -5 -5 -18
7219 -18 -12 -41 0 32 33 -56 19 -18 -16 -14 31 -6 31 98 -1 0 13 -9 -26 -28 1 -2 32 -11 4 -7 48 -30 43 -14 3 -10 -29 -2
7253 -2 20 -12 -59 -12 38 -20 54 5 -60 25 33 14 -22 -17 -38 32 -39 22 -33 -58 -1 14 31 0 -71 -9 -33 69 14 -63 -14
7284 -14 26 57 46 24 1 3 15 -33 -6 23 -5 19 8 7 -31 29 1 14 36 55 22 -22 -60 -67 33 -11 37 -21 -30 2 -25 -43
7316 -43 -9 -26 39 3 -11 5 61 -24 33 -66 -12 46 -22 -59 25 22 -22 57 -3 -24 -30 38 46 26 8 2 -39 -35 -3 -10 -16 -25 -46 28
7350 28 16 -37 4 13 38 4 9 -23 -47 21 30 17 29 12 24 4 25 30 30 44 13 69 48 30 -34 25 -39 18 46 -34 83 57
7382 57 47 24 17 37 65 -19 -24 -35 0 47 9 14 38 -53 -24 24 -30 -11 -14 -36 -6 64 -29 -10 30 43 42 -80 13 4 -14 -41 -80
7415 -80 28 -32 64 24 94 21 29 50 38 34 -30 2 -6 8 -11 30 -24 41 -5 49 38 19 -42 35 -20 19 1 -59 -40 -5 53
$$ packed form
7186b9O2p7R7l1J1k9J0k8j0N4o0M5j0l0m3J6K1P9j06M9MnO9p4qL2j5qJ1nL%j3
7219a8Ok9M1L2Jq9P5l7KKM5l7L7O7r9JJ3k2j7kK9lL4m3J5j1N5p8P3n7J7j3j9K7
7253bK2l2m7M7N0n8P4m9o5Q5Qj9l6Nk1P0p1O1n5k5N7J5J7l1p1O2k4J02n5p7M9
7284a4M0L1j1k2k3KJ2m8K7K9k8K4j1jl8O0k8J3K2J9l3m4l8pJ00m4M8n8rL2k7j8
7316d3L4j7O5l6j4J6N6q5N7r9N4N8o8l7Q4lm4P9o0k1oO8Qk0j8om1ML2pork1P4
7350B8j2n3M1RK5l4Nl2k4O8Rj3J2j7J2k0K1N%J4l1N6k1j8o4N9o4N7K8q0J17k6
7382E7j0k3pK0K8q4nj1L5M7l8NK4r1K9M8n4J9lk2L0P0r3J9M0J3jj22R3rj8k7l9
7415h0J08o0R6m0P0p3QK1j2mo4L2qJ4j9M1n4O5m6N4j1j9o1P7n5L9j8o0J9L5N8
$$ plain form
7446 53 3 -28 55 -22 8 35 -48 -37 88 3 -17 17 -22 71 5 -9 32 -34 6 38 20 27 -4 -4 0 26 16 -25 4 10 6 -42
$$ packed form
7446E3n0l1Q3p7L0K7q3J1J25q5k0L4l9R3o6j4M1o6M0L2j8Pl1%MK6j0m1K9Omm8
$$ [...]
8191a3
##END NTUPLES=NMR FID
##END=
