##TITLE=1H_LY-benzophenone_3
 CDCl3, 8 sc, 
 3.7.2019
##JCAMPDX= 6.0         $$ Bruker NMR JCAMP-DX V2.0
##DATA TYPE= NMR FID
##DATA CLASS= NTUPLES
##ORIGIN= UXNMR, Bruker Analytische Messtechnik GmbH
##OWNER= root
$$ XWIN-NMR		Version 3.5
$$ Wed Jul  3 16:30:18 2019 Russian Standard Time (UT+4h)  she@DPX200
##.OBSERVE FREQUENCY= 200.13155
##.OBSERVE NUCLEUS= ^1H
##.DELAY= (6, 6)
##.ACQUISITION MODE= SIMULTANEOUS
##.ACQUISITION SCHEME= undefined
##.AVERAGES= 8
##.DIGITISER RES= 18
##SPECTROMETER/DATA SYSTEM= spect
##.PULSE SEQUENCE= zg30
##.SOLVENT NAME= CDCl3
##.SHIFT REFERENCE= (INTERNAL, CDCl3, 0, 15.7039)
##AUDIT TRAIL= $$ (NUMBER, WHEN, WHO, WHERE, WHAT)
$$ ##TITLE= Audit trail, XWIN-NMR		Version 3.5
$$ ##JCAMPDX= 5.01
$$ ##ORIGIN= Bruker BioSpin GmbH
$$ ##OWNER= she
$$ F:/spectra/data/she/nmr/H-F/1/audita.txt
$$ ##AUDIT TRAIL=  $$ (NUMBER, WHEN, WHO, WHERE, WHAT)
(   1,<2019-07-03 16:28:52.25 +0400>,<she>,<DPX200>,
      <created by zg, POWCHK disabled, PULCHK disabled
       configuration hash MD5:
       00 E9 B6 7A A2 85 ED C7 34 08 36 98 17 FE 4E 26
       data hash MD5: 16K
       00 AC D5 DD B6 AC ED 2B AF F7 99 CC 34 4D 67 F8>)
$$ ##END=
$$ 
$$ hash MD5
$$ C5 B3 C3 16 92 9F 08 FB 4D AD ED 0E 5E CF 47 28
##$RELAX= 
##$RELAX= 
##$RELAX= 
##$RELAX= 
##$RELAX= 
##$RELAX= 
$$ Bruker specific parameters
$$ --------------------------
##$DU= <F:/spectra>
##$EXPNO= 1
##$NAME= <H-F>
##$PROCNO= 1
##$TYPE= <nmr>
##$USER= <she>
##$AMP= (0..31)
100 100 100 100 100 100 100 100 100 100 100 100 100 100 100 100 100 100 
100 100 100 100 100 100 100 100 100 100 100 100 100 100 
##$AQSEQ= 0
##$AQ_mod= 1
##$AUNM= <au_zg>
##$AUTOPOS= <>
##$BF1= 200.13
##$BF2= 200.13
##$BF3= 200.13
##$BF4= 200.13
##$BF5= 200.13
##$BF6= 200.13
##$BF7= 200.13
##$BF8= 200.13
##$BYTORDA= 1
##$CFDGTYP= 0
##$CFRGTYP= 5
##$CHEMSTR= <none>
##$CNST= (0..31)
1 1 145 1 1 1 1 1 1 1 1 1 1 1 1 1 1 1 1 1 1 1 1 1 1 1 1 1 1 1 1 1 
##$CPDPRG= <>
##$CPDPRG1= <>
##$CPDPRG2= <>
##$CPDPRG3= <>
##$CPDPRG4= <mlev>
##$CPDPRG5= <mlev>
##$CPDPRG6= <mlev>
##$CPDPRG7= <mlev>
##$CPDPRG8= <mlev>
##$CPDPRGB= <>
##$CPDPRGT= <>
##$D= (0..31)
0 1.2 0 0 0 0 0 0 0 0 0 0.03 0 0 0 0 0 0 0 0 0 0 0 0 0 0 0 0 0 0 0 0 
##$DATE= 1562156931
##$DBL= (0..7)
120 120 120 120 120 120 120 120 
##$DBP= (0..7)
150 150 150 150 150 150 150 150 
##$DBP07= 0
##$DBPNAM0= <>
##$DBPNAM1= <>
##$DBPNAM2= <>
##$DBPNAM3= <>
##$DBPNAM4= <>
##$DBPNAM5= <>
##$DBPNAM6= <>
##$DBPNAM7= <>
##$DBPOAL= (0..7)
0.5 0.5 0.5 0.5 0.5 0.5 0.5 0.5 
##$DBPOFFS= (0..7)
0 0 0 0 0 0 0 0 
##$DE= 6
##$DECBNUC= <off>
##$DECIM= 24
##$DECNUC= <off>
##$DECSTAT= 4
##$DIGMOD= 1
##$DIGTYP= 9
##$DL= (0..7)
0 120 120 120 120 120 120 120 
##$DP= (0..7)
150 150 150 150 150 150 150 150 
##$DP07= 0
##$DPNAME0= <>
##$DPNAME1= <>
##$DPNAME2= <>
##$DPNAME3= <>
##$DPNAME4= <>
##$DPNAME5= <>
##$DPNAME6= <>
##$DPNAME7= <>
##$DPOAL= (0..7)
0.5 0.5 0.5 0.5 0.5 0.5 0.5 0.5 
##$DPOFFS= (0..7)
0 0 0 0 0 0 0 0 
##$DQDMODE= 0
##$DR= 18
##$DS= 0
##$DSLIST= <SSSSSSSSSSSSSSS>
$$ [...]
##$SUBNAM2= <"">
##$SUBNAM3= <"">
##$SUBNAM4= <"">
##$SUBNAM5= <"">
##$SUBNAM6= <"">
##$SUBNAM7= <"">
##$SUBNAM8= <"">
##$SUBNAM9= <"">
##$SW= 24.9336996594482
##$SWIBOX= (0..15)
0 0 2 0 0 0 0 0 0 0 0 0 0 0 0 0 
##$SW_h= 4990.01996007984
##$TD= 16384
##$TD0= 1
##$TE= 0
##$TE2= 300
##$TE3= 300
##$TEG= 300
##$TL= (0..7)
0 120 120 120 120 120 120 120 
##$TP= (0..7)
150 150 150 150 150 150 150 150 
##$TP07= 0
##$TPNAME0= <>
##$TPNAME1= <>
##$TPNAME2= <>
##$TPNAME3= <>
##$TPNAME4= <>
##$TPNAME5= <>
##$TPNAME6= <>
##$TPNAME7= <>
##$TPOAL= (0..7)
0.5 0.5 0.5 0.5 0.5 0.5 0.5 0.5 
##$TPOFFS= (0..7)
0 0 0 0 0 0 0 0 
##$TUNHIN= 0
##$TUNHOUT= 0
##$TUNXOUT= 0
##$USERA1= <user>
##$USERA2= <user>
##$USERA3= <user>
##$USERA4= <user>
##$USERA5= <user>
##$V9= 5
##$VALIST= <valist>
##$VCLIST= <CCCCCCCCCCCCCCC>
##$VD= 0
##$VDLIST= <DDDDDDDDDDDDDDD>
##$VPLIST= <PPPPPPPPPPPPPPP>
##$VTLIST= <TTTTTTTTTTTTTTT>
##$WBST= 1024
##$WBSW= 4
##$XGAIN= (0..3)
0 0 0 0 
##$XL= 0
##$YL= 0
##$YMAX_a= 23404
##$YMIN_a= -24624
##$ZGOPTNS= <>
##$ZL1= 120
##$ZL2= 120
##$ZL3= 120
##$ZL4= 120
##$ABSF1= 10
##$ABSF2= 0
##$ABSG= 5
##$ABSL= 3
##$ALPHA= 0
##$AQORDER= 0
##$ASSFAC= 0
##$ASSFACI= 0
##$ASSFACX= 0
##$ASSWID= 0
##$AUNMP= <proc_1d>
##$AZFE= 0.1
##$AZFW= 0.1
##$BCFW= 1
##$BC_mod= 2
##$BYTORDP= 1
##$COROFFS= 0
##$CY= 11.3945322036743
##$DATMOD= 1
##$DC= 2
##$DFILT= <>
##$DTYPP= 0
##$F1P= 18.9103706918063
##$F2P= -1.10871071338519
##$FCOR= 0.5
##$FTSIZE= 0
##$FT_mod= 4
##$GAMMA= 1
##$GB= 0.15
##$INTBC= 1
##$INTSCL= 1
##$ISEN= 128
##$LB= 0.24
##$LEV0= 0
##$LPBIN= 0
##$MAXI= 10000
##$MC2= 0
##$MEAN= 0
##$ME_mod= 0
##$MI= 1.114404
##$NCOEF= 0
##$NC_proc= 0
##$NLEV= 6
##$NOISF1= 3.799351
##$NOISF2= 2.8
##$NSP= 1
##$NTH_PI= 0
##$NZP= 0
##$OFFSET= 15.70392
##$PC= 1
##$PHC0= -8514.159
##$PHC1= 44.40097
##$PH_mod= 1
##$PKNL= yes
##$PPARMOD= 0
##$PSCAL= 0
##$PSIGN= 0
##$REVERSE= no
##$SF= 200.130013532006
##$SI= 16384
##$SIGF1= 3
##$SIGF2= 2
##$SINO= 400
##$SIOLD= 16384
##$SREGLST= <1H.CDCl3>
##$SSB= 0
##$STSI= 0
##$STSR= 0
##$SW_p= 3612.71676300578
##$SYMM= 0
##$S_DEV= 0
##$TDeff= 0
##$TDoff= 0
##$TI= <>
##$TILT= no
##$TM1= 0
##$TM2= 0
##$TOPLEV= 0
##$USERP1= <user>
##$USERP2= <user>
##$USERP3= <user>
##$USERP4= <user>
##$USERP5= <user>
##$WDW= 1
##$XDIM= 8192
##$YMAX_p= 0
##$YMIN_p= 0
$$ End of Bruker specific parameters
$$ ---------------------------------
##NTUPLES= NMR FID
##VAR_NAME=  TIME,          FID/REAL,        FID/IMAG
##SYMBOL=    X,             R,               I
##VAR_TYPE=  INDEPENDENT,   DEPENDENT,       DEPENDENT
##VAR_FORM=  AFFN,          ASDF,            ASDF
##VAR_DIM=   8192,          8192,            8192
##UNITS=     SECONDS,       ARBITRARY UNITS, ARBITRARY UNITS
##FACTOR=    0.0002004,     1,               1
##FIRST=     0,             0,               0
##LAST=      1.6414764,     0,               0
##MIN=       0,             -24624,          0
##MAX=       1.6414764,     23404,           0
$$ Real data points
##PAGE= N=1
##DATA TABLE= (X++(R..R)), XYDATA
$$ [...]
$$ plain form
2073 34 -56 177 382 140 -12 253 217 140 482 241 505 503 501 148 337 347 666 246 178 226 175 169 -124 -31 -260
2098 -260 -33 -163 -113 -450 -283 -318 -429 -237 -309 -599 -479 -469 -822 -628 -877 -388 -663 -600 -597 -438 -352 -508 -364
2121 -364 -207 -94 -286 -219 -424 81 -105 -7 128 -37 181 -194 139 121 309 543 243 175 467 594 288
2142 288 286 261 377 314 312 134 453 -203 128 -8 -18 -66 -80 -338 -196 -272 -334 -380 -520 -62 -367 -506 -546 -474 -397
2167 -397 -354 -502 -629 -348 -623 -740 -635 -629 -468 -385 -511 -450 -350 -417 -46 -136 -114 237 83 192 331 629 823
2190 823 215 299 688 476 343 402 721 758 683 436 500 623 437 508 727 522 710 441 410 529 538 352 86
2213 86 342 45 50 11 -127 -7 -9 -312 -35 -206 -219 -129 -342 -1 47 28 63 11 -63 -158 35 -32 68 25 70 281
2239 281 314 275 275 550 452 466 631 346 479 658 577 689 763 547 590 1038 393 783 429 684 704 620 290 281
$$ packed form
2073C4r0K33K05k42j52K65l6p7L42k41K64kkl53J89J0L19m20o8M8n1ok93R3k29
2098b60K27j30N0l37J67l5j11J92p2k90J20J0l53J94k49M89k75O3LJ59Q6j56J44
2121c64J57J13j92O7k05N05j86R8J35j65K18l75L33j8J88K34l00o8K92J27l06
2142B88kk5J16o3kj78L19o56L31j36j0m8j4k58J42p6o2m6j40M58l05j39m0P2P7
2167c97M3j48j27K81k75j17J05OJ61Q3j26O1J00o7L71r0K2L51j54J09J39K98J94
2190H23o08Q4L89k12j33N9L19L7p5k47O4J23j86P1K19k05J88k69l1J19Rj86k66
2213H6K56k97Nl9j38J20kl03K77j71j3R0k13L41M8j9L5n2p4r5J93o7J00m3M5K11
2239B81L3l9%K75r8J4J65k85J33J79q1J12P4k16M3M48o45L90l54K55K0q4l30r
$$ plain form
2263 281 367 300 274 265 126 63 -76 -201 -56 -250 -37 -53 -388 -241 -195 -189 -219 -563 -368 -372 -361 -533 -370 -412 -123
2288 -123 -220 119 -73 -58 -270 17 -172 78 86 204 305 155 -9 320 180 529 455 537 705 298 382 735
2310 735 666 431 430 602 303 544 447 460 243 178 47 183 266 276 -44 -533 -199 -597 -310 -498 -563 -319 -367
2333 -367 -369 -527 -489 -290 -540 -516 -423 -252 -574 -757 -749 -394 -342 -323 -319 -287 -237 -23 -265 -572 -211 -114 -58 -189 163
2358 163 -300 18 120 -30 -132 -157 617 181 199 29 226 250 -43 -32 -25 -43 -72 76 -7 32 10 -517 -244 -293
2382 -293 -447 -430 -571 -596 -585 -484 -563 -481 -419 -871 -544 -561 -817 -902 -590 -674 -601 -303 -566 -320 -265 -565 -488 -444
2406 -444 -73 259 -81 -75 294 -100 -278 439 413 302 410 271 590 257 363 147 401 497 343 248 291 661
2428 661 553 312 173 659 284 260 357 193 -11 304 -28 -197 147 -338 -111 -170 -161 -375 -107 -91 -475 -251
$$ packed form
2263B81Q6o7k6rj39o3j39j25J45j94K13j6l35J47M6Ol0l44J95mJ1j72J63m2K89
2288a23r7L39j92J5k12K87j89K50QJ18J01j50j64L29j40L49p4Q2J68m07Q4L53
2310G35o9k35jJ72k99K41r7J3k17o5j31J36Q3J0l20m89L34l98K87j88o5K44m8
2333c67kj58L8J99k50K4R3J71l22j83QL55N2J9ML2N0K14k42l07L61R7N6j31L52
2358A63m63L18J02j50j02k5P74m36J8j70J97K4k93J1Pj8k9J48q3L9k2n27K73m9
2382b93j54J7j41k5J1J01p9Q2O2m52L27j7k56q5L12q4P3K98k63K46N5l00P7M4
2406d44L71L32l40OL69l94j78P17k6j11J08j39L19l33J06k16K54R6j54r5M3L70
2428F61j08k41j39M86l75k4R7j64k04L15l32j69L44m85K27n9Rk14K68J6l84K24
$$ plain form
2450 -251 -284 -273 -391 -371 -73 -221 -193 -178 -124 -136 -230 -152 -187 230 -89 19 188 -46 230 -46 413 388 171 61
2474 61 147 227 392 484 402 349 131 479 378 398 467 288 26 453 240 -123 -48 81 -56 -94 -86 -81 -233 -203 -225
2499 -225 -390 -456 -234 -245 -235 -589 -350 -188 -447 123 8 -70 91 -123 -525 -84 -450 -242 64 162 -10 71
2521 71 233 503 427 276 296 531 678 486 607 391 588 599 734 677 625 708 379 556 636 853 506 406 282
2544 282 364 527 469 448 -12 223 427 232 -129 82 207 -145 103 55 -314 -458 -140 -160 -397 -172 -422 -199
2566 -199 -96 -554 -337 -154 -173 -389 -282 -200 -71 -220 99 -139 113 332 -15 -47 168 108 327 171 158 92
2588 92 301 349 338 392 198 1 348 245 -72 275 247 13 13 27 -85 -20 -61 -77 -367 -414 -255 -679 -118 -222
2612 -222 -771 -445 -534 -424 -646 -649 -478 -520 -427 -410 -557 -436 -736 -326 -486 -556 -692 -447 -186 -266 -415 -277 65
$$ packed form
2450b51l3J1j18K0K98j48K8J5N4j2r4P8l5M17l19J08J69k34K76k76M59k5k17j10
2474F1Q6Q0J65R2q2n3k18L48j01K0O9j79k62M27k13l63P5J29j37l8QNj52L0k2
2499b25j65o6K22j1J0l54K39J62k59N70j15p8J61k14m02M41l66K08L06R8j72Q1
2521G1J62K70p6j51K0K35J47j92J21k16J97J1J35n7n2Q3l29J77Q0K17l47j00j24
2544B82Q2J63n8k1m60K35K04j95l61K11J25l52K48m8l69j44L18k0k37K25k50K23
2566a99J03m58K17J83j9k16J07Q2J29j49L19k38K52K19l47l2K15o0K19j56j3o6
2588I2K09M8j1N4j94j97L47j03l17L47k8k34%J4j12O5m1j6k90m7J59m24N61j04
2612b22n49L26q9J10k22lJ71m2R3J7j47J21l00M10j60p0j36K45K61q0j49J38L42
$$ plain form
2635 65 -543 28 -35 161 -183 288 265 136 229 479 411 109 -210 460 49 11 281 -85 259 195 258 104 301
2658 301 -48 65 -136 29 109 -94 -172 -79 -98 12 -345 -9 -337 -543 -70 -236 -214 -583 -717 -529 -351 -252
2680 -252 -452 -230 -267 24 -114 -388 -160 -140 -217 157 -91 28 323 111 138 283 127 252 270 347 282 414
2702 414 473 -48 113 177 434 313 188 586 47 128 214 85 157 471 -105 -173 53 19 -208 -281 -5 -196 -208
2725 -208 -121 -118 -214 -486 -191 -223 -361 -638 -149 -242 -90 -146 -501 -146 -488 -501 -288 39 -48 -77 -56 75 -72 378
2749 378 246 280 25 -107 221 266 642 395 446 376 380 398 342 210 573 460 227 314 302 148 346 141 246
2772 246 1 106 -181 57 -13 56 -187 -180 -164 47 -21 131 -165 -38 -106 -123 45 -79 5 -221 -211 44 -139
2795 -139 117 115 -69 73 65 5 203 192 -26 458 453 113 428 478 583 591 476 471 696 701 547 409 688 223 353
$$ packed form
2635F5o08N71o3J96l44M71k3j29R3K50o8l02l19O70m11l8K70l66L44o4O3j54J97
2658C01l49J13k01J65Q0k03p8R3j9J10l57L36l28k06M73j66K2l69j34J88J78R9
2680b52k00K22l7K91j38k74K28K0p7L74k48J19K95k12K7J45j56J25J8P7o5J32
2702D14N9n21J61O4K57j21j25L98n39Q1Q6j29P2L14n76o8K26l4k27p3K76j91j2
2725b08Q7Lr6k72K95l2j38k77M89r3J52n6l55L55l42j3K13L27q7k9K1J31j47M50
2749C78j32L4k55j32L28M5L76k47N1p0MJ8n6j32L63j13k33Q7j2j54J98k05J05
2772B46k45J05k87K38p0O9k43PJ6K11o8J52k96J27o8j7J68j24Q4k26J0K55j83
2795a39K56kj84J42qo0J98j1k18M84nl40L15N0J05Qj15nK25Nj54j38K79m65J30
$$ plain form
2820 353 360 284 394 502 277 64 247 349 235 -18 143 17 56 -148 -33 -353 -337 -484 -247 -256 -338 -436 -452
2843 -452 -304 -313 -573 -590 -170 -404 -724 -215 -325 -235 -169 -192 -404 -415 -216 60 -268 -146 -52 -99 107 -4 72
2866 72 333 283 249 508 0 258 521 435 223 293 59 288 -9 96 151 112 233 142 4 -25 165 -166 9
2889 9 -232 -452 -69 -74 54 -305 -352 -252 109 -185 -105 -133 -191 -678 -197 16 -318 -162 47 -276 -86 -7 -248
2912 -248 -13 97 164 128 -288 -201 84 -131 125 149 182 457 -104 648 444 176 339 195 228 -52 279 212
2934 212 575 354 218 239 310 322 101 46 46 -119 -240 74 -27 -534 -360 -258 -407 -394 -482 -419 -614 -596 -439
2957 -439 -410 -504 -337 -693 -518 -552 -571 -285 -449 -88 -152 -201 -389 -240 -337 -201 -31 -373 86 -58 -170 256
2979 256 177 252 164 11 263 212 387 -56 -36 -183 189 -120 257 234 -7 91 71 -31 109 -45 -339 13 -42
$$ packed form
2820C53Pp6J10J08k25k13J83J02j14k53J61j26L9k04J15l20J6j47K37rq2r8j6
2843d52J48rk60j7M20k34l20N09j10R0O6k3k12j1J99K76l28J22R4m7K06j11P6
2866G2K61n0l4K59n08K58K63q6k12P0k34K29k97J05N5l9J21r1j38k9J90l31J75
2889Ik41k20L83nJ28l59m7J00L61k94Q0k8n8m87M81K13l34J56K09l23J90P9k41
2912b48K35J10O7l6m16Q7K85k15K56K4L3K75n61P52k04k68J63j44L3k80L31o7
2934B12L63k21j36K1P1J2k21n5%j65j21L14j01n07J74J02j49J3q8O3j95J8J57
2957d39K9r4J67l56J75l4j9K86j64L61o4m9j88J49r7J36J70l42M59j44j12M26
2979B56p9P5q8j53K52n1J75m43K0j47L72l09L77k3k41R8k0j02J40j54k94L52n5
$$ plain form
3002 -42 -468 -446 -286 -325 72 62 -248 -274 -56 -61 -135 45 -167 -252 -357 -52 -54 -286 -94 -203 -223 77 -99 -23
3026 -23 -110 201 15 -32 -118 -92 -134 -3 98 287 266 364 379 495 372 617 356 119 318 344 568 89 154 265
3050 265 171 14 -22 170 159 132 156 -14 -282 -141 -413 -267 -65 30 -426 -91 -443 -306 -406 -419 -325 -456 -203
3073 -203 -269 -237 -251 -140 -134 -256 21 -187 -178 210 -58 279 22 94 126 235 368 212 214 511 545 277 439 580
3097 580 546 587 555 724 582 546 195 740 403 144 266 78 360 175 219 163 271 437 317 160 159 233 -37
3120 -37 -147 -51 -468 11 -26 88 40 -273 -115 92 -192 128 -281 -220 68 -233 -69 -33 -214 -129 47 135 406
3143 406 268 137 239 -27 232 344 239 306 100 -137 189 273 33 167 196 150 18 30 302 278 206 -215
3165 -215 -259 32 -190 14 -117 -261 -347 -120 -260 -464 -519 -600 -514 -388 -347 -314 -292 -578 -280 -218 -528 -468 -215
$$ packed form
3002d2m26K2J60l9L97j0l10k6K18np4J80k12q5j05L05kk32J92j09k0L00j76P6
3026b3q7L11j86m7q6K6m2J31J01J89k1R8J5J16j23K45k61k37J99K6K24m79O5J11
3050B65r4j57l6J92j1k7K4j70k68J41k72J46K02R5m56L35l52J37j00j3R4j31K53
3073b03o6L2j4J11Oj22K77k08RL88k68L37k57P2L2J09J33j56KK97L4k68J62J41
3097E80l4M1l2J69j42l6l51N45l37k59J22j88K82j85M4n6J08J66j20j57jP4k70
3120c7j10R6m17M79l7J14m8l13J58K07k84L20m09O1K88l01J64L6j81Q5J76Q8K71
3143D06j38j31J02k66K59J12j05O7k06k37L26Q4k40J34K9m6j32J2K72k4p2m21
3165b15m4K91k22K04j31j44q6K27j40k04n5q1Q6J26M1L3K2k86K98O2l10O0K53
$$ plain form
3188 -215 -340 -322 -332 -188 -129 112 -116 -190 -399 -409 -99 -175 -62 -58 -4 156 233 118 -41 -88 34 187 129 352
3212 352 20 31 77 92 43 51 241 190 -36 92 51 -264 60 100 -61 -239 -229 -246 -246 -399 -338 -233 -64 -169 -156
3237 -156 -427 -284 -403 -68 -360 -25 -336 -160 -473 -148 -340 -248 -301 -133 -87 -179 -1 35 -58 140 -199 -29
3259 -29 96 153 -15 208 308 -97 622 347 388 230 154 37 172 89 338 -39 88 208 100 149 204 -112
3281 -112 106 50 -213 -349 -32 5 -312 -37 32 -229 -40 169 -100 -91 -124 -225 -470 -182 -154 -123 -107 -68 -118 104
3305 104 -87 -148 -175 134 62 -84 -113 -38 -188 397 170 96 24 306 317 192 259 156 499 80 427 251 172
3328 172 215 171 70 409 141 132 306 257 -118 -147 83 8 -14 75 123 -311 98 -48 -196 -44 -85 -333 -257 -397
3352 -397 -125 -342 -259 -133 61 -221 -18 -284 -20 -197 291 98 50 -166 75 88 356 81 302 355 -51
$$ packed form
3188b15j25J8j0J44N9K41k28p4k09j0L10p6J13MN4J60P7j15j59m7J22J53n8K23
3212C52l32J1M6J5m9QJ90n1k26J28m1l15L24M0j61j78J0j7%j53O1J05J69j05J3
3237a56k71J43j19L35k92L35l11J76l13L25j92R2n3J68M6r2J78L6r3J98l39J70
3259b9J25N7j68K23J00m05P19k75M1j58p6j17J35q3K49l77J27J20j08M9N5l16
3281a12K18n6k63j36L17L7l17K75O9k61J89K09k69Rl3j01k45K88K8L1J6L9n0K22
3305A04j91o1k7L09p2j46k9P5j50N85k27p4p2K82J1j25O7j03L43m19L47j76p9
3328A72M3m4j01L39k68rJ74m9l75k9K30p5k2Q9M8m34M09j46j48J52m1k48P6j40
3352c97K72k17Q3J26J94k82K03k66K64j77M88j93m8k16K41J3K68k75K21N3m06
$$ plain form
3373 -51 223 294 92 78 53 136 182 82 271 227 97 302 221 142 18 174 142 -119 312 17 148 126 -85 27
3397 27 141 -470 -16 -16 -244 -515 -384 -73 -364 -313 -116 -109 -307 -383 28 -407 -165 -57 -186 -571 -148 -249
3419 -249 -286 -223 -208 116 -180 185 217 191 178 447 -103 179 74 -104 11 22 292 193 325 -6 527 322 181
3442 181 362 351 67 114 73 35 125 247 167 -84 -98 59 132 -278 -183 -86 -305 -395 34 -109 -216 -66 -192 -177
3466 -177 -179 -188 -161 -74 -12 -336 -163 266 38 -25 -29 -91 326 248 213 506 70 215 346 297 210 91 268 576 459
3491 459 343 393 131 485 253 109 261 150 194 89 185 218 275 132 79 341 33 -218 -94 -71 -197 312
3513 312 -128 -118 -107 109 -103 248 -315 -289 -204 -367 -141 -6 -34 -161 -108 -24 60 -227 -128 -207 -193 -201 -302 -12
3537 -12 -254 -28 -142 -21 -95 56 -5 147 198 -112 217 438 -84 99 -285 -6 47 70 387 185 66 69 49
$$ packed form
3373e1K74P1k02j4k5Q3M6j00J89m4j30K05q1p9j24J56l2k61M31k95J31k2k11J12
3397B7J14o11M54%k28k71J31L11k91N1J97Pj98p6M11m35K42J08j29l85M23j01
3419b49l7O3J5L24k96L65L2k6j3K69n50K82j05j78J15J1K70r9J32l31N33k05j41
3442A81J81j1k84M7m1l8R0J22q0k51j4J57P3m10R5R7k19r0M29j43j07J50j26J5
3466a77krK7Q7O2l24J73M29k28o3mo2M17p8l5K93m36J45J31m9q7j19J77L08j17
3491D59j16N0k62L54k32j44J52j11M4j05R6L3N7j43n3K62l08k51J24K3j26N09
3513C12m40J0J1K16k12L51n63K6Q5j63K26J35k8j27N3Q4Q4k87R9p9J4qj01K90
3537a2k42K26j14J21p4J51o1J52N1l10L29K21n22J83l84K79N3K3L17k02j19Lk0
$$ plain form
3560 49 63 -364 -65 -293 -136 -384 -141 -296 -439 -158 -353 -390 -315 -409 -292 62 -183 -155 -153 -477 -221 -149 -282
3583 -282 -339 -494 130 -48 -61 -217 -155 6 -145 94 146 139 133 189 125 -72 93 136 218 223 278 -1 363 232 81
3608 81 385 398 328 50 66 107 234 244 -4 106 183 71 1 -309 -287 -163 48 -145 109 30 -194 -247 -277 57
3632 57 -15 -298 18 -319 -16 -292 -406 116 -141 -116 32 -28 97 -85 213 -105 -265 -166 371 -24 254 195
3654 195 419 220 200 265 471 88 202 105 307 183 373 366 437 132 269 380 197 40 308 -56 126 516
3676 516 44 158 -150 146 49 -87 -50 -189 -174 -253 -335 -196 -15 -255 -366 -20 189 -380 28 -76 18 -297
3698 -297 -251 217 232 277 98 26 -70 67 104 -103 138 403 421 56 447 493 285 83 347 250 294 261 -26 602
3722 602 280 364 14 175 -18 88 -16 29 198 -49 -111 -44 -74 42 -324 -526 517 -55 -325 -468 -70
$$ packed form
3560D9J4m27K99k28J57k48K43j55j43K81j95l7P5r4J17L54k45K8Kl24K56P2j33
3583b82n7j55O24j78j3j56O2J61j51K39N2poN6o4j97J65M3Q2NN5k79L64j31j51
3608H1L04J3p0k78J6M1J27J0k48J10P7j12p0l10K2J24K11j93K54p9k24n3l0L34
3632E7p2k83L16l37L03k76j14N22k57K5J48o0J25j82K98l18j60R9N37l95K78n9
3654A95K24j99k0O5K06l83J14r7K02j24J90pP1l05J37J11j83j57K68l64J82L90
3676E16m72J14l08K96r7j36L7j39J5p9q2J39J81k40j11L46K09n69M08j04R4l15
3698b97M6M68J5M5j79p2r6J37L7k07K41K65J8l65L91M6k08k02K64r7M4l3k87O28
3722F02l22Q4l50J61j93J06j04M5J69k47o2O7l0J16l66k02J043n72k70j43L98
$$ plain form
3743 -70 -301 -78 -470 -137 109 42 -279 -392 -132 -493 7 166 -55 -53 -499 -93 -387 47 -178 -255 23 28
3765 28 -75 -33 67 395 262 -100 146 294 64 -131 -50 67 168 244 -138 -120 34 -148 17 -196 73 101
3787 101 -75 -163 67 -204 -245 -278 -177 -374 -126 -404 -173 -692 -228 -428 -69 -347 -289 -289 47 -28 -356 -140
3809 -140 -380 -90 -374 -308 -461 -33 33 202 32 -34 -84 -5 159 450 98 46 177 327 109 26 134 345
3831 345 215 -160 260 28 356 68 -92 133 222 -25 139 -36 119 -95 -28 63 11 230 -191 -242 -283 -265
3853 -265 -19 -469 -295 -138 -193 25 64 -176 -152 -53 -40 -17 -319 65 -189 -394 -5 -143 74 191 171 123 -23
3876 -23 111 251 503 356 241 -41 90 241 293 418 329 191 4 110 277 372 261 426 20 265 -34
3897 -34 432 -25 223 -122 44 -84 191 46 13 -88 34 160 -59 72 -132 -244 -62 76 -353 -117 -209
$$ packed form
3743g0k31K23l92L33K46o7l21j13K60l61N00J59k21Km46M06k94M34k25p7K78N
3765B8j03M2J00L28j33l62K46J48k30j95Q1J17J01P6l82J8J54j82J65k13K69K8
3787A01j76q8K30k71m1l3J01j97K48k78K31n19M64k00L59k78N8%L36p5l28K16
3809a40k40K90k84O6j53M28O6J69j70o6n0P9J64K91l52n2J31J50k18q3J08K11
3831C45j30l75M20k32L28k88j60K25Q9k47J64j75J55k14O7R1n2K19m21n1m1J8
3853b65K46m50J74J57n5K18L9k40K4R9J3K3l02L84k54k05L89j38K17J17k0m8j46
3876b3J34J40K52j47j15k82J31J51N2J25q9j38j87J06J67R5j11J65m06K45k99
3897c4M66m57K48l45J66j28K75j45l3j01J22J26k19J31k04j12J82J38m29K36r2
$$ plain form
3918 -209 -54 -88 -67 162 -48 271 127 58 -274 -68 -16 139 -4 87 -115 -4 49 -12 345 128 249 194 233
3941 233 193 210 444 177 236 -48 73 326 366 -18 275 -174 -205 208 -27 183 140 -80 110 -103 46 -270
3963 -270 -283 -145 -153 -257 -265 58 74 -188 -109 -315 -290 -112 -229 15 -114 -67 -334 -4 -164 -48 -90 -222 19
3986 19 138 -31 -90 -151 76 191 -25 259 141 89 188 186 467 233 488 172 273 292 35 379 -34 -320 211
4009 211 36 124 430 -25 146 109 133 90 142 -281 -188 139 -28 -146 -204 -163 -312 -213 -429 198 -84 -178 -139 -141
4033 -141 -94 -31 109 -196 -323 -200 -65 8 -33 100 11 -144 242 -12 185 326 -67 375 125 261 -107 176
4055 176 114 391 14 322 96 1 128 -68 146 301 -49 -101 -278 -147 210 -331 -201 -182 -71 -241 -285 13
4077 13 -25 -235 -188 16 -169 -48 -140 -366 -478 11 -364 -333 49 -174 -340 -302 38 -69 -199 -314 14 -120
$$ packed form
3918b09J55l4K1K29k10L19j44o9l32K06N2J55j43R1k02J11N3o1L57k17J21n5L9
3941B33m0J7K34k67N9k84J21K53M0l84K93m49l1M13k35K10m3k20J90k13J49l16
3963b70j3J38qj04qL23J6k62P9k06K5J78j17K44j29M7k67L30j60J16m2j32K41
3986A9J19j69n9o1K27J15k16K84j18n2R9kK81k34K55l16J01J9k57L44m13k86N31
4009B11j75Q8L06m55J71l7K4m3N2m23R3L27j67j18n8M1j49R9k16O27k82r4L9k
4033a41M7O3J40l05j27J23J35P3m1J33q9j55L86k54J97J41l93M42k50J36l68K83
4055A76o2K77l77L08k26r5J27j96K14J55l50n2j77J31L57n41J30J9J11j70m4K98
4077A3l8k10M7K04j85J21r2k26j12M89l75L1L82k23j66L8L40j07j30j15L28j34
$$ plain form
4099 -120 16 49 -144 94 89 227 15 -58 105 134 159 135 9 9 191 -46 69 66 29 -28 121 -25 150 266
4123 266 29 9 79 169 12 160 178 -337 -573 -353 -319 -574 -283 -219 -463 3 -286 -372 -356 -153 -445 -164 120
4146 120 -361 14 -146 0 52 -264 54 -149 149 49 61 -11 278 -151 -98 49 200 510 121 203 53 -134
4168 -134 116 389 297 302 549 98 39 288 112 194 414 41 132 35 93 -173 -166 -15 19 -37 85 -322 -44 203
4192 203 -119 -347 -101 2 12 -155 -319 -100 -95 -242 -156 -300 173 -253 -226 140 -96 185 -91 -61 164 99
4214 99 44 -91 259 59 153 297 -129 234 37 -87 103 270 46 173 223 141 48 156 301 200 283 118
4236 118 141 80 -224 121 -325 -19 146 -58 245 -157 -348 30 -120 -180 -360 66 -298 -319 -8 -21 -298 -284
4258 -284 -116 -305 165 52 57 -169 -332 62 -101 -193 310 234 208 -31 235 373 81 -297 103 187 19 549
$$ packed form
4099a20J36L3j93K38nJ38k12p3J63K9K5k4j26%J82k37J15ll7n7J49j46J75J16
4123B66k37k0P0R0j57J48J8n15k36K20L4k55K91O4k44M66k89q6J6K03k92K81K84
4146A20m81L75j60J46N2l16L18k03K98j00J2p2K89m29N3J47J51L10l89Q2j50j87
4168a34K50K73r2NK47m51n9K49j76Q2K20l73R1r7N8k66PJ51L4n6J22m07K78K47
4192B03l22k28K46J03J0j67j64K19Nj47Q6j44M73m26K7L66k36K81k76L0K25o5
4214I9n5j35L50k00R4J44m26L63j97j24J90J67k24J27N0q2r3J08J45j01Q3j65
4236A18K3o1l04L45m46L06J65k04L03m02j91L78j50o0j80M26l64k1L11j3k77J4
4258b84J68j89M70j13Nk26j63L94j63r2N03p6k6k39K66J38k92l78M00Q4j68N30
$$ plain form
4280 549 125 391 92 151 312 330 179 1 499 117 56 288 -220 255 -239 71 -191 -46 11 120 -224
4301 -224 -72 -56 -46 -189 -94 -69 -420 -82 -193 -60 -35 -240 -309 -133 -143 -139 -390 -25 -218 -115 -106 -311 -196 -157
4325 -157 84 -274 78 98 -82 62 115 28 211 27 380 62 44 24 37 119 -34 145 52 27 144 25 -17
4348 -17 102 353 118 -400 -197 -286 61 20 -142 -40 -122 -282 -401 -458 -205 -243 46 -63 -124 -157 -302 -211 -66
4371 -66 -179 179 -90 -44 149 -27 -418 -72 -165 79 -93 114 122 -111 73 111 289 89 219 237 -124 47
4393 47 141 38 395 -12 46 396 297 -250 36 -42 140 300 150 -90 241 189 141 1 -237 -138 -157 -1 -367
4416 -367 -255 -363 86 -116 -11 -428 -42 -14 99 -240 228 -218 -78 91 -218 -199 -125 119 -105 -217 123
4437 123 23 87 59 54 -95 -181 339 215 167 519 -46 422 -17 148 301 227 173 16 33 -20 252 89 200
$$ packed form
4280E49m24K66k99N9J61J8j51j78M98l82o1K32n08M75m94L10k62J45N7J09l44
4301b24J52J6J0j43R5K5l51L38j11J33K5k05o9J76j0Mk51L65j93J03Rk05J15L9
4325a57K41l58L52K0j80J44N3q7J83j84L53l18j8k0J3Q2j53J79r3k5J17j19m2
4348a7J19K51k35n18K03q9L47m1j62J02q2j60j19n7K53l8K89j09o1l3j45R1J45
4371f6j13L58k69M6J93j76l91L46r3K44j72K07Qk33J84L8J78k00J30J8l61J71
4393D7R4j03L57m07N8L50r9n47K86p8J82J60j50k40L31n2m8j40k38R9j9J56l66
4416c67J12j08M49k02J05m17L86K8J13l39M68m46J40J69l09J9P4K44k24j12L40
4437A23j00O4k8nj49q6N20j24m8L52n65M68m39J65J53p4n4j57J7n3K72j63J11
$$ plain form
4460 200 198 155 36 -123 -364 244 265 132 120 152 -105 -279 -12 -70 -84 45 -233 -374 -160 -111 154 -234 -392
4483 -392 -442 -108 102 -316 -181 -290 173 204 22 96 -31 -39 266 41 88 212 245 -70 -29 172 45 228 383
4506 383 339 -403 25 -146 -48 -5 163 -157 184 242 135 24 6 -154 109 -317 -138 22 -14 -148 -182 -223 -192
4529 -192 -103 -169 -83 -161 -306 -209 -265 -257 -173 -365 -224 0 -20 212 -62 -138 27 -88 -298 -231 -355 79 -29 -252
4553 -252 -42 137 70 52 352 150 423 106 154 -83 266 290 57 159 105 337 51 145 0 201 129 242
4575 242 -33 129 57 -84 48 -1 -200 133 -154 -208 290 -212 -219 -52 143 -3 253 -2 -496 128 -9 -15
4597 -15 51 -131 -128 -85 99 239 -16 -273 15 -43 258 98 163 -8 153 293 82 131 15 161 244 44 168
4620 168 -129 356 206 236 388 290 -204 -45 433 15 153 -7 -130 84 199 138 -2 -180 -37 -415 -287
$$ packed form
4460B00km3j19j59k41O08K1j33j2L2k57j74K67n8j4J29k78j41K14M9K65l88j58
4483c92n0L34K10m18J35j09M63L1j82P4j27qL05k25M7J24L3l15M1K01j27J83J55
4506C83m4p42M28j71R8M3J68l20L41N8j07j11j8j60K63m26J79J60l6j34l4m1L1
4529a92Q9o6Q6p8j45R7n6QQ4j92J41K24k0K32k74p6J65j15k10O7j24M34j08k23
4553b52K10J79o7j8L00k02K73l17M8k37L49K4k33J02n4K32k86R4j45K01p2J13
4575B42k75J62p2j41J32m9j99L33k87n4M98n02pJ67J95j46K56k55m94O24j37o
4597a5O6j82LM3J84J40k55k57K88n8L01j60O5j71J61J40k11M9j16J46Q3k00J24
4620A68k97M85j50L0J52r8m94J59M78m18J38j60j23K14J15o1j40j78J43l78J28
$$ plain form
4641 -287 -428 -197 -38 -231 24 83 -357 -609 200 -88 -434 -249 -88 -213 61 -223 -75 -105 7 380 22
4662 22 42 156 -221 228 87 91 437 -235 -90 -78 -70 397 217 32 123 48 104 -109 389 219 227 -39 95 260
4686 260 -116 -216 66 35 -188 152 -22 -60 -37 -245 -292 -67 -456 -147 -66 -196 -45 -430 -265 -245 -8 -273
4708 -273 -360 52 118 -116 -285 88 117 47 28 311 -139 112 -56 3 101 -122 397 -32 404 57 -18 182 28
4731 28 496 114 144 -58 183 -54 219 167 91 269 -150 282 210 250 153 -103 -2 -105 -72 38 -245 -34 -83
4754 -83 259 -157 -9 38 43 -150 -223 -120 5 36 -155 -226 233 -17 -38 -198 -206 -238 -360 2 -115 -247 -77 -119
4778 -119 -218 239 105 349 4 84 1 549 90 158 124 413 383 201 299 196 128 306 96 -189 -25 -16 -33 229
4802 229 251 -243 115 146 48 -215 -151 -447 46 -179 -240 -345 -207 22 33 -68 -268 -108 -110 125 -320 -64 -359
$$ packed form
4641b87j41K31J59j93K55N9m40k52Q09k88l46J85J61j25K74k84J48l0J12L73l58
4662B2K0J14l77M49j41ML46o72J45J2QM67j80j85R1p5N6k13M98j70Qk66J34J65
4686B60l76j00K82l1k23L40j74l8K3k08m7K25l89L09Q1j30J51l85J65K0K37k65
4708b73q7M12O6k34j69L73K9p0j9K83m50K51j68N9R8k23N19m29M36l47p5K00j54
4731B8M68l82L0k02K41k37K73n2p6J78m19M32p2M0r7k56J01j03L3J10k83K11m9
4754h3L42m16J48M7Nj93p3J03J25L1j91p1M59k50k1j60ql2j22L62j17j32J70m2
4778a19r9M57j34K44l45Q0q3N48m59O8l4K89l0j82R8j03o8J78k10k85J64Rj7K62
4802B29K2m94L58L1r8k63O4k96M93k25o1j05J38K29J1j01k00J60kK35m45K56k95
$$ plain form
4825 -359 16 -294 27 171 234 -88 404 -15 387 159 134 23 271 125 190 169 173 -4 -133 217 -35 142
4847 142 244 144 261 -29 -54 93 -248 132 -22 -89 56 -69 -276 109 127 397 243 131 -167 -127 143
4868 143 53 -274 -106 233 -311 95 -378 119 -90 -62 -197 -250 -153 -275 -221 -5 35 -265 149 -272 103 285
4890 285 334 -18 36 -70 427 182 296 126 194 227 448 -142 129 -212 97 47 -4 164 15 -56 -45 112 106
4913 106 -159 24 200 -119 146 -152 -135 -25 -210 10 -283 -112 -141 -279 -385 -153 -416 -202 0 -216 -127
4934 -127 -134 -149 -13 -132 -183 2 154 -88 -449 -14 90 -51 94 295 -46 323 105 -12 -52 149 -150 57
4956 57 -45 136 126 468 140 359 200 -9 267 95 208 -86 -37 51 -309 -133 -21 68 87 274 -15 -43
4978 -43 -168 14 156 -163 -94 -20 -160 -91 -129 -92 -49 -89 304 69 -34 -136 -176 -256 -44 -291 -39 130 -55
$$ packed form
4825c59L75l10L21J44O3l22M92m19M02k28k5j11K48j46O5k1Mj77j29L50k52J77
4847A42J02j00J17k90k5J47l41L80j54o7J45j25k07L85J8K70j54j12k98M0K70
4868A43r0l27J68L39n44M06m73M97k09K8j35n3R7j22N4K16M0l00M14m21L75J82
4890B85M9l52N4j06M97k45J14j70O8L3K21n90K71l41L09n0n1J68j49p1J1J57o
4913A06k65J83J76l19K65k98J7J10j85K20k93J71k9j38j06K32k63K14K02k16Q9
4934a27pj5J36j19n1J85J52k42l61M35J04j41J45K01l41L69k18j17m0K01k99K07
4956E7j02J81j0L42l28K19j59k09K76j72J13k94M9Q8l60J76J12Q9J9J87k89k8
4978d3j25J82J42l19O9P4j40O9l8L7M3m0L93k35j03j02m0q0K12k47K52J69j85
$$ plain form
5001 -55 -45 242 -214 -78 286 -25 362 133 62 256 267 -5 123 71 -54 48 295 -232 166 124 142 212 291
5024 291 -6 -41 142 48 -105 104 12 -177 -103 -18 -111 -204 15 -335 -18 -286 -278 3 -177 -93 -211 -43 -270
5047 -270 128 -25 -230 36 -15 -5 105 46 -62 -76 -258 87 -47 35 178 -160 -74 209 177 16 -93 -184 279
5070 279 59 -118 413 -8 59 -36 -25 -36 -82 87 135 211 6 41 133 -13 -190 144 -93 -168 -58 -198 -6
5093 -6 -198 -210 12 -193 -138 150 -145 -253 119 -152 -106 -87 29 -91 -134 2 9 -35 189 147 35 102 -82 276
5117 276 140 -32 227 150 252 40 271 264 -51 88 270 -49 22 285 131 147 67 103 -27 142 124 140 -160
5140 -160 -164 26 231 -215 110 -18 -96 -72 -95 -57 -289 -10 -373 21 -209 -297 -211 -238 -196 -263 65 -120 148 159
5164 159 -390 -295 222 275 210 -48 47 -156 211 53 -21 180 105 238 -100 56 7 388 76 29 199 74 -238
$$ packed form
5001e5J0K87m56J36L64l11L87k29p1J94J1k72J28n2j25J02K47n27L98m2J8P0P9
5024B91k97l5J83r4j53K09r2j89P4Q5r3r3K19l50L17k68QK81j80Q4j18J68k27
5047b70L98j53k05K66n1J0J10n9j08j4j82L45j34Q2J43l38Q6K83l2j61j09r1M63
5070B79k20j77N31m21O7r5J1j1m6J69M8P6k05L5R2j46j77L34k37p5J10j40J92
5093fj92j2K22k05N5K88k95j08L72k71M6J9J16j20m3J36Pm4K24m2j12O7j84L58
5117B76j36j72K59p7J02k12K31pl15J39J82l19P1K63j54J6q0L6j30J69j8J6l00
5140a60mJ90K05m46L25j28p8K4k3L8k32K79l63L94k30q8Q6k7M2o7L28j85K68J1
5164A59n49R5N17N3o5k58R5k03L67j58p4K01p5J33l38J56m9L81l12m7J70j25l12
$$ plain form
5187 -238 1 73 -104 364 -147 -22 128 233 172 -145 -48 -11 -65 -122 11 102 24 191 158 -107 -288 -276 -26
5210 -26 -264 77 -132 -83 -171 237 -117 -8 -211 45 -259 -151 -30 -41 108 -222 -58 72 10 16 56 82 191
5233 191 342 15 -129 264 290 246 276 61 183 83 -187 -87 -216 -10 179 237 213 239 -52 -33 172 26
5255 26 -199 -74 -89 250 -108 328 -123 -87 2 100 -87 -315 -124 -179 -250 -96 -260 140 3 -121 38 17 124
5278 124 -155 -93 -55 -110 47 3 89 73 20 -267 107 356 -187 -69 46 -38 114 297 346 112 416 169 124
5301 124 -50 161 23 40 -111 -129 201 -78 -218 -103 15 -43 21 -246 -132 -280 -109 -327 190 -135 124
5322 124 -238 -386 -107 81 -166 -211 112 33 -115 -311 -59 55 -205 123 -114 -84 198 129 -148 -54 -63 270
5344 270 298 -75 477 69 61 24 -162 -116 174 10 50 71 130 198 75 213 -50 -96 -34 63 134 -37 -137 -59 79
$$ packed form
5187b38K39P2j77M68n11J25J50J05o1l17R7L7n4n7J33R1p8J67l3k65j81J2K50
5210b6k38L41k09M9q8M08l54J09k03K56l04J08J21j1J49l30J64J30o2OM0K6J09
5233A91J51l27j44L93K6m4L0k15J22j00k70J00j29K06J89N8k4K6k91J9K05j46
5255B6k25J25j5L39l58M36m51L6Q9R8j87k28J91n5p1J54j64M00j37j24J59k1J07
5278A24k79O2L8n5J57m4Q6j6n3k87L74K49n43J18J15q4J52J83M9k34L04k47m5
5301A24j74K11j38J7j51j8L30k79j40J15J18n8O4k67J14j48J71k18N17l25K59
5322A24l62j48K79J88k47m5L23p9j48j96K52J14k60L28k37L0K82o9k77R4rL33
5344B70K8l73N52m08ql7j86M6K90j64M0K1N9O8j23J38k63m6O2R7P1j71j00P8J38
$$ plain form
5369 79 -66 -233 -34 -248 42 -195 198 -19 -414 -76 -73 -116 40 -268 -197 -179 30 -420 -241 197 55 -47
5391 -47 -28 237 103 -250 229 121 260 0 -5 -3 284 37 80 245 339 109 -26 -153 -1 131 40 -114 -41
5414 -41 -123 212 273 -42 141 91 -253 139 -44 176 -189 -321 -242 62 22 -95 -30 -78 -271 -271 -122 -237 229
5437 229 -151 125 -263 -195 -284 -141 -41 -472 -58 -158 37 60 -24 56 18 -14 -27 170 -126 -6 -73 -94 245
5460 245 -221 -7 326 -45 9 65 186 211 236 -266 19 65 252 21 199 -40 -233 -106 -219 -152 -242 329
5482 329 -301 -201 -188 -5 83 33 18 -1 -35 -217 -17 -309 -311 -146 -16 82 52 -52 9 20 -27 -238 -134 -86 -44
5507 -44 149 299 -94 153 18 -192 -174 31 150 171 -262 157 180 68 189 38 77 68 250 -298 -4 122
5529 122 252 352 -119 68 12 -24 -201 130 348 -153 82 -270 -87 -194 -159 -276 -277 -188 -245 12 -29 17 -156
$$ packed form
5369G9j45j67J99k14K90k37L93k17l95L38Lm3J56l08P1J8K09m50J79M38j42j02
5391d7J9K65j34l53M79j08J39k60nKK87k47M3J65R4k30j35j27J52J32r1j54P3
5414d1q2L35O1l15J83n0l44L92j83K20l65j32P9L04m0j17O5m8j93%J49j15M66
5437B29l80K76l88O8q9J43J00m31M14j00J95K3q4Q0l8l2j3J97k96J20o7k1L39
5460B45m66K14L33l71N4N6J21K5K5n02K85M6J87k31J78k39j93J27j13O7r0N71
5482C29o30J00J3J83Q8n0j5j9l4j82K00k92kJ65J30R8l0j04O1J1m7k11J04M8M2
5507d4J93J50l93K47j35k10J8K05J19K1m33M19K3j12J21j51L9rJ82n48K94J26
5529A22J30J00m71J87n6l6j77L31K18n01K35l52J83j07L5j17jQ9n7K57m1M6j73
$$ plain form
5552 -156 -309 -20 -59 -100 -53 334 268 -14 106 -74 -121 120 53 4 -120 46 -114 256 -65 313 -19 131
5574 131 86 278 139 -113 -180 85 96 94 52 -98 244 157 -54 -38 93 106 -54 -73 -9 -206 294 -72 -430 -285
5598 -285 -360 -26 -85 12 -352 -353 77 -61 -337 -93 -120 -117 39 -119 -102 -92 309 60 -43 83 -290 -163 -9
5621 -9 196 -41 -235 140 -26 115 3 -22 -58 179 133 32 271 -171 -162 164 86 240 -169 208 -53 -27 15
5644 15 88 262 79 211 -157 -40 3 168 -83 -19 -40 -350 -189 -60 128 -223 -55 -6 -98 121 -137 -175 66
5667 66 -264 9 8 128 -130 18 -317 -90 -39 -297 -5 -12 148 111 98 -53 -11 -148 -27 143 67 35 -40 -12
5691 -12 126 33 -42 219 199 77 23 126 23 66 60 -78 140 53 146 43 215 88 82 110 -93 -152 72 407 252
5716 252 -52 28 -184 -50 211 -87 -2 -173 -184 37 36 49 236 -229 187 -71 -277 18 66 -11 -38 -314 -28
$$ packed form
5552a56j53K89l9m1M7L87o6k82J20j80m7K41o7m9j24J66j60L70l21L78l32J50
5574A31m5J92j39k52o7K65J1km2j50L42q7k11J6J31J3j60j9O4j97N00l66l58J45
5598b85p5L34n9R7l64jM30j38k76K44k7LJ56j58J7J0M01k49j03J26l73J27J54
5621iK05k37j94L75j66J41j12k5l6K37m6j01K39m42RL26p8J54m09L77k61K6M2
5644A5P3J74j83J32l68J17M3J65k51O4k1l10J61J29J88l51J68M9r2K19k58l8K41
5667F6l30K73jJ20k58J48l35K27N1k58K92pJ60l7j3j51M2j37J21J70p6l2p5K8
5691a2J38r3p5K61k0j22n4J03j03M3oj38K18q7R3j03J72j27oK8k03n9K24L35j55
5716B52l04Q0k12J34K61k98Q5j71j1K21jJ3J87m65M16k58k06K95M8p7k7k76K86
$$ plain form
5739 -28 -166 202 154 169 117 62 4 -42 -41 229 168 111 62 -231 -206 351 229 177 -36 65 29 116 153 530 -55 -139
5765 -139 40 -341 96 -249 -318 38 -40 -246 119 120 221 37 71 -101 -369 82 -205 118 -154 -77 -158 149
5787 149 -127 296 -74 145 121 -164 28 -95 4 92 -57 -59 326 197 103 317 191 -142 204 23 -161 -188
5809 -188 26 323 3 -244 27 94 -29 -163 169 114 122 239 -88 208 437 -229 16 -248 -79 46 -126
5830 -126 -34 -143 124 93 -293 -120 7 -174 57 254 -198 129 -17 -77 331 18 -305 -10 3 234 -68
5851 -68 0 -100 198 229 162 328 66 101 32 79 312 253 156 -25 18 90 0 176 -160 -29 -20 158 153 -130 -21
5876 -21 297 -419 -100 165 21 215 -234 202 133 77 -21 -111 -66 -84 83 -101 -368 -110 105 48 77 190 -323
5899 -323 -170 74 176 184 34 -43 34 -29 113 -350 -77 -70 302 -120 2 242 -51 -112 145 42 -87 41 223
$$ packed form
5739b8j38L68m8J5n2n5n8m6JK70o1n7m9k93K5N57j22n2k13J01l6Q7L7L77n85q4
5765a39J79l81M37l45o9L56p8k06L65JJ01j84L4j72k68M51k87L23k72P7q1L07
5787A49k76M23l70K19k4k85J92j23R9Q8j49kL85j29r4K14j26l33L46j81j84k7
5809a88K14K97l20k47K71O7j23j34L32n5QJ17l27K96K29o66K45k64J69J25j72
5830a26R2j09K67l1l86J73J27j81K31J97m52L27j46o0M08l13l23K95J3K31l02
5851f8O8j00K98L1o7J66k62L5o9M7K33n9r7j81M3P2r0J76l36J31RJ78nk83J09
5876b1L18p16L19K65j44J94m49M36o9n6r8r0M5j8J67j84k67K58K15n7K9J13n13
5899c23J53K44J02Qj50p7P7o3J42m63K73PL72m22J22K40k93o1K57j03j29J28J82
$$ plain form
5922 223 -93 75 115 -113 373 31 -255 -141 -156 89 -225 25 -190 132 13 -248 24 163 -51 34 -122
5943 -122 59 -206 94 -90 -10 -85 -7 -187 -59 -149 -157 -297 -203 -37 57 -33 105 -91 -161 48 -317 135 217 308
5967 308 -50 47 323 -1 2 -8 -38 218 217 2 -58 113 325 129 49 -83 37 -79 197 182 180 -52 180 102
5991 102 92 63 -113 -369 -24 -147 73 109 -43 -9 -15 24 -78 116 -108 211 -269 -35 84 -39 -89 21 122
6014 122 29 296 139 -92 200 303 28 90 -10 198 -3 182 -106 195 -126 202 11 -29 -4 -76 19 383
6036 383 1 -12 147 101 -167 -333 133 -141 197 74 -209 -236 -24 -75 215 -230 -59 -206 195 107 147 106
6058 106 -54 -180 -110 142 -112 -160 -298 -136 -54 -27 420 -86 15 21 23 240 -69 263 162 24 215 -324 -4
6081 -4 -68 115 292 10 399 -282 -94 1 68 -141 -121 126 -59 300 232 126 22 20 208 -166 86 143 97 311
$$ packed form
5922B23l16J68M0k28M86l42k86J14j5K45l14K50k15L22j19k61K72J39k14Q5j56
5943a22J81k65L00j84Q0p5P8j80J28r0qj40R4J66R4r0J38j96p0K09l65M52Q2R1
5967C08l58R7K76l24Lj0l0K56jk15o0J71K12j96q0j32J20j16K76j5kk32K32p8
5991A02j0k9j76k56L45j23K20L6j52L4oL9j02J94k24L19m80K34J19j23n0J10J01
6014A22r3K67j57k31K92J03k75O2j00K08k01J85k88L01l21L28j91m0K5p2R5L64
6036C83l82j3J59m6k68j66M66k74L38j23k83k7K12n1K90m45J71j47M01q8M0m1
6058A06j60j26P0K52k54m8j38J62Q2K7M47n06J01OKK17l09L32j01j38J91n39L20
6081do4J83J77k82L89o81J88R5O7k09K0K47j85L59o8j06j04kJ88l74K52N7m6K14
$$ plain form
6105 311 -322 8 -339 -112 -203 -153 130 151 -287 -111 250 2 167 61 -127 -44 -184 -133 -15 241 133 -63
6127 -63 198 -53 -61 85 0 -42 -16 135 -303 61 91 22 371 -40 211 -71 156 256 80 58 -37 109 -126
6150 -126 84 183 -67 366 -76 -125 -86 -194 283 -170 -220 -84 -585 -340 18 -51 -95 54 -206 -48 82 -204
6172 -204 -117 -106 -69 48 -127 -278 -82 71 -82 190 -56 -103 53 -196 154 7 97 48 -29 100 223 102
6194 102 54 -50 109 188 38 -134 267 239 -125 42 124 -59 23 124 -173 -144 -70 -132 57 52 339 45 -162
6217 -162 -61 -168 91 -134 -50 1 77 -5 -164 78 77 159 -159 -133 -335 223 195 -8 -109 -67 -47 88 28 -127
6241 -127 -8 14 109 -37 70 -15 -105 134 -51 -331 69 196 -91 41 259 -185 148 206 31 -51 98 69
6263 69 -76 30 38 42 -231 -236 69 -77 -32 -14 61 32 -122 -139 -166 -321 -89 -132 -171 -152 -24 -434 -254 -130 218
$$ packed form
6105C11o33L30l47K27r1N0K83K1m38J76L61k48J65j06j88Q3j40N1J18K56j08j96
6127f3K61k51qJ46q5m2K6J51m38L64L0o9L49m11K51k82K27J00j76k2r5J46k35
6150a26K10R9k50M33m42m9L9j08M77m53n0J36n01K45L58o9m4J49k60J58J30k86
6172b04Q7J1L7J17j75j51J96J53j53K72k46m7J56k49L50j47R0m9p7J29J23j21
6194A02m8j04J59P9j50j72M01k8l64J67Q2j83Q2J01k97K9P4o2J89nK87k94k07
6217a62J01j07K59k25Q4N1P6q2j59K42jQ2l18K6k02N58k8k03j01M2K0J35o0j55
6241a27J19K2R5j46J07q5r0K39j85k80M00J27k87J32K18m44L33N8j75q2J49k9
6263F9j45J06QMk73nL05j46M5J8P5k9j54j7k7j55K32m3l9J9J28m10J80J24L48
$$ plain form
6288 218 -302 85 97 58 -99 401 -132 -299 197 -29 30 62 -37 11 -23 -11 276 112 -123 -67 148 0 102
6311 102 178 45 299 -11 -115 -216 98 -127 289 -47 88 -121 -326 -147 88 -153 -212 -246 141 108 128 129
6333 129 -216 53 -154 -51 -186 96 -182 -152 45 93 -2 241 -89 -296 -32 -42 55 48 63 -46 90 -84 -28
6356 -28 43 191 15 102 309 91 418 -22 -2 -96 107 -44 -50 -188 44 -57 177 398 -190 71 119 60 20
6379 20 -33 53 -106 -70 199 -187 -35 196 -238 -151 -237 157 -29 8 114 17 92 140 293 -283 180 184 -60 -135
6403 -135 71 -54 -83 -190 -96 28 -216 -1 -205 -141 40 122 25 -38 96 202 -79 -66 -15 -78 323 38 -81
6426 -81 -76 -144 -102 300 -138 33 103 -168 87 207 -105 -153 289 -265 -237 -46 98 187 -22 -359 163 -289 98
6449 98 -14 57 18 -16 -104 -11 -91 -102 32 43 66 38 7 106 -265 -14 -100 -422 130 31 115 341 271 28 110 -98
$$ packed form
6288B18n20L87J2l9j57N00n33j67M96k26N9L2r9M8l4J2K87j64k35N6K15j48J02
6311A02P6j33K54l10j04j01L14k25M16l36J35k09k05J79K35k41n9l4L87l3K0J
6333A29l45K69k07J03j35K82k78L0J97M8r5K43l30k07K64j0R7pJ5j09J36j74N6
6356b8P1J48j76Q7K07k18L27m40K0r4K03j51oj38K32j01K34K21n88K61M8n9m0
6379B0n3Q6j59L6K69l86J52K31m34Q7q6L94j86L7J06r7P5M8J53n76M63Mk44p5
6403a35K06j25k9j07R4J24k44K15k04O4J81Q2r7o3J34J06k81J3N1o3M01k85j19
6426h1No8M2M02m38J71P0k71K55J20l12m8M42n54K8J91J44Q9k09l37N22m52L87
6449I8j12P1l9l4q8R3q0j1J34J1K3k8l1R9l71K51q6l22N52r9Q4K26p0k43Q2k08
$$ plain form
6475 -98 126 79 96 19 -22 -29 -54 166 50 -33 -25 -38 27 -42 121 181 -174 51 -91 -122 43 29 17 -177 27 -198
6501 -198 -27 -71 -81 -161 27 177 -113 57 36 -236 -314 369 -122 -219 118 -256 127 -95 -159 -32 172 102 30
6524 30 89 -269 157 303 -134 3 -71 81 56 -212 -56 -63 61 -27 -38 -62 47 49 -187 131 174 -12 28 260
6548 260 -173 0 85 -126 -41 -56 -177 38 -142 -34 -232 -41 32 -14 -130 -43 96 -124 4 56 -157 51
6570 51 -94 176 189 -213 -406 98 -380 -104 62 249 -148 222 73 75 175 -85 215 196 182 351 -160 -15
6592 -15 329 141 204 -13 205 -172 -33 13 -167 -104 -102 110 -253 -110 -119 -230 -122 41 128 -239 153 -199 87
6615 87 -323 -177 -46 164 1 -7 -166 37 28 -221 -165 29 -182 20 23 53 58 94 104 -102 103 262 161 167 45
6640 45 -186 71 -201 15 103 224 -175 401 92 -160 -268 46 -131 -104 9 -214 122 104 -131 -168 277 -88
$$ packed form
6475i8K24m7J7p7m1pk5K20j16q3Qj3O5o9J63O0l55K25j42l1J65j4j2j94K04k25
6501a98J71m4j0q0J88J50k90J70k1k72p8O83m91r7L37l74L83k22o4J27K04p0p2
6524C0N9l58M26J46m37J37p4J52k5k68J56pJ24q8j1k4J09Kk36L18M3j86M0K32
6548B60m33J73Q5k11Q5j5j21K15j80J08j98J91P3m6j16Q7J39k20J28N2k13K08
6570E1j45K70J3m02j93N04m78K76J66J87l97L70j49KJ00k60L00j9j4J69n11J45
6592a5L44j88O3k17K18l77J39M6j80O3KK12l63J43rj11J08J63Q7l67L92l52K86
6615H7m10J46J31K10j63qj59K03rk49N6J94k11K02LL0NL6J0k06K05J59j01Oj22
6640D5k31K57k72K16Q8J21l99N76l09k52j08L14j77K7J13k23L36j8k35l7M45l65
$$ plain form
6662 -88 197 96 -245 87 109 -286 -12 -236 12 366 -172 -30 108 326 -98 207 -41 204 211 107 63 -4
6684 -4 115 -145 192 58 77 165 26 28 -172 -233 -74 84 158 159 129 -141 -120 39 299 -44 -40 137 -82 243 -123
6709 -123 -59 66 -9 6 131 -19 58 71 183 -62 -98 82 -85 -501 -279 294 -247 -118 -88 -537 -182 61
6731 61 61 56 -99 186 -73 -43 -146 -31 -188 -178 -113 86 -126 -3 -185 -92 -118 280 -95 14 163 163 41 -161
6755 -161 -29 36 376 89 -361 -27 -69 52 -45 -28 54 4 -64 -244 66 173 -505 56 -128 -65 95 80 4
6778 4 -147 -120 84 50 -267 -85 -79 -78 4 19 168 -255 -20 -53 -27 286 -186 40 -108 -230 -28 -19 311 89 -38
6803 -38 141 261 271 186 3 -83 2 -14 542 -168 152 55 -171 -116 7 -133 -180 6 105 166 -102 -9 -249 30
6827 30 45 -5 -67 88 255 -221 -196 275 -31 -254 -18 160 112 -97 -221 36 -136 -266 56 157 -102 185
$$ packed form
6662h8K85j01l41L32K2l95K74k24K48L54n38J42J38K18m24L05k48K45Pj04m4o7
6684dJ19k60L37j34J9Q8j39Kk00o1J59J58P4Jl0k70K1J59K60l43MJ77k19L25l66
6709a23O4J25p5J5J25j50P7J3J12k45l6J80j67m16K22N73n41J29L0m49L55K43
6731F1%nj55K85k59L0j03J15j57J0O5J99k12J23j82R3k6L98l75J09J49%j22k02
6755a61J32O5L40k87m50L34m2J21r7J7Q2n0o8j80L10J07o78N61j84O3J60j5p6
6778Dj51K7K04l4l17J82OJQ2J5J49m23K35l3K6L13m72K26j48j22K02RL30k22j27
6803c8J79J20J0q5j83q6Q5j6N56p10L20r7k26N5J23j40m7J86R9O1k68R3k40K79
6827C0J5n0o2J55J67m76K5M71l06k23K36J78m8k09j24K57j72j30L22J01k59K87
$$ plain form
6849 185 36 -101 98 86 -11 -7 33 184 89 -59 -169 231 -389 74 100 50 56 223 -238 280 -72 -354 288
6872 288 11 82 -140 50 130 78 -79 123 -110 -318 79 20 -180 -80 -21 -60 17 -137 -18 -283 -85 -116 -215
6895 -215 -85 232 -96 -61 -38 -7 -61 -107 -214 -68 -172 -4 2 179 371 260 -271 75 -73 139 -42 43 -9
6918 -9 -2 -94 -150 246 47 60 18 21 56 146 -2 132 -286 277 285 77 -163 118 106 -156 -87 298 266 48 53 105 -248
6945 -248 -154 -277 13 190 -9 31 -4 184 -66 -213 -14 -101 -127 -229 -68 196 191 356 -87 -43 -142 9 167
6968 167 343 -114 -19 13 156 -97 -107 73 357 117 131 117 -232 -32 -48 35 151 -10 299 201 -218 32 183
6991 183 -208 34 -13 -118 22 -47 -270 92 111 -31 -185 99 -34 187 -378 85 299 -20 366 -182 -221
7012 -221 -261 121 14 -325 115 -155 -218 -161 -170 -50 -103 82 91 -325 88 -53 -283 38 133 266 118 -237 -31
$$ packed form
6849A85j49j37J99j2r7MM0J51r5j48j10M00o20M63K6n0OJ67m61N18l52k82O42
6872B88k77P1k22J90Q0n2j57K02k33k08L97n9k00J00N9l9P7j54J19k65J98l1r9
6895b15J30L17l28L5K3L1n4m6j07J46j04J68OJ77J92j11n31L46j48K12j81Q5n2
6918iPr2n6L96j99J3m2LL5R0j48J34m18N63Qk08k40K81j2k62O9L85l2k18NN2l53
6945b48R4j23K90J77j99M0l5J88k50j47J99q7k6j02J61K64nJ65m43M4r9J51J58
6968A67J76m57R5L2J43k53j0J80K84k40J4j4l49K00j6Q3J16j61L09r8m19K50J51
6991A83l91K42m7j05J40o9k23L62J9j42j54K84j33K21n65M63K14l19L86n48l9
7012b21m0L82j07l39M40k70o3N7rJ20n3J85Rm16M13j41k30L21R5J33j48l55K06
$$ plain form
7035 -31 0 -7 38 255 258 40 -114 42 -36 -22 31 60 258 -95 66 53 390 0 93 -37 111 -54 -38 -197 381
7060 381 -68 -262 -109 58 -257 86 34 -212 32 -136 306 47 -16 19 -22 26 -236 -128 -209 -1 5 -56 183
7083 183 40 -117 94 115 48 -206 -111 304 194 -92 -7 178 47 180 -248 203 320 225 174 -94 179 -152
7105 -152 -5 -114 -92 -33 -301 -242 46 -278 104 125 -56 162 -184 223 -43 247 -74 9 -106 -137 154 56
7127 56 108 -240 90 267 97 -100 -131 104 437 -165 112 120 391 123 -56 -128 116 -153 -70 -44 -21 -65 -109 182
7151 182 156 -108 165 -10 -39 -137 -57 -22 -181 143 81 26 -186 -208 -57 161 -72 24 -136 -70 169 -24 -181
7174 -181 -164 114 -449 200 -166 -24 -38 -80 -274 84 -246 -144 -191 -325 139 76 241 -32 -114 -173 -98 16 242
7197 242 -108 107 128 232 106 231 175 -179 73 -118 18 -96 357 16 -103 2 171 132 -167 52 274
$$ packed form
7035c1L1pM5K17Lk18j54J56p8J4N3K9J98l53J61j3L37l90R3j30J48j65J6j59N78
7060C81m49j94J53J67l15L43n2k46K44j68M42k59o3L5m1M8k62J08q1K08Oo1K39
7083A83j43j57K11K1o7k54R5M15j10k86Q5J85j31J33m28M51J17r5n1k68K73l31
7105a52J47j09K2N9k68N9K88l24L82K1j81K18l46M07k66K90l21Q3j15l1K91r8
7127E6N2l48L30J77j70j97l1K35L33o02K77QK71k68j79p2K44k69Q3K6K3m4m4K91
7151A82k6k64K73j75k9r8Q0L5j59L24o2n5k12k2J51K18k33R6j60O6K39j93j57
7174a81J7K78n63O49l66J42j4m2j94L58l30J02m7j34M64o3J65k73q2n9P5J14K26
7197B42l50K15K1J04j26J25n6l54K52j91J36j14M53l41j19J05J69l9k99K19K22
$$ plain form
7218 274 -244 -33 232 -136 -2 120 102 -94 22 51 280 -188 -100 51 -59 -4 174 108 168 11 169 -160
7240 -160 -302 134 -105 -247 30 160 -8 -24 -78 -42 -115 -9 242 -46 -206 -157 -346 155 76 65 -99 -107 -16
7263 -16 185 104 -199 -22 -23 79 3 -36 124 31 -251 -148 18 -75 296 -27 -66 -148 -202 103 -127 -61 127 -99
7287 -99 -125 -3 -28 34 -170 -235 29 157 109 52 145 147 -47 -59 19 74 117 -110 -264 -141 -208 -138 -63 -187 -35 -148
7313 -148 254 -104 -148 90 -48 99 -21 -169 123 56 258 -282 165 187 417 71 -257 -105 77 31 -63 228
7335 228 -104 -91 -20 -152 -217 7 204 33 17 133 -124 30 166 183 -90 -201 -416 92 -272 121 -289 -86
7357 -86 -142 34 583 156 -39 173 -75 -21 -43 182 200 128 -76 -55 29 109 254 -159 100 72 -22 -86 -65 40
7381 40 37 114 41 -239 69 305 241 -87 -84 -220 -6 -159 142 -222 -115 57 231 -124 -89 41 -8 -327 52
$$ packed form
7218B74n18K11K65l68J34J22j8j96J16K9K29m68Q8J51j10N5J78o6O0j57J58l29
7240a60j42M36k39j42K77J30j68j6n4L6p3J06K51k88j60M9j89N01p9j1j64qR1
7263a6K01q1l03J77jJ02p6l9J60r3k82J03J66r3L71l23l9q2n4L05k30O6J88k26
7287i9k6J22k5O2k04o5K64J28m8n7R3Kj94j2P8N5M3k27j54J23o7P0P5j24J52j13
7313a48M02l58m4K38j38J47j20j48K92o7K02n40M47K2K30l46l28J52J82m6r4K91
7335B28l32J3P1j32o5K24J97j71j6J16k57J54J36J7k73j11k15N08l64L93m10K03
7357h6n6J76N49m27j95K12k48N4k2K25J8p2k04K1Q4Q0J45m13K59k8r4o4K1J05
7381D0lP7p3k80L08K36o4l28Lj36K14j53L01l64J07J72J74l55L5J30m9l19L79
$$ plain form
7404 52 -307 -22 50 -87 -34 -111 87 -61 -64 120 -95 120 -13 141 33 198 175 141 201 -139 -72 90 -74
7427 -74 -159 116 93 -76 126 258 -69 -50 -85 -136 -28 86 2 185 -8 29 -47 155 -2 6 -27 96 -22 -166
7451 -166 309 -114 -81 212 -97 -87 -319 84 197 -19 -5 -138 60 -102 10 172 32 139 -111 -184 222
7472 222 231 422 -71 144 -59 97 12 17 103 -24 166 98 188 64 -30 -7 184 16 74 84 -269 -267 -49 228 -69
7497 -69 130 262 -87 -87 -46 181 164 -225 122 -276 -69 -152 -190 -304 1 31 -133 9 -121 -51 -401 275 -39
7520 -39 -85 -226 -199 266 334 288 -14 -201 -32 213 -150 74 -9 70 -102 58 94 280 75 14 -27 55 241 -139
7544 -139 307 205 130 194 55 0 131 -64 77 -348 45 72 118 -53 79 157 -79 -125 259 -136 8 14 -148
7567 -148 -74 -190 -2 -181 37 -172 -152 105 -61 198 76 -105 86 75 61 127 10 140 -155 160 29 -63
$$ packed form
7404E2l59K85P2j37N3p7J98j48lJ84k15K15j33J54j08J65k3l4O0l40O7J62j64
7427g4q5K75k3j69K02J32l27J9l5n1J08J14q4J83j93L7p6K02j57Ql3J23j18j44
7451a66M75m23L3K93l09J0k32M03J13k16J4j33J98j62J12J62j40J07k50p3M06
7472B22RJ91m93K15k03J56q5NQ6j27J90o8R0j24r4K3J91j68N8J0l53KK18K77k97
7497f9J99J32l49%M1K27j7l89L47l98K07q3l8j14L05L0j64J42j30P0l50O76l14
7520c9m6j41K7M65O8m6l02j87J69K45l63K24q3P9j72J60L6J86k05o1m1Q2J86l80
7544a39M46j02p5O4j39n5J31j95J41m25L93K7M6j71J32P8k36m6L84l95J44Oj62
7567a48P4j16J88j79K18k09K0K57j66K59j22j81J91j1j4O6j17J30k95L15j31r2
$$ plain form
7589 -63 -14 364 52 -364 -33 -182 8 -192 24 -190 115 59 -17 84 75 155 78 -52 -131 151 73 -429 172
7612 172 -39 -73 -365 104 55 -87 -247 -79 -57 -90 78 64 302 -206 -97 -194 -57 -45 -91 88 -136 41 321
7635 321 -188 -176 -119 307 -38 -116 10 34 -94 136 -305 66 152 -140 -101 176 141 -3 15 279 125 -267 -19
7658 -19 171 -32 -227 -69 -390 115 27 286 115 -110 102 213 -4 -77 -65 -332 -206 -47 -132 -1 -266 -193
7680 -193 -86 425 77 -66 -5 -124 101 -180 63 -204 -109 -348 -236 246 332 -181 -43 95 -55 7 219
7701 219 -98 -94 153 173 -29 -111 -167 -20 198 212 -225 -86 133 -209 24 -89 -111 -20 -119 47 80 -179 -21
7724 -21 111 280 -108 -174 -264 24 112 -49 -326 -179 -31 -39 509 66 161 228 -309 -305 84 -187 -52 -96 246 155
7748 155 -107 -243 197 -134 -108 93 62 94 -99 -49 168 73 -134 -49 -97 -31 213 -110 -163 -163 51 67 1 -264
$$ packed form
7589f3M9L78l12m16L31j49J90k00K16k14L05n6p6J01rQ0p7j30p9K82p8n02O01
7612A72k11l4k92M69m9j42j60J68K2l3J68j4K38n08J09r7J37J2m6J79k24J77K80
7635C21n09J2N7M26l45p8J26K4j28K30m41L71Q6k92L9K77l5j44J8K64j54l92K48
7658a9J90k03j95J58l21N05q8K59j71k25K12J11k17p3J2k67J26J59q5J31k65P3
7680a93J07N11l48j43O1j19K25k81K43k67R5k39J12M82Q6n13J38J38j50O2K12
7701B19l17MK47K0k02q2n6J47K18J4m37J39K19l42K33j13k2R1r9J66L3k59J58
7724b1J32J69l88o6r0K88Q8j61k77J47J48qN48m43R5O7n37ML89k71J35m4L42r1
7748A55k62j36M40l31K6K01l1L2j93N0K17r5k07Q5m8O6K44l23n3%K14J6o6k65
$$ plain form
7772 -264 -180 109 367 -230 219 157 255 275 -33 2 -338 225 81 132 122 160 -170 32 -173 244 162 106 -172
7795 -172 26 -11 227 -112 15 -126 -290 -41 154 -198 -409 -36 12 94 157 35 283 37 61 125 31 171
7817 171 9 -146 -64 -17 173 -277 -5 -128 108 33 -150 147 -13 -93 -81 113 -282 249 -124 7 206 149
7839 149 -48 16 -170 -183 96 -182 -351 -187 -113 -29 -160 -234 -318 67 262 138 -266 122 70 -50 0 -141 81
7862 81 92 -63 -207 -193 -88 253 -116 -72 4 -11 -169 -75 31 83 -124 -90 32 -275 199 -96 174 -63 193
7885 193 232 303 -14 -22 364 30 -140 20 102 19 -78 -525 -12 -129 -91 -2 -82 63 -177 208 130 38 207 33
7909 33 -121 -105 86 -73 -25 -111 220 -52 -38 -154 0 146 -67 -259 -243 -118 -77 -119 113 135 -28 222 -86
7932 -86 -109 202 -83 -347 -59 97 -23 -88 21 200 111 -96 181 221 127 -139 97 -373 0 78 238 9
$$ packed form
7772b64Q4K89K58n97M49o2R8K0l08L5l40N63j44N1j0L8l30K02k05M17q2n6k78
7795a72J98l7K38l39J27j41j64K49J95l52k11L73M8Q2O3j22K48k46K4O4r4J40
7817A71j62j55Q2M7J90m50K72j23K36p5j83K97j60q0J2J94l95N31l73J31J99n7
7839A49j97O4j86j3K79k78j69J64P4Q4j31p4q4L85J95j24m04L88n2j20N0j41K22
7862H1J1j55j44J4J05L41l69M4P6j5j58R4J06N2k07L4J22l07M74k95K70k37K56
7885A93L9P1l17qL86l34j70J60Q2q3r7m47N13j17L8Q9q0J45k40L85p8r2J69j74
7909C3j54J6J91j59M8q6L31k72J4j16J54J46k13j92J6J25M1m2K32K2j63K50l08
7932h6k3L11k85k64K88J56j20o5J09J79q9k07K77M0r4k66K36m70L73P8J60k29
$$ plain form
7954 9 -349 39 33 -144 -11 187 9 -84 57 -120 -84 -224 -116 49 24 -35 -208 -174 -116 55 372 107 78 141
7978 141 31 -29 -250 106 33 19 222 -71 -220 -136 -23 -81 273 -75 -87 -17 -116 8 61 -115 38 -146 118
8001 118 182 -267 75 -138 -9 -50 105 -23 126 -89 -178 -218 67 -142 474 -135 -286 -245 86 53 -244 -142
8023 -142 -110 291 -61 -45 -201 49 -71 56 -109 -29 -210 156 91 133 95 72 252 -89 165 85 -151 124 -208
8046 -208 -131 85 112 -83 56 -25 -165 197 -24 189 63 -27 2 -192 136 100 -120 47 -226 353 -20 -148
8068 -148 202 23 -164 53 -19 104 -209 62 394 -203 -19 16 -171 291 230 60 196 150 195 -37 -222 -96
8090 -96 -149 -253 -94 -129 -158 63 -118 276 -19 27 77 -182 -108 -147 -126 158 -115 141 -133 -179 141 -221 -84
8113 -84 -84 84 -17 -169 -45 -373 -203 97 61 43 95 -113 -49 -204 -229 -61 -30 167 85 86 -97 -117 103 22 -180
$$ packed form
7954Il58L88oj77J33J98j78r3J41j77L6j40J08J65k5n9j73L4N8J71L17k65k9O3
7978A41j10o0k21L56p3j4K03k93j49Q4J13n8L54l48j2P0r9J24N3j76J53j84K64
8001A18O4m49L42k13J29m1J55j28J49k15q9m0K85k09O16o09j51M1L31l3k97J02
8023a42L2M01l52J6j56K50j20J27j65Q0j81L66o5M2l8k3J80l41K54q0k36K75l32
8046b08P7K16K7j95J39q1j40L62k21K13j26r0K9j94L28l6k20J67k73N79l73j28
8068a48L50j79j87K17p2J23l13K71L32n97J84L5j87M62o1j70J36m6M5k32j85J26
8090i6n3j04J59l5k9K21j81L94k95M6N0k59P4l9K1K84k73K56k74m6L20l62J37
8113h4%J68j01j52J24l28J70L00l6j8N2k08O4j55k5J68L1J97q2Jj83k0K20q1k02
$$ plain form
8138 -180 -9 66 190 -145 -212 -300 -212 9 77 -226 -62 189 54 18 283 7 200 -12 50 -37 -50 178 9
8161 9 -74 148 52 -36 296 82 6 135 105 -84 -26 -4 -9 -129 -213 -35 231 76 17 356 -106 209 11 23 114
8186 114 -189 -1 171 24 -131
$$ packed form
8138a80J71P5J24l35o7q8Q8K21O8l03J64K51j35l6K65k76J93k12O2q7j3K28j69
8161Iq3K22r6q8L32k14p6J29l0j89N8K2nj20q4J78K66j55n9L39m62L15j98J2R1
8186A14l03J88J72j47j55
8191a31
$$ Imaginary data points
##PAGE= N=2
##DATA TABLE= (X++(I..I)), XYDATA
$$ plain form
0 0 0 0 0 0 0 0 0 0 0 0 0 0 0 0 0 0 -1 4 -7 8 -8 8 -8 9 -12 15 -16 17 -20 23 -25 29 -32 37 -38 44 -49 53 -61 67
40 67 -73 81 -90 100 -111 123 -136 153 -170 192 -218 247 -284 332 -395 482 -612 821 -1229 2302
60 2302 -11286 -24624 -5014 202 -10049 -17379 -7195 -4036 -11903 -15947 -7992 -5393 -11002 -13996
74 -13996 -9080 -6652 -9243 -10430 -8170 -7215 -7564 -7743 -6475 -6154 -5181 -5284 -5231 -4563 -2935 -3224 -3434 -2720
92 -2720 -1574 -1095 -1172 -1215 -381 440 141 -400 453 1396 1060 127 391 2257 1520 -343 815 2855 1529
111 1529 -745 593 2589 985 -930 971 2840 563 -782 1639 2965 761 77 2634 3305 943
127 943 1159 3681 3857 2168 3054 5285 4676 3442 5326 6863 5613 5285 6722 7875 6841 7015 8519
144 8519 8705 7975 8427 9299 9342 8482 8757 9648 9320 8417 8828 8596 8496 7942 7731 7623 7450 6274 5901 6044
$$ packed form
0@%%%%%%%%%%%%%%%%jNj1J5j6J6j6J7k1K7l1L3l7M3m8N4o1O9p5Q2r3J02j14J28
40F7j40J54j71J90k11K34k59K89l23L62m10M65n31O16p27Q77j094J433k050L531
60B302j3588j3338J9610N216j0251p330J0184L159p867m044P955K599n609k994
74a3996M916K428k591j187K260R55l49j79J268L21R73j03N3O68J628k89k10P14
92b720J146M79p7m3Q34Q21k99n41Q53R43l36r33K64J866p37j863J158K040j326
111A529k274J338J996j604j915J901J869k277j345K421J326k204o84K557O71k362
127I43K16K522J76j689Q86K231o09j234J884J537j250l28J437J153j034J74J504
144H519J86p30M52Q72M3q60K75Q91l28r03M11k32j00n54k11j08j73j176l73J43
$$ plain form
164 6044 5451 3984 3970 4205 2975 1815 1718 2180 1206 -122 154 337 -684 -2260 -1418 -840 -2467 -2870
182 -2870 -2080 -1772 -3188 -3767 -2372 -2151 -3435 -2823 -1832 -2319 -2957 -1975 -758 -1610 -1986 -601 127 -978
200 -978 -951 471 1122 -2 404 1549 1592 898 755 1699 1881 868 818 1639 1177 439 623 911 472 -274
220 -274 -29 -158 -767 -1497 -1288 -894 -1604 -2290 -2462 -2183 -2746 -3458 -3367 -2642 -3234 -3876 -3058 -3167 -3997 -4118 -3245
241 -3245 -3199 -3829 -3339 -2182 -2670 -3118 -2562 -1117 -1220 -2307 -1310 -100 -575 -659 110 1033 759 336 1020
260 1020 1388 1365 1483 1973 2280 1814 1418 2083 2071 1271 1401 1859 1596 563 659 868 830 -228 -232 -157 -570 -1425
282 -1425 -1403 -1100 -1696 -2373 -2498 -2506 -3170 -3459 -3263 -3194 -3575 -4190 -3600 -3495 -4070 -3998 -2917 -3105 -3751 -3451 -2593
303 -2593 -2699 -2759 -2392 -1649 -1596 -2424 -1092 -214 -298 -823 -42 672 181 299 1283 1390 989 665 1875 2013
$$ packed form
164F044n93j467j4K35j230j160r7M62r74j328K76J83j021j576Q42N78j627m03
182b870P90L08j416n79J395K21j284O12R91m87o38R82J217q52l76J385P28j105
200i78K7J422O51j124M06J145M3o94j43R44J82j013n0Q21m62p38J84K88m39p46
220b74K45j29o09p30K09L94p10o86j72K79n63p12R1P25n92o42Q18j09q30j21Q73
241c245M6o30M90J157m88m48N56J445j03j087R97J210m75q4P69R23k74m23O84
260A020L68k3J18M90L07m66l96O65j2q00J30M58k63j033R6K09l8j058mP5m13q55
282a425K2L03n96o77j25qo64k89J96O9l81o15N90J05n75P2J081j88o46L00Q58
303b593j06o0L67P43N3q28J332Q78q4n25P81P14m91J18R84J07m01l24J210J38
$$ plain form
323 2013 1123 1344 1693 1723 1523 1288 1788 1336 589 764 1309 649 -48 40 207 -177 -1085 -667 -357 -1080 -1782
344 -1782 -1167 -1233 -1797 -2198 -1642 -1427 -2085 -2214 -1831 -1738 -2060 -1974 -1348 -1319 -1520 -1316 -574 -403 -590 -455 461
365 461 389 114 837 1158 1134 1012 1524 2070 2063 1919 2555 2545 1969 2085 2769 2474 2136 2305 2311 2393 1941 1738 1809
388 1809 1775 1035 1272 1435 845 512 258 218 -155 -775 -616 -416 -1049 -1441 -1178 -1284 -1672 -1352 -1412 -1461 -1900
409 -1900 -2132 -1473 -1013 -1775 -1632 -1029 -1021 -1082 -787 38 4 -231 -234 580 696 525 806 1636 1393 1336 1652 1942
431 1942 1786 1822 2183 2368 2192 2007 2204 2254 2091 1797 2281 1925 1556 1461 1547 1529 855 438 736 511 47 -227
453 -227 5 -243 -941 -835 -566 -906 -1448 -1192 -660 -1319 -1452 -1060 -747 -1344 -1339 -879 -956 -868 -846 -176 87 -287
475 -287 248 414 798 735 991 1515 1320 1628 1696 2394 2130 1846 2756 2817 2499 1925 2851 2858 2098 2075 2492 2435 2006
$$ packed form
323B013q90K21L49L0k00k35N00m52p47J75N45o60o97Q8J67l84r08M18L10p23p02
344a782O15o6n64m01N56K15o58j29L83R3l22Q6O26K9k01K04P42J71j87J35R16
365D61p2k75P23L21k4j22N12N46pj44O36j0n76J16O84k95l38J69OQ2m52k03P1
388A809l4p40K37J63n90l33k54m0l73o20J59K00o33l92K63j06l88L20o0m9m39
409a900k32O59M60p62J43O03Qo1K95Q25l4k35lQ14J16j71K81Q30k43n7L16K90
431A942j56L6L61J85j76j85J97N0j63k94M84l56l69r5Q6j8o74m17K98k25m64k74
453b27K32k48o98J06K69l40n42K56N32o59j33L92L13n97NM60p7Q8K2O70K63l74
475b87N35J66L84o3K56N24j95L08O8O98k64k84R10O1l18n74R26Pp60k3M17n7m29
$$ plain form
498 2006 1760 2044 2059 1338 992 945 943 214 463 264 -341 -373 -354 -223 -1023 -1325 -1141 -1084 -1555 -1714 -1560 -1854
520 -1854 -1658 -2032 -1917 -1402 -1711 -1778 -1061 -1237 -1703 -1368 -587 -454 -578 -478 -83 222 6 445 555 651 513
541 513 987 1175 889 889 1529 1597 1363 1376 1553 2016 1214 1062 1286 1541 1009 666 1010 710 615 114 183 82
563 82 -531 -288 -673 -896 -1515 -1225 -1151 -1745 -1916 -1537 -1309 -1779 -2253 -1878 -1551 -2087 -1811 -1831 -1336 -1672 -1683 -1125
585 -1125 -999 -1278 -1106 -785 -623 -548 -754 151 -78 114 190 459 459 346 863 1130 692 661 690 931 583 286
607 286 848 803 479 100 61 -84 -126 -213 -232 -564 -1200 -1089 -827 -1765 -2150 -2052 -1968 -2507 -2903 -2774 -2546 -3266 -3399
630 -3399 -3141 -3118 -3576 -3810 -3077 -3387 -3461 -3108 -3383 -3364 -3202 -3142 -2792 -2440 -2647 -2151 -1970 -1737 -1801 -1299 -1067 -1192
652 -1192 -1139 -500 -252 -350 -486 65 630 514 356 652 869 944 626 1056 1331 793 888 886 912 806 550 745
$$ packed form
498B006k46K84J5p21l46m7kp29K49j99o05l2J9J31q00l02J84N7m71j59J54k94
520a854J96l74J15N15l09o7P17j76m66L35P81J33j24J00L95L05k16M39J10R6j38
541E13M74J88k86%O40O8k34J3J77M63q02j52K24K55n32l43L44l00r5n01O9j01
563H2o13K43l85k23o19K90P4n94j71L79K28m70m74L75L27n36K76k0M95l36j1N58
585a125J26k79J72L21J62P5k06R05k29J92P6K69%j13N17K67m38l1K9K41l48k97
607B86N62m5l24l79l9j45m2q7j9l32o36J11K62r38l85R8Q4n39l96J29K28p20j33
630c399K58K3m58k34P33l10p4L53k75J9J62O0L50L52k07M96J81K33o4N02K32j25
652a192N3O39K48r8j36N51N65j16j58K96K17P5l18M30K75n38R5kK6j06k56J95
$$ plain form
674 745 829 671 61 593 430 173 244 572 273 229 65 324 -49 98 223 610 554 310 850 901 497 923
696 923 1139 1587 1256 1582 1943 2104 2188 2092 2770 2689 2487 2860 3025 3398 3178 3412 3866 3691 4062 3692 4113
717 4113 4256 3596 3818 4185 3717 3484 3210 3270 3013 2775 3101 2681 2256 2133 2158 1725 1054 1213 958 997 358
738 358 431 521 202 -145 -230 -162 -658 -715 -861 -519 -1185 -1179 -1239 -837 -1128 -1078 -1151 -1013 -825 -950 -713 -738 -812 -518
762 -518 -316 -103 -197 -152 227 8 63 29 373 39 318 430 459 379 337 153 293 118 -127 -18 -123 -356 -96
785 -96 -316 -583 -833 -769 -535 -849 -1282 -1325 -1066 -1199 -1601 -1622 -1208 -1500 -1695 -2058 -1480 -2048 -1942 -1573 -1543 -1963
807 -1963 -1531 -1372 -1326 -1430 -1008 -869 -777 -665 -777 -398 -195 -129 323 263 373 394 342 575 948 654 914 1062
829 1062 592 913 831 913 844 747 621 752 418 254 474 411 89 -37 -46 -214 -452 -1090 -505 -789 -1078 -1167 -1096
$$ packed form
674G45Q4j58o10N32j63k57P1L28k99m4j64K59l73J47J25L87n6k44N40N1m04M26
696I23K16M48l31L26L61J61Q4r6O78q1k02L73J65L73k20K34M54j75L71l70M21
717D113J43o60K22L67m68k33k74O0k57k38L26m20m25j23K5m33o71J59k55L9o39
738C58P3R0l19l47q5O8m96n7j46L42o66Oo0M02k91N0p3J38J88j25K37k5p4K94
762e18K02K13r4M5L79k19N5l4L44l34K79J12K9q0m2j84J40j75k45J09j05k33K60
785i6k20k67k50O4K34l14m33m3K59j33m02k1M14k92j95l63N78n68J06L69L0m20
807a963M32J59M6j04M22J39R2J12j12L79K03O6M52o0J10K1n2K33L73k94K60J48
829A062m70L21q2Q2o9r7j26J31l34j64K20o3l22j26rj68k38o38N85k84k89q9P1
$$ plain form
852 -1096 -1203 -1574 -1886 -1584 -1590 -1775 -1911 -1709 -1645 -1813 -1647 -1638 -1868 -1543 -1303 -1439 -1156 -1481 -942 -867 -929 -637
874 -637 -502 -562 -120 -282 268 159 -198 401 473 640 341 550 277 591 364 645 635 621 367 369 351 296 217
897 217 157 87 29 -324 -292 -206 -329 -688 -668 -530 -795 -941 -738 -952 -1038 -1293 -661 -1072 -747 -678 -1037 -435 -732
920 -732 -639 -228 -203 -566 -58 150 -109 352 421 562 594 626 753 1263 1018 1038 1810 1342 1429 1950 1811 1328 1349
943 1349 1913 1988 1500 1434 1904 1898 1592 1281 1395 1451 777 991 651 773 761 348 278 431 178 4 40 -172 -270
966 -270 -363 -489 -661 -886 -771 -537 -824 -855 -457 -468 -619 -455 -494 -408 -343 -438 -437 97 30 -63 117 639 341 522
990 522 540 949 537 849 885 973 1091 1008 1277 991 990 1048 994 708 566 891 1210 521 617 609 492 171 149 -89
1014 -89 -72 -6 -319 -510 -513 -994 -828 -998 -1078 -1302 -1402 -1040 -1176 -1457 -1407 -1010 -964 -1105 -1051 -1120 -824 -985 -761
$$ packed form
852a096j07l71l12L02oj85j36K02O4j68J66Rk30L25K40j36K83l25N39P5o2K92
874f37J35o0M42j62N50j09l57N99P2J67k99K09k73L14k27K81j0j4k54Kj8n5p9
897B17o0p0n8l53L2Q6j23l59K0J38k65j46K03k14q6k55O32m11L25O9l59O02k97
920g32R3M11K5l63N08K08k59M61O9J41L2L2J27N10k45K0P72m68Q7N21j39m83K1
943A349N64P5m88o6M70ol06l11J14N6o74K14l40J22j2m13p0J53k53j74L6k12r8
966b70r3j26j72k25J15K34k87l1L98j1j51J64l9Q6O5r5JN34o7r3J80N22k98J81
990E22J8M09m12L12L6Q8J18q3K69k86jN8n4k86j42L25L19o89R6qj17l21k2k38
1014h9J7O6l13j91lm81J66j70q0k24j00L62j36k81N0L97M6j41N4o9K96j61K24
$$ plain form
1037 -761 -397 -752 -473 -254 -108 -473 -202 258 216 331 357 543 647 491 585 1069 829 612 1083 878 818
1058 818 925 1100 1004 641 469 943 890 861 210 476 212 19 0 -445 -173 -190 -400 -323 -545 -436 -718 -732
1080 -732 -1075 -755 -871 -613 -1097 -912 -931 -482 -899 -1016 -816 -445 -538 -428 -527 -300 18 -153 30 333 487
1101 487 50 478 494 659 851 610 837 792 896 1426 1113 997 1050 1100 815 838 1020 1199 998 916 722 743
1123 743 297 214 333 -22 145 -38 -132 -256 -311 -621 -450 -504 -669 -482 -661 -769 -1099 -798 -858 -1238 -966 -786
1145 -786 -755 -759 -888 -667 -308 -742 -213 89 122 -135 105 135 160 276 88 471 484 470 722 888 883 653 554 605
1169 605 701 859 713 734 711 351 585 657 383 101 200 232 -111 -3 -111 -426 -242 -699 -351 -648 -1230 -1015
1191 -1015 -863 -920 -969 -1262 -1009 -1052 -1081 -1078 -1362 -966 -1078 -1279 -1095 -788 -940 -853 -461 -570 -398 -429 -508 -304 -245
$$ packed form
1037g61L64l55K79K19J46l65K71M60m2J15K6J86J04j56R4M84k40k17M71k05o0
1058H18J07J75r6l63j72M74n3k9o51K66k64j93j9m45K72j7k10P7k22J09k82j4
1080g32l43L20j16K58m84J85j9M49m17j17K00L71r3J10r9K27L18j71J83L03J54
1101D87m37M28J6J65J92k41K27m5J04N30l13j16N3N0k85K3J82J79k01q2j94K1
1123G43m46q3J19l55J67j83r4j24n5l10J71n4j65J87j79j08l30L01o0l80K72J80
1145g86L1mj29K21L59m34N29L02L3k57K40L0K5J16j88L83J3j4K52J66nk30r9N1
1169F05R6J58j46K1k3l60K34P2k74k82R9L2l43J08j08l15J84m57L48k97n82K15
1191a015J52n7m9k93K53m3k9Lk84L96j12k01J84L07j52Q7L92j09J72l1p9K04N9
$$ plain form
1214 -245 -85 156 290 421 447 505 424 645 631 818 642 869 799 853 962 591 665 402 580 404 450 816 443
1237 443 359 250 178 117 -157 -308 -25 -384 -286 -271 -548 -428 -512 -673 -896 -752 -471 -283 -694 -604 -444 -431 -462
1260 -462 -236 211 -95 -94 -247 -75 212 217 286 484 325 596 988 1059 741 1192 1165 1013 1336 926 1215 1307 1111
1283 1111 1416 1269 1122 1139 1159 874 741 647 927 585 532 479 429 275 -210 10 37 -481 -885 -574 -580 -481 -806
1306 -806 -937 -800 -841 -954 -784 -715 -1028 -684 -643 -806 -685 -674 -554 -763 -743 -444 -205 -166 44 69 -135 260
1328 260 -56 213 728 549 393 285 473 596 578 557 793 486 320 513 833 204 286 338 273 62 114 -105
1350 -105 21 -102 -639 -124 -320 -606 -759 -610 -542 -1094 -917 -827 -930 -720 -817 -947 -1058 -928 -927 -1027 -782 -983
1372 -983 -720 -652 -663 -560 -242 -321 -41 -60 50 149 215 163 552 588 406 799 699 945 880 950 911 829 1257 793
$$ packed form
1214b45J60K41J34J31K6N8q1K21j4J87j76K27p0N4J09l71P4k63J78j76M6L66l73
1237D43q4j09p2o1k74j51K83l59R8J5k77J20q4j61k23J44K81J88m11R0J60J3l1
1260d62K26M47l06Jj53J72K87NO9J98j59K71L92P1l18M51k7j52L23m10K89R2j96
1283A111L05j47j47J7K0k85j33r4K80l42n3n3n0j54m85K20K7n18m04L11oR9l25
1306h06j31J37m1j13J70O9l13L44M1j63J21J1J20k09K0K99K39L9K10K5k04L95
1328B60l16K69N15j79j56j08J88J23j8k1K36l07j66J93L20o29Q2N2o5k11N2k19
1350a05J26j23n37N15j96k86j53J49O8n52J77R0j03K10r7j30j11J30Jj00K45k01
1372i83K63O8j1J03L18p9K80j9J10R9O6n2L89L6j82L93j00K46o5P0l9q2M28m64
$$ plain form
1396 793 1162 606 617 853 639 888 555 511 362 235 85 84 175 -27 -19 19 15 -198 -354 -418 -439 -533 -493 -750 -725
1421 -725 -524 -830 -994 -897 -658 -671 -769 -487 -394 -605 -429 -371 -322 -131 -127 -62 133 -6 36 191 211 375 267 381
1445 381 865 809 652 308 684 808 953 719 547 787 527 692 647 571 297 109 225 238 -259 -173 -22 -171
1467 -171 -369 -415 -135 -314 -331 -710 -580 -455 -845 -290 -433 -707 -592 -468 -605 -723 -513 -90 -225 -759 -260
1488 -260 -94 -46 -96 119 245 165 364 492 398 883 615 517 1056 699 878 952 785 990 643 754 1112 997
1510 997 957 892 1120 783 635 590 561 369 371 535 186 34 40 258 129 -298 -296 -293 -363 -507 -595 -519 -315 -556 -680
1535 -680 -951 -792 -407 -753 -492 -670 -618 -356 -740 -294 -602 -49 -208 -222 -117 47 116 267 32 204 291
1556 291 173 559 528 510 327 662 678 553 330 403 350 440 337 433 265 135 -40 104 240 -65 -428 -364 -367
$$ packed form
1396G93L69n56J1K36k14K49l33m4j49j27j50jR1k02QL8mk13j56o4k1r4M0k57K5
1421g25K01l06j64R7K39j3r8K82R3k11J76N8M9J91MO5J95j39M2J55K0J64j08J14
1445C81M84n6j57l44L76J24J45k34j72K40k60J65m5p6k74j88J16J3m97Q6J51j49
1467a71j98m6K80j79j7l79J30J25l90N55j43k74J15J24j37j18K10M23j35n34M99
1488b60J66M8n0K15J26q0J99J28r4M85k68r8N39l57J79P4j67K05l47J11L58j15
1510I97m0o5K28l37j48m5k9j92KJ64l49j52OK18j29m27KLp0j44q8P6K04k41j24
1535f80k71J59L85l46K61j78N2K62l84M46l08N53j59j4J05J64O9J51k35J72Q7
1556B91j18L86l1j8j83L35J6j25k23P3n3R0j03R6j68j30j75J44J36l05l63O4l
$$ plain form
1579 -367 -386 -1003 -539 -975 -763 -858 -1090 -731 -1181 -595 -907 -967 -884 -1017 -1022 -1290 -764 -781 -607 -707 -857 -726
1601 -726 -337 -469 -647 -74 -213 -266 -52 116 -100 41 381 381 616 573 376 340 879 334 441 291 637 492
1623 492 298 588 535 436 74 273 158 -127 -248 -157 -61 -137 -261 -353 -431 -561 -335 -277 -250 -516 -295 -636 -674
1646 -674 -518 -297 -664 -683 -353 -466 -683 -738 -399 -448 -332 -248 -409 -119 -124 422 143 9 430 207 480 567
1668 567 694 695 883 765 820 718 684 624 749 699 807 949 777 745 715 689 293 521 371 220 201 513 399
1691 399 102 -144 -207 134 -141 -462 -380 -337 -410 -336 -124 -338 -362 -246 -530 -517 -231 -242 -606 -374 -228 -125 -332
1714 -332 -72 74 111 152 120 404 263 349 527 464 384 622 555 679 832 619 950 669 948 756 696 803 532
1737 532 463 465 752 596 506 353 380 397 -22 26 88 -369 -421 -254 -333 -908 -853 -477 -628 -435 -727 -942 -385 -604
$$ packed form
1579c67j9o17M64m36K12r5k32L59m50N86l12o0Q3j33nk68N26j7J74j00j50J31
1601g26L89j32j78N73j39n3K14J68k16J41L40%K35m3j97l6N39n45J07j50L46j45
1623D92j94K90n3r9l62J99j15k85j21R1R6p6j24r2p8j30K26N8K7k66K21l41l8
1646f74J56K21l67j9L30j13k17n5L39m9J16Q4j61K90nN46k79j34M21k23K73Q7
1668E67J27JJ88j18N5j02l4o0J25n0J08J42j72l2l0k6l96K28j50j51j9L12j14
1691C99k97k46o3L41k75l21Q2M3p3P4K12k14k4J16k84J3K86j1l64K32J46J03k07
1714c32K60J46L7M1l2K84j41Q6J78o3q0K38o7J24J53k13L31k81K79j92o0J07k71
1737E32o9KK87j56r0j53K7J7m19M8O2m57n2J67p9n75N5L76j51J93k92k15N57k19
$$ plain form
1761 -604 -1120 -576 -707 -465 -703 -352 -451 -292 -530 -465 -412 -346 -182 -353 -141 189 91 226 235 146 495 356 595
1784 595 601 868 243 609 597 524 408 693 408 351 265 355 336 120 363 205 -316 196 -133 -396 -257 -239 -398
1807 -398 -276 -361 -600 -589 -653 -518 -614 -663 -584 -490 -566 -772 -521 -544 -563 -500 -316 -426 -360 -408 -114 -165 -140 -45 173
1832 173 127 -39 182 406 227 399 457 676 499 688 656 511 848 516 753 649 270 407 679 538 475
1853 475 252 544 199 142 -10 190 -12 76 30 -420 -422 -592 -697 -754 -528 -526 -840 -656 -765 -636 -623 -774 -432
1876 -432 -723 -626 -789 -590 -361 -433 -635 -580 -207 -135 -260 97 -274 119 174 -29 129 222 339 426 69 326
1898 326 399 427 647 246 285 395 402 476 203 136 374 26 254 218 73 217 128 -161 12 -214 -544 -349 -312
1921 -312 -157 -449 -674 -446 -695 -734 -712 -399 -449 -702 -463 -408 -166 -452 -79 -229 -187 -157 26 -336 75 145
$$ packed form
1761f04n16N44j31K42k38L51r9J59k38O5N3O6J64j71K12L30r8J35Rq9L49j39K39
1784E95OK67o25L66j2p3j16K85k85n7q6R0j9k16K43j58n21N12l29k63J39J8j59
1807c98J22q5k39J1o4J35r6m9P9R4p6k06K51k3j9O3J84j10O6m8K94n1K5R5K18
1832A73m6j66K21K24j79J72N8K19j77J89l2j45L37l32K37j04l79J37K72j41o3
1853D75k23K92l45n7j52K00k02Q8m6m50kj70j05n7K26Kl14J84j09J29J3j51L42
1876d32k91R7j63J99K29p2k02N5L73P2j25L57l71L93N5k03J58R3J17Q7l57K57
1898C26P3K8K20m01L9J10PP4k73o7K38l48K28l6j45J44q9k89J73k26l30J95L7
1921c12J55k92k25K28k49l9K2L13n0k53K39N5K42k86L73j50M2L0J83l62M11P0
$$ plain form
1943 145 191 135 56 188 410 545 312 393 698 699 773 601 786 620 586 574 666 699 613 655 455 531 397 420 511
1968 511 314 159 196 218 11 -300 -371 4 -426 -389 -50 -345 -443 -339 -461 -536 -445 -399 -357 74 -378 -506 -717
1991 -717 -283 -156 -305 -322 -513 -82 -328 -33 55 -73 -33 230 326 366 258 436 491 300 543 560 697 653 538
2014 538 502 539 244 549 325 276 255 363 174 317 327 228 538 234 170 60 -94 -104 -298 -210 -208 -363 -546 100
2038 100 -438 -475 -438 -169 -633 -831 -531 -405 -407 -416 -289 -373 -321 15 -62 -227 -516 -29 80 69 77 296 249 407
2062 407 392 491 434 504 312 532 455 445 748 623 400 530 431 459 587 505 417 436 233 -80 289 72 -196 107
2086 107 213 16 22 36 -216 -331 -368 -477 -304 -550 -320 -608 -497 -505 -342 -596 -420 -254 -601 -335 -391 -400 -212
2109 -212 -363 156 -148 -234 374 145 -138 14 179 -101 405 -70 196 233 113 249 501 562 356 322 304 308
$$ packed form
1943A45M6n6p9J32K22J35k33Q1L05JP4j72J85j66l4j2R2L3q6M2k00P6j34K3R1
1968E11j97j55L7K2k07l11p1L75m30L7L39k95r8J04j22p5R1M6M2M31m52j28k11
1991g17M34J27j49j7j91M31k46K95Q8j28M0K63R6M0j08J78N5j91K43J7J37m4j15
2014E38l6L7k95L05k24m9k1J08j89J43J0r9L10l04o4j10j54j0j94Q8Kj55j83O46
2038A00n38l7L7K69m64j98L00J26krJ27q4N2L36p7j65k89M87J09j1QK19m7J58
2062D07j5R9n7P0j92K20p7j0L03j25k23J30r9K8J28q2q8J9k03l13L69k17k68L03
2086A07J06j97OJ4k52j15l7j09J73k46K30k88J11qJ63k54J76J66l47K66n6rJ88
2109b12j51N19l04q6O08k29k83J52J65k80N06m75K66L7j20J36K52O1k06l4j8M
$$ plain form
2131 308 132 564 -17 337 398 105 -242 143 31 -177 -40 -73 -406 -340 -653 -448 -579 -606 -408 -621 -778
2152 -778 -744 -579 -613 -805 -612 -779 -587 -487 -234 -438 -531 -593 -309 -194 -11 -113 -174 -133 -341 16 -63 384
2174 384 51 338 89 220 481 558 508 566 675 37 629 337 536 309 471 291 627 276 499 264 -117
2195 -117 61 52 -137 33 -74 -151 -317 -119 -265 3 -172 -443 -537 -509 -449 -438 -43 -733 -176 -674 -352 -429 -473
2218 -473 -292 -491 -234 -182 -250 -140 267 -182 -42 350 49 -105 457 241 287 174 381 273 396 167 313
2239 313 211 354 54 90 512 251 315 398 526 369 125 -12 -165 -197 -89 -283 -300 -184 -165 -405 -384 -103
2261 -103 -514 -466 -363 -287 -498 -453 -688 -405 -418 -393 -212 -167 -62 -396 -518 -294 -100 -75 -154 364 174 250 353
2284 353 254 306 294 355 348 433 492 777 644 838 491 403 609 813 841 445 573 609 484 567 652 519 693 -144
$$ packed form
2131C08j76M32n81L54O1k93l47L85j12k08J37l3l33O6l13K05j31k7J98k13j57
2152g78L4J65l4j92J93j67J92J00K53k04r3o2K84J15J83j02o1M1k08L57p9M47
2174C84l33K87k49J31K61P7n0N8J09o38N92k92J99k27J62j80L36l51K23k35l81
2195a17J78rj89J70j07p7j66J98j46K68j75k71r4K8O0J1L95o90N57m98L22p7m4
2218d73J81j99K57N2o8J10M07m49J40L92l01j54N62k16M6j13K07j08J23k29J46
2239C13j02J43l00L6M22k61O4Q3J28j57k44j37j53l2J08j94j7J16J9k40K1K81
2261a03m11M8J03P6k11M5k35K83j3K5J81M5J05l34j22K24J94K5p9N18j90P6J03
2284C53r9N2j2O1pQ5N9K85j33J94l47q8K06K04K8l96J28L6j25Q3Q5j33J74q37
$$ plain form
2308 -144 346 143 141 169 -39 -131 75 56 -67 21 -344 -312 5 -307 -243 -414 5 -481 -333 -268 -235 -269 -288 -202
2332 -202 -470 134 -202 -92 -85 91 28 153 46 405 224 391 696 391 316 400 281 444 579 486 424 701
2354 701 846 228 474 212 225 238 -42 291 238 216 -6 245 248 -145 -193 -136 -344 -107 -406 -201 -132 -159 -400
2377 -400 -362 -194 -662 -366 -243 -239 -601 -466 -264 28 214 -324 23 -107 -240 119 -217 253 288 198 537 280
2399 280 279 289 529 482 255 390 452 729 649 469 439 273 312 432 109 283 452 343 404 160 -205 -180 117
2422 117 -7 190 -83 -199 -451 -603 -286 -559 -407 -462 -588 -668 -276 -714 -596 -613 -572 -556 -712 -810 -627 -727
2444 -727 -468 -430 -643 -310 -307 -527 -459 -497 -417 -7 -132 -144 -202 -20 -187 126 -132 -66 -19 59 -10 -36 98 79 -131
2469 -131 -190 89 166 15 -82 -132 -190 105 -485 -203 -78 -238 -399 -344 -450 -352 -327 -471 -540 -591 -855 -364 -407 -654
$$ packed form
2308a44M90k03kK8k08r2K06j9j23Q8l65L2L17l12O4j71M19m86J48O5L3l4j9Q6
2332b02k68O04l36J10PJ76o3J25j07L59j81J67L05l05p5Q4j19J63J35r3o2K77
2354G01J45o18K46k62J3J3k80L33n3k2k22K51Ll93m8N7k08K37k99K05O9k7k41
2377d00L8J68m68K96J23Ml62J35K02K92J86n38L47j30j33L59l36M70L5r0L39k57
2399B80jJ0K40m7k27J35O2K77q0j80l0j66L9J20l23J74J69j09O1k44l65K5K97
2422A17j24J97k73j16k52j52L17k73J52n5j26q0L92m38J18j7M1J6j56r8J83j00
2444g27K59L8k13L33Lk20O8l8Q0M10j25j2n8J82j67L13k58O6M7P8o9k6J34j9k10
2469a31n9K79P7j51r7n0n8K95n90K82J25j60j61N5j06R8K5j44o9n1k64M91m3k47
$$ plain form
2493 -654 -257 -186 -249 -213 -377 -184 -333 -432 -435 -234 -47 -480 211 136 380 75 262 195 511 334 113 334 592
2516 592 277 688 627 614 824 320 607 622 669 401 862 751 163 308 -57 143 430 386 401 278 201 74
2538 74 -60 -71 -208 22 -63 -121 -192 -355 -34 -391 -120 48 -167 -10 -576 -377 -140 -351 -21 5 156 139
2560 139 192 -55 101 62 254 -52 57 54 511 363 654 121 259 529 300 359 181 333 451 240 242 317 359
2583 359 166 8 307 272 357 204 136 338 80 0 137 95 -238 -309 -346 -236 -413 -127 -69 -313 -194 -348 -293
2606 -293 -467 -283 -481 -115 -174 52 -492 -378 -116 -89 108 -159 13 21 139 215 339 31 275 321 292 465
2628 465 363 514 386 484 204 546 513 526 286 333 335 339 586 203 263 438 346 137 209 243 257 -237 -56 46
2652 46 -257 -51 -15 -221 -231 -208 -320 -312 -331 -76 -399 -419 -213 -421 -191 -299 -111 -294 -234 -76 -174 36 -22 155
$$ packed form
2493f54L97P1o3L6j64J93j49r9lK01J87m33O91p5K44l05J87o7L16j77k21K21K58
2516E92l15M11o1j3K10n04K87J5M7k68M61j11n88J45l65K00K87m4J5j23p7j27
2538G4j34j1j37K30q5n8p1j63L21l57K71J68k15J57n66J99K37k11L30K6J51j7
2560A39N3k47J56l9J92l06J09lM57j48K91n33J38K70k29N9j78J52J18k11KP5M2
2583C59j93j58K99l5Q5j53o8K02k58q0J37m2l33p1l7J10j77K86N8k44J19j54N5
2606b93j74J84j98L66n9K26n44J14K62K7J97k67J72QJ18P6J24l08K44M6k9J73
2628D65j02J51j28R8k80L42l3J3k40M7KMK47l83O0J75r2k09P2L4J4m94J81J02
2652D6l03K06L6k06j0K3j12Qj9K55l23k0K06k08K30j08J88j83O0J58r8K10n8J77
$$ plain form
2676 155 190 40 259 373 191 125 441 100 71 435 173 36 347 306 344 43 404 53 363 329 232 -217
2698 -217 142 -95 32 179 -29 -283 -160 -215 -390 61 -294 -332 -349 -338 -610 -418 -439 -617 -642 -699 -328 -607
2720 -607 -472 -240 -315 -362 -555 -125 -359 -283 -327 -214 -263 -249 -12 173 56 -113 -220 79 120 40 261 269 425
2743 425 539 160 354 210 430 249 312 204 527 412 166 297 163 -249 239 188 40 -72 83 -41 121
2764 121 44 58 -220 -289 -213 -597 -296 -331 -282 -201 -458 -369 -431 -475 -212 -314 -114 -249 -134 -274 -71 -265 -336 165
2788 165 223 221 -162 140 -34 229 336 25 438 86 61 127 186 43 235 80 274 -4 298 189 174 -38
2810 -38 132 237 129 -24 -262 304 -83 -162 -148 -136 -367 -269 -236 -360 -782 -488 -506 -588 -383 -792 -454 -607 -631
2833 -631 -436 -576 -555 -506 -311 -370 -514 -529 -129 -155 -129 -2 -85 -61 197 -32 -136 120 157 392 225 564 369
$$ packed form
2676A55L5j50K19J14j82o6L16l41k9L64k62j37L11m1L8l01L61l51L10l4r7m49
2698b17L59k37J27J47k08k54J23n5j75M51l55l8j7J1k72J92k1j78k5n7L71k79
2720f07J35K32p5m7j93M30k34P6m4J13m9J4K37J85j17j69j07K99M1q0K21QJ56
2743D25J14l79J94j44K20j81O3j08L23j15k46J31j34m12M88n1j48j12J55j24J62
2764A21p7J4k78o9P6l84L01l5M9Q1k57Q9o2m4K63j02K00j35J15j40K03j94p1N01
2788A65N8kl83L02j74K63J07l11M13l52k5O6N9j43J92j55J94k78L02j09j5k12
2810c8J70J05j08j53k38N66l87p9J4J2k31R8L3j24m22K94j8q2K05m09L38j53k4
2833f31J95j40K1M9J95n9j44j5M00k6K6J27q3K4K58k29j04K56L7K35j67L39j95
$$ plain form
2856 369 381 611 405 547 591 138 160 336 374 303 425 317 491 284 150 190 -39 243 123 -45 229 124
2878 124 -2 -64 167 67 82 6 117 183 -69 -69 35 -39 44 172 -38 343 271 31 -69 97 -101 313 554
2901 554 562 -13 299 170 459 355 191 223 611 596 590 591 453 545 702 288 446 877 633 217 334 292 229 298
2925 298 -77 316 462 10 255 -135 -180 45 -22 -128 35 84 -600 -69 -165 -287 -289 -433 -94 -543 -228 -42
2947 -42 -155 -455 -316 -229 -511 -141 -319 -169 -42 -430 9 -26 85 -42 224 169 273 26 113 246 117 293
2969 293 368 161 215 56 336 262 -54 -53 397 -132 247 318 -187 -131 -146 123 -165 -329 -100 -233 -40 -371 -144
2992 -144 -643 -178 -519 -218 -601 -164 -58 -131 -300 -270 -410 -580 -478 -338 -161 -439 -407 -497 -465 -210 -65 -262
3014 -262 -200 -15 -481 -50 -210 31 -44 -7 23 -229 85 346 -44 21 -28 -82 89 79 -147 -199 137 -79 227
$$ packed form
2856C69J2K30k06J42M4m53K2J76L8p1J22j08J74k07j34M0k29K82j20j68K74j05
2878A24j26o2K31j00J5p6J11O6k52%J04p4Q3J28k10L81p2k40j00J66j98M14K41
2901E54Qn75L12j29K89j04j64L2L88j5oJj38R2J57m14J58M31k44m16J17m2o3O9
2925B98l75L93J46m52K45l90m5K25o7j06J63M9o84N31r6j22kj44L39m49L15J86
2947d2j13l00J39Q7k82L70j78J50J27l88M39l5J11j27K66n5J04k47Q7J33j29J76
2969B93P5k07N4j59K80p4l16JM50n29L79P1n05N6j5K69k88j64K29j33J93l31K27
2992a44m99M65l41L01l83M37J06p3j69L0j40j70J02J40J77k78L2r0L2K55J45j97
3014b62O2J85m66M31j60K41p5L7L0k52L14K61l90O5m9n4J71j0k26n2L36k16L06
$$ plain form
3037 227 91 -151 -23 -340 -373 -241 -113 -65 -492 -346 -315 -440 -400 -168 -215 -171 -130 -269 -140 -564 -573 -395 -206
3060 -206 -421 -373 -253 -262 -239 137 -206 -10 -131 -214 106 246 -121 493 189 306 228 260 183 360 412 559 212
3083 212 528 497 81 147 400 324 178 126 309 179 122 598 263 335 524 256 99 25 121 112 -53 81 -263
3106 -263 109 -33 -262 -127 145 -180 -197 56 -14 -189 -324 -41 -126 -68 -142 259 -246 -189 196 -141 239 104
3128 104 237 119 257 304 418 389 124 277 450 361 243 430 292 318 252 401 175 383 175 201 514 381
3150 381 215 289 118 299 143 -83 -200 -30 173 -180 -150 -30 -151 -47 -334 -122 -238 -400 -377 -277 -361
3171 -361 -481 -390 -108 84 -221 18 61 -167 -57 176 125 -49 -20 278 -62 392 -21 37 371 263 294 439
3193 439 318 329 487 280 391 382 582 207 278 519 227 304 254 249 157 77 115 95 185 -148 -42 -49 -155 -137 -219 -320
$$ packed form
3037B27j36k42J28l17l3J32J28M8m27J46L1j25M0K32m7M4M1j39J29m24rJ78J89
3060b06k15M8J20rK3L76l43J96j21q3L20J40l67O14l04J17p8L2p7J77N2J47l47
3083B12L16l1m16O6K53p6j46n2J83j30n7M76l35P2J89k68j57p4R6rj65J34l44
3106b63L72j42k29J35K72l25j7K53p0j75j35K83q5N8p4M01n05N7L85l37L80j35
3128A04J33j18J38M7J14k9k65J53J73q9j18J87j38K6o6J49k26K08k08K6L13j33
3150C81j66P4j71J81j56k26j17J70K03l53L0J20j21J04k87K12j16j62K3J00q4
3171c61j20R1K82J92l05K39M3k28J10K33n1j74K9K98l40M54m13N8L34j08L1J45
3193D39j21J1J58k07J11rK00l75P1K41k92P7n0nr2q0L8k0R0l33J06pj06J8q2j01
$$ plain form
3219 -320 -131 -266 7 -99 -111 -409 -248 -317 -112 -418 -684 -219 -174 -404 -577 -154 14 -225 -314 -50 -73 -179
3241 -179 -78 52 -233 55 242 68 141 296 371 431 373 230 183 28 84 -31 94 230 -3 -183 -88 -203
3263 -203 -205 38 -1 195 171 24 -410 -57 182 56 -137 -34 -106 -437 -391 -365 -430 -326 -341 -522 -118 -103 -350
3286 -350 -402 -130 -97 -225 -142 175 212 -129 -21 -146 -25 62 108 205 -156 156 1 202 -127 357 48 157
3308 157 402 136 354 241 101 415 107 2 229 -51 142 -89 -20 -59 163 65 -132 -282 -99 -292 -210
3329 -210 -81 -247 -158 -33 -460 -164 -370 -199 -224 -517 -322 -103 -337 -19 -115 -68 -80 -133 -111 159 -60 221
3351 221 -108 -265 -25 168 255 95 46 256 153 205 269 -156 203 192 82 153 263 138 73 303 66 224
3373 224 223 340 293 349 9 70 -225 104 -104 -96 -350 -537 -127 40 -108 -127 -335 -122 -180 -384 -213 -312 -23
$$ packed form
3219c20J89j35K73j06j2k98J61o9K05l06k66M65M5k30j73M23J68k39q9K64k3j06
3241a79J01J30k85K88J87j74P3J55P5O0n8j43m7j55N6j15J25J36k33j80R5j15
3263b03kK43l9J96k4j47m34L53K39j26j93J03p2l31M6K6o5J04j5j81M04J5k47
3286c50n2K72L3j28Q3L17L7l41J08j25J21Q7M6R7l61L12j55K01l29M84l09J09
3308A57K45k66K18j13j40L14l08j05K27k80J93k31O9l9K22r8j97j50J83j93Q2
3329b10J29j66Q9J25m27K96k06J71k5k93J95K19k34L18r6M7j2n3K2K70k19K81
3351B21l29j57K40J93Q7j60m9K10j03N2O4m25L59j1j10P1J10j25o5K30k37J58
3373B24jJ17m7N6l40O1k95L29k08Qk54j87M10J67j48j9k08K13n8k04J71r9K89
$$ plain form
3396 -23 -35 -418 -197 -305 -271 150 -404 -359 -75 168 -5 282 95 -88 122 222 192 135 -19 163 347 203
3418 203 295 200 292 405 366 316 500 56 439 329 105 347 90 277 140 130 256 269 -80 -114 14 -55 48
3441 48 106 -79 -463 93 -340 -54 -165 -183 31 -168 -388 -119 -235 -325 -67 -153 8 231 118 209 137 39 151
3464 151 -20 179 349 306 145 367 278 256 229 62 276 4 397 537 127 150 341 135 621 504 397 430
3486 430 176 241 305 124 81 159 -13 188 210 -122 -146 -122 -203 -266 -172 -385 -288 -226 -172 -282 -454 -510 -345 -332 -38
3511 -38 -385 -350 19 60 -198 -625 111 -155 -3 -102 34 -196 239 -129 -35 219 -150 -7 272 343 88 329
3533 329 -11 -222 108 239 272 321 349 49 378 -122 -4 37 -65 224 -44 -41 131 58 -450 -48 -301 -179
3555 -179 -330 -57 236 -275 -172 -227 -123 -246 -376 -256 -249 -308 -244 -206 -336 -37 -112 -140 -232 -215 169 -50 8 -233
$$ packed form
3396b3j2l83K21j08L4M21n54M5K84K43j73K87j87j83K10J00l0n7j54J82J84j44
3418B03R2r5R2J13l9n0J84m44L83j10k24K42k57J87j37j0J26J3l49l4J28o9J03
3441D8N8j85l84N56m33K86j11j8K14j99k20K69j16r0K58q6J61K23j13R1p2r8J12
3464A51j71J99J70m3j61K22q9k2k7j67K14k72L93J40m10K3J91k06M86j17j07L3
3486D30k54O5O4j81m3P8j72K01K2l32k4K4q1o3R4k13R7O2N4j10j72n6J65J3K94
3511c8l47L5L69M1k58m27P36k66J52r9J36k30M35l68R4K54l69J43K79P1k55K41
3533C29l40k11L30J31L3M9K8l00L29n00J18M1j02K89k68LJ72p3n08M02k53J22
3555a79j51K73K93n11J03n5J04j23j30J20Pn9O4L8j30K99p5k8r2J7L84k19N8k41
$$ plain form
3579 -233 40 84 60 64 35 255 -1 269 330 -109 170 414 -107 317 349 -27 -1 -19 194 223 -136 241 -21
3602 -21 148 32 -88 -229 -240 72 -217 -267 -397 -154 -314 -216 -396 -149 -476 -396 -198 -163 -205 -608 -113 -81 -328
3625 -328 -446 -167 -376 -103 -317 -12 -262 -94 113 -393 20 -55 -105 -164 106 94 73 -44 477 234 126 197
3647 197 123 176 95 107 310 116 -20 190 161 82 22 83 -120 114 113 -15 -121 31 -540 96 129 -240 -164 -103
3671 -103 -38 -285 -99 42 -285 -175 -421 -376 45 -114 44 48 -130 -449 229 -5 -46 316 17 -41 -82 402
3693 402 301 93 -85 283 62 452 340 308 471 436 380 387 242 236 508 357 406 324 333 271 151 220 74 197
3717 197 151 -59 -172 36 33 -43 25 -366 -2 138 -15 -157 71 -44 -37 -197 -137 49 -7 48 -54 -2 -105 108
3741 108 -231 -202 -221 193 -227 468 321 28 346 147 312 241 13 321 246 36 205 306 17 149 351
$$ packed form
3579b33K73M4k4Mk9K20k56K70O1m39K79K44n21M24L2l76K6j8K13K9l59L77k62
3602b1J69j16j20j41j1L12k89n0j30K43j60R8j80K47l27Q0J98L5m2m03M95L2k47
3625c28j18K79k09K73k14L05k50J68K07n06M13p5n0n9K70j2k1j17N21k43j08P1
3647A97p4N3q1J2K03j94j36K10k9p9o0O1k03K34jj28j06J52n71O36L3l69P6O1
3671a03O5k47J86J41l27J10k46M5M21j59J58Mj78l19O78k34m1L62k99n8m1M84
3693D02j01k08j78L68k21L90j12l2J63l5n6Pj45oK72j51M9q2Ro2j20O9j46J23
3717A97m6k10j13K08lp6O8l91L64J40j53j42K28j15Pj60O0J86n6N5j02N2j03K13
3741A08l39K9j9M14m20O95j47k93L18j99J65p1k28L08p5k10J69J01k89J32K02
$$ plain form
3762 351 321 224 146 413 293 71 236 391 210 233 152 -95 -81 92 -105 -261 52 119 -300 -227 -91 -344 -263
3785 -263 -85 -239 -269 -394 102 -160 -414 57 -255 -182 56 -165 69 -169 -237 1 105 148 20 -194 48
3806 48 -28 -3 -263 7 -22 25 193 154 -146 267 169 259 107 28 150 213 -37 -53 17 70 20 84 63 -134 100
3831 100 77 -113 -27 -99 -101 -95 -140 -237 -205 -73 -427 -152 -127 -9 -344 -131 -92 126 139 -306 -287 -174 -260 -300 -164
3856 -164 70 -232 -269 -183 -18 -118 -218 -27 -42 90 116 89 245 193 191 273 9 132 131 134 222 -121 191 89 112
3881 112 136 221 86 61 -216 -52 -60 150 -158 -25 -224 -221 -246 -346 -274 -263 -535 -45 -299 -323 41 -262 -69 -286
3905 -286 174 -354 -156 -187 -155 -621 -189 -283 -182 43 -84 121 80 -99 -23 -317 -101 215 365 89 -94 217
3927 217 341 266 -5 445 409 28 -270 72 338 -32 116 -63 107 93 47 -132 -25 -316 -199 -147 -230 -118
$$ packed form
3762C51l0r7p8K67j20k22J65J55j81K3q1k47J4J73j97j56L13O7m19P3J36k53Q1
3785b63J78j54l0j25M96k62k54M71l12P3K38k21K34k38o8K38J04M3j28k14K42
3806D8p6K5k60K70k9M7J68l9l00M13r8R0j52p9J22O3k50j6P0N3n0O4k1j97K34
3831A00k3j90Q6p2kOm5r7L2J32l54K75K5J18l35K13L9K18J3m45J9J13q6m0J36
3856a64K34l02l7Q6J65j00j00J91j5J32K6k7J56n2kQ2k64J23jLQ8l43L12j02K3
3881A12K4Q5j35k5k77J64qK10l08J33j99Lk5j00P2J1k72M90k54k4L64l03J93k17
3905b86M60n28J98l1L2m66M32r4J01K25j27K05m1j79P6k94K16L16J50k76j83L11
3927B17J24p5k71M50l6l81k98L42K66l70J48j79J70j4m6j79J07k91J17N2q3J12
$$ plain form
3949 -118 -141 -209 -152 -137 -86 23 -155 -254 -353 -253 -96 -395 -191 -102 -66 74 -22 120 -114 120 -56 -61 17 271
3973 271 -171 294 206 284 -76 24 332 282 217 431 230 337 262 -10 451 144 149 77 296 204 149 476 178
3996 178 141 242 -180 40 -124 -7 169 -25 -68 -75 -272 34 -243 -54 -109 -360 -237 -23 -188 -187 -286 -288 -9
4019 -9 -283 -22 -164 182 262 -392 -359 119 126 470 165 100 418 293 289 -9 -63 131 204 403 192 -167 432 220
4043 220 274 -15 46 215 219 -12 168 -121 -26 286 -132 6 48 -208 -34 -47 -45 -242 -179 107 163 -342 -403 -19
4067 -19 -330 -179 -39 -218 -227 -45 -108 -148 -52 -104 -60 -188 247 -170 9 161 165 48 60 -156 316 145 -404 77
4091 77 270 95 7 112 195 154 -149 216 228 159 101 147 16 10 108 246 -106 -60 495 99 -142 -87 -47 -166 -182
4116 -182 -112 -75 -128 -101 -213 -155 -21 -197 -185 -358 -428 -93 -320 -151 -100 -256 -277 189 -175 -59 214 -102 108
$$ packed form
3949a18k3o8N7J5N1J09j78r9r9J00J57k99K04Q9L6J40r6J42k34K34j76nP8K54
3973B71m42M65q8P8l60J00L08n0o5K14k01J07p5k72M61l07Np2K19r2n5L27k98
3996A78l7J01m22K20j64J17J76j94m3pj97L06k77J89n5k51J23K14j65Jr9kK79
4019ik74K61j42L46Q0o54L3M78PL44l05o5L18j25mk98n4J94P3J99k11l59N99k12
4043B20N4k89O1J69Mk31J80k89R5L12m18J38M2k56J74j3Kj97O3K86N6n05o1L84
4067a9l11J51J40j79rJ82o3m0R6n2M4j28M35m17J79J52Mj17J2k16M72j71n49M81
4091G7J93j75q8J05Q3m1l03L65J2o9n8M6j31oR8J38l52M6N55l96k41N5M0j19j6
4116a82P0L7n3K7j12N8J34j76J2j73p0L35k27J69N1j56k1M66l64J16K73l16K10
$$ plain form
4139 108 254 -82 -91 98 -5 -330 6 26 57 -22 357 77 296 -11 -42 -66 196 355 130 331 64 -169
4161 -169 114 170 166 -104 7 -465 -81 -204 136 189 -171 -244 24 -128 -525 -155 -338 -244 -264 -122 -48 -277 -384
4184 -384 -573 -257 -188 -55 -8 -474 -159 -79 -70 260 -150 129 -195 204 -522 110 120 -235 363 146 215 380
4206 380 218 143 -4 -106 212 -13 2 169 -204 331 429 -9 157 32 22 -56 -103 -272 89 62 -69 -134 19
4229 19 -118 142 -151 -281 -217 -359 4 -334 106 -120 -220 -136 -25 27 21 -173 47 33 -200 -57 -53 126 -17
4252 -17 368 207 -82 65 361 185 34 257 464 196 100 147 -114 203 284 359 143 592 36 72 215 377
4274 377 440 2 331 67 -186 -33 77 -20 153 122 -56 207 22 -93 -24 -285 -253 -279 -23 -41 -197 -333
4296 -333 -177 -108 -166 -43 -30 -188 -378 -102 -23 6 -152 -87 -155 41 213 22 355 -34 105 149 -96 23 40
$$ packed form
4139A08J46l36rJ89j03l25L36K0L1p9L79k80K19l07l1k4K62J59k25K01k67k33
4161a69K83N6mk70J11m72L84j23L40N3l60p3K68j52l97L70j83R4k0J42P4k29j07
4184c84j89L16O9J33M7m66L15Q0RL30m10K79l24L99p26O32J0l55N98k17O9J65
4206C80j62p5j47j02L18k25J5J67l73N35R8m38J66j25j0p8m7j69L61k7j31o5J53
4229A9j37K60k93j30O4j42L63l38M40k26j00Q4J11N2oj94K20j4k33J43MJ79j43
4252a7L85j61k89J47K96j76j51K23K07k68r6M7k61L17Q1P5k16M49n56L6J43J62
4274C77O3m38L29k64k53J53J10r7J73l1j78K63j85j15O9k61L2k6K56j8j56j36
4296c33J56O9n8J23J3j58j90K76P9K9j58O5o8J96J72j91L33l89J39M4k45J19J7
$$ plain form
4319 40 310 258 -12 389 101 189 184 80 -282 -14 59 94 -177 346 132 289 173 -3 -161 148 155 -212 26
4342 26 29 -142 -102 -152 -258 -138 74 -4 -116 -429 33 -72 -219 -239 -242 -80 -392 -22 -139 -97 -200 109 -72
4365 -72 -152 91 4 -69 252 177 -133 514 148 158 323 -119 256 117 -17 -245 -32 287 31 36 -19 546 45
4388 45 42 -252 182 199 -66 -75 84 42 -21 7 -104 6 70 -8 -64 197 -67 -63 -142 -91 -40 -180 156 -237 -252 110
4414 110 146 -118 85 -27 -142 -117 -81 67 -208 35 33 321 -81 -197 -58 42 84 221 459 145 -120 393
4436 393 230 4 446 315 177 -189 215 68 85 108 301 209 -204 245 -95 80 186 -274 42 -17 -118
4457 -118 180 -210 53 -107 -230 -145 -521 -57 -137 -488 -281 -318 -206 123 -156 -145 -69 -29 101 25 -177 65
4479 65 -83 52 66 -166 -214 48 75 193 221 -226 -80 -34 44 303 24 -55 25 226 169 36 -114 218 -41
$$ packed form
4319D0K70n2k70M01k88Q8nj04l62K68P3L5k71N23k14J57j16j76j58L09Pl67K38
4342B6Lj71M0n0j06J20K12p8j12l13M62j05j47k0lJ62l12L70j17M2j03L09j81
4365g2q0K43q7p3L21p5l10O47l66J0J65m42L75j39j34k28K13L19k56Nn5N65n01
4388D5lk94M34J7k65rJ59m2o3K8j11J10O4p8n6K61k64Mp9N1N1j40L36l93j5L62
4414A10L6k64K03j12j15K5L6J48k75K43kK88m02j16J39J00M2J37K38l14k65N13
4436C93j63k26M42j31j38l66M04j47J7K3J93r2m13M49l40J75J06m60L16n9j01
4457a18K98l90K63j60j23Q5l76M64q0l51K07l7J12L29k79J1P6M0J30p6k02K42
4479F5j48J35J4k32m8K62K7J18K8m47J46M6P8K59k79p9Q0K01n7j33j50L32k59
$$ plain form
4502 -41 282 89 47 -172 -53 -14 -177 -20 -33 40 -108 55 -96 -121 5 9 -234 -300 -219 206 89 209 -120
4525 -120 -296 -67 -278 -175 -23 -50 112 178 197 -116 164 201 -66 14 -122 -165 53 243 118 -101 213 323
4547 323 209 118 283 202 185 29 -77 -94 242 97 195 210 357 120 127 0 -159 22 146 -246 -73 226 -85
4570 -85 -27 34 -142 161 -160 -76 -212 97 -274 -133 -45 -59 -374 -219 -272 -108 -2 -76 -290 161 -96 -101 -180 -103
4594 -103 54 251 134 105 371 236 251 119 -49 56 137 129 438 374 -33 113 289 -32 -200 229 181 44
4616 44 122 48 92 -3 -228 25 -79 -15 -88 123 -34 -18 -45 -112 -374 -200 -368 -44 -74 -11 -331 -16 -197 -10
4640 -10 -66 -82 71 -48 219 -38 -200 -189 247 191 93 182 -88 135 -137 30 270 -161 60 238 289 77 35
4663 35 -26 42 299 105 -95 -37 16 102 -25 246 248 167 -71 -64 -100 134 -129 -205 -258 182 129 -132 32 156 79
$$ packed form
4502d1L23j93m2k19J19L9j63J57j3P3j48J63j51k5J26Mk43o6Q1M25j17J20l29
4525a20j76K29k11J03J52k7J62O6J9l13K80L7k67Q0j36m3K18J90j25k19L14J10
4547C23j14r1J65q1j7j56j06j7L36j45R8J5J47k37Pj27j59J81J24l92J73K99l11
4570h5N8O1j76L03l21Q4j36L09l71J41Q8j4l15J55n3J64J06p4k14M51k57np9P7
4594a03J57J97j17k9K66j35J5j32j68J05Q1qL09o4m07J46J76l21j68M29m8j37
4616D4P8p4M4r5k25K53j04O4p3K11j57J6k7o7k62J74j68L24l0O3l20L15j81J87
4640a0n6j6J53j19K67k57j62J1M36n6r8Q9k70K23k72J67K40m31K21J78N1k12m2
4663C5o1O8K57j94k00N8N3Q6j27K71Kq1k38Pl6K34k63p6n3M40n3k61J64J24p7
$$ plain form
4688 79 -88 -86 105 -241 -295 -240 -148 -229 -107 -91 -104 -103 -93 4 71 -16 -44 202 175 165 263 130 238 106 272 -66
4714 -66 -31 87 278 35 140 264 212 124 252 -59 71 -155 81 43 286 -76 134 -278 82 32 -158 -120
4736 -120 -226 -55 -89 -226 -212 -251 6 -136 -63 198 -332 -125 -67 329 -164 -174 -47 -181 -434 63 -159 204
4758 204 -34 -49 -141 18 -33 -1 0 42 203 136 97 -45 90 332 194 250 250 40 222 22 214 125 -42 120
4782 120 64 -193 147 169 -38 94 48 -101 107 19 89 -53 -172 -294 -183 -101 -215 274 -236 -6 -228 -321
4804 -321 -187 -165 -396 -254 -53 -207 40 190 -75 -58 -106 -142 113 246 -5 -90 239 24 -214 152 212 81
4826 81 192 -18 463 323 285 226 26 229 2 165 -94 231 493 -1 201 -254 -81 -299 30 68 69 5
4848 5 -280 -48 -204 -90 -229 -219 -211 -243 89 -201 -255 136 15 -39 -344 -342 -111 -152 60 -12 163 37 90 -217
$$ packed form
4688G9j67KJ91l46n4N5R2q1J22J6j3JJ0R7O7q7k8K46k7j0R8j33J08j32J66l38
4714f6L5J18J91k43J05J24n2q8J28l11J30k26K36l8K43l62K10m12L60n0j90L8
4736a20j06J71l4j37J4l9K57j42P3K61n30K07N8L96m93j0J27j34k53M97k22L63
4758B04k38j5r2J59n1L2JM2J61o7l9j42J35K42j38N6%k10J82k00J92q9j67J62
4782A20n6k57L40K2k07J32m6j49K08q8P0j42j19j22J11Q2j14M89n10K30k22r3
4804c21J34K2k31J42K01j54K47J50k65J7m8l6K55J33k51q5L29k15k38L66O0j31
4826H1J11k10M81j40l8n9k00K03k27J63k59L25K62m94K02m55J73k18L29L8Jo4
4848Ek85K32j56J14j39J0Ql2L32k90n4L91j21n4l05KK31m1K12p2J75j26N3l07
$$ plain form
4872 -217 -30 68 -81 -385 -70 -247 176 71 366 156 161 -163 -90 242 9 57 -258 -245 59 26 -11 66 -6
4895 -6 148 -33 14 135 -160 -124 212 124 -181 -134 -5 -2 -22 -121 -30 -319 -209 -284 -91 -96 14 -173 -174 -223 -84 -65
4921 -65 -127 -64 -142 -397 -284 36 -244 30 -119 127 -44 -2 -54 162 -86 -17 215 -197 67 170 206 294 -106
4944 -106 352 -5 23 -105 50 250 532 0 -68 7 -291 142 -115 -159 -150 188 -22 -132 -212 -112 -112 -41 -233
4967 -233 -185 -126 72 -267 -101 -238 -196 -131 -72 17 -261 23 -134 -61 -191 -73 70 -89 59 50 -109 86 249
4990 249 92 -131 64 -164 179 23 206 166 212 344 107 145 121 289 214 266 423 -67 -16 196 -21 -273
5012 -273 -118 -4 -150 -419 63 61 -202 -38 15 29 -253 -69 174 11 -111 -232 -274 -170 135 184 -261 80
5034 80 72 15 -271 -38 -53 -30 -110 54 -300 140 -151 123 172 144 -185 -77 22 114 290 -32 34 61 -146 -104 229
$$ packed form
4872b17J87R8j49l04L15j77M23j05K95k10Nl24P3L32k33M8l15J3L04l3l7P7p2
4895fJ54j81M7J21k95L6L36q8l05M7J29Lk0r9R1k89J10p5J93nJ10j87jm9J39J9
4921f5o2O3p8k55J13L20k80K74j49K46j71M2n2K16k48O9K32m12K64J03L6Q8m00
4944a06M58l57K8j28J55K00K82n32o8P5k98M33k57m4RL38k10j10q0J00%P1j92
4967b33M8N9J98l39J66j37M2O5N9Q9k78K84j57P3j30J18J43j59J48rj59J95J63
4990B49j57k23J95k28L43j56J83m0M6J32k37L8k4J68p5N2J57m90N1K12k17k52
5012b73J55J14j46k69M82kk63J64N3J4k82J84K43j63j22j21m2J04L05M9m45L41
5034H0qn7k86K33j5K3q0J64l54M40k91K74M9k8l29J08R9R2J76l22O6K7k07M2L33
$$ plain form
5059 229 55 139 187 67 164 -1 -2 149 -84 -86 -16 -132 -68 83 -118 47 -100 -57 130 136 24 -184 -69 -259
5083 -259 -252 -108 42 -105 105 87 -76 -125 88 265 -247 -100 106 190 -54 68 32 117 48 0 -83 -179 -73 37
5107 37 -76 54 271 -59 190 30 237 -189 25 76 169 -23 304 182 561 207 104 -27 -24 -28 29 69 -25
5130 -25 -114 99 -292 -436 43 -209 -365 110 -227 -252 -428 -435 179 -159 149 17 -72 78 148 -231 -140 -237 -229 61
5154 61 -79 37 150 -92 -359 86 240 -121 124 -207 -127 87 -210 -70 95 -130 329 219 245 346 -43
5175 -43 221 275 88 -55 -44 125 80 -106 309 -45 145 -293 3 -46 -185 64 -162 -76 143 -23 -51 -246
5197 -246 20 -168 -294 -596 169 -328 87 41 -432 159 170 -323 -182 -267 -183 69 -275 -137 36 414 154
5218 154 -36 -236 122 -178 99 243 71 20 398 413 5 29 54 188 139 69 353 153 256 101 -156 158
$$ packed form
5059B29j74Q4M8j20R7j65jJ51k33kP0j16O4J51k01J65j47M3J87Oj12k08J15j90
5083b59PJ44J50j47K10j8j63m9K13J77n12J47K06Q4k44J22l6Q5o9m8q3r6J06J10
5107C7j13J30K17l30K49j60K07m26K14N1R3j92L27j22L79l54j03j31LmN7M0r4
5130b5q9K13l91j44M79k52j56M75l37k5j76pO14l38L08j32q9J50P0l79R1r7QK90
5154F1j40J16J13k42k67M45J54l61K45l31Q0K14k97J40J65k25M59j10K6J01l89
5175d3K64N4j87j43J1J69m5j86M15l54J90m38K96m9j39K49k26Q6K19j66k8j95
5197b46K66j88j26l02P65m97M15m6m73N91J1m93J41q5Q4K52l44J38J73L78k60
5218A54j90k00L58l00K77J44j72n1L78J5m08K4K5J34m9p0K84k00J03j55k57L14
$$ plain form
5240 158 279 -247 -76 -188 80 109 -251 -60 -88 -233 -67 -416 -23 -4 -53 -56 -26 0 -65 -89 191 171 -170 -257
5264 -257 91 47 -258 254 -259 59 245 -220 -120 5 24 -19 136 294 101 299 430 137 124 67 22 -32
5286 -32 283 -36 -35 271 157 -104 161 7 267 189 -77 41 12 -153 -99 -315 -183 -172 -7 -131 17 -364
5308 -364 -34 -369 202 -293 -189 11 -106 -27 -128 -8 76 -378 -53 -5 37 -46 80 35 10 34 77 -1 301
5331 301 -292 187 49 39 119 -338 -47 243 54 -127 17 166 -4 -235 218 63 -70 -87 -25 -150 130
5352 130 13 176 122 16 139 -258 3 -30 -235 -49 -264 -110 186 -138 -192 -25 -147 -29 -256 -246 17
5373 17 199 83 -82 134 -114 -132 225 -142 59 -194 -46 -78 145 151 72 -118 128 88 377 172 28 152
5395 152 226 102 -11 3 403 104 233 -361 -10 45 -288 22 -57 265 -36 -110 63 192 -88 239 -195 -347
$$ packed form
5240A58J21n26J71j12K68K9l60J91k8j45J66l49L93J9m9lL0K6o5k4K80k0l41q7
5264b57L48m4l05N12n13L18J86m65J00J25J9m3J55J58j93J98J31k93j3n7m5n4
5286c2L15l19JL06j14k61K65j54K60p8k66J18k9j65N4k16J32J1J65j24J48l81
5308c64L30l35N71m95J04K00j17P9j01J20Q4m54L25M8M2q3J26m5k5K4M3p8L02
5331C01n93M79j38j0Q0m57K91K90j89j81J44J49j70k31M53j55j33j7O2j25K80
5352A30j17J63n4j06J23l97K61l3k05J86k15J54K96l24n4J67j22J18k27J0K63
5373A7J82j16j65K16k48j8L57l67K01k53J48l2K23Op9j90K46m0K89k05j44J24
5395A52P4j24j13J4M00k99J29n94L51N5l33L10p9L22l01p4J73J29k80L27m34j52
$$ plain form
5417 -347 -364 -50 -276 -248 -123 -190 -156 -67 -115 -158 15 -349 -50 -126 -246 -147 -159 -100 157 -232 143 302 -336 183
5441 183 -107 145 32 -78 -155 -124 169 -279 61 11 70 280 93 46 28 379 -32 111 293 -260 94 -17
5463 -17 64 -64 -178 -11 -6 -133 112 -132 -406 -48 -36 -170 -27 4 -130 -164 -160 -46 152 -357 74 -283 -104
5486 -104 5 202 -87 -276 47 -347 14 -411 -160 -206 77 155 -36 252 67 -82 -32 132 -131 -27 132
5507 132 12 43 271 56 253 226 268 501 138 -4 153 -162 29 293 -67 -98 42 92 -73 39 9 -141
5529 -141 -255 -310 -75 -313 -293 17 42 -151 -101 -501 -110 -67 -91 -2 -456 -22 -173 81 94 -164 38 -268 -94
5552 -94 -83 -45 -229 303 -88 -125 -142 58 196 218 157 108 -7 31 315 -74 207 -48 128 370 97 159 296
5575 296 -382 213 211 -169 -110 55 -149 -50 31 41 -174 38 21 -242 191 193 -227 -172 34 239 93 -90 -3 -195
$$ packed form
5417c47j7L14k26K8J25o7L4Q9m8m3J73l64K99p6j20R9j2N9K57l89L75J59o38N19
5441A83k90K52j13j10p7L1K93m48L40n0N9K10j87m7j8L51m11J43J82n53L54j11
5463a7Q1j28j14J67Nj27K45k44k74L58J2j34J43L1j34l4MJ14J98n09M31l57J79
5486a04J09J97k89j89L23l94L61m25K51m6K83P8j91K88j85j49N0J64k63J04J59
5507A32j20L1K28k15J97k7M2K33l63j42J57l15J91K64l60l1J40N0j65J12l0j50
5529a41j14n5K35k38K0L10K5j93N0m00L91M3k4Q9m54M34j51K54J3k58K02l06J74
5552i4J1L8j84N32l91l7j7K00J38K2o1m9j15L8K84l89K81k55J76K42k73O2J37
5575B96o78N95kl80N9J65k04R9Q1J0k15K12j7k63M33Km20N5K06K05j46j83Q7j92
$$ plain form
5599 -195 153 -226 -4 185 -60 155 -84 4 225 113 192 197 224 -243 -140 125 111 263 -48 526 251 306
5621 306 231 -235 -39 196 22 -106 181 69 75 64 51 24 103 -332 74 -132 46 112 119 -26 -152 -313 -188
5644 -188 13 -78 -262 -147 -21 -99 100 144 -51 -225 -8 246 -55 58 89 -136 -83 -93 -314 26 155 69
5666 69 152 -12 -10 -52 6 149 296 24 372 -37 -7 28 146 -96 207 55 -170 60 -4 93 87 -28 -14 230
5690 230 -336 -15 -5 7 -100 -183 -171 -73 -184 -598 -276 -282 95 -76 -185 -406 -151 55 138 -116 -368 302 137
5713 137 81 -17 101 93 201 -106 -71 167 -12 82 25 129 0 150 298 -18 233 235 256 63 115 -54 -238 62
5737 62 11 123 57 102 -75 67 41 105 164 -127 158 -151 198 121 55 -140 -160 -443 -144 -84 -143 -142 108 129 -49
5762 -49 -173 -126 -12 40 79 -14 -29 -34 -5 -153 161 171 -143 -110 88 101 93 211 -187 0 -55 -30 191 140 267 -366
$$ packed form
5599a95L48l79K22J89k45K15k39Q8K21j12P9NK7m67J03K65j4J52l11N74k75N5
5621C06p5m66J96K35j74j28K87j12Oj1j3k7P9m35M06k06J78O6Pj45j26j61J25
5644a88K01r1j84J15J26p8J99M4j95j74K17K54l01J13L1k25N3j0k21L40J29q6
5666F9Q3j64Km2N8J43J47k72L48m09L0L5J18k42L03j52k25K30o4R7oj15J4K44
5690B30n66L21J0J2j07q3J2R8j11m14L22oL77j71j09k21K55K06Q3k54k52O70j65
5713A37n6r8J18qJ08l07L5K38j79R4n7J04j29J50J48l16K51KK1j93N2j69j84L00
5737F2n1J12o6M5j77J42k6O4N9k91K85l09L49p7o6j95k0k83K99O0n9JK50K1j78
5762d9j24M7J14N2L9r3j5nK9j48L14J0l14L3J98J3qJ18l98J87n5K5K21n1J27o33
$$ plain form
5788 -366 200 20 246 180 -18 119 107 -105 -47 37 229 211 -257 182 74 -70 -237 -2 -120 -86 -317 150
5810 150 -264 -286 -67 20 8 -88 204 -149 -92 7 -125 -129 134 -232 -68 -13 58 -91 139 311 -115 -130 133 -123
5834 -123 177 224 275 173 178 -137 199 26 -33 269 253 -98 269 -41 -144 -8 -18 -145 -326 114 7 126
5856 126 -216 81 6 -103 -56 20 -193 -63 -70 -112 -266 -89 -219 -98 -86 2 -187 -65 -4 100 45 148 25
5879 25 -186 -6 156 -249 56 66 -172 -97 204 61 235 219 133 188 14 -182 170 -85 -47 -21 -85 103 12
5902 12 -330 -52 329 -256 40 -146 -280 135 167 -180 -126 -45 222 -116 167 208 -79 -376 200 -27 -305 -3
5924 -3 107 -277 95 78 -69 -66 102 -145 -32 228 -121 390 71 6 -88 -113 -116 150 163 -71 67 -105 -72 410
5948 410 -5 158 -24 103 191 287 247 -148 28 -88 337 -84 -107 -316 116 -127 84 320 -320 23 -71 -88
$$ packed form
5788c66N66j80K26o6j98J37j2k12N8Q4J92j8m68M39j08j44j67K35j18L4k31M67
5810A50m14k2K19Q7j2r6K92l53N7R9j32mK63l66J64N5P1j49K30J72m26j5K63k56
5834a23L00M7N1j02Nl15L36j73n9L02j6l51L67l10j03J36j0j27j81M40j07J19
5856A26l42K97p5j09M7P6k13J30pm2j54J77j30J21J2Q8j89J22O1J04n5J03j23
5879B5k11J80J62m05L05J0k38P5L01j43J74j6q6N5j74j96L52k55L8K6o4J88r1
5902A2l42K78L81n85K96j86j34M15L2l47N4Q1K67l38K83M1k87k97N76k27k78L02
5924cJ10l84L72j7j47LJ68k47J13K60l49N11l19o5r4k5lK66J3k34J38j72L3M82
5948D10m15J63j82J27Q8R6m0l95J76j16M25m21k3k09M32k43K11K36o40L43r4j7
$$ plain form
5970 -88 -59 100 114 110 -146 -56 -208 100 -116 15 -160 -147 -50 -79 -190 -94 144 118 -119 121 -275 -227 -143 -81 -211
5995 -211 -72 37 2 -114 49 -178 -176 -201 -13 -219 -100 138 228 21 7 428 337 220 116 -22 -210 205
6017 205 -78 84 124 162 232 112 194 -168 -280 -147 111 -233 1 -106 27 -97 -78 -15 18 -301 -118 -184 -243
6040 -243 -261 -393 62 -202 179 311 -194 -203 -137 -422 102 -99 -91 -7 241 29 122 13 -190 -35 -39 75 117 37
6064 37 -41 37 207 150 -21 -123 140 177 261 -202 -86 146 135 194 60 -107 77 89 -217 130 -76 -231 19
6087 19 185 59 -67 96 98 -19 18 361 -112 -28 49 -61 -11 -26 182 -131 -191 -62 -82 197 -5 -180 234
6110 234 90 71 269 213 -147 -10 -278 56 1 -8 -121 -37 6 152 422 99 213 37 -4 -32 159 -8 134
6133 134 29 396 -35 306 5 125 -193 62 -138 -56 192 -180 -151 14 71 -355 -3 -222 -119 21 -109
$$ packed form
5970h8K9J59J4mk56R0j52L08k16J31j75J3R7k9j11R6K38k6k37K40l96M8Q4O2j30
5995b11J39J09l5j16J63k27Kk5J88k06J19K38R0k07j4M21r1j17j04j38j88M15
6017B05k83J62M0L8P0j20Q2l62j12J33K58l44K34j07J33j24J9O3L3l19J83o6n9
6040b43j8j32M55k64L81J32n05rO6k85N24k01QQ4K48k12R3j09k03J55mJ14M2q0
6064C7p8P8J70n7j71j02K63L7Q4m63J16K32j1N9j34j67J84J2l06L47k06j55K50
6087A9J66j26j26J63Kj17L7L43m73Q4P7j10N0j5K08l13o0J29k0K79k02j75M14
6110B34j44j9J98n6l60J37k68L34n5rj13Q4M3J46K70l23J14j76m1k8J91j67J42
6133A34j05L67m31L41l01J20l18K55k00Q2K48l72K9J65N7m26L52k19J03J40j30
$$ plain form
6154 -109 184 -125 -175 98 -37 -207 -95 29 -121 -24 168 -12 -23 85 -195 -66 17 34 -77 -91 104 133
6176 133 -139 -1 -142 -93 192 105 105 -66 78 213 230 0 -105 -180 259 -92 101 -92 5 -133 105 -52
6198 -52 -13 -204 236 -97 402 -171 -53 -116 78 85 447 -163 26 145 67 -57 41 221 -197 -181 -137 167 -55
6221 -55 159 -128 191 -60 111 -84 -181 -85 329 118 240 169 -52 107 3 261 -149 -37 278 -2 61 162
6243 162 99 36 97 64 130 257 109 70 -6 -62 -544 27 101 330 -52 23 448 -375 138 -522 -37 -52 -218 8
6267 8 -95 42 -85 337 -274 -320 3 -99 -128 -259 121 -20 -135 61 135 -285 -137 -34 65 113 131 -30 22
$$ packed form
6154a09K93l09n0K73j35j70J12J24j50R7J92j80j1J08k80J29Q3J7j11j4J95K9
6176A33k72J38j41M9K85q7%j71J44J35J7k30j05p5M39l51J93j93R7j38K38j57
6198e2L9j91M40l33M99n73J18o3J94PL62o10J89J19p8j24R8J80m18J6M4L04k22
6221e5K14k87L19k51J71j95r7R6M14k11J22p1k21J59j04K58m10J12L15k80O3J01
6243A62o3o3O1l3O6J27j48l9p6n6m82N71P4K29l82P5M25q23N13o60M85j5j66K26
6267Hj03J37j27M22o11m6L23j02k9j31L80j41j15J96P4m20J48J03R9M8J8j61N2
$$ [...]
8191A59
##END NTUPLES=NMR FID
##END=
