##TITLE=1H_LY-benzPd240
 CDCl3,8 sc, 
 24.9.2021
##JCAMPDX= 6.0         $$ Bruker NMR JCAMP-DX V2.0
##DATA TYPE= NMR FID
##DATA CLASS= NTUPLES
##ORIGIN= UXNMR, Bruker Analytische Messtechnik GmbH
##OWNER= root
$$ XWIN-NMR		Version 3.5
$$ Fri Sep 24 09:27:25 2021 Russian Standard Time (UT+4h)  she@DPX200
##.OBSERVE FREQUENCY= 200.1314
##.OBSERVE NUCLEUS= ^1H
##.DELAY= (6, 6)
##.ACQUISITION MODE= SIMULTANEOUS
##.ACQUISITION SCHEME= undefined
##.AVERAGES= 8
##.DIGITISER RES= 18
##SPECTROMETER/DATA SYSTEM= spect
##.PULSE SEQUENCE= zg30
##.SOLVENT NAME= CDCl3
##.SHIFT REFERENCE= (INTERNAL, CDCl3, 0, 15.7039)
##AUDIT TRAIL= $$ (NUMBER, WHEN, WHO, WHERE, WHAT)
$$ ##TITLE= Audit trail, XWIN-NMR		Version 3.5
$$ ##JCAMPDX= 5.01
$$ ##ORIGIN= Bruker BioSpin GmbH
$$ ##OWNER= she
$$ F:/spectra/data/she/nmr/H-F/1/audita.txt
$$ ##AUDIT TRAIL=  $$ (NUMBER, WHEN, WHO, WHERE, WHAT)
(   1,<2021-09-24 09:26:24.57 +0400>,<she>,<DPX200>,
      <created by zg, POWCHK disabled, PULCHK disabled
       configuration hash MD5:
       00 E9 B6 7A A2 85 ED C7 34 08 36 98 17 FE 4E 26
       data hash MD5: 16K
       12 15 F0 77 77 3C B2 D3 56 7E 04 66 F3 FC D4 95>)
$$ ##END=
$$ 
$$ hash MD5
$$ 24 5C 6B 38 7C ED F7 9A 12 D5 DE 57 50 0E F0 88
##$RELAX= 
##$RELAX= 
##$RELAX= 
##$RELAX= 
##$RELAX= 
##$RELAX= 
$$ Bruker specific parameters
$$ --------------------------
##$DU= <F:/spectra>
##$EXPNO= 1
##$NAME= <H-F>
##$PROCNO= 1
##$TYPE= <nmr>
##$USER= <she>
##$AMP= (0..31)
100 100 100 100 100 100 100 100 100 100 100 100 100 100 100 100 100 100 
100 100 100 100 100 100 100 100 100 100 100 100 100 100 
##$AQSEQ= 0
##$AQ_mod= 1
##$AUNM= <au_zg>
##$AUTOPOS= <>
##$BF1= 200.13
##$BF2= 200.13
##$BF3= 200.13
##$BF4= 200.13
##$BF5= 200.13
##$BF6= 200.13
##$BF7= 200.13
##$BF8= 200.13
##$BYTORDA= 1
##$CFDGTYP= 0
##$CFRGTYP= 5
##$CHEMSTR= <none>
##$CNST= (0..31)
1 1 145 1 1 1 1 1 1 1 1 1 1 1 1 1 1 1 1 1 1 1 1 1 1 1 1 1 1 1 1 1 
##$CPDPRG= <>
##$CPDPRG1= <>
##$CPDPRG2= <>
##$CPDPRG3= <>
##$CPDPRG4= <mlev>
##$CPDPRG5= <mlev>
##$CPDPRG6= <mlev>
##$CPDPRG7= <mlev>
##$CPDPRG8= <mlev>
##$CPDPRGB= <>
##$CPDPRGT= <>
##$D= (0..31)
0 1.2 0 0 0 0 0 0 0 0.06 0 0.03 0 0 0 0 0.0002 0 0 0 0 0 0 0 0 0 0 0 0 
0 0 0 
##$DATE= 1632461183
##$DBL= (0..7)
120 120 120 120 120 120 120 120 
##$DBP= (0..7)
150 150 150 150 150 150 150 150 
##$DBP07= 0
##$DBPNAM0= <>
##$DBPNAM1= <>
##$DBPNAM2= <>
##$DBPNAM3= <>
##$DBPNAM4= <>
##$DBPNAM5= <>
##$DBPNAM6= <>
##$DBPNAM7= <>
##$DBPOAL= (0..7)
0.5 0.5 0.5 0.5 0.5 0.5 0.5 0.5 
##$DBPOFFS= (0..7)
0 0 0 0 0 0 0 0 
##$DE= 6
##$DECBNUC= <off>
##$DECIM= 32
##$DECNUC= <off>
##$DECSTAT= 4
##$DIGMOD= 1
##$DIGTYP= 9
##$DL= (0..7)
0 120 120 120 120 120 120 120 
##$DP= (0..7)
150 150 150 150 150 150 150 150 
##$DP07= 0
##$DPNAME0= <>
##$DPNAME1= <>
##$DPNAME2= <>
##$DPNAME3= <>
##$DPNAME4= <>
##$DPNAME5= <>
##$DPNAME6= <>
##$DPNAME7= <>
##$DPOAL= (0..7)
0.5 0.5 0.5 0.5 0.5 0.5 0.5 0.5 
##$DPOFFS= (0..7)
0 0 0 0 0 0 0 0 
##$DQDMODE= 0
##$DR= 18
##$DS= 0
##$DSLIST= <SSSSSSSSSSSSSSS>
$$ [...]
##$SUBNAM2= <"">
##$SUBNAM3= <"">
##$SUBNAM4= <"">
##$SUBNAM5= <"">
##$SUBNAM6= <"">
##$SUBNAM7= <"">
##$SUBNAM8= <"">
##$SUBNAM9= <"">
##$SW= 20.0188988654967
##$SWIBOX= (0..15)
0 0 2 0 0 0 0 0 0 0 0 0 0 0 0 0 
##$SW_h= 4006.41025641026
##$TD= 16384
##$TD0= 1
##$TE= 0
##$TE2= 300
##$TE3= 300
##$TEG= 300
##$TL= (0..7)
0 120 120 120 120 120 120 120 
##$TP= (0..7)
150 150 150 150 150 150 150 150 
##$TP07= 0
##$TPNAME0= <>
##$TPNAME1= <>
##$TPNAME2= <>
##$TPNAME3= <>
##$TPNAME4= <>
##$TPNAME5= <>
##$TPNAME6= <>
##$TPNAME7= <>
##$TPOAL= (0..7)
0.5 0.5 0.5 0.5 0.5 0.5 0.5 0.5 
##$TPOFFS= (0..7)
0 0 0 0 0 0 0 0 
##$TUNHIN= 0
##$TUNHOUT= 0
##$TUNXOUT= 0
##$USERA1= <user>
##$USERA2= <user>
##$USERA3= <user>
##$USERA4= <user>
##$USERA5= <user>
##$V9= 5
##$VALIST= <valist>
##$VCLIST= <CCCCCCCCCCCCCCC>
##$VD= 0
##$VDLIST= <DDDDDDDDDDDDDDD>
##$VPLIST= <PPPPPPPPPPPPPPP>
##$VTLIST= <TTTTTTTTTTTTTTT>
##$WBST= 1024
##$WBSW= 4
##$XGAIN= (0..3)
0 0 0 0 
##$XL= 0
##$YL= 0
##$YMAX_a= 167397
##$YMIN_a= -186483
##$ZGOPTNS= <>
##$ZL1= 120
##$ZL2= 120
##$ZL3= 120
##$ZL4= 120
##$ABSF1= 10
##$ABSF2= 0
##$ABSG= 5
##$ABSL= 3
##$ALPHA= 0
##$AQORDER= 0
##$ASSFAC= 0
##$ASSFACI= 0
##$ASSFACX= 0
##$ASSWID= 0
##$AUNMP= <proc_1d>
##$AZFE= 0.1
##$AZFW= 0.1
##$BCFW= 1
##$BC_mod= 2
##$BYTORDP= 1
##$COROFFS= 0
##$CY= 11.3945322036743
##$DATMOD= 1
##$DC= 2
##$DFILT= <>
##$DTYPP= 0
##$F1P= 2.36226072786647
##$F2P= -0.459571619588291
##$FCOR= 0.5
##$FTSIZE= 0
##$FT_mod= 4
##$GAMMA= 1
##$GB= 0.15
##$INTBC= 1
##$INTSCL= 1
##$ISEN= 128
##$LB= 0.24
##$LEV0= 0
##$LPBIN= 0
##$MAXI= 10000
##$MC2= 0
##$MEAN= 0
##$ME_mod= 0
##$MI= 1.114404
##$NCOEF= 0
##$NC_proc= 0
##$NLEV= 6
##$NOISF1= 3.799351
##$NOISF2= 2.8
##$NSP= 1
##$NTH_PI= 0
##$NZP= 0
##$OFFSET= 15.70392
##$PC= 1
##$PHC0= -14155.98
##$PHC1= 16.00088
##$PH_mod= 1
##$PKNL= yes
##$PPARMOD= 0
##$PSCAL= 0
##$PSIGN= 0
##$REVERSE= no
##$SF= 200.130013532006
##$SI= 16384
##$SIGF1= 3
##$SIGF2= 2
##$SINO= 400
##$SIOLD= 16384
##$SREGLST= <1H.CDCl3>
##$SSB= 0
##$STSI= 0
##$STSR= 0
##$SW_p= 3612.71676300578
##$SYMM= 0
##$S_DEV= 0
##$TDeff= 0
##$TDoff= 0
##$TI= <>
##$TILT= no
##$TM1= 0
##$TM2= 0
##$TOPLEV= 0
##$USERP1= <user>
##$USERP2= <user>
##$USERP3= <user>
##$USERP4= <user>
##$USERP5= <user>
##$WDW= 1
##$XDIM= 8192
##$YMAX_p= 0
##$YMIN_p= 0
$$ End of Bruker specific parameters
$$ ---------------------------------
##NTUPLES= NMR FID
##VAR_NAME=  TIME,          FID/REAL,        FID/IMAG
##SYMBOL=    X,             R,               I
##VAR_TYPE=  INDEPENDENT,   DEPENDENT,       DEPENDENT
##VAR_FORM=  AFFN,          ASDF,            ASDF
##VAR_DIM=   8192,          8192,            8192
##UNITS=     SECONDS,       ARBITRARY UNITS, ARBITRARY UNITS
##FACTOR=    0.0002496,     1,               1
##FIRST=     0,             0,               0
##LAST=      2.0444736,     0,               0
##MIN=       0,             -186483,         0
##MAX=       2.0444736,     167397,          0
$$ Real data points
##PAGE= N=1
##DATA TABLE= (X++(R..R)), XYDATA
$$ [...]
2260C74J171J003O85L08q9m95q46j063j218j191j027p44l81M5M14P89J056J186
2278b3J199J050P97M48K3l63p15j025j160j214j086q32m89j00L11O59R70J141
2296d09J218J085Q76N69J57k39o21r10j130j208j124r08o29k00J87N57Q69J099
2314g61J206J133R33O70K85j24n04q36j065j185j160r84p05l37O4M38Q10J035
2332a087J173J175R99P42L99j5l77p50j005j159j164j042p79m57m8L44O71R90
2350a390J124J176J062Q14N03J28k68o50r42j118j167j080q72n51j76K18O03Q86
2368a700J085J168J109R07N91K38j64n32q52j061j173j108r45o30l10J15M84Q03
2386a975J035J163J122R63P01L34l5m31p68r95j151j135r87p47l99j9L71P19R72
$$ plain form
2260 374 1545 2548 3233 3541 3452 2957 2111 1048 -170 -1361 -2388 -3132 -3513 -3468 -3054 -2265 -1209 -23
2278 -23 1176 2226 3023 3471 3494 3131 2416 1391 231 -983 -2069 -2901 -3390 -3490 -3179 -2520 -1550 -409
2296 -409 809 1894 2770 3339 3496 3257 2636 1726 596 -612 -1736 -2644 -3273 -3473 -3286 -2729 -1860 -761
2314 -761 445 1578 2511 3181 3466 3342 2838 2002 937 -248 -1408 -2392 -3097 -3434 -3370 -2932 -2122 -1087
2332 -1087 86 1261 2260 3002 3401 3386 3009 2259 1254 95 -1069 -2111 -2890 -3347 -3395 -3051 -2380 -1390
2350 -1390 -266 910 1972 2786 3289 3417 3149 2499 1557 439 -728 -1808 -2680 -3231 -3407 -3189 -2586 -1700
2368 -1700 -615 553 1662 2569 3160 3398 3234 2702 1850 789 -384 -1492 -2437 -3067 -3377 -3262 -2778 -1975
2386 -1975 -940 223 1345 2308 3009 3343 3308 2877 2109 1114 -37 -1172 -2159 -2906 -3305 -3324 -2953 -2234 -1262
2405a262J123J150J018P84M50P1l22o67r33j105j162j031q20m94j19K54O22R13
2423a530J074J147J058Q60N48J71j89n78q85j054j139j085q70n98k25J52N03Q30
2441a810J046J130J084R10O37K93j07m54p89j004j116j103r59o61l42M0M09P43
2459b053R73J098J114R58P24L92J6l59o98r39j081j129r73p60m36o7L19O38R10
2478a353J063J106J009P79M84J26k49n92q67j039j107j020q25n31j78J83N47Q21
2496a643J021J105J024Q61N73K30j34m89p76r94j086j050q81o27k74P4M37P42
2514a887R65J062J073Q85O67L38k6l74o91r27j050j065r34o87l95j7L07O45Q78
2533a233J053J058R39P41M31R3k66o00q47j018j054r74p72m78j46K10N55Q14R85
$$ plain form
2405 -1262 -139 1011 2029 2813 3263 3334 3012 2345 1412 307 -855 -1886 -2706 -3200 -3319 -3065 -2443 -1530
2423 -1530 -456 691 1749 2609 3157 3328 3139 2561 1676 622 -517 -1602 -2472 -3070 -3295 -3143 -2640 -1810
2441 -1810 -764 366 1450 2360 2997 3290 3183 2729 1940 936 -180 -1283 -2242 -2903 -3245 -3205 -2796 -2053
2459 -2053 -1080 18 1132 2090 2814 3206 3222 2863 2165 1226 145 -984 -1957 -2717 -3153 -3220 -2901 -2263 -1353
2478 -1353 -290 816 1825 2604 3088 3214 2965 2373 1506 467 -640 -1660 -2485 -3016 -3194 -3011 -2464 -1643
2496 -1643 -622 483 1507 2368 2941 3171 3037 2548 1772 778 -308 -1358 -2239 -2866 -3140 -3066 -2629 -1887
2514 -1887 -922 140 1213 2098 2765 3103 3077 2703 2012 1085 35 -1030 -1964 -2651 -3046 -3063 -2756 -2111 -1233
2533 -1233 -180 878 1817 2558 2989 3082 2816 2216 1369 351 -703 -1677 -2449 -2927 -3073 -2863 -2308 -1494 -509
2552e09J068R78P96N28J89j53n06p86r72j051j001q12n52k42J21M54P42R33J045
2571B70R99Q51O03K85p8m05p04r07j034j001q61o45l26J0L53O68Q73J007J013
2590I71Q95O73L77L1k98o05q59r67j034r11o98m47p8K61N60Q05R63J014R36P40
2610B329M74J39k00n22p72r40j010r49p58n21j85J48M66P39R13R97R69P93N43
2629B653K42r6m11o90q99r82r61q09n92k94L2L48O67Q50R67R73Q46O28L39Kl12
2650B501o01q26r61r94q60o47l81m1K72N85P79R52R64Q67O85M20R1k27n34p70
2670A274r05r70q78p10m58j30J82M72P35R00R36R12P34M87J90j33m29o93q67r50
2690c01r12p66n13k49R3L85O42Q47R34R12P81N83K69l2l48o15q20r17r40p84n97
$$ plain form
2552 -509 559 1537 2333 2861 3050 2897 2391 1605 633 -418 -1419 -2231 -2783 -3025 -2904 -2450 -1708 -775 270
2571 270 1269 2120 2723 3008 2930 2525 1821 914 -120 -1121 -1982 -2627 -2953 -2943 -2590 -1922 -1049 -42 971
2590 971 1866 2539 2916 2947 2649 2044 1185 218 -816 -1727 -2425 -2872 -2950 -2689 -2129 -1324 -361 653 1589 2329
2610 2329 2803 2942 2742 2220 1448 508 -502 -1451 -2209 -2730 -2915 -2767 -2301 -1562 -649 348 1317 2110 2653
2629 2653 2895 2799 2388 1698 799 -183 -1144 -1953 -2545 -2839 -2807 -2459 -1792 -942 25 998 1844 2472 2811 2813 2501
2650 2501 1900 1074 113 -881 -1741 -2388 -2769 -2810 -2538 -1953 -1174 -222 742 1609 2294 2714 2805 2578 2044 1274
2670 1274 369 -601 -1479 -2189 -2647 -2777 -2595 -2123 -1388 -488 448 1360 2094 2581 2771 2638 2209 1516 649 -301
2690 -301 -1213 -1979 -2492 -2741 -2648 -2263 -1621 -774 160 1072 1853 2436 2705 2673 2325 1710 890 -27 -967 -1751 -2348
2711b348l22J0K93N83P92R21R25Q07O21L39M2k59n33p69r02r13q12o57l84q6K07
2732b445N03P24Q64R10Q47O85M28J40j72m46p04q44r10q51o97m80j84J19M22O53
2752a438Q20R06Q67P23N09K30q0l81o36p84q95q75p36n44k64M4L36N87P91Q63
2772D3Q88P51N75K85Ml02n46p59q67q72p73n88l34m3K49N16P17Q43Q73Q05O02
2793B067L87R5j99m85o92q28q86p91o50m16j27J54M42O60Q10Q64Q22O63M48J67
2813B505j04m10o28p88q59q32o75m81k18Q3L54O00P62Q55Q23P08N07K59m1l26
2833B094n42p37q48q21p30n28l02j4K75N22P03Q19Q47P39N53L38O3k37m85o75
2853A034q07q44p45n91l69r0J90M41O53P89Q39P59O27L87J28j53m17o26p52q44
$$ plain form
2711 -2348 -2670 -2660 -2367 -1784 -992 -71 854 1661 2282 2621 2663 2404 1871 1102 200 -713 -1525 -2182 -2566 -2652 -2445
2732 -2445 -1942 -1218 -354 556 1403 2088 2516 2656 2484 2038 1334 490 -420 -1271 -1968 -2448 -2632 -2513 -2091 -1438
2752 -1438 -618 288 1155 1878 2387 2617 2537 2156 1520 736 -159 -1034 -1770 -2314 -2578 -2534 -2198 -1611 -820 43
2772 43 931 1682 2257 2542 2546 2244 1698 939 72 -800 -1573 -2161 -2495 -2538 -2289 -1773 -1056 -213 660 1465 2067
2793 2067 2454 2549 2350 1865 1173 345 -541 -1332 -1982 -2398 -2525 -2371 -1929 -1269 -459 405 1227 1890 2338 2505
2813 2505 2401 1991 1363 575 -284 -1116 -1791 -2272 -2490 -2407 -2053 -1453 -691 164 987 1695 2202 2461 2420 2094
2833 2094 1552 815 -33 -854 -1584 -2112 -2414 -2428 -2153 -1631 -928 -109 738 1477 2030 2368 2431 2194 1709 1034
2853 1034 227 -617 -1362 -1953 -2322 -2412 -2222 -1781 -1128 -339 500 1259 1886 2273 2401 2248 1831 1205 453 -391
2873c91p69o25m36j66J16L84N92P53Q11P73O61M48J94o3l40n60p30q03p89o71
2893a611m71k44M5K99N14P08P91P96O93M99K69Pk63m87o81p81q02o90n41l03m5
2914b298K34M57O64P64P92P15N41L42Q2j89m45o25p42p84p28n77l68j09J52L98
2934a724N94P39P73P30N96M08J49j17l60n59p12p72p44o22m26j84P2L28N30O87
2954f14P80P36O21M71K29m9k75n17o63p49p58o43m84k62%K42M82O35P38P47O66
2975A333N03K97K6k06m30o30p22p40o71n34l16p1J71M00N99P11P41O89N47L37
2995B034J19j36l67n76o91p41o89n58l90j39J09L34N47O77P23P05N79M05J72p6
3015B041k91n26o39p40p01n86m38k15N1K55M85O32P09P03O20M46K43J0k35m53
$$ plain form
2873 -391 -1160 -1785 -2221 -2387 -2271 -1887 -1295 -542 269 1042 1703 2151 2345 2282 1942 1382 652 -151 -940 -1611
2893 -1611 -2082 -2326 -2281 -1982 -1468 -760 31 827 1520 2019 2288 2295 2032 1545 864 83 -719 -1409 -1950 -2253 -2298
2914 -2298 -2064 -1607 -943 -179 613 1328 1869 2211 2293 2104 1659 1034 292 -492 -1220 -1797 -2165 -2274 -2122 -1724
2934 -1724 -1130 -391 382 1112 1708 2116 2265 2148 1788 1229 517 -255 -999 -1621 -2047 -2231 -2159 -1831 -1301 -614
2954 -614 166 902 1523 1994 2223 2174 1899 1382 719 -30 -788 -1431 -1915 -2177 -2177 -1935 -1453 -818 -80 667 1333
2975 1333 1836 2133 2159 1953 1523 893 171 -569 -1240 -1774 -2090 -2161 -1990 -1590 -991 -280 461 1150 1697 2034
2995 2034 2153 2017 1650 1074 383 -358 -1047 -1605 -1995 -2134 -2025 -1691 -1144 -467 256 961 1540 1945 2117 2041
3015 2041 1750 1224 585 -155 -856 -1442 -1880 -2095 -2044 -1789 -1304 -672 37 740 1360 1806 2049 2059 1824 1371
3035A371o00p10o98o25m72k84k9K08M07N80O78P16O37M98L01O6j70l82n46o73
3055B73p10o46n28l26r6J35L64N32O49P11O34N41L53J38j06l36n02o41o86o57
3075i04n39l82j66P9K82M74O16O87O61N73L88J95l2k55m56o03o64o77n69m21k13
3096a926LK23M20N89O66O64N81M39K56K6k00m07n51o58o73n98m58k75n3J69L78
3117a385N21O42O62O10M81K92Q7j29l34n16o17o56o14m94l19j25J01L19M86N97
3137c91O38O33N11L47J45o7k86m59n87o32o26n42l72j70L9K59M33N61O42O34N28
3158A238M05J97k1k18m07n64o20o38n45m05k38rK03L76N38O09O28N60M24K58M5
3179A816j62l47m91o26o22n76m36k84o9J31L24M84N91O24N66M71K97J01r9l10
$$ plain form
3035 1371 771 61 -637 -1262 -1734 -2018 -2047 -1839 -1432 -852 -174 542 1179 1677 1978 2044 1874 1492 946 273
3055 273 -437 -1083 -1611 -1937 -2033 -1898 -1534 -1002 -353 358 992 1533 1886 2024 1918 1582 1080 439 -247 -904
3075 -904 -1443 -1825 -1991 -1912 -1630 -1156 -540 147 808 1381 1769 1964 1932 1677 1221 618 -46 -723 -1292 -1713 -1926
3096 -1926 -1923 -1700 -1280 -691 -25 639 1220 1659 1915 1941 1741 1334 783 125 -548 -1146 -1604 -1879 -1932 -1763 -1385
3117 -1385 -864 -222 440 1050 1531 1823 1910 1781 1447 931 314 -342 -956 -1450 -1769 -1894 -1793 -1474 -988 -391
3137 -391 247 880 1391 1738 1883 1816 1530 1071 484 -148 -774 -1316 -1688 -1858 -1819 -1560 -1127 -566 76 710 1238
3158 1238 1643 1840 1819 1601 1194 630 10 -628 -1173 -1578 -1816 -1825 -1622 -1246 -708 -99 529 1089 1513 1771 1816
3179 1816 1654 1307 816 190 -432 -1008 -1444 -1728 -1797 -1666 -1342 -858 -267 357 923 1394 1691 1792 1693 1383
3199A383m59n81o17n76m80l16j44R3K88M32N49O19O00M74L44J34n4k52m07n37
3219D93o08n83n00l53j71K6K23L90N13N89N95N04L78J90J6k00l65m83n94n89m98
3240a027l95k30k7J61L41M65N54N88N26M14K59N4j44l06m64n41n82n34m29k72
3260a589p9J00K96M36N32N73N42M44K90J14p4k68m31n04n74n47m48l06j31M6K50
3281a328L96N04N55N35M66L26J53j8k16l69m88n62n42m58l52j87J6J79L44M68
3301e78N49N50M69L69J86K4j50l16m71n31n42m90l72k26n1J46L09M25N24N46M86
3322H56L94K47P0j13k87m03n27n28n02l97k56r3Q1K60M00M88N44M99M06K75J13
3343A527n7k42l71m87n16n13m23k92j40M4K08L66M55N27N19M21L06J66k8j88l38
$$ plain form
3199 1383 924 343 -274 -850 -1330 -1646 -1790 -1697 -1409 -977 -428 191 791 1265 1609 1743 1689 1437 1030 493
3219 493 -115 -698 -1198 -1551 -1722 -1696 -1473 -1083 -570 19 614 1118 1496 1686 1702 1502 1137 654 60 -529 -1027
3240 -1027 -1422 -1652 -1679 -1518 -1177 -712 -158 430 956 1370 1629 1683 1539 1233 769 228 -354 -888 -1317 -1589
3260 -1589 -1668 -1568 -1272 -836 -304 269 811 1255 1545 1659 1585 1317 886 382 -192 -739 -1187 -1493 -1624 -1578 -1328
3281 -1328 -932 -428 127 662 1128 1454 1607 1589 1373 1004 516 -46 -588 -1046 -1398 -1585 -1569 -1390 -1046 -578
3301 -578 -29 521 990 1359 1545 1569 1419 1103 632 101 -441 -931 -1303 -1529 -1580 -1434 -1125 -700 -176 370 856
3322 856 1250 1497 1567 1454 1167 764 237 -291 -793 -1190 -1446 -1539 -1458 -1198 -798 -310 234 733 1139 1414 1527
3343 1527 1470 1228 857 370 -146 -659 -1082 -1374 -1514 -1470 -1262 -896 -441 86 605 1026 1332 1498 1470 1282 944
3364I44m50n20m97m36l26j83PJ62L30M26N05N01M49L47J81J3j36l01m15m99m96
3385c94m60l47k12m5J22K79M04M80N07M41L92K04O3r1k60m00m47n03m62l73k45
3406a347r1Q4K52L59M64M87M68L84K49J06o7k10l58m34m91m63m01k68j18M9K02
3427a144L23M33M73M71M04K83J30k4j66l26m17m72m69m01k88j55j2J71K84M04
3447d98M69M60M14L07J67K9j48k84l78m61m63m09l21j85l1J15K75L72M45M61M21
3468G57L32J86N3j00k57l52m41m38m45l23k33n6R8K12L50M27M42M25L46K24Q8
3489A295o7k13l11m12m42m27l68k36j07N4J76L19L92M43M45L44K68J18l0j68k99
3510G74l87m33m16l69k73j41RJ56K79L71M20M31L78K70J62J1j41k69l43m34m19
$$ plain form
3364 944 494 -26 -523 -959 -1285 -1468 -1461 -1299 -969 -543 -38 463 912 1259 1440 1453 1317 1016 601 102 -394
3385 -394 -854 -1201 -1413 -1458 -1336 -1057 -653 -173 334 775 1167 1371 1434 1343 1083 683 236 -267 -729 -1102 -1347
3406 -1347 -1438 -1354 -1102 -743 -279 208 676 1060 1309 1415 1348 1138 780 346 -145 -608 -1009 -1277 -1395 -1346 -1144
3427 -1144 -821 -388 85 556 960 1243 1373 1349 1183 857 440 -32 -501 -902 -1190 -1345 -1357 -1186 -902 -498
3447 -498 -29 431 845 1152 1319 1348 1200 916 538 77 -386 -795 -1116 -1301 -1332 -1217 -942 -570 -125 336 757
3468 757 1089 1275 1328 1228 971 619 178 -260 -705 -1028 -1261 -1317 -1219 -1007 -657 -230 212 637 983 1207 1295
3489 1295 1228 1015 704 292 -150 -577 -945 -1181 -1288 -1234 -1058 -739 -347 96 541 885 1153 1271 1241 1073 774
3510 774 387 -46 -462 -831 -1104 -1245 -1236 -1080 -801 -430 -10 421 799 1069 1231 1242 1101 832 489 55 -364
3531c64l75k88j78k0R7K47L44L94M29L88L04J90M8p9k24l37l88m08m05l21j90
3552a136p1O5J90L30L77M21L87L34K18Q5m3j79l08l66m05m16l34k20j06K0J68
3573i89K79L76L87M11L51K34J16j6j45k51l67l94l88l63k56j31j1J36K38L43L90
3594e0L85L75K66J33L6j11k20l38l87l80l68k69j76l2J00K06L13L80L88L71K64
3615H86J89M6o7j94l01l63l86l69k89k01p2O5J84K80L49L82L65L08J94R6m2j72
3637H88k59l34l75l79l13k05j14J1J69K48L26L74L66L10K43J26j1j32k44l26l63
3658Fl53l40k31j25j1J02K19L24L64L54L16K63J53J8r7k11k98l45l67l31k64j67
3680a021k8Q2J85K89L41L61L38K76J69M9n9j90k57l58l54l35k74j81o9O9J54K64
$$ plain form
3531 -364 -739 -1027 -1205 -1225 -1128 -881 -537 -143 286 674 978 1168 1216 1137 913 576 188 -220 -625 -946 -1136
3552 -1136 -1207 -1142 -952 -622 -245 176 563 897 1115 1200 1157 978 670 304 -101 -517 -851 -1071 -1177 -1157 -989
3573 -989 -710 -334 53 464 815 1049 1165 1149 1004 753 386 -8 -396 -759 -1015 -1146 -1157 -1021 -783 -440 -50
3594 -50 335 710 976 1109 1145 1034 814 476 89 -291 -659 -928 -1104 -1136 -1036 -830 -517 -137 251 622 886
3615 886 1075 1121 1054 860 559 196 -190 -559 -848 -1049 -1121 -1056 -872 -592 -243 139 504 812 1006 1102 1060 888
3637 888 629 295 -80 -459 -772 -977 -1091 -1080 -911 -663 -337 37 403 713 956 1082 1071 939 695 369 6
3658 6 -347 -687 -918 -1043 -1054 -952 -733 -409 -45 309 625 888 1041 1059 962 751 453 108 -259 -590 -854 -1021
3680 -1021 -1049 -967 -782 -493 -152 209 547 823 992 1041 982 792 535 177 -177 -512 -786 -967 -1036 -967 -813 -549
3702e49L30L48L48K67J92Q7l1j68k35l20l47l38k86k12r7K5J34K28L20L31L46
3723C73K75K46J01k0j19k20k84l42l43k92k19j35PR7K18K78L40L33L01K33J49
3744I77Pr4k07k77l18l44l05k33j51j7P3J71K73L41L26K97K59J59L6q1j63k57
3766D72l12l28l15k52j65o6N7J48K44L27L21L09K56J81P6m5j31k46k90l35l07
3787d01k67j83q9L1J26K16L05L20L26K63K05R4k9j21k07k84l27l04k90k08r1n
3809i20J13K02K81L13L18K92J93J27kq5k04k66l11l10k95k15j13m1R0J77K52L06
3831i8L16K95K23J44L7n9j69k54k98l25l01k18j62m1O4J49K33L04L05L08K50J59
3853H62N1l8j61k16k95l06k97k62j69p3L2J38K11K89L05K89K69J75Q2j5j07k08
$$ plain form
3702 -549 -219 129 477 744 936 1023 992 824 589 269 -78 -416 -702 -914 -1011 -986 -852 -624 -304 27 373
3723 373 648 894 995 975 856 636 352 10 -333 -625 -844 -979 -972 -875 -657 -379 -39 294 595 828 977
3744 977 984 890 683 406 88 -256 -561 -794 -945 -962 -889 -718 -445 -104 222 519 778 937 973 892 729 472
3766 472 160 -168 -483 -735 -900 -966 -909 -761 -517 -190 131 440 696 877 953 908 777 531 241 -94 -401
3787 -401 -668 -851 -940 -909 -783 -567 -262 58 384 647 852 946 917 796 589 305 -22 -326 -616 -824 -915 -920
3809 -920 -807 -605 -324 -11 307 599 792 919 917 832 628 362 51 -259 -554 -769 -882 -923 -833 -656 -404 -98
3831 -98 218 513 736 880 917 858 689 435 137 -188 -489 -707 -869 -910 -846 -697 -464 -160 145 453 703 862
3853 862 913 875 714 498 203 -103 -400 -662 -831 -904 -872 -734 -523 -234 71 360 629 804 886 871 764 556
3875E56k71l14l03k60j89r8MJ02J92K70L15K95K68K08J00Mr7j71k77k96k96k81
3897e39k12j28mQ9J69K61K88K96K83K12J33L5p5j68k39k80l08k91k15j44m0N5
3919h22J53K36K77L03K78K37J48N7n3j31k14k85k85k88k40j59p4L0J33J98K75
3940b26K83K91K49J81Q5l7r6k07k58k98k93k42j90r5J8Q8J95K50K92K89K48K10
3962G37R9jq6j71k48k91k90k58k01j12k5Q0J53K59K73K82K79J98J27K8n8j49k35
3985C90k73k88k66k21j33l6M9J50K14K63K84K73K26J50N8o0j22k11k70k91k68
4006c82k31j52p5M1J34J76K70K77K88K35J68P8l1j07j89k50k80k86k41j75r7K5
4028h04J09J71K54K76K80K43J80J08%r0j77k47k66k95k43j87j14j1P9J71K28K81
$$ plain form
3875 556 285 -29 -332 -592 -781 -879 -875 -773 -581 -311 4 299 567 775 875 879 782 611 334 38 -258 -539
3897 -539 -751 -879 -883 -794 -625 -364 -76 220 503 715 848 883 808 640 401 121 -187 -478 -693 -837 -877 -822
3919 -822 -669 -433 -156 147 425 662 810 867 814 683 469 184 -101 -389 -629 -788 -862 -832 -699 -501 -226
3940 -226 57 348 597 778 863 826 730 523 265 -33 -326 -568 -758 -853 -835 -747 -552 -302 -10 279 527 737
3962 737 836 835 749 578 330 39 -251 -509 -710 -822 -847 -767 -614 -355 -82 200 479 677 804 832 774 625 390
3985 390 117 -171 -437 -658 -791 -827 -778 -628 -414 -151 133 406 632 782 840 780 658 447 177 -114 -382
4006 -382 -613 -765 -840 -799 -665 -489 -219 58 346 581 749 827 796 689 500 250 -30 -316 -557 -732 -829 -804
4028 -804 -695 -524 -270 6 286 529 709 817 817 727 550 303 37 -258 -501 -688 -802 -813 -734 -563 -335 -54
4050e4K69K68J90J25J2n9j69k15k79k76k61k06j27l8O2J45K25K67K83K58K11J41
4072G72N6n7j40k10k71k69k78k28j37n4M3J22K06K56K75K75K24J51O9j9j21j99
4094D66k44k75k80k38j63p9K8J00J75K62K82K54K47J79Q1nr4j81k34k79k83k24
4116e05k01j00J6Q2J66K41K69K82K57J84J04J8p8j63k44k63k62k60k07j00l9P7
4138g26J50K20K63K78K46K04J35L0o0j51k10k44k85k55k19j34m0M4J23K06K64
4159a61K58K79K08J50O2m8j09j94k62k75k60k08j58q4J9J28J98K39K61K71K31
4180E45J63Q6j2j03j72k62k63k66k36j83r3JR3J81K33K72K67K40J75J14J2r4j56
4203E42k23k64k72k49j88j26k6Q8J42K30K60K68K52K00J22L8o0j42k12k57k74
$$ plain form
4050 -54 215 483 673 798 810 751 582 367 88 -188 -449 -655 -782 -820 -758 -613 -388 -121 162 420 631 772
4072 772 828 771 631 421 150 -119 -397 -625 -762 -816 -773 -651 -445 -189 86 361 585 736 805 786 665 466
4094 466 222 -53 -333 -571 -734 -813 -785 -685 -510 -248 34 288 535 714 795 790 696 515 281 2 -281 -505
4116 -505 -706 -806 -790 -708 -542 -301 -32 250 507 691 795 813 735 572 328 65 -197 -457 -664 -764 -803 -726
4138 -726 -576 -356 -93 185 431 635 770 800 740 589 379 135 -150 -405 -624 -758 -798 -754 -631 -425 -161
4159 -161 97 376 584 734 796 748 639 445 183 -92 -352 -560 -718 -802 -783 -655 -457 -218 43 314 545
4180 545 708 794 782 679 507 245 -18 -284 -520 -703 -796 -795 -702 -521 -288 -16 251 491 666 780 792 698 542
4203 542 319 55 -217 -466 -654 -780 -806 -718 -576 -346 -86 182 434 634 756 794 734 592 380 123 -151
4224a51k49k25j31m9N2J36K12K54K62K62K27J43N0l6j31j87k60k66k72k32j36
4245g27p7J9J25J98K41K69K71K28J64Q9qj02j85k42k81k75k32j64r5j1J04J68
4267e23K34K73K62K57J84J03J5r0j68k27k68k62k46k01j21j4O9J46K11K78K61
4288A73K63K09J28K7n7j46k05k71k68k63k10j36m9M0J31K17K46K73K69K23J43
4309G37P5l8j20j91k66k59k75k49j55o7J8J23J87K33K80K65K34J75R0mr4j83k45
4332B71k66k87k38j76j07lR4J64K37K60K79K49K02J13Qp5j62k28k61k70k64j84
4354f44j40k0O2J46K20K71K77K56K09J35L7l8j57k08k49k88k71k22j32m7L0J39
4376f34J99K54K78K67K26J55P3l9j22j95k46k78k64k42j72o5J8J06J88K44K63
$$ plain form
4224 -151 -400 -625 -756 -805 -753 -617 -405 -151 111 373 600 743 793 757 626 439 179 -87 -359 -591 -727
4245 -727 -804 -785 -660 -462 -221 48 319 547 711 800 792 690 505 263 -18 -293 -525 -689 -784 -795 -691 -523
4267 -523 -289 -16 246 503 687 790 805 715 547 320 52 -210 -456 -657 -778 -792 -723 -577 -366 -88 173
4288 173 436 645 773 800 743 597 392 121 -147 -410 -620 -756 -805 -765 -634 -417 -171 102 371 594 737
4309 737 812 774 654 463 197 -62 -337 -586 -741 -808 -790 -667 -480 -247 33 298 532 707 797 793 699 516 271
4332 271 5 -282 -520 -696 -803 -806 -712 -548 -311 -51 228 477 679 792 800 725 563 335 74 -196 -460 -644
4354 -644 -784 -804 -742 -596 -376 -105 172 428 637 772 809 771 614 406 157 -131 -402 -624 -756 -803 -773 -634
4376 -634 -435 -181 97 364 590 745 818 779 657 462 216 -62 -326 -568 -740 -805 -787 -681 -493 -249 14
4397A4K89K29J83Q3Oj03j83k34k68k84k43j76j17nR6J75K34K68K67K64J93J05
4419G93J3p5j54k41k51k89k50k07j28j2M4J56K25K64K71K56K21J33M0m9j35k24
4441D01k57k70k61k24j53m6M0J31J89K65K78K69K23J56P6j8j25j95k47k79k75
4462c22k26j75p4NJ09J69K58K57K83K38J80J04or3j71k40k69k74k45j99j07j2
4484h10R4J57K23K79K62K56K07J20K3o7j53k13k67k78k71k07j23m0N2J50K03K62
4506a41K75K65K28J29N5n2j21k01k53k72k82k24j57o5L6J25J92K51K80K62K23
4527E53J73Q7k6j20j83k32k74k72k34j83q9OR4J80K44K55K86K37J83J18Lo9j82
4550E55k36k47k92k56j94j14k5O4J69K19K73K69K56J97J29M8n7j27k36k42k80
$$ plain form
4397 14 303 532 715 798 804 701 518 284 16 -268 -511 -687 -804 -809 -713 -538 -304 -36 231 495 688 793
4419 793 806 731 577 336 85 -204 -454 -661 -789 -801 -757 -601 -376 -112 159 415 636 769 809 760 625 401
4441 401 144 -126 -387 -611 -764 -810 -770 -639 -450 -185 93 362 585 741 817 799 674 479 232 -47 -322
4462 -322 -548 -723 -797 -792 -683 -514 -256 1 284 522 702 806 800 707 536 296 27 -247 -492 -691 -798 -810
4484 -810 -716 -559 -336 -57 205 461 668 788 811 744 591 378 111 -167 -438 -645 -768 -808 -756 -606 -403 -141
4506 -141 134 399 627 756 811 759 638 437 184 -88 -370 -594 -751 -816 -780 -655 -463 -212 68 330 553
4527 553 726 813 787 667 484 252 -22 -294 -528 -711 -800 -794 -700 -520 -276 -21 265 502 685 803 806 737 555
4550 555 319 72 -220 -476 -670 -784 -809 -745 -576 -357 -84 185 441 638 767 815 758 631 395 153 -127
4571a27k73k20j43m8M0J34K07K49K74K65K30J66O5l8j16j99k47k72k70k43j63
4592g29q0PJ12J86K61K80K72K27J83R1Nj14j69k37k64k92k41j87j07pP2J58K30
4615c43K86K62K58K00J18K4o3j44k31k73k77k42k23j27m7O1J30K24K70K82K64
4636D09K18J39N0l3j26k02k66k78k74k30j55p2K9J22J98K43K81K62K37J77Q6j6
4658G99r0j95k52k71k77k27k07q4kP6J86K26K70K87K51J86J17J4o9j73k23k57
4680H5k84k60k02j14l8N8J46K31K60K75K71K01J50M2n3j37k03k67k82k75k14j53
4702g63n6L8J13K16K35K84K74K30J57O8kj31j71k58k77k64k47j69q4KJ02J78K49
4725b76K64K85K42J76J12jq2j69k33k77k80k42j96j10j9P7J46K32K71K77K64J91
$$ plain form
4571 -127 -400 -620 -763 -811 -771 -637 -430 -181 93 358 588 754 819 781 665 466 219 -53 -323 -566 -729
4592 -729 -809 -802 -690 -504 -243 37 309 536 719 810 815 701 532 295 31 -261 -502 -689 -796 -803 -731 -573 -343
4615 -343 -57 205 463 663 781 805 742 598 367 94 -183 -425 -648 -775 -822 -761 -631 -407 -137 145 409
4636 409 627 766 816 783 657 455 189 -89 -363 -593 -748 -820 -791 -669 -471 -228 53 315 552 729 815 799
4658 799 709 514 262 -9 -286 -513 -720 -804 -806 -730 -544 -318 -48 239 490 676 793 807 738 565 342 85
4680 85 -199 -459 -661 -775 -813 -755 -609 -378 -118 157 428 629 779 821 768 631 428 161 -121 -396 -610 -763
4702 -763 -819 -781 -668 -452 -217 67 341 571 728 796 794 663 492 234 -43 -307 -554 -723 -807 -805 -703 -525 -276
4725 -276 -12 273 515 691 803 802 720 551 318 41 -239 -481 -677 -787 -806 -729 -583 -351 -80 197 461 652
4747F52J32K2o5j37k19k66k79k52k13j42m3M8J29K12K56K73K66K29J44O6k7j42
4769F44j95k60k66k58k41j61o5J9J28J87K41K58K78K30J81R0j7j00j87k27k75
4790Dk72k37j91j04J5Q5J62K38K71K65K42J93J10J7p4j62k21k66k78k65j86j11
4812g65l4N3J53K08K72K81K54J97J51L7n8j23k15k55k74k52k22j41o6L7J30J88
4834d44K51K66K69K28J55P5k5j09j86k40k77k65k27j69r0J0J14J64K50K51K54
4855B55K44J82Q9Pq0j65k31k65k50k62j84j11j4P7J52K16K50K74K54K07J12L6
4877G93p3j37k05k61k52k72k02j23m6L4J38J91K56K70K59K07J38P0m0j28j81k43
4899A93k68k56k25j52p3K3J13J80K49K53K61K30J51R7j7r7j63k38k69k53k42j63
$$ plain form
4747 652 784 806 741 604 385 119 -160 -412 -625 -767 -810 -762 -633 -421 -165 108 374 603 747 813 786 644
4769 644 449 189 -77 -335 -576 -737 -802 -783 -655 -468 -227 31 309 539 720 810 793 693 506 279 4
4790 4 -268 -505 -696 -800 -785 -700 -538 -300 -29 236 478 671 781 798 724 562 341 75 -203 -468 -654 -765
4812 -765 -799 -746 -593 -385 -113 168 422 619 770 807 749 626 411 156 -118 -370 -592 -733 -799 -762 -632 -444
4834 -444 -193 73 342 570 725 800 775 666 480 240 -37 -302 -529 -698 -788 -778 -664 -500 -250 1 255
4855 255 499 681 770 777 697 532 301 36 -214 -476 -660 -771 -785 -708 -556 -340 -90 184 438 645 757 793
4877 793 720 583 378 117 -135 -407 -609 -732 -778 -744 -606 -415 -159 111 370 577 715 785 745 617 436 193
4899 193 -75 -331 -556 -708 -781 -758 -645 -465 -216 37 298 528 679 776 759 662 499 261 -8 -261 -503 -666
4921f66j11J3Q5J65K27K61K54K39J76J20Pp6j52k16k58k54k51j94j18k3O2J31
4943e79K09K69K47K53K04J37K9m9j33j84k59k70k42k05j50m7L4J16J95K42K64
4964H1K48K31J37P0k3j14j65k43k71k52k22j56r2J5J07J65K35K60K63K27J72Q4
4986G57jq2j65k14k62k63k41j72j20oP5J56K15K60K61K42J82J20K3n7j45k15k48
5009A00k70k33k06j20m8O3J33J92K57K56K37K00J56M3k9j31j88k40k51k65k10
5030e54j43o5K7R9J89K32K56K51K28J58P0qr9j80k33k33k66k24j75p3j2R8J50
5053e07K26K59K46K28J84J00J2p5j50k07k51k54k46j72j18k0N2J45K11K33K42
5074A38K58J86J19M7m4j23k00k55k48k46j97j33m1K9J16J82K36K45K50K12J54
$$ plain form
4921 -666 -777 -764 -679 -514 -287 -26 228 467 643 763 770 694 542 326 68 -186 -437 -631 -749 -772 -710 -579
4943 -579 -370 -101 146 399 603 740 769 720 587 403 144 -126 -368 -573 -723 -770 -736 -620 -425 -183 81
4964 81 329 560 697 767 744 630 465 222 -49 -301 -523 -679 -771 -756 -649 -484 -249 11 274 501 673 757
4986 757 756 674 509 295 33 -230 -471 -643 -763 -769 -694 -538 -323 -63 198 440 622 742 765 708 563 348 100
5009 100 -170 -403 -609 -729 -777 -714 -581 -389 -132 124 361 561 717 760 731 600 412 172 -79 -344 -554
5030 -554 -697 -762 -735 -636 -447 -215 41 292 520 678 748 740 641 461 228 -5 -271 -495 -670 -743 -755 -657 -507
5053 -507 -281 -22 224 452 636 736 748 673 523 316 65 -189 -435 -607 -725 -745 -693 -548 -337 -104 138
5074 138 396 582 701 748 704 581 381 126 -122 -368 -565 -698 -739 -710 -594 -412 -176 69 319 531 685
5095F85N5k1j00j71k49k58k36k11j54o8RR6J66K20K57K42K18J65Q6lr4j63k03
5118B68k42k49k23j79q6j6P9J38J97K55K56K27J75J07J2n8j38k09k25k53k43j78
5140e85j16m6P3J37J82K26K55K39J87J34M3m1j24j88k30k38k35k12j27m4K7R4
5162e89J78K22K51K43J95J46O8j3j00j73k08k39k37k29j50p9J0Q5J50K13K33K45
5184B22K14J78Q1J0q5j43j87k36k46k22j76r7k2O0J43J85K43K34K30J93R6K5l4
5207F66j42j70k52k27k19j95j19m9N1R8J90K25K37K40J76J38O1m0r8j79k16k29
5229e3k30k09j42p2K4J07J42K26K23K41K02J58O4Oq6j62j99k37k25k02j63r9j0
5252f96R6J35J92K20K44K11J67J06Pn6j34j84k34k20k24j82j10l4N3J27J72K25
$$ plain form
5095 685 740 719 619 448 199 -59 -295 -506 -660 -728 -719 -623 -457 -237 20 262 480 645 731 728 634 471 268
5118 268 26 -223 -446 -625 -711 -727 -648 -510 -313 -58 198 425 600 707 719 661 523 314 89 -164 -407 -585
5140 -585 -701 -747 -674 -537 -355 -129 126 365 552 686 729 688 564 376 146 -92 -327 -539 -666 -710 -683 -589
5162 -589 -411 -189 62 305 500 646 714 701 601 428 220 -19 -256 -485 -635 -714 -704 -619 -469 -256 -23 222
5184 222 436 614 695 705 620 477 290 54 -192 -414 -590 -687 -709 -649 -506 -321 -78 156 386 579 675 700 666
5207 666 524 354 102 -125 -344 -539 -658 -707 -656 -558 -368 -143 94 334 510 648 709 669 571 392 176 -53
5229 -53 -283 -492 -634 -706 -682 -575 -433 -207 16 257 459 617 681 687 601 439 240 3 -222 -424 -587 -686 -696
5252 -696 -600 -465 -273 -53 191 402 569 675 682 626 492 308 74 -146 -370 -552 -662 -696 -643 -516 -344 -119
5274a19K29K23J98J10M3l1j23j67k16k40k25j94j19m4K7R7J60K21K31K17J90J41
5296F09N5qr1j49k21k13k23j95j54q2J2Q4J37K05K15K44K01J37J00Mo6j55j82
5319B64k16k35k04j65q6k2N5J24J87K10K21K24J77J09J7l4j26j71k06k36k10j81
5341e04j12m1K9J12J68K05K26K08J88J33N8l3q9j64j96k26k24j97j33n0OQ1J45
5364d10J99K29K28J78J49P5pp6j39j92k14k22k07j38q2rN5J35J83K23K20J99J55
5387E32R6Rm9j22j74k17k13k07j67j12k6N8J15J74J92K17K02J90R7M6l5r5j75
5410C36j97k13k04j81j34l4J4Q5J51K13K09K09J72J37N6j2p3j50j77k30j91j97
5432d11j40n4LN8J39J77K20J99J82J55P5No3j20j86j93k18j87j38q8k5M8J18J75
$$ plain form
5274 -119 110 333 531 641 684 653 530 363 147 -93 -318 -512 -631 -675 -648 -551 -391 -170 61 278 468 609
5296 609 664 656 565 416 195 -18 -241 -436 -590 -672 -660 -576 -439 -234 -19 225 426 563 663 667 601 446 264
5319 264 48 -187 -391 -556 -642 -664 -609 -485 -298 -88 133 357 534 643 660 626 500 329 123 -113 -323 -504
5341 -504 -616 -657 -628 -516 -348 -143 83 291 479 612 670 637 548 384 188 -38 -262 -459 -592 -642 -636 -555 -410
5364 -410 -211 18 246 424 573 648 641 565 426 234 20 -202 -409 -547 -629 -638 -583 -448 -265 -42 178 377 532
5387 532 628 637 588 466 292 75 -138 -345 -512 -624 -650 -592 -477 -303 -111 106 308 498 595 641 606 511 336
5410 336 139 -74 -278 -459 -593 -627 -613 -528 -377 -164 45 254 426 563 619 607 534 384 207 -23 -214 -411
5432 -411 -551 -605 -602 -544 -405 -228 -8 191 373 528 603 608 545 425 239 46 -172 -359 -497 -585 -610 -562 -444 -269
5456b69K08J94J88J53R8M4n2j07j55j85k04k06j65j05l6L1R3J66J76J93K07J70
5478D37J16M2l1p9j38j96j84j89j75j25n6LQ0J40J70K00K01J65J37N7jp7j11j71
5502B15j99j93j81j40o3j5N6J22J60J93J91J87J23R6J9m1j16j58j89k01j84j35
5524d53r1l1M3R5J59J83J92J82J52R6L2k9q5j56j68k02j70j53j15l3K1Q5J27J78
5548a41J82J87J55J09O4j9q2j25j58j95j84j61j22n0J1O4J22J53J88J77J56J29
5570D60N9K3o0j25j54j72j81j59j35p7j8O4Q3J63J78J68J78J44O9J3l2j04j34
5593B51j69j78j68j54q3j7K3Q9J36J73J79J66J32J00M4l7p6j20j64j80j79j55
5615c87q4l5J0Q0J13J51J81J65J54J06N1j7n5j19j51j68j71j54j15n9LN0J17J53
$$ plain form
5456 -269 -61 133 321 474 572 616 564 457 302 117 -87 -293 -458 -563 -599 -568 -475 -309 -133 60 267 437
5478 437 553 595 564 485 347 151 -33 -222 -397 -522 -578 -575 -495 -355 -185 15 216 381 518 575 574 497 386 215
5502 215 16 -177 -358 -498 -561 -576 -520 -398 -238 -45 146 333 456 552 571 530 414 256 67 -134 -318 -453
5524 -453 -544 -575 -532 -437 -278 -95 97 279 431 527 559 530 445 289 121 -81 -251 -404 -519 -552 -531 -446 -319 -141
5548 -141 41 228 383 492 556 537 455 330 172 -23 -207 -368 -490 -540 -529 -465 -343 -190 -2 175 331 460
5570 460 519 542 482 357 203 31 -150 -309 -444 -521 -539 -475 -392 -229 -51 117 295 439 508 521 489 385 251
5593 251 82 -96 -264 -418 -501 -518 -495 -406 -270 -97 82 248 380 480 524 487 411 291 127 -53 -232 -387
5615 -387 -471 -506 -496 -416 -303 -152 29 194 348 454 505 488 433 314 163 -5 -176 -330 -445 -504 -501 -451 -334 -181
5639a81J72J62J47J27M6J0m3r4j52j57j72j57j34o4j6O6P6J46J68J64J57J21Q3
5662D75J1l0r6j20j69j67j49j21r4k5K7R6J06J65J62J58J32Q0L9k9o6j21j48j56
5686d0j67j49q2l1kQ0J15J36J56J65J34J02L9%m8j11j26j82j56j32r1o5j4O5J06
5711b98J42J44J49J51R4O8Pn3r7j25j43j55j54j07o5jK9Q1J25J61J40J47J21P2
5735D33K1k9q9j25j34j54j42j20q8k8L3P6J19J36J60J37J26P2M3k2o2j08j62j34
5759d1j40j31r2l0MP0J12J31J37J48J32R4L9mn5j09j30j44j52j01j06n5KN8Q8
5784b75J28J37J40J39R4N1Pl9j04j25j33j36j38r2n9k0N7P1J25J33J38J30J09
5807C38N9J1l9p1j09j31j33j45q7p7k6K8P8J02J28J39J31J06O9K8k3m7j17j23
$$ plain form
5639 -181 -9 153 300 427 473 483 440 346 194 37 -135 -292 -426 -490 -506 -440 -364 -218 -50 114 271 392 475
5662 475 486 456 360 240 71 -96 -245 -366 -460 -485 -458 -362 -256 -91 71 229 361 441 480 451 385 264 116 -40
5686 -40 -207 -356 -438 -469 -471 -391 -276 -140 16 181 315 417 456 456 408 297 171 -11 -167 -299 -390 -455 -469 -404 -298
5711 -298 -156 -12 137 288 382 450 457 404 307 182 39 -116 -270 -377 -442 -443 -414 -333 -208 -47 93 240 361 433
5735 433 454 425 336 211 77 -77 -219 -339 -427 -455 -422 -346 -227 -91 69 206 332 404 447 425 363 255 93 -41
5759 -41 -181 -312 -404 -434 -430 -360 -248 -117 20 168 300 394 433 429 374 265 135 -9 -161 -262 -368 -423 -421 -363 -275
5784 -275 -147 -10 130 269 363 414 421 382 278 153 20 -116 -254 -346 -405 -425 -368 -297 -172 -39 99 229 338
5807 338 397 408 369 298 189 58 -75 -220 -307 -384 -410 -382 -304 -202 -74 65 196 302 371 399 376 329 212 89
5831H9j33j36j14n8m3J4O1R2J28J28J24J19Q1M2j1n9r7j23j07j33j19q8m3QN4
5856c24P9J18J34J22J29P1N2Nn2p8j14j25j37j03r4m7pL7P9J11J07J47J12Q7M8
5881C57J1l6n1j21j19j14j35q9n5j7L2N8J06J21J19J33Q3O5J6k4o6q7j32j07j25
5906a77r4o6k2J3O0R6J14J21J04J12P0K9j0o5p3j22j22j26r9p0k9J7L9Q4J10J20
5932A4J07J08O9O1j0m6q7j00j19j11j18o6n6RM0P5R9J20J11J13Q1M7Lm0n8j11
5958A35j05j30r9r7m3j6L5P4R9J08J17J05R1N4J5l3o1r5j04j23j09q4n7k6L0N2
5984b67J07R6J21J16P8O7K2k6m6r2j04j25j00j01o6k5K4N0Q2R6J16J28Q9O3L2
6009C35j5l9q2j16j10j01j13o4l5OM8P7R6J10J22J12N1N1nl5p8r1j16j11j05q6
$$ plain form
5831 89 -44 -180 -294 -352 -395 -381 -320 -228 -100 28 152 271 352 394 383 324 227 104 -3 -136 -255 -343 -386 -378 -324
5856 -324 -245 -127 7 129 258 329 381 386 334 256 142 17 -120 -223 -317 -364 -371 -334 -255 -144 -37 110 222 309 357
5881 357 368 332 281 160 41 -73 -208 -297 -352 -369 -337 -279 -173 -52 67 200 283 348 364 340 274 187 55 -52 -177
5906 -177 -271 -337 -359 -346 -286 -190 -76 45 149 261 331 360 350 285 212 90 -32 -158 -257 -327 -356 -339 -300 -216 -106 14
5932 14 121 229 298 359 349 303 216 116 -3 -114 -232 -298 -354 -345 -305 -230 -131 -11 100 213 294 341 344 304 246 135
5958 135 30 -100 -199 -296 -339 -355 -320 -246 -147 -39 78 183 274 328 343 310 249 154 50 -73 -182 -266 -323 -349 -319 -267
5984 -267 -160 -64 57 173 251 318 340 314 268 176 72 -53 -153 -254 -320 -345 -321 -271 -189 -93 23 151 240 303 335
6009 335 320 281 199 83 -27 -128 -241 -305 -340 -334 -286 -209 -113 -3 119 231 282 333 328 293 215 124 8 -103 -208 -294
6035b94l1pL2P2J02J08J19Q7Q9M6J0k8q1r0r6j24j08q1m4j3K3N4J03J09J09J12
6061A78P7N7J5k2o6q5j01j13j13r3n5j0J5N6Q3J08J07J10Q6N9K8on3q3j06j14
6087d1j06q6o5l1OO0P6R0J17J03R7O8L2J2n1p7r5j09j14j10o1k9qL8P3R3J07R5
6115H4J15P2L0J7l7o2r8j12j11r0q0m3qK7N6R1J07J20Q7R2M8Rl3l9r4j12j03j01
6143a68r1m6j6K2N2Q2J10R7J06R1M7L6j8n9q4r3j14j09p7o3k1J0N2O2J19R7R2
6170A16J06N1L3Jm5p8j00r8j14j01m7l0ML0Q2Q6J09J08Q9N8M4Km0p1q4j18j04
6197a11r6n5m4qL1P5R4Q8J15Q9Q9L1J1k6o5j03r7r6j03o5m6j4M5M4Q2J05Q7J09
6225A66O9M6K2k7m2r2j00j01j04q0n4kJ3O2O2R8J15Q5R1N2J7j7m1q1r4j04j00
$$ plain form
6035 -294 -325 -332 -300 -228 -126 -18 101 188 277 323 333 305 224 134 38 -86 -194 -275 -319 -332 -309 -255 -152 -43 66 178
6061 178 255 312 327 305 239 154 53 -60 -173 -266 -321 -331 -316 -260 -177 -69 38 148 234 293 321 315 262 179 73 -41
6087 -41 -147 -233 -298 -329 -323 -263 -187 -97 20 123 220 288 320 332 281 204 109 0 -114 -224 -285 -314 -322 -284 -211 -118 -11 84
6115 84 199 271 301 318 281 219 121 9 -102 -192 -272 -315 -323 -296 -240 -149 -42 78 165 257 305 314 281 242 148 36 -67 -168
6143 -168 -259 -305 -321 -299 -247 -165 -55 42 148 239 286 322 304 245 161 68 -46 -155 -232 -295 -316 -306 -254 -192 -73 24 116
6170 116 222 273 306 307 262 184 84 -14 -128 -229 -276 -306 -302 -272 -190 -104 5 113 202 260 304 306 266 195 111 -7 -111
6197 -111 -207 -262 -306 -314 -283 -208 -114 -26 89 178 267 298 309 283 218 115 18 -78 -181 -246 -292 -306 -261 -217 -135 -30 57 166
6225 166 235 281 303 276 234 142 42 -59 -163 -243 -297 -299 -286 -224 -162 -64 51 136 227 279 296 279 238 157 63 -41 -141
6252a41q6n4k6J8M4Q0Q8R9R7Q7O8L1pm1p4j00j00j03q4o0l4JL4O4R2J17Q8J02
6280B00O5K9J1m4o7q4j09r8q6q0k6j3M5N4P9J06J13P4Q0M6J9m7m6q9j05r9j11
6307a83n8m8j4K6N5O9J24J03R1O0P2J1j3n3r5r4j04j02r1l3l6K5N0Q1R6R9J08
6334A46Q2N3K5j3m3p9j00j00r5r5o0k4QM0P0R4R7J07R5M9L9jk7p8r9r2j03j05
6362b09n0m1j0M0O8Q0J07J14Q9O8L9J1l1p0r0r4j13q6o8o2kK4P1Q7J02J06R2P1
6390B43N3Qk7n6p9r8j11r5q3m7j2QO1Q9R2R7R9R0O2J7j8n5q1r3j00j01r9m9k5
6419c10J3N0P2J07R7J02R0O0L1j0m0p3j05j01j06j01n0l3kM3P9Q7J04J22Q1O1
6445B68M4ml4o4q9j24r9j08o3l5jK9P5R1J14R3R2Q2L8Jk5n7r1j16q8j10p8m8j6
$$ plain form
6252 -141 -227 -281 -307 -289 -245 -165 -77 22 119 206 274 305 298 257 183 83 -17 -120 -204 -264 -298 -297 -263 -199 -107 10 98 200
6280 200 265 294 305 261 194 110 1 -97 -183 -263 -289 -302 -257 -203 -124 -18 95 169 249 295 314 267 221 132 27 -72 -183
6307 -183 -241 -289 -303 -277 -222 -153 -29 74 165 225 297 308 295 242 147 53 -51 -153 -244 -277 -313 -288 -238 -157 -61 38 146
6334 146 228 281 306 293 250 171 71 -29 -124 -219 -279 -303 -295 -255 -185 -91 6 113 208 257 296 295 268 190 91 -1 -104 -209
6362 -209 -259 -300 -310 -270 -202 -122 -15 99 188 256 295 306 275 205 115 21 -92 -178 -246 -308 -310 -286 -215 -128 -26 80 172 243
6390 243 296 304 277 221 142 44 -67 -162 -245 -292 -304 -296 -235 -146 -54 43 142 232 294 311 293 238 157 64 -36 -137 -236 -285 -310
6419 -310 -297 -247 -175 -68 29 131 221 281 312 302 262 189 84 -17 -123 -224 -274 -307 -309 -266 -187 -100 4 126 207 268
6445 268 312 308 274 210 121 -3 -102 -210 -273 -308 -309 -280 -205 -114 0 93 185 267 305 306 281 224 133 17 -71 -181 -259 -307 -323
6474c23L1N7Q8J14J05R8Q3L7K0j3o6q2j02j04j08j00k5k7J2N5P8J01J11Q5J01
6499B26O6K1j6n0p3j10j06r8p9p7k0KO7O7J01J03R7R4O2L7om6p7r1j12r3r7p5
6527b83m3MN4N9R1J09J15R7O1M9ok1p1r5j12j01r9p3m7mJ6P0J00R9J09J06Q8L6
6555C08Qj9p3p8j07j22r4p0n5k1K7M8J04R0J18J04Q7O5Lj8o3r1q6j14j21q2m5
6582b97l0RN3R0J04J08J04R9M9L5om1q7j09j07j14r2q0j1ON2O5J02J15J09R3P1
6609B90L4mm2o0j23j06j02j07p0m3jM8N6J03J05J35R7P4M6qk0p7r0j16j07j11
6635a99p8n5j3K8P6J00R3J31R7R2N7Nj1p1r2j17j02j16r3o4j8K7M4J02J10J17
6661E0J10R7O4K5k5m4q5j19j05j27q6q0k6NM5R5J01J24J14J01P0L9Km8q4r4j23
$$ plain form
6474 -323 -292 -235 -147 -33 72 170 253 290 310 297 231 149 47 -57 -165 -265 -290 -317 -305 -250 -172 -71 40 125 226
6499 226 292 313 297 247 174 64 -42 -140 -219 -296 -316 -314 -247 -180 -79 24 121 215 277 314 308 262 185 94 -18 -111 -208 -283
6527 -283 -326 -322 -268 -209 -118 -9 106 203 264 313 307 286 215 120 8 -93 -192 -265 -312 -316 -300 -230 -130 -31 78 184 272 308
6555 308 316 297 224 146 39 -83 -177 -247 -302 -323 -296 -248 -144 -54 64 168 255 320 323 305 242 151 65 -49 -170 -252 -297
6582 -297 -327 -318 -265 -175 -71 37 141 240 289 324 318 277 190 81 -26 -140 -232 -312 -323 -317 -265 -200 -98 17 126 219 290
6609 290 324 320 278 218 95 -11 -113 -220 -290 -333 -334 -286 -230 -127 -22 113 210 284 330 322 302 225 135 19 -88 -199
6635 -199 -277 -332 -345 -317 -241 -141 -48 83 180 272 329 334 323 252 160 43 -59 -175 -268 -332 -350 -323 -279 -177 -67 50
6661 50 160 257 321 346 321 277 192 73 -32 -159 -245 -325 -351 -346 -301 -206 -105 19 133 234 304 343 345 297 213 119 -4
6688dj22j07p3m1qL8Q5Q9J27J23J05Q4N7kk3q4r6j22j20j12r3n4j0K6P3R3J29
6715d2J22J12R0O7K1l8o2j13r5j43j09r5o4j7J3O2R6J15J39J18R3O9K7j9m9r6
6741B02j08j29j22j10p5l4JO9J04J03J15J24J13Q6L3J3n9r0j20j29j16j23p2n0
6765c74LL7P8J18J27J18J18R3M3J4l9p2r8j31j37j13r9n7k6L7P7J02J27J33J18
6790A97Q7P1K1j6o2j15j09j30j27j11p5k6K2O9J01J17J26J37J07P1L2j6l9j08
6814B24j13j36j35j04q5m0J4M5R9J07J28J40J07Q8M9J1o3p1j23j28j33j15r0n9
6838c83nL2Q0J09J40J26J23J06N4J6l5p8j11j30j29j27j10p1%J7P1J11J27J36
6862F9J22J02P6L1j7p5r4j20j34j53r4p6m0L0L9J01J27J40J38J03R3K8Lp3p9j26
$$ plain form
6688 -4 -126 -233 -306 -347 -355 -317 -232 -143 -16 107 212 296 353 351 328 244 148 26 -94 -206 -299 -353 -363 -337 -264 -171 -42
6715 -42 80 192 282 349 370 332 270 157 62 -81 -190 -285 -349 -366 -353 -291 -195 -80 59 177 270 339 366 347 298 202
6741 202 94 -35 -157 -267 -342 -376 -375 -306 -202 -99 16 140 253 339 372 385 326 236 116 -13 -129 -252 -324 -374
6765 -374 -371 -334 -256 -138 -11 107 225 318 361 375 336 264 166 35 -102 -215 -314 -371 -397 -360 -283 -181 -54 79 197
6790 197 284 355 376 360 298 183 74 -56 -183 -294 -369 -395 -373 -304 -203 -86 40 177 284 355 387 371 332 224
6814 224 111 -25 -160 -264 -349 -389 -375 -330 -231 -124 4 144 251 339 388 399 336 265 142 14 -119 -234 -324 -383
6838 -383 -388 -356 -276 -167 -27 99 222 328 382 398 363 285 174 44 -85 -212 -322 -393 -393 -376 -305 -194 -67 69
6862 69 191 293 369 400 383 308 214 94 -40 -193 -287 -363 -403 -373 -334 -233 -106 34 172 275 368 396 399 326 247 121
6888A21j42j34j19q0m8QN0Q9J12J32J35J29Q5N5kl3r3r3j42j41j29r2o4j5N2O7
6914b92J14J29J36J39R8N6K9k7p4j10j40j39j28j06p2l7L3O7J10J21J39J31J20
6937B97Q3M0l7n4j02j17j35j47j13q1m1LP2Q2J32J36J42J17P8M9pm2r2j30j43
6962a0j26j21j09m3qN5Q0J20J40J33J47Q9O3Ol5r6r4j47j39j37j05o3j9L3Q4R7
6988b05J33J47J32J26P2J3k0p4j13j36j40j29j19q6j9LP1J16J30J42J33J18Q7
7011C82L5no3q3j48j41j41j27r1l5lN9J02J22J40J41J30Q6O1Jn2r5j07j45j48
7036a25j47p7p1KL7Q7J07J52J28J47J09O2K2m1q6j13j27j42j32j23q5rK5O2J18
7061b20J37J32J38J28Q5K3pp4r8j38j47j36j31p9n2J9N4J15J25J44J45J33Q8L8
$$ plain form
6888 121 -21 -155 -274 -354 -402 -394 -344 -255 -143 -11 124 253 338 393 391 358 265 172 30 -111 -240 -332 -396 -411 -359 -292
6914 -292 -178 -49 87 226 324 380 409 382 308 198 58 -81 -209 -315 -387 -424 -391 -324 -214 -93 46 177 297
6937 297 380 420 383 329 227 110 -25 -172 -285 -366 -407 -404 -332 -250 -118 18 160 277 355 404 397 355 263 133 -10
6962 -10 -136 -257 -366 -409 -417 -362 -282 -162 -22 111 258 347 410 416 381 285 191 44 -95 -232 -337 -400 -419 -386 -302 -205
6988 -205 -72 75 207 333 405 418 398 324 211 75 -65 -194 -313 -399 -418 -415 -344 -228 -98 44 177 295 382
7011 382 417 412 349 266 118 -23 -164 -291 -382 -417 -420 -361 -259 -137 3 144 274 360 421 422 370 275 168 23 -125
7036 -125 -272 -349 -420 -418 -381 -294 -187 -35 93 240 349 411 433 392 306 193 66 -76 -208 -331 -416 -425 -400 -338 -220
7061 -220 -83 49 187 315 400 423 416 342 244 106 -41 -177 -308 -387 -439 -420 -366 -251 -126 18 163 296 384 422
7085D22Po4r6j21j41j44j37r1o2KL1J03J21J49J43J37R9N6J9l5q8j21j44j43j45
7110b43j01o8l4M4Q0J16J53J42J35J14P7J3j9q2r3j43j53j52j15p0l6RQ1J09J31
7135a05J44J38J39P7M2j0n6j03j35j48j38j32r1o2jP3R6J29J41J42J41R2N2J1
7159D36m9r6j26j46j42j27j16m6j7M3R0J18J32J48J30J16O7J8k5q3j19j32j48
7182g4j51j14o8k9K6P2J08J42J49J45J15P7L2j8p0j12j20j40j53j32q3k6PN1J16
7207b50J31J41J43J29R8L9Lo7r5j28j50j25j51r9m5J4K5R3J24J48J38J41R6N9
7231D12J7m8q8j05j45j53j31j16o0oK2Q7J15J38J47J47J08O0L2l0p3j02j46j53
7255g1j38j09q0m2L6P4R9J35J44J34J24P5M7j8o0j05j26j44j39j27r1m2QM7R7
$$ plain form
7085 422 429 365 269 148 7 -137 -274 -365 -427 -425 -394 -291 -170 -21 122 259 358 414 433 398 310 189 45 -98 -243
7110 -243 -344 -412 -446 -402 -322 -206 -53 89 224 338 415 428 409 327 234 91 -62 -214 -329 -399 -435 -426 -345 -236 -105
7135 -105 39 177 316 393 435 425 369 266 131 -17 -155 -287 -378 -440 -441 -368 -272 -143 -2 140 281 373 425 436
7159 436 387 291 165 19 -123 -250 -366 -412 -429 -386 -296 -178 -46 102 232 348 415 433 408 325 206 74 -74
7182 -74 -225 -339 -407 -436 -410 -338 -230 -88 61 206 321 398 430 412 342 230 110 -30 -183 -315 -398 -424 -417 -366 -250
7207 -250 -119 22 165 294 392 431 434 367 272 144 -6 -131 -282 -381 -426 -412 -387 -294 -170 -22 116 257 353 412
7231 412 429 381 293 188 43 -110 -241 -357 -417 -423 -401 -314 -199 -61 86 233 341 401 433 403 330 228 82 -71
7255 -71 -209 -318 -398 -440 -404 -330 -231 -96 48 182 306 381 428 410 350 245 119 -25 -164 -291 -382 -424 -416 -369 -272
7280b72J35J48J42J22R1M9%m9q3j36j31j50j29r1p1JL3J04J19J32J48J37R8N9
7304D06K4l0q6j30j37j42j36j05n3l0K1P5J13J29J51J43J08O3L1qp5j04j44j30
7328d6j53j08q3l9J8O5J17J14J59J26J20R5L6no2r4j35j45j44j17r1n9OM6J14
7353b65J26J39J48J19R9M6Jm2r6j16j34j47j23j14o1lL7P9J26J30J42J35J12N6
7377C94L7m2p9j14j41j40j43r7p5j5J2P2J19J34J36J45J06Q7K7k5o0j11j24j46
7401d3j37j04r9l6K1N1J00J19J60J30J21Q5L5J4p3q0j35j26j43j33r8l7qM6Q1
7426b89J28J33J44J32J09M9%l0q8j06j46j51j21j02o7mK4P3J21J42J22J42J07
7449C22O1K9l6o2j10j34j47j31r6p7k7J6O8R3J32J44J25J29P4L2ko9r8j27j38
$$ plain form
7280 -272 -137 11 153 275 366 415 415 366 283 147 16 -134 -263 -354 -425 -424 -391 -287 -168 -36 112 249 347 406
7304 406 430 400 314 184 47 -95 -231 -336 -389 -419 -398 -323 -210 -81 70 213 321 384 415 407 332 228 84 -46
7328 -46 -199 -307 -390 -429 -411 -346 -229 -115 44 170 290 385 421 416 354 260 125 -20 -164 -281 -372 -431 -425 -379 -265
7353 -265 -139 0 148 267 366 412 413 371 275 159 25 -122 -245 -359 -420 -423 -386 -307 -181 -51 91 226 338 394
7377 394 431 389 310 196 55 -85 -228 -325 -400 -415 -403 -331 -212 -78 58 203 309 396 423 398 338 227 103 -43
7401 -43 -180 -284 -383 -419 -398 -347 -247 -128 32 162 283 368 403 417 344 264 129 3 -140 -273 -371 -408 -416 -370 -289
7426 -289 -161 -28 116 248 357 406 406 376 288 182 36 -115 -236 -338 -405 -409 -385 -312 -191 -49 73 215 322
7449 322 383 412 376 314 204 70 -77 -208 -304 -381 -408 -392 -324 -231 -99 45 170 299 373 405 403 334 236 109 -29
7474b9j40j22p5m2KN3J06J22J40J40J13R9L9Ro5q9j28j26j34j27q9n1rL9R2J10
7500a62J35J32J26J00M8K1l7p4j08j41j41j23r4o6k1M6O7J12J11J37J38J11O0
7523C77K1l4n5j05j17j41j24j29n6l7RP1Q9J30J37J41R6P6M9j4m4r6j28j27j32
7548a43j27p9m1nN8J00J02J34J39J04J00M1J3n4p2j23j37j18j25r2n1kK2Q4J11
7573a61J30J17J27J10N0J1j6p8j07j19j35j25j01o4k0J5P9Q5J35J22J16J18O7
7596C56M0k0o8r8j20j31j25j15p3l3RO0R3J10J18J38J06R4K2J8o8q3j09j15j34
7621a28j25q1m4MK6R7J08J29J26J19P8O5Jm3p5r4j27j33j19p7p0j8L6P7R7J36
7647c5J03J26J07N0J5k2o7r6j21j19j20r9o5k0PN7R6J13J28J26J08O8J9Kn3q9
$$ plain form
7474 -29 -169 -291 -366 -408 -406 -353 -247 -125 15 155 268 367 406 415 350 261 133 7 -127 -254 -343 -394 -403 -364 -272 -162
7500 -162 -27 105 231 331 379 400 363 289 181 40 -101 -224 -318 -384 -405 -359 -292 -180 -69 68 206 317 377
7523 377 398 364 309 204 87 -54 -178 -307 -363 -400 -391 -320 -231 -101 36 177 273 349 398 384 340 244 116 -11 -143
7548 -143 -270 -349 -390 -395 -337 -237 -135 -1 138 242 342 383 396 342 270 147 10 -108 -233 -325 -376 -378 -356 -272 -161
7573 -161 -31 86 213 323 373 384 368 290 183 64 -71 -196 -297 -361 -381 -366 -287 -202 -67 55 171 289 356
7596 356 396 376 308 210 90 -41 -166 -281 -354 -387 -378 -318 -225 -115 3 141 247 341 363 381 313 230 121 6 -128
7621 -128 -253 -334 -378 -374 -348 -251 -143 -14 112 231 309 374 375 332 257 163 36 -97 -216 -293 -363 -381 -345 -268 -171 -35
7647 -35 68 194 301 351 366 344 277 181 60 -59 -179 -278 -343 -363 -356 -299 -203 -90 38 164 272 340 359 361 308 219
7673B19j08j31j15j15o7m0kN8P6J10J24J14J19P2M8Ln6p8j02j20j12j20q3m8L
7698c51K6O9J10J19J27R8R7N2J0j9q2j08j02j23j15r0n4k0K7N5R8J25J14J14J01
7723B78N8K0j2o0q6j22j17j18r8o4l4K1O0P8J04J18J05J15O5L9pn4p5j10j13j35
7749a44q9p5l0pM1P9J06J06J27J06Q4L9Pm0o8j04j06j08j32q3l2j3K1P7R6J08
7775c4J20J13Q3M4J2j3o0q9j26j15j13q2o3k9K6N8R9J07R8J29Q5N1L7k0m6q7r9
7802H6j30r2j00p7k9PN0Q9Q1J25J07J06P6L4lm8o2j08j09j13r0q7l8LK5P5R1J13
7830a8J09J00P8N2Kk0o9r3j12j11r6q0n5j9K0N6Q5J18J01J05Q6O3J7k1m1r2j02
7857F3j13r7q3o5k2JN0R1R3J18J15P7O9L1mn7p3r8j03j22r3n0n0J4L3Q1R1J09
$$ plain form
7673 219 111 -20 -135 -250 -317 -357 -359 -301 -225 -115 9 123 242 314 362 365 309 231 129 9 -103 -223 -306 -354 -351
7698 -351 -325 -256 -146 -27 100 198 295 347 357 338 256 148 46 -77 -192 -282 -336 -356 -329 -274 -176 -51 63 177 278
7723 278 336 356 344 284 198 76 -41 -159 -257 -321 -355 -334 -274 -196 -92 26 131 246 311 350 343 289 214 104 -9 -144
7749 -144 -233 -308 -338 -345 -304 -225 -119 -13 114 220 304 343 350 310 242 138 32 -76 -208 -291 -323 -336 -315 -238 -142 -34
7775 -34 86 199 282 326 338 325 265 176 50 -65 -178 -260 -323 -352 -326 -268 -169 -62 36 165 250 301 338 318 272 185 86
7802 86 -44 -136 -236 -313 -342 -335 -285 -196 -115 10 117 223 299 333 330 282 220 112 3 -110 -200 -287 -325 -322 -297 -222 -131 -18
7830 -18 91 191 269 321 323 303 234 141 29 -82 -178 -258 -313 -332 -312 -256 -171 -53 48 153 239 302 319 298 257 165 63
7857 63 -50 -147 -230 -295 -317 -316 -266 -175 -82 36 151 228 297 328 324 267 194 96 -7 -129 -222 -272 -322 -308 -275 -194 -103 6
7885FJ05Q6O0M2Jk9n4r7j16j07q8o2n4j9M4N5R6R7R9Q9Q1N1J8j8o5q0j06r8q8
7914a51p9o0j9K2N4Q3Q9R9R5R0N5Qnm5o7r6j11r3p9o1k2kN8P4P0J08R9Q3O0L0
7944B87Pm2o6r7q0j09p0q5l1kL4O0R1R2Q7R5Q4K7Qj6o8p4r5r8j07n9l3l3L2N0
7974b11P6Q5J01Q8P8M5J6qo2o2j07q5r2p7l5k7JO4O0Q3J10Q3O0P0K3j4m2o0r0
8003G1q7q9q6m3m4ML7O1P7R8J12O7N7J8Oj3p4q1q5r2p9p1l6QL2M5P6Q8Q4R0M9
8034B00N9kj5o3p1p8r8p7o9l6pK4L6Q4Q2Q3Q4O6K8L4k3l9q0p7q7q4o2n9oK5K6
8065b02O3O7R7Q9O0M6K7Mm8n5q0q3q7o3m9m8J1L1N2Q6P6Q6P5O0K9nl3l8q1q2q5
8096h0o3o2l4j4L6L9P7R2Q2P8M7K8L2l6m3o4r5p4p9o5l8j1K4M2N9Q1Q7O2O0N0
$$ plain form
7885 6 111 197 257 299 300 271 217 120 4 -103 -191 -253 -307 -326 -282 -227 -131 -34 65 154 235 286 304 286 221 141 35 -63 -151
7914 -151 -230 -290 -309 -287 -233 -150 -61 38 133 223 278 286 281 236 169 73 -38 -131 -210 -271 -293 -295 -237 -163 -93 15 114 197 257 287
7944 287 294 252 186 89 9 -100 -170 -255 -286 -288 -254 -194 -103 -11 76 171 255 282 290 274 206 132 37 -61 -168 -227 -260 -293 -261 -211
7974 -211 -135 -50 51 139 217 262 278 270 208 146 39 -46 -138 -215 -250 -277 -276 -212 -152 -69 41 124 184 254 277 263 221 161 71
8003 71 -16 -105 -191 -234 -278 -274 -237 -176 -99 -1 111 178 235 253 259 246 172 91 6 -86 -165 -236 -272 -264 -232 -187 -111 -23 61 151 200
8034 200 259 257 242 179 108 30 -68 -145 -214 -250 -257 -233 -197 -113 -31 52 136 202 230 264 241 202 122 45 -42 -126 -188 -247 -253 -228 -202
8065 -202 -139 -72 25 114 174 220 247 251 203 148 68 -15 -102 -165 -214 -262 -251 -220 -168 -82 -6 80 155 215 244 239 206 168 87 5 -80
8096 -80 -143 -205 -239 -253 -217 -178 -101 -9 73 151 198 226 258 222 179 115 20 -54 -133 -198 -236 -247 -223 -181 -122 -41 46 108 168 218
8126B18K6j9m2n8q2p4q7o6m3j4MN1N6P5P4P6Q3L1K7j1l7n7p6p1p1o0n7k2jL7L8
8157a52Q2P1Q1O7N5L2j4j2o5p0o7q9o7m5l3JJ8N7N7P4Q1O1N4L5J0k5l8p1o4p8
8187e4p0n5k9j2
$$ plain form
8126 218 244 225 183 125 43 -31 -118 -184 -227 -241 -237 -186 -130 -55 19 95 178 209 236 225 188 131 55 -16 -87 -147 -204 -226 -227 -190 -152
8157 -152 -70 1 82 149 204 236 222 210 145 75 8 -81 -148 -193 -226 -225 -207 -150 -93 -19 62 123 177 212 222 197 159 88 24 -54
8187 -54 -124 -179 -208 -220
8191b20
$$ Imaginary data points
##PAGE= N=2
##DATA TABLE= (X++(I..I)), XYDATA
0@%%%%%%%%%%%%%%JrJ6j6J6j9K7l2L9m7N4o2P2q2R1j06J22j39J60j83K08k35K63
37A39k94L30l70M12m58N08n61O21o87P58q37R23j016J118j233J359j498J654j831
56i63K030k258K524k833L205l657M221m951N935p343R548j3520K2966q8925j12462
71a86483L7361J7769N5085M9056O4394M7626M6154K4080J2355j3940k6255m4639
83H2563m9829n7188m9991m3276k6696j2499Q489K3822L9608M7094N2544M8943
95F3584M2273K8408J3463n026k0572l4896m4140m9829m7940m0952k9000j5239
107a39866J498J7954L2079M1204M6471M6507M0795K9620J6060R06j4760k9038
119H9430l8763m3618m4172m0015l0204j6729k294J1822K5137L5756M1401M1752
$$ plain form
0 0 0 0 0 0 0 0 0 0 0 0 0 0 0 0 1 -8 8 -8 8 -11 16 -16 23 -24 30 -32 40 -42 49 -57 65 -74 86 -97 111 -124 139
37 139 -155 175 -195 217 -241 267 -294 327 -360 398 -439 484 -532 586 -647 712 -786 868 -963
56 -963 1067 -1191 1333 -1500 1705 -1952 2269 -2682 3253 -4090 5458 -8062 14904 -74021 -186483
71 -186483 -149122 -131353 -76268 -27212 37182 84808 130962 155042 167397 153457 127202 82563
83 82563 32734 -24454 -74445 -117721 -144417 -156916 -148427 -124605 -84997 -37903 14641 63584
95 63584 105857 134265 147728 142702 122130 87234 43094 -6735 -54675 -95627 -124627 -139866
107 -139866 -138368 -120414 -88335 -47131 -660 45847 86642 116262 132322 133228 118468 89430
119 89430 50667 7049 -37123 -77138 -107342 -124071 -126365 -114543 -89406 -53650 -12249 29503
131B9503L7871K9848J8102M209r684k2189l2128l8248l9613l6504k9325j8802
143a06960o012P209J9320K9141L5554L7663L5507K9212J9504P597m929j6713k6692
156E9401l3564l6120l4454k9044k0463r274L094J4737K4357L1352L4755L3830
168C8607K8840K0801J0497j247j2776k2385k9261l2873l2757k8518k0836j1186
180i3094m24J0596K0346K7352L0954L1129K7836K1107J1936J627q712j8050k5211
193C7392k9233k9831k7161k1263j2858l067O906J6018K3256K7742K8880K6759
205D3540K1447J3742M530n140j4263k1653k6362k7891k6404k1872j4604n666L700
218g6896J2500J9988K5123K7044K5844K1832J5272O838k332j0962j8286k3570
$$ plain form
131 29503 67374 97222 115324 119533 109849 87660 55532 17284 -22329 -58833 -88158 -106960
143 -106960 -112972 -105763 -86443 -57302 -21748 15915 51422 80634 100138 107735 102806 86093 59401
156 59401 25837 -10283 -44737 -73781 -94244 -103518 -100424 -85687 -61330 -29978 4777 38607
168 38607 67447 88248 98745 97498 84722 62337 33076 203 -32554 -61072 -81908 -93094
180 -93094 -93518 -82922 -62576 -35224 -4270 26859 54695 75802 87738 89365 80653 62603 37392
193 37392 8159 -21672 -48833 -70096 -82954 -86021 -79115 -63097 -39841 -12099 16781 43540
205 43540 64987 78729 83259 78119 63856 42203 15841 -12050 -38454 -60326 -74930 -80596 -76896
218 -76896 -64396 -44408 -19285 7759 33603 55435 70707 77545 75213 64251 45965 22395
230B2395k6004k5283k1657j5647p853R20R474J6756K2035K4779K4589K1538J5984
243F2026Q687L85p919j5212k0649k3673k3945k1420j6393r548j626O470J3739
256d9078J9356K2662K3324K1327J6786J0376K788n136j2413j8111k1691k2747
268a2557k1194j7082j0975l742L869J1099J6963K0696K1976K0855J7246J1561
280E8715M600k762r808j5701j9692k1229k0406j7253j2025n441J737Q617J4441
293c6207J8571K0491J9980J7228J2441O227p03p468j3280j7559j9712j9581j7187
306c6759j2773o920l00O377J2216J6581J8976J9118J7121J3077P519J088n365
319D9956j1161j5629j8231j8629j6935j3228q050j905M420J0149J4640J7413J8116
$$ plain form
230 22395 -3609 -28892 -50549 -66196 -74049 -73129 -63655 -46899 -24864 -85 24504 46042 62026
243 62026 70713 71098 63179 47967 27318 3645 -20300 -41720 -58113 -67661 -69287 -62817 -49078
256 -49078 -29722 -7060 16264 37591 54377 64753 67541 62405 49992 31881 10190 -12557
268 -12557 -33751 -50833 -61808 -65550 -61681 -50582 -33619 -12923 9053 29908 47154 58715
280 58715 63315 60553 50745 35044 15352 -5877 -26283 -43536 -55561 -61002 -59265 -50648 -36207
293 -36207 -17636 2855 22835 40063 52504 58731 58028 50560 37280 19721 9 -19572 -36759
306 -36759 -49532 -56452 -56752 -50375 -38159 -21578 -2602 16516 33637 46714 54233 55321 49956
319 49956 38795 23166 4935 -13694 -30629 -43857 -51907 -53812 -49392 -39243 -24603 -7190 10926
332A0926J6730J3347Q488K645l449r145j3694j6573j7472j6500j3497q902l358
345e0454K543Q107J2719J5807J6933J6175J3536R335M025j707p152j1750j4965
358A3152j6336j5883j3568r654m659Q55O233J0841J4151J5758J5541J3551R963
371C9945N219p9n342r919j3361j5164j5157j3510j0221n751o58M521R043J2545
385a7889J4538J4802J3403J0390O228J360l667q217j1752j3917j4397j3310j0572
398c3000o662j993K870P402J1005J3288J3963J3141J0730P032K576k140o578j0232
412B1402j2685j3567j2929j0773p370l143J439N839R503J2039J3093J2722J0835
425B6405P686L642p80n067q759j1404j2659j2455j0837p936m145J14M343Q016
$$ plain form
332 10926 27656 41003 49491 52136 48687 39542 25848 9275 -8197 -24697 -38194 -47096 -50454
345 -50454 -47911 -39804 -27085 -11278 5655 21830 35366 44701 48726 47019 39867 28117 13152
358 13152 -3184 -19067 -32635 -42289 -46948 -46093 -39860 -29019 -14868 890 16431 29982 39945
371 39945 45164 45085 39743 29824 16463 1299 -13858 -27368 -37589 -43340 -43998 -39477 -30434 -17889
385 -17889 -3351 11451 24854 35244 41472 42832 39165 30948 19196 5279 -9118 -22428 -33000
398 -33000 -39662 -41655 -38785 -31383 -20378 -7090 6873 20014 30744 37776 40352 38212 31634 21402
412 21402 8717 -4850 -17779 -28552 -35922 -39065 -37626 -31787 -22284 -10245 2848 15570 26405
425 26405 34091 37733 36953 31886 23127 11723 -936 -13391 -24228 -32164 -36309 -36195 -31852 -23836
439b3836J0747J2151J2168J0835Q186M608M93l620p268j0097j1702j1874j0776
452a9985q354n035j094K936O581R436J1165J1573J0685Q520N376J656k256n885
466B5319q798j0641j1224j0553q660n731k132J629N194Q163J0130J0869J0402
479A3967Q727O008K637j039m559p520r604j0487j0212q786o269l051M73L920O896
494a8899R079J0111J0004Q782O487L473N3l315o301q558r734r771q750o695l833
509b7867n34K770N752Q016R350R558Q711O803M122R84k267n205p540q960r276
524e583q607o881m407j391J760M688P046Q531R026Q471O975M620J769j331m176
539B0510o537q120q733q351o979m807k115Q54L690O061P726Q401Q184P027M996
$$ plain form
439 -23836 -13089 -938 11230 22065 30251 34859 35352 31732 24464 14367 2665 -9209 -19985
452 -19985 -28339 -33374 -34468 -31532 -24951 -15515 -4350 7223 17908 26428 31804 33460 31204 25319
466 25319 16521 5880 -5344 -15897 -24557 -30288 -32420 -30791 -25597 -17434 -7304 3565 13967
479 13967 22694 28702 31339 30300 25741 18221 8617 -1870 -12082 -20868 -27137 -30188 -29715 -25795 -18899
494 -18899 -9820 291 10295 19077 25564 29037 29090 25775 19474 10916 1182 -8589 -17339 -24034 -27867
509 -27867 -28401 -25631 -19879 -11863 -2513 7045 15756 22559 26681 27665 25398 20193 12653 3693 -5583
524 -5583 -14190 -21071 -25478 -26869 -25109 -20421 -13375 -4844 4182 12653 19628 24248 26017 24686 20510
539 20510 13973 5853 -2880 -11231 -18210 -23017 -25132 -24278 -20588 -14527 -6801 1600 9784 16811 21807
554B1807K426m31l211n596p288q117q015p012n147k720J2K739N123O875P808P835
570G088P002N297K981L67k278m655o495p495p637o930n423l247p11J860M237O068
586i971P161P447O862N482L442J042j470l794n693o856p206o741n557l667j329
601b0848J109L393N270O539P002O662N584L834J631p45k983m888o209o761o562
616g972n598l995j911L84K596M487N882O540O435N602M133K176l1k236m132n551
632F809o272o284n614m264k403k64J861L784N208O032O148N580M341K612N73j514
648A6333l397m904n791o001n538m430k837q52J203L077M583N532N855N482M523
663A2838K972J130q97k731m292n305n694n420m550l131j350O01K422L992N057
$$ plain form
554 21807 24233 23802 20591 14995 7707 -410 -8425 -15437 -20584 -23304 -23292 -20553 -15430 -8555 -747 7088
570 7088 14090 19387 22368 22735 20457 15802 9307 1812 -5825 -12755 -18178 -21425 -22136 -20276 -16039 -9971
586 -9971 -2810 4637 11499 16981 20423 21465 19995 16201 10508 3652 -3554 -10295 -15852 -19519 -20848
601 -20848 -19739 -16346 -11076 -4537 2465 9127 14711 18545 20176 19431 16448 11560 5351 -1410 -7972
616 -7972 -13570 -17565 -19476 -19092 -16496 -12009 -6127 413 6848 12450 16583 18759 18728 16492 12360 6809
632 6809 537 -5747 -11361 -15625 -18028 -18292 -16431 -12647 -7439 -1407 4741 10321 14662 17274 17847 16333
648 16333 12936 8032 2241 -3760 -9298 -13728 -16565 -17417 -16214 -13137 -8554 -3022 2833 8315 12838
663 12838 15810 16940 16043 13312 9020 3715 -1979 -7399 -11949 -15080 -16430 -15829 -13407 -9415 -4358
678d358N541N337M576L233J573l20k137l705m811n309n285m598l347j747N6J842
694a3459L417M554N170N182M575L491J936J90j580l156m338m988n085m575l559
709a2225k107l99J328K895M109M807M981M560L616K209O12j095k645l907m612
724B127m864m514l656k336p77Q66K419L677M432M745M454L678K439R28o69k190
740A0759l458m259m607m387l689k542j061M75J975L248M099M480M321L693K620
755A1667J229l12j770l035l913m342m254l682k697j346J29J554K835L731M217
770A1M153L637K733J473M2j371k631l526m024m095l607k769j587j99J166K413
786h181L344L889L958L570K818J673L89r76k208l161l712l885l531k834j768n26
$$ plain form
678 -4358 1183 6520 11096 14329 15902 15582 13445 9740 4929 -380 -5665 -10263 -13610 -15357 -15301 -13459
694 -13459 -10042 -5488 -318 4864 9439 12930 14866 15056 13476 10320 5982 994 -4091 -8666 -12225
709 -12225 -14332 -14731 -13403 -10508 -6399 -1592 3389 7949 11565 13774 14386 13291 10646 6739 2127
724 2127 -2737 -7251 -10907 -13243 -14020 -13154 -10735 -7058 -2626 2119 6573 10251 12690 13618 12949 10759
740 10759 7301 3042 -1565 -5952 -9641 -12183 -13244 -12769 -10794 -7546 -3447 1033 5354 9047 11667
755 11667 12896 12584 10814 7779 3866 -476 -4730 -8412 -11109 -12455 -12326 -10772 -7937 -4206 11
770 11 4164 7801 10534 12007 12049 10678 8047 4521 497 -3598 -7205 -9974 -11561 -11760 -10594 -8181
786 -8181 -4837 -948 3010 6580 9398 11071 11460 10484 8276 5115 1403 -2482 -6013 -8847 -10615 -11141
802a1141P94J997K977L549L773L494K840J876O62o27j781k792l365l665l440k849
818g698j950p93M42J602K577L203L504L382K842K020R16k78j411k377l036l385
834d40l315k785k072j041J19J233K201K879L223L227K788K105J136L4j058k000
850F234k712l110l159k773k125j227j83Q83J856K542K967L065K747K161J306L07
866H779p45j669k395k813k980k707k160j377m15N82J489K242K685K870K663K163
882F212J452N38m52j333k090k541k774k617k144j508o21K98J190J942K417K680
898F49K569K141J552P12j85j061j783k299k581k527k155j561q09P6R11J671K181
915b499K468K475K128J599Q64J9q00j534k054k371k416k108j594r36j16O79J433
$$ plain form
802 -11141 -10347 -8350 -5373 -1824 1949 5443 8283 10159 10821 10194 8413 5621 2256 -1409 -4849 -7698
818 -7698 -9648 -10441 -9999 -8397 -5820 -2617 887 4269 7111 9131 10047 9769 8358 5981 2945 -440
834 -440 -3755 -6540 -8612 -9653 -9534 -8301 -6100 -3221 2 3229 6017 8122 9258 9292 8234 6234
850 6234 3522 412 -2747 -5520 -7645 -8872 -9055 -8172 -6316 -3774 -807 2258 5005 7166 8472 8779
866 8779 8034 6365 3970 1157 -1823 -4530 -6690 -8067 -8482 -7900 -6411 -4169 -1484 1386 4049 6212
882 6212 7664 8202 7750 6417 4327 1786 -988 -3605 -5749 -7257 -7878 -7580 -6390 -4448 -2031 649
898 649 3218 5359 6911 7623 7438 6377 4594 2295 -286 -2813 -4968 -6529 -7338 -7262 -6351 -4680 -2499
915 -2499 -31 2444 4572 6171 7035 7054 6254 4720 2666 295 -2121 -4229 -5823 -6759 -6875 -6196 -4763
932d763J944K262K357K086J607R69K20n89j303j827k174k282k051j622j014k98
948f478N00J174J741K054K221K046J612J049L52m02j080j611j982k139k007j603
964d553j083m16K99R80J539J870K059J960J616J082M67k12q94j422j779j992j905
981b384j607j090n23J45P91J336J691J912J877J573J117N62r9p07j229j611j838
998h4j820j570j106n97K1O51J149J530J765J763J527J127N93K7n67j080j453j692
1016A84j696j504j114o02p6N25J000J372J613J642J451J122O14R6m45r31j278
1033A973j542j587j430j109o20j37L92Q49J221J474J517J397J082O50J53l37p81
1050C165j149j405j483j353j070o58j78L04P16J088J346J407J298J062O67K08
$$ plain form
932 -4763 -2819 -557 1800 3886 5493 6462 6682 6093 4790 2963 789 -1493 -3544 -5166 -6180 -6478
948 -6478 -5978 -4804 -3063 -1009 1212 3258 4870 5919 6271 5869 4789 3178 1196 -943 -2950 -4553
964 -4553 -5636 -6052 -5753 -4773 -3234 -1364 695 2655 4271 5353 5820 5608 4714 3292 1513 -479 -2384
981 -2384 -3991 -5081 -5604 -5459 -4668 -3332 -1641 271 2148 3721 4838 5400 5301 4594 3365 1754 -84
998 -84 -1904 -3474 -4580 -5177 -5156 -4505 -3356 -1826 -61 1702 3229 4356 4949 4976 4409 3329 1876 184
1016 184 -1512 -3016 -4130 -4732 -4808 -4283 -3283 -1911 -298 1344 2795 3917 4531 4627 4182 3251 1973
1033 1973 431 -1156 -2586 -3695 -4315 -4452 -4060 -3211 -1990 -516 1001 2398 3480 4130 4283 3946 3165
1050 3165 2016 611 -872 -2225 -3295 -3953 -4131 -3827 -3111 -2023 -677 730 2028 3090 3757 3965
1066C965k63o75j029j262j363j261j009o82k47K35O36R79J204J295J228R94O67
1083C412K60j66o04r16j158j249j189r71o69k85J53N53Q57J113J207J141R69O56
1101C114K84j37n00q35j066j163j108r32o55k76J08M83P81J037J117J061R03O40
1119B856K96r1m58p50r75j074j045q64o24l05Q3M08P26R17J035J026Q53O14L02
1138B930l8l92o82q93r95r87q54o10l05J1L61O37Q68R69R62Q33O09L22k3l24o36
1159A763q14r60r25q10o03l04J6L16N90Q05R09R22P75N81L20kl07n88p75q83q85
1180h59p65n73l03nK95N55P33Q62Q70P48N66K99L1k89n30p27q48q54p39n49l07
1201b389j3K73N08P06Q38Q27P34N38L01L0k66n18o97p99q21p00n39k86j5K57M99
$$ plain form
1066 3965 3702 3027 1998 736 -627 -1888 -2897 -3579 -3826 -3591 -2955 -1976 -772 523 1751 2745 3412
1083 3412 3672 3506 2902 1986 828 -421 -1610 -2581 -3250 -3535 -3382 -2829 -1972 -859 348 1489 2458 3114
1101 3114 3398 3261 2761 1926 860 -303 -1411 -2343 -2998 -3274 -3166 -2683 -1902 -865 252 1313 2216 2856
1119 2856 3152 3061 2603 1853 878 -196 -1241 -2105 -2729 -3034 -2951 -2543 -1817 -900 135 1161 2014 2628 2930
1138 2930 2892 2500 1818 925 -70 -1057 -1911 -2521 -2826 -2815 -2454 -1817 -949 20 982 1815 2424 2746 2723 2399 1763
1159 1763 949 -11 -936 -1746 -2349 -2653 -2637 -2321 -1731 -926 -17 905 1680 2261 2581 2579 2272 1684 909 26 -859
1180 -859 -1624 -2197 -2500 -2505 -2210 -1655 -922 -60 810 1558 2124 2423 2454 2165 1635 908 60 -794 -1533 -2082 -2389
1201 -2389 -2402 -2129 -1621 -915 -77 750 1484 2022 2323 2353 2087 1569 872 73 -748 -1448 -1987 -2273 -2288 -2031 -1532
1222a532O90P97P96P05N13K87Mk58m89o75p76p91o83n11l04j2K32M91O60P68P77
1243F89O90N16K89K7k58m63o42p71p67o83n16k92l5K47M63O65P56P67O83N13K87
1264B165L3k25m64o70p46p75o84n14l01k3K44M74O47P65P76O73N18K92K8k44m58
1285A511o56p67p80o75n22l00l6K24M60O52P61P82O95N29L15M3k20m58o52p66
1305A40p81p09n32l38n1K12M50O52P75P86P29N63L31P6k03m54o46p81p88p37n80
1326a886l51r6J95M49O40P73Q18P44N84L82R9j72m33o34p77q42p56o01m02j34
1346b400J74M11O20P77Q35P84O50M14J62j38l87o36p76q39q04o54m57j70J04L85
1366a945O13P74Q68Q01O77M90K10r3l69o14p88q52q52p06m97k31O7L34O09P79
$$ plain form
1222 -1532 -842 -45 751 1456 1969 2256 2260 2002 1513 838 62 -729 -1412 -1923 -2227 -2239 -2007 -1516 -856 -88 689
1243 689 1379 1895 2184 2211 1953 1490 848 77 -690 -1373 -1889 -2181 -2216 -1969 -1506 -841 -85 682 1365 1878 2165
1264 2165 2198 1973 1509 839 93 -682 -1366 -1880 -2181 -2204 -1960 -1486 -839 -74 702 1375 1893 2185 2213 1969 1511
1285 1511 855 88 -692 -1367 -1889 -2189 -2225 -2001 -1541 -889 -128 654 1349 1878 2193 2236 2016 1558 906 140
1305 140 -641 -1350 -1882 -2220 -2271 -2059 -1609 -957 -182 604 1333 1896 2227 2303 2100 1646 1000 219 -569 -1306 -1886
1326 -1886 -2237 -2333 -2138 -1689 -1049 -276 542 1286 1870 2252 2351 2179 1746 1112 335 -507 -1263 -1864 -2266 -2400
1346 -2400 -2226 -1815 -1195 -418 417 1201 1851 2265 2427 2289 1902 1266 490 -349 -1153 -1807 -2264 -2434 -2330 -1945
1366 -1945 -1332 -558 310 1111 1788 2278 2488 2395 2026 1412 624 -228 -1080 -1786 -2283 -2514 -2447 -2113 -1504 -725
1386g25Q79Q58P33N44K60n8l18n93p95q74q79p58n46l01J5L12N82P80Q89R03P78
1407A686O02L16K0k97n53p89q86r20q15o25l50m7K70N44P60R09R38Q31O59L97
1427B650O8k43n50p59r17r55q64o75m35j03K20N23P73R22R69Q93P15M62J34j99
1447B629n05p46r35r72r23p56m91j49J45M91P44R27R98R40P74N32K04j32m54p30
1467A591r35r96r70q24n54k58J07M05P46R01J021R84Q31O26K83n2m06o75r09j033
1487a17j008q86o38l26J3L53O69Q91J039J025R07O92L82J7l31o32q72j035j049
1506i06r31p30m20o9K76O11Q58J037J054R64P54M68J21k44n76q45j018j062r94
1525a652q04m95j56J87N37Q30R95J077J016Q22N53K21j59n02p90r81j073j037
$$ plain form
1386 -725 154 1012 1745 2289 2549 2491 2173 1580 785 -89 -968 -1726 -2272 -2573 -2558 -2246 -1664 -884 5 908 1686
1407 1686 2288 2604 2624 2327 1774 985 99 -821 -1636 -2261 -2611 -2658 -2388 -1844 -1084 -175 763 1594 2253 2650
1427 2650 2718 2475 1925 1166 249 -706 -1570 -2245 -2680 -2783 -2563 -2040 -1267 -345 624 1517 2232 2694 2828 2629
1447 2629 2124 1378 443 -529 -1452 -2208 -2699 -2848 -2703 -2212 -1468 -541 457 1397 2171 2703 2907 2775 2321 1591
1467 1591 656 -340 -1310 -2134 -2688 -2946 -2839 -2434 -1688 -787 234 1218 2049 2675 2958 2906 2500 1825 916 -117
1487 -117 -1125 -2011 -2649 -2975 -2962 -2609 -1940 -1049 -10 1015 1922 2614 2996 3013 2682 2050 1178 143 -906
1506 -906 -1837 -2567 -2987 -3056 -2780 -2169 -1311 -274 780 1744 2498 2966 3087 2843 2267 1422 404 -658 -1652
1525 -1652 -2456 -2951 -3107 -2920 -2383 -1553 -558 519 1535 2357 2910 3131 2972 2470 1680 699 -374 -1411
1543a411q64n94k56R7M50P74R64J081J045R02O35L27o4m13p25r42j099j065r28
1562b086o79l67J4L68O81R35J068J082R50P29M19L7l02o43r21j060j106r77p59
1581b617m73j05K60O10Q90J047J111J011Q18N14J55k20n55q61j038j107j045q56
1599b461n51k25J63N34Q16J022J126J060Q92O18K61j12m82p97r92j135j074r33
1617b270o74l22N4M36P66R78J122J108R58P15L84j3l70p10r75j119j122r93p75
1636b822m32m3L27O83R30J120J142J032Q20M79J20k89o29r25j112j161j056q56
1654b672n37j68K33N85Q86J089J171J095R02N92K27j72n43q71j059j172j129r51
1672b494o47k88J06N00Q26J058J192J130R98O93L50m6m48p95j034j174j170j010
$$ plain form
1543 -1411 -2275 -2869 -3125 -3028 -2578 -1804 -840 241 1286 2188 2823 3150 3086 2673 1948 1006 -93 -1158 -2086
1562 -2086 -2765 -3132 -3118 -2750 -2069 -1134 -66 1016 1966 2695 3114 3151 2849 2206 1285 225 -881 -1858 -2617
1581 -2617 -3090 -3195 -2935 -2325 -1435 -388 723 1734 2552 3066 3221 3001 2446 1585 547 -560 -1605 -2461
1599 -2461 -3012 -3237 -3074 -2540 -1724 -702 424 1484 2376 2994 3255 3143 2661 1864 872 -263 -1337 -2270
1617 -2270 -2944 -3266 -3212 -2776 -2010 -1032 90 1198 2156 2871 3255 3242 2872 2162 1187 68 -1054 -2047 -2822
1636 -2822 -3254 -3297 -2970 -2287 -1357 -237 905 1937 2757 3236 3356 3067 2438 1513 401 -760 -1816 -2672
1654 -2672 -3209 -3377 -3144 -2559 -1673 -584 587 1682 2584 3176 3403 3231 2688 1817 758 -414 -1543 -2494
1672 -2494 -3141 -3429 -3323 -2823 -1997 -939 253 1383 2381 3074 3424 3378 2930 2135 1101 -73 -1243 -2253
1690b253p73l84k1M01P54J008J172J187J053Q00M51P3l56o96r99j157j209j079
1708b028q46n21j19K96O66R51J169J213J101Q90N61J91k35o13r41j128j215j152
1726a760r12o30k39J93N57Q82J120J217J177R76O79L01j43m89q72j081j233j183
1744a440j013p25l63N3M73Q04J077J207J217J048P75M09Qm15p76j052j201j227
1762a141j086q25m76m8L51P36J019J188J229J110Q78N38J21k93o88r81j177j248
1780g93j140r16n83j79K40O22R59J171J240J162R63O35K49j85n64r22j138j253
1798d32j189r99o99l09J14N22Q67J121J232J217J038P48L76n1m56q21j095j230
1816d6j229j089q05m21k4M13P87J043J232J246J112Q53M93Q0l62p20j036j210
$$ plain form
1690 -2253 -3026 -3410 -3431 -3030 -2276 -1268 -96 1091 2144 2944 3395 3468 3112 2416 1417 260 -949 -2028
1708 -2028 -2874 -3395 -3514 -3218 -2552 -1601 -432 781 1882 2772 3333 3524 3289 2676 1735 607 -608 -1760
1726 -1760 -2672 -3302 -3541 -3348 -2791 -1909 -789 428 1605 2581 3260 3561 3418 2929 2057 976 -257 -1440
1744 -1440 -2453 -3178 -3541 -3488 -3015 -2211 -1134 73 1290 2338 3113 3522 3530 3115 2339 1287 86 -1141
1762 -1141 -2227 -3052 -3528 -3576 -3225 -2489 -1470 -282 947 2057 2935 3473 3594 3301 2613 1632 455 -793
1780 -793 -1933 -2849 -3432 -3611 -3371 -2749 -1790 -619 621 1783 2746 3381 3630 3445 2881 1959 821 -432
1798 -432 -1621 -2620 -3319 -3628 -3514 -2992 -2125 -1004 228 1445 2483 3231 3607 3556 3100 2279 1184 -46
1816 -46 -1275 -2364 -3169 -3590 -3614 -3201 -2414 -1371 -139 1107 2219 3072 3565 3645 3283 2563 1527 317
1834C17j257j135q94n50j30K78O82R93J195J253J160R33O16K10k38o13r51j156
1852G13j268j192r89o60k90J53N69R03J144J255J215J030P31L38p3n04q40j124
1870A111j249j231j065p80m18K0M24Q16J073J228J244J110Q35M73O2l71p39j056
1888A487j217j255j136q85n32j41L15O88J001J195J259J166R25O10J90k36o42
1905B792r47j175j266j191r78o44k67J75N67R11J158J253J216J016P21L25j12
1922C554n12q63j132j252j227j053p66l74L4M63Q26J094J247J236J084Q00M38
1939C597Rl81p88j051j224j260j115q39n06r0L43P05J039J206J256J138Q93N68
1957C500J55k77o62r83j194j259j166r33o27k16K16O14R43J164J267J186R87O64
$$ plain form
1834 317 -940 -2075 -2969 -3519 -3649 -3371 -2689 -1696 -501 752 1912 2845 3461 3671 3433 2820 1869 713
1852 713 -555 -1747 -2736 -3396 -3686 -3533 -2964 -2061 -917 338 1553 2583 3314 3652 3579 3075 2235 1111
1870 1111 -138 -1369 -2434 -3214 -3632 -3612 -3188 -2372 -1299 -71 1173 2283 3118 3591 3653 3282 2543 1487
1888 1487 270 -985 -2121 -3006 -3538 -3679 -3364 -2676 -1675 -480 779 1945 2870 3480 3670 3434 2792
1905 2792 1845 670 -596 -1787 -2765 -3409 -3676 -3501 -2934 -2023 -865 388 1604 2620 3341 3666 3554
1922 3554 3042 2179 1047 -205 -1432 -2485 -3251 -3625 -3591 -3128 -2302 -1208 39 1275 2359 3159 3597
1939 3597 3606 3225 2437 1386 162 -1098 -2213 -3052 -3558 -3648 -3305 -2600 -1561 -355 901 2039 2932 3500
1957 3500 3655 3378 2716 1733 539 -720 -1886 -2819 -3446 -3662 -3446 -2832 -1889 -725 542 1728 2715 3379
1975C379K75j40n69r04j146j265j207j022p13l23R5N13Q49J123J252J223J048
1992B468P65L82l1m47q21j088j243j237j106p93m50l5M03P59J059J229J244J134
2010B192Q59N18Q5l19p13j025j220j257j147r17n60j66K66O67R78J183J279J165
2028A868R74O20K32k21o09r38j167j263j205j000o77l03J38N54Q92J142J266J232
2046A535J040P28L58p7m93q50j107j259j250j066p85m28J6M35P97J103J240J263
2064A200J106Q44M63N8l93p44j040j236j272j141q88n27j28L13P15J012J216J276
2082H34J168R35N90J77k72o44r89j179j293j185r72o47k42K01O05R41J161J288
2100D77J212J009O99K93j27n50r02j151j267j229j036p50l54P3M99Q50J113J257
$$ plain form
1975 3379 3654 3514 2945 2041 895 -370 -1577 -2599 -3312 -3635 -3540 -3027 -2178 -1055 197 1420 2468
1992 2468 3233 3615 3584 3137 2316 1228 -15 -1252 -2358 -3151 -3601 -3636 -3233 -2474 -1415 -186 1058 2192
2010 2192 3051 3569 3654 3335 2622 1597 377 -880 -2027 -2944 -3504 -3670 -3404 -2737 -1759 -576 703 1868
2028 1868 2842 3462 3694 3473 2864 1926 759 -504 -1709 -2709 -3386 -3689 -3551 -2997 -2105 -963 303 1535
2046 1535 2575 3303 3661 3584 3091 2241 1134 -125 -1375 -2441 -3226 -3654 -3638 -3203 -2406 -1303 -63 1200
2064 1200 2306 3150 3613 3671 3278 2534 1494 258 -1014 -2155 -3043 -3570 -3698 -3385 -2670 -1658 -442 834
2082 834 2002 2937 3527 3704 3432 2788 1799 620 -673 -1858 -2830 -3477 -3719 -3518 -2913 -1972 -811 477
2100 477 1689 2698 3397 3690 3563 3013 2111 960 -307 -1536 -2572 -3322 -3676 -3603 -3104 -2254 -1141 116
2118A16J256J078P86M15j3m37p94j098j251j249j116q29m80m8L79P64J052J222
2136b47J263J129Q93N26J16l22p06j007j218j278j139r28n94j62K55O50R69J179
2154f21J276J188R65O45K39k04n96r36j157j253j197j006p03k95J20N42Q78J127
2172i88J258J214J030P58L79o9m73q33j094j236j249j072p98m33j0M08P75J065
2190a368J230J250J096Q66M77O9l51p30j012j206j250j147q75n38j38K93O76R85
2208a673J196J251J148R30N92J90k36o21r45j159j258j169r62o55k52J73N70Q88
2226a992J149J242J183J003O90L14j21m82q59j111j227j215j023p46l69N2M43
2243c069Q17J058J209J235J058P76M50J3m08p45j025j203j225j066q53m77r0L31
$$ plain form
2118 116 1372 2450 3236 3651 3638 3201 2407 1309 58 -1191 -2307 -3136 -3616 -3664 -3285 -2521 -1469 -247
2136 -247 1016 2145 3038 3564 3680 3358 2652 1645 427 -851 -1990 -2918 -3512 -3674 -3419 -2769 -1800 -621
2154 -621 655 1843 2808 3453 3692 3488 2892 1956 799 -454 -1651 -2657 -3360 -3655 -3535 -2993 -2115 -988
2172 -988 270 1484 2514 3272 3651 3582 3109 2276 1182 -54 -1303 -2375 -3173 -3606 -3616 -3208 -2433 -1368
2190 -1368 -138 1112 2208 3074 3551 3620 3269 2539 1527 321 -929 -2076 -2951 -3489 -3627 -3334 -2658 -1673
2208 -1673 -477 774 1922 2852 3444 3634 3398 2777 1832 673 -585 -1754 -2716 -3371 -3623 -3450 -2880 -1992
2226 -1992 -843 399 1582 2585 3275 3589 3468 2986 2127 1016 -211 -1426 -2449 -3195 -3564 -3512 -3069
2243 -3069 -2252 -1194 15 1250 2308 3084 3534 3547 3139 2394 1369 166 -1059 -2125 -2978 -3455 -3545 -3214
2261c214P06R93J173J220J113Q62N52J42k64o46r56j145j229j123r26n95k08K00
2279c345N98Q91J113J221J147R53O60K85j44n31q49j084j207j154r97o94l57Q2
2297c412M61Q00J074J184J183J024P47L93j6l97p58j024j182j175j055p89m54
2314c396n3L50P00R95J159J187J070Q21N15J03k86o54r51j132j192j083q80n64
2332c291j62K26O15R01J117J193J095R15O18K12j76n37q70j071j199j115r38o57
2350c124k86J17M91Q19J053J175J133R78O91L55o8m42p70j029j162j148r87p49
2368b953m06jL84P33R79J139J165J024P85M52O5l26o83r56j111j161j050q20n06
2387c247j24K73O13R32J104J150J077Q50N56J88k11n69q84j077j166j086q89o08
$$ plain form
2261 -3214 -2508 -1515 -342 878 1991 2853 3405 3547 3283 2637 1681 536 -693 -1816 -2742 -3337 -3545 -3345
2279 -3345 -2747 -1856 -743 478 1625 2578 3238 3523 3379 2848 1999 915 -292 -1446 -2443 -3137 -3494 -3412
2297 -3412 -2951 -2151 -1077 107 1290 2314 3061 3454 3438 3041 2283 1259 77 -1098 -2153 -2942 -3396
2314 -3396 -3449 -3099 -2399 -1404 -245 942 2012 2833 3348 3451 3165 2511 1560 428 -764 -1847 -2727 -3291
2332 -3291 -3453 -3227 -2612 -1711 -594 599 1694 2609 3227 3439 3263 2726 1856 785 -414 -1529 -2467 -3124
2350 -3124 -3410 -3293 -2802 -1983 -930 245 1378 2356 3047 3402 3334 2892 2122 1093 -69 -1217 -2204 -2953
2368 -2953 -3359 -3360 -2976 -2243 -1264 -125 1040 2064 2849 3301 3366 3040 2357 1401 290 -871 -1921 -2741 -3247
2387 -3247 -3371 -3098 -2485 -1553 -449 701 1778 2628 3184 3372 3161 2592 1708 631 -535 -1621 -2510 -3118
2405c118k46J68N22Q32J054J155J097R36O44K87r6m69q04j013j149j119r51o98
2423b968l39M1M19P51R81J142J114R91P32L98Rl63p03r67j101j138r98p65m52
2442c216n5L07O53R28J090J149J003Q10N09J31k73o16q88j073j137j027q30n55
2460c090j75K01N61Q36J053J129J059Q68N67K30j42n08q20j016j115j056q93o35
2478b946k70Q7M72P58R76J109J077R21O79L19l9l95p18r42j102j071r58p04l88
2497c135oL23O75R28J054J093R70P35M44O3k84o14q84j042j085r90p76m85j37
2516c153K41N76Q37J016J078J002Q14N23J94j70n30p94r86j077j014q37n67k53
2534c100J23M69P51R67J062J020Q64O30K88o6m03p25r20j044j053q87o59l40J7
$$ plain form
2405 -3118 -3364 -3196 -2674 -1842 -788 367 1464 2400 3044 3331 3235 2766 1962 949 -200 -1319 -2270 -2968
2423 -2968 -3307 -3266 -2847 -2096 -1115 27 1141 2132 2864 3262 3271 2908 2205 1238 137 -1001 -1999 -2764 -3216
2442 -3216 -3271 -2964 -2311 -1383 -293 856 1859 2669 3178 3309 3036 2420 1532 459 -678 -1705 -2535 -3090
2460 -3090 -3265 -3064 -2503 -1667 -614 515 1574 2442 3009 3239 3097 2589 1769 753 -362 -1418 -2311 -2946
2478 -2946 -3216 -3129 -2657 -1899 -923 186 1263 2184 2863 3182 3143 2748 2030 1088 -14 -1085 -2043 -2747 -3135
2497 -3135 -3141 -2818 -2143 -1215 -161 932 1902 2637 3081 3144 2860 2246 1362 320 -765 -1755 -2531 -3016 -3153
2516 -3153 -2912 -2336 -1499 -483 595 1597 2411 2934 3128 2958 2428 1634 648 -429 -1443 -2280 -2847 -3100
2534 -3100 -2977 -2508 -1757 -790 272 1292 2156 2786 3074 3008 2605 1880 960 -84 -1137 -2024 -2683 -3023 -3006
2553c006L51O72R08J027J048R02O86L90L9l21o22q66j033j027r40p12m27p7K65
2572b743N73Q35R96J052R38P55M74J35k20n46p83r73j037r62p77n06j93J57M87
2591b338P52R54J014R87Q00N64K23j00m49p08r25j013r82q20o18k76N9L82O81
2610a813Q90J000R85Q59O35L34j3l33o23q76r75r81q77o70l84m0K75N95Q13R64
2630b35R83R08P03M28J03k44n37p74r47r94r08p26m78j48J83M87P56R04R84R41
2650A389P46N07J98j38m43p13q94r75r38p79n35k53R7L94O91Q67R69R30Q14N61
2670B495K82m6l66o28q31r44r46q30n88l39J3L07N90Q06R28R53Q31O31L74O1k82
2691B471n49p70r09r45q64o59m07j05K20M95P51Q92R36Q76P01M34J45j66m77p08
$$ plain form
2553 -3006 -2655 -1983 -1075 -48 1000 1902 2588 2978 3017 2696 2074 1208 175 -852 -1792 -2504 -2931 -3008 -2743
2572 -2743 -2170 -1335 -339 713 1651 2406 2880 3015 2795 2249 1466 493 -544 -1506 -2283 -2789 -2982 -2825 -2338
2591 -2338 -1586 -632 382 1369 2169 2733 2956 2856 2407 1699 774 -239 -1221 -2041 -2659 -2935 -2876 -2494 -1813
2610 -1813 -923 77 1062 1921 2556 2890 2877 2544 1921 1045 70 -911 -1788 -2458 -2842 -2882 -2607 -2012 -1199 -235
2630 -235 748 1656 2359 2787 2890 2646 2109 1335 388 -606 -1514 -2240 -2718 -2866 -2683 -2196 -1440 -536 448 1389
2650 1389 2135 2642 2840 2702 2259 1546 652 -323 -1261 -2040 -2575 -2828 -2731 -2337 -1646 -779 190 1120 1934 2495
2670 2495 2777 2731 2365 1737 906 -38 -984 -1814 -2402 -2741 -2728 -2421 -1831 -1025 -97 856 1687 2318 2692 2753 2471
2691 2471 1922 1152 243 -702 -1566 -2225 -2632 -2737 -2517 -2022 -1271 -379 557 1433 2134 2568 2713 2547 2070 1362
2711A362q68r35q82p17m79j77J30M21O92Q53R23Q88P28N16K24r2l91o39q26q97
2731a66r03p58n39k73M7L38N87Q00R01Q91P88N75L20kk99n52p71q92q93q07o07
2752b215l47n3K51N22P41Q73Q93Q20O32L85J01k17m81p05q52r15q03o61m26j28
2772b585J64M53O86Q31Q89Q32O75M58J73j31m06o53q10q71q47o99m91k18R1L53
2792b106O24P56Q84Q53P28N16K61m9l26n63p60q47q67p48n48k95JK77N37P29Q62
2813h1Q54P49N84L32M0k37m98p03q27q51p85o13l59q5K09M50O83Q04Q50P93O23
2834A932M00J33j55m25o38p84q47q02o60m30j81J20L88O01P53Q51Q10O62M74K13
2854B415o8l44n63p48q34p96o92n04k53L2L05N43P17Q08Q35P04N21K81Kk66n27
$$ plain form
2711 1362 494 -441 -1323 -2040 -2519 -2696 -2566 -2145 -1453 -600 323 1211 1939 2455 2679 2587 2196 1557 731 -166
2731 -166 -1069 -1827 -2366 -2639 -2592 -2254 -1667 -867 34 925 1713 2288 2608 2606 2307 1755 984 92 -801 -1608 -2215
2752 -2215 -2562 -2615 -2364 -1842 -1101 -228 665 1485 2117 2502 2603 2386 1905 1200 348 -567 -1370 -2031 -2457 -2585
2772 -2585 -2421 -1968 -1282 -451 438 1270 1945 2403 2576 2445 2039 1386 576 -295 -1142 -1841 -2332 -2550 -2459 -2106
2792 -2106 -1482 -726 158 1011 1739 2255 2516 2467 2141 1578 818 -29 -896 -1644 -2192 -2487 -2486 -2209 -1672 -943 -81
2813 -81 773 1522 2106 2438 2478 2241 1743 1040 213 -638 -1423 -2036 -2395 -2480 -2271 -1821 -1138 -334 516 1309 1932
2834 1932 2332 2465 2310 1885 1247 463 -384 -1186 -1846 -2276 -2457 -2337 -1949 -1348 -595 256 1066 1728 2202 2415
2854 2415 2347 2003 1440 692 -142 -938 -1630 -2134 -2387 -2355 -2050 -1507 -790 18 853 1557 2078 2359 2361 2095 1568
2875A568o75q01q20p16n54l21l7K31M79O56P76Q15P44N66L45Q1j80m47o39p47
2895C24q19p48n94l73j29J59L98O06P52Q12P50O05M17J57r9l80n79p34p98p64
2915a037o16m52j92P6L41N49O89Q02P57O55M73K17m1k91n23o93p67p69o72m86
2935a980k66J2K57M69O67P78P63O70N23K98L1k15m38o41p45p68o92n39l38p9J80
2956b053M26O13P27P69O98N65L63J10j35l84n85p04p67p24n61m11j42R2L57N57
2976a189O78P56P25O08M07J79o9l11n11o77p49p19o15m48k20M8K67M81O56P39
2996C6P34O15M67K60Nk48m61o30p26p16o36n00k73l3K25M25N84P12P29O50N19
3017A738L09N7j69m06n77o82p31o62n30l39r9J31L53N41O83P16O56N71L59J44
$$ plain form
2875 1568 893 92 -728 -1444 -1998 -2319 -2356 -2125 -1646 -990 -214 601 1345 1911 2256 2337 2157 1710 1071 324
2895 324 -495 -1243 -1837 -2210 -2339 -2180 -1782 -1176 -424 388 1138 1743 2160 2317 2218 1838 1259 525 -273 -1037
2915 -1037 -1653 -2105 -2297 -2221 -1880 -1331 -642 160 917 1572 2045 2262 2221 1930 1407 714 -53 -822 -1494 -1980
2935 -1980 -2246 -2234 -1977 -1508 -841 -63 700 1370 1893 2191 2222 2007 1569 928 183 -585 -1277 -1816 -2154 -2233 -2053
2956 -2053 -1627 -1014 -287 482 1180 1745 2108 2218 2083 1699 1114 410 -357 -1081 -1642 -2053 -2195 -2103 -1746 -1189
2976 -1189 -511 245 970 1578 1985 2164 2095 1784 1273 596 -153 -872 -1487 -1935 -2155 -2107 -1840 -1359 -703 36
2996 36 770 1385 1852 2112 2117 1869 1408 778 52 -664 -1300 -1800 -2073 -2106 -1881 -1456 -872 -160 569 1219 1738
3017 1738 2047 2104 1935 1529 952 270 -461 -1123 -1653 -1992 -2091 -1960 -1607 -1066 -383 333 989 1560 1919 2063
3037B063j08l25n09o51p17o79n49l96j78O6K96M86O28P08O90N87M11J97l3k62
3057A725m56o15o93o89o05m25k30MK21M29O00O76O87O09M61K55L2k08m01n70o65
3078A42o86o19m69k97o3J74L84N37O43O91O16N05L07J04j43l48n05o48o65o43
3098i83n17l28j16J03L17N02O15O71O36N28L73J43p7k77m86o03o68o45n37l91
3118a740j93N9K58M48N76O53O48N57L98K23k7k18m16n61o45o45n65m28k42j3J95
3139a678L84N50O27O49N82M32K76N3j74l49n27o18o40n89m67k92q8J24L58M89
3159h98O02O58N98M73L19Q9r0l12m84n76o51o00n03l33j34Q6K66M66N58O43O04
3180G81M92L73J63m8k42m29n54o26n93n16l87j91K0K22L86N46O17N97N27M10K10
$$ plain form
3037 2063 1955 1630 1121 470 -247 -926 -1475 -1871 -2049 -1983 -1687 -1201 -573 135 825 1412 1823 2020 1987 1725
3057 1725 1269 654 -39 -728 -1333 -1758 -1988 -1984 -1763 -1334 -734 -58 629 1238 1699 1954 1986 1778 1377 807 142
3078 142 -544 -1163 -1632 -1929 -1992 -1818 -1434 -897 -254 437 1053 1558 1865 1969 1826 1478 973 325 -340 -983
3098 -983 -1500 -1828 -1944 -1841 -1524 -1022 -407 264 900 1428 1801 1944 1867 1590 1104 501 -167 -812 -1349 -1740
3118 -1740 -1933 -1874 -1616 -1168 -592 61 709 1266 1664 1887 1860 1642 1226 665 20 -625 -1190 -1618 -1860 -1873 -1678
3139 -1678 -1294 -744 -117 532 1114 1546 1822 1875 1701 1352 825 207 -433 -1022 -1489 -1781 -1869 -1745 -1387 -898
3159 -898 -296 362 960 1433 1752 1841 1751 1439 955 379 -272 -872 -1375 -1708 -1842 -1756 -1490 -1024 -466 177 781
3180 781 1273 1646 1809 1761 1519 1090 536 -90 -683 -1199 -1586 -1777 -1757 -1535 -1149 -603 14 611 1138 1548 1758
3201A758J1j98l88m99n95o23n42m07k34m5J80L43M96N87O10N47M28K52O0j46l22
3222A273m79n65n99n49m31k97r1J18L08M41N58N97N56M52L00J15p7k64m26n36
3242D04n91n60m72l23j29N0K44L95N18N69N69M64L56J70l0k11l74n05n76n59m94
3263a085l58j98qJ91L53M85N68N66M93L64K31K0j47l42m65n60n51n13l92k22m9
3284a619J38L08M43N32N55N13M21K42Q4j06k84m25n28n48n17m25k71j00Q0K62
3304a245L85N20N36N27M30L00J23n2k35l95m89n41n23m49l01j55M2J98L63M85
3324d76N33N27M56L31J80k2j79l44m67n26n14m64l45k01JJ56L04M64N14N27M75
3345I30L51K10L4j49k97m21n07n32m75l77k28n4J25K68M08N05N13M92L89K34P9
$$ plain form
3201 1758 1769 1571 1183 684 89 -534 -1076 -1483 -1717 -1762 -1582 -1239 -743 -156 454 1001 1429 1681 1741 1595 1273
3222 1273 794 229 -370 -919 -1350 -1647 -1738 -1620 -1312 -871 -313 284 840 1292 1592 1707 1630 1366 940 404
3242 404 -187 -747 -1219 -1542 -1671 -1621 -1377 -982 -464 105 674 1138 1494 1664 1634 1423 1049 544 -32 -591 -1085
3263 -1085 -1443 -1641 -1649 -1458 -1105 -620 -52 514 1007 1371 1602 1622 1475 1133 668 108 -443 -956 -1348 -1570 -1619
3284 -1619 -1481 -1173 -730 -198 357 870 1291 1533 1617 1511 1227 802 274 -274 -791 -1216 -1487 -1587 -1507 -1245
3304 -1245 -860 -340 196 723 1153 1453 1576 1524 1289 894 405 -136 -659 -1108 -1409 -1564 -1522 -1324 -961 -476
3324 -476 57 584 1040 1371 1551 1529 1350 1006 539 13 -501 -965 -1310 -1511 -1510 -1354 -1050 -586 -72 455 930
3345 930 1281 1491 1525 1376 1079 658 151 -381 -856 -1233 -1461 -1515 -1390 -1122 -714 -209 304 796 1185 1419 1498
3366A498j14k41l90m90n09m78m00k67r8Q5K25L80M73N04M96L94K78J28n1k29l49
3387H45m49n06m90m01l01j34L8J76L44M45M79M91M26L17J46j8j71l08m27n03m83
3408d84m22l18j83j3J66K90M17M76M97M25L16J97K4j23k75m01m60m82m41l28j96
3429a318o2J03K69L79M44M87M43L44K28O3r8k43l47m42m79m54l50k42q5O4K24
3450a072L43M41M59M53L72K44J01o4j93l33m19m61m44l78k71j22M2J90L21M06
3470c85M58M49L83K89J28k8j71k92l90m52m44l80k89j70PJ47K88L78M53M28L88
3491G95K94J65J4j17k67l61m32m44m13k87j96l9J15K49L52M09M48M14L06J97O4
3512A266j00k13l35m27m31m03l11k28o8O8K06L39L78M36M10L38K22J04o7j81l14
$$ plain form
3366 1498 1384 1143 753 263 -246 -724 -1124 -1391 -1489 -1404 -1179 -799 -326 178 674 1068 1346 1474 1423 1194 845
3387 845 396 -110 -600 -1001 -1302 -1436 -1398 -1222 -878 -433 46 537 963 1280 1426 1408 1237 929 502 -1 -484
3408 -484 -906 -1224 -1407 -1420 -1254 -964 -547 -71 426 851 1167 1364 1388 1265 990 589 129 -353 -794 -1122 -1318
3429 -1318 -1380 -1277 -1008 -629 -185 302 745 1089 1317 1380 1282 1039 692 250 -229 -683 -1033 -1275 -1360 -1296 -1072
3450 -1072 -729 -288 171 624 996 1240 1341 1277 1084 751 332 -129 -573 -951 -1222 -1344 -1302 -1112 -791 -385
3470 -385 73 522 905 1194 1322 1294 1123 831 441 -11 -455 -835 -1124 -1294 -1287 -1140 -852 -474 -21 407 795
3491 795 1089 1254 1268 1151 884 523 91 -353 -766 -1053 -1249 -1288 -1173 -924 -572 -163 285 699 1005 1202 1266
3512 1266 1166 953 618 191 -240 -643 -954 -1182 -1250 -1182 -976 -637 -259 177 587 925 1147 1251 1184 1003 689
3533F89l76m27m08l48k49j08K0J71L01L65M19L98L75K45J27jj51k70l75l96m12
3554d11l51k79j38j1J18K39L67M02M15L68K85J66J4j03k38l22m05l97l82k89j82
3575a134m1Q6K27L09L95L90L78L06K01N4q2j94l08l62m11l82l10k09p5N5J78K88
3597f41L78L82L82L17K28Q9k9j61k81l51l93l62l36k41j06K2J51K50L54L83L77
3618D12L36K41J39j9j32k44l28l82l74l40k60j43j5J26K18L23L72L69L50K59J49
3639A057L2q7k15l16l61l62l48k72j67n6Q9J85K74L84L76L30K90J80P1o7j77k74
3661E66l52l60l55k99j91p6N6J65K57L28L63L57K94K15J05o2j33k53l30l54l54
3682d13k98k18j05J3J28K32L09L52L60L06K39J20j9j06k25l03l58l34l13k37j36
$$ plain form
3533 689 313 -114 -522 -870 -1119 -1227 -1207 -1036 -735 -370 49 447 822 1067 1194 1193 1042 772 397 1 -411
3554 -411 -762 -1041 -1179 -1190 -1072 -833 -466 -64 351 719 1004 1170 1184 1081 843 521 116 -281 -663 -952 -1134
3575 -1134 -1175 -1089 -862 -553 -158 232 610 916 1117 1171 1089 895 587 225 -186 -568 -878 -1087 -1162 -1107 -929 -641
3597 -641 -263 119 501 818 1046 1135 1106 945 664 313 -80 -442 -778 -1019 -1125 -1103 -952 -702 -348 35 412
3618 412 748 989 1128 1109 977 733 405 23 -351 -691 -951 -1094 -1109 -983 -765 -442 -70 299 649 908 1057
3639 1057 1089 1002 787 471 110 -252 -600 -872 -1039 -1095 -1006 -821 -547 -163 213 543 833 1013 1084 1017 840 566
3661 566 214 -146 -501 -800 -991 -1067 -1011 -846 -589 -261 102 459 753 968 1073 1011 878 625 295 -59 -413
3682 -413 -711 -929 -1034 -1021 -893 -661 -352 0 360 666 905 1025 1006 900 675 372 14 -320 -633 -870 -1006
3703a006pJ06J99K82L51L57L14K49J42L8r5j93k73l37l53l17k63j52m1P5J64K83
3725d77L15L51L18K66J71N8p5j55k53l28l31l31k67j78q1M6J62K39L14L45L26
3746D35K80J81R9m2j44k37k96l44l21k78j95r9J3J43K14K87L40L26K89K03J04
3767I58oj09k21k82l32l21k81k27j17oJ00J84K80L18L25K92K27J32K6r6j73k78
3789C93l03l33k93k36j43k6P2J83K52L13L27K98K42J54M2o5j50k67l08l15l05
3810d68k42j78l9M1J54K38K95L33K87K62J61P7m1j46k26k86l10l10k56j74q0j
3832i09J40K14K89L10L02K66K03Q0kj25j87k93l00l03k78k03j05NJ07J79K72L23
3854a5L00K84K15J20%r0j83k60l20k96k76k29j23l5Q3J67K66K93L03K77K28J39
$$ plain form
3703 -1006 -1013 -907 -708 -426 -75 282 596 845 987 1025 930 737 464 127 -226 -543 -806 -958 -999 -924 -760 -477
3725 -477 -162 189 507 773 944 1002 927 772 519 191 -140 -471 -738 -916 -997 -951 -789 -550 -236 109 435
3746 435 715 896 995 953 809 572 276 -68 -389 -667 -862 -961 -948 -805 -591 -304 36 362 651 854 958
3767 958 952 843 622 340 8 -313 -594 -821 -938 -944 -844 -660 -380 -62 263 555 782 914 940 844 671 393
3789 393 90 -243 -536 -772 -915 -941 -869 -686 -434 -121 206 504 746 900 942 877 727 460 152 -163 -468
3810 -468 -710 -888 -927 -886 -732 -494 -199 134 421 683 844 921 880 734 508 222 -88 -398 -654 -828 -908 -909
3832 -909 -769 -555 -266 44 346 612 815 895 893 768 581 288 -12 -315 -593 -796 -901 -896 -789 -610 -338 -15
3854 -15 285 569 784 904 904 814 631 371 51 -245 -521 -750 -873 -908 -825 -658 -392 -99 204 481 709 848
3876H48M9p2j47k50k82k95l01k27j66n4N4J36K42K92L03K75K47J70P7m5j40k22
3898D92k77l09k97k45j86n2L4J25J83K86L15K96K50J75Q3j2j18j95k79k89k96
3919c16k65j93j10J2J09J79K60K92K93K60K00J27Oq4j86k48k66l08k56k12j16
3940h22l5P0J65K43K88K85K83K15J31L8n8j53k36k72l06k59k26j56o2O1J40K30
3962d36K60K94K84K21J63N8l5j38j99k70k88k84k37j64q1K3J30J95K61K84K77
3983C18K38J85Q0Jj07j90k46k83k84k48j92r1LR7J82K38K81K81K47K10J04J5r3
4006G46j69k43k79k85k60k05j21j3N8J72K31K79K79K61K12J25L8o9j42k25k73
4027A17k85k58k15j46m0M6J53K08K74K86K57K15J52O2m6j22k20k48k81k87k22
$$ plain form
3876 848 897 825 678 428 146 -149 -450 -677 -843 -897 -843 -707 -465 -173 130 405 652 822 899 854 714 492
3898 492 215 -94 -391 -636 -822 -874 -840 -715 -532 -246 69 365 615 790 873 861 743 548 269 -20 -316
3919 -316 -581 -774 -884 -872 -763 -584 -324 -32 261 521 721 848 854 770 584 336 70 -238 -494 -706 -822
3940 -822 -857 -787 -622 -379 -91 194 477 692 823 861 803 650 414 142 -164 -423 -649 -805 -867 -806 -666 -436
3962 -436 -176 118 402 623 786 844 809 671 472 202 -86 -370 -607 -771 -852 -829 -699 -504 -243 41 318
3983 318 556 741 821 822 715 525 279 -4 -288 -536 -728 -819 -816 -719 -537 -299 -18 263 510 720 824 839 746
4006 746 577 334 55 -230 -490 -695 -816 -829 -771 -599 -368 -89 190 451 663 788 826 757 615 390 117
4027 117 -168 -426 -641 -787 -827 -781 -628 -420 -146 140 397 612 764 826 780 658 438 190 -91 -378 -600
4048f00j58o0L2J14K12K50K74K60K41J68Q1k3j12j87k55k77k83k34j77q5J0R8
4070g11J90K58K59K74K39J98R7Mq8j74k39k72k95k35j91j01qO0J66K44K63K83
4092B21K50K05J07L6p5j47k33k67k82k52k14j23m0O0J41K22K61K75K60K21J37
4113G63L8l9j48k11k50k85k62k12j50n4K6J29K03K68K77K60K36J51O7l3j08k10
4135D56k38k71k77k24j72o3J7J04J80K46K70K76K36J77P6j0r2j73k46k77k73k36
4157e14j71r7k6J01J57K40K70K68K45J85J16J1o8j52k31k67k74k51j83j23k9O3
4179g30J43K16K72K74K50K12J27M1o1j41j99k77k61k68k03j40n6M7J31J88K62
4200a73K65K52K35J43P3m6j06k04k44k58k68k31j68o5J0J22J88K26K89K70K21
$$ plain form
4048 -600 -758 -818 -786 -672 -460 -210 64 324 565 733 814 791 679 492 237 -40 -323 -557 -734 -819 -809 -711
4070 -711 -521 -263 -4 270 509 707 804 808 720 546 307 35 -260 -495 -686 -787 -795 -735 -569 -325 -62 221
4092 221 471 676 783 819 744 597 364 97 -185 -437 -651 -774 -814 -754 -613 -391 -130 145 405 626 763
4113 763 801 762 614 403 153 -132 -394 -606 -756 -810 -784 -655 -452 -184 93 353 589 740 807 774 666 456
4135 456 218 -53 -330 -554 -726 -789 -772 -668 -488 -242 28 304 540 717 793 783 691 518 272 -5 -278 -514
4157 -514 -685 -782 -808 -707 -550 -310 -40 228 473 658 774 785 717 565 334 67 -207 -458 -641 -764 -793 -730
4179 -730 -587 -371 -99 175 425 637 764 805 744 603 404 127 -134 -402 -605 -745 -801 -754 -623 -435 -173
4200 -173 92 344 579 722 795 749 643 439 195 -63 -331 -562 -730 -795 -785 -663 -475 -249 40 310 531
4221E31J75Q5qj02j72k39k66k78k44j62j05j5R2J73K37K68K68K49J96R1L2r0j50
4244E66k34k60k72k61k05j20k3O7J46K15K73K70K59K05J35M1o0j41j97k72k69
4265a37k65k07j51l7K5J46K02K52K67K73K19J67M9l3j16j87k46k80k68k40j48
4286g15r2L2R4J87K41K63K87K27J85P4nq5j74k51k64k73k46j93r6kQ9J70K24K66
4310e7K74K57J92J10K8p2j40k40k69k71k59k08j12l6O6J48K10K69K69K53K10J46
4332G68M7n1j44j98k62k84k53k35j45o2M2J27J90K66K72K77K08J67P3j9j16j92
4354D76k58k67k71k29j70q4L1Q4J77K43K78K68K51J75J05pr9j56k51k71k75k49
4376d99j85j12jP2J71K22K76K83K44J89J23Ro3j48k31k57k77k62k10j31k9N1J47
$$ plain form
4221 531 706 791 783 681 509 270 4 -274 -518 -680 -785 -800 -708 -535 -298 -30 238 487 683 774 806 716 566
4244 566 332 72 -200 -461 -666 -786 -809 -742 -596 -381 -108 162 421 626 761 802 742 601 404 132 -137
4265 -137 -402 -609 -760 -797 -772 -626 -424 -172 95 368 587 754 803 770 654 467 221 -59 -327 -567 -715
4286 -715 -807 -775 -681 -494 -253 10 297 524 709 783 778 693 519 268 4 -269 -515 -708 -804 -806 -717 -547 -323 -57
4310 -57 217 474 666 776 804 732 592 352 83 -188 -447 -655 -767 -803 -737 -589 -379 -110 159 412 622 768
4332 768 815 764 620 422 160 -124 -377 -612 -757 -819 -777 -650 -460 -194 78 355 563 730 803 784 668 476
4354 476 218 -49 -320 -549 -719 -803 -772 -688 -511 -268 10 278 529 704 809 802 703 547 296 25 -250 -499
4376 -499 -684 -796 -797 -725 -554 -332 -56 227 471 660 783 792 729 581 350 93 -184 -446 -656 -787 -816 -765 -618
4399f18K25K64K71K61K26J40M5n1j35k14k58k69k63k16j48o2K8J34K02K53K69
4420H4K64K33J59Q1l5j09j89k53k87k76k19j76q6J3R6J96K15K92K67K49J86Q5
4442G90J0j01j71k35k79k69k44j94j01j2P9J66K35K56K87K52J98J32J7n6j55k43
4464C62k44k83k55k12j36k8M6J33K14K64K73K58K24J45N2l5j39k02k49k77k77
4485c66k22j62n6J9J22J91K39K75K83K33J68Q8k9r8j91k36k83k59k42j80r1MR8
4508f95J71K48K65K76K37J87J18Oq7j51k42k70k73k50j99j29k2P7J51K20K60K75
4530A73K71J95J40M1o6j43k09k79k55k65k21j34n7M5J27K15K60K71K67K16J60
4551G52P1k7j17k12k46k83k73k15j69q7J9J07J86K51K79K65K32J82R7j1r1j85
$$ plain form
4399 -618 -393 -129 142 403 629 769 814 763 628 414 156 -113 -376 -592 -740 -802 -774 -640 -438 -185 84
4420 84 348 581 740 821 786 677 488 235 -52 -328 -547 -723 -809 -796 -700 -504 -289 3 270 519 705 790
4442 790 800 699 528 293 14 -255 -499 -693 -794 -806 -727 -561 -326 -70 217 469 667 799 816 760 605 362
4464 362 118 -165 -420 -632 -768 -796 -750 -617 -403 -139 134 392 616 761 813 778 639 437 188 -89 -366
4485 -366 -588 -750 -806 -787 -665 -474 -235 40 323 556 724 812 783 685 494 258 -25 -284 -526 -706 -797 -793 -695
4508 -695 -524 -276 -11 265 502 689 807 813 726 575 333 63 -210 -460 -659 -788 -810 -733 -582 -362 -102 173
4530 173 444 639 779 820 754 611 402 123 -132 -397 -618 -752 -809 -764 -637 -422 -162 109 376 592 752
4551 752 823 796 679 467 221 -62 -335 -550 -719 -806 -787 -680 -494 -243 36 301 533 715 812 801 710 525
4573E25k26k88k65k44j98j00j4Q9J49K45K75K67K62J92J17J5n5j57k25k71k76
4594a83k66j92j35m9P4J44K04K65K86K59K08J60M7m6j19k18k45k89k61k29j65
4615g50o4K9J13J89K62K73K78K37J64P9j4j07j92k41k70k79k37j92r0nR6J79K41
4638c01K77K69K61J77J32Oq0j56k47k66k74k53k00j33j9O5J45K36K55K85K56K09
4660F44J40L0n0j33k14k59k78k61k21j67n7M0J16K15K62K76K71K28J67N5j2j13
4682F79k00k33k98k59k34j80p5RQ9J78K58K69K64K62J83J09rp6j82k28k72k75
4704b21k45k24q5k9P0J67K35K69K64K49K12J21L2o8j42k14k76k88k54k00j44l0
4726h01L7J24K09K81K66K63K19J61M3j6j28k06k55k63k62k37j67p0K2J18J80K57
$$ plain form
4573 525 299 11 -254 -498 -696 -796 -810 -721 -572 -327 -52 215 477 669 786 801 746 589 364 93 -183
4594 -183 -449 -641 -776 -825 -751 -607 -403 -138 148 407 615 775 822 776 657 439 194 -95 -356 -585 -750
4615 -750 -814 -785 -672 -483 -221 52 330 567 731 810 796 689 497 256 -14 -293 -530 -722 -812 -817 -721 -542 -301
4638 -301 -24 245 506 683 815 821 741 585 338 72 -202 -455 -655 -788 -807 -742 -597 -361 -106 179 435 644
4660 644 784 814 764 631 417 158 -120 -381 -602 -769 -826 -786 -670 -455 -193 83 354 582 749 804 792 679
4682 679 479 246 -52 -311 -545 -725 -800 -791 -702 -524 -266 3 267 529 712 821 812 736 554 326 54 -221
4704 -221 -466 -690 -775 -804 -734 -567 -332 -63 201 450 662 783 815 747 605 391 115 -173 -427 -627 -771 -801
4726 -801 -764 -640 -431 -150 116 379 598 759 802 786 658 452 197 -66 -328 -565 -732 -802 -780 -662 -482 -225
4748b25K65K85K30J81Q7j0j09j76k42k72k76k52j76j02qP9J78K15K83K75K38K06
4770F74J18mn4j69k20k67k73k58k02j20k9P1J40K09K66K83K52K11J32N7n2j32
4792F33k07k72k68k67k14j49n1K9J23K03K51K85K57K23J67O8n1r8j88k53k67k70
4814c16k29j66q3LJ02J77K43K66K70K49J69J01Jr3j57k40k54k70k37k00j06j6
4836g86P3J54K21K70K61K62J95J34K5p0j48k17k51k64k67k03j32m2L6J35K03K60
4858a51K63K55K14J48N1l0j20j85k51k69k66k09j66p1K4J06J84K33K78K61K32
4879E31J74P4Jj05j69k33k57k66k28j88j03J8P0J73K17K49K70K36J93J20Ko8j55
4902E56k30k52k73k43j84j30k3N8J38K09K60K56K69J99J36K8n7j17k02k43k73
$$ plain form
4748 -225 40 325 555 736 823 813 704 528 286 14 -262 -514 -690 -792 -800 -721 -543 -328 -45 230 468 674
4770 674 792 788 734 565 345 78 -195 -453 -655 -775 -804 -733 -593 -384 -118 165 417 628 760 817 765 633
4792 633 426 154 -114 -381 -595 -744 -795 -766 -643 -440 -189 96 353 576 743 811 760 662 474 221 -46 -316
4814 -316 -545 -711 -794 -791 -689 -512 -269 -3 267 516 685 786 787 694 537 297 43 -227 -464 -664 -770 -786
4836 -786 -713 -559 -338 -68 193 455 650 784 809 739 591 374 123 -141 -408 -611 -743 -785 -749 -614 -411 -151
4858 -151 112 367 581 729 780 750 630 445 194 -75 -341 -550 -716 -787 -763 -657 -473 -240 38 299 531
4879 531 705 779 780 675 506 273 16 -250 -478 -666 -769 -751 -681 -508 -291 -42 228 464 657 777 779 711 556
4902 556 326 74 -199 -442 -626 -756 -779 -721 -583 -374 -114 142 411 610 746 774 717 600 398 155 -118
4923a18k40k26j35n6K7J27K06K32K79K56K11J65O6l9j07j84k39k54k68k20j62
4944f79p7RR0J71K32K60K59K35J69R1%q0j67k23k64k58k43j81j04j2Q2J46K18
4967c26K62K62K43J97J14J4m7j62j97k53k61k32k10j27n2O1J31J91K54K68K41
4988C71K16J35N6m0j30j84k38k69k56k26j34p8M1R9J91K32K52K54K24J60Q8j6
5010G48r7j74k36k50k54k33j61j02J0R0J52K30K53K64K30J79J10J8q0j49k22k53
5032G3k52k39j90j16l5O3J46K09K35K69K28K06J18N5o1j31k04k48k48k54j92j41
5054g09o1M3J21J92K28K79K27K24J46O0l3j01j75k27k49k54k10j52q4J0R8J58
$$ plain form
4923 -118 -358 -584 -719 -775 -748 -621 -415 -183 96 352 563 728 794 755 648 464 225 -29 -297 -517 -679
4944 -679 -756 -747 -657 -486 -254 6 265 500 669 760 760 680 513 290 26 -232 -475 -656 -760 -772 -690 -544 -326
4967 -326 -64 198 441 638 752 766 719 557 360 107 -154 -386 -596 -723 -775 -714 -583 -392 -138 130 371
4988 371 587 722 778 738 608 424 186 -83 -339 -565 -699 -777 -736 -637 -446 -214 38 292 516 676 764 748
5010 748 651 477 241 -9 -263 -496 -657 -759 -749 -659 -507 -277 -24 240 470 649 759 777 697 548 326 73
5032 73 -179 -418 -608 -724 -759 -696 -550 -341 -106 163 391 597 715 770 709 578 374 126 -122 -376 -568 -709
5054 -709 -770 -727 -606 -414 -186 93 320 544 690 750 717 616 441 214 -35 -289 -499 -651 -735 -725 -627 -469
$$ [...]
8191b1
##END NTUPLES=NMR FID
##END=
