##TITLE=1H_LY-allylPd240.2
 CDCl3,40 sc, 
 30.9.2021
##JCAMPDX= 6.0         $$ Bruker NMR JCAMP-DX V2.0
##DATA TYPE= NMR FID
##DATA CLASS= NTUPLES
##ORIGIN= UXNMR, Bruker Analytische Messtechnik GmbH
##OWNER= root
$$ XWIN-NMR		Version 3.5
$$ Thu Sep 30 11:33:31 2021 Russian Standard Time (UT+4h)  she@DPX200
##.OBSERVE FREQUENCY= 200.1313468511
##.OBSERVE NUCLEUS= ^1H
##.DELAY= (6, 6)
##.ACQUISITION MODE= SIMULTANEOUS
##.ACQUISITION SCHEME= undefined
##.AVERAGES= 9
##.DIGITISER RES= 18
##SPECTROMETER/DATA SYSTEM= spect
##.PULSE SEQUENCE= zg30
##.SOLVENT NAME= CDCl3
##.SHIFT REFERENCE= (INTERNAL, CDCl3, 0, 15.7039)
##AUDIT TRAIL= $$ (NUMBER, WHEN, WHO, WHERE, WHAT)
$$ ##TITLE= Audit trail, XWIN-NMR		Version 3.5
$$ ##JCAMPDX= 5.01
$$ ##ORIGIN= Bruker BioSpin GmbH
$$ ##OWNER= she
$$ F:/spectra/data/she/nmr/H-F/1/audita.txt
$$ ##AUDIT TRAIL=  $$ (NUMBER, WHEN, WHO, WHERE, WHAT)
(   1,<2021-09-30 11:32:09.85 +0400>,<she>,<DPX200>,
      <created by zg, POWCHK disabled, PULCHK disabled
       terminated by command 'halt'
       configuration hash MD5:
       00 E9 B6 7A A2 85 ED C7 34 08 36 98 17 FE 4E 26
       data hash MD5: 16K
       FE EB 79 48 C6 02 18 36 CF 24 EA 4B FD 98 1E CE>)
$$ ##END=
$$ 
$$ hash MD5
$$ AA 24 19 2C 0F AC 23 4D 57 F8 12 F5 4C 20 E0 83
##$RELAX= 
##$RELAX= 
##$RELAX= 
##$RELAX= 
##$RELAX= 
##$RELAX= 
$$ Bruker specific parameters
$$ --------------------------
##$DU= <F:/spectra>
##$EXPNO= 1
##$NAME= <H-F>
##$PROCNO= 1
##$TYPE= <nmr>
##$USER= <she>
##$AMP= (0..31)
100 100 100 100 100 100 100 100 100 100 100 100 100 100 100 100 100 100 
100 100 100 100 100 100 100 100 100 100 100 100 100 100 
##$AQSEQ= 0
##$AQ_mod= 1
##$AUNM= <au_zg>
##$AUTOPOS= <>
##$BF1= 200.13
##$BF2= 200.13
##$BF3= 200.13
##$BF4= 200.13
##$BF5= 200.13
##$BF6= 200.13
##$BF7= 200.13
##$BF8= 200.13
##$BYTORDA= 1
##$CFDGTYP= 0
##$CFRGTYP= 5
##$CHEMSTR= <none>
##$CNST= (0..31)
1 1 145 1 1 1 1 1 1 1 1 1 1 1 1 1 1 1 1 1 1 1 1 1 1 1 1 1 1 1 1 1 
##$CPDPRG= <>
##$CPDPRG1= <>
##$CPDPRG2= <>
##$CPDPRG3= <>
##$CPDPRG4= <mlev>
##$CPDPRG5= <mlev>
##$CPDPRG6= <mlev>
##$CPDPRG7= <mlev>
##$CPDPRG8= <mlev>
##$CPDPRGB= <>
##$CPDPRGT= <>
##$D= (0..31)
0 1.2 0 0 0 0 0 0 0 0.06 0 0.03 0 0 0 0 0.0002 0 0 0 0 0 0 0 0 0 0 0 0 
0 0 0 
##$DATE= 1632987129
##$DBL= (0..7)
120 120 120 120 120 120 120 120 
##$DBP= (0..7)
150 150 150 150 150 150 150 150 
##$DBP07= 0
##$DBPNAM0= <>
##$DBPNAM1= <>
##$DBPNAM2= <>
##$DBPNAM3= <>
##$DBPNAM4= <>
##$DBPNAM5= <>
##$DBPNAM6= <>
##$DBPNAM7= <>
##$DBPOAL= (0..7)
0.5 0.5 0.5 0.5 0.5 0.5 0.5 0.5 
##$DBPOFFS= (0..7)
0 0 0 0 0 0 0 0 
##$DE= 6
##$DECBNUC= <off>
##$DECIM= 32
##$DECNUC= <off>
##$DECSTAT= 4
##$DIGMOD= 1
##$DIGTYP= 9
##$DL= (0..7)
0 120 120 120 120 120 120 120 
##$DP= (0..7)
150 150 150 150 150 150 150 150 
##$DP07= 0
##$DPNAME0= <>
##$DPNAME1= <>
##$DPNAME2= <>
##$DPNAME3= <>
##$DPNAME4= <>
##$DPNAME5= <>
##$DPNAME6= <>
##$DPNAME7= <>
##$DPOAL= (0..7)
0.5 0.5 0.5 0.5 0.5 0.5 0.5 0.5 
##$DPOFFS= (0..7)
0 0 0 0 0 0 0 0 
##$DQDMODE= 0
$$ [...]
##$SUBNAM2= <"">
##$SUBNAM3= <"">
##$SUBNAM4= <"">
##$SUBNAM5= <"">
##$SUBNAM6= <"">
##$SUBNAM7= <"">
##$SUBNAM8= <"">
##$SUBNAM9= <"">
##$SW= 18.0517286264689
##$SWIBOX= (0..15)
0 0 2 0 0 0 0 0 0 0 0 0 0 0 0 0 
##$SW_h= 3612.71676300578
##$TD= 16384
##$TD0= 1
##$TE= 0
##$TE2= 300
##$TE3= 300
##$TEG= 300
##$TL= (0..7)
0 120 120 120 120 120 120 120 
##$TP= (0..7)
150 150 150 150 150 150 150 150 
##$TP07= 0
##$TPNAME0= <>
##$TPNAME1= <>
##$TPNAME2= <>
##$TPNAME3= <>
##$TPNAME4= <>
##$TPNAME5= <>
##$TPNAME6= <>
##$TPNAME7= <>
##$TPOAL= (0..7)
0.5 0.5 0.5 0.5 0.5 0.5 0.5 0.5 
##$TPOFFS= (0..7)
0 0 0 0 0 0 0 0 
##$TUNHIN= 0
##$TUNHOUT= 0
##$TUNXOUT= 0
##$USERA1= <user>
##$USERA2= <user>
##$USERA3= <user>
##$USERA4= <user>
##$USERA5= <user>
##$V9= 5
##$VALIST= <valist>
##$VCLIST= <CCCCCCCCCCCCCCC>
##$VD= 0
##$VDLIST= <DDDDDDDDDDDDDDD>
##$VPLIST= <PPPPPPPPPPPPPPP>
##$VTLIST= <TTTTTTTTTTTTTTT>
##$WBST= 1024
##$WBSW= 4
##$XGAIN= (0..3)
0 0 0 0 
##$XL= 0
##$YL= 0
##$YMAX_a= 442129
##$YMIN_a= -428700
##$ZGOPTNS= <>
##$ZL1= 120
##$ZL2= 120
##$ZL3= 120
##$ZL4= 120
##$ABSF1= 10
##$ABSF2= 0
##$ABSG= 5
##$ABSL= 3
##$ALPHA= 0
##$AQORDER= 0
##$ASSFAC= 0
##$ASSFACI= 0
##$ASSFACX= 0
##$ASSWID= 0
##$AUNMP= <proc_1d>
##$AZFE= 0.1
##$AZFW= 0.1
##$BCFW= 1
##$BC_mod= 2
##$BYTORDP= 1
##$COROFFS= 0
##$CY= 11.3945322036743
##$DATMOD= 1
##$DC= 2
##$DFILT= <>
##$DTYPP= 0
##$F1P= 2.36226072786647
##$F2P= -0.459571619588291
##$FCOR= 0.5
##$FTSIZE= 0
##$FT_mod= 4
##$GAMMA= 1
##$GB= 0.15
##$INTBC= 1
##$INTSCL= 1
##$ISEN= 128
##$LB= 0.24
##$LEV0= 0
##$LPBIN= 0
##$MAXI= 10000
##$MC2= 0
##$MEAN= 0
##$ME_mod= 0
##$MI= 1.114404
##$NCOEF= 0
##$NC_proc= 0
##$NLEV= 6
##$NOISF1= 3.799351
##$NOISF2= 2.8
##$NSP= 1
##$NTH_PI= 0
##$NZP= 0
##$OFFSET= 15.70392
##$PC= 1
##$PHC0= -14595.07
##$PHC1= 13.40085
##$PH_mod= 1
##$PKNL= yes
##$PPARMOD= 0
##$PSCAL= 0
##$PSIGN= 0
##$REVERSE= no
##$SF= 200.130013532006
##$SI= 16384
##$SIGF1= 3
##$SIGF2= 2
##$SINO= 400
##$SIOLD= 16384
##$SREGLST= <1H.CDCl3>
##$SSB= 0
##$STSI= 0
##$STSR= 0
##$SW_p= 3612.71676300578
##$SYMM= 0
##$S_DEV= 0
##$TDeff= 0
##$TDoff= 0
##$TI= <>
##$TILT= no
##$TM1= 0
##$TM2= 0
##$TOPLEV= 0
##$USERP1= <user>
##$USERP2= <user>
##$USERP3= <user>
##$USERP4= <user>
##$USERP5= <user>
##$WDW= 1
##$XDIM= 8192
##$YMAX_p= 0
##$YMIN_p= 0
$$ End of Bruker specific parameters
$$ ---------------------------------
##NTUPLES= NMR FID
##VAR_NAME=  TIME,          FID/REAL,        FID/IMAG
##SYMBOL=    X,             R,               I
##VAR_TYPE=  INDEPENDENT,   DEPENDENT,       DEPENDENT
##VAR_FORM=  AFFN,          ASDF,            ASDF
##VAR_DIM=   8192,          8192,            8192
##UNITS=     SECONDS,       ARBITRARY UNITS, ARBITRARY UNITS
##FACTOR=    0.0002768,     1,               1
##FIRST=     0,             0,               0
##LAST=      2.2672688,     0,               0
##MIN=       0,             -428700,         0
##MAX=       2.2672688,     442129,          0
$$ Real data points
##PAGE= N=1
##DATA TABLE= (X++(R..R)), XYDATA
$$ plain form
0 0 0 0 0 0 0 0 0 0 0 -9 9 -9 9 -18 18 -26 27 -36 45 -49 63 -73 83 -100 118 -136 163 -184 213 -246 282 -319
32 -319 364 -411 464 -524 586 -658 736 -819 913 -1015 1126 -1246 1377 -1522 1678 -1851 2042
49 2042 -2250 2477 -2729 3009 -3320 3670 -4062 4513 -5025 5622 -6332 7181 -8224 9540
63 9540 -11264 13628 -17084 22641 -33063 59528 -277617 -428700 66081 201890 303337
74 303337 147396 -79819 -118099 90465 183040 195528 41918 -211643 -286342 -55474 174502
85 174502 312698 278500 49402 -175427 -208275 -171686 -73549 18498 -56629 -184528 -120474
96 -120474 11555 107236 204023 205402 62394 -38315 -61849 -70205 -20545 57841 57157 33124
108 33124 42081 28250 -21858 -54151 -49547 -26254 -32049 -71398 -93985 -86810 -49228 46539 147504
$$ packed form
0@%%%%%%%%%rJ8j8J8k7L6m4N3o3Q1r4J12j36J56j83K18k54K99l47L97m59N28o01
32c19O83p75Q75r88J110j244J394j555J732j928K141k372K623k899L200l529L893
49B042m292M727n206N738o329O990p732Q575r538J0647j1954J3513j5405J7764
63I540k0804K4892l0712L9725n5704R2591l37145j51083M94781J35809J01447
74C03337j55941k27215l8280K08564R2575J2488j53610k53561p4699K30868K29976
85A74502J38196l4198k29098k24829l2848L6589R8137R2047p5127j27899O4054
96a20474J32029R5681R6787J379j43008j00709k3534q356M9660P8386o84k4033
108C3124Q957j3831n0108l2293M604K3293n795l9349k2587P175L7582R5767J00965
$$ plain form
121 147504 155830 66632 -52702 -113778 -52927 71374 138535 101641 -13236 -120728 -121361 -25052
133 -25052 81816 120001 19970 -147467 -182043 -59445 77804 165358 145173 -21926 -170220
144 -170220 -147345 -22432 115889 187528 87534 -83291 -125007 -50141 53060 139247 100011
155 100011 -63047 -174380 -160407 -52887 108650 178757 80342 -37896 -81847 -76542 2687
166 2687 91318 56264 -39625 -83606 -85010 -19923 95700 118954 41606 -20411 -60698 -75303
178 -75303 -21162 31810 26159 11897 -5556 -25878 -218 32357 20329 15422 21431 -8069 -33549
191 -33549 -31453 -34777 -18348 25479 38294 21312 1435 -34042 -46586 3967 56056 55897 18967
204 18967 -39364 -80132 -48932 27312 77773 71220 7064 -70132 -81670 -14937 63463 88909
$$ packed form
121A47504Q326q9198j19334o1076O0851J24301O7161l6894j14877j07492o33R6309
133b5052J06868L8185j00031j67437l4576J22598J37249Q7554k0185j67099j48294
144a70220K2875J24913J38321P1639r9994j70825m1716P4866J03201Q6187l9236
155A00011j63058j11333J3973J07520J61537P0107r8415j18238m3951N305P9229
166B687Q8631l5054r5889m3981j404O5087J15623K3254p7348o2017m0287j4605
178g5303N4141N2972n651j4262j7453k0322K5660L2575j2028m907O009k9500k5480
191c3549K096l324J6429M3827J2815j6982j9877l5477j2544N0553N2089j59l6930
204A8967n8331m0768L1200P6244N0461o553o4156p7196j1538O6733P8400K5446
$$ plain form
216 88909 35049 -62818 -115812 -74929 21501 99712 100008 19021 -69423 -82461 -13360 70377
228 70377 90734 25023 -72979 -121440 -76918 29214 111643 105989 25674 -59143 -81671 -31077
240 -31077 35587 53167 11467 -49971 -75713 -33266 44758 90491 72931 11036 -50109 -64991
252 -64991 -31177 7496 18931 3992 -19359 -22633 4415 34728 43288 29667 2646 -19735
264 -19735 -23212 -19452 -20675 -17921 -6522 8874 25734 30552 12847 -10039 -16680 -6196 9507
277 9507 11232 -12704 -41957 -42969 -8016 42698 74254 56743 1577 -43798 -46255 -12022 25030
290 25030 25957 -15724 -59729 -58717 -5400 62326 91082 54595 -19214 -72786 -68901 -18096 32425
303 32425 38669 1705 -33893 -27091 21412 72648 80018 28738 -46738 -90533 -73835 -16964 32745
$$ packed form
216H8909n3860r7867n2994M0883R6430P8211K96q0987q8444j3038O9101Q3737
228G0377K0357o5711r8002m8461M4522J06132Q2429n654q0315q4817k2528N0594
240c1077O6664J7580m1700o1438k5742M2447P8024M5733j7560o1895o1145j4882
252f4991L3814L8673J1435j4939k3351l274K7048L0313Q560j3621k7021k2381
264a9735l477L760j223K754J1399J5396J6860M818j7705k2886o641J0484J5703
277I507J725k3936k9253j012L4953N0714L1556j7511n5166m5375k457L4233L7052
290B5030R27m1681m4005J012N3317O7726K8756l6487p3809n3572L885N0805N0521
303C2425O244l6964l5598O802M8503N1236P370n1280p5476m3795J6698N6871M9709
$$ plain form
316 32745 41769 14857 -13126 -11524 18107 44568 36050 -7583 -53774 -66580 -38040 9835 44591
329 44591 47021 24863 3850 -48 5294 2772 -13865 -34633 -41854 -25962 4809 31128 38378
342 38378 26347 9162 -862 -6152 -13919 -23358 -28802 -22308 1209 29873 42166 30293 4314
355 4314 -18793 -23601 -12476 -3407 -5057 -12799 -16369 -2028 27482 44048 30243 -2421 -35003
368 -35003 -46044 -23553 11062 27376 20970 1332 -13356 -3390 19138 23442 5506 -22326 -44568
381 -44568 -36037 3558 37061 43172 25786 -6823 -28000 -17597 747 3262 -4719 -18468 -24010
394 -24010 -534 33815 45606 32624 1043 -35342 -43145 -20773 -1818 5591 7661 2226 5593
407 5593 25992 35873 20949 -6346 -36997 -50793 -29458 3181 19133 21334 15017 6180 10355
$$ packed form
316C2745R024k6912k7983J602K9631K6461q518m3633m6191j2806K8540M7875L4756
329D4591K430k2158k1013l898N342k522j6637k0768p221J5892L0771K6319P250
342C8378j2031j7185j0024n290p767r439n444O494K3517K8664J2293j1873k5979
355D314k3107m808J1125R069j650p742l570J4341K9510J6566j3805l2664l2582
368c5003j1041K2491L4615J6314o406j9638j4688R966K2528M304j7936k7832k2242
381d4568Q531L9595L3503O111j7386l2609k1177J0403J8344K515p981j3749n542
394b4010K3476L4349J1791j2982l1581l6385p803K2372J8955P409K070n435L367
407E593K0399R881j4924k7295l0651j3796K1335L2639J5952K201o317q837M175
$$ plain form
420 10355 20491 13858 -9102 -33658 -46273 -31218 5924 34234 35391 18682 971 -6049 -470
433 -470 6631 394 -19225 -34769 -28637 -255 32773 43547 23424 -3700 -17119 -19152 -9315
446 -9315 5568 1966 -15456 -16503 -1466 16091 31815 24878 -5647 -21387 -16760 -12116 1613
459 1613 15046 1867 -12580 -4135 3996 9949 16467 -486 -19752 -7755 5198 5389 13690 7675
473 7675 -16175 -14293 2226 5725 13604 10260 -17947 -17791 11357 14448 7717 7937 -16742 -37455
487 -37455 -15357 9134 17910 24769 6556 -18831 -3523 19354 16309 12204 -3054 -36105 -37451
500 -37451 -6372 16647 33483 31074 -5418 -23901 -5441 2461 911 4692 -13996 -35833 -18820
513 -18820 11860 31581 43441 25768 -13142 -24315 -13129 -9169 -1618 6249 -3348 -11730 -2879
$$ packed form
420A0355J0136o633k2960k4556j2615J5055L7142K8310J157j6709j7711p020N579
433d70P101o237j9619j5544O132K8382L3028J0774k0123k7124j3419k033R837
446i315J4883l602j7422j047J5037J7557J5724o937l0525j5740M627M644J3729
459A613J3433j3179j4447Q445Q131N953O518j6953j9266J1997J2953J91Q301o015
473G675k3850J882J6519L499P879l344k8207J56K9148L091o731K20k4679k0713
487c7455K2098K4491Q776O859j8213k5387J5308K2877l045m105j5258l3051j346
500c7451L1079K3019J6836k409l6492j8483J8460P902j550L781j8688k1837J7013
513a8820L0680J9721J1860j7673l8910j1173J1186L960P551P867r597q382Q851
$$ plain form
526 -2879 10930 21660 19787 -793 -17835 -17390 -14387 -10576 1745 10577 8435 6822 9793 10476
540 10476 7155 341 -8887 -12560 -6749 -4484 -9804 -5301 9115 12558 9666 11931 3360 -15596
554 -15596 -19602 -9141 2898 14606 10391 -8872 -11205 1427 7137 16244 21282 -892 -23966
567 -23966 -22455 -10833 9735 27713 10526 -16023 -14640 -9134 -2763 23431 28442 -4078 -22791
580 -22791 -20548 -13520 13559 32291 8997 -13608 -14465 -17453 -3419 27132 24814 -1388 -15867
593 -15867 -24244 -13802 18915 25220 5197 -2305 -13872 -27029 -3153 24502 16363 4257 -3846
606 -3846 -19859 -12578 10950 9695 3113 6354 -6928 -17228 -11 10833 5401 5668 1005 -8994
620 -8994 -4947 -1295 -5105 2822 9027 -1184 -4603 317 -1907 2348 13510 10887 1906 -4358 -16532
$$ packed form
526b879J3809J0730j873k0580j7042M45L003L811J2321Q832k142j613K971O83
540A0476l321o814r228l673N811K265n320M503J4416L443k892K265q571j8956
554a5596m006J0461J2039J1708m215j9263k333J2632N710R107N038k2174k3074
567b3966J511J1622K0568J7978j7187k6549J383N506O371K6194N011l2520j8713
580b2791K243P028K7079J8732k3294k2605q57k988J4034L0551k318k6202j4479
593a5867q377J0442L2717O305k0023p502j1567j3157K3876K7655q139j2106q103
606c846j6013P281K3528j255o582L241j3282j0300J7217J0844n432K67m663r999
620h994M047L652l810P927O205j0211l419M920k224M255J1162k623q981o264j2174
$$ plain form
635 -16532 -18954 1597 17633 13540 5672 -4054 -17329 -16219 918 11688 6934 -6118 -19282
648 -19282 -18014 3922 26939 31669 19928 -962 -21048 -20928 -191 15861 13515 -1639 -19666
661 -19666 -22451 -2457 17039 18486 7052 -14792 -34716 -26352 2011 19218 21874 13936 -3090
674 -3090 -6556 10775 22199 19789 11717 -9022 -28905 -22089 -3371 5695 9398 3425 -13001 -18332
688 -18332 -11302 -7053 -147 6560 870 -2077 7372 12788 15149 20777 16366 5070 1560 -3224 -10771
703 -10771 -7202 -1781 -5293 -7054 -7967 -15668 -17492 -9103 -2048 3318 5927 -369 -5069 3169 15224
718 15224 23801 27401 18101 -195 -9718 -6231 2452 9295 5212 -10983 -24976 -26118 -16434 -2180
732 -2180 5822 -591 -12573 -15071 -4346 13495 28130 28196 13218 -2972 -7438 214 11719 16496
$$ packed form
635a6532k422K0551J6036m093p868r726j3275J110J7137J0770m754j3052j3164
648a9282J268K1936K3017M730j1741k0890k0086J20K0737J6052k346j5154j8027
661a9666k785J9994J9496J447j1434k1844j9924Q364K8363J7207K656p938j7026
674c090l466J7331J1424k410q072k0739j9883O816J8718R066L703n973j6426n331
688a8332P030M249O906O707n690k947R449N416K361N628m411j1296l510m784p547
703a0771L569N421l512j761r13p701j824Q389P055N366K609o296m700Q238J2055
718A5224Q577L600r300j8296r523L487Q683O843m083j6195j3993j142R684J4254
732b180Q002o413j1982k498J0725J7841J4635O6j4978j6190m466P652J1505M777
$$ plain form
746 16496 8910 -6233 -16818 -15621 -6118 1738 170 -10407 -20618 -20811 -9640 6284 17792
759 17792 17799 9087 1847 1855 6817 11938 11942 4356 -5416 -9854 -7396 -1615 2743 1850 -3702 -9056 -11415
776 -11415 -9962 -4984 430 3503 4916 5667 5127 4511 5564 6301 4889 1766 -2584 -6726 -7009 -2413
792 -2413 3644 6801 4656 -2269 -8949 -9865 -4456 3157 7835 5694 -1137 -5342 -2683 4309 9675
807 9675 8159 -1200 -11638 -13974 -6493 4115 10136 7125 -2524 -9112 -5887 4183 12768 13003 4110
822 4110 -6585 -9479 -3119 6280 11017 5920 -6169 -14732 -13528 -5818 2282 5342 580 -6047 -6092
837 -6092 346 8008 11971 8847 1182 -3565 -1947 3343 8110 8158 2485 -3628 -6244 -6374 -5353 -4085
853 -4085 -4555 -6139 -5811 -3178 -295 1662 3437 5138 6001 5809 4739 3024 1835 2398 3546 3948 2122
$$ packed form
746A6496p586j5143j0585J197R503P856j568j0577j0211j93J1171J5924J1508
759A7792Pq712p240QM962N121Mp586r772m438K458N781M358q93n552n354k359
776a1415J453M978N414L073J413P51n40o16J053P37j412l123m350m142k83M596
792b413O057L157k145o925o680r16N409P613M678k141o831m205K659O992N366
807I675j516r359j0438k336P481J0608O021l011r649o588L225J0070Q585K35q893
822D110j0695k894O360R399M737n097j2089q563J204P710Q100L060m762o627m5
837f092O438P662L963l124p665m747J618N290M767M8n673o113k616j30J021J268
853d085m70j584L28K633K883J957J775J701Q63j92j070j715j189N63J148M02j826
$$ plain form
870 2122 -2801 -7127 -6755 -3997 -1744 -263 -2880 -8319 -8041 -1612 4449 8825 8918 2058 -3580 -1435
886 -1435 3092 7301 9085 2653 -5513 -5418 -1750 1074 4696 1597 -8292 -11545 -6917 -1532 5070 7423
902 7423 405 -4541 -2410 -85 5133 11188 5963 -2604 -3148 -2476 -1190 4534 3905 -3505 -4614 -3011
918 -3011 -3062 1946 5046 -931 -4205 -2190 -2086 829 5130 2097 -1244 426 -941 -1612 2822 2357
934 2357 -1982 -732 903 -650 539 930 -2224 -1207 1724 583 453 2085 -624 -2402 769 2372
950 2372 918 -9 -1858 -3522 -876 2161 1128 -341 -889 -3332 -3200 2407 5819 3505 663 -1493
966 -1493 -3102 -39 3422 1778 319 -196 -4362 -3964 3308 4096 -814 -1278 -2472 -4402 1082 4901
982 4901 1462 1101 -5 -5663 -2309 5666 2857 -169 1740 -2609 -4050 3221 2570 -1916 1223 -1029
$$ packed form
870B122m923m326L72K758K253J481k617n439K78O429O061M376R3o860n638K145
886a435M527M209J784o432q166R5L668K824L622l099r889l253M628N385O602K353
902G423p018m946K131K325N218O055n225q567n44O72J286N724o29p410j109J603
918c011n1N008L100n977l274K015J04K915M301l033l341J670j367o71M434m65
934B357m339J250J635j553J189L91l154J017K931j141j30J632k709j778L171J603
950B372j454r27j849j664K646L037j033j469n48k443J32N607L412k314k842k156
966a493j609L063L461j644j459n15m166L98P272P88m910m64j194j930N484L819
982D901l439l61j106n658L354P975k809l026J909m349j441P271o51m486L139k252
$$ plain form
998 -1029 -5901 1156 5221 -1031 -726 914 -3372 294 5513 107 -676 2920 -3416 -4452 4104 1623
1014 1623 -3984 603 356 -2806 3213 3553 -2794 -11 1243 -4324 582 6451 -310 -3136 615
1029 615 -2041 -1717 3867 1053 -2754 512 -712 -2212 3866 4002 -2650 -2451 -250 -1138 2346 4541
1045 4541 -542 -2073 215 -1858 -728 4530 1973 -4033 -2357 -1 -1097 843 1900 -2052 -2644
1060 -2644 698 800 1935 4820 983 -3931 -1163 1510 309 1812 1652 -2642 -1924 887 -868 504
1076 504 2755 -2240 -4093 1630 2063 -430 1867 -73 -4181 -311 1968 -386 2673 3319 -3564 -2498
1092 -2498 3280 759 -569 2320 -1393 -3505 1479 1249 -810 1985 -770 -4750 768 3794 72
1107 72 1360 1491 -3644 -1481 2977 -373 -770 1991 -2081 -2999 3043 2564 -1006 586 -613 -2830
$$ packed form
998a029m872P057M065o252L05J640m286L666N219n406p83L596o336j036Q556k481
1014A623n607M587k47l162O019L40o347K783J254n567M906N869o761k826L751
1029F15k656L24N584k814l807L266j224j500O078J36o652J99K201q88L484K195
1045D541n083j531K288k073J130N258k557o006J676K356j096J940J057l952n92
1060b644L342J02J135K885l837m914K768K673j201J503j60m294P18K811j755J372
1076E04K251m995j853N723M33k493K297j940m108L870K279k354L059O46o883J066
1092b498N778k521j328K889l713k112M984k30k059K795k755l980N518L026l722
1107G2J288J31n135K163M458l350l97K761m072r18O042m79l570J592j199k217
$$ plain form
1123 -2830 966 2371 -394 693 411 -3332 -1043 2915 822 106 1378 -958 -1021 2075 906 -718
1139 -718 239 -1685 -2980 1313 2703 -482 -680 -465 -2501 -683 2793 1625 67 439 -781 -1082
1155 -1082 1482 1559 -603 -775 -412 -269 1521 1962 -161 -1182 -1141 -1799 -61 2280 724 -1266 -705
1172 -705 -819 -569 1753 1872 -188 4 315 -516 940 1831 -952 -2088 -669 -780 -275 1698 624
1189 624 -1387 -601 -124 -13 1802 1714 -630 -757 230 59 1103 1522 -805 -1663 -482 -299 871 2342
1207 2342 244 -2056 -1093 -472 -325 1286 1037 -1257 -1033 487 672 1395 1312 -995 -1511 113 801 1174
1225 1174 1482 -597 -2405 -1189 88 542 1697 1330 -506 -709 185 334 683 588 -778 -1104 -161 -25
1243 -25 151 607 -614 -1731 -455 940 999 1318 962 -635 -851 424 856 769 389 -641 -603 578 854
$$ packed form
1123b830L796J405k765J087k82l743K289L958k093p16J272k336o3L096j169j624
1139g18R57j924j295M293J390l185j98K15k036J818L476j168j558L72j220l01
1155a082K564P7k162j72L63J43J790M41k123j021M1o58J738K341j556j990N61
1172g05j14K50K322J19k060J92L11q31J456Q91k783j136J419j11N05J973j074
1189F24k011P86M77J11J815q8k344j27R87j71J044M19k327q58J181J83J170J471
1207B342k098k300R63O21J47J611k49k294K24J520J85P23q3k307n16J624O88L73
1225A174L08k079j808J216J277M54J155l67j836k03Q94J49L49r5j366l26R43J36
1243b5J76M56j221j117J276J395N9L19l56j597k16J275M32q7l80j030L8J181K76
$$ plain form
1262 854 258 -89 -938 -1590 -287 1137 584 -220 -583 -1106 -574 689 1111 537 37 -175 111 1109 1296
1281 1296 128 -731 -1228 -1263 -4 1470 1130 -91 -595 -657 -179 1187 1761 778 -355 -818 -860 -253 238
1300 238 -568 -1235 -867 -308 518 1492 1006 -275 -654 -213 417 1415 1744 751 -127 -203 -60 359 645 -353
1320 -353 -1342 -1563 -1258 -685 -3 -430 -1357 -987 115 955 2034 2164 1110 607 1232 1609 1561 1241 111
1339 111 -993 -1229 -1074 -1012 -1363 -2499 -3185 -2593 -1431 -119 1387 1873 1154 998 1638 2097 2515 2595 1616
1358 1616 908 860 516 91 -428 -1625 -2803 -2440 -1952 -1968 -1830 -2022 -2428 -1648 144 1743 2922 3319 2915
1377 2915 2978 2997 2099 1560 1307 -243 -1159 -408 -777 -2140 -2359 -2659 -3549 -2445 -677 -467 -116 280 -92
1396 -92 665 2663 2953 2569 2443 1030 137 1392 1520 -3 -484 -1514 -3110 -1851 -294 -1004 -923 -629
$$ packed form
1262H54n96l47q49o52J303J424n53q04l63n23N32J263M22n74n00k12K86R98J87
1281A296j168q59m97l5J259J474l40j221n04o2M78J366N74r83j133m63m2O07M91
1300B38q06o67L68N59Q26R74m86j281l79M41O30R98L29r93q78p6J43M19K86r98
1320c53r89k21L05N73O82m27r27L70J102Q40J079J30j054n03O25L77m8l20j130
1339A11j104k36J55O2l51j136o86N92J162J312J506M86p19j56O40M59M18Q0r79
1358A616p08m8l44m25n19j197j178L63M88j6J38j92m06P80J792J599J179L97m04
1377B915O3J9q98n39k53j550r16P51l69j363k19l00q90J104J768K10L51L96l72
1396i2P57J998K90l84j26j413q93J255J28j523m81j030j596J259J557p10Q1K94
$$ plain form
1414 -629 -2062 -1358 1603 1639 1023 2064 966 -520 1547 2444 528 130 -466 -2812 -1980 430 205
1431 205 152 777 -1045 -1578 706 1091 1082 2588 1286 -943 291 230 -1890 -880 -29 -2096 -1848 301
1449 301 -866 -956 1324 614 -277 1856 1852 611 2569 3132 896 1259 1337 -1308 -852 517 -1525 -2460
1467 -2460 -1984 -4737 -5702 -2282 -1143 -488 2677 2501 379 2814 4722 3487 4910 5142 415 -999
1483 -999 1352 -87 -981 413 -2789 -6476 -5078 -4095 -4162 -1248 -756 -3261 -1411 1679 2079 5220 7857
1500 7857 4588 2907 4077 2079 1433 3702 667 -3892 -3190 -3654 -5520 -2460 -905 -4348 -4649 -3173
1516 -3173 -4090 -1234 3732 3479 3538 6062 4425 2918 5627 5150 1889 1374 -824 -4526 -3700 -2720 -4388
1533 -4388 -2804 -1429 -4361 -3914 -270 -632 -484 2466 1095 -875 2301 3953 3768 6912 6880 1641
$$ packed form
1414f29j433P04K961L6o16J041j098j486K067Q97j916l98n96k346Q32K410k25
1431B05n3O25j822n33K284L85rJ506j302k229J234o1k120J010Q51k067K48K149
1449C01j167r0K280p10q91K133mj241J958N63k236L63P8k645M56J369k042r35
1467b460M76k753r65L420J139O55L165j76k122K435J908j235J423K32m727j414
1483i99K351j439q94J394l202l687J398R83o7K914M92k505J850L090M00L141K637
1500G857l269j681J170j998o46K269l035m559P02m64j866L060J555l443l01J476
1516c173r17K856M966k53N9K524j637j507K709m77l261n15k198l702Q26R80j668
1533d388J584J375k932M47L644l62J48K950j371j970L176J652j85L144l2n239
$$ plain form
1549 1641 -450 -602 -3105 -2714 -754 -3210 -4989 -3557 -3742 -2215 2535 2573 -566 -73 -168 -1449 1959
1566 1959 4868 2994 2273 2199 -442 527 3711 1605 -1202 -2057 -4919 -6411 -1921 1040 311 1194 647
1583 647 -2174 -385 2796 1444 906 1428 -1662 -2191 1596 2786 2445 3326 611 -2984 -1794 -1183 -1947
1600 -1947 389 1146 -2193 -2427 -99 141 1639 3925 1663 -960 -606 -1483 -1691 1703 1910 -1070 -657
1617 -657 -267 -1284 938 3013 802 -579 -813 -2916 -2252 1721 2142 760 979 -802 -2483 -66
1633 -66 1908 1480 1848 379 -2960 -2173 700 929 1262 1786 -1081 -2841 -603 1165 1797 2539 390
1650 390 -2839 -2392 -592 387 2134 2344 -835 -2344 -913 174 1686 3216 1394 -1529 -1850 -1516
1666 -1516 -992 1232 1900 -31 -1034 -846 -584 1060 2362 805 -1159 -1851 -2442 -1379 1899 3243
$$ packed form
1549A641k091j52k503L91J960k456j779J432j85J527M750L8l139M93r5j281L408
1566A959K909j874p21p4k641R69L184k106k807q55k862j492M490K961p29Q83n47
1583F47k821J789L181j352n38N22l090n29L787J190l41Q81k715l595J190O11p64
1600a947K336P57l339k34K328K40J498K286k262k623L54q77k08L394K07k980M13
1617f57L90j017K222K075k211j381k34k103O64L973M21j382K19j781j681K417
1633f6J974m28L68j469l339P87K873K29L33N24k867j760K238J768O32P42k149
1650C90l229M47J800R79J747K10l179j509J431J087J512J530j822k923l21L34
1666a516N24K224O68j931j003J88K62J644J302j557j964o92n91J063L278J344
$$ plain form
1682 3243 2111 1227 127 -1241 -657 368 -360 -1159 -1774 -2620 -1643 1029 2437 2699 2505 488 -1751
1699 -1751 -1744 -979 -472 526 626 -273 62 1771 3055 3427 2220 -1064 -4199 -4929 -3970 -1660 1037 1848
1717 1848 1286 1203 1434 1710 2141 1471 -826 -2916 -3280 -1962 538 3040 3703 2633 905 -785 -1331
1734 -1331 -904 -984 -1794 -2563 -2753 -1513 874 3212 3963 2907 938 -1059 -1874 -1624 -777 -179 -167 -171 351
1753 351 1252 1897 2065 1095 -800 -2378 -2958 -2244 -788 652 1313 1414 1095 723 997 1469 1127 214 -897
1772 -897 -1836 -2222 -1374 43 991 1376 1301 764 491 483 252 -288 -1222 -2135 -2174 -1004 341 1637 2498 2422
1792 2422 1399 361 -152 -662 -1168 -1337 -1479 -1571 -802 593 1900 2701 2506 1080 -443 -1495 -2155 -1905
1810 -1905 -1191 -903 -413 932 1991 2285 2373 1610 -388 -1882 -2373 -2378 -1447 124 1080 1814 2471 1918 879
$$ packed form
1682C243j132q84j100j368N84J025p28p99o15q46R77K672J408K62j94k017k239
1699a751PP65N07R98J00q99L35J709J284L72j207l284l135p30R59K310K697Q11
1717A848n62q3K31K76M31o70k297k090l64J318K500K502O63j070j728j690n46
1734a331M27q0q10p69j90J240K387K338P51j056j969j997q15K50Q47N98J2mN22
1753C51R01O45J68r70j895j578n80P14J456J440O61J01l19l72K74M72l42r13j111
1772h97r39l86Q48J417R48L85p5n37k73qk31n40r34r13l9J170J345J296Q61p6
1792B422j023j038n13n10n06j69j42r2P69J395J307Q01j95j426j523j052o60K50
1810a905P14K88M90J345J059K94Q8p63j998j494m91nR31J571R56P34O57n53j039
$$ plain form
1829 879 224 -1031 -2228 -1967 -1237 -607 537 1574 1442 1262 1273 513 -406 -973 -1740 -1905 -796 361
1847 361 1053 1682 1270 280 166 326 -428 -691 -549 -1042 -776 691 1535 1304 919 -187 -1634 -1472 -343
1866 -343 313 928 1416 584 -163 -52 -82 -556 -493 -855 -1370 -405 1041 1740 2598 2425 174 -1616 -2238 -2897
1886 -2897 -2195 135 955 1228 2300 1805 979 1907 1293 -1438 -2434 -2658 -3526 -1689 1997 3104 2882 2535
1904 2535 258 -1296 -577 -1071 -1997 -1702 -2373 -2572 829 3873 4798 5161 2561 -2214 -3719 -2833 -2807 -810
1922 -810 1453 107 -766 1304 2243 2567 3078 172 -3721 -4280 -3688 -2446 1462 3994 2758 1592 1328
1939 1328 783 1362 1522 -705 -2643 -3862 -4847 -2474 2389 4366 3658 2634 97 -2061 -1200 155
1955 155 -352 -859 -1687 -3274 -1895 2723 5238 4864 3285 -127 -3753 -4380 -2343 -313 800 64 -1819
$$ packed form
1829H79o55j255j197K61P30O30J144J037j32j80J1p60r19n67p67j65J109J157
1847C61O92O29m12r90j14J60p54k63J42m93K66J467Q44k31l85j106j447J62J129
1866c43O56O15M88q32p47J11l0m74O3l62n15R65J446O99Q58j73k251j790o22o59
1886b897P02K330Q20K73J072m95q26R28o14k731r96k24q68J837L686J107k22l47
1904B535k277j554P19m94r26K95o71j99L401L044R25L63k600m775j505Q86K6J997
1922h10K263j346q73K070R39L24N11k906l893n59N92J242L908K532j236j166k64
1939A328n45N79J60k227j938j219r85K373M863J977p08j024k537k158Q61J355
1955A55n07n07q28j587J379M618K515l74j579l412l626o27K037K030J113p36j883
$$ plain form
1972 -1819 -1534 1275 3494 4415 3790 15 -4244 -5088 -3316 -358 2837 2719 105 -82 860 830 2354
1989 2354 3401 -622 -4999 -4952 -3644 -235 4863 5593 2400 415 -1703 -3238 -292 2388 210 -2306
2005 -2306 -3445 -3931 -369 4341 4943 3945 1728 -3592 -5200 -658 1971 1626 1810 -840 -3810 -1106
2021 -1106 2517 3322 4265 1709 -4866 -6051 -2171 298 2550 3854 148 -3233 -2325 -455 2536 5823
2037 5823 3390 -1979 -3512 -2923 -1551 2309 4019 764 -2066 -3399 -3300 1185 5801 4096 203 -2221
2053 -2221 -4554 -4512 177 3911 3299 1106 -1637 -2875 -165 3432 3588 1525 -1656 -5500 -5973 -1243
2069 -1243 3817 5613 4186 183 -3296 -2570 484 2581 3185 806 -4219 -6178 -2489 2325 5117
2084 5117 5215 942 -4373 -5166 -2897 392 4246 4355 -429 -3139 -1346 1261 4228 5861 2434 -2863
$$ packed form
1972a819K85K809K219R21o25l775m259q44J772K958L195j18k614j87R42l0J524
1989B354J047m023m377M7J308L409N098P30l193j985k118j535K946K680k178k516
2005b306j139m86L562M710O02r98k217n320j608M542K629l45J84k650k970K704
2021a106L623Q05R43k556o575j185L880K469K252J304l706l381R08J870K991L287
2037E823k433n369j533N89J372L860J710l255k830j333R9M485M616j705l893k424
2053b221k333M2M689L734o12k193k743j238K710L597J56k063l181l844m73M730
2069a243N060J796j427m003l479P26L054K097O04k379n025j959L689M814K792
2084E117R8m273n315p93K269L289L854J09m784k710J793K607K967J633l427n297
$$ plain form
2100 -2863 -4962 -4683 -1598 3413 3653 -759 -3776 -4805 -4037 800 5283 4725 2039 -890 -3318 -1116
2116 -1116 3784 4751 2726 237 -3334 -4435 -237 4060 4633 2560 -2828 -8163 -7856 -3796 -384 2605
2132 2605 3093 -76 -1375 1887 5568 7764 6841 1035 -5370 -6848 -4578 274 5431 6007 1717 -2392
2148 -2392 -3836 -3269 -1041 -399 -3528 -6777 -6874 -3511 3225 10263 12177 8159 2149 -2877 -4448 -2313
2164 -2313 448 876 -455 -2373 -3000 -204 3965 4969 1703 -3890 -9069 -10346 -6032 896 6005
2179 6005 7492 5423 2425 1826 3677 4799 3462 -609 -5783 -8322 -5701 104 5024 6333 2953
2194 2953 -2855 -6219 -5487 -2370 773 1537 -637 -2436 -1128 2798 7130 8934 5775 -261 -4683
2209 -4683 -5407 -2822 1431 3321 1068 -2575 -4561 -3761 -300 3089 3181 313 -2997 -4420 -2271 2357
$$ packed form
2100b863k099K79L085N011K40m412l017j029P68M837M483n58k686k929k428K202
2116a116M900R67k025k489l571j101M198M297N73k073n388n335L07M060L412K989
2132B605M88l169j299L262L681K196r23n806o405j478K270M852N157N76m290m109
2148b392j444N67K228O42l129l249r7L363O736P038J914m018o010n026j571K135
2164b313K761M28j331j918o27K796M169J004l266n593n179j277M314O928N109
2179F005J487k069k998n99J851J122j337m071n174k539K621N805M920J309l380
2194B953n808l364P32L117L143P64k174j799J308L926M332J804l159o036m422
2209d683p24K585M253J890k253l643j986Q00L461L389R2k868l310j423K149M628
$$ plain form
2225 2357 5488 5062 1953 -1846 -3518 -1283 2517 4519 3262 -693 -4586 -5188 -2231 1460 3222
2240 3222 1727 -1958 -4184 -2794 1222 5110 5617 2252 -2663 -5129 -3573 376 3926 4262 1267
2255 1267 -2183 -3110 -1018 2253 3519 1561 -2335 -5087 -4462 -678 3818 5704 3804 -180 -3130
2270 -3130 -3254 -734 2157 2695 329 -2717 -3764 -1916 1718 4561 4260 1054 -2548 -4092 -2556 767
2286 767 3213 2657 88 -2479 -3040 -730 2683 4018 2339 -952 -3874 -3863 -876 2429 3562 1733
2302 1733 -1612 -3443 -2115 1228 4061 4313 1397 -2432 -3918 -2462 385 2538 2215 -460 -2622
2317 -2622 -2427 90 3135 4229 2218 -1489 -4008 -4085 -1388 2076 3453 2274 56 -1642 -1292 827
2333 827 2336 1824 -423 -3041 -4033 -2080 1288 3688 4006 1838 -1212 -2409 -1427 220 1405 964
$$ packed form
2225B357L131m26l109l799j672K235L800K002j257l955l893o02K957L691J762
2240C222j495l685k226J390M016L888N07l365m915k466J556L949L550L36k995
2255A267l450r27K092L271J266j958l896k752O25L784M496J886j900l984k950
2270c130j24K520K891N38k366l046j047J848L634K843l01l206l602j544J536L323
2286G67K446n56k569k567n61K310L413J335j679l291k922J1K987L305J133j829
2302A733l345j831J328L343K833K52k916l829j486J456K847K153l23k675k162
2317b622J95K517L045J094k011l707k519p7K697L464J377j179k218j698L50K119
2333H27J509n12k247k618r92J953L368K400L18k168l050j197R82J647J185m41
$$ plain form
2349 964 -1333 -3004 -2388 56 3040 4327 2529 -751 -2935 -3135 -1295 1501 2391 952 -784 -1534
2365 -1534 -453 2019 3657 2618 -192 -2882 -3992 -2694 53 1882 1482 -72 -1449 -1103 999
2380 999 2852 2901 1217 -1335 -3416 -3178 -707 1869 2745 2199 804 -525 -444 518 791 17 -1612 -3617
2398 -3617 -3741 -1120 1871 3518 4067 2501 -530 -1740 -1281 -604 212 122 -1559 -1929 58 1844 3186
2415 3186 3739 1385 -2215 -3841 -3832 -2304 763 1842 818 1095 1510 1059 2023 2525 -110 -2684 -3407
2432 -3407 -3485 -1140 2437 3312 2529 2139 119 -1924 -1197 -555 -1412 -1306 -997 -1022 968 2889 2625 2210
2450 2210 1290 -1634 -3185 -1910 -887 61 1532 1266 350 771 636 -111 624 212 -2052 -2487 -843
2467 -843 354 1641 2800 1911 109 -1044 -1998 -1773 6 609 -157 173 956 1005 1336 1480 36 -1570
$$ packed form
2349I64k297j671O16K444K984J287j798l280k184k00J840K796Q90j439j736p50
2365a534J081K472J638j039k810k690j110J298K747J829m00j554j377L46K102
2380I99J853M9j684k552k081K38K471K576Q76n46j395j329Q1R62K73p74j629k005
2398c617j24K621K991J647N49j566l031j210M59O77Q16r0j681l70J987J786J342
2415C186N53k354l600j626RJ528L067J079j024K77M15m51R64N02k635k574p23
2432c407p8K345L577Q75p83l90k020k043P27O42q57J06L09k5J990J921k64m15
2450B210r20k924j551J275J023R48J471k66r16M21j35p47P35m12k264m35J644
2467h43J197J287J159q89j802j153r54K25J779O03p66L30P83M9L31J44j444j606
$$ plain form
2485 -1570 -2215 -2312 -836 1571 2122 1480 1461 987 -650 -949 -747 -1293 -1510 -782 -219 1084 2691 2088 714
2504 714 470 -641 -2517 -2045 -791 -545 445 1564 1411 1726 1758 -70 -852 -552 -1739 -2329 -649 494
2522 494 935 2252 2181 911 722 -312 -2221 -1648 -704 -1541 -774 1321 1663 1685 1869 515 -687 -588 -1506
2541 -1506 -1653 75 323 -395 763 1692 980 755 215 -1074 -1027 -432 -774 84 1251 138 -577 540
2559 540 744 283 476 -146 -972 -387 188 158 963 975 -676 -1182 -351 -97 459 899 526 168 329 -103
2579 -103 -101 643 178 -1029 -898 -107 108 913 1609 1085 159 -639 -1473 -1318 -215 72 -65 575 818 538
2599 538 933 1411 733 -385 -1473 -2279 -1506 208 1247 1665 1734 646 -667 -524 36 -57 -329 -1024 -1686
2618 -1686 -597 1126 1968 2427 2122 6 -1655 -1442 -876 -514 87 -95 -650 -92 762 1169 1708 1221
$$ packed form
2485a570o45r7J476K407N51o42j9m74j637k99K02n46k17P28N63J303J607o03j374
2504G14k44j111j876M72J254K46R90J119j53L15L2j828p82L00j187n90J680J143
2522D94M41J317p1j270j89j034j909N73R44q37P67K095L42K2J84j354j202R9r18
2541a506j47J728K48p18J158R29p12k25n40j289M7N95l42Q58J167j113p15J117
2559E40K04m61J93o22q26N85N75l0Q05J2j651n06Q31K54N56M40l73l58J61m32
2579a03KP44m65j207J31P91K15Q05O96n24r26p98q34J55J103K87j37O40K43k80
2599E38L95M78o78j118j088q06P73J714J039M18O9j088j313J43N60r3k72o95o62
2618a686J089J723Q42M59l05k116j661K13N66L62O01j82n55N58Q54M07N39m87
$$ plain form
2636 1221 -703 -1829 -1573 -1061 170 1511 1376 647 376 -250 -272 640 685 -331 -745 -1092 -1186 69 1265
2655 1265 1314 984 109 -1251 -1140 121 669 688 487 -596 -1238 -490 740 1463 1452 154 -1311 -1480 -526
2674 -526 441 1251 1097 -273 -1229 -835 201 1263 1587 514 -976 -1440 -946 119 1267 1363 282 -707
2692 -707 -1048 -534 603 1375 1006 -90 -1017 -1244 -636 675 1428 986 -20 -879 -955 -329 812 1341 797
2711 797 -207 -1002 -914 197 1212 1189 293 -1052 -1865 -1258 360 1575 1711 708 -812 -1661 -939 378
2729 378 1215 1078 39 -898 -761 604 1821 2204 1073 -921 -2324 -2092 -824 599 1255 559 -592
2746 -592 -881 -283 863 1566 1036 -340 -1310 -1449 -253 1503 2492 2092 848 -600 -1542 -1301 -508 -106
2764 -106 -438 -1213 -1624 -982 537 1852 2090 1138 -694 -1742 -1200 314 1880 2527 1774 347 -483 -260
$$ packed form
2636A221j924j126K56N12J231J341j35p29k71o26k2R12M5j016m14l47r4J255J196
2655A265M9l30q75j360J11J261N48J9k01j083o42P48J230P23j1j298j465j69R54
2674e26R67Q10j54j370r56L94J036J062L24j073j490m64M94J065J148R6j081r89
2692g07l41N14J137P72l69j096r27k27O08J311P53m42j006q59p6O26J141N29n44
2711G97j004p95Q8J111J015k3q96j345q13O07J618J215J36j003j520q49P22J317
2729C78Q37j37j039r37J37J365J217L83j131j994j403K32J268J423O56o96j151
2746e92k89N98J146P03n30j376r70j39J196J756R89m00j244j448r42K41P93M02
2764a06l32p75m11O42J519J315K38r52j832j048N42J514J566O47p53j427q30K23
$$ plain form
2782 -260 410 745 -170 -1798 -2978 -2785 -1254 805 2000 1522 97 -927 -874 310 1691 1983 1179
2799 1179 93 -349 154 1340 1887 1215 -550 -2253 -2851 -2150 -657 470 507 -244 -949 -1012 -131 1157
2817 1157 1802 1345 576 33 115 1262 2270 2002 820 -807 -2294 -2337 -1116 72 465 -1 -1230 -1794
2835 -1794 -876 405 1215 1544 519 -796 -536 863 2086 2837 2238 108 -1291 -1482 -1049 -30 643
2852 643 -332 -1546 -1584 -1099 -38 1271 1203 -141 -899 -1092 -477 1205 2395 2065 1180 198 -646 -437 263
2871 263 244 -222 -843 -1601 -1449 58 1063 1118 786 -321 -1383 -1175 -215 773 1488 1207 35 -529 -151
2890 -151 406 847 888 -161 -1307 -1581 -728 618 1508 1331 149 -736 -798 -352 546 1129 583 -542 -915
2909 -915 -549 330 1115 933 -181 -1004 -1232 -1022 24 1409 1346 544 70 -124 -68 661 796 234 -158 -749
$$ packed form
2782b60O70L35r15j628j180J93J531K059J195m78j425j024N3J184J381K92q04
2799A179j086m42N03J186N47o72j765j703n98P01J493J127L7p51p05o3Q81J288
2817A157O45m57p69n43Q2J147J008k68j182j627j487m3J221J188L93m66j229n64
2835a794R18J281Q10L29j025j315K60J399J223P51n99k130j399j91M33J019O73
2852F43r75j214l8M85J061J309o8j344p58j93O15J682J190l30q85r82q44K09P00
2871B63j9m66o21p58J52J507J005N5l32j107j062K08R60R88P15k81j172n64L78
2890a51N57M41M1j049j146k74Q53J346Q90j77j182q85o2M46Q98N83n46j125l73
2909i15L66Q79P85j82j114q23k28K10J046J385o3q02m74j94N6P29J35n62l92n91
$$ plain form
2929 -749 -1137 -235 747 618 142 -333 -1197 -1239 -190 366 831 1267 275 -493 304 875 886 1093 539 -740
2949 -740 -940 -535 -244 734 892 -623 -1243 -799 -714 -217 852 478 -254 -96 -71 528 1846 1600 329
2968 329 -50 -362 -969 -88 725 273 -118 -437 -1032 -652 453 103 -296 71 -318 -636 182 856 875 1014
2988 1014 422 -386 3 393 141 433 717 -327 -1018 -563 -97 156 489 69 -483 -398 -245 -208 677 1152
3008 1152 176 -458 -71 40 229 678 392 -266 -418 -500 -333 606 889 -20 -408 -118 -267 33 635 374
3028 374 -16 -28 -426 -417 563 618 -178 0 247 -418 -243 418 143 68 230 -375 -256 618 346 56 707 312
3050 312 -565 -292 73 -141 360 355 -401 -179 84 -369 -47 762 129 -430 85 74 100 758 390 -291 -37
3071 -37 -109 -509 230 673 -124 -402 -41 -239 10 477 146 -106 165 -189 -328 433 418 -86 155 294 -69
$$ packed form
2929g49l88R02R82j29m76m75q64m2J049N56M65M36r92p68P97N71J1K07n54j279
2949g40k00M05K91R78J58j515o20M44Q5M97J069l74p32J58K5N99J318k46j271
2968C29l79l12o07Q81Q13m52l91l19n95L80J105l50l99L67l89l18Q18O74J9J39
2988A014n92q08L89L90k52K92K84j044o91M55M66K53L33m20n52Q5J53L7Q85M75
3008A152r76o34L87J11J89M49k86o58j52q2J67R39K83r09l88K90j49L00O02k61
3028C74l90j2l98RR80N5p96J78K47o65J75O61k75p5J62o05J19Q74k72k90O51l95
3050C12q77K73L65k14N01np56K22K63m53L22Q09o33n59N15j1K6O58l68o81K54
3071c7p2m00P39M43p97k78L61j98K49M67l31k52K71l54j39P61j5n04K41J39l63
$$ plain form
3092 -69 151 294 -50 -108 83 -314 -269 277 142 -110 202 101 -34 31 -3 -77 205 331 21 44 232 -94
3114 -94 -189 209 159 -25 17 105 77 281 330 12 14 141 -116 85 298 29 -203 -38 -12 -123 155 139 -99 82
3138 82 141 -140 26 216 -48 28 245 309 232 259 48 -112 104 42 -51 89 59 -208 -53 46 -30 -14 -8 -57 110
3163 110 420 250 127 157 -19 -147 119 209 -58 68 -70 -260 -26 119 39 47 103 -39 22 190 100 121 81
3186 81 -19 37 181 168 114 140 78 -34 41 44 -78 -65 -7 115 86 163 21 89 142 87 202 219 118 -14 65 116
3212 116 9 36 -5 -164 12 5 85 155 24 5 34 139 233 174 147 24 35 2 12 49 36 20 116 113 126 123 1 -136
3240 -136 -121 -24 157 218 174 136 157 114 116 213 76 -45 29 46 4 114 55 -136 -86 -36 12 164 148 22 18 163 29
3267 29 79 195 81 -4 80 55 34 56 -42 22 140 196 133 151 41 -58 31 45 -14 -13 68 -8 170 272 260 23 -40
$$ packed form
3092f9K20J43l44n8J91l97M5N46j35k52L12j01j35O5l4p4K82J26l10K3J88l26
3114i4r5L98n0j84M2Q8k8K04M9l18KJ27k57K01K13k69k32J65K6j11K78j6k38J81
3138H2N9k81J66J90k64P6K17O4p7K7k11j60K16o2r3J40l0k67J55R9p6J6Om9J67
3163A10L10j70j23L0j76j28K66R0k67J26j38j90K34J45q0QN6j42O1J68r0K1m0
3186H1j00N6J44j3n4K6o2j12P5Lj22J3N8J22k9P7j42O8N3n5J15J7j01j32P9N1
3212A16j07K7m1j59J76pQ0P0j31j9K9J05R4n9k7j23J1l3J0L7j3j6R6lJ3lj22j37
3240a36J5R7J81O1m4l8K1m3KR7j37j21P4J7m2J10n9j91N0N0M8J52j6j26mJ45j34
3267B9N0J16j14q5Q4k5k1K2r8O4J18N6o3J8j10r9Q9J4n9JQ1p6J78J02j2k37o3
$$ plain form
3294 -40 -108 -27 109 119 165 31 -47 -24 142 214 84 1 36 -8 10 184 148 52 42 -47 -50 43 125 50 53 21 33 49 58
3323 58 106 164 122 -122 -106 -9 -6 -29 101 206 107 91 156 85 91 135 70 -96 6 -53 14 247 242 11 -83 -94 -147 163
3351 163 267 170 -3 -5 -175 1 250 109 11 82 -62 -50 300 276 16 138 24 -293 42 247 70 82 154
3374 154 -146 -145 205 149 194 355 -32 -282 2 0 -132 229 182 -117 8 59 -113 234 427 66 -45 124 -100
3397 -100 -19 367 208 -106 -30 -234 -351 199 385 58 51 75 -239 -5 405 342 331 208 -118 -94 274 358 38
3420 38 100 -86 -459 -214 146 12 38 35 -411 -376 116 169 256 652 451 74 233 390 264 359 284 -221 -249 -234
3444 -234 -480 -221 256 -72 -450 -208 -171 -170 287 355 38 209 174 48 695 1094 567 201 189 -288 -462 49
3466 49 13 -257 -149 -436 -793 -68 288 -76 42 148 -284 -27 629 622 693 719 81 -172 239 151 -143 134
$$ packed form
3294d0o8Q1J36J0M6j34p8K3J66P2j30q3L5m4J8J74l6r6j0q9lR3Q2p5Ll2J2J6R
3323E8M8N8m2k44J6R7Lk3J30J05r9j6O5p1OM4o5j66J02n9O7K33nk31r4j1n3L10
3351A63J04r7j73kj70J76K49j41r8P1j44J2L50k4k60J22j14l17L35K05j77J2P2
3374A54l00JL50n6M5J61l87k50K84kj32L61m7k99J25N1j72L47J93l61j11J69k24
3397a00Q1L86j59l14P6k04j17N50J86l27pK4l14K34M10o3j1j23l26K4L68Q4l20
3420C8O2j86l73K45L60j34K6lm46L5M92N3Q7L96k01l77J59J57j26R5p5n05k8J5
3444b34k46K59M77l28l78K42L7JM57O8l17J71l5j26O47L99n27l66j2m77j74N11
3466D9l6k70J08k87l57P25L56l64J18J06m32K57O56pP1K6o38k53M11q8k94K77
$$ plain form
3488 134 -126 -705 -463 -213 -118 229 283 -237 -211 127 -64 147 734 456 15 269 212 183 555 361 -161 -242
3510 -242 -441 -671 -116 314 169 -41 -100 -401 -86 357 358 329 389 -79 -309 197 431 192 143 -128 -505 -300
3532 -300 99 226 369 365 -85 -358 139 298 213 366 230 -254 -260 -9 6 289 291 -219 -549 -227 -236 -58 385
3555 385 309 54 219 180 332 785 725 198 70 -74 -398 -118 321 77 -309 -373 -688 -605 -108 53 -33 201
3577 201 48 -162 431 956 872 738 659 89 22 320 53 -39 -105 -590 -896 -482 -269 -219 54 -113 -483 -246
3599 -246 86 132 652 980 650 451 662 577 505 636 196 -361 -580 -781 -854 -377 -256 -467 -369 -227 -220 150
3621 150 573 582 460 444 176 283 732 795 677 557 155 -363 -303 -237 -438 -603 -676 -840 -596 -92 166 454
3643 454 518 285 29 250 479 455 608 452 142 53 193 134 187 86 -335 -754 -685 -538 -424 -15 173 151
$$ packed form
3488A34k60n79K42K50R5L47N4n20K6L38j91K11N87k78m41K54n7k9L72j94n22q1
3510b42j99k30N55M30j45k10n9l01L15M43Jk9O0m68k30N06K34k39m9k71l77K05
3532c00L99J27J43mm50k73M97J59q5J53j36m84oK51J5K83Kn10l30L22rJ78M43
3555C85p6k55J65l9J52M53o0n27j28j44l24K80M39k44l86o4l15Q3M97J61q6K34
3577B01j53k10N93N25q4j34p9n70o7K98k67r2o6m85l06M14K13N0K73j67l70K37
3599b46L32M6N20L28l30j99K11q5p2J31m40n57k19k01p3M77J21k11R8J42PL70
3621A50M23Rj22j6k68J07M49O3j18j20m02n18O0O6k01j65p3j64K44N04K58K88
3643D54O4k33k56K21K29k4J53j56l10q9J40n9N3j01m21m19O9J47J14M09J88k2
$$ plain form
3665 151 197 359 338 451 507 239 -57 -109 -143 8 413 394 187 57 -193 -382 -180 -98 -196 -230 -190 -225 32 475
3689 475 523 447 410 161 -69 16 63 19 33 -38 -205 -45 173 198 238 168 -172 -256 -183 -15 166 228 156 67 118 124
3715 124 126 224 151 -42 -117 -68 -10 103 162 179 30 46 2 1 82 164 40 -54 -48 -37 34 171 252 172 5 -30 -56 108
3743 108 138 76 69 0 -31 -7 128 173 133 52 11 -38 72 137 81 47 -67 -80 -60 50 180 202 355 238 85 20
3769 20 57 -87 -162 -142 -198 -134 32 232 318 356 211 213 89 -3 7 -20 -113 -54 90 129 229 333 213 124 -9 -273
3795 -273 -420 -376 -238 -152 98 274 403 507 473 408 202 -71 -187 -217 -120 -75 104 236 191 223 229 -21 -172 -205
3819 -205 -421 -463 -218 -13 95 478 562 658 526 405 5 -168 -314 -442 -321 -45 82 267 488 428 168
3840 168 102 -145 -465 -431 -344 -195 168 461 566 635 639 357 151 11 -264 -512 -458 -367 -274 34 296 347 428 364
$$ packed form
3665A51M6J62k1J13N6k68k96n2l4J51M05j9k07j30k50j89K02Q2r8l4M0l5K57M43
3689D75M8p6l7k49k30Q5M7m4J4p1j67J60K18K5M0p0l40q4P3J68J81O2p2q9N1O
3715A24KR8p3j93p5M9N8J13N9J7j49J6m4jQ1Q2j24r4OJ1P1J37Q1q0j67l5k6J64
3743A08L0o2po9l1K4J35M5m0q1m1m9J10O5n6l4j14j3K0J10J30K2J53j17j53o5
3769B0L7j44p5K0n6O4J66K00Q6L8j45Kj24r2J0k7r3N9J44L9J00J04j20q9j33k64
3795b73j47M4J38Q6K50J76J29J04l4o5k06k73j16l0R7M5J79J32m5L2Ok50j51l3
3819b05k16m2K45K05J08L83Q4R6j32j21m00j73j46j28J21K76J27J85K21o0k60
3840A68o6k47l20L4Q7J49L63K93J05O9Mk82k06j40k75k48N4R1R3L08K62N1Q1o4
$$ plain form
3864 364 89 -97 -202 -362 -327 -127 10 217 518 602 422 441 205 -244 -357 -334 -517 -295 106 152 287 509
3886 509 391 158 234 35 -290 -179 -155 -216 94 291 201 373 438 135 73 5 -294 -384 -200 -142 -88 337 438
3909 438 314 522 333 -38 -30 -95 -355 -176 26 -79 139 428 230 144 259 78 -197 -22 -79 -288 -25 31
3931 31 -42 246 318 133 211 295 -58 -142 54 -155 -218 115 98 23 240 243 43 87 116 -53 46 155 -35 11 119
3956 119 -28 -90 75 124 38 235 278 93 227 139 -133 1 120 -224 -71 221 185 168 522 242 33 106 -47
3979 -47 -330 -100 32 -192 32 337 122 323 460 74 -52 24 -348 -425 40 14 1 403 483 249 507 410
4001 410 -98 -305 -271 -609 -337 237 241 386 700 359 149 205 -28 -409 -345 -299 -472 -95 410 401 671 812 257
4024 257 -66 -189 -419 -490 -247 -349 -389 182 515 574 828 739 -11 -339 -385 -620 -426 1 141 181 493 533
$$ packed form
3864C64k75j86j05j60L5K00J37K07L01Q4j80J9k36m49j13K3j83K22M01M6J35K22
3886E09j18k33P6j99l25J11K4o1L10J97r0J72O5l03o2o8k99r0J84N8N4M25J01
3909D38j24K08j89l71Qo5k60J79K02j05K18K89j98q6J15j81k75J75n7k09K63N6
3931C1p3K88P2j85P8Q4l53q4J96k09o3L33j7p5K17Lk00M4K9j69R9J09j90M6J08
3956A19j47o2J65M9q6J97M3j85J34q8k72J34J19l44J53K92l6j7L54k80k09P3j53
3979d7k83K30J32k24K24L05k15K01J37l86j26P6l72p7M65k6j3M02Q0k34K58r7
4001D10n08k07L4l38K72N74MJ45L14l41k10N6k33l81O4M6j73L77N05rK70J41n55
4024B57l23j23k30p1K43j02m0N71L33N9K54q9p50l28m6k35J94M27J40M0L12M0
$$ plain form
4046 533 450 600 313 -301 -467 -636 -753 -196 275 378 489 567 310 231 310 49 -362 -411 -625 -513 91 472
4068 472 640 837 574 -24 -191 -204 -424 -390 -276 -385 -228 326 713 804 777 285 -309 -652 -600 -539 -106 93
4090 93 86 151 456 576 616 627 266 -386 -551 -700 -419 184 526 357 299 247 86 213 222 -56 -454 -621 -642 -291
4114 -291 410 708 701 563 171 -185 -94 231 148 64 -191 -410 -224 159 503 525 349 -88 -504 -300 -18 283
4136 283 352 113 -222 -231 54 398 644 546 29 -383 -412 -291 131 384 231 -83 -279 -249 48 494 595 338
4158 338 -146 -406 -384 34 349 378 87 -237 -408 -110 370 611 446 91 -456 -606 -225 328 559 512 225
4179 225 -181 -66 131 474 434 61 -493 -864 -622 -161 361 606 319 -22 -137 97 468 770 631 56
4199 56 -459 -588 -289 372 731 472 6 -411 -576 -370 62 121 -302 -706 -734 -396 378 1137 1289 997 488
$$ packed form
4046E33q3J50k87o14j66j69j17N57M71J03J11P8k57p9P9k61m11m9k14J12O04L81
4068D72J68J97k63n98j67j3k20L4J14j09J57N54L87R1k7m92n94l43N2O1M33J99
4090I3pO5L05J20M0J1l61o52j65j49K81O03L42j69n8n2j61J27Rk78l98j67k1L51
4114b91P01K98pj38l92l56R1L25q3q4k55k19J86L83L44K2j76m37m16K04K82L01
4136B83O9k39l35rK85L44K46r8n17m12k9J21M22K53j53l14j96L0K97M46J01k57
4158C38m84k60K2M18L15K9k91l24j71K98M80K41j65l55n47j50L81N53K31m7k87
4179B25m06J15J97L43m0l73n54l71K42M61N22K45k87l41j15K34L71L02j39n75
4199E6n15j29K99O61L59k59m66m17j65K06M32N9m23m04k8L38P74P59J52k92n09
$$ plain form
4220 488 3 -84 215 336 192 -337 -761 -794 -251 432 631 449 -224 -1005 -1164 -701 1 480 586 508 454
4241 454 819 1251 1463 1078 228 -932 -1507 -1223 -580 233 514 264 -218 -406 -247 38 141 -122 -648 -812
4261 -812 -377 549 1694 2143 1721 799 23 -590 -614 -436 -503 -864 -1132 -930 -353 519 1098 927 185 -671
4281 -671 -1183 -758 72 824 1058 923 652 472 823 1019 654 -17 -1027 -1778 -1558 -741 145 602 513 7
4301 7 -341 -235 222 682 613 144 -455 -395 121 881 1445 1175 302 -537 -880 -723 -170 148 -137 -620 -791
4322 -791 -606 164 932 1044 489 -93 -582 -473 235 809 759 249 -329 -618 -186 409 712 487 -77 -797
4342 -797 -945 -461 187 552 557 -30 -423 -236 337 798 973 467 -405 -907 -620 -129 514 760 257 -430 -520
4363 -520 -210 334 831 596 -189 -646 -713 -394 404 870 631 71 -414 -465 28 637 659 183 -353 -773 -611
$$ packed form
4220D88m85q7K99J21j44n29m24l3N43O83J99j82o73p81j59M63P02M79J06p8n4
4241D54L65M32K12l85q50j160n75K84O43Q13K81k50m82j88J59K85J03k63n26j64
4261h12M35R26J145M49m22r22p76o13k4J78o7l61k68K02N77Q72N79j71p42q56
4281f71n12M25Q30P52K34j35k71j80L51J96l65o71j010p51K20Q17Q86M57q9n06
4301Gl48J06M57M60o9m69n99O0N16P60N64k70q73q39l43J57N53L18k85m83j71
4322g91J85P70P68J12n55n82m89J09P08N74n0n10n78k89M32N95L03k25n64p20
4342g97j48M84O48L65Nn87l93J87N73M61J75n06q72n02K87M91O43K46n03o87r0
4363e20L10N44M97k35p85m57o7L19P98M66k39n60m85n1M93O09K2m76n36m20J62
$$ plain form
4384 -611 190 826 738 413 -193 -575 -269 380 639 469 -7 -625 -786 -266 386 744 694 104 -466 -322 -1
4405 -1 330 596 300 -477 -735 -283 234 829 1037 480 -328 -590 -614 -170 483 428 -158 -315 -251 119 728 1127
4427 1127 573 -192 -722 -954 -585 334 564 332 170 -134 -151 403 756 478 12 -645 -998 -569 382 773
4447 773 791 684 25 -401 -81 108 132 34 -424 -899 -606 71 621 1034 931 111 -387 -274 -33 264 395
4468 395 49 -454 -398 -78 367 927 869 53 -535 -675 -743 -213 292 223 -17 -23 -76 344 1019 964 240 -239 -694
4491 -694 -812 -306 311 444 366 173 -244 -68 408 293 -50 -284 -811 -907 -196 546 872 1031 730 94 -51
4512 -51 -3 -189 -204 -171 -485 -575 -63 371 780 987 492 -271 -566 -696 -581 43 358 254 174 333 366 623
4534 623 670 184 -383 -599 -801 -505 284 675 492 338 107 -190 -29 77 -25 -157 -174 -362 -34 556 773
$$ packed form
4384f11Q01O36q8l25o06l82L06O49K59j70m76o18j61N20O52L58n0n90n70J44L21
4405aL31K66k96p77k58M52N17N95K08n57q08k62k4M44O53n5n86j57O4L70O09L99
4427A127n54p65n30k32L69R19K30k32j62l04j7N54L53k78m66o57l53M29R51L91
4447G73J8j07o59m26L20J89K4r8m58m75K93O77N50M13j03q20m98J13K41K97J31
4468C95l46n03N6L20M45N60n8q16n88j40o8N30N05o9k40on3M20O75n5p24m79m55
4491f94j18N06O17J33p8j93m17J76M76j15l43k34n27r6P11P42L26J59l01o36j45
4512e1M8j86j5L3l14r0N12M34M09K07m95p63k95j30J15O24L15j04q0J59L3K57
4534F23M7m86n67k16k02K96P89L91j83j54k31k97J61J06j02j32j7j88L28N90K17
$$ plain form
4555 773 584 243 -163 -564 -374 -129 92 343 265 44 83 312 156 52 19 -270 -377 -91 74 465 649
4576 649 363 -78 -226 -302 -359 -52 229 56 97 197 161 295 348 36 -319 -367 -361 -187 303 564 497 409 187
4599 187 -122 -112 -61 -294 -230 -121 -25 143 607 723 384 273 -186 -508 -427 -318 -178 72 240 331 435 510
4621 510 280 -50 -177 -338 -477 -180 27 196 444 545 283 217 144 -152 -237 -167 -208 -91 78 174 213 317
4643 317 230 63 -53 -90 -230 -102 31 52 100 249 230 121 125 -24 -92 10 -20 -11 102 111 4 30 151 31 84
4668 84 119 10 54 112 243 198 77 -105 -235 -229 11 177 379 355 115 -3 -40 -40 -85 -137 -169 -273 -90 163 452
4693 452 582 431 101 -161 -270 -269 -58 55 10 28 97 253 342 463 283 -177 -377 -511 -457 -90 241 429
4715 429 383 243 165 148 148 97 -22 -190 -369 -245 144 567 603 515 88 -263 -395 -222 87 133 71 -66 -88 66
$$ packed form
4555G73j89l41m06m01J90K45K21K51p8k21L9K29j56j04l3k89j07K86J65L91J84
4576F49k86m41j48p6n7L07K81j73M1J00l6J34N3l12l55m8OJ74M90K61o7q8k22
4599A87l09J0N1k33O4J09R6J68M64J16l39j11m59l22Q1J09J40K50J68R1J04P5
4621E10k30l30j27j61j39K97K07J69K48J01k62o6p3k96q5P0m1J17J69R6L9J04
4643C17q7j67j16l7j40J28J33K1M8J49j9j09Mj49o8J02l0RJ13Rj07K6J21j20N3
4668H4L5j09M4N8J31m5j21j82j30OK40J66K02k4k40j18l7%m5n2l2j04J83K53K89
4693D52J30j51l30k62j09JK11J13m5J8O9J56Q9J21j80m60k00j34N4L67L31J88
4715D29m6j40p8j7%n1j19j68j79J24L89M23L6q8m27l51j32J73L09M6o2j37k2J54
$$ plain form
4739 66 303 552 426 -61 -418 -441 -267 86 383 354 125 -99 -103 91 393 327 75 -282 -356 -285 27 357 465
4762 465 287 -13 -181 -60 101 260 238 64 -219 -354 -127 211 413 437 89 -229 -204 -21 235 346 272
4783 272 -88 -387 -272 66 411 522 255 -173 -410 -215 74 397 502 60 -261 -295 -92 277 475 257
4803 257 -142 -382 -359 -12 492 543 245 -100 -379 -375 53 427 411 200 -84 -347 -135 288 494 249 6 -373
4825 -373 -522 -229 285 507 544 178 -188 -263 58 247 344 301 -179 -397 -243 187 458 589 271 -470 -737
4846 -737 -633 -276 286 565 332 11 -30 158 578 760 402 -171 -475 -507 -136 493 860 479 -70 -427 -619
4867 -619 -362 -2 -24 -195 -353 -371 -114 626 1053 827 453 -4 -398 -282 251 423 437 203 -299 -409 -143
4888 -143 37 8 -11 -497 -812 -492 -28 580 1018 842 240 -123 -32 242 504 677 311 -241 -287 -258 43 383
$$ packed form
4739F6K37K49j26m87l57k3J74L53K97k9k29k24mJ94L02o6k52l57p4P1L12L30J08
4762D65j78l00j68J21J61J59k2j74k83j35K27L38K02K4l48l18K5J83K56J11p4
4783B72l60k99J15L38L45J11k67m28k37J95K89L23J05m42l21l4K03L69J98k18
4803B57l99k40K3L47N04N1k98l45k79MM28L74j6k11k84k63K12M23K06k45k43l79
4825c73j49K93N14K22L7l66l66p5L21J89R7m3m80k18J54M30K71J31l18p41k67
4846g37J04L57N62K79k33l21m1J88M20J82l58n73l04l2L71O29L67l81n49l57j92
4867f19K57L60k2j71j58j8K57P40M27k26l74m57l94J16N33J72J4k34n02j10K66
4888a43J80k9j9m86l15L20M64O08M38j76o02l63R1K74K62J73l66n52m6K9L01L40
$$ plain form
4910 383 89 -518 -867 -850 -516 169 760 597 214 12 -60 362 824 738 382 60 -284 -265 185 524 249
4931 249 -185 -638 -966 -585 -91 127 278 252 -145 -139 278 550 611 563 101 -239 -141 181 543 816 536 -294
4953 -294 -679 -616 -463 -158 135 -32 -275 -193 -8 328 794 698 91 -304 -353 -114 420 698 543 127 -281
4974 -281 -461 -207 234 202 -123 -295 -453 -292 277 674 652 285 -179 -483 -194 197 312 325 248 -107 -238
4995 -238 88 272 261 180 -238 -495 -326 -18 292 627 539 30 -302 -206 -44 189 292 -2 -247 -269 -176 79
5017 79 519 524 8 -289 -269 -172 263 637 454 199 -54 -240 -46 369 332 -85 -268 -442 -390 92 365 334 158
5040 158 -65 -360 -123 290 363 366 323 76 -36 172 288 282 170 -138 -510 -420 -142 -59 221 288 37 -218 -107
5063 -107 76 243 494 283 75 75 42 112 403 483 43 -170 -359 -238 -29 268 128 -24 -193 -196 -79 259
$$ packed form
4910C83k94o07l49J7L34O85N91j63l83k02p2M22M62q6l56l22l44J9M50L39k75
4931B49m34m53l28L81M94K18J51k6l97OM17K72O1m8m62l40R8L22L62K73k80q30
4953b94l85O3J53L05K93j67k43Q2J85L36M66r6o07l95m9K39N34K78j55m16m08
4974b81j80K54M41l2l25j72j58J61N69L97k2l67m64l04K89L91J15J3p7l55j31
4995b38L26J84j1q1m18k57J69L08L10L35q8n09l32R6J62K33J03k94k45k2R3K55
5017G9M40Nn16k97K0R7M35L74j83k55k53j86J94M15l7m17j83j74N2M82K73l1j76
5040A58k23k95K37M13P3Lm3k47j12K08J16oj12l08l72R0K78Q3K80O7k51k55J11
5063a07J83J67K51k11k08%l3P0K91Q0m40k13j89J21K09K97j40j52j69lJ17L38
$$ plain form
5085 259 387 162 -36 -173 -125 96 347 326 219 39 -238 -205 113 196 81 -7 -147 -175 64 151 283 300 169
5108 169 -56 0 133 102 194 225 15 -190 -145 -59 103 260 213 29 -41 -69 -71 185 247 90 4 -129 -89 110 303
5133 303 196 13 -119 -166 -66 101 309 194 30 -54 -110 34 233 183 192 90 -13 -37 213 212 110 11 -112
5156 -112 -250 -5 40 43 73 55 -21 32 126 116 197 149 105 32 12 82 52 95 172 53 -48 -11 -33 -4 118 75 0 5
5184 5 51 38 187 182 106 11 2 -6 83 273 165 97 -60 -73 -35 106 123 30 -23 -29 -76 187 218 109 103 39 -53 21 119 22
5214 22 -23 -1 -11 84 116 113 89 47 26 13 76 4 99 43 152 114 96 61 -11 -21 15 86 14 56 79 -14 72 115 97 80
5244 80 -22 2 73 231 141 121 101 -11 59 121 27 -39 -19 -91 -30 85 62 48 53 109 117 198 196 79 24 34 42 109 120 107
5274 107 73 5 46 -8 46 19 -51 -38 -13 53 152 162 38 -53 62 80 48 104 58 -19 97 130 103 119 116 -10 -48 -2
$$ packed form
5085B59J28k25j98j37M8K21K51k1j07j80k77L3L18Q3j15q8j40k8K39Q7J32J7j31
5108A69k25N6J33l1R2L1k10k05M5Q6J62J57m7j84p0k8kK56O2j57q6j33M0J99J93
5133C03j07j83j32m7J00J67K08j15j64q4n6J44J99n0Rj02j03k4K50jj02r9j23
5156a12j38K45M5LL0j8p6N3R4j0Q1m8m4p3k0P0l0M3P7j19j01L7k2K9J22m3p5N
5184EM6j3J49np6r5rqQ9J90j08o8j57j3L8J41J7r3n3om7K63L1j09oo4r2P4R8r7
5214B2m5K2j0R5L2lk4m2k1j3O3p2R5n6J09l8j8l5p2j0L6P1p2M2K3r3Q6M3j8j7
5244H0j02K4P1J58r0k0k0j12P0O2r4o6K0p2O1J15k3j4NN6QQ1kj17n5J0QO7J1j3
5274A07l4o8M1n4N4k7p0J3K5O6R9J0j24r1J15J8l2N6m6p7J16L3k7J6lj26l8M6
$$ plain form
5302 -2 2 -78 -10 63 54 94 200 210 171 56 -33 82 1 -7 14 83 41 102 97 61 17 35 -65 -75 109 89 25 92 131 84
5332 84 123 120 -14 -58 -18 32 54 127 110 -6 45 22 18 54 -25 -54 23 38 58 232 167 14 53 65 37 27 72 -108 10
5361 10 134 106 142 158 67 -34 29 71 7 26 -1 -12 57 141 75 126 73 -92 -43 51 65 146 95 78 50 177 19 0
5389 0 100 43 -72 4 138 113 121 153 117 68 146 -93 -153 5 65 25 112 110 -2 75 165 98 49 -65 -198 -115 209
5416 209 157 49 169 27 -24 54 86 53 111 34 -160 -5 229 33 73 134 -63 -139 106 111 108 136 -12 -70 58
5441 58 185 -15 128 133 -46 -90 116 124 112 194 64 44 155 9 -133 129 183 -40 -6 49 -23 96 205 46
5465 46 59 82 -93 -103 143 169 140 64 21 -142 -4 173 160 187 112 -164 -71 175 158 70 158 -90 -147 50 195
5490 195 244 288 112 -117 -2 169 69 141 253 -76 -206 -80 -38 76 182 28 -118 2 45 25 221 252
$$ packed form
5302bMq0O8P3rM0J06J0l9j15q9J15q1qK1O9m2O1nl6m4J8j00j0J84k0o4O7L9m7
5332H4L9lj34m4M0N0K2P3j7j16N1k3mL6p9k9P7J5K0J74o5j53L9J2k8j0M5j80J18
5361A0J24k8L6J6r1j01O3M2o4J9k7j1O9Q4o6N1n3j65M9R4J4Q1n1j7k8J27j58j9
5389@J00n7j15P6J34k5QL2l6m9P8k39o0J58O0m0Q7kj12P7R0o7m9j14j33Q3L24
5416B09n2j08J20j42n1P8L2l3N8p7j94J55K34j96M0O1j97p6K45NlK8j48n8J28
5441E8J27k00J43Nj79m4K06Qj2Q2j30k0J11j46j42K62N4k23L4N5p2J19J09j59
5465D6J3K3j75j0K46K6k9p6m3j63J38J77j3K7p5k76R3K46j7q8Q8k48n7J97J45
5490A95M9M4j76k29J15J71j00P2J12l29j30J26M2J14J06j54j46J20M3k0J96L1
$$ plain form
5512 252 94 46 -4 -18 129 325 241 200 100 -123 -169 119 192 18 -74 -177 -212 -95 161 306 322 184 -55
5535 -55 -77 207 323 323 203 36 -77 -1 101 179 147 -80 -460 -444 -192 25 217 250 138 -45 9 90 257 338
5559 338 196 -29 15 118 129 330 310 102 -153 -315 -441 -200 6 27 43 66 -49 62 238 438 346 168
5581 168 -7 -165 86 298 439 358 155 -229 -343 -190 3 64 -51 -224 -294 -70 149 439 494 194 -213
5602 -213 -239 -92 208 410 379 127 -55 -161 -36 161 207 72 -243 -361 -194 106 285 459 317 -29 -161
5623 -161 -181 -31 227 294 135 -5 -131 -53 149 290 203 2 -274 -291 -91 297 425 534 213 -137 -274 -84
5645 -84 118 124 40 -185 -365 -209 123 362 402 191 -285 -417 -210 167 449 511 309 63 56 104 254 223 52
5668 52 -292 -481 -434 -134 153 295 222 -121 -232 -179 39 332 420 292 196 45 140 397 517 371 -6 -333
$$ packed form
5512B52j58m8n0j4J47J96q4m1j00k23m6K88P3j74r2j03l5J17K56J45J6j38k39
5535e5k2K84J16%j20j67j13P6J02P8l2k27l80J6K52K17J92L3j12j83N4Q1J67Q1
5559C38j42k25M4J03J1K01k0k08k55j62j26K41K06K1J6K3j15J11J76K00r2j78
5581A68j75j58K51K12J41q1k03l84j14J53J93O1j15j73p0K24K19K90N5l00m07
5602b13k6J47L00K02l1k52j82j06J25J97M6j35l15j18J67L00J79J74j42l46j32
5623a61k0J50K58O7j59j40j26P8K02J41q7k01k76j7K00L88J28J09l21l50j37J90
5645h4K02Oq4k25j80J56L32K39M0k11m76j32K07L77K82O2k02k46pM8J50l1j71
5668E2l44j89M7L00K87J42p3l43j11N3K18K93Q8j28r6j51R5K57J20j46l77l27
$$ plain form
5690 -333 -542 -425 -79 123 148 24 -280 -359 -88 272 404 318 132 -20 38 427 670 637 306 -154 -410 -310
5712 -310 -77 148 128 -107 -439 -503 -244 50 245 190 101 -37 33 281 562 725 482 64 -242 -267 -68 152
5734 152 157 21 -248 -330 -156 88 244 101 -65 -295 -229 -70 363 676 680 421 157 -69 -65 125 149 35 -199
5757 -199 -391 -268 25 327 363 160 -232 -436 -298 62 341 433 344 26 7 136 367 482 271 -131 -365
5778 -365 -419 -169 187 366 212 24 -105 -133 20 206 199 -33 -158 -186 -89 234 507 437 258 -55 -213 -217 22
5801 22 146 126 79 -113 -164 113 265 362 311 -14 -303 -230 -36 147 280 198 -102 -178 4 186 321 412 84
5824 84 -189 -288 -181 89 375 308 68 -128 -117 -51 184 355 114 -38 -147 -125 23 272 354 132 -10 -109 -155
5847 -155 -2 328 259 74 -89 -230 -79 156 267 161 128 -67 -201 86 241 306 274 59 -151 -171 39 141
$$ packed form
5690c33k09J17L46K02K5j24l04p9K71L60J32q6j86j52N8L89K43l3l31m60k56J00
5712c10K33K25k0k35l32o4K59K94J95n5q9j38P0K48K81J63k43m18l06k5J99K20
5734A52Nj36k69q2J74K44J56j43j66k30O6J59M33L13Mk59k64k26MJ90K4j14k34
5757a99j92J23K93L02L6k03l92k04J38L60K79R2q9l18j9J29K31J15k11m02k34
5778c65n4K50L56J79j54j88j29k8J53J86pk32j25k8R7L23K73p0j79l13j58mK39
5801B2J24k0m7j92n1K77J52R7n1l25k89P3J94J83J33q2l00p6J82J82J35R1l28
5824H4k73r9J07K70K86o7k40j96J1O6K35J71k41j52j09K2J48K49Q2k22j42r9m6
5847a55J53L30o9j85j63j41J51K35J11j06l3j95j34K87J55O5l2k15k10k0K10J02
$$ plain form
5869 141 183 248 4 -139 -54 30 212 213 94 -234 -209 -82 88 425 468 198 3 -49 -59 12 137 -79 -206 -178
5893 -178 -168 28 363 448 138 -17 -186 -251 -140 72 78 139 194 120 221 372 306 229 49 -230 -356 -295 -102 81
5917 81 196 223 39 86 201 114 96 26 -122 -218 -137 105 380 541 226 122 -65 -152 -136 -49 -27 -131 -163 -74 51
5942 51 225 421 253 -7 24 -134 -109 90 119 58 103 114 103 283 309 130 -30 17 -260 -286 -45 68 70 223
5966 223 132 120 242 197 65 87 20 -146 -128 -34 -18 118 261 234 56 106 86 64 13 -63 -232 -148 13 54 300
5991 300 416 317 217 73 -62 -110 23 -62 -135 40 76 118 257 303 151 -1 -43 -134 -115 4 -98 -19 201 206
6015 206 184 200 145 -5 -5 -180 -171 -48 63 65 227 315 205 175 144 -39 -99 -23 -86 -50 109 120 184 231 231 44 35 -25
6043 -25 -55 -20 63 58 97 143 107 60 119 50 -55 46 63 44 19 46 37 33 63 -30 -26 16 -55 24 178 159 123 128 84 -36 -3
$$ packed form
5869A41M2O5k44j43Q5Q4J82Jj19l28K5J27J70L37M3k70j95n2j0P1J25k16j27K8
5893a78J0J96L35Q5l10j55j69o5J11K12OO1N5p4J01J51o6p7j80k79j26O1J93J83
5917H1J15K7j84M7J15q7j8p0j48r6Q1K42K75J61l15j04j87q7J6Q7K2j04l2Q9J25
5942E1J74J96j68k60L1j58K5J99K9o1M5J1j1J80K6j79j60M7k77k6K41J13KJ53
5966B23r1j2J22m5j32K2o7j66J8R4J6J36J43k7j78N0k0k2n1p6j69Q4J61M1K46
5991C00J16r9j00j44j35m8J33q5p3J75L6M2J39M6j52j52m2r1J9J19j02P9K20N
6015B06k2J6n5j50%j75RJ23J11KJ62Q8j10l0l1j83o0P6o3L6J59J1O4M7%j87ro0
6043b5l0L5Q3nL9M6l6m7N9o9j05J01J7j9k5K7rmL0r3MM2p1P9J54j9l6Nm4j20L3
$$ plain form
6074 -3 -39 -31 15 69 3 125 273 230 93 71 -3 -92 -107 -86 66 154 246 189 198 244 72 2 -97 -194 -181 -89 35 132 214
6103 214 264 218 197 47 -19 -109 -77 -184 -111 7 188 252 350 292 137 31 -158 -223 -172 -81 -38 91 201 219 309
6128 309 260 176 62 -147 -245 -250 -105 53 154 288 300 284 186 141 92 -103 -164 -260 -244 -50 206 308 416 297
6152 297 166 127 -52 -143 -217 -253 -246 -116 127 291 391 414 221 35 -113 -242 -225 -200 -25 -40 118 230 184 297
6176 297 321 139 -96 -156 -242 -185 11 54 202 315 236 208 182 81 37 -60 -171 -228 -91 129 237 363 363 208
6200 208 88 -1 -44 -106 -76 -171 -135 13 136 229 276 292 81 -16 -82 -89 -18 40 15 47 162 179 171 221 223 30 -132 -138
6228 -138 -177 -76 -60 29 86 135 80 157 173 96 78 -21 -42 -72 -13 112 137 119 57 9 81 23 87 79 52 -10 31 62 23
6257 23 80 142 97 35 89 79 105 93 57 0 -35 24 -47 14 136 138 106 148 144 134 184 88 11 -61 -2 -23 -30 48 93 51 139
$$ packed form
6074cl6QM6N4o6J22J48m3j37k2p4q9j5K1J52Q8R2n7RM6j72p0r9r7J3R2J24R7Q2
6103B14N0m6k1j50o6r0L2j07P3J18J81O4R8n8j55j06j89o5N1R1M3J29J10J8R0
6128C09m9q4j14k09r8nJ45J58J01J34J2j6r8m5m9j95o1r6J6J94K56J02J08j19
6152B97j31l9j79r1p4l6PJ30K43J64J00K3j93j86j48j29J7K5J75j5J58J12m6J13
6176B97K4j82k35o0q6N7J96M3J48J13p9k8k6j01m4r7j11n7J37K20J08J26%j55
6200B08j20q9m3o2L0r5L6J48J23R3M7J6k11r7o6pP1N8k5L2J15J7qN0Kj93j62o
6228a38l9J01J6Q9N7M9n5P7J6p7j8r9k1l0N9J25K5j8o2m8P2n8O4qk7o2M1L1l9
6257B3N7O2m5o2N4j0K6j2l6n7l5N9p1O1J22Kl2M2mj0N0r6p7p2N9k1pP8M5m2Q8
$$ plain form
6288 139 20 17 34 -21 36 26 63 104 175 320 344 265 200 28 -14 -151 -119 -138 -135 -151 -89 53 174 204 152 81 31 -12
6316 -12 -51 -32 120 183 241 316 361 328 226 63 -185 -370 -373 -444 -332 -155 -71 147 273 352 324 271 123 0 28
6341 28 87 106 202 353 297 301 261 31 -114 -281 -419 -538 -402 -242 -99 147 291 349 370 388 244 102 134 -17
6365 -17 -14 91 179 263 343 233 38 -32 -287 -417 -456 -368 -285 -140 133 301 435 588 488 354 184 28 -128
6388 -128 -14 -52 -52 85 136 48 98 96 -128 -216 -280 -437 -312 -102 89 214 453 458 359 355 229 127 61 -23 -207 -171
6414 -171 -29 17 86 182 48 -40 -67 -72 -80 -31 -21 -63 71 186 245 386 426 203 82 -10 -111 -123 -14 11 -86 1
6440 1 27 18 162 159 83 -34 -48 -126 -68 166 149 134 122 44 27 146 151 77 20 -52 -197 8 -34 101 164 149 41 15
6468 15 141 122 153 137 27 -81 -54 7 44 113 125 17 22 73 103 126 261 40 -73 -70 -113 -24 104 135 45 36 91 76
$$ packed form
6288A39j19lJ7n5N7j0L7M1P1J45K4p9o5j72m2j37L2j9Lj6O2J42J21L0n2p1n0m3
6316a2l9J9J52O3N8P5M5l3j02j63k48j85lp1J12J77Q4K18J26P9k8n3j48j23K8
6341B8N9J9R6J51n6Mm0k30j45j67j38j19J36J60J43K46J44N8K1J8j44j42L2j51
6365a7LJ05Q8Q4Q0j10j95p0k55j30l9Q8Q3J45K73J68J34J53j00j34j70j56j56
6388a28J14l8%J37N1q8N0kk24q8o4j57J25K10J91J25K39Nr9mj26j02o6q4j84L6
6414a71J42M6O9R6j34q8k7nqM9J0m2J34J15N9J41M0k23j21r2j01j2J09K5r7Q7
6440AK6rJ44lp6j17j4p8N8K34j7j5j2p8j7J19Np4n7p2j45K05m2J35O3j5j08k6
6468A5J26j9L1j6j10j08K7O1L7O9J2j08NN1L0K3J35k21j13Lm3Q9J28L1r0rN5j5
$$ plain form
6496 76 148 151 101 -67 -195 -150 14 155 213 248 211 163 22 82 34 -1 -54 -118 -102 -80 231 209 340 156 75 -75
6522 -75 -54 -82 8 6 -42 -30 93 150 282 277 173 -98 -216 -150 -153 -39 105 205 148 195 204 168 289 140 -74 -285
6548 -285 -232 -176 10 186 259 202 97 33 52 41 -48 -28 -81 -155 10 210 353 407 363 157 6 -40 -123 -85 -102 -104
6574 -104 -155 -34 80 216 269 297 104 -50 -127 -113 -28 82 166 118 178 226 210 255 211 -5 -173 -254 -296 -78 93
6599 93 148 131 220 139 101 157 111 -1 -42 -96 -50 10 238 337 294 116 -3 -131 -80 -124 -77 -71 -76 -74 49 264 290 318
6627 318 230 48 -137 -91 -20 28 58 105 64 45 145 204 134 88 -96 -202 -111 -55 51 189 203 127 91 93 38 95 123
6654 123 -10 -80 -57 -16 128 217 110 47 25 -74 -31 89 71 47 101 24 42 105 133 142 43 49 -41 -26 101 179 146 130
6682 130 45 -9 18 39 70 169 28 60 82 96 123 89 46 -63 -55 -54 56 72 239 153 42 97 11 -7 -14 15 -14 -49 103
$$ packed form
6496G6P2Ln0j68j28M5J64J41N8L5l7m8j41O0m8l5n3o4J6K2L11k2J31j84q1j50
6522g5K1k8R0km8J2J23N7J32nj04k71j18O6lJ14J44J00n7M7Rl6J21j49k14k11
6548b85N3N6J86J76P3n7j05o4J9j1q9K0n3p4J65K00J43N4m4k06j51m6q3L8j7k
6574a04n1J21J14J36N3K8j93j54p7J4Q5J10Q4m8O0M8j6M5m4k16j68q1m2K18J71
6599I3N5j7Q9q1l8N6m6j12m1n4M6O0K28R9m3j78j19j28N1m4M7OnKJ23K15K6K8
6627C18q8j82j85M6P1M8L0M7m1j9J00N9p0m6j84j06R1N6J06J38J4p6l6Kn5N7K8
6654A23j33p0K3M1J44Q9j07o3k2r9M3J20j8k4N4p7J8O3K8Rr9Or0J5J27P8l3j6
6682A30q5n4K7K1L1R9j41L2K2J4K7l4m3j09QJJ10J6J67q6j11N5q6j8pK9k9l5J52
$$ plain form
6711 103 154 182 215 135 71 30 -51 -77 -54 38 44 75 126 145 224 145 88 31 6 -59 -56 6 28 44 116 113 96 97 13 5 -11 28
6743 28 -62 -4 45 134 160 176 146 109 89 74 -35 -1 -5 -10 24 82 114 60 117 77 82 66 19 -9 32 4 17 105 116 130 167
6774 167 81 85 41 63 -9 -35 -3 39 37 110 102 172 136 77 -30 11 16 -72 52 30 65 89 156 175 148 134 18 -7 -57 -32
6804 -32 -4 49 41 70 119 81 161 232 71 -47 -82 -81 -75 42 98 106 109 103 63 -22 96 114 -3 -100 -50 -43 88 150 155 193 62
6835 62 -70 38 99 29 46 79 9 8 132 154 124 123 41 -96 -37 -20 99 119 156 58 35 1 64 99 152 134 -32 -160
6863 -160 -2 50 128 196 81 50 -8 16 84 175 121 -30 -66 -8 -2 146 246 150 95 -36 -32 82 165 39 7 22 -73
6890 -73 -61 159 194 161 62 -40 -111 -24 108 95 110 44 -109 -64 75 82 201 188 -18 -39 -37 39 159 206 94 -9
6916 -9 -91 -98 34 205 179 104 -39 -10 15 148 215 151 31 -64 -73 90 189 281 237 125 -27 -51 -4 86 87 46 -78 -149
$$ packed form
6711A03N1K8L3q0o4m1q1k6K3R2OL1N1J9P9p9n7n7k5o5LO2K2J6P2lj7Jq4qj6L9
6743B8r0N8M9Q9K6J6l0l7k0j5j09L4mnL4N8L2n4N7m0Nj6m7k8M1k8J3Q8J1J4L7
6774A67q6Mm4K2p2k6L2M2kP3qP0l6n9j07M1Nq8J24k2L5K4O7J9k7j4j16k5n0K5
6804c2K8N3qK9M9l8Q0P1j61j18l5JOJ17N6QLom0q5J18J8j17r7N0PJ31O2NL8j31
6835F2j32J08O1p0J7L3p0jJ24K2l0jq2j37N9J7J19K0L7r8k3l4O3L5N3j8j66j28
6863a60J58N2P8O8j15l1n8K4O8R1n4j51l6N8OJ48J00r6n5j31MJ14Q3j26l2J5r5
6890g3J2K20L5l3r9j02p1Q7J32j3J5o6j53M5J39PJ19j3k06k1KP6J20M7j12j03
6916iq2pJ32J71k6p5j43K9K5J33O7o4j20r5rJ63R9R2m4j12j52k4M7R0Jm1j24p1
$$ plain form
6944 -149 -65 92 177 130 82 -70 -167 -69 141 268 301 210 94 21 148 126 219 130 -165 -247 -211 -48 69 262 156
6969 156 0 -16 -4 -18 181 225 82 14 116 174 242 372 337 56 -114 -293 -209 -87 45 -19 -84 -147 -208 25
6993 25 202 180 117 82 -28 77 273 440 378 268 33 -101 -36 -1 -21 -23 -89 -242 -210 -32 35 98 194 -11 -115
7018 -115 3 154 307 389 394 161 42 21 16 86 131 -29 -207 -204 -265 -65 131 87 -1 -161 -141 -3 232 443 350
7043 350 264 145 50 116 222 180 71 -49 -202 -213 6 106 76 41 -95 -226 -44 99 235 216 188 94 40 162
7067 162 204 295 248 -7 -121 -183 -44 56 149 130 -50 -99 -67 25 119 123 127 28 -88 70 185 281 211 64 -36 -112
7093 -112 -132 82 224 181 85 23 9 50 154 159 143 51 -61 -28 99 235 183 149 -1 -168 -132 44 80 118 46 -48
7119 -48 -21 92 178 249 172 54 -12 -74 78 153 216 134 -36 -117 -91 7 42 49 52 -30 -14 88 111 211 226 108 12 26
$$ packed form
6944a49Q4J57Q5m7m8j52r7R8K10J27L3r1j16p3J27k2R3q9k95q2L6J63J17J93j06
6969A56j56j6J2j4J99M4j43o8J02N8O8J30l5k81j70j79Q4J22J32o4o5o3o1K33
6993B5J77k2o3l5j10J05J96J67o2j10k35j34O5L5k0ko6j53L2J78O7O3R6k05j04
7018a15J18J51J53Q2Nk33j19k1nP0M5j60j78Lo1K00J96m4q8j60K0J38K35K11r3
7043C50q6j19r5O6J06m2j09j20j53j1K19J00l0l5j36j31J82J43J36j9k8r4n4J22
7067A62M2R1m7k55j14o2J39J00R3j9j80m9L2R2R4MMr9j16J58J15R6p0j47j00p6
7093a12k0K14J42m3r6o2j4M1J04Nj6r2j12L3J27J36n2l4j50j67L6J76L6L8p2r4
7119d8K7J13Q6P1p7j18o6o2J52P5O3q2j70q1K6R8L5PLq2J6J02K3J00J5j18r6J4
$$ plain form
7147 26 -24 88 208 239 67 -8 -57 -10 67 95 48 -41 -103 -82 42 160 198 175 110 33 48 91 109 192 104 10 -44 -1
7175 -1 98 88 132 49 -106 3 63 168 140 146 46 -2 -11 26 140 162 111 -20 -26 12 57 127 120 15 12 -18 -24 -16 111 84
7205 84 32 64 -7 24 127 106 100 79 48 0 52 113 62 91 39 -53 30 145 185 184 132 63 10 58 46 66 97 67 -66 -6
7235 -6 -9 115 104 51 53 -10 54 90 106 88 50 -32 43 44 88 131 147 26 52 -3 -48 4 53 31 29 43 9 38 42 118 139 110
7267 110 116 71 146 134 78 27 -38 -43 2 28 88 101 70 40 -50 44 17 44 93 106 27 -14 31 40 92 -7 32 -17 27 26 35 62
7299 62 18 -5 -7 68 70 59 63 40 77 37 39 26 81 120 42 94 0 -19 11 42 34 71 64 66 127 139 112 20 79 39 81 73 60 -17
7333 -17 94 12 32 53 59 62 67 54 37 33 37 60 113 109 95 80 119 73 54 17 59 17 89 59 35 90 31 -24 75 60 68 56 73
7366 73 90 108 86 117 -18 50 -26 10 27 20 -1 -17 40 34 67 83 57 45 82 58 -12 94 71 71 128 131 107 73 102 29 -24
$$ packed form
7147B6n0J12J20L1j72p5m9M7P7K8m7q9o2K1J24J18L8k3o5p7J5M3J8Q3q8r4n4M3
7175aR9j0M4q3j55J09O0J05k8Oj00m8rL7J14K2n1j31oL8M5P0pj05ll0oQJ27k7
7205H4n2L2p1L1J03k1ok1l1m8N2O1n1K9n2r2Q3J15M0jn2o9n3M8j2K0L1l0j33O0
7235flJ24j1n3Ko3O4L6J6j8l8q2P5JM4M3J6j21K6n5m5N2M9k2kJ4l4K9MP6K1k9
7267A10Om5P5j2n6n1o5nM5K6O0J3l1l0r0R4k7K7M9J3p9m1M5RN2r9L9m9M4jRK7
7299F2m4k3kP5Kj1Mk3L7m0Kj3N5L9p8N2r4j9L0L1qL7pKO1J2k7r2N9m0M2qj3p7
7333a7J11q2K0K1OLNj3j7mMK3N3mj4j5L9m6j9l7M2m2P2l0k4N5n9n5R9j5Qj2J7
7366G3J7J8k2L1j35O8p6L6J7pk1j6N7oL3J6k6j2L7k4p0J06k3%N7Lk4l4K9p3n3
$$ plain form
7397 -24 41 -21 10 47 88 49 124 60 7 -10 -25 32 87 128 124 94 128 56 102 46 40 -36 -35 -2 45 102 66 151 103 85 -24
7428 -24 54 154 23 33 20 38 44 94 87 65 77 38 -9 87 43 -2 15 130 30 98 115 71 83 15 39 29 131 51 21
7457 21 121 81 59 96 34 -4 -57 17 51 64 37 50 57 105 -14 14 93 42 34 63 81 58 64 86 63 100 70 37 -23 24 89
7488 89 79 84 93 50 75 49 69 93 32 51 44 125 71 113 90 7 -28 14 -22 85 85 179 70 49 123 50 125 18 19 -16 58
7519 58 79 85 97 60 -10 111 89 79 171 28 4 70 61 -15 45 121 73 103 48 95 73 -2 43 37 127 57 -16 53 68 138 114
7550 114 45 72 2 15 96 145 117 -55 -8 60 47 94 177 94 -24 9 44 68 124 156 7 28 77 39 75 90 68 -16
7578 -16 28 -10 55 174 116 108 33 12 28 -27 77 126 67 115 -2 61 73 91 130 47 28 -28 23 59 109 121 92 13 -11
7607 -11 -3 53 105 156 62 14 89 106 191 189 106 -60 -117 -70 21 162 125 11 -84 -63 -50 88 80 75 15 13 74 113 291 306
$$ packed form
7397b4O5o2L1L7M1l9P5o4n3j7j5N7N5M1ml0L4p2M6n6op6JL3M7N7l6Q5m8j8j09
7428b4P8J00j31J0j3J8ON0pk2J2l9m7R6m4m5J7J15j00O8J7m4J2o8K4j0J02q0l0
7457B1J00m0k2L7o2l8n3P4L4J3k7J3PM8j19K8P9n1qK9J8k3OK2k3L7l0l3o0M7O5
7488H9j0NRm3K5k6K0K4o1J9pQ1n4M2k3q3l5M2l6J07%R4j09k1P4p3P5j07Jl5P4
7519E8K1OJ2l7p0J21k2j0R2j43k4O6rp6O0P6m8L0n5M7k2p5M5oR0p0p3O9J5P0k4
7550A14o9K7p0J3Q1M9k8j72M7O8j3M7Q3q3j18L3L5K4N6L2j49K1M9l8L6J5k2q4
7578a6M4l8O5J19n8qp5k1J6n5J04M9n9M8j17O3J2J8L9q3j9n6N1L6N0J2k9p9k4
7607a1QN6N2N1r4m8P5J7Q5kq3j66n7M7R1J41l7j14r5K1J3J38qno0kO1L9J78J5
$$ plain form
7637 306 198 89 46 7 -2 67 101 19 40 30 -25 31 99 31 8 -50 -46 20 206 280 300 233 108 76 8 124 138 60
7665 60 -8 -143 -59 51 170 174 57 -27 -177 -68 -22 169 200 160 99 81 210 245 242 124 -62 -162 -118 -40 99
7690 99 232 130 -5 -100 -80 -65 68 159 86 25 55 86 213 278 197 74 -64 -149 -118 37 179 201 163 14 -76
7715 -76 -10 70 99 82 -53 -72 -58 108 309 336 219 64 -175 -181 -21 55 186 129 62 6 77 144 283 208 -26 -196
7741 -196 -195 83 249 357 256 78 -86 -165 -89 11 154 -13 -94 -77 57 212 365 231 126 -23 -166 -129
7763 -129 78 168 182 211 -10 -68 -23 77 57 52 -127 -213 -112 57 285 411 285 77 46 -10 18 269 199 95
7787 95 -72 -141 -91 120 162 89 -50 -231 -275 -114 184 305 212 102 42 9 69 330 304 135 32 -47 -43 97 181
7812 181 108 36 -142 -299 -145 32 153 201 76 -43 -22 96 219 267 318 113 -21 -106 147 250 210 109 -120
$$ packed form
7637C06j08j09m3l9rO9L4q2K1j0n5N6O8o8k3n8MO6J86P4K0o7j25l2o8J16J4p8
7665F0o8j35Q4J10J19Mj17q4j50J09M6J91L1m0o1j8J29L5lj18j86j00M4P8J39
7690I9J33j02j35r5K0J5J33R1p3o1L0L1J27O5q1j23j38q5L1J55J42K2l8j49r0
7715g6O6Q0K9j7j35j9J4J66K01K7j17j55k39oJ60P6J31n7o7n6P1O7J39p5k34j70
7741a96JK78J66J08j01j78j64p9P6J00J43j67q1J7J34J55J53j34j05j49j43L7
7763a29K07R0J4K9k21n8M5J00k0nj79q6J01J69K28J26j26k08l1n6K8K51p0j04
7787I5j67o9N0K11M2p3j39j81m4J61K98J21r3j10o0l3O0K61k6j69j03p9MJ40Q4
7812A81p3p2j78j57J54J77J21M8j25j19K1J18J23M8N1k05j34q5K53J03m0j01k29
$$ plain form
7835 -120 -253 -227 -76 55 245 130 -40 -47 -1 157 269 262 44 -68 -130 9 183 344 282 82 -136 -86 -28
7858 -28 104 114 78 -130 -192 -124 148 358 271 157 -24 -139 -72 98 191 100 88 -63 -20 40 104 120 93 -55 -253
7883 -253 -179 -7 194 254 222 31 -12 -42 3 222 204 66 -116 -98 4 118 237 266 150 9 -124 -43 143
7906 143 233 120 -19 -101 -85 89 198 283 175 21 -175 -170 20 187 155 118 62 -91 0 161 226 172 47 -98
7930 -98 -131 -42 122 100 177 84 -21 -69 32 107 167 100 60 -32 -29 51 198 243 143 -17 -71 -86 113 228 228 146 -34
7957 -34 -31 -54 79 175 113 -37 -118 -89 39 219 269 156 15 -137 -182 -72 144 141 58 -12 -22 23 146 167 181 84
7983 84 -72 -163 -54 162 224 193 130 27 -63 -7 14 11 3 -66 -121 -13 77 257 278 239 78 -52 -115 -95 43 144
8009 144 103 12 91 123 163 221 99 -30 -217 -244 -117 35 239 237 262 145 38 73 105 114 -46 -70 -81 17 122 186
$$ packed form
7835a20j33K6J51J31J90j15j70pM6J58J12pk18j12o2J39J74J61o2k00k18N0N8
7858b8J32J0l6k08o2O8K72K10q7j14j81j15O7J70R3r1j2j51M3O0O4J6k7j48j98
7883b53P4J72K01O0l2j91m3l0M5K19j8j38j82J8J02J14J19K9j16j41j33Q1J86
7906A43R0j13j39q2J6J74J09Q5j08j54j96NJ90J67l2l7n6j53R1J61O5n4j25j45
7930i8l3Q9J64k2P7r3j05m8J01P5O0o7m0r2LQ0J47M5j00j60n4j5J99J15%q2j80
7957c4Lk3J33R6o2j50q1K9J28J80N0j13j41j52m5J10K16lq3p0j0M5J23K1J4r7
7983H4j56r1J09K16O2l1o3j03r0N6K1lqo9n5J08R0J80K1l9j61j30o3K0J38J01
8009A44m1r1P9L2M0N8j22j29j87k7J27J52K04kK5j17j07L5L2Rj60k4j1R8J05O4
$$ plain form
8035 186 241 142 -1 -109 -36 -7 -23 66 16 81 21 118 211 146 153 71 -16 -9 20 56 124 105 28 -36 -26 -32 75 90 53 -5
8065 -5 -12 15 53 152 170 82 54 2 64 141 205 85 68 -15 -7 -8 37 44 90 101 21 111 144 202 27 92 -79 -114 -54 2 101
8096 101 172 113 87 74 101 21 -35 -50 -31 -62 -3 61 173 189 176 140 35 -50 -57 0 45 31 89 128 111 116 150 83 16 2
8126 2 -57 -11 22 117 201 131 113 26 98 76 2 24 -1 36 26 106 178 120 71 77 59 2 66 4 34 23 128 99 139 49 67
8157 67 82 -44 -9 29 68 11 90 112 127 48 67 18 22 21 29 111 129 121 81 76 13 -46 3 -19 12 55 49 127 128 148 78 1 54
8190 54 -37
$$ packed form
8035A86N5r9j43j08P3K9j6Q9n0O5o0R7R3o5Pq2q7PK9L6O8j9p7o4J0oJ07J5l7n8
8065epK7L8R9J8q8k8n2O2P7O4j20j7q3QjM5PM6J1q0R0L3N8j75O5j71l5O0N6R9
8096A01P1n9k6j3K7q0n6j5J9l1N9O4J12J6j3l6j05q5pN7M5j4N8L9j7NL4o7o7j4
8126Bn9M6L3R5Q4p0j8q7P2k2p4K2k5L7j0Q0P2n8m9Oj8n7O4o2L0j1J05k9M0r0J8
8157F7J5j26L5L8L9n7P9K2J5p9J9m9MjQQ2J8qm0no3n9M9k2L1M3oP8JK0p0p7N3
8190E4r1
8191c7
$$ Imaginary data points
##PAGE= N=2
##DATA TABLE= (X++(I..I)), XYDATA
$$ plain form
0 0 0 0 0 0 0 0 0 0 0 0 0 0 0 0 0 0 0 0 -1 1 -9 9 -9 9 -9 10 -13 14 -18 19 -22 23 -29 31 -34 40 -42 49 -54 59 -65
41 -65 72 -81 88 -97 108 -118 129 -144 158 -172 191 -211 234 -260 289 -325 366 -416 478 -554 656
62 656 -792 983 -1270 1739 -2604 4534 -10654 70129 435368 442129 260261 59287 -153271
75 -153271 -127183 94221 150003 40196 -98918 -242264 -189901 96086 277111 226663 54911
86 54911 -193089 -341670 -245269 -79561 35588 108882 44102 -62723 21999 175231 205097
97 205097 182547 101255 -75772 -169149 -117209 -52576 14662 79539 49204 -21032 -31505 -33393
109 -33393 -61569 -66606 -41466 -17223 -18281 -35742 -21504 26833 73441 122495 147153 84895
121 84895 -32322 -112266 -104235 -7641 96933 102396 10195 -99287 -148872 -88224 33252 104273
$$ packed form
0@%%%%%%%%%%%%%%%%%%jKj0J8j8J8j8J9k3K7l2L7m1M5n2O0o5P4q2R1j03J13j24
41f5J37j53J69j85K05k26K47k73L02l30L63m02M45m94N49o14O91p82Q94j032J210
62F56j448J775k253L009m343P138j5188Q0783L65239O761j81868k00974k12558
75a53271K6088K21404N5782j09807j39114j43346N2363K85987J81025n0448j71752
86E4911k48000j48581R6401J65708J15149P3294o4780j06825Q4722J53232K9866
97B05097k2550q1292j77027r3377N1940O4633O7238O4877l0335p0236j0473j888
109c3393k8176n037K5140K4243j058j7461J4238M8337M6608M9054K4658o2258
121H4895j17217p9944Q031R6594J04574N463r2201j09482m9585O0648J21476P1021
$$ plain form
133 104273 77960 -36016 -151924 -114808 56806 168664 155428 55582 -108000 -193999 -84625
144 -84625 86601 169538 141800 -6743 -162308 -139401 4890 100345 110930 18715 -137904
155 -137904 -181369 -64570 85079 185255 160867 -4923 -132322 -109702 -31471 50098 99106
166 99106 27539 -82766 -85314 -19536 54409 120741 84829 -39196 -97217 -75603 -39042 23383
178 23383 64034 29997 -6071 -8643 -9717 11333 33488 5534 -18385 -7810 -19869 -37223
190 -37223 -20875 -6440 9851 46235 48311 8790 -20354 -37603 -30678 25139 64956 31464
202 31464 -29259 -69685 -67600 -3240 74507 85463 27967 -48721 -91487 -53813 36888 88968
214 88968 56992 -28941 -101580 -91561 2185 96559 115871 51264 -47656 -98786 -55874 35158
$$ packed form
133A04273k6313j13976j15908L7116J71614J11858j3236r9846j63582q5999J09374
144h4625J71226Q2937k7738j48543j55565K2907J44291R5455J0585r2215j56619
155a37904m3465J16799J49649J00176k4388j65790j27399K2620P8231Q1569M9008
166I9106p1567j10305k548O5778P3945O6332l5912j24025n8021K1614L6561O2425
178B3383M0651l4037l6068k572j074K1050K2155k7954k3919J0575j2059j7354
190c7223J6348J4435J6291L6384K076l9521k9144j7249O925N5817L9817l3492
202C1464o0723m0426K085O4360P7747J0956n7496p6688m2766L7674R0701N2080
214H8968l1976q5933p2639J0019R3746R4374J9312o4607r8920n1130M2912R1032
$$ plain form
226 35158 85337 49147 -41275 -105572 -85182 6848 99304 118105 48085 -49828 -97914 -67062
238 -67062 7785 57624 41068 -15088 -53515 -40216 18910 75163 74086 17260 -47196 -76932
250 -76932 -54854 -1461 34877 32476 10722 -7002 -5043 16795 32227 22033 -2447 -26088
262 -26088 -38343 -30665 -13874 -2507 8987 22428 27165 22353 9649 -11124 -24607 -17657 -2268
275 -2268 5284 -544 -16866 -23598 -1764 36450 61022 51430 6811 -45588 -64150 -38095 4121
288 4121 27112 13594 -22503 -40377 -12425 42290 77849 60691 -3160 -67767 -83805 -42146
300 -42146 21158 56878 41079 -3784 -29065 -9075 34648 57735 31397 -32723 -87251 -86758
312 -86758 -29882 39674 72286 51829 5136 -24589 -15877 14601 29654 7539 -36084 -61386
$$ packed form
226C5158N0179l6190r0422o4297K0390R2030R2456J8801p0020r7913m8086L0852
238f7062P4847M9839j6556n6156l8427J3299N9126N6253j077n6826o4456k9736
250g6932K2078N3393L6338k401k1754j7724J959K1838J5432j0194k4480k3641
262b6088j2255P678J6791J1367J1494J3441M737m812j2704k0773j3483O950J5389
275b268P552n828j6322o732K1834L8214K4572r592m4619n2399j8562K6055M2216
288D121K2991j3518l6097j7874K7952N4715L5559j7158o3851o4607j6038M1659
300d2146O3304L5720j5799m4863k5281J9990M3723K3087k6338o4120n4528M93
312h6758N6876O9556L2612k0457m6693k9725Q712L0478J5053k2115m3623k5302
$$ plain form
324 -61386 -42244 9377 55811 65856 36277 -7241 -32048 -27468 -11668 -7801 -18551 -28204 -19555
337 -19555 9075 40014 50842 33667 1512 -23141 -27741 -19897 -14201 -12913 -9237 3128 24673
350 24673 42077 35926 6551 -25414 -39795 -28924 -4351 10233 6313 -3258 -4492 9983 31401
363 31401 32650 2969 -32984 -48522 -33468 6273 40206 38717 11033 -15371 -22713 -4534 18452
376 18452 14009 -13013 -33662 -32533 -3404 39549 55000 29692 -8591 -36775 -39297 -12112 12584
389 12584 8463 -6207 -12050 -4017 22569 44726 30875 -5892 -37095 -50295 -32063 6153 24365
402 24365 17788 10445 6639 9451 21167 16769 -11921 -37206 -43441 -28428 7762 37059 34321
415 34321 16518 3734 -3349 -983 2767 -9956 -30167 -35384 -20605 9311 39902 45408 21903
$$ packed form
324f1386J9142N1621M6434J0045k9579m3518k4807M580J5800L867j0750r653Q649
337a9555K8630L0939J0828j7175l2155k4653m600P844N696J288L676J2365K1545
350B4673J7404o151k9375l1965j4381J0871K4573J4584l920r571j234J4475K1418
363C1401J249k9681l5953j5538J5054L9741L3933j489k7684k6404p342J8179K2986
376A8452m443k7022k0649J129K9129M2953J5451k5308l8283k8184k522K7185K4696
389A2584m121j4670n843Q033K6586K2157j3851l6767l1203j3200J8232L8216J8212
402B4365o577p343l806K812J1716m398k8690k5285o235J5013L6190K9297k738
415C4321j7803j2784p083K366L750j2723k0211n217J4779K9916L0591N506k3505
$$ plain form
428 21903 -6074 -19194 -17079 -8149 -4007 -10470 -20022 -16736 4608 31052 43198 28949 -4090
441 -4090 -28098 -27192 -15400 -3795 6788 4121 -7391 -1950 15802 22637 19068 3553 -22530
454 -22530 -28444 -10507 -164 5635 13580 2576 -10671 -62 9241 5949 6196 -3546 -16399 -1738
468 -1738 13553 5299 3032 1196 -15429 -11852 8641 8317 4667 3996 -13503 -12571 15783 15043 -5178
483 -5178 -6024 -14988 -25602 737 26466 21127 13801 -547 -20762 -6277 17407 6808 -7152
496 -7152 -13524 -29586 -20928 17005 33513 27887 12846 -20807 -35282 -7780 8587 2280 3246
509 3246 -5558 -19374 1951 33446 36494 24041 -3115 -39104 -40182 -11119 3666 8334 12835
522 12835 2091 -8034 2777 16285 17182 5487 -17089 -29661 -17394 -815 7907 16724 18520
$$ packed form
428B1903k7977j3120K115Q930M142o463r552L286K1344K6444J2146j4249l3039
441d090k4008R06J1792J1605J0583k667j1512N441J7752O835l569j5515k6083
454b2530n914J7937J0343N799P945j1004j3247J0609R303l292K47r742j2853J4661
468a738J5291q254k267j836j6625L577K0493l24l650o71j7499R32K8354p40k0221
483e178q46q964j0614K6339K5729n339p326j4348k0215J4485K3684j0599j3960
496g152o372j6062Q658L7933J6508n626j5041l3653j4475K7502J6367o307R66
509C246q804j3816K1325L1495L048j2453k7156l5989j078K9063J4785M668M501
522A2835j0744j0125J0811J3508Q97j1695k2576j2572J2267J6579Q722Q817J796
$$ plain form
535 18520 8245 1145 3583 4079 -1897 -9986 -16368 -14502 -3064 4904 1992 2926 11952 11011 2024
550 2024 758 -4443 -18379 -16572 1344 13446 16864 8036 -11487 -13344 4205 11178 10726 8622
564 8622 -12120 -29927 -15282 8216 22405 26179 2180 -26745 -18028 2618 9474 21647 17420
577 17420 -19046 -33045 -10872 7925 24074 28835 -3355 -29379 -16406 -2072 9066 26756
589 26756 14052 -19871 -25495 -12250 4380 27732 23682 -8271 -17415 -11684 -12378 7894 28823
602 28823 9743 -12411 -11897 -13299 -4602 17063 12450 -3563 -636 -4327 -12613 2577 13329 1628
616 1628 -2655 -2305 -9587 -5860 2238 368 5442 12190 988 -6663 180 1557 3021 10573 4104
631 4104 -10783 -14625 -14290 -7598 13927 24315 8222 -8281 -13226 -14910 -6450 10908 14737 1519
$$ packed form
535A8520j0275p100K438M96n976q089o382J866J1438P968k912R34R026r41q987
550B024j266n201j3936J807J7916J2102L418q828j9523j857J7549O973m52k104
564H622k0742j7807J4645K3498J4189L774k3999k8925Q717K0646O856J2173m227
577A7420l6466j3999K2173J8797J6149M761l2190k6024J2973J4334J1138J7690
589B6756j2704l3923n624J3245J6630K3352m050l1953r144N731o94K0272K0929
602B8823j9080k2154N14j402Q697K1665m613j6013K927l691q286J5190J0752j1701
616A628m283L50p282L727Q098j870N074O748j1202p651O843J377J464P552o469
631D104j4887l842L35O692K1525J0388j6093j6503m945j684Q460J7358L829j3218
$$ plain form
645 1519 -10885 -12520 -905 20184 30893 18010 -4990 -21528 -26492 -14392 8067 16539 4029
658 4029 -12104 -19346 -11597 9574 21743 11284 -5938 -18457 -21922 -3461 25343 32522 19264
671 19264 4111 -9909 -11312 4913 11990 406 -11694 -23564 -30728 -14088 10586 15693 9306
684 9306 -161 -13970 -14966 -158 9079 12987 16029 8549 2069 9992 15047 10680 7770 -1206 -15681
699 -15681 -18155 -14623 -15073 -8888 -1533 -5391 -8203 -4212 -4109 -1583 8722 14163 13111 11729 6275
714 6275 2403 9206 16376 14246 7296 -5208 -19908 -22327 -11586 -1329 1671 -4647 -17623 -23208
728 -23208 -13753 2355 14923 17422 7667 -3110 -667 13203 26164 28336 15455 -6104 -20137
741 -20137 -16954 -3597 6424 4578 -8160 -21473 -23417 -12026 2677 8850 3318 -7027 -10744
$$ packed form
645A519j2404j635J1615K1089J0709j2883k3000j6538m964J2100K2459Q472j2510
658D029j6133p242P749K1171J2169j0459j7222j2519l465J8461K8804P179j3258
671A9264j5153j4020j403J6225P077j1584j2100j1870p164J6640K4674N107o387
684I306r467j3809r96J4808R237L908L042p480o480P923N055m367k910q976j4475
699a5681k474L532m50O185P355l858k812L991J03K526J0305N441j052j382n454
714F275l872O803P170k130o950j2504j4700k419J0741J0257L000o318j2976n585
728b3208R455J6108J2568K499r755j0777K443J3870J2961K172j2881k1559j4033
741b0137L183J3357J0021j846j2738j3313j944J1391J4703O173n532j0345l717
$$ plain form
754 -10744 -1912 13942 25418 24988 13226 -1185 -7241 -3023 3370 4726 -386 -9252 -15100 -12245
768 -12245 -4192 1880 2320 -2066 -7290 -8344 -4843 607 5818 9373 9945 8702 7308 4528 1298
783 1298 -1 -487 -2303 -4817 -7248 -8249 -5334 1392 6797 6767 1348 -6014 -9251 -4909 3697 9774
799 9774 8991 1789 -6054 -7345 -977 6118 6945 616 -8800 -13371 -7425 4732 12958 11452 2290
814 2290 -7062 -8504 -201 9467 11575 4623 -5952 -12080 -8009 1864 8121 5907 -3279 -12895 -14293
829 -14293 -5954 4067 8903 7472 1574 -2743 356 7352 10966 8882 2134 -5091 -7153 -3212 1447
844 1447 2978 89 -5902 -9846 -8829 -5449 -2063 826 1904 1265 1895 4139 5941 6423 6308 5620
860 5620 3614 914 -1083 -2105 -1911 -811 -647 -2275 -4824 -7692 -8334 -4744 -449 902 703 -738
$$ packed form
754a0744Q832J5854J1476m30j1762j4411o056M218O393J356n112q866n848K855
768a2245Q053O072M40m386n224j054L501N450N211L555N72j243j394k780l230
783A298j299m86j816k514k431j001K915O726N405l0n419p362l237M342Q606O077
799I774p83p202p843j291O368P095Q27o329r416m571N946J2157Q226j506r162
814B290r352j442Q303R668K108o952j0575o128M071R873O257k214r186r616j398
829a4293Q339J0021M836j431n898m317L099O996L614k084o748p225k062L941M659
844A447J531k889n991l944J017L380L386K889J078o39O30K244J802M82j15o88
860E620k006k700j997j022J94J100J64j628k549k868o42L590M295J351j99j441
$$ plain form
876 -738 -2607 613 7846 11149 9582 5713 -1180 -5258 -1434 3144 3536 1582 -4455 -10198 -6945 -464
892 -464 1433 2072 -657 -7635 -7560 910 6361 8438 7191 -770 -5577 -1117 3073 5425 7713 1448
908 1448 -7596 -6195 -1508 24 3553 2556 -5331 -6267 -1393 27 3047 5416 -764 -4748 -479 2002
924 2002 3215 5783 1723 -3819 -2158 -1136 -1865 1768 1832 -3225 -2361 1253 431 849 1755 -1139 -1192
941 -1192 2116 1225 -340 744 -1247 -3208 185 2768 551 -909 -1467 -2026 614 3657 1832 -1170
957 -1170 -1686 -2365 -1509 3568 5740 1145 -2963 -3384 -2603 861 4246 1457 -2161 -2320 -3601 -2584 4140
974 4140 4463 -2510 -3376 -1061 -1009 3590 6953 1348 -1985 -1051 -3741 -976 6345 2514 -4218 -1877
990 -1877 -2249 -3385 3439 3852 -2936 -1048 571 -3373 1790 6210 -1604 -3859 655 -1402 90 5297
$$ packed form
876g38j869L220P233L303j567l869o893m078L824M578L92j954o037n743L253O481
892d64J897O39k729o978P5Q470N451K077j247p961m807M460M190K352K288o265
908A448r044J401M687J532L529r97p887r36M874J420L020K369o180l984M269K481
924B002J213K568m060n542J661J022p29L633O4n057Q64L614q22M18R06k894n3
941a192L308q91j565J084j991j961L393K583k217j460n58n59K640L043j825l002
957a170n16o79Q56N077K172m595m108m21P81L464L385k789l618j59j281J017O724
974D140L23o973q66K315N2M599L363n605l333R34k690K765P321l831o732K341
990a877l72j136O824M13o788J888J619l944N163M420p814k255M514k057J492N207
$$ plain form
1006 5297 101 -3424 1714 -1019 -3443 4490 3234 -4602 -690 2375 -1856 1414 3096 -3812 -2171
1021 -2171 2629 -1591 321 6010 -774 -5497 215 213 -1827 2610 774 -4005 -146 1727 -778 3166
1037 3166 3836 -3026 -2771 2099 1177 1474 2759 -2218 -4260 -159 -210 -835 3190 1381 -4420 -2073 2341
1054 2341 772 408 1444 -1712 -2340 1619 1832 639 2212 -383 -4436 -875 3200 1004 447 821
1070 821 -2580 -2403 1235 -50 -665 1731 -1262 -3267 2532 3811 -528 577 602 -3081 -276 3229
1086 3229 -276 -71 1503 -3893 -3694 3303 1685 -1808 1332 -130 -2999 1637 2706 -1227 312
1101 312 -227 -3986 698 4792 16 -834 1160 -2493 -1379 3882 875 -1787 1143 -1177 -3309 2181
1117 2181 2584 -2506 -1294 -77 -1992 1145 3422 -185 -543 413 -2494 -923 3336 1014 -1572 105
$$ packed form
1006E297n196l525N138k733k424P933j256p836L912L065m231L270J682o908J641
1021b171M800m220J912N689o784m723N712kk040M437j836m779L859J873k505L944
1037C166O70o862K55M870r22K97J285m977k042M101n1o25M025j809n801K347M414
1054B341j569l64J036l156o28L959K13j193J573k595m053L561M075k196n57L74
1070H21l401J77L638j285o15K396k993k005N799J279m339J105K5l683K805L505
1086C229l505K05J574n396J99O997j618l493L140j462k869M636J069l933J539
1101C12n39l759M684M094m776q50J994l653J114N261l007k662K930k320k132N490
1117B181M03n090J212J217j915L137K277l607l58R56k907J571M259k322k586J677
$$ plain form
1133 105 -855 -1396 1846 1521 -1183 -162 -395 -1649 1790 3152 -1105 -2343 -690 -1486 -33 3404
1149 3404 1837 -1073 -431 -348 -727 1379 1502 -1435 -1789 -486 -180 766 1071 -1055 -1958 -487 158 1481
1167 1481 3053 1091 -1579 -741 201 101 1445 1278 -1302 -1313 59 -209 479 1287 -1234 -2373 -126
1184 -126 575 160 1212 67 -2118 -921 836 738 1631 1462 -872 -773 972 785 595 568 -1556 -2257
1202 -2257 -153 575 688 1380 -377 -2404 -634 1244 810 1312 884 -1471 -1265 759 631 128 -98
1219 -98 -1602 -1620 850 1649 1008 641 -909 -2053 -190 1546 1071 838 329 -1364 -1302 322 631 415
1237 415 335 -505 -712 481 488 -102 -95 -864 -1607 -35 1502 961 503 272 -691 -584 878 1112 267 -355
1257 -355 -1034 -943 221 308 -512 -686 -728 -542 882 2086 1027 -335 -394 -414 -50 742 748 -343 -726 -572
$$ packed form
1133A05r60n41L242l25k704J021k33j254L439J362m257j238J653p96J453L437
1149C404j567k910O42Q3l79K106J23k937l54J303L06R46L05k126r03J471O45J323
1167A481J572j962k670Q38R42j00J344j67k580j1J372k68O88Q08k521j139K247
1184a26P01m15J052j145k185J197J757r8Q93j69k334R9J745j87j90k7k124p01
1202b257K104P28J13O92j757k027J770J878m34N02m28k355K06K024j28n03k26
1219i8j504j8K470P99o41l67j550j144J863J736m75k33n09j693O2J624L09k16
1237D15q0q40k07J193Pn90Pp69p43J572J537n41m58k31r63J07J462K34q45o22
1257c55o79R1J164Q7q20j74m2J86J424J204j059j362n9k0L64P92Oj091l83J54
$$ plain form
1277 -572 -63 710 701 -486 -1054 -670 -155 760 1582 624 -1108 -1213 -452 263 1189 1278 80 -977 -673 -292
1297 -292 335 559 -248 -849 -260 408 759 1049 433 -799 -636 454 1133 1379 1023 -437 -1474 -1218 -795
1316 -795 -689 -541 -1236 -1694 -955 219 1019 1478 1117 357 849 1864 2067 1798 1081 -405 -1066 -282 26
1335 26 -344 -896 -1634 -2191 -1668 -1078 -929 -1077 -1512 -1382 51 1752 2650 3198 2876 1613 1155 1558 1596 1087
1355 1087 306 -1009 -1930 -1918 -1974 -2211 -2328 -2567 -2583 -1205 280 590 770 934 1032 1818 3161 3695 3128 2149
1375 2149 724 -47 -237 -1125 -1679 -1609 -2316 -2793 -1617 -1282 -2303 -2018 -1140 -962 434 2479 2455 1967 2352
1394 2352 1965 2115 3215 2465 487 -512 -1588 -2452 -1361 -896 -2436 -2610 -2147 -2330 -512 1649 956
1411 956 225 857 64 405 2813 2485 423 691 295 -1124 478 1595 -690 -1571 -1044 -2145 -1216 1628
$$ packed form
1277e72N09P73rj187n68L84N15R15Q22r58j732j05P61P15R26Q9j198j057L04L81
1297b92O27K24q07o01N89O68L51K90o16j232J63J090O79K46l56j460j037K56M23
1316g95J06J48o95m58P39J174Q00M59l61p60M92J015K03k69p17j486o61P84L08
1335B6l70n52p38n57N23N90J49j48m35J30J433J701Q98N48l22j263m58M03L8n09
1355A087p81j315r21J2n6k37j17k39j6J378J485L10J80J64R8P86J343N34n67r79
1375B149j425p71j90q88n54P0p07m77J176L35j021K85Q78J78J396K045k4m88L85
1394B352l87J50J100p50j978r99j076q64J091M65j540j74M63j83J818K161o93
1411I56p31O32p93L41K408l28k062K68l96j419J602J117k285q81N27j101R29K844
$$ plain form
1429 1628 1095 -289 257 -720 -1193 1218 1900 703 1119 220 -2182 -1235 -169 -2047 -1481 378 -1033
1446 -1033 -1048 1664 1197 300 2533 2273 541 1959 2152 -44 616 1019 -1913 -2464 -1466 -3125 -2899 -559
1464 -559 -1740 -2846 -1140 -1581 -1556 2656 4483 3309 4374 3836 649 1819 3710 1134 191 269 -3730
1481 -3730 -5010 -1501 -1716 -3592 -2239 -3427 -5957 -2646 796 1029 3144 4166 1652 3064 6191
1496 6191 5360 4969 5220 537 -3076 -1692 -2627 -4131 -2150 -3654 -7238 -4897 -2020 -2635 170 2665
1512 2665 -472 -1021 2260 2600 4123 7699 6008 2931 3622 1942 -1146 291 -88 -4401 -5197 -5024
1528 -5024 -6790 -4736 -1456 -2118 -1099 1397 -315 -32 4112 4141 2504 4330 3305 478 2725 4249
1544 4249 1844 1788 784 -4857 -6610 -4165 -4251 -3351 -368 -1447 -2954 -142 1394 1999 4922 3992 -532
$$ packed form
1429A628n33j384N46r77m73K411O82j197M16q99k402R47J066j878N66J859j411
1446a033j5K712m67q97K233k60j732J418J93k196O60M03k932n51R98j659K26K340
1464e59j181j106J706m41K5M212J827j174J065n38l187J170J891k576r43P8l999
1481c730j280L509k15j876J353j188k530L311L442K33K115J022k514J412L127
1496F191q31l91K51m683l613J384r35j504J981j504l584K341K877o15K805K495
1512B665l137n49L281L40J523L576j691l077O91j680l088J437l79m313p96J73
1528e024j766K054L280o62J019K496j712K83M144K9j637J826j025k827K247J524
1544D249k405n6j004n641j753K445q6R00K983j079j507K812J536O05K923r30m524
$$ plain form
1561 -532 -481 1218 449 2576 4798 1606 -1038 -650 -2115 -1973 763 -1281 -4832 -4216 -4082 -3399 1606
1578 1606 5199 2761 1600 1629 -803 535 3441 1428 -981 -318 -1715 -2233 2097 2897 389 26
1594 26 -1844 -4391 -2374 541 -182 318 1572 -1396 -1834 1775 2103 1212 2550 317 -2689 -1321 -347
1611 -347 -469 1865 2118 -1427 -1642 45 -556 531 2332 -201 -2295 -1326 -1473 -529 3146 2971 -234
1628 -234 -797 -1258 -2314 283 2529 925 -277 -904 -2780 -1253 2487 2314 719 558 -1422 -2656
1644 -2656 266 2292 1289 599 -1171 -3294 -1589 1525 1994 1956 1369 -1608 -2606 -171 1288 1285 1480
1661 1480 -603 -3180 -2264 -316 632 1939 2157 -108 -1250 -353 216 1046 1573 -362 -2379 -1735 -724
1678 -724 804 3369 3627 881 -1055 -1688 -2194 -1280 14 -729 -1623 -1295 -856 677 3099 3385 1871
$$ packed form
1561e32N1J699p69K127K222l192k644L88j465J42K736k044l551O16J34O83N005
1578A606L593k438j161K9k432J338K906k013k409O63j397n18M330Q00k508l63
1594B6j870k547K017K915p23N00J254k968m38L609L28q91J338k233l006J368R74
1611c47j22K334K53l545k15J687o01J087J801k533k094R69j47R44L675j75l205
1628b34n63m61j056K597K246j604j202o27j876J527L740j73j595j61j980j234
1644b656K922K026j003o90j770k123J705L114M69l8n87k977r98K435J459lJ95
1661A480k083k577R16J948R48J307K18k265j142Q97N69Q30N27j935k017O44J011
1678g24J528K565K58k746j936o33n06R14J294p43q94L28M39J533K422K86j514
$$ plain form
1695 1871 397 -1372 -2651 -1599 145 684 907 835 -15 300 1662 1712 476 -1372 -3768 -4739 -2996
1712 -2996 -92 2312 3770 3259 1410 444 472 60 -156 -795 -2235 -2807 -1464 875 2946 3748 2479
1729 2479 -158 -2357 -3230 -2585 -1281 -486 -657 -710 206 1903 3747 4342 2929 75 -2456 -3403 -2688
1746 -2688 -1173 174 711 508 411 969 1441 1249 267 -1230 -2697 -2992 -1914 -64 1518 2202 2001 1389
1764 1389 746 401 319 304 -278 -1283 -1682 -1681 -1139 26 1306 1704 1378 694 -90 -589 -523 -522 -748 -1191 -1266
1785 -1266 -662 734 1911 2262 1864 737 -885 -1783 -1502 -1106 -905 -476 -126 117 1123 2145 2355 1617
1803 1617 123 -1680 -2606 -2302 -1423 -421 709 1107 1396 2115 2319 1205 -66 -1410 -2836 -3073 -1858
1820 -1858 -483 780 2168 2538 2146 1694 419 -1368 -1938 -2127 -2113 -927 619 1169 1567 1920 1305 496
$$ packed form
1695A871j474j769j279J052J744N39K23p2q50L15J362N0j236j848k396r71J743
1712b996K904K404J458n11j849r66K8m12k16o39j440n72J343K339K071Q02j269
1729B479k637k199q73O45J304P95j71n3R16J697J844N95j413k854k531r47P15
1746b688J515J347N37k03r7N58M72j92r82j497j467k95J078J850J582O84k01o12
1764A389o43l45q2j5n82j005l99JN42J165J280L98l26o84p84m99O6Jk26m43p5
1785a266O04J396J177L51l98j127j622q98K81L96K01M29L50K43J006J022K10p38
1803A617j494j803r26L04Q79J002J130L98K89P19K04j114j271j344j426k37J215
1820a858J375J263J388L70l92m52j275j787n70j89J4J186J546N50L98L53o15q09
$$ plain form
1838 496 127 -747 -1648 -1618 -1164 -530 654 1423 1202 923 317 -598 -596 -210 -672 -751 -84 221 314 1233 1274 148
1860 148 -562 -974 -1546 -863 753 1293 1397 1302 242 -965 -798 -561 -821 -439 -210 -504 423 1627 1753
1879 1753 1381 464 -1896 -3211 -2188 -1079 309 2409 2602 1280 1042 712 -521 -297 -563 -2824 -3002
1896 -3002 -1015 -146 1640 4224 3368 814 -463 -2001 -2975 -1654 -1025 -1492 -342 707 1063 3455
1912 3455 4853 2946 590 -2189 -5525 -5253 -1951 -357 1292 3314 1809 107 1618 2080 782
1927 782 110 -2192 -4956 -3708 -506 1625 4193 5218 2087 -658 -930 -940 -639 -486 -2357 -3812 -2907
1944 -2907 -1418 1629 5427 5073 1505 -918 -2360 -3049 -1138 951 84 -832 -678 -612 1258 4557 4756
1961 4756 1322 -1942 -4023 -5121 -3453 170 2065 2176 1180 -302 190 2435 3027 1516 -537 -3543
$$ packed form
1838D96l69q74r01L0M54O34J184P69k21k79o06r15KL86m62p9O67L05R3R19M1j126
1860A48p10m12n72O83J616N40J04r5j060j207J67K37k60L82K29k94R27J204J26
1879A753l72r17k360j315J023J109J388K100J93j322k38l30j233K24k66k261j78
1896c002J987Q69J786K584q56k554j277j538r74J321O29m67J150J049L56K392
1912C455J398j907k356k779l336K72L302J594J649K022j505j702J511M62j298
1927G82o72k302k764J248L202K131K568J025l131k745k72j0L01J53j871j455R05
1944b907J489L047L798l54l568k423j442o89J911K089q67r16J54O6J870L299J99
1961D756l434l264k081j098J668L623J895J11r96j482M92K245N92j511k053l006
$$ plain form
1977 -3543 -5751 -3850 140 3176 4718 3256 -269 -1167 356 139 409 684 -2811 -5806 -3094 1014
1993 1014 4090 6626 4769 -898 -3465 -3294 -2876 215 2531 -401 -3303 -2276 -415 3032 6187
2008 6187 4046 -169 -2417 -4836 -4287 1455 3873 1164 -205 -1395 -2842 364 3925 2567 663
2023 663 -1564 -5563 -4628 1369 3905 3160 2565 -904 -3711 -1347 1613 2960 3802 554 -4660 -4549
2039 -4549 -1302 855 3257 3540 -777 -3701 -2814 -772 2972 5736 2115 -3329 -4511 -3479 -1199
2054 -1199 3624 5755 2528 -1403 -3056 -2468 848 3569 1709 -2011 -4056 -4595 -2060 3566 6852
2069 6852 4773 541 -3293 -4617 -2095 1642 2226 569 -1785 -4391 -3624 1679 5634 5120 2125 -2368
2085 -2368 -5649 -3937 503 3343 4637 3052 -1914 -3710 -423 2553 3346 2621 -1686 -6185 -5836 -2461
$$ packed form
1977c543k208J901L990L036J542j462l525q98J523k17K70K75l495k995K712M108
1993A014L076K536j857n667k567J71M18L091K316k932k902J027J861L447L155
2008F187k141m215k248k419N49N742K418k709j369j190j447L206L561j358j904
2023F63k227l999R35N997K536p45n95l469k807K364K960J347Q42l248n214J11
2039d549L247K157K402K83m317k924Q87K042L744K764l621n444j182J032K280
2054a199M823K131l227l931j653N88L316K721j860l720k045n39K535N626L286
2069F852k079m232l834j324K522L737N84j657k354k606P67N303L955n14k995m493
2085b368l281J712M440K840J294j585m966j796L287K976P93p25m307m499L49L375
$$ plain form
2101 -2461 1288 4551 3168 -2274 -4533 -2450 593 4919 7324 3880 -1179 -3115 -3079 50 4242
2116 4242 3385 -1321 -3862 -4555 -3304 1700 4647 2070 -2301 -5859 -7350 -3282 3094 5529 5261 3889
2132 3889 730 -223 2926 4781 3257 -301 -5425 -8601 -5973 -514 3709 5674 3394 -2378 -5864
2147 -5864 -4906 -2389 284 1165 -999 -2254 305 4988 9515 11587 7649 -502 -7052 -9175 -6848
2162 -6848 -1945 1510 1102 -979 -2245 -1503 1507 4163 2568 -2695 -7061 -7667 -3788 3554 9586 10595
2178 10595 7057 2150 -1339 -1346 271 0 -2705 -6146 -7846 -5999 -384 5130 6466 3673 -1412 -5784
2194 -5784 -5852 -2110 2071 4305 3731 1272 -50 1698 4598 5752 3857 -1289 -6636 -8030 -5075 -383
2210 -383 3410 3531 -127 -3628 -3779 -1100 2732 4681 2725 -1180 -3465 -2465 1343 5422 6000 2451
$$ packed form
2101b461L749L263j383n442k259K083L043M326K405l444n059j936L6L129M192
2116D242q57m706k541o93J251N004K947k577m371l558j491M068O376K435k68j372
2132C889l159r53L149J855j524l558n124l176K628N459M223J965k280n772l486
2147e864R58K517K673Q81k164j255K559M683M527K072l938q151o550k123K327
2162f848M903L455m08k081j266P42L010K656j595n263m366o06L879P342O032J009
2178A0595l538m907l489pJ617k71k705l441j700J847N615N514J336k793n085m372
2194e784o8L742M181K234n74k459j322J748K900J154j895n146n347j394K955M692
2210c83L793J21l658l501j51K679L832J949j956l905k285J000L808M079N78l549
$$ plain form
2226 2451 -2215 -4672 -3772 31 3303 2855 -717 -4401 -5620 -3026 1540 4249 3491 356 -2567 -2584
2242 -2584 526 4079 4887 2426 -2048 -5256 -4569 -747 3229 4499 2587 -1149 -3465 -2667 126 2391
2258 2391 2048 -808 -3712 -4156 -1316 3028 5721 4872 883 -3312 -4709 -2628 973 3084 2114 -1085
2274 -1085 -3471 -2635 707 3967 4704 1987 -2383 -4716 -3610 -8 3296 3688 981 -2279 -3362 -1843
2290 -1843 1416 3670 2693 -656 -3430 -3830 -1473 2182 4037 2603 -397 -2805 -2766 2 3015 3623
2306 3623 1662 -1729 -3979 -3248 -371 2191 2871 1426 -1312 -2544 -1135 1369 3087 2425 -621 -3654
2322 -3654 -4236 -2092 1532 4304 3894 965 -1821 -2744 -1350 1122 1999 331 -2143 -3377 -2262 1249
2338 1249 4316 4581 2207 -1266 -3693 -3179 -521 1267 1223 -253 -2047 -2063 123 2837 3891 2627
$$ packed form
2226B451m666k457R00L803L272m48l572l684j219K594M566K709p58l135k923j7
2242b584L110L553Q08k461m474l208O87L822L976J270j912l736k316P98K793K265
2258B391l43k856k904m44K840M344K693q49l989m195j397K081L601K111r70l199
2274a085k386Q36L342L260P37k717m370k333J106L602L304L92k707l260j083J519
2290a843L259K254r77l349k774m00K357L655J855j434l000k408L9K768L013O08
2306C623j961l391k250P31K877K562O80j445k738j232J409K504J718o62l046l033
2322c654n82K144L624K772m10k929k786r23J394K472Q77j668k474j234J115L511
2338A249L067K65k374l473k427N14K658J788m4j476j794j6K186K714J054j264
$$ plain form
2354 2627 -587 -3307 -3428 -1641 835 2389 2067 -27 -1247 -805 534 2011 2104 -20 -2599 -3697
2370 -3697 -2780 -543 2152 2971 1645 -358 -1257 -431 1490 2441 1422 -920 -2991 -3379 -1514 1688
2386 1688 3637 2850 550 -1501 -2246 -1368 215 490 -815 -2079 -2450 -776 2604 4756 3889 1742
2402 1742 -995 -3256 -2975 -920 198 288 147 -810 -321 1927 2895 1889 450 -2064 -4414 -3808 -1583
2419 -1583 579 2977 3312 1520 1010 1209 92 -171 83 -1972 -3548 -2426 -764 1417 4075 3621
2435 3621 1059 -469 -2003 -3351 -1669 378 -8 -14 554 402 1670 2963 1633 -369 -1609 -3330
2451 -3330 -3406 -320 1782 1903 1915 856 -593 -126 250 -629 -648 -803 -2047 -1293 1433 2504 2108 1591
2469 1591 3 -1824 -1982 -1590 -876 629 1234 377 574 1231 670 -45 -262 -1103 -1876 -1378 -492 802
$$ packed form
2354B627l214k720j21J787K476J554l22k094j220M42J339J477R3k124k579j098
2370c697R17K237K695Q19j326k003q99Q26J921R51j019k342k071l88J865L202
2386A688J949p87k300k051p45Q78J583K75j305j264l71J674L380K152q67k147
2402A742k737k261K81K055J118R0j41r57M89K248R68j006j439k514k350O06K225
2419a583K162K398L35j792n10J99j117k63K54k055j576J122J662K181K658m54
2435C621k562j528j534j348J682K047l86oN68j52J268J293j330k002j240j721
2451c330p6L086K102J21J2j059j449M67L76q79j9j55j244P54K726J071l96n17
2469A591j588j827j58L92P14J505O05q57J97O57n61p15k17q41p73M98Q86J294
$$ plain form
2487 802 2485 2381 611 -196 -742 -2009 -1889 -424 -43 29 799 1157 1492 2092 1027 -1130 -1661 -1984
2505 -1984 -2706 -1069 1274 1638 1506 1627 846 315 287 -1196 -2212 -1402 -1297 -1107 1288 2577 1746 1505
2523 1505 831 -773 -891 -1090 -2302 -1557 250 248 865 2595 1996 225 -174 -1023 -1697 -818 -741 -949 615
2542 615 1372 419 926 1426 -130 -1112 -896 -1192 -646 411 111 302 1395 609 -350 429 435 -619 -436
2561 -436 -226 -610 -63 443 186 500 669 -569 -1069 -90 378 462 833 337 -422 -447 -608 -485 479 389 -709
2582 -709 -639 454 760 1063 1239 127 -1326 -1789 -1504 -371 1112 1337 504 480 736 492 470 422 -805
$$ packed form
2487H02J683j04j770q07n46j267J20J465L81P2P70L58L35O00j065k157n31l23
2505a984p22J637K343L64j32J21p81n31k8j483j016Q10J05J90K395J289q31k41
2523A505o74j604j18j99j212P45J807kO17J730n99j771l99q49o74Q79P7k08J564
2542F15P57r53N07N00j556r82K16k96N46J057l00J91J093p86r59P79Oj054J83
2561d36K10l84N47N06k57L14J69j238n00R79M68Q4L71m96p59k5j61J23R64r0j098
2582g09P0J093L06L03J76j112j453m63K85J133J483K25q33k4K56k44k2m8j227
$$ [...]
8191d6
##END NTUPLES=NMR FID
##END=
