##TITLE=1H_LY-allyl Pd240
 CDCl3,8 sc, 
 23.9.2021
##JCAMPDX= 6.0         $$ Bruker NMR JCAMP-DX V2.0
##DATA TYPE= NMR FID
##DATA CLASS= NTUPLES
##ORIGIN= UXNMR, Bruker Analytische Messtechnik GmbH
##OWNER= root
$$ XWIN-NMR		Version 3.5
$$ Thu Sep 23 10:53:39 2021 Russian Standard Time (UT+4h)  she@DPX200
##.OBSERVE FREQUENCY= 200.1314
##.OBSERVE NUCLEUS= ^1H
##.DELAY= (6, 6)
##.ACQUISITION MODE= SIMULTANEOUS
##.ACQUISITION SCHEME= undefined
##.AVERAGES= 8
##.DIGITISER RES= 18
##SPECTROMETER/DATA SYSTEM= spect
##.PULSE SEQUENCE= zg30
##.SOLVENT NAME= CDCl3
##.SHIFT REFERENCE= (INTERNAL, CDCl3, 0, 15.7039)
##AUDIT TRAIL= $$ (NUMBER, WHEN, WHO, WHERE, WHAT)
$$ ##TITLE= Audit trail, XWIN-NMR		Version 3.5
$$ ##JCAMPDX= 5.01
$$ ##ORIGIN= Bruker BioSpin GmbH
$$ ##OWNER= she
$$ F:/spectra/data/she/nmr/H-F/1/audita.txt
$$ ##AUDIT TRAIL=  $$ (NUMBER, WHEN, WHO, WHERE, WHAT)
(   1,<2021-09-23 10:52:05.23 +0400>,<she>,<DPX200>,
      <created by zg, POWCHK disabled, PULCHK disabled
       configuration hash MD5:
       00 E9 B6 7A A2 85 ED C7 34 08 36 98 17 FE 4E 26
       data hash MD5: 16K
       C4 59 9E 34 B0 1F F1 20 CF BC 2B 09 AE F4 7C 46>)
$$ ##END=
$$ 
$$ hash MD5
$$ 20 B8 D3 C5 DC 84 C4 70 42 20 06 92 68 C6 72 B0
##$RELAX= 
##$RELAX= 
##$RELAX= 
##$RELAX= 
##$RELAX= 
##$RELAX= 
$$ Bruker specific parameters
$$ --------------------------
##$DU= <F:/spectra>
##$EXPNO= 1
##$NAME= <H-F>
##$PROCNO= 1
##$TYPE= <nmr>
##$USER= <she>
##$AMP= (0..31)
100 100 100 100 100 100 100 100 100 100 100 100 100 100 100 100 100 100 
100 100 100 100 100 100 100 100 100 100 100 100 100 100 
##$AQSEQ= 0
##$AQ_mod= 1
##$AUNM= <au_zg>
##$AUTOPOS= <>
##$BF1= 200.13
##$BF2= 200.13
##$BF3= 200.13
##$BF4= 200.13
##$BF5= 200.13
##$BF6= 200.13
##$BF7= 200.13
##$BF8= 200.13
##$BYTORDA= 1
##$CFDGTYP= 0
##$CFRGTYP= 5
##$CHEMSTR= <none>
##$CNST= (0..31)
1 1 145 1 1 1 1 1 1 1 1 1 1 1 1 1 1 1 1 1 1 1 1 1 1 1 1 1 1 1 1 1 
##$CPDPRG= <>
##$CPDPRG1= <>
##$CPDPRG2= <>
##$CPDPRG3= <>
##$CPDPRG4= <mlev>
##$CPDPRG5= <mlev>
##$CPDPRG6= <mlev>
##$CPDPRG7= <mlev>
##$CPDPRG8= <mlev>
##$CPDPRGB= <>
##$CPDPRGT= <>
##$D= (0..31)
0 1.2 0 0 0 0 0 0 0 0.06 0 0.03 0 0 0 0 0.0002 0 0 0 0 0 0 0 0 0 0 0 0 
0 0 0 
##$DATE= 1632379924
##$DBL= (0..7)
120 120 120 120 120 120 120 120 
##$DBP= (0..7)
150 150 150 150 150 150 150 150 
##$DBP07= 0
##$DBPNAM0= <>
##$DBPNAM1= <>
##$DBPNAM2= <>
##$DBPNAM3= <>
##$DBPNAM4= <>
##$DBPNAM5= <>
##$DBPNAM6= <>
##$DBPNAM7= <>
##$DBPOAL= (0..7)
0.5 0.5 0.5 0.5 0.5 0.5 0.5 0.5 
##$DBPOFFS= (0..7)
0 0 0 0 0 0 0 0 
##$DE= 6
##$DECBNUC= <off>
##$DECIM= 32
##$DECNUC= <off>
##$DECSTAT= 4
##$DIGMOD= 1
##$DIGTYP= 9
##$DL= (0..7)
0 120 120 120 120 120 120 120 
##$DP= (0..7)
150 150 150 150 150 150 150 150 
##$DP07= 0
##$DPNAME0= <>
##$DPNAME1= <>
##$DPNAME2= <>
##$DPNAME3= <>
##$DPNAME4= <>
##$DPNAME5= <>
##$DPNAME6= <>
##$DPNAME7= <>
##$DPOAL= (0..7)
0.5 0.5 0.5 0.5 0.5 0.5 0.5 0.5 
##$DPOFFS= (0..7)
0 0 0 0 0 0 0 0 
##$DQDMODE= 0
##$DR= 18
##$DS= 0
##$DSLIST= <SSSSSSSSSSSSSSS>
$$ [...]
##$SUBNAM2= <"">
##$SUBNAM3= <"">
##$SUBNAM4= <"">
##$SUBNAM5= <"">
##$SUBNAM6= <"">
##$SUBNAM7= <"">
##$SUBNAM8= <"">
##$SUBNAM9= <"">
##$SW= 20.0188988654967
##$SWIBOX= (0..15)
0 0 2 0 0 0 0 0 0 0 0 0 0 0 0 0 
##$SW_h= 4006.41025641026
##$TD= 16384
##$TD0= 1
##$TE= 0
##$TE2= 300
##$TE3= 300
##$TEG= 300
##$TL= (0..7)
0 120 120 120 120 120 120 120 
##$TP= (0..7)
150 150 150 150 150 150 150 150 
##$TP07= 0
##$TPNAME0= <>
##$TPNAME1= <>
##$TPNAME2= <>
##$TPNAME3= <>
##$TPNAME4= <>
##$TPNAME5= <>
##$TPNAME6= <>
##$TPNAME7= <>
##$TPOAL= (0..7)
0.5 0.5 0.5 0.5 0.5 0.5 0.5 0.5 
##$TPOFFS= (0..7)
0 0 0 0 0 0 0 0 
##$TUNHIN= 0
##$TUNHOUT= 0
##$TUNXOUT= 0
##$USERA1= <user>
##$USERA2= <user>
##$USERA3= <user>
##$USERA4= <user>
##$USERA5= <user>
##$V9= 5
##$VALIST= <valist>
##$VCLIST= <CCCCCCCCCCCCCCC>
##$VD= 0
##$VDLIST= <DDDDDDDDDDDDDDD>
##$VPLIST= <PPPPPPPPPPPPPPP>
##$VTLIST= <TTTTTTTTTTTTTTT>
##$WBST= 1024
##$WBSW= 4
##$XGAIN= (0..3)
0 0 0 0 
##$XL= 0
##$YL= 0
##$YMAX_a= 68521
##$YMIN_a= -100033
##$ZGOPTNS= <>
##$ZL1= 120
##$ZL2= 120
##$ZL3= 120
##$ZL4= 120
##$ABSF1= 10
##$ABSF2= 0
##$ABSG= 5
##$ABSL= 3
##$ALPHA= 0
##$AQORDER= 0
##$ASSFAC= 0
##$ASSFACI= 0
##$ASSFACX= 0
##$ASSWID= 0
##$AUNMP= <proc_1d>
##$AZFE= 0.1
##$AZFW= 0.1
##$BCFW= 1
##$BC_mod= 2
##$BYTORDP= 1
##$COROFFS= 0
##$CY= 11.3945322036743
##$DATMOD= 1
##$DC= 2
##$DFILT= <>
##$DTYPP= 0
##$F1P= 2.36226072786647
##$F2P= -0.459571619588291
##$FCOR= 0.5
##$FTSIZE= 0
##$FT_mod= 4
##$GAMMA= 1
##$GB= 0.15
##$INTBC= 1
##$INTSCL= 1
##$ISEN= 128
##$LB= 0.24
##$LEV0= 0
##$LPBIN= 0
##$MAXI= 10000
##$MC2= 0
##$MEAN= 0
##$ME_mod= 0
##$MI= 1.114404
##$NCOEF= 0
##$NC_proc= 0
##$NLEV= 6
##$NOISF1= 3.799351
##$NOISF2= 2.8
##$NSP= 1
##$NTH_PI= 0
##$NZP= 0
##$OFFSET= 15.70392
##$PC= 1
##$PHC0= -14158.69
##$PHC1= 17.80088
##$PH_mod= 1
##$PKNL= yes
##$PPARMOD= 0
##$PSCAL= 0
##$PSIGN= 0
##$REVERSE= no
##$SF= 200.130013532006
##$SI= 16384
##$SIGF1= 3
##$SIGF2= 2
##$SINO= 400
##$SIOLD= 16384
##$SREGLST= <1H.CDCl3>
##$SSB= 0
##$STSI= 0
##$STSR= 0
##$SW_p= 3612.71676300578
##$SYMM= 0
##$S_DEV= 0
##$TDeff= 0
##$TDoff= 0
##$TI= <>
##$TILT= no
##$TM1= 0
##$TM2= 0
##$TOPLEV= 0
##$USERP1= <user>
##$USERP2= <user>
##$USERP3= <user>
##$USERP4= <user>
##$USERP5= <user>
##$WDW= 1
##$XDIM= 8192
##$YMAX_p= 0
##$YMIN_p= 0
$$ End of Bruker specific parameters
$$ ---------------------------------
##NTUPLES= NMR FID
##VAR_NAME=  TIME,          FID/REAL,        FID/IMAG
##SYMBOL=    X,             R,               I
##VAR_TYPE=  INDEPENDENT,   DEPENDENT,       DEPENDENT
##VAR_FORM=  AFFN,          ASDF,            ASDF
##VAR_DIM=   8192,          8192,            8192
##UNITS=     SECONDS,       ARBITRARY UNITS, ARBITRARY UNITS
##FACTOR=    0.0002496,     1,               1
##FIRST=     0,             0,               0
##LAST=      2.0444736,     0,               0
##MIN=       0,             -100033,         0
##MAX=       2.0444736,     68521,           0
$$ Real data points
##PAGE= N=1
##DATA TABLE= (X++(R..R)), XYDATA
$$ [...]
408C980N822j880n649n567l958p5M724O372K682l428n169l16L409J445l54o22
424A416l840n695M35Q026P984K304l826p427o681k723K436P679P676k14o105l202
440a757K76oJ537K847j544n535k860K679O430N879M97m390n338n512l204M589
456e412Q773L274k299k313k564k672R10L542J502k063l981k027L053N012K111
471D846M84j045n882o571R13O518M700J273j044l627m369j628K883N811K832l523
487B571n069j516O24J751M220L332k231o042l666K022N512L401o68k501m246n006
503g512N49P964P005J12m455n718m422j60L956N363L091k862o118j065M081K975
519B784J528M72n069p554q08N729O481N017L8o331o292k555j97M224O474j00m836
$$ y = [3980, 9802, 7922, 2273, -3294, -7252, -7327, -2603, 3769, 6451, 3023, -2146, -2462, 947, 2392, 2038, 1416, -2424, -8119, -7684, 342, 8326, 10630, 6804, -623, -7304, -10027, -7591, 88, 7764, 7550, 1445, -1757, -1481, -1487, 50, 2897, 1353, -4182, -7042, -4363, 2067, 7946, 8443, 4053, -1285, -6797, -10001, -5412, 3361, 6635, 4336, 2023, -541, -3213, -2303, 1239, 2741, 678, -3303, -5330, -2277, 2735, 4846, 5330, 4285, -1597, -8168, -7255, -737, 3963, 5236, 4192, 565, -3804, -5432, -2549, 3262, 6094, 2571, -2498, -4014, -3390, -1639, 2581, 5913, 3682, -2360, -6026, -4004, 1508, 4909, 4241, 1740, -2506, -7512, -6963, 1001, 8006, 8118, 3663, -2055, -6477, -6637, -2681, 2682, 5773, 2911, -3207, -4272, -191, 2784, 4312, 4784, -285, -7839, -8647, -2918, 3563, 8580, 8618, 2287, -4005, -6560, -6757, -2533, 3941, 3841, -995]
536i95l17K325L82K055K053m121o640k847J320N963P288R31l545j976m109n396
552g629K776P029M0k635J441N06j121J695J015k095j948k983l141L270O164Q24
568C208j93J926k549n430m72J900L59J565J371j020P3K72k248K55L064j485l406
585b810J083Q65j688K437M934K3l098k382k500j044K154K959K076J80l696l664
601d171J731L626J031O01j01l928l912J106M636M151M99m049m527r86R61K553
617g79M908K182m811o436j098L906M874K468p24l108n112l774L417Q086K766l784
633B981l943k809j625L139O108K424k617n397m654J016N822L880M20j468m977
648a700m914K137O183K985k45k742n280k348L140M182L127J037m748o081R02M051
$$ y = [-995, -1312, 1013, 1395, 3450, 5503, 1382, -5258, -8105, -6785, -822, 6466, 7397, 3852, 1876, -2233, -7629, -4853, 2176, 2216, -419, 1022, 1528, 407, 2102, 3117, 1022, -926, -3909, -7050, -3780, 2384, 3208, 3015, 4941, 2392, -3038, -3510, -1610, -1251, 314, 1685, 665, 738, 1010, -1238, -983, 2081, 596, -2810, -1727, -862, -2550, -113, 4821, 4844, 1746, -636, -3136, -4180, -2026, 933, 3009, 3189, -507, -4171, -2440, 1186, 2217, 2818, 2717, -1211, -5123, -4017, 619, 4770, 5269, 1220, -3307, -4293, -3332, -779, 4129, 6311, 1500, -4936, -6034, -2128, 2746, 5214, 4490, 1382, -3730, -7504, -4087, 3999, 6765, 2981, -962, -3771, -5396, -2257, 3851, 6275, 3658, -1739, -6393, -5377, 445, 4325, 4745, 3277, -1700, -6614, -4477, 1706, 4691, 4446, 1704, -3576, -5924, -2784, 1398, 4525, 5562, 814, -5267, -4365, -314]
664c14J328J909J537m607n342J577M366K490J142j667m035j875J78J277M498L147
680E609l730m275R04P26p89K119J785k305k080J33P21K512K242j780j944P42j330
697g40k516J899K854r44p76J396l23j786p02K7R33J599Q7l23R79m63k029P96K102
716B070j366k642m76p4p5K070K887P74j599k694j364J631K548R52p6j079k925
733a438k237J524L409J083k136k938j202Q81K415L806L063j487n260l146J471
748b192L028J969L11k011m119l363P79N157M604l58l314k277p39J040M066M000
764F581r30n180m633j063K477L638J638r64k804l630j001M355N711J400j946k217
780A432k188j058J884K851J57l277m193j485K312L383K046R20r26l384j952K816
$$ y = [-314, 1014, 2923, 4460, -147, -5489, -3912, 454, 2944, 4086, 2419, -1616, -3491, -3313, -2036, 2462, 5609, 1879, -2396, -1492, -766, -1555, 564, 2349, 44, -2036, -1903, -1182, 1330, 3572, 1792, -152, 590, -740, -3256, -1357, 1497, 553, -223, 1173, 850, -936, -1638, -1611, -678, 921, 1008, 685, 1664, 1201, -828, -32, 2070, 704, -1938, -2414, -2488, -2563, -493, 2394, 3168, 1569, -1125, -2489, -858, 1690, 2642, 2566, 1487, -1438, -3675, -2151, 1258, 2341, 205, -2733, -3935, -3054, -639, 3167, 6230, 4743, -517, -3663, -2192, 836, 2805, 3116, 1105, -3014, -6377, -5598, -441, 4163, 3805, 491, -1786, -2525, -1485, 2581, 6581, 5651, 471, -4162, -5225, -2748, 890, 2528, 1564, -1240, -4870, -5871, -1516, 4195, 5595, 3649, 1432, -756, -1814, 70, 2921, 3078, -199, -4392, -5877, -3565, -182, 1864, 2784, 1858, -1526, -3478, -662]
796f62M157J155j217j917k292j675J77J687J220j196k796q40K204K619J620J454
812C698J83k417k737M9J803P95n64p14n63j105j179M23J795O96p99R2J504O89
830A649l70L52Q41n50j883j306j48k77m93P63J947P67j268j169K94O15L57J106
848A227J459l01k292j663N90J280J35n71m39r61j187P35L009K260p08k244j511
865a182m13L80J609K114J72k673k823L5K149J705N24j64j369k156m28K593K945
882C018J29k408k411j079J81J757K907J465j925l307j057J609J988J090J98j233
898I22k619j687J428L190J395j387k065j182l07J107K841K286q10l116k168K05
914a967J305J050O46j20j675k106K52K735K080k00r81q30r84l73J332J964L18
$$ y = [-662, 3495, 4650, 3433, 1516, -776, -2451, -2274, -587, 633, -563, -3359, -4199, -1995, 624, 2244, 3698, 3881, 1464, -1273, -1224, 579, 1374, 810, 96, -467, -1572, -2751, -2328, -533, 163, -636, -544, 960, 1649, 1279, 1631, 2472, 1922, 39, -1267, -1415, -1692, -2185, -1422, 525, 1292, 24, -1145, -851, -236, 121, 1227, 2686, 2385, 93, -1570, -980, 300, 435, -136, -575, -1536, -2723, -1988, 1021, 3281, 2573, 329, -1182, -1595, -1215, 394, 2508, 2680, 7, -2816, -2781, -632, 1073, 1597, 1433, 64, -2092, -2520, 73, 3018, 3147, 739, -1672, -2751, -2570, -813, 2094, 3559, 1634, -1673, -2730, -1121, 867, 1957, 2155, 922, -1697, -3384, -1956, 1234, 2629, 1242, -823, -2005, -2312, -1205, 1636, 3922, 3112, -4, -2172, -1967, -662, 388, 1034, 914, -761, -2867, -2615, 120, 2200, 2000, 1019, 189, -795, -1168, 164, 2128, 2446]
931B446j897k190n48N61M33P62J335Q2j586o36J435J325Q5k42k50q65j272n16
949a538R12J143l68j115j7L37m29J88J741J144o78r69p8J06k96k12M83L34j078
968c90j590Q0J332N81J26P42K04j173r12Q34J535M59q77r74n44q17m56J335J848
987A343k48j719q17L75O83R52J040M02j075k063p48J519J465j70m47m22j461j028
1005b419J403K231P30p82j413q84K39N99Q10J347j02k546j554J269J263K81P56
1022A228M2j741j306M45J393J501K05j584j072J38m13K70K275P90k165j422M80
1039i36L81N80J135R4q42r80j141K85K228P70j358l10K00j343k26K168J097r32
1057H70q63o31m66N76P41K82N91m21j995l74J710N92l10P06o5j625n64R14Q13
$$ y = [2446, 549, -1641, -2189, -1628, -1195, -433, 902, 984, -602, -1238, 197, 1522, 1607, 1365, 1115, 250, -1022, -1538, -626, 517, 149, -966, -983, -646, -1075, -887, 854, 1998, 1320, 351, 273, 379, 83, -129, 354, 688, -390, -1980, -1900, -568, 13, 139, 881, 1085, -88, -1000, -166, 1369, 1828, 951, -23, -567, -1384, -1840, -505, 1343, 1095, -624, -1441, -1066, -383, 569, 1609, 2011, 936, -1127, -1875, -356, 1109, 939, 492, 70, -1391, -2419, -1016, 1215, 1945, 1163, -250, -1134, -895, -296, 514, 1861, 1759, -787, -2341, -1072, 191, 472, 1228, 1270, -471, -1777, -1332, 61, 1562, 1767, 183, -889, -751, -1164, -894, 1381, 2171, 6, -1416, -936, -555, 25, 1160, 1254, 412, -568, -1709, -1424, 804, 1574, 216, -94, 106, -1237, -1463, 705, 1802, 870, 7, -624, -1090, -514, 227, 509, 1100, 679, -1316, -1690, 20, 612, 302, 1008, 943, -682, -1246, -332, 481]
1076D81M54j35r63n31L0k87N85J656M7j667n68N50NJ66R58M67p79j305n49R12
1096d73J091q5k49K13o69j194L80J612P02o15q74l69Mj14L09J270N06j480j191
1115a226N02O32K00N51L01o46r31o01M40J531N15j088m32J69r09j74J837Q95j065
1134E01p14k45m49M67R31J85P2m02j577k62J776N17p16O54Q9j848m30J615P12
1153H76j50n4q75p58M05J47K32J426l5k152l63J413j00j91J298R7j568o49K44
1172g57M08J063K99j117k73L01r73MK055N52j603n19L64l72J23J028L43l96p38
1191b08r16K17J245K24m27M68k20j433p8J537N17m25j69m11o01k1N21O84N11n62
1211D53j184j02O66J54J88O80q1j160p36N74R59J88l76m7q0q02l73J097J076l90
$$ y = [481, 935, 800, -163, -694, -664, -951, -366, 1290, 1337, -330, -898, -348, -343, -177, 781, 1248, 469, -836, -1385, -473, 618, 533, 284, 497, -172, -1366, -986, 626, 1328, 713, -161, -530, -526, -640, -331, 939, 1445, -35, -1226, -724, -92, 108, 659, 960, 314, -617, -1218, -778, 753, 1268, 180, -252, -83, -992, -1166, 671, 1566, 501, -213, -458, -907, -440, 491, 676, 748, 346, -1231, -1493, 283, 800, 84, 738, 827, -1021, -1451, 164, 876, 726, 672, -203, -961, -556, -409, -177, 1249, 1214, -938, -1301, 112, 12, -179, 1119, 1216, -352, -1001, -757, -349, 714, 1013, -104, -377, -76, -1049, -1045, 1010, 1562, -41, -560, -196, -568, -445, 583, 926, 530, -208, -1124, -907, 338, 562, 135, 603, 383, -1050, -1128, 409, 926, 501, 332, -79, -680, -701, -180, 504, 1015, 453, -731, -833, -167, -13, 175, 855, 774, -386, -1122, -548, 411, 599, 223, 176, 96, -706, -1079, 18, 1094, 704]
1231G04q57k65Pp9K61P51N30o48j252j33Q52L47j6M27k2r77o08M32Q34N53k09
1252F32p31k29J2m13L43J367J07j341n30M59k3J15Q23L32o50p84l66N13Q23N2
1272E11l72Q2k02j051K41J410L16p35k92r9m23J81N14N23K00o73j020J38R10L1
1292A90j02N56k09j207k39R82O31p9k58l08k51k11qP24Q22m38j104q4M31j41J49
1313a54Q29J24r24o85J94O22M30oj18j07n30n90N02J074O4o96k10M8l32o7O99
1334A67O43k61q19l29L48K92k0K75L53m78q98J6Q34M00k46j37J0l80m39L46Q72
1355E49J81o49m63R2Q3r9L56O27q7q86m72M60N40K5qJ83l22q06j13Q38O24k11
1377D42m24j22j53k97K17Q37M10o26p90L9L60QJ45N28J0q56n70L98O99J87j13
$$ y = [704, -153, -418, -411, -490, -229, 522, 1052, 404, -848, -981, -129, 218, 202, 629, 607, -370, -978, -546, 288, 841, 632, -99, -328, -316, -729, -386, 981, 1088, -253, -783, -324, -347, -232, 591, 923, 273, -511, -877, -364, 459, 511, 139, 221, 19, -1032, -791, 619, 935, 200, -92, -191, -614, -433, 81, 604, 804, 131, -889, -751, 159, 190, 88, 644, 435, -772, -1011, -29, 602, 523, 265, -43, -294, -505, -513, 211, 1033, 595, -509, -593, -162, -303, -154, 675, 799, -125, -810, -616, 6, 436, 430, 312, 205, -325, -915, -413, 661, 725, 29, -181, -133, -465, -532, 167, 810, 549, -270, -599, -251, 41, 21, 296, 649, 171, -727, -711, 123, 523, 277, 140, 150, -230, -669, -323, 549, 730, 81, -382, -290, -207, -306, 50, 677, 590, -296, -768, -308, 232, 257, 249, 432, 110, -696, -809, 29, 653, 442, 18, -104, -257, -554, -337, 500, 910, 284, -506, -467, -107, -99, 46, 574, 584, -272, -842, -444, 255, 442, 329]
1398C29m1j66n47k63O54P54j69o85j69J06j48O6O34L99n31p58m4M99K72k9J39
1419C02Q3n14o14K69Q08J82l66j76jk77j59M73O61r6p41l89K30J86mL16M46k87
1441C32p50j35N89L82j22r7K0l26n40P8P60L59m20m03O1oj54L59O72J39o35n27
1463c64J41K98m2p1K45j43p02k72O34O57Pj34M0j37l25l6N45M71l91p42j44J67
1485b98j49K0N47K22n22l94K94N88K83k2K0n6n46n94K51O17j32n64m6J18j67J03
1507d27O01M77q0m85k25L25K56k12jK11n12q42R8O14J00r8J38J15o1m1K07N65
1529G23K69o13n92J64om70K08N67k19o14K0L14K41K35J39R7K2m57l77M82M63m46
1551A50m01J47k32m74K44O47K74q9k75j15K04R3j28K94K91o77o84L46M70j36K2
$$ y = [329, 288, 122, -425, -688, -34, 720, 551, -134, -303, -197, -345, -279, 355, 754, 223, -535, -579, -80, 192, 163, 302, 385, -129, -743, -474, 334, 516, 150, -26, -27, -304, -463, 10, 671, 575, -166, -555, -325, -139, -143, 173, 619, 332, -418, -553, 36, 418, 296, 199, 219, -107, -647, -569, 191, 550, 130, -273, -212, -218, -372, -13, 659, 798, 163, -364, -223, 75, 33, -38, 207, 64, -638, -910, -276, 381, 388, 254, 294, 157, -168, -204, 341, 812, 421, -321, -465, -298, -447, -427, 120, 342, -180, -574, -280, 308, 591, 569, 589, 533, -13, -607, -356, 261, 129, -435, -481, -363, -530, -427, 174, 651, 571, 86, -139, 186, 442, 230, 229, 440, -72, -914, -816, -202, -102, -200, -62, 53, -8, -49, 158, 723, 992, 379, -213, -49, -55, -525, -317, 250, 31, -583, -563, -249, -8, 227, 366, 463, 485, 28, -349, 133, 596, 150, -251, -104, -336, -810, -566, 81, 355, 266, -9, -124, 80, 173, 45, 339, 630, -47, -731, -385, 85, -51, -29]
1572b9K95j58m49j12M25N31M3m74k29O5j97j04N60L76m22n08J7K97K72J56P9k9
1594D05m55o05J23O90J56l66j46l8k02N1N10O10J21n93n14K27J79k79J38L52n60
1615a96p75K35N87J98J83J22j63q0n4JN05L92o69o34J66r9m77K52L97k40j48K42
1637b55K33M89M24k90j57K58n27o87M70L39p63l01M96j15l22L91L43O2K15L2l3
1658C02M49P2n76J7K33p55o63L13O0l01L55N62O7J18O5j38L05L57l97k65K82m05
1680E7p72K82N31l42m10R9K0OL67N25N07J34n40m13K41M7l92n5O7n52m95L21O59
1703a08L68Rj83j13j0L5L01N32K1o74n26M1J59K2k3K6k13m17qQ14P42q1k68o3
1727C83l33l62K42M60n1m53m40r6L77L13L7J80J9o32l27O85N99j21r2q4l95k47
$$ y = [-29, 266, 108, -341, -453, -28, 503, 546, 72, -157, -92, -289, -393, 167, 543, 121, -387, -370, -73, 199, 355, 434, 405, -50, -655, -532, 158, 314, -52, -198, -236, -438, -387, 123, 733, 854, 261, -253, -26, 153, -126, 12, 364, -196, -971, -736, -149, 49, 232, 354, 191, 111, 57, 58, 563, 955, 286, -348, -182, -281, -758, -506, -109, -349, -497, -255, -22, 467, 891, 601, 444, 702, 175, -512, -42, 297, -466, -767, -271, -386, -708, -317, 26, 88, 303, 335, 302, 751, 823, 247, 264, 497, -258, -921, -608, -548, -849, -494, 68, 135, 253, 318, 180, 485, 842, 445, 180, 462, 57, -715, -433, 98, -244, -654, -555, -535, -529, -162, 363, 870, 1004, 464, 51, 292, 339, -53, -108, -41, -593, -1088, -767, -108, 260, 269, 86, -27, -37, -2, 299, 831, 852, 178, -348, -307, -148, -126, -149, -123, -336, -753, -761, 53, 795, 714, 446, 383, 50, -312, -70, 390, 339, -114, -554, -650, -273, 40, 77, 257, 276, -356, -683, 2, 601, 480, 388, 304, -91, -338]
1749c38Q4J59J80m7n25r1O36K25k02L22J65o74m15M25K66p7K9r6j27Q9p5p6L34
1772A71L9n74j4N77J7k49K68R8l91j41J46L0Po3j59K13L01k29j68K98m7m61J24
1795b07M47r4k88M7J03OO3M2J0k7l14j94M02L86k19k28J07r3k41J85M65M2l93
1818Gl50K0K73J67N6J05p4m57k50L93M50m7k84j20o8j12J44M82K42l81n43j00
1840d47K31J83J45J64n5l66k67K58N30J16l47k76r4j63N7M97L84k37m80j43J43
1861a67J82Q9O6Mk18l21J48N59K08l30k75j04k46j10L51M37K8k86j36J67J70l5
1883A81j18Pj66l66M7N06K93j53j51j0j53k53K1K53J47p0k1K66K24j74k66k9j41
1906a26l34r2L70L33K3jJ59L2k57k92m3N0q9L4L88L43j29k76p0o5k50j64J39K41
$$ y = [-338, -254, -95, 85, 38, -487, -578, 58, 283, 81, 403, 568, -106, -521, -96, 170, 93, 122, 26, -101, -12, -87, -163, 171, 210, -364, -378, 199, 216, -33, 235, 333, -58, -199, -53, -23, -16, -79, -238, -25, 276, 47, -121, 177, 130, -331, -207, 240, 146, -142, -95, 8, 14, 77, 119, 129, 102, -212, -406, -4, 382, 163, -65, 42, -51, -292, -107, 358, 400, 7, -343, -323, -50, 117, 173, 278, 204, -253, -503, -110, 340, 293, 9, -111, -179, -291, -147, 335, 577, 196, -347, -447, -216, -33, 112, 276, 221, -145, -412, -154, 376, 492, 145, -131, -225, -388, -331, 166, 550, 313, -167, -310, -167, 15, 104, 170, 174, -44, -365, -217, 342, 550, 220, -55, -159, -405, -515, -164, 273, 301, 15, -121, 46, 216, 181, 63, 70, -96, -462, -415, 91, 384, 231, 80, 70, -83, -336, -315, -62, 85, 15, -6, 260, 484, 310, 44, 15, -126, -460, -552, -182, 151, 174, 173, 332, 364, 107, -185, -228, -178, -267, -233, 155, 498, 369, 93, 23, -42, -292, -456, -317, -76]
1930g6M7M1L09K89j27m43k45j01j67JL82M25K0k27n4O4r7k13k7P8o9q7K92M86
1954E01R5l25k88j57j97j15K61L77J13k00p7J46P6j46q7K4j65k43J10M26K43j03
1976B69j73o0j34j86O8K87J15k25j52J55J70k5J7P4j01l00j47K26K33pq8O4N5
1999A35j59o4J93J11k32k17M7J24M0N4J81J08j83l00l3J39n2q3J56J70q9q3J38
2022A01J46j31k33j07L4QrK15L49ml16j36N3j21j21J88K03l8j17N1J60O0j73j56
2046i4J6o5j60J62L88R8k22j43J3q2q5J12J64Oj75r9J60J57q9p7M9l7j85M0K46
2071I8J30j75j76lO7j6M2K00Q2k20j84Q9Q0p7n5J12Q0m2rJ53P0k37k94N0J54%
2097h1L5K75J06j57j35k2n2j37j90J5K81K01J9J32J13l08l97OJ75k2M0J19J40
$$ y = [-76, -29, 12, 321, 610, 483, 40, -205, -306, -473, -472, -90, 335, 355, 128, 74, 138, 41, -172, -199, -121, -190, -277, 15, 501, 596, 271, -17, -174, -371, -486, -225, 152, 265, 65, -12, 134, 210, 64, -23, 1, -164, -407, -297, 129, 372, 269, 96, 36, -98, -284, -216, 71, 186, -39, -191, -36, 134, 109, 126, 200, 99, -201, -348, -122, 111, 104, 16, 80, 135, -24, -88, 105, 216, -16, -233, -186, -62, -22, 32, 213, 321, 138, -162, -195, -56, -108, -191, -35, 135, 46, -37, 101, 247, 116, -117, -224, -190, -182, -191, 24, 373, 369, 53, -83, -30, -151, -272, -84, 119, 81, -36, 15, 175, 235, 62, -94, -78, -143, -303, -141, 247, 345, 123, -20, -7, -89, -174, -62, 102, 108, -67, -166, -6, 151, 62, -15, 34, -3, -188, -148, 98, 228, 53, -123, -126, -59, -75, -33, 167, 249, 29, -155, -66, 14, -63, -118, -6, 74, 32, 23, 176, 246, 9, -285, -235, -81, -81, -46, 229, 335, 178, 43, 21, -31, -168, -358, -343, -62, 139, 158, 290, 403, 95, -302, -296, -121, -143, -103, 16, 156]
2120A56P4Pp2k0j67m35j63L65L24J06K23J35l26l38jM5l1n0q8O4K59J65Q6J42
2144D60k02o01k63K59K56J63K73L8k43j77J0P3O9k06l73k1L21J93K44L76j13o26
2166i0l52R7J90J20J16np2n3K8K53K19k79n23j44J60J64L10L57jl72k95k8J73
2189b7J11j22j53j7N9J33L33K52k17m98l06K5J99K12K13P6j87k23Q6K73Ok50j89
2212b11j18%K07L74K33j18m18k71Q5J59J9P9Q8j37j28K55K95m6k88k80j58J18
2234b61K29J50J67om02k45L41K91j30j17n2j63n1K76K81L7k50m13j41L25K69L3
2256A68Q4j18m42j24M16L25Jj30k52k43P9K60J62N7j89m02m7M45K91J0m4k95m71
2279d59n7M34L82O5j76l03j23J51J79J63M9l62m88O6N37L32N4j22l59m71o7L72
$$ y = [156, 230, 237, 165, 145, -22, -457, -620, -255, 69, 175, 398, 533, 207, -131, -132, -87, -118, -168, -256, -192, 67, 232, 318, 460, 258, -343, -606, -347, -91, 72, 345, 383, 140, -37, -27, 46, 115, -91, -464, -485, -164, 29, 273, 649, 536, -90, -442, -345, -155, -35, 81, 76, 4, -49, -21, 232, 451, 172, -351, -495, -335, -171, 139, 496, 495, 123, -172, -200, -27, 84, -38, -191, -208, -149, -16, 317, 569, 352, -146, -452, -427, -228, -16, 197, 273, 86, -137, -51, 222, 228, -22, -211, -329, -329, -122, 252, 485, 367, -51, -322, -237, -78, -59, 20, 108, -29, -157, 98, 393, 347, 59, -221, -379, -261, -32, 118, 285, 279, -123, -368, -27, 264, 134, 17, -35, -198, -249, 27, 308, 345, 95, -318, -459, -134, 135, 168, 252, 134, -308, -432, -16, 309, 310, 180, -72, -315, -236, 24, 186, 243, 54, -348, -395, 50, 341, 351, 307, 12, -459, -516, -82, 300, 365, 189, -114, -237, -86, 93, 256, 305, -57, -545, -479, 58, 390, 444, 322, -37, -508, -575, -203]
2301b03M35J61k27k94k5K06J50Q8k9l59m77l0M61M69J01j86k67k40m7K64L66Q8
2323D05l00l25RK30J91O3j32l29l42K0M36M21J9k26k09r7P0L04K62r8m03l71o9
2346d71K47K38N1o1j14j83P4M47L27j66l83k23l9J42L17K08q4l77m11o5L26K00
2368@n5l2M5L1K09M29J88l83n99m19l1K86L41J91L5k07k81K1L22J34k28k05l2
2391b40J38L61M41J24m01p07n35l4L55L79K12J18q1j35J58L21L3l94m25k01J22
2412c91L87M55J90k53n97m69L4L51K79J28O8m7n1J88L22Qm53n96k78J10L80M14
2434A79K62j19m10l09J27L52J66q7j38j09k5J85L25P0l47n30k32J64L29L17J75
2455C45r0k91j86J49L41J29j97k84j46k7J48K63J61k21l73j18K11L09J61lj76
$$ y = [-203, 232, 393, 166, -128, -153, 53, 203, 291, 262, -97, -574, -604, -143, 326, 427, 241, -26, -266, -313, -49, 317, 405, 105, -220, -211, 19, 210, 273, 141, -188, -530, -510, -74, 347, 366, 140, -69, -166, -96, 208, 470, 372, -31, -402, -471, -224, 14, 65, 4, -110, -293, -219, 228, 555, 389, 6, -217, -256, -114, 203, 411, 327, -50, -461, -526, -200, 0, -55, -87, -42, -11, 198, 627, 815, 432, -167, -586, -617, -331, 10, 201, 236, 29, -252, -231, 91, 225, -3, -208, -240, -102, 259, 700, 824, 423, -284, -819, -853, -498, -119, 93, 211, 130, -5, 153, 474, 507, 113, -312, -513, -391, -4, 451, 641, 388, -209, -678, -644, -293, -14, 114, 182, 135, 84, 272, 594, 602, 149, -447, -725, -615, -235, 179, 441, 322, -88, -397, -270, 82, 248, 161, 23, -86, -111, 74, 399, 469, 122, -408, -640, -476, -147, 170, 345, 255, -36, -222, -73, 268, 397, 200, -84, -230, -257, -109, 154, 315, 94, -279, -397, -186, 123, 284, 281, 105]
2476A05k57j30J66L36J38k32k68j07N6J16K02P3j94k78l3L03L15P1j87k35k15
2497b55r4J74L51J24k00k51k9J41J59R8k5k36k75k2L23L38M7k09k38j45l4J69
2519h9K79O1k17k55J0K18J99M4j04k16k48n5L04L23M7k43k04m6O4J94K02Pk87
2542a2l12k1K88K60M8j00j68k02j8K46K60qk56k33j8J76K08J76rk54l34n8K44
2565i7K28L9q7j09q6J4J76J93m6k99k57J3K14K05J39L8j95k55m5J74J58l3j52
2588g0r0J8J01J68J63j8l12k56L8J94J53Q3oj07j43rJ51J31q6k39j32Q0J28J51
2612I1J62Jk21j81K1J30O8l7r2o9kO2J82J52j06k71j21O6R1J04J17pj34p3O8J29
2638A30L1j60k17o1P2J03K44K10q4k60j18K9M1L4L4m4m2rR1K14M2k17k53r2L6
$$ y = [105, -152, -282, -116, 220, 358, 126, -142, -249, -193, -77, 125, 198, 4, -274, -307, -4, 311, 382, 195, -40, -255, -349, -175, 176, 300, 100, -151, -180, -39, 120, 218, 193, -43, -318, -340, -17, 321, 368, 159, -79, -224, -258, -89, 190, 251, 34, -221, -211, 7, 206, 250, 146, -70, -318, -373, -69, 254, 301, 58, -146, -192, -128, 66, 268, 275, -12, -324, -345, -57, 203, 251, 151, -17, -219, -237, 9, 269, 261, 5, -228, -246, -70, 138, 314, 305, 51, -283, -341, -97, 131, 170, 83, -26, -112, -98, 78, 271, 225, -74, -331, -318, -104, 101, 240, 278, 83, -172, -217, -43, 115, 82, -70, -160, -142, -41, 127, 290, 272, -40, -296, -258, -64, 89, 172, 166, 59, -84, -93, 58, 189, 103, -136, -268, -188, -60, 91, 253, 254, 33, -148, -127, 3, 71, 34, -58, -127, -129, -67, 115, 267, 161, -110, -231, -165, -74, 30, 147, 140, 6, -67, 1, 130, 161, 1, -216, -277, -205, -102, 142, 352, 268, 8, -110, -81, -40, -6, 28, -16, -58, -67, 24, 238, 280, 63, -190, -282, -246]
2663b46R2K12K18jj85j30rN4l4r1l4MN4J23K03R3j84k61j06K7P4J22J71K9j11
2688H4j08M6L9n5r3o4oN0J29J96Q3j27k20j25K6M1O0J33N6q8r0M1N1n9p2l3K0
2715h5M6M9P9J00n4k16r1R4L6l5R9R8n3o7J6J3m4n4n7P1J43J2k4M4n0j82m4J06
2743e0M6ON4L5j9j8l1n4rl9p0R3J65Ml3L9p4j69k7Q2L7RM8N5J8k1p5m4j4q9l0
2774a75J53J46k0l1L3m0j38n0L3N4J5J3L6R8J0j05o0K8n6q9P6J42M1p0J0Ro3j01
2802a01nP3L0j3L1N4Pr2k8M0J1m7JN5qk3J0M2k3n3j3K3K6L3J5J5k0q4n0P3Q0l0
2834B9k4N6k9q9J0Q7j1n4j9O5O0J3l8j4l1j32o9J28J37nl5J9j9o4k2K2J5k6n8
2863i8K4J31R4m6n7k5j30j21J15J51M1npk6l2k1%Rm5o4J1J41R0j8j8m9j35p6O1
$$ y = [-246, -154, 58, 276, 275, 90, -40, -49, 5, -29, -120, -154, -150, -96, 27, 230, 323, 139, -122, -228, -201, -127, -5, 166, 195, 84, -24, 22, 61, 6, -87, -151, -157, -107, 22, 218, 301, 174, -46, -171, -145, -104, -44, 89, 145, 57, -33, 8, 59, 0, -72, -105, -85, -39, 10, 89, 189, 135, -81, -172, -78, -42, -77, 22, 120, 67, 0, 16, 29, -15, -69, -126, -55, 88, 100, 76, 120, 70, -112, -156, -50, -4, 2, 56, 91, 72, 54, 23, -31, -40, -79, -149, -56, 109, 113, 80, 119, 45, -124, -151, -69, -32, -23, 25, 80, 98, 77, 2, -42, -56, -145, -175, -22, 124, 104, 73, 106, 66, -72, -122, -89, -35, -20, -7, 29, 127, 137, 32, -28, 0, -56, -145, -69, 73, 114, 44, 54, 63, 0, -101, -106, -33, -3, -16, 15, 69, 76, -16, -44, -4, 7, -40, -39, 16, 8, -15, -5, 37, 14, -39, -52, -29, -3, 30, 45, 60, 40, -44, -94, -21, 59, 29, 5, 61, 32, -57, -47, 40, 29, -25, -44, 21, 81, 94, 56, 42, 11, -121, -190, -62, 75, 70, 35, 54, 35, -29, -51, -29, -14, -40, -98, -74, 57, 151, 105, 48, 23, -107, -228, -113, 38, 79, 74, 67, 41, 9, -12, -12, -3, -48, -112, -101, 40, 130, 112, 94, 45, -90, -166, -105]
2892a05J09M5j7J8rNk4j9Qm0j06JJ31R9k7j2rq4q9L7J06K3n7l0M3O0lk5J8m5j03
2923a01k6J25R0j7n0k5ol4K0P5Qp1p5L5P9L2j8lj5p9m9R3J04m1p8l0K1K0J8O2
2953F4Rr8p9J9J12M8l5l9j5m4k2R4J06m4j18l7L1N5L4N0j3r3r9K0J35Q0m1o7n0
2982c7l6pQ9J09j5j29p1K9P8L8K0j3r1q5KJ48J01m3q2m8k4mO3R4j0j05p5N4Q9
3011C9L8k9l9o7q2K9J58J18m6r1n8mKN5M9j2q8q5N3J19L9m1m6o6n3OJ33J12j9
3040A24j03n2OKkK8j8p0m8O8J41L2m3n5l2l0PR4R0n2j25n9N4N0j6j3j6n2lR2J48
3071A47N1p1j18l8rJ7N3N4n7j38m9P5R2K7k0j0k2j8P4J21K1j20j36m2K8J8N9L5
3099B4m0j05j2J06J20L2n8k9qk3L5R1Pj52j58j5P9P1O4N1m5o8k6Q5J20K6j06p1
$$ y = [-105, 4, 49, 32, 50, 41, 46, 22, 3, 11, -29, -135, -134, -3, 96, 69, 57, 48, -36, -125, -88, 18, 41, -16, -46, -3, 57, 54, 29, 47, 2, -101, -127, -2, 88, 71, 21, -4, -10, -44, -24, 51, 59, -12, -87, -52, 27, 59, 41, 38, 23, -56, -105, -12, 92, 51, -27, -57, -36, -16, 2, 64, 73, -25, -104, -85, 27, 75, 40, 1, -14, -58, -80, 14, 120, 76, -42, -79, -48, 7, 41, 91, 78, -15, -114, -94, 41, 121, 80, 13, -37, -73, -80, 9, 118, 103, -26, -97, -68, 10, 48, 68, 55, -36, -121, -119, 29, 130, 87, 5, -43, -67, -71, -8, 86, 76, -29, -104, -50, 39, 77, 48, 9, -58, -140, -111, 47, 165, 119, 28, -30, -34, -32, 23, 72, 60, -28, -113, -60, 59, 98, 57, 11, -55, -108, -102, 31, 143, 124, 21, -31, -25, -23, -25, 3, -15, -85, -133, -65, 76, 108, 65, 10, -22, -52, -45, 49, 139, 87, -38, -97, -43, 7, -9, -22, -38, -90, -93, -1, 147, 198, 127, 9, -29, -38, -21, 32, 86, 29, -109, -158, -83, 9, 36, 16, 6, -16, -34, 40, 161, 182, 62, -74, -116, -88, -70, -11, 24, -16, -121, -133, -27, 93, 125, 67, 38, 30, 7, 42, 133, 140, -12, -170, -185, -106, -35, 29, 80, 35, -33, -59, 26, 146, 172, 66, -5]
3127ej6j8J1P3Pj15j26pJ05J08O8K9k5n5p3L4J03nj13o7OJ0K8O9L3q5q6oJ22J01
3157A05K8j7k3o4o6J5P7nj17n5L3O9M3M3J0n5q9k5J03Q9j4m8m6j9m9J9O2J1o7
3186e2o0N9P5M3nK1o2r9JO7O7po2k8K6Oj1N1L4p7p1O9R3J3m0l0m4m8j2Q7Q0Mj00
3219a2m6N7J7j4L7Lq8p5N0R0L1j5o0l7QlM7Q9K6j18m0L7J6j3J4J1p0m2M6Q1N2
3250G9Kq0k2J5oK6P9j4j02m7M1K9j7RJ2l1m0L3Q1P5n1q6mJ3k0KN5mp9n9N4N5J1
3283ImLjj2j4M3O9j8r5j8K8Jk7L8J5l5k9K5O7J0l1j1Oqj1J6K1k1o8j0N4J0l1K4
3317eL3n0l2N4M3j7k3k7qPjJ3M1j1o8l4Q6L7n5QL2l0k6K4L8K3l7m8LN6j9j4L9
3350C2K3q8l1Q9K3l8j9Rl0%K4J9K9k5o5RN6Ql8K6No9qN5K8l1Lj3k3J8OK3M4k6
$$ y = [-5, -21, -39, -28, 45, 52, -63, -189, -196, -91, 17, 85, 114, 89, 34, -39, -5, 98, 93, -20, -87, -81, -71, -43, 26, 59, -26, -112, -118, 4, 105, 133, 116, 93, 29, -37, -22, 55, 50, -67, -122, -89, -20, 23, 66, 76, 21, -68, -93, 10, 99, 85, 37, -9, -28, -77, -58, 4, 15, -52, -112, -53, 22, 65, 60, 81, 19, -80, -79, -12, 55, 48, -14, -42, -16, -10, -21, 30, 64, -13, -84, -15, 78, 91, 51, 21, -23, -71, -83, 4, 84, 88, -12, -58, -1, 16, 2, 39, 42, -46, -121, -71, 19, 50, 35, -25, -62, -54, -57, -10, 79, 105, -13, -53, -16, 0, -13, 1, 12, -58, -100, -54, 27, 79, 81, 1, -21, -6, -12, 14, 93, 79, -23, -70, -29, 0, -17, -8, 4, -27, -67, -34, 47, 122, 71, -15, -19, -6, -26, -24, 31, 27, -52, -111, -57, -2, 9, 5, 8, 7, -5, -19, 24, 93, 75, -20, -38, -10, -9, -36, 2, 17, -18, -47, -22, 45, 55, 24, 13, 19, 11, 0, 16, 37, 16, -52, -62, -8, 2, -29, -5, 28, -22, -54, 0, 43, 26, 3, -24, -32, -25, -26, -13, 28, 17, -51, -85, 1, 38, -17, -9, 23, -7, -33, -9, 29, 52, 15, -33, -30, 26, 7, -7, 32, 55, -33, -64, 25, 48, 10, -9, 0, -30, -30, -6, 13, 42, 17, -48, -39, 17, 25, -13, 13, 18, -51, -59, -4, 24, -7, -4, -17, -40, -22, -16, 7, 51, 25]
3384B5o2KN7j8k9L5J5m8k5K7N6Jm0JK0jl0RN4j4o5JN1jn4OM2k6l2PL7K4l6k3K6
3419hK0k3k8M9J2m7j6N1J3k9k0M4Ol7NL1kk6j1J2J8k2j5L3K4l0l0M7Rm3j7M8P
3452B5l4%PNj3k1L4J7j7m2K2M2k5m0L3K5m2k1J7L7qk6K6J6ol8J5M6nn1MM7j8m8
3486c7K8L7ql5lK3K1k9pM0rl2j0L1nl5PK8Nl2LL0Mm0lK2K4k0j6L1Lm3j3K8K5k2
3522ik8M3Nk2jL4J4l2k9K7K1k5mK8K0l6l8K0J8j3j3K3L0l9k4K7K2j9l2K7J8k8
3554a5k8L3L4j5m0QK0j0k4K8L2kl8lL3j3k1LM1j4l0J5L7nl8JJ8rj3QL0Ol6OJ9
3589A8%m6lL8pj9mM9Nn0mK0Kl4KL5J8l9j8K5J5k2pL0J1l4KK8K2l2k2J6J6k7j8
3624c4L0M0k8k7K5K0l6mK1K4k5j1lK7rl5K1K1k4l6K9L6j0m2K3K0j9l1J1M5k1l1
$$ y = [25, -37, -35, 22, 4, -25, 10, 25, -23, -48, -21, 35, 36, -4, -3, 17, 16, -14, -5, 49, 35, -30, -29, 22, 21, -33, -27, 15, -11, -43, -36, 1, 25, -11, -34, -8, 12, -11, -39, 10, 22, -25, -41, 10, 23, -6, -26, 18, 24, -13, -8, 23, 21, -5, -16, -4, 14, -8, -23, 10, 34, 4, -26, 21, 30, -13, -30, 18, 25, -9, -9, -2, 3, -10, -31, 3, 20, 3, -39, -17, 25, 0, -40, -7, 18, -24, -45, -28, 9, 1, -25, 1, 17, 11, -27, -12, 34, 29, -22, -18, 29, 11, -37, -9, 28, 20, -15, -18, 5, 26, -3, -10, 30, 21, -11, -21, 10, 5, -30, -23, 5, 10, -22, -19, 11, 15, -25, -28, -6, 18, -2, -18, 13, 16, -27, -40, -12, 13, -9, -37, 6, 11, -11, -12, 22, 36, 4, -25, 2, 23, -2, -6, 22, 42, 6, -32, -12, 6, -7, -20, 3, 33, -6, -30, -3, 19, 0, -32, -5, 13, -15, -43, -10, 24, 9, -31, -23, -3, -13, -37, -9, 23, 21, -17, -20, 13, 0, -21, -18, 23, 9, -21, -6, 31, 26, -12, -11, 7, -2, -15, -7, 23, 29, -7, -1, 18, 18, -28, -31, 7, 0, -19, -23, 26, 31, -19, -23, -3, -1, -35, -33, 2, 20, -19, -37, -12, 3, -19, -26, 4, 15, -19, -17, 11, 33, 1, -21, -5, 11, -16, -34, -4, 36, 8, -19, 6, 26, -10, -14, 7, 31, 6, -5, -8, 19, 10, -25, -4, 17, -7, -43, -14, 22, 12, -30, -7, 13, -6, -37, -26, 19, -2, -33]
3656c3LK7Pk9J1K2Nl3RM3j3l2oL5ll3J3L3Ml4%K3Ol3KJ1J3k8j4L9J2m3rK7J3m2
3692b7ML8Ok8k1K7J9l3k7L3K4l1j3L6Nm0j3L9K5j7j7MJ9j2j1J7L2k9n0K2M1j7
3724Ej1L5ol0k4K0K9j4j1j7J9j3j9L3L2k2n1J1M7k3pJ0J4pk6jM0J9m5j8L1Ok2
3757a6K3M1l1m8oM5Mj7NJ2Pl0JM3K1l9m9K2K2k6JL5jm8pK7J7j4mLK1k7pL9Pl0
3793dm9NK2j5QL9Ql1lL7J7j7k2LK1lk6J6K8l8n0K2M0j2j6M1J7l1nL4K0k9k9k2
3827b4J7qqkJ9jn1J9O1jj9J5J2l4j5K1J2pm5j9J1M0rpL9Mm2K4N1Pk8Ll4j3j2L
3863b1K1Rl8l2M0L6JpK9j5o1K2M3Qj9k8nnj6J3K5K8m3m4M4N7j4k0J3rm2j7L6K3
3897A2ll2RK5mj6L0J9l2l0K4L2Ml6Nj1j9mK3N2j9m0j2J7K0j2qJ5k1n5K3M8%k0
$$ y = [-33, -30, -3, 4, -25, -14, 8, 13, -20, -11, 32, 19, -13, -19, 16, 13, -20, -7, 26, 30, -4, -4, 19, 25, -8, -6, 5, 18, -10, -24, 15, 27, -16, -25, 2, 15, -27, -23, 15, 21, -7, -28, -1, 18, -15, -42, -9, 15, -16, -29, 7, 12, -28, -41, -2, 23, 6, -11, -7, 12, 0, -11, 6, 38, 9, -41, -19, 22, 5, -6, 29, 23, -7, -31, -11, 18, 4, -7, -24, -5, -18, -37, -4, 28, 6, -45, -34, 13, -10, -17, -7, 7, 0, -26, -27, 13, 32, -13, -31, 0, 6, -16, 7, 48, 17, -31, -37, 8, 12, -5, 0, 12, 19, -11, -10, 33, 54, 15, -34, -12, 10, -16, -15, 20, 19, -29, -36, -9, 8, -6, -10, -7, 14, -13, -20, 19, 26, -4, -53, -48, -26, -41, -33, 6, 14, -17, -20, 17, 34, 17, -5, -2, 19, 16, -10, 6, 34, -4, -54, -32, 8, -4, -20, 21, 38, 7, 2, 36, 56, 27, -2, -24, -7, -15, -23, -25, -6, -7, -58, -39, 22, 21, 2, 17, 29, -5, -20, 1, 13, 6, -39, -58, -47, -7, -16, -23, 16, 20, -22, 2, 53, 60, 32, 35, 1, -12, -24, -21, 0, 9, -29, -61, -21, 15, 16, 9, 38, 23, -38, -16, 27, 35, 16, -12, -17, -22, -38, -25, 0, 28, -15, -59, -15, 42, 28, 8, 21, 12, -30, -47, -11, 12, 9, -23, -14, 11, 7, -9, 21, 40, 8, -22, 2, 34, 38, 2, 7, -4, -23, -27, -4, 48, 29, -11, -23, -6, 14, 2, -6, 9, -12, -67, -44, 4, 4, -16]
3931a6LJ7ppK4L5k1m1l3K2J8l1RK8nl1J5O6Jl1pJ7LoKoKm8m4L4L6j2j8M4Rj4J8
3968B5M4ml7m5j9K9rk5K1Rk7l1M7M6j4j0K6OQRPnm3m6k1J7OlJ7L1nKL4L8k2l4
4004B2rNqk2J6Mk4m6qM2J9qJ8L2Lk0RL9j5o5k6Qqj6J6L3J3l4MN1J6j5k6K9%k8
4040AOL5nm0l8J1Pj5J8K2K2mrL4J4k4n4QMj5j4L1K8l2j7J6J7j4lnK0j0j7M7J3
4075C8k9k6jJ2k6j3L7K2j3j7K3L0rl1mJ1nk4L0M8l4j8%J5j8j8J2K0j2j8RL0lk4
4109fj5J1Nl4J4L7j4j9qM6j3j2k3L3oj7mL7J4k8k1L3Ll9J4K9lk7jK4J8k7qK7L
4144B3k7j4L5Ok9j4J7J5j7mJ4J6k8j7J8K6l5oJ2J4rk2OK3j9k0J3L3j4j4L3J2n
4177B2k4MJ1k2pjL4Jk7J8K1j6l1J4QJ7m2K2L1mk9%Rk4k8OK6K0k4J0L3jk6k1L1
$$ y = [-16, -13, 4, -3, -10, 14, 49, 28, -13, -46, -24, -6, -37, -28, 0, -5, -36, -21, 45, 46, 15, 8, 25, 28, 22, 24, 18, 20, -28, -72, -38, -2, -14, -32, 12, 21, 7, 25, 69, 65, 28, -17, -36, -7, -16, -41, -20, -11, -38, -69, -22, 24, 10, 0, 26, 32, 40, 49, 56, 51, 8, -38, -59, -42, -36, -39, -22, 9, 4, 6, 40, 78, 56, 22, 13, 18, 10, -12, 4, 8, -16, -62, -70, -28, -9, -17, 1, 33, 36, 16, 25, 64, 49, -16, -42, -34, -42, -58, -42, -9, 4, -30, -26, 25, 41, 26, 0, 29, 29, 1, 7, 42, 37, -3, -41, -30, -23, -38, -20, 2, 24, 20, 11, 45, 59, 35, -19, -11, -7, -22, -36, -5, 23, -9, -26, -10, 7, -7, -10, -15, 5, -5, -22, 25, 38, 9, -17, -18, -6, -32, -45, -8, 14, 1, -16, 7, 37, 28, -3, -7, 4, -1, -25, 5, 53, 19, 1, 1, 16, -2, -20, -8, 12, 0, -18, -9, 21, 18, -6, -21, -10, -5, -39, -25, 12, -2, -21, -29, 17, 4, -8, -31, 2, -4, -21, -25, 12, 26, -2, -23, 10, 13, -26, -12, 17, 14, -13, -14, 10, 28, 1, -7, 20, 23, -4, -18, 17, 23, -6, -20, -3, 12, -5, -9, 5, 21, -7, -24, -6, 20, -15, -21, -9, 5, -4, -26, -20, 3, -16, -36, -23, 10, -4, -18, 15, 27, 22, -2, 2, 13, -9, -16, -17, 17, 18, -9, 9, 30, 14, -17, -3, 5, 22, -20, 2, 33, 29, 0, 0, 9, -15, -43, -37, -11, 9, -15, -5, 28, 27, 1, -20, 11]
4212A1k8k0OL5Kj1j1L3j3k5j1K7J4j8J2M2Pk6j3Ok1k7k3J9L5mnL5L6l8k9oNl0
4246c4mK8L3nj9Rll0l4J3K8mkL3L6j5l1j3Lk2rmM6MlJ5J9k2k4j1J9j3j5K8M1J0
4282D8k3Qj5rm0k1L0J6qPM1jk3j0kk4l9J0M4J1rKL1j5k4j6J2Lj0j2M3K2nk2K8
4317B8%n4k0L1J4MpK3J6j3j8OJ0k9k1K4J9prL5Jl7j4ORj4j3J7K2Nk1kJ8j7k7K2
4353a3Nj1j4L1J4Lj3jLKj3rL1Kk1JL8kk8j1L1j3l6J5L2j6j0OJ2%j5j7J5Nk0oK8
4390Elj1rL4%k3rK1qj3j5J5K5rmK9J3m4k3K4Qj3lK8J2j1oL4rk4k4kJ1Rj3L0L3
4427E5k5m4J8mk3j9K4K4j0RK3kJm9oRmj0K8M0j5pJ0%k6m3LOK1J4J7L2Mm6k3J9
4463Aj8k7MM9nML4K8l8k3m6lJ7%%M7K0k9j0J6ln8j1J6NJL8K9J5l6l9rPmj5L5K0
$$ y = [11, -17, -37, -31, 4, 6, -5, -16, 17, 4, -21, -32, -5, 9, -9, 3, 45, 52, 26, 13, 19, -2, -29, -52, -33, 2, -2, -7, 28, 64, 26, -3, -9, -4, -34, -38, -10, 23, 18, -1, 8, 5, -25, -59, -46, -18, -22, -24, 9, 45, 30, -1, -14, -11, -33, -42, -46, 0, 4, 1, 16, 35, 13, -11, -22, -3, -16, -31, -3, 38, 48, 25, 33, 18, 9, -31, -52, -22, -6, -14, -7, 34, 33, 10, 0, -2, -26, -65, -55, -11, 0, -9, -7, 24, 9, -15, -31, -19, -16, -26, -38, 5, 27, 22, 0, 28, 28, -26, -46, -15, -1, 3, -4, 19, 35, 22, 4, 10, 20, -9, -30, -6, 13, 6, -3, 32, 33, -4, -18, -12, -3, -17, -30, -13, 9, 14, -7, -9, 9, -8, -35, -13, -8, -19, -33, -2, 12, 15, 2, 1, 4, 6, -7, -16, 15, 17, -4, -3, 35, 33, 5, -6, 25, 12, -24, -9, 23, 7, -3, 3, 15, 15, 0, -17, -2, 3, -17, -23, 5, 2, -9, -18, 16, 16, -7, -16, 5, -3, -16, -31, -16, 9, 0, -4, 25, 38, -6, -29, -5, 3, -10, -13, 15, 27, 16, 10, 44, 35, 11, -13, -15, -4, 5, -8, 22, 55, 30, -14, 4, 0, -23, -42, -18, 6, -4, 5, 28, 26, 27, -22, -28, -19, -23, -33, -5, 35, 20, 13, 23, 23, -3, -46, -43, -37, -16, -2, 15, 47, 51, 5, -18, 1, -17, -44, -40, 9, 4, 8, 42, 70, 32, 9, -37, -40, -23, -23, -23, 24, 44, 15, 5, 21, 18, -40, -51, -35, -30, -29, 9, 38, 53, 17, -22, -31, -24, -28, -43, -8, 12]
4500A2j0KM1Pn0k8rLj1M1M0J2mm0%Oj2k7jK3j7J9M9K6l2m4k4lkjK2K2Kk1J7J9
4536B7rl7qLj1LL6N4k4l7rRj0jJ2J0j1j4L1M1Pl8l6mqj0K6M7pl6rJ9J4mj0j7m
4573a5j2PM7J3m0k5J3qrJ3M0nl5k4L7K6J0l2j5J5l3J0M8J5m1j1OJ8RNKj1k6l5
4607d3L6L5%k0j0Nj4NL1J6n0l6J6L6J0rJ6j2m6k1K7M7kl2j1J3K4NJ8Ll9n8rL3
4641c6M4KLNk1j3K8L4jm5l2J4K5J1NJ2k5o6jN5K4j1mmLjJ5L5mo8n6QL4PKK9j3
4678fk1ML7M0l3l2j2MQJ9K3Kn3n2J4L7J1mK3PrK4L2K9k9o1n7j3K7J7M2Jk5l5K7
4713a4J9J5j7j5kMJ7N4K4m8o9n7LJ5K6L3L6j1j3K7L7J0m8n5k1J5J2M3L9j8o9k3
4745e1NK7OJ3J9mLK7L6Jm8p7l7qK7N4M0Pn5j2K3K8Nk2k0j3lK7L9K1m5n5l6RL4
$$ y = [12, 2, 4, 45, 52, 2, -26, -35, -32, -43, -2, 38, 50, 46, 6, 6, 12, 0, -27, -28, -5, -22, -3, 46, 72, 40, -4, -28, -31, -33, -34, -12, 10, 12, -9, 8, 27, 18, -19, -27, -24, -35, -32, 4, 58, 34, -3, -12, -3, -13, -14, -2, 8, -3, -17, 14, 55, 62, 24, -12, -16, -24, -34, -8, 39, 32, -4, -13, 6, 20, 16, 6, -11, -15, -27, -20, 27, 40, 0, -25, -12, -20, -29, -16, 24, 19, -16, -40, -3, 23, 33, 1, -14, 1, -32, -22, 26, 41, 0, -11, -5, 13, 22, 27, 29, 18, -8, -43, -7, 28, 28, 8, -2, 3, -11, -6, 25, 41, -9, -45, -29, 7, 17, 8, 24, 12, -34, -55, -28, 19, 17, -15, -26, -13, 11, 16, 34, 37, -2, -60, -69, -36, 8, 10, 13, 18, -3, -16, 12, 46, 45, 0, -32, -18, 7, 18, 23, 35, 10, -56, -57, -2, 22, 11, 7, 3, 6, 5, 20, 55, 51, -17, -73, -65, -31, -24, -22, 7, -6, -27, -23, 14, 54, 21, -11, -23, -19, -11, 8, 31, 33, -20, -72, -58, -21, -10, -14, 9, 16, 7, 31, 63, 92, 63, 2, -55, -68, -41, -24, 18, 19, -6, -41, -14, 5, 20, 3, -12, -14, -10, 7, 61, 85, 37, -32, -89, -86, -71, -45, -12, 24, 13, 0, 27, 64, 74, 26, -29, -50, -35, -23, 20, 59, 41, -28, -51, -46, -19, -13, 0, 19, 15, 18, 45, 81, 82, 34, -43, -80, -88, -61, -7, 33, 40, -15, -27, -4, 24, 29, 7, -13, -26, -29, -2, 37, 58, 13, -42, -78, -69, -35]
4780c5L5L8Om4rK8M1nl3l5j9rK3M4L7l6o3mK8L7oJ3j2n4LL4L1Jl6k5k0JL3K8K2
4815C8l8m7QN1K9k0j4j7l9JK6N8Jk2l4RJ1J4J4K1m9l9NM1L4lj7k8qpJ7M0Ll9l9
4850c9OL6K0Ojl3o3J6M9L1mj7k1mPJ5L3km7n0J4N0K0Olk2k4NL7J2mm3j7J4K5K5
4886C3J9Qn4m1oN3J3mj3ok1PL2K3k2n9j9J5M4J7J3J2l5m7%M8Pl5%jLQL8J9qm9
4922hk5OL8J8LJ1l2j9mL5Qk7l1nJ0K0M1NNm4l8K0K1p%Kj4j5J3M6Kl1k6j8QK3K0
4959A1MJ7l5j6J6J4Mm3Oj2lK7L6L5k0m2j1QJ4JqNok8L4M4k0m3qj6PJ0L3K4Kl3
4995Hk6J9kj1j9Pj3ML2M9Jm2l0%pPJ9K9pj8j9K6J0k3j4%mNK8M2lj5l2j2Rj4J6
5032@J0J4l1KK5Prm2MkJJ3L2J0l1k1JKJPQRj8qJ4K0j2j5pO%J8J1J1k1k1rK6Mr
$$ y = [-35, 0, 38, 44, 0, -9, 19, 60, 55, 22, -13, -32, -41, -18, 26, 63, 27, -36, -40, -12, 25, 19, 32, 20, -34, -31, 3, 34, 35, -1, -26, -46, -45, -12, 16, 38, 0, -47, -39, 12, 41, 21, 7, -10, -49, -48, -22, 36, 37, 15, -19, -10, 1, 15, 29, 50, 1, -38, -33, 8, 42, 39, 22, -6, -14, -21, -4, 36, 39, 0, -39, -33, 3, 23, 29, 28, -5, -68, -52, -3, 28, 24, 7, -14, -18, -11, 4, 37, 35, -12, -62, -48, 2, 22, 28, 25, 3, -21, -16, 21, 33, 29, -14, -31, -17, 8, 33, 52, 60, 6, -35, -41, 12, 25, 21, 8, 2, -19, -12, 20, 43, 21, -38, -57, -42, 2, 19, 32, 44, 9, -38, -38, 10, 17, -18, -18, -19, -16, -8, 30, 49, 41, -8, -33, -27, 11, 29, 32, 43, 11, -8, -12, 23, 31, 4, -27, -32, -22, -2, 39, 44, 49, 5, -33, -13, 8, 1, 1, 3, -11, -26, -13, 33, 35, 4, -22, -40, -32, -9, 11, 15, 32, -3, -19, -3, 11, 15, -28, -22, -34, -37, -10, 26, 61, 41, -1, -12, -4, 10, 11, 3, 8, 2, -26, 8, 52, 32, -11, -19, -35, -28, -18, 15, 39, 41, 8, -18, 1, -1, -12, -31, -24, -37, -33, -1, 48, 49, 7, -23, -23, -30, -23, -4, 25, 18, 0, -19, 7, 17, -6, -20, -20, -24, -19, 9, 51, 48, 33, 1, -11, -2, -16, 0, 10, 24, -7, -5, 20, 27, 18, -24, -20, -22, -21, -8, 24, 34, 3, -18, -17, -15, -14, -7, 1, 10, -8, -16, -2, 18, 6, -9, -16, -10, -10, 8, 19, 30, 9, -12, -21, 5, 9, 0]
5072@J4Oj2rPOj4k4MK2LkJ9Nk2j6j9K6nKQJ9qk1NJ0k0j9PK3J2J2jKJk1j9J5lL
5112dMJL1k6NPj1k3OJK3nR%%j8pOlrrK0J7okj2Qj3k0K4JKmRmLk2J0QJmQK4j3k5
5157a2J2J6nk1J9J8j1l1J7mKnjJ6joJOpk2%J8MjpJ3pj4LRnj6J0K0mkKPj4k9J0
5198b2J5J6KlQjqrQjj1jJ3RrJ1mj3j7mJ3K7pk0J4J3k1qK3j0k8j0JM2Lj3Lmj0j3
5238b6K4J4j5j3J1J2Qj7J7Lk7rLK6OnrJoj2J1K6pl4J5LJ5mkNk2j6PK9Lk5JKjJ0
5278BjJ5j2k4jNJ6KnOlj1lK9Nj3j3%J1JPKMk7LJK8ok2J2orjK1Pj5k4J5J1%kQj8
5321ek3nL5J5%k7kLrLK0Qj9j6KJ8J4j6Jojj9L2L3ok0j5MJmK0npk3PK4K0j5Jj9
5361aj8JRM5j6k6j5RMJkJ4k6m%L6K8k7nmj9j2K0L1j2rk9J5OLmJ6Kk2OL3J2rk9
$$ y = [0, 14, 20, 8, -1, 6, 12, -2, -26, -22, 0, 3, 1, 20, 25, 3, -13, -32, -6, -11, -9, -1, 18, 10, -11, -6, 4, -16, -35, -28, -5, 7, 19, 18, 20, 21, 0, -19, -4, -7, -4, 0, 1, 32, 6, 11, 18, 7, -16, -10, -9, 14, 9, 18, 18, 18, 0, -7, -1, -4, -13, -22, -2, 15, 9, 7, -5, 3, -10, -30, -6, -5, -3, -7, 2, -2, 1, -21, -11, -3, -2, -6, 2, 26, 13, -12, 0, 16, 11, -10, 9, 27, 16, -15, 2, -2, 0, -5, -6, 10, 9, 3, 4, 10, 3, -19, -19, -1, 3, 2, -5, 8, 1, -13, -10, -1, -6, -22, -12, 8, 4, 2, 4, 11, -3, -32, -22, -7, 9, 11, 8, 16, 15, 7, -2, 6, 5, -6, -7, 6, 15, 6, 17, 13, 0, -17, -21, -8, 19, 12, -8, 6, 19, -2, -10, 13, 3, -25, -35, -34, 8, 11, -2, 1, -3, -13, -26, -2, 12, -3, -16, -5, 7, 15, -2, 15, 18, -9, -18, -15, 11, 17, 12, 3, 4, -2, -14, -3, 23, 16, -18, -3, 0, 15, 11, 9, 14, -8, -24, -17, 12, 15, -10, -9, -7, -8, 2, 1, 16, 4, -20, -21, -16, 0, 2, -3, 3, 0, -11, -14, 15, 20, 7, -6, -6, 5, 6, 13, 15, 19, -8, -5, -4, 24, 18, -4, 8, 2, -7, -8, 13, 20, 5, -19, -4, 7, 7, 5, 13, -5, -28, -33, 2, 17, 17, -10, -12, -9, -18, -15, 5, 13, -6, -22, -20, -2, 12, -4, -3, -9, -10, -29, 3, 36, 30, 10, -5, -1, 0, -4, 16, 11, 4, -19, -12, 12, 32, 17, 18, -1, -19, -18, -9, 36, 20, -6, -21, -12, -8, -7, -9, 5, -21, -25, -25, 11, 39, 12, 7, 3, -16, -28, -8, 23, 11, 2, -27, -12, -6, -3, -7, 9, 11, -11, -5, 28, 40, 31, 2]
5400Bj3J6jj7K5Mj7j6QJ0OJrNj9QK2J0j4l8mJ0LlJ9J1j3j5J6L0Jj7JqoLJ4J5k1
5439Il4j0K1J5kJ9Qj3j0J0J7prj3j5PPKNkk7oJ6L1pM%j7j6J8J3rj6r%RNJ4Qj4
5479Bj7nK5K7nj5Mj0j1MJ1Rk0j3NNJ1J9Lj2k7oJ4K4j5j3jkLk0L0Kol4J0L1Rql
5518Elj3j1J2J9Qk0j6RJ2mJ4Oj3j4LJ8mJ6rlj3j3RJ2J8k2qkJ8k4J6Qj5pj1J6J7
5556A1qj3KKmRJ7j0j9j2J0QKkJ1Jk9J0J6J9%j8Qkj6RJ7%j6j0%LJ2QrOj7lK3Ko
5597A2j2qlJ6j5KPj3MjJ2jjRj0rNJ3K0j8j7kOKJ2Joj0kNMJ9mnpopQNKk6lJ8NQ
5642I%Nk1nJ4%J4j8j9PJ7j4LJ1%k1OJ3JpNKKnmJ9%j0mj1J8Lj1K0kk1lJ0OJopQ
5685ErlJ1jJ2k1PLlmmkJj2J9onoML%OJ1Nj0j6NJ5mOr%LkQJ1joj3J7r%%Poj7kJ2
$$ y = [2, -11, 5, 4, -13, 12, 16, -1, -17, -9, 1, 7, 8, -1, 4, -15, -7, 15, 25, 11, -27, -31, -21, -18, -21, -2, 9, -4, -19, -3, 27, 28, 11, 12, 4, -2, 1, 15, 30, 9, -25, -35, -14, 1, -1, 18, 26, 13, 3, 13, 30, 23, 14, 1, -14, -7, 0, 2, 7, 5, -22, -28, -12, 19, 12, 16, 16, -1, -17, 1, 14, 5, -11, -20, -20, -11, -6, 8, 16, 2, -15, -20, 5, 32, 27, 12, 16, 6, -5, -1, 10, 19, -1, -14, -9, -4, 7, 26, 29, 17, -10, -16, -2, 22, 7, -6, -7, -9, -6, -26, 4, 6, 0, -34, -24, 7, 16, 8, 5, 2, -11, -22, -10, 9, 17, -3, -19, -10, 2, -2, 12, 18, 5, -9, -6, 12, 8, 24, 15, 12, -1, -14, -5, 7, 25, 3, -5, -7, 11, -13, 3, 11, -4, -11, -22, -6, 11, 3, -10, -8, -6, -10, -1, 16, 6, -13, -25, -15, -7, -5, -7, 4, 5, -24, -14, 2, 21, 21, 3, 11, 9, -7, 2, 19, 19, 3, -7, -7, -4, 8, 16, 7, 13, -4, -7, 16, 18, 12, 0, -8, -11, 5, -10, -8, -1, -14, -10, -11, 1, 0, -1, 8, -2, -11, -6, 7, 27, 9, -8, -10, -4, -2, 10, 11, 5, -5, -7, -2, 2, 21, 17, 12, 5, -1, -8, 0, 5, 7, -19, -22, -4, 1, 9, 9, 14, -7, -12, 2, 2, 16, -2, -21, -14, 3, -11, -8, 3, 3, -18, -12, 1, 2, -5, 0, 2, 4, -1, -5, 14, 14, 4, 0, -11, 7, 10, -1, 19, 17, -4, -7, 3, 9, 10, 4, -3, 5, -4, -7, 4, 3, 15, -6, 1, 4, 1, -3, -7, -9, -8, -20, -1, -7, -12, -18, -14, -11, -11, -5, 6, 11, 1, -15, -10, 5, 1, 7, -2, -2, 1, -1, 7, 18, 17, 11, -2, 15, 6, 6, 6, 13, 7, -10, -12, 0]
5733@jrRJ%j0OMJ1j1j5QQj3nOJ1rnJ4Ljj4J0Lj0RNkoj4K0Qj3pJ2Rj6KJ4KnrLO
5778Inj1J4%lkj0RRj4jMmqJJ7j4jmK0Mk2RJ2mqMQj1j0NK3j1j0KK2Kk4kOLqqK0
5822HNkk2J7j3mj1K3JkqNjmj0J6jj2oK8j4KqOKj0JJ5JOpJ0Oj7qJ3Mj7JRRj3Oo
5866bJ2prMJ4npMlkj3J2JolJ4Ppj2LJ0nj6J3KljmJ5mq%OMoORKlrmJ1j7PJ6rpN
5914EPlj5J1JJj3NLpJ2k0NlMj0J8Pj8jPlj3J1j1J0NjQMk0jJ3QjoMKjjLoQj0j2
5959a4J8njJ1Kmj0j3J6mqPNjqN%rJLjKmqJ3Mj4OmJ7pLJ1j2LkOnqJ4MKj4rK0oj1
6006iQkl%%PK8m1MJNj%NrJp%JkQmJLkkOmrRJ5j6NmPJ1j4J3JqKNmOk0J8qj4K2q
6056AQjj7J2%j5MJ4LLk0kJ3k0J3jjj0lJ2J4Joj7J3Jp%J3%rJOKnKM%nJ0Nmnj0M
$$ y = [0, -1, -10, -1, 0, 0, -10, -4, 0, 11, 0, -15, -7, 1, -12, -17, -11, 0, -9, -14, 0, 3, 2, -12, -2, 1, -9, 0, 5, 3, -3, -17, 3, 11, -2, -9, 3, 12, -4, -2, 12, 14, 9, 0, 3, 9, 4, -7, 7, 7, 4, 2, -8, 1, 10, -4, -5, -1, -5, -13, -12, 5, -9, -10, -14, 6, 10, -12, -3, 9, 5, -3, 1, 9, -2, -12, -7, 16, 5, -5, -3, 19, 21, -3, -5, 1, 4, -4, -12, 8, 13, 11, -11, 6, -7, -11, -22, 1, 2, 0, -8, -3, -4, -8, -18, -2, -3, -15, -21, 7, -7, -5, -13, -7, -5, -15, -14, 1, 2, 8, 1, 11, 17, 0, -8, 5, 9, -8, -7, 2, 11, -2, 4, -2, 10, 3, -6, -2, 12, 7, 0, 4, 1, -1, -14, -2, -1, -7, -10, 4, 11, 4, -8, -5, 5, 0, -16, -3, -1, -4, -5, -9, 6, 2, -6, -6, 0, 4, -2, 4, 13, 15, 12, 3, -1, 10, -7, 0, 16, 7, 0, 5, 12, 9, -6, 5, 6, 7, -6, -1, 2, -5, 7, -13, -8, -11, -7, -17, 1, 8, -10, -11, -4, -7, -20, -9, -20, -10, -5, -6, 2, 6, -14, -15, -2, 6, 5, -1, 3, 5, 4, 3, 6, 0, 8, -2, -14, 4, -1, -2, 9, 11, 7, -3, -16, 0, -4, -12, -5, 0, -1, -9, -4, -4, -13, -12, -9, -10, -8, -12, -20, -7, -3, -17, -11, -15, 2, -5, -2, 9, -3, 0, -2, 4, -1, -9, 5, 9, 11, -3, -12, 8, 2, -9, -1, -3, -6, -6, -6, 1, 29, -12, -8, -7, -2, -3, -3, 2, -7, -6, -13, -13, -12, -14, -6, -10, -9, -6, -8, -10, -4, -8, -17, -8, 7, -9, -4, -8, -1, 10, -4, 9, 10, 2, 4, 9, 5, 11, -9, 9, 1, -13, 9, 1, 9, 8, -9, 3, 3, -12, -8, 6, 9, 12, -8, -10, 3, -17, -4, -5, -6, -16, -19, -7, 7, 8, 2, -15, -2, -1, -8, -8, 5, 5, -4, -3, 3, 5, 0, 2, 6, 6, 1, 11, 16, 12, 7, -3, 1]
6101AnKJ2%j1lkKnMj0J4JKoPoj6KJ1mjMJ7lj4%NK1j5koKLkJ0pmk1J2J1RkJ0qm
6147EpPJkj4kPlJJ0J2k5qPMJ2j0LPj2j2RLmnLOPLlJ8j4kkPjl%rJjJNnlmJ6J1k
6196A3nrJj5KNJ5pokMjMLrJj6K0OkrlmmnJ6J5Rj2lJNnJOj6j3K1J0jOj6n%LOPm
6244Hmj8J6Pj3RnLj8OJ1MKj2Nk1J6PPqk1LMRJkNlnJ1QJ3j8%j2KNMJ0j9rRjQkL
6290E%pjmJ5Lk1j1lJ1J1%pOmP%LmPj5J1rQNQj5k2OJ9jLQJj3L%J5qj8KKQjMQj6
6337aj2PJ1mJ0N%qj1jRKl1jJ0qJ2LJ1jrkK1Pj8pJLlJ3jlj3mLJ1NqN%j0PRJ1j8
6382BKj7mJ3K%J%k0K1Klj0%J1j4OJ6oj3ojjQPMRj7nMJ3J2k0P%r%K2njj2mJ1lq
6427fRNnj8J9Ppj0lJ0k0%J8LLj3j2K5knmKjn%K4rkppNpPJ4jk1J6kJ5qj2J2jj4
$$ y = [1, -4, -2, 10, 10, -1, -4, -6, -4, -9, -5, -15, -1, 0, 2, -4, 3, -3, -19, -17, -6, -10, -11, -7, 10, 7, -7, -7, -2, 19, 4, 2, -4, -2, 1, -1, 9, 2, -2, -23, -11, 0, 9, 7, 17, 9, 5, -2, 5, 6, 4, -10, -12, -5, -8, -7, 3, 15, -10, -18, -11, -7, 5, -5, -2, 5, -7, -19, -10, -7, -11, -16, -13, -7, 0, 3, 0, 18, 4, 2, 0, 7, 6, 3, 3, -6, -5, -6, -5, 0, -5, -8, -12, 4, 15, 13, 8, -1, 0, -15, -13, -8, 7, 0, -6, -8, -4, -5, -1, 2, -7, -6, -22, -2, 4, 2, -7, -10, -14, -18, -23, -7, 8, 17, 5, 2, 3, 8, 3, 4, 10, -6, -19, 2, 12, 11, 17, 1, -4, -4, -1, 5, 12, 8, 4, -14, 2, 9, -4, 5, 0, 3, -15, -9, 2, 6, 8, -4, 1, -20, -4, 3, 10, 2, -19, -16, -12, -3, -2, -4, 1, -2, -7, 4, 12, 25, 7, 7, -5, -3, 2, 6, 16, -3, -12, -3, -4, 4, 2, 5, 5, -2, -3, -7, 8, 11, -10, -21, -24, -13, -2, -2, -9, -3, -7, 0, 0, 3, -1, 6, -9, 2, -7, 1, 6, 14, -1, -23, -17, 2, 1, 4, 12, 13, 0, 3, 3, 18, 10, -8, -6, -4, 4, 3, 7, 15, -1, -13, -6, 5, 1, 11, 16, 16, 8, -3, -4, 5, 7, -24, -25, -15, -23, -11, -8, 3, 2, -7, -9, 12, 19, 1, -6, -5, -2, -5, 8, 7, 4, -9, -13, -10, 1, 6, -2, 3, 3, -7, 0, 9, 20, 2, 4, -13, -17, -4, -2, -2, -1, -1, -21, 0, 2, -1, -11, -11, 0, -14, -8, 8, 2, -11, -17, -18, -19, -11, -4, 0, 9, -8, -13, -9, 4, 16, -4, 3, 3, -6, -6, 16, 11, 10, -2, -6, 5, 2, -6, 3, 8, 3, -15, 4, 11, 4, -6, -9, 1, -19, -19, -1, 2, 5, -8, -20, 5, 3, -2, -6, -4, -5, -10, -10, 14, 5, 3, -4, -11, -6, -13, -6, 8, 7, -14, 2, 0, 15, 7, -5, 7, 6, -8]
6471hLJ7Nk3JlK0j1j4J4lj1kjJ5kpJ0k4QPQLrqKJ0J2rMKmk4J6RNj4LmLJ3MKom
6516Ej0J0KrJQnrOKqKp%KRkNooj0J6lj0LLJ6j4J1lJ5k7kJ6J4rmJ0Kj2qQ%nNjR
6563A0ojJ2prloQqJ9%J3j9L%Jrm%kJ2JLpnj6LJ4mrOJ4%ONlj4qmK3j7J9LJ2rj0
6609GkJjj3kJ6%nJ4loj7QqQpJ2oJ0j2nJ5nj1KJ0llJ2j0J0j8KJ0j2J1nRoKQJ1q
6652A0j0JNoNqkJ1q%OLj8OJ1j0okJ0Oj0nQpPoKPj3J0oJ1nj3J8%j2qK3joM%J2j5
6697alKKMqNJ1Lj1KOpnqJ8j1mLMjPmknoO%pj5J7Rj2NmJ7oljJJ7k1%K1m%lnnqL
6747gJ4jrMRmj2jL%oKJ5MrkJ0pj0j0J3ljoJ4Nn%j6J2ppKJ7%lJ0Rj5p%PmQKJ4J
6794B3rrJ0k1mJJ3j1%J4J7kj1j0j3Rj5RNJ%jRKj3j2J2%j0%J4RJnMj4j1RKOjKJ7
$$ y = [-8, -5, 12, 17, -6, -5, -8, 12, 1, -13, 1, -2, -13, -15, -16, -1, -3, -10, 0, -24, -16, -9, -1, 2, -7, -15, -13, -3, 9, 0, 4, 6, 2, -22, -6, 3, 8, -6, -3, -7, -4, 9, 13, 15, 9, 5, -5, 5, 7, -2, -1, 7, 2, -7, -1, 1, -7, -5, -12, -12, -10, -1, -3, 2, -4, -10, -20, -4, -7, -17, -14, -11, 5, -9, 2, -1, 14, -13, -15, 1, 15, 6, 2, 12, 14, 2, -6, 2, 2, -3, 2, 1, 10, 4, 3, 15, 8, -1, -4, -10, -2, -10, 9, 9, 22, 3, 6, 6, 7, -2, -6, -6, -8, 4, 5, 8, 1, -4, -20, -17, -3, -7, -16, -10, 4, 4, 10, 15, 12, -2, -10, -14, 9, -8, 11, 14, 26, 17, 7, 5, 6, 5, -8, -10, 6, 6, 1, 15, 12, 6, -11, -3, -11, -3, -10, 2, -4, 6, -6, -11, 4, -1, -12, -10, 0, -3, -6, 6, -4, 6, -12, -10, 0, -12, -1, -6, 3, -3, -1, 7, 18, 10, 0, 1, 6, 0, 5, -3, -5, 6, -2, -2, 4, 7, -11, -5, 6, -4, -10, -12, -2, 4, -6, -11, -3, -10, -3, -9, -7, 0, -13, -3, -9, 2, -3, -16, 2, 2, -10, -18, 5, 4, -2, 2, 2, 14, -1, -4, -2, 0, 4, -4, 1, 12, 15, 4, 6, 12, 5, 0, -8, 10, -1, -5, -2, 2, 1, 8, 4, 2, -3, -9, -3, -3, -10, -25, -8, 1, -11, -6, -10, 7, 1, -2, -3, -2, 15, -6, -6, 15, 11, 11, 8, 3, -2, -10, -7, 7, 6, -3, 1, 10, 6, -6, -7, -4, -4, -10, -8, 7, 11, 2, 0, 10, 3, -7, -17, -4, -7, -8, -14, 0, 5, 0, 0, -16, -4, -11, -18, -16, 1, 1, -2, 8, 17, 2, -5, -5, 2, -2, 6, 8, 22, 23, 14, 5, 15, -6, -10, -9, 4, -7, -7, 7, 24, 22, 11, 1, -12, -3, -18, -9, -4, -3, -3, -4, 5, 7, -6, -18, -6, -6, -16, -16, -2, 7, 8, 3, 7, -7, -18, -9, -7, -1, -2, 0, 17]
6837A7Kj3k%orOJ6NmmLkoj5NJj1RJ0J2Lj3j1qNj3QRP%Nknj%mKjKPJLKloj6PPm
6887eNpK4Mj6KOj1q%RrnNJ2Jj2LKj2ojK2JpjJJ0j1%J0pkmJ0QqpK2Kk5lJ6JqLK
6934FPj3nJ6rrlJ2PnLkPj0jqJ5rrQrKJRJj0%%J0k0%OK4j3OoJ4jj4PJ0j7NnJ5r
6980DKJ1lqooQJ7j3jPmqnnQj7j0J7jJJ5Pl%%klj3kJ6ooQj4K4k1LNJ1j1QJ4jJk0
7026bJ3j4j7KkJ7LLJJ9k6QMjoj7J5Prj1J4j0kj4oJ6KJ4J6l%j2jLrj0jPpJ2RLq
7069@qJJ2%oJ8J5j4mj2Rj4k3J4L%LNJ2Rk6Rj1PpLj6MMQQ%k2KMKMQPn%qK9j6l0
7114b2ORLlJ1J6mk3KM%KkKj6J7mLOj0rMrQRR%rnj1K1j5lj1QlJ4nK0lj6JMKKLL
7161FrpPJ3Nj1ljKj2J8Olj8oK2jpJoKj0LQlOj3OJpJ6pmj5OQJ1OrrQ%j2J6Rj6o
$$ y = [17, 19, 6, 4, 4, -2, -11, -5, 11, 16, 12, 8, 11, 9, 3, -12, -7, -6, -17, -8, 2, 14, 17, 4, -7, -15, -10, -23, -15, -6, 1, 1, 6, 4, -1, -2, -2, -6, -4, -5, -3, 4, 5, 8, 10, 7, 1, -15, -8, -1, -5, 0, -7, 17, 21, 5, 7, 13, 2, -6, -6, 3, -6, -11, -6, 6, 7, -5, -2, 0, -12, -18, -19, 3, 4, -3, -4, -3, 7, -4, -4, 6, -1, -3, -7, 3, 11, 3, -4, 18, 20, -5, -8, 8, 9, 1, 4, 6, 13, 0, -5, 11, 2, -7, -10, 2, 9, 4, 7, 5, 12, 2, 1, -7, 8, -1, -10, -2, -11, -9, -8, 1, 2, -8, -8, -8, 2, -18, -18, -12, 12, -1, 5, -1, 13, 12, -2, 5, 15, -2, 3, -2, 13, 4, 6, 17, 14, 6, 0, -6, 2, 19, 6, 5, 12, 8, 0, -5, -10, -2, -19, -29, -12, -13, -12, 3, 10, 7, 7, 7, 5, 2, -11, -13, 3, -3, -9, -1, -15, 9, -12, -9, -4, 7, -4, 4, 18, 17, 18, -2, 11, -3, -20, -18, -20, -3, 0, 3, 4, 23, -3, 5, 9, 8, 2, -15, 0, 7, -2, -13, 1, -9, -11, -25, -31, -15, -13, 1, 17, 14, 14, 2, 1, 4, -5, -15, -16, -9, -16, -4, 5, 8, 0, -8, -7, 5, 5, -1, 17, 32, 18, 14, 2, 11, -3, -26, -12, -9, -9, -6, -1, 11, 20, -6, 3, -8, -1, -8, -5, -21, -17, -13, -5, 3, 3, -19, -17, -13, -11, -7, 1, 8, 3, 3, -5, 24, 8, -22, -16, -7, -4, -7, 4, 20, 16, -7, -5, -1, -1, 1, -1, 1, -15, 2, -2, 1, 7, -3, -12, -8, -17, -9, 0, 9, 9, 0, -5, -16, 5, -10, -13, -24, -16, -19, -5, -10, 10, 7, -9, -8, -4, -2, 0, 3, 6, -3, -10, -3, 10, 15, 4, 1, 0, 2, -10, 8, 14, 11, -7, -13, 9, 8, 1, 2, -4, -2, -12, -9, -1, -4, 2, -11, -5, -4, -11, 5, -2, -6, -21, -15, -7, 4, 10, 1, -8, 0, 0, -12, 4, 13, -3, -9]
7208iPNPpJQj3j9K3nQoLQj1j3J5Lk4qJ4K0q%KKj0j7%K4qonLJ6NnJ0j0k7QRJ1o
7252ejMlj3J8jPk1pK2MRJKk2oj0K0nqORj5QkRkk5lJ4OjQRoj8%NkjLJJ3qJ7Oop
7300Cj4lJ0L%lJmRkOj4MnJ1MrJ3%qk0RLlj2J2KPj3J8lj1lpJ6lmORj6LNmMnMjO
7348AjPnJ0qj4RKpKJ0okJ0Lj4Nj2Nj0ROKQj9oMJ3j2OkMj1NK1pj9qkJ7J%J1oqq
7394a6J8J7j2j0jJ6j1j0K6mjk2J3J2jpPj8Rk5J2J0J0k0NKJj7QJknNJ3jmoMnmQ
7435eJ1plNJ0Lj3KRj0qRKOkk0K1Pk9JQJ0j4lQJ1j2MLqkk3J8KQqJ8j6okPOkMoR
7481Cj0rJ7Rj6JLOJj3J4Rj1j4J1Pj6NJMj1jKJ5Lk4J5J2k5M%J4qj5J0J3j2j2QJ8
7521Hqj2kJ6lqNNmqJ0Qnk1J5MkN%KjpR%KjmLJ2k7pK3jk1OJ2Mj2oLJ5k4jJ1J0j6
$$ y = [-9, -2, 3, 10, 3, 4, 12, -1, -20, 3, -2, 6, 0, 3, 11, 0, -13, 2, 5, -19, -27, -13, 7, -1, -1, 1, 3, -7, -24, -24, 0, -8, -14, -19, -16, 0, 5, 0, 10, 0, -27, -19, -10, 1, -5, -6, -2, -5, -18, 0, -1, 6, -15, -22, 0, 4, 13, 14, 16, -6, -12, -22, -2, -7, -15, -9, 0, -15, -7, -9, 0, -2, -27, -30, -16, -10, -11, -3, 6, 0, -18, -18, -13, -15, -16, -13, -12, 1, -7, 10, 16, 10, 3, -11, -14, -4, -1, -1, -4, -3, -7, 2, 0, 6, -8, -4, -9, 2, 6, -3, 10, 10, 2, -18, -9, -6, -9, -21, -9, -7, 0, -13, 5, 2, -9, -12, -19, -3, -6, -10, -4, 5, -11, -8, -3, -7, -3, -8, -4, -5, 1, 0, 7, 2, 12, 4, -10, -1, 1, -6, -4, 6, 0, -2, 8, 11, -3, 2, -10, -5, -15, -6, 0, 2, 10, -9, -15, -11, 2, -10, -4, -6, -2, -13, -8, 13, 6, -13, -21, -23, -6, -5, -5, 6, 0, -8, -16, 2, 19, 7, -3, -4, 12, 1, -9, 17, 13, 12, -10, 3, 15, 14, 7, 14, -4, 5, -20, -8, 2, 12, -8, -3, -1, 0, -17, -9, -8, -10, -15, -10, 3, 2, -2, -8, -4, -9, -13, -5, 6, -1, -4, 1, 11, 14, 1, 3, 12, 2, -6, 3, 5, 11, 9, -11, 10, 17, -12, -11, -3, 7, -7, -10, -2, 9, -3, 1, 4, -4, -6, -29, -11, -9, -1, -9, 9, -7, -13, -15, -8, -2, -4, 0, -6, 3, -7, -16, 1, 10, -6, -5, -2, 4, 5, -8, 6, 15, 4, -10, 1, 8, -8, -3, -2, 2, -9, -10, -8, 7, 10, -14, 1, 13, -12, -8, -8, 6, -2, -17, -7, 6, -6, -18, -10, 8, 0, -12, -14, 2, -1, -9, -4, 1, -3, -11, -1, 7, 2, -19, -4, 0, -2, 3, 3, 5, 4, -3, 6, 6, 8, 7, 3, 6, 18, -9, -16, 7, 6, -15, -9, 3, 7, -5, -11, -8, 7, -17, -18, -7, 3, -13]
7567a3NJ2morJK2k8ROK6j6j4PKrONQjj0%J5lolJoj7PJ9Kk1MJ0j0qJ5Mj5j3QJ6
7610bJLj1J0jj5%K5Jk7J2KL%NQk9J1%J2J2k2jNLj5NK7j8mj4QJOPj0ojkJ2Qk2j
7653a4%Nj1ORpJlJ0PkoLQj5pK2J3k6mJ0jkj2K9j2kMnK2%k4oJ1rPJ1Qj8lj%KMj0
7698hJ2ppPK1lj5Kj1pMOPj1m%J6PpLNmj3LK4lk2rKJPKPkj3J3OPlj7L%j4JMJ3j7
7745a4j0J3%MlJ5Roj4J0Rj1j4PqpLJ5MpqPJ8l%nJ0j1k%J3rj4k1K4Oj3J4Qj4oQ
7787cK5j3j1JJ0j9oRQj4n%QQlJ9j1mn%J4jj0mrJ0koK0Ok6PRP%pJ0j1j5JJ6J6j6
7830Ck0OQlJ1PMj8j9J6PqNj5Pmj5J9Pkj5MJ1JJ4j4MjpkJ1J2pnm%j1K0Oj6onRJ
7874dkNOj0j0LQNqMloMkJ7k1j0NJ7J1mrmmMrK0Qk1lRJjJ1Npj0pJ7J0nqjJpjJ1
$$ y = [-13, -8, 4, 0, -6, -15, -14, 8, -20, -11, -5, 21, 5, -9, -2, 0, -9, -3, 2, 10, 9, -1, -1, 14, 11, 5, 2, 3, -3, -20, -13, 6, 8, -13, -9, 1, -9, -17, -2, 2, -13, -26, -18, -2, -1, 2, -9, 1, 0, -15, -15, 10, 11, -16, -4, -2, 1, 1, 6, 14, -15, -4, -4, 8, 20, -2, -3, 2, 5, -10, -5, 22, 4, 0, -14, -6, -5, 1, 8, -2, -8, -9, -11, 1, 9, -13, -14, -14, -9, -20, -14, -5, -12, -11, -14, -4, 3, 1, -5, -2, 6, -9, -16, 6, 19, -7, -11, -1, -2, -4, -16, 13, 1, -1, 3, -2, 20, 20, -4, -10, 1, -8, -1, 10, 18, 0, -3, -4, -4, -2, 2, -8, 4, -3, -10, -3, 18, 15, 0, 2, -9, -16, -12, -6, 1, -10, -14, -14, 2, 9, 2, 5, 10, 6, -7, -4, 20, 17, -5, -14, -12, -11, -4, -2, 5, 3, -10, 3, 9, 16, 13, -4, -1, -1, -15, -14, -10, 3, -14, -24, -11, -11, -7, -10, 5, 14, 8, -6, 4, 13, 2, -12, -5, -13, -20, -17, -2, 2, -5, -13, -6, 12, 9, 9, 4, 14, 3, 1, 1, 14, 5, -9, -30, -6, 0, -13, 1, 9, -5, -11, -3, 22, 9, -2, -1, 9, -10, -16, -7, 1, -13, -18, -18, -10, -2, -5, 14, 3, -1, -6, -6, 8, 7, -3, -7, -16, -6, -8, -14, 6, 12, -14, -7, 2, 9, 9, 2, 12, 1, -14, -13, 3, 19, 3, -17, -11, -3, -6, 5, 12, 16, -2, -21, -5, 2, -6, -1, -16, -9, -13, -28, -9, -2, -4, -19, -15, -4, -3, 11, -3, 1, 0, -7, -9, 2, 14, 7, 2, -2, -2, -13, 7, 13, -3, -9, -14, -5, -4, -6, -1, 5, -5, -15, -12, -4, 1, -7, -3, -6, -12, -8, -10, 7, -14, -24, -19, -2, 9, 5, -4, -8, -12, -8, -17, 3, 11, -10, -13, -4, -3, -4, 7, 12, 5, -5, -12, 5, 15, 10, 2, 1, 2, -5, -6, 5]
7921EKj5j1J4PpOkolj5K2J1kk0MK0mj3POqj0JJ0lqJ4Mmj4J9%%j5RLjqJ1Kj5oJ5
7965BQLqKLj4rPJ5nj6KKk%KLoqJ0J3Ok2J0lNl%J0J1k0J2oQj3KKmpjROj4jJ2J3
8011A6k4MJ3%nk1MJ1ljlK0j9j3J9J3j3nPmmoKK0j6oPROj0jJ1jj2J1J5k0%Olj2
8052hJ2qJ6jj5MQQj7KLlj5J2lJqLLRpKnMoJ3OPk4LOoj0KQnOpJ6%pJjJ0pkQmLq
8102akPqj2J9KOj8MJ1k0jJ9okmJ4J1k4pM%KkQJ1lj1jLNj3pJ0N%OJ1j8LqJ0Jj1
8146gJ2%Qj5qRJ0j0LkOj1KJ8oj0ljqkNJ1Nj1mQljpJ2RqJ%J1k3%J1loLK0Pj3j0
$$ y = [5, 7, -8, -19, -5, 2, -5, 1, -1, -7, -10, -25, -3, 8, 6, -14, -10, 10, 6, -7, 0, 6, -2, -12, -11, -1, -4, -12, 2, 6, 2, -12, 7, 7, 7, -8, 1, 4, 3, -5, 6, 8, -7, -13, 2, 10, 13, 5, 7, 10, -4, -13, -6, 9, 4, -12, -10, -8, -10, -10, -8, -5, -11, -19, -9, 4, 10, -12, -2, -5, 0, -3, -3, 7, 18, -2, 10, 4, 12, -1, 1, 3, -1, -8, -9, 0, 6, -8, -9, 3, 16, -8, -4, 9, 9, 4, -17, -13, -2, -5, -6, -9, 11, -8, -21, -2, 11, -2, -7, 0, -4, -8, -14, -12, 8, -8, -14, -7, 2, 8, -2, -3, 8, 7, -5, 6, 21, 1, 1, 7, 4, -8, 4, -4, 12, 11, -4, 0, 8, 16, -1, 1, 4, 1, -14, -2, -5, -4, -12, -9, -6, 3, -4, -2, -7, -3, -9, 4, 10, 17, -7, -4, 2, -4, -14, -12, -4, -9, -3, -10, 6, 6, -1, 0, -1, 9, 2, 0, 8, 4, 7, -1, -3, 4, -4, -16, 3, 5, 11, -7, -3, 8, -12, -13, 6, 0, -2, -6, 8, 19, -5, -12, -8, -8, -6, -8, 0, 11, 8, -3, -4, -1, 4, -9, -16, -6, -1, -1, 5, 16, -2, 1, -7, 3, 4, -7, 5, 5, 13, -2, -10, -1, 9, -1, 2, 0, 6, -5, -3, 15, 9, -1, -4, -5, -13, -15, -10, 1, 6, -5, -9, -1, -4, -5, -12, 0, 9, 1, 2, 2, 13, -10, -10, 1, -2, -8, -5, 15, 22, 9, -1]
8191a
$$ Imaginary data points
##PAGE= N=2
##DATA TABLE= (X++(I..I)), XYDATA
0@%%%%%%%%%%%%%%%pJ5j6J6j6J6k4L2l2M0m8N6o4P2q2R1j06J22j38J54j75J99
37A05k24K49k75L08l46L85m25M71n20N73o33O98p68Q45r34J030j134J254j387
56g28J537j709J908k142K421k758L177l721M447n477P076r896J6352n8424j5188
71f3125R7127K4570R949l3500m7340k5537K9756K9020J2591j9208l8193k3797
83d7687K6632L8021K2779k053l4060n5352j8887K9123M7923M0672J4042k8602
95C2551l4856r099N483Q636J2947j1118l6560j5417K1793K7193K2390J3867j4602
108B3208l5408j8375R946K2924J9636M612r888j2968j2023n279Q779P626j0232
121g442j1908L409R999R805J0315K571o873p260n519r37P742M094q629o253M124
$$ y = [0, 0, 0, 0, 0, 0, 0, 0, 0, 0, 0, 0, 0, 0, 0, 0, -7, 8, -8, 8, -8, 8, -16, 16, -16, 24, -24, 32, -32, 40, -42, 49, -57, 65, -73, 81, -94, 105, -119, 130, -145, 163, -183, 202, -223, 248, -272, 301, -332, 366, -402, 443, -491, 539, -595, 659, -728, 809, -900, 1008, -1134, 1287, -1471, 1706, -2015, 2432, -3045, 4031, -5865, 10487, -47937, -63125, 34002, 58572, 68521, 35021, -12319, -37856, -8100, 20920, 33511, 14303, -23890, -47687, -21055, 16966, 39745, 37692, 3632, -51720, -70607, -41484, 6439, 47111, 61153, 32551, -2305, -11404, -5921, 2715, 15662, 4544, -32016, -47433, -25640, 1553, 23943, 37810, 23208, -12200, -30575, -20629, 2295, 21931, 26543, 16655, 3687, -8336, -13615, -4836, 2790, -7442, -19350, -15941, -5942, 3863, 14178, 16749, 9876, 2616, -2903, -3840, 3902, 7996, -633, -6886, -2762]
136b762K077l904k783o12J209M480P880J0978L666j6119k0503l32J2335R055R662
151A4327M229j5599k0673k513J2061J4658R228p025j7752q158O058J4663J9982
164B3486P081k0763k8061j0251O920J8727K2656N252j7554j9951p741Q813K2873
177A1487J4039j3050k2779j2487j244J6185L1428J4382k0109l0296j6827J694
189b7577K0510K5853Q854j2342k2181j7609M904K5849J7191o704j6801j6337r551
202b5941J1000K6996J6456p374k1942k0459k515J7912J9958P390o120j8861k0744
215b4244j20K1848J9700L405r293j5800j2792J436J4343J4667L205j1498j5068
228a0211l322Q491R848O849M02j1003j4675k900J0379J1993N397k044o232o013
$$ y = [-2762, -685, -4589, -7372, -7984, -6775, -2295, 5585, 16563, 20229, 4110, -16393, -16725, -4390, 4665, 14327, 18556, 2957, -17716, -20229, -8168, 6490, 15718, 8693, -9059, -17217, -11159, 3504, 23486, 30567, 9804, -18257, -28508, -21588, -2861, 19795, 25047, 7493, -12458, -20199, -11386, 11487, 25526, 12476, -10303, -22790, -24034, -7849, 23579, 37961, 17852, -12444, -29271, -27577, -7067, 18786, 27640, 15298, -6883, -24492, -19588, 6261, 23452, 16748, -53, -16390, -25941, -14941, 12055, 28511, 21137, -805, -21264, -23779, -5867, 14091, 21481, 15361, -3500, -24244, -24364, -2516, 17184, 20589, 11296, -4504, -17296, -15860, -1517, 13150, 16355, 4857, -10211, -13533, -5042, 4806, 11655, 12057, 1054, -13621, -16521, -6142, 5851, 11248, 9204, 2972, -3041]
242c041k827K285O222K553n676o295R29M733L446L052K358k411o940n306L85L013
258c520J117J369N224M658k083n781l612k190k065J619O146M620j748m708q54
273a808L619K441q00k087m374o871k058Q555J2181M714m753q366o680k252L792
288d747Q160N109m975j1006m558O885J1014P257K26q687j4749r522N408J5971
302A786J2704P34q526r979n904J494Q758Q067k930j2596q885L810J2441J2219
316A3193N646n191j5158j5239k550J1925J4626N714m197q176o907j310O661R154
330H191P57j0453j1474j621Q713J2367R768J727r564j5798r766L514J0952P942
344E255J530k505m276l284J824O211K797n904r466l932M093Q114Q398N256k683
$$ y = [-3041, -5868, -3583, 2639, 5192, -484, -6779, -5850, -1117, 2329, 5381, 7739, 5328, -1612, -6918, -6533, -3520, -2403, -1034, 4190, 8848, 6765, 984, -2628, -4818, -6883, -5264, 882, 5502, 3754, -954, -1808, 1811, 4252, 3452, 1365, -3009, -9880, -11938, -3383, 8798, 13512, 8759, 393, -6287, -8539, -4747, 3413, 8522, 3547, -7459, -12017, -5132, 5882, 13139, 13365, 4678, -10071, -19593, -14185, 1786, 14490, 15224, 6698, -3281, -9185, -7691, 1067, 9134, 6204, -6392, -15277, -11467, 974, 13193, 18839, 13648, -1510, -16749, -19299, -7374, 7252, 12966, 8769, 593, -6314, -7624, -963, 8191, 8948, -1505, -12979, -14600, -5887, 6480, 16248, 17975, 8411, -7387, -17153, -13639, -2687, 5255, 6785, 4280, 4, -3280, -1456, 4755, 7552, 1648, -7818, -11750, -7657, 457, 8855, 14111, 11428]
359A1428j1062j1103k293N853O991M448J993j206m455l419J755L988j04m285l074
374d545J07J336K903N289L679k973p582n355j51K768L870N038L491k364o614l745
390d848J432K329J177J410O49k368k984J013M700K914k296m832l086r95J046N568
406H29P687J533o731p768l544N04L938O265M602p45n636n048P95M130J017j956
422a28j241j772k025L275Q094M145l774p679o661k193L246O397O874L396m401
437E553q073k427K794J603O61J319j824m047K87N471N598J487m366p228m403n49
453h144K457P004P505n41o637m173r34j36K353L578J07l332k946M18M591M557
469E727l44l283l245m480k901M649Q377L080k696m065l999k364J432M800M681
$$ y = [11428, 366, -10737, -13030, -7177, -186, 4262, 6255, 5049, 594, -2825, -1070, 2918, 2814, -1471, -4545, -4438, -3102, -199, 5090, 8769, 5796, -1786, -7141, -7292, -4524, -654, 4384, 7875, 5511, -1103, -4848, -3416, -1087, 90, 1500, 2149, -219, -3203, -2190, 2510, 5424, 3128, -1704, -4790, -5785, -4739, 829, 8516, 10049, 3318, -4450, -7994, -7490, -3552, 2713, 7315, 6570, 934, -4114, -3319, 811, 1828, -128, -1369, -3141, -5166, -1891, 6203, 10348, 6574, -1105, -7766, -9959, -6713, -316, 6558, 9954, 5553, -2520, -4947, -2153, -550, 111, 1430, -394, -4441, -4154, 1317, 6915, 8402, 4036, -3192, -7595, -8144, -5687, 1317, 8822, 8281, 1644, -2529, -3463, -3599, -1246, 2332, 2439, -893, -3839, -3421, 1170, 5727, 5383, 2100, -1145, -5625, -8526, -3877, 4500, 7580, 4884, 819, -3180, -5544, -4112, 688, 5369]
484E369R7n477n049N90L314K657K578P94m056n611j011M461N469J182l393l893
500a979k410j107L339P740L757m629p137m198m23L482N505L642k81m502n156P85
516c572N482K162j787k122m075l970L341Q356M618o24m703p614m339K255M335
531b257M761M180k210o275l63L807M17m37n0m411n045J382N712O170M047l014
547F414p282l274j093j447M689P701p12n005K74J047j698N41Q74k505j915m00
563c791j59M206N912o84l508k73k392m674R44M208J147N95R12j561j165K91j497
580a489j41K910o98l221J446K472j140J131L420j648m834j865j3Q31L134K689
596B984J09j563l237k200K923M052l03j802j035k639j752L182M928J536k590m974
$$ y = [5369, 5466, -11, -5060, -4470, -1156, 1501, 4079, 4873, 817, -4794, -5805, -1344, 4125, 5307, 1914, -1979, -4389, -5496, -2157, 5583, 9340, 4711, -2426, -6624, -7047, -3565, 1940, 5582, 5301, 799, -4357, -3572, 1910, 4072, 2285, 163, -3912, -7882, -4541, 3815, 8433, 7809, 3106, -4508, -8847, -6592, -2257, 2504, 6684, 4474, -1801, -2164, 1643, 2060, 1623, 1573, -2838, -7883, -6501, -789, 5381, 9428, 6414, -868, -4142, -5235, -6682, -1993, 5708, 4996, -9, 265, 1312, -386, 155, 1029, -1476, -3391, -3791, -3950, 256, 6168, 5484, 1976, 1703, -689, -5363, -4419, -211, 936, 1531, 2443, 882, -283, 8, -1489, -1630, 1280, 582, -2639, -1193, 1279, 139, 1270, 4690, 3042, -1792, -3657, -3670, -2839, 295, 2984, 3093, 1530, -1707, -3907, -984, 3068, 2765, 963, -72, -2711, -4463, -1281, 3647, 5183, 2593, -2381]
612b381l046J810L650K611K067q06n864m749K347O258L807p84l845m131k639K82
628e413N534P015l35p032m524J03J711M218M766o42n522m986j308L922O576K192
644F275l052l726l686j994M286O692Q46l606l751l276J84N079M163J72j960m785
660b139m210K969N832P27j052k21l873l646L583N514O07j837k694l241n5K753
676i83K260K430P63m775m342K315K867n28Q87J181k588j973J633J895J472P24
692C238k742k896Q86L63j297K175L119j462k066R07n6j637R4J248J068R50m68
709A424j252K44j62j642N07J875j453k640N91J813J011J814J674j070k950k233
725b449Q3K584K432l19j815j796j930n47K767L417k6k973k281N82K583K702J870
$$ y = [-2381, -5427, -3617, 33, 2644, 4711, 3905, -1959, -6708, -4361, 1897, 5704, 4920, 1075, -3056, -5695, -5413, 121, 7136, 6801, -231, -4755, -4652, -2941, 1277, 6043, 5401, -121, -5107, -6415, -2493, 4083, 6275, 3223, -503, -4189, -6183, -1897, 4795, 5641, 2035, -1716, -4992, -4808, 271, 4434, 4606, 2646, -2139, -6349, -3380, 2452, 3179, 2127, 1906, -1967, -5613, -2030, 3484, 4091, 2254, -440, -3681, -3736, -983, 1277, 3707, 4470, -305, -4647, -2332, 535, 7, 894, 2075, -513, -2486, -853, 1042, 2514, 3238, 496, -2400, -1514, -1151, -2448, -273, 2846, 1384, -682, 225, 169, -1468, -1374, -126, 942, 1892, 1424, 172, 416, 254, -1388, -881, 994, -459, -3099, -2508, -695, 316, 2130, 3804, 2734, -216, -2449, -2366, 218, 2650, 2331, 516, -1280, -3210, -3757, -990, 2427, 2401, -572, -2853, -2271, 312, 3014, 4884]
742D884O4l591n262j366L475L574N22j570k600k552l89L328N334K487k883m576
758a121j408J363K075K642J119l462n692k323K371M421L160k41k716k590j153
773c555J693N125L975j777m842k921p12N96K332J999j337l676k335J349M387L651
789C952L36j451k138k680m96L588L449r48l435k597j313m1J610K213R07j258j851
806b153N20L173K392k6q23j366k812k063J057K325N14j161q59j47j83r9J124J934
824A347N38j013j22J187J86j236o00J24r28j695n01R20P77K47R46J528J29j632
842B02j050Q04R90J36K26L35j087k259r04J444J556j61r32k90j4M5J369K413O92
861C515k323k822p01J018J329J336P86j130k866j662J674L085J241q16j333j360
$$ y = [4884, 4948, 1357, -3905, -5271, -1796, 1778, 2300, 730, -1870, -4422, -4811, -1483, 3851, 6338, 3455, -1121, -2529, -1166, 909, 3551, 4670, 1208, -4484, -6807, -4436, -15, 3145, 2904, 188, -2402, -3555, -1862, 3263, 7238, 5461, 619, -2302, -3014, -2418, -86, 1913, 576, -3100, -5435, -4086, 301, 3952, 4288, 2837, 699, -1981, -2477, 1111, 4560, 3612, 177, -2420, -3733, -3774, -2164, 49, 956, -302, -2153, -1633, 1540, 3932, 3906, 3083, 1717, -1095, -3158, -2101, 224, 738, -423, -1282, -1429, -1612, -1711, -587, 1347, 1885, 872, 750, 1937, 2123, 887, 287, 411, -517, -2212, -2713, -1793, -1016, -769, 177, 1705, 1834, 202, -848, -44, 946, 1082, 1308, 1643, 556, -1703, -2607, -1163, 393, 232, -700, -990, -1004, -959, 410, 2823, 3515, 1192, -1630, -2331, -1313, 16, 1352, 2138, 1008, -1858, -3520, -1846, 1239, 2480, 1664, 331, -1029]
877a029j069P96K849J862j542l337j768O71J855K166J738l00l005k930L43K772
893G2J981q5j145j670j739j69K467K903J44k507k093l2J130J628J878N13k343
910I33l338j016J686K082P34k80p32j256q44J326K832J106j650j938o47r3L82
927g13J333J117q37k351j510P58J798J010M27N22m33j568l33J682J054p87j160
944Io48o54n71L76J359J043n78j184J51Q87P0K47J296L97j516j434K2L98r3r9
964e22L52J56q71r47P91J851O25m16K2j88j195o36J084J279k53j464j069n7J42
983a316L21J426J362q03j930l49J139R81M79J76n32j433j447J28J958J318q40
1000F38j124k74n10r5J794J868l84j728j359j69R35J012L67K28p05k216p35K186
$$ y = [-1029, -2098, -1302, 1547, 3409, 1867, -1470, -3238, -2567, -712, 1454, 3192, 2892, -113, -3043, -2700, 72, 2053, 1968, 823, -847, -2586, -2755, -288, 2615, 2759, 252, -1841, -1873, -743, 885, 2763, 3276, 933, -2405, -3421, -1735, 347, 1081, 801, 69, -1187, -2031, -705, 2127, 3233, 1583, -355, -1002, -1095, -713, 620, 1737, 900, -1451, -2961, -2203, -405, 605, 1032, 1554, 1121, -447, -780, 902, 1956, 1169, 9, -639, -1293, -1864, -1488, -129, 914, 336, -848, -697, 190, 260, 507, 1803, 2200, 684, -750, -728, -330, -423, -522, -170, -14, -885, -1832, -1041, 810, 1435, 1019, 1041, 853, -342, -978, 106, 1385, 1132, -332, -1401, -1458, -1316, -995, 431, 1793, 990, -940, -1289, -150, 831, 1310, 1486, 954, -479, -1926, -1798, 160, 1478, 638, -486, -760, -1270, -1365, 429, 2297, 1913, 185, -1174, -1343, -408, 604, 971, 1199, 494, -1722, -2457, -271]
1018b71J741l62l44l69j501o64J380J610N93p35j890r18R14N93L46J491J41k552
1036g97j313J397J129K99M82m20j336p17r3Q37J986L88j961p89O63n14k2K018
1054A237P18j743j204k4J53P98Q37r2j62m85j433M3K077O60r70j4o0j346k57J409
1074A42P86k13n35q74l03N92K90M13J017l33j827l86J166L85o0M83J2j057r68
1093a270J79J258R92m70q01Ok66o56P18J566J44j275r89oN05L32L15P27n5j564
1113f10r59J077J119mj6q6q63p15J13Q48J247Q9j471o98N64j61RJ587N57j635
1133hj006L16J48N20R04j48n82m14r13J14J908N48j258m5K64j372k25J939O51
1152A341r52m85n11m55P66O39rO59k13j967j99J929K59p68O83j4j649l74J022
$$ y = [-271, 1470, 1108, 764, 395, -1106, -1770, -390, 1220, 1813, 1078, -812, -1730, -816, -223, 123, 1614, 1755, -797, -2110, -713, 416, 715, 1197, 777, -559, -1276, -1369, -532, 1454, 1842, -119, -908, -245, -759, -781, 1237, 1955, 212, -992, -1016, -863, -65, 772, 680, 518, 33, -1400, -1357, 720, 1380, 410, 396, 336, -1010, -1267, 142, 928, 715, 180, -694, -997, -405, -115, 298, 1315, 982, -845, -1231, -65, 320, 260, 743, 755, -302, -1270, -1091, 167, 1159, 689, -112, -106, -372, -1028, -310, 1256, 1400, 125, -864, -870, -365, -33, 282, 1009, 954, -610, -1569, -492, 627, 623, 607, 521, -342, -1057, -944, -96, 1151, 1240, -231, -929, -365, -526, -517, 1070, 1627, -8, -1014, -698, -550, -30, 874, 726, 144, -270, -1183, -1069, 839, 1387, 129, 84, 348, -1024, -1249, 690, 1341, 389, -96, -607, -1062, -296, 343, 334, 993, 780, -1187, -1386, 543, 802, 34, 717, 703, -946, -1320, -298]
1171b98O29N02l6j273m01P43k42lJ644K39k043o61R91J38K8Q02J8r09o38k51N70
1192d51J307R9r01j5j2r94K11J674K62j002m58j97k58L44P43M10l3p62r95K31
1212g97J064K67j58K06k99j052l44R59R82j16p23k41N1l69n5J097P86q10j113
1231f65k3M35J95K61M57M8q28r85K84J188L75m11j9j44p92k69Q23Q13Q5n83p88
1252e43j11M11L5K82R12j81j491l48R73K21nM95jr00o25J85P42P16j93p13p0o
1274b15n10L54J307M1j122l61K15r4L05N70K11l01o93o64M41J045N5n25J78r2
1294A45r61J0J227N41n54n33k36m8Q3K61N26M26o75j103J25Q53O5n1M96j04r96
1315e03m34O11P60K08l15l64j79k45j92O30R26k34r67k40L48j2O5N79L50n68q17
$$ y = [-298, 331, 833, 797, -476, -877, -134, -376, -379, 1265, 1504, -539, -1200, -209, -71, -43, 759, 777, -132, -770, -1021, -451, 856, 955, 54, 39, 27, -967, -756, 918, 1180, 178, -280, -477, -735, -391, 352, 762, 729, -33, -1028, -797, 267, 534, 376, 582, 283, -769, -1113, -154, 828, 712, -11, -252, -201, -570, -625, 472, 1258, 448, -665, -688, -253, -58, 203, 660, 708, -120, -1105, -821, 367, 742, 331, 312, 168, -624, -893, -70, 743, 828, 245, -543, -654, -243, -208, 74, 986, 805, -686, -1034, -61, 160, 155, 650, 649, -251, -876, -691, 51, 767, 574, -139, -209, -215, -725, -371, 936, 977, -145, -506, -291, -385, -80, 490, 701, 400, -293, -957, -516, 529, 584, 59, 237, 145, -816, -806, 421, 962, 408, -125, -361, -409, -326, -65, 461, 887, 212, -891, -766, 87, 152, 101, 597, 493, -503, -937, -326, 434, 642, 327, -37, -216, -461, -653, -23, 903, 669, -298, -538, -190, -202, -137, 442, 792, 224, -593]
1336e93p6O33M00j16k2R6m60o62L07R82K51n69l48M4j54j67M62P08j11q39m25
1357f59L59L37MK06L30l04q48k26P37O19j71k99k8k40n12J89R30M28n45o06n5
1378c54J14j1L14N90O7q41o91L10O49P3l5K19j75p58k83P17P37n4m43k16j17k74
1400d62J2O91N48m49q14o3M04Q4P2M36J19o62o44K49P05K44k39j18k7l82l42M62
1422a76Q01Ko57k53J38m1j8M36M28l64p86j98N20L80k8J04J82l76o59Q1P31K93
1444E40l51l17j6j72k47K76P37J70o15m30K17K25qK54M09j78p83m26L71M59n3
1465F2j76J11p5m40K7Q03N59k68m59r0p5k17O4M58K05n69p03Q8N11J06L9M27J14
1488E02n39l13M68N54J2l79k85j85l76k91M12O82j61n75P2M02N6J18M66J75m13
$$ y = [-593, -669, -36, 364, 248, 226, 322, -138, -800, -493, 489, 740, 171, -177, -133, -287, -454, 8, 716, 605, -234, -659, -300, 37, 41, 247, 577, 273, -575, -801, -64, 555, 384, 85, 57, -183, -695, -506, 424, 852, 307, -299, -354, -240, -251, 63, 653, 720, -121, -812, -502, 147, 220, 185, 404, 229, -529, -812, -95, 642, 588, 145, -71, -188, -462, -450, 241, 789, 340, -474, -537, -133, -49, 23, 459, 578, -84, -728, -479, 226, 470, 231, 113, 86, -296, -638, -176, 625, 627, -30, -283, -145, -186, -204, 232, 660, 296, -490, -688, -168, 212, 184, 288, 470, 94, -565, -484, 247, 540, 189, -128, -144, -316, -563, -287, 450, 620, 5, -425, -208, 17, 9, 263, 672, 494, -289, -715, -344, 115, 62, -114, -3, -78, -518, -491, 312, 871, 603, 144, 54, -21, -238, -174, 284, 489, -80, -783, -695, -184, -78, -39, 388, 502, -37, -350, 118, 672, 684, 305, 20, -165, -541, -832, -420, 262, 101, -474, -402, 0, 56, 174, 640, 815, 402]
1509D02n69j60L69K29l14k16J25l06n31M07Q84J29k90P5R8j08l0J38K38q5p29
1530b44n84L25L09k37J68N75j97n70J97N48K09J7q6j62j73l46k38M56M11n00n01
1551f23K63J25k22L90O72M3l90l13q5K37J40j98N9J30n54n25N72O69j82k00K05
1572B13j44l73O9M66L45k09o00k11K49M9j1M40K33n36m82K51M44J70m6j70k13
1593f6l24l09L43P34N5n30j73J57L1J69M37K86k90p45m38L73L64k39k9K82l68
1614b80n19N18Q20Q8j49p3k40j73N0JK34J17p17o55L82L03k39L12N75j74k08L52
1636C25K68J43N6n33m85J17k63n60M81N51n86k74P20J88k85L91M27j48m1l8k17
1657B37J20o8o73j68L02m68m34O52N35j42L40N60j04k23m3k01M1J74m80m62K49
$$ y = [402, -167, -327, 42, 271, -43, -259, -134, -440, -971, -564, 320, 449, 159, 234, 332, 224, 194, 332, 570, 485, -244, -828, -503, -194, -431, -263, 312, 115, -455, -258, 290, 499, 516, 430, 268, 95, -251, -489, -33, 378, -122, -623, -360, -235, -457, -67, 605, 648, 258, -55, -140, 97, 237, 39, 98, 228, -326, -851, -279, 390, 208, 8, 213, 69, -304, -235, 231, 576, 367, -233, -444, -195, -146, -157, 283, 516, -20, -502, -251, 193, 363, 317, 147, -66, -390, -699, -356, 378, 433, -97, -270, -113, -82, 87, 524, 810, 520, -225, -663, -290, 74, -165, -194, 88, -280, -799, -281, 539, 627, 478, 405, 165, -8, 42, 43, 277, 394, -323, -978, -596, -293, -532, -220, 355, 181, -27, 325, 593, 736, 792, 259, -226, -109, -372, -932, -451, 100, -486, -760, -40, 148, -137, 254, 681, 533, 492, 454, 237, 357, 289, -384, -552, -250, -718, -1152, -500, 35, -107, 233, 793, 689, 466, 423, 222, 263, 437, -43, -505, -256]
1678b56j33n34L88P15k55m19L26L20J02L34L22K0l55o98m58L01J90l74q5K07j96
1699e38j74O23P48J18k95l40j33P4J03J48J92k60p52l80L30L95O6m5K7o5j15K25
1721d8P57M21m88o77j44j35k02L15M32j73n00j78K18N23L17j27j14m9m31j36P25
1742C06N24m41m64r4k44r4K89K60P9p9l37K4O61K23m26jQ9o13l04N94L92k36j12
1765dn2j20J01O7p9J95P6m64k1O30M2m24Q7J37l87j39K86R4n3%n7J41K61k32k84
1790a99K43O1l97J19M85j14l90R2J83j6Qkn5n2j80m7L96L14l12l42J23N2j50J90
1814A0L57j16m67k26K22L65J33j14p0j23l12n8M64L86k28m08p4J21L8J72L16N
1836C93n15m49J62M35K43kl8j64l02q7L48M33q0n18k68J09J21J53L70J99m18n18
$$ y = [-256, -389, -923, -535, 180, -75, -494, -168, 152, 254, 588, 910, 930, 575, -123, -581, -280, -90, -464, -549, -342, -538, -712, -89, 659, 777, 482, 142, 9, 83, 186, 334, 526, 266, -486, -866, -536, -141, -75, -120, -93, -158, -273, -48, 709, 1130, 642, -35, -179, -314, -516, -201, 231, 58, -442, -620, -402, 121, 438, 311, 197, 148, -283, -419, 306, 830, 389, -75, -169, -413, -507, -218, 42, 121, 42, -295, -271, 390, 613, 187, 186, 275, -338, -642, -48, 344, 108, -4, -56, -176, -75, -8, -87, 108, 184, -280, -301, 329, 371, -53, 34, 171, -216, -355, -69, 25, -28, -28, -85, 56, 317, 85, -199, 44, 105, -292, -173, 312, 198, -192, -100, 83, 67, 75, 73, 18, -34, -214, -261, 135, 449, 137, -205, -82, -30, -180, 10, 367, 251, -216, -442, -220, 145, 278, 164, 94, -29, -341, -399, 65, 451, 223, -185, -259, -138, -100, 72, 388, 393, -122, -571, -409, 26, 269, 267, 229, 65, -237, -324, 24, 457, 377, -141, -409, -300, -179, -26, 344, 543, 125, -393]
1858c93QL33K22Rn1p4j79j62K23M65K9n30l16P2L2R0L97L42j71l91j02J91J34
1881A78j21j76l2j5j52J65M95J55l59k90J8m4q8J42L03J11j30r8J70O8k99l26
1903c25pO1j06J11M63L00j44k00j3o6k80j95J06K15N0P7K63J50l11m10m0Q0q9
1926c10J2K88K70L6o1J16M8l24m74j41J60J54J53L69K71k03l81j17Q0m1j31M8
1948a78J73N3m8K33L10j61n24l05J0P0J31L28L16l3l16j40J23M5j84j00P1l0q0
1971b36J98L98Q1l20k69m4Ok4J17K68O3k53j31J96J79r4j36J4r2k07K3L06K28
1994B71r2j87K8M7j26n2J71P7k43j87J54K32M2mO1l1k49k57Q8K37M6o8J25J35
2018B18j39j34J21P0j76k04MJ46J13L8J52J89j51m02j30J55K6l9J91J96j05j65
$$ y = [-393, -385, -52, 170, 179, 128, 54, -125, -287, -64, 401, 430, -100, -416, -344, -312, -222, 175, 517, 346, -45, -147, 44, 178, 57, -119, -151, -166, -318, -153, 342, 497, 138, -152, -134, -178, -266, -124, 179, 290, 160, 62, 232, 300, 1, -325, -332, -271, -377, -266, 197, 497, 353, 153, 140, 74, -206, -401, -295, -80, -30, 47, 310, 460, 149, -261, -301, -221, -310, -298, -10, 260, 296, 235, 351, 399, 75, -399, -540, -380, -226, -73, 296, 567, 364, -17, -134, -54, -95, -226, -178, -5, 48, 0, 233, 543, 382, -142, -447, -437, -367, -236, 92, 408, 375, 59, -81, 42, 87, -97, -197, -126, -156, -236, -38, 360, 441, 121, -148, -192, -186, -210, -93, 175, 238, -15, -146, 50, 229, 135, -1, 13, -79, -286, -263, 43, 271, 179, -8, 20, 67, -59, -111, 60, 137, -106, -293, -139, 93, 135, 131, 192, 161, -88, -345, -257, -20, 26, -42, 83, 218, 79, -55, 66, 136, -40, -244, -240, -94, 19, 57, 209, 398, 247, -155, -285, -130, -104, -143, 48, 244, 139, -26]
2040b6L8J10j9j97j28Q2Q0l6J37L09m7l47j67R6J7j7J15J34l1j76m6J71J26j35
2064D3j51N1K3q2N5K39K5k35j72Q6J48L8J9R9j4k60j59J55J66o5o0J07P0p5n2
2089aO2K1k04k17J55K69L2nJ45nk68j82RJ7n0j3J38L15J58j28j08l3k91k88J78
2114b94L35L4j4J06N9m0j09j36p1j03k07O8N24L57r4n1p5m10l24J28K23J2L6K6
2138b0Q4K11O5j23j20k18m26j7N04L65J6K4j05l23j63Q5J02J5j31j98J70M61J83
2161D41j6J1l12o20j66M10L59Q5rn8j18k7N3J51N3l44m28Q7M24K69J58J01k39
2184B65m66k27J46K54J27j24j06O6J53R8J37J9l64m64p8L23L32J62N2p2k25j81
2206a73J12K34q0k86j29J12J77K32K36k9l41m05j04K77K81J9k1K7j29r4K03J99
$$ y = [-26, 12, 122, 103, -94, -222, -140, -60, -96, 41, 350, 303, -44, -211, -115, -98, -115, 0, 134, 103, -73, -119, 52, 178, 43, -108, -57, -34, -116, -61, 178, 203, -32, -204, -118, 30, 68, 87, 186, 172, -88, -247, -92, 74, 9, -51, 56, 126, 51, -1, 61, 82, -122, -339, -184, 85, 117, 112, 257, 252, -16, -198, -189, -172, -222, -235, -97, 218, 376, 248, 140, 107, -184, -472, -294, 41, 75, 61, 167, 226, 186, 77, -59, -130, -233, -440, -372, 152, 509, 415, 364, 289, -121, -445, -317, -94, -82, -46, -20, 64, 275, 340, 217, 97, -121, -547, -564, -60, 305, 321, 345, 240, -83, -246, -161, -59, -44, -175, -373, -203, 258, 441, 425, 436, 124, -496, -662, -252, 107, 192, 183, 125, 7, -20, 33, 184, 237, -107, -535, -448, -24, 245, 403, 504, 265, -201, -428, -282, -28, 99, -25, -131, -65, 88, 186, 323, 342, -22, -486, -564, -241, 91, 253, 305, 233, 8, -173, -61, 173, 93, -193, -322, -210, -33, 199, 435, 406, 65, -340, -444, -167, 114, 133, 112, 139, 10, -84, 119, 318]
2228C18j95l59j72O9K75K73P5m7j24l22j46L71K97k11k25%k7K1K71J78j69l02
2250a51k59P2M30K60j28j46j04k87K5M91K46k41k81j81p6K25L11O6j35k18k46
2271c27J20M95J98k71k47k28k57J88N50K82j77l38k47qK54J82Nr9k91k74K66N93
2293C69J55k60l17k98k15K24N13L26q6l57l01R1K67Q2r4j52k79k29K81N90K99
2314F09k01l81k67n9J76L05K29j22m07k49J59L07J23j08k14k44r4K46N17K62k13
2335C74l89j76M2J49K16P2k56m22j67J98L81K30o5j32q5l2J22L27J11l76m34p8
2357c90J97K36K18Qk74l68j73K20M54K09j60j11Q9O2R4J71j53n64n25n1L59N04
2379E2L26Oj77k77j87J23L44P6k86j62J21K19J97J24k47n88n27q2M21O48L56L8
$$ y = [318, 123, -236, -408, -339, -64, 209, 284, 237, 113, -209, -355, 16, 313, 102, -123, -123, -150, -129, 142, 320, 151, -151, -410, -338, 92, 352, 224, 78, -26, -313, -288, 203, 449, 208, -73, -254, -330, -105, 206, 272, 137, -81, -327, -207, 288, 486, 215, -32, -260, -517, -329, 221, 503, 326, -12, -259, -267, -13, 169, 174, 75, -216, -490, -224, 369, 524, 264, -53, -351, -566, -342, 171, 497, 411, 54, -247, -156, 111, 193, 99, -53, -332, -561, -280, 310, 609, 408, 27, -240, -299, -123, 182, 411, 289, -118, -367, -208, 99, 222, 114, -100, -344, -438, -192, 325, 587, 374, -15, -191, -149, 0, 216, 288, 32, -390, -557, -359, 22, 252, 187, 55, -30, -62, 60, 387, 498, 122, -312, -390, -193, 43, 261, 269, -5, -373, -546, -326, 128, 337, 177, 66, 155, 217, 311, 482, 329, -235, -760, -811, -452, 52, 378, 384, 207, -70, -257, -134, 210, 286, 0, -162, -41, 178, 375, 499, 252, -336, -863, -945, -524, 124, 480, 518]
2401E18j09j73j62N5J78j63m52k66J26M00L89K04j49n11n07j08M08N51K38n7j29
2422B81j24q4Q1J23k15m97l88J30M82M99K48l5l40m22j59K98L87O6k10j84m9O4
2444d8J54J48j02m15l57J00M42L89J58p9k49k85n8K32K64m6l21k53QJ68K22J67
2466B39rl04k92P3L77K69pk13k45j69K8K76K71k9l31k63N6J98J50J10k7k06j95
2489b43J10L27J89j19l17k20n0J16K65K49j0l05k19R4K14Q6l5j32j90j09J58L55
2511B14K23j70l68k05M1J44K13J81p7k91j90J37K76J36j12k01k04p1J29L54K29
2532C88j19l41j84Q7J72J63P5j22k92j79J60L47J79j21k03j48o6R8K32J68j63
2553A31k92j24J55K45J52l3j63k64j89J47L43J70j08j85r7MQ4J65P3j72k91j26
$$ y = [518, 409, 236, 74, 129, 307, 144, -308, -574, -448, -48, 341, 545, 396, -115, -622, -730, -322, 229, 467, 410, 281, 157, 73, 154, 277, 62, -435, -823, -693, -211, 288, 536, 501, 161, -261, -420, -122, 265, 331, 121, -63, -112, -48, 106, 254, 152, -263, -620, -520, -78, 311, 469, 390, 141, -144, -202, 30, 294, 248, -73, -326, -318, -150, 72, 239, 230, -74, -366, -293, 84, 353, 346, 133, -112, -281, -253, 23, 294, 265, -66, -329, -273, -75, 75, 185, 158, -48, -243, -133, 194, 383, 264, -53, -273, -323, -207, 58, 307, 297, -8, -227, -133, 81, 167, 132, 0, -190, -299, -141, 214, 437, 267, -101, -306, -265, -121, 92, 273, 196, -95, -285, -148, 128, 264, 152, -49, -253, -324, -195, 159, 388, 269, -72, -256, -169, 3, 166, 241, 119, -173, -352, -192, 155, 334, 213, 10, -138, -204, -106, 126, 294, 131, -161, -285, -130, 115, 267, 234, 71, -193, -382, -235, 108, 278, 170, -15, -112, -108, -24, 141, 214, 42, -249, -375]
2575c75K12L07J61k6j40k36k03Q3K64J18r6j54k2Q0J34J04J6j49k86j28J88K67
2597A19J05m6q4j23j09N4J55N3j28k10JK15J45O6J5j25k54j16J48J76L1r7r4j0
2621a13P8R0J20K3j73k75pK03J38Q1K2p7j49o1P6J07k5j63j30P1J79J30J30M2
2645C17k02k99m9J36R4K0%kk7K0P9R1p1k60j91R7K18J50J29N2j64k45r7P5J01
2670b8j4n3qQ8Q7Q6R7m8k67k36K5J81J50J19N4n9j81j06L9O4m4n9K4P5P9Q3R2
2697B40o8j92k05j6J38J03O4N4J6j26r2N2L6n3p0K0Q5Q5M6J0j6j16j88j6J88Q9
2723F8l4M7N7j02r2L2L0k2m4KR4J01j1r0j1k9j52KJ73N8k0L1oo2n0l2l4K6L0p
2753d7R9J29n0j41k0l8j12K9J64N1j9L2J4l5o1o8k3J7qJ7J61J31q3j21rm9j07
$$ y = [-375, -163, 144, 305, 279, 139, -97, -300, -217, 47, 165, 69, -85, -107, -27, 107, 211, 227, 78, -208, -336, -148, 119, 224, 178, 94, -29, -138, -84, 71, 124, -4, -214, -213, 2, 147, 213, 228, 103, -151, -267, -119, 57, 88, -9, -103, -113, -35, 55, 175, 198, 25, -250, -257, -54, 84, 165, 187, 110, -39, -100, -24, 83, 58, -105, -235, -164, 15, 145, 275, 317, 115, -184, -233, -97, -3, 17, 17, 15, -12, 8, 87, 178, 107, -153, -344, -247, -29, 121, 250, 302, 138, -107, -204, -129, -28, -42, -95, -103, -15, 72, 158, 255, 207, -60, -296, -271, -90, 60, 179, 233, 174, -7, -113, -74, -10, -54, -113, -89, -14, 65, 148, 240, 172, -20, -225, -241, -103, 0, 64, 118, 134, 8, -84, -32, 4, -49, -119, -99, -14, 71, 117, 127, 111, -5, -193, -209, -21, 68, 34, 81, 138, 36, -56, -24, 6, -16, -60, -58, 36, 137, 126, 36, 25, -4, -156, -154, 19, 77, 57, 88, 82, 20, -30, -62, -96, -70, -40, -47, 52, 181, 131, -10, -30, -68, -180, -151, 13, 64, 45, 77, 91, 56, -5, -73, -96, -79, -87, -70, 91, 222, 139, 18, 9, -40, -147]
2780a47K5J11P4J1jnL5m6j16n1O2J1m3R2J24j8j15l4K1n2o1L9R2M3j2NK1l5p8
2809d8n8P6L4l0K0N6j1n3lM8k0m4J1N6K2pk9rj2o0j1R9P3p0n6L9Lq9L3P3Nq6J7
2842c1O2N5k9n1o0l5n3KJ74J39o7j01Nl5o1J3Q0Pj1k5L9Q8K7j05p8k4n0k5J36
2871a4J74j1o6m7k8n1qOJ5Lj8M7J20N2j19r4m3o2rJ23J31qo4j9pJk0k4Pk0m9M3
2903e9J61O2r1q0k9m3l1P9J13J5o3n3L8M9l3n6K3k2o2K4J16P1o9o9j2J1j3J1M8
2932C6Qr1l2O5Q6lp6k7j2k8J5J01O4n7j16j2N7L3J9L1l3q5n2O5J26M1q2n7j5m
2962c5lR0P8p0j31j0Q5M3J4%l6p3m5N5J32L3r9r2%PM1O3P1q5j28j9R1Q9J3m0n7
2993a8n4m7Q0J48N5j15j25j4L9M3O4O0o0j00m9Q4J06j8n8o0k8j8N9J39P1j09j26
$$ y = [-147, -122, -11, 63, 74, 73, 68, 103, 57, -59, -110, -48, -37, -80, 12, 136, 118, 3, -31, -10, -62, -123, -84, 8, 51, 39, 44, 65, 30, -48, -106, -30, 4, -26, -6, 50, 39, -14, -17, 31, 11, -33, -22, 34, 56, 49, 20, 11, -1, -61, -72, 27, 100, 30, -26, 13, 16, -73, -40, 33, 38, -48, -31, 31, 86, 57, 6, -54, -89, -142, -140, 34, 173, 106, 5, 10, -25, -86, -73, 7, 14, 3, -22, 17, 105, 132, 27, -51, -75, -125, -150, -14, 160, 149, 83, 36, 8, -43, -51, -45, -30, -27, -45, 2, 122, 174, 55, -39, -82, -144, -153, -30, 101, 93, 29, 10, 3, 4, -16, -40, -33, -53, -102, -59, 102, 164, 73, -7, -36, -79, -110, -31, 82, 97, 34, -19, 19, 68, 35, -21, 2, -20, -82, -58, 58, 129, 60, -9, -21, -10, -23, -12, 36, 44, -47, -79, -14, 72, 69, -7, -34, -46, -74, -59, 42, 106, 49, -67, -79, -22, 11, 30, 61, 28, -57, -109, -44, 82, 123, 41, -16, -31, -35, -38, 52, 130, 60, -71, -81, 4, 47, 61, 61, 25, -48, -93, -38, 94, 127, 28, -64, -64, -57, -16, 47, 118, 33, -95, -114, -23, 66, 79, 39, -18, -72, -119, -39, 109, 164, 49, -76, -90, -51, -8, 56, 116, 56, -44, -93, -9, 97, 79, 21, -39, -67, -85, -26, 113, 184, 75, -51]
3020e1l0M3K2K3L8j6r6k4Q8J06k8r2m8j4LP2J07M9r8j37l0N9M0kJ8j7m3j5J20
3049D7J30l0j26p8QK2L3P9L9r9j14k5Q6O0j0j6%rJ2P9Q5l4j36r8qN3L1K5J3n4
3079c5r5J8J27Q4k5m1k8nJ4O0M4m5j61j15M7J08O7K0K6o9o6L1J35J03m6j04p0
3106b1kLK3M5k6j39r4P6J44Q4L1j3n6p7nP4R1o0j20p9K6L4K1L3%q8m7O4J58R6
3136A76jq2n6o2l5M6Q0m6j20l3O6O7M9K4Jq6n2L1J44P8n2r7o4l5m9M0Q5kq0m0
3166a05R0Q4J9j5l1m2p9L0R0O1p4p9k1PK1J9M8om6j9Q3P3j7n4l1m1n9L3J11L5
3196H5m6o9k4M2L3J2K5%q7m9Q1Q6l1n7l4l3j7M6P4N0l8q1n5Q8K2k8j2J9n4m8Q2
3227a8Q7j7n8l3qK8L1M7L4m2j08l1Q7L0l3JRn7kQ8P7mn6p0l5M0J3J6L7k5j18k5
$$ y = [-51, -81, -38, -16, 7, 45, 29, -67, -91, -3, 103, 75, -17, -65, -79, -76, -4, 103, 152, 54, -83, -113, -54, -14, -16, 2, -15, -58, -73, 47, 177, 147, 21, -57, -49, -27, 6, 85, 124, 25, -89, -114, -28, 32, 22, 6, 6, -3, 9, 88, 173, 139, 3, -95, -103, -50, -19, 6, 19, -35, -130, -112, 15, 99, 74, 33, 5, 0, 14, 74, 118, 73, -88, -203, -156, -48, 19, 39, 65, -4, -70, -39, 96, 199, 153, 49, -21, -23, -20, 3, 48, 22, -117, -211, -135, 9, 93, 124, 111, 55, -22, -27, 47, 138, 78, -42, -121, -95, -61, -40, -7, -7, -95, -142, -78, 80, 176, 175, 93, 37, -25, -60, -14, 66, 20, -100, -133, -67, 0, 49, 73, 74, -12, -64, -33, 111, 189, 137, 40, -24, -59, -108, -68, 17, 15, -65, -105, -15, 69, 88, 73, 42, 0, -79, -49, 41, 102, 28, -51, -72, -65, -44, -25, 23, 17, -29, -48, 35, 108, 91, 37, 6, -35, -94, -61, 50, 85, 39, -30, -54, -12, 21, 33, 58, 58, -29, -78, 3, 89, 58, 1, -33, -66, -83, -37, 37, 87, 49, -32, -87, 1, 23, -5, -17, 2, -52, -100, -18, 69, 52, -6, -39, -47, -19, 12, 59, 93, 51, -57, -88, -1, 29, -4, -3, 6, -51, -53, 35, 112, 108, 52, -18, -53, -13, 0, 16, 53, 28, -90, -115]
3259a15P5N3k0NJ6l0rL6M8M3p2j07ON6j1j2O0kp8k8P5R0j5l8j8RpjK9K9o4p0l
3292g0M8L8k4J7K3l4k4M7N2k2m4l0QjnK3J4k8m4nN6L5k7oL1k3l7M4M7l3p1JK5
3325a9J6MnK8j3m2j1J02J8o6k5L4j0l8M3M3j9n1l7L0N7pl9PL0p3k4P8M5o6k6N
3357c1J0LK3J8rj0m1qP3j9l3J7J8m8j2P4J9k9k1LPLK6%Qk6n7J8O2pm8QK7l4j4
3392c0N6L4k5m6j2K1J3k8NL5or1QP0K4n6MM1j6l9K5L5J6m2k4L4%j7j0M7Rl4k5
3425b4M6K3m8pL1J8m6nK7Ml2qK5L6l5l1L5J1l0j6K6K8n6pL4K1l9lK0Pk2j5J8L8
3459B4k2l7K3M3k6m4K9L9l2l4M5K2rk4QL2j3k2qM2j5n4QN4k1k3K4K5l0l9J9L1
3491A5J4k8j8K2Lm2mM9J1m8OK8Jl0J6K9j9k2qL4J5l0oK7K0n3qM1J3l5kL7J8m3
$$ y = [-115, -40, 13, -7, -2, 14, -16, -25, 11, 59, 102, 30, -77, -71, -15, -26, -38, 22, 20, -58, -86, -11, 79, 64, 26, 8, 17, 10, 9, 38, 67, 3, -67, -70, -22, 16, -8, 9, 32, -2, -26, 21, 73, 51, 7, -23, -15, -16, -21, 2, 16, -12, -56, -61, -5, 30, 3, -3, 28, 5, -32, 12, 59, 26, -45, -44, -19, -3, 1, -4, 24, 11, -31, -42, 60, 78, 12, -13, 21, 11, -27, 16, 59, 40, -11, -48, -18, 39, 32, -7, 0, 30, -43, -67, 11, 56, -10, -36, -31, -21, -18, 5, 23, 14, 4, -37, -45, 28, 9, -24, -7, 11, -37, -49, 25, 44, 15, -6, -3, 4, 7, 33, 33, 41, 15, -42, -24, 38, 31, -17, -9, 18, -16, -30, 26, 60, 35, -11, -23, -2, 11, -17, -12, 23, 17, -74, -66, 4, 28, -28, -24, 17, 1, -38, -13, 22, 38, -4, -28, 6, 6, -11, -21, 26, 35, 1, -24, 22, 45, -3, -10, 21, 39, -7, -12, 15, 19, -13, -21, 4, 40, 5, -26, 9, 20, -10, -26, 0, 28, -28, -35, -1, 20, -19, -22, -2, 5, -17, -32, -14, 24, 2, -35, -12, 31, 5, -39, -10, 29, -3, -37, 8, 30, 21, -3, 5, 37, 24, 2, -6, 36, 21, -33, -25, 29, 8, -15, 9, 34, 4, -35, -16, 15, 29, 1, -17, 5, 8, -34, -38, 11, 22, -26, -20, 8, 9, -21, -5, 24, 5, -17, -25, 9, 24, -6, -12, 15, 35, -18, -26, 15, 28, -7, -9, 28, 46, 3]
3525CqK9Kl3j0J7L4l2k0L3J7m6j5K2K1k9j7K8K7l7j7K1K0j4m2L4K8k0k0L4K9l3
3557Fm5K3L0Nl1K9J4rm0J2K8Jl4lL3%l0J2L9j2m5jL2rj3ML4qn5kL0Pk8nL4Mk9
3594b2mM3rl1j8L6J2k2lL0J1l6j8L0J6k6JL8J1k7j3K3J2l5j4L2%j9j3L5J6l5k1
3627b0J4K1j7j0K0J7k8k8J0L0j6k9QK9j4j6J4M0k5k7QL3j2k3K9J9j3l6kN0rk9
3659a2J2L7k4k9J3L6kl8j1L7qk5jL3%l5j0M0nl2kL8Om1%L5J0n4mL1J9k8j1L9o
3694Hk1j8L3K0k9j6J8L9k2k7L4J3l3j7L6J7k3j7J5Olk2RK9l2l9K7M2j6k8J2J6
3726A1k8j2K4J6j6l5J2J7J9k7K9J3k1n5K6N4jl3J2Rj2j5J6L6jm5k5M0K4l0kM4
3758D4k0n6KN4J4k7j0K2j8k9J5L6om1l1K2L4k4LL0rl8j2N2J4k6rJ1Qq%J7mk9k6
$$ y = [3, -5, 24, 26, -7, -17, 0, 34, 2, -18, 15, 32, -14, -29, -7, 14, -15, -32, -4, 23, -14, -31, -10, 10, -4, -46, -12, 16, -4, -24, 10, 39, 6, -39, -16, 14, 19, -12, 17, 31, 22, -18, -6, 22, 23, -11, -14, 19, 19, -11, 1, 40, 28, -17, -18, 14, 5, -8, -4, 30, 22, -33, -35, -5, 2, -26, -31, 3, 7, -22, -26, 17, 8, -23, -41, -5, 7, -15, -18, 12, 23, -13, -31, -1, 15, -11, -10, 28, 39, 12, -1, 22, 34, -1, -15, 17, 17, -2, -15, 20, 36, 1, -20, -6, 15, -2, -12, 8, 25, -3, -31, -21, 9, -7, -36, -28, 1, -13, -29, -15, 25, 0, -27, -19, 14, 2, -21, 8, 27, 14, -22, -24, 26, 17, -12, 0, 37, 13, -16, -3, 33, 31, -7, -18, 19, 11, -14, -15, 18, 18, -17, -27, 13, 8, -24, -26, 12, 18, -23, -23, 12, 22, -32, -36, -5, 14, -14, -25, 14, 8, -13, -31, 2, 22, -7, -23, -5, 34, 12, -15, 19, 32, -1, -18, 18, 35, 12, -5, 10, 16, 13, -9, 0, 29, -3, -42, -15, 27, 11, -17, -5, 11, -17, -29, -5, 11, -5, -40, -28, -11, 8, -19, 10, 23, 2, -53, -27, 27, 26, -7, 5, 14, 2, -13, 3, 39, 38, -7, -32, 8, 32, 2, 0, 44, 24, -32, -30, 24, 38, 11, 1, 23, 5, -24, -9, 27, 21, -20, -51, -29, 5, -19, -16, 14, 5, -33, -45, 7, 21, -5, -14, -3, 5, -3, -3, 14, 10, -19, -45]
3793d5J0N9k0jL4pj9j9L8Qk6k5J7mKj9J2K0k4m7L5M4Lk8RK9m0j2K8J4l2m5pL5
3827b3J2j4QK5ql8L5N8qm9PJ7l4nK0joj6k9M5L1rJJ8Jm0J0O0k3m1l1Mj5NJ1K6
3863DJ0l8j4M0M7k8k3J7j1m0J3N0nl5l8J0J1J7J0K4J3l3k7N1L6k5m7ROl2J0M5
3895B7K1k7l9lM1J1j5LJ2l6k4J6M5qm4NoJnL7J9l4k4j0L0J1j8j2K6k0k8L3M8k
3929C1l3MK9j3j3K9nj7m5j5M3K2k4oL1Rk7J4N3no1j8K1Jk2oLml5qM4N5k9nK4L0
3965E2m2jK6l5l4m5K7J9J5klJ8oj8N2M9j8l7J8K1l5j1J2l8l7k4K2L3M5rRL1j8
3998C6j6J9J8m3n7ON%j2J3J4k5k1J5O0K9j8oK6j2l4J8J0m4n0k0M3K4oK0L9lk7
4031AJ4L0Rl3k7K0rk1KK2rm0j3K4L1PlK1Rk0qNJ8n7l7J7J3nMM5Ok1l0K8L1j6j3
$$ y = [-45, -35, 24, 4, 3, 37, 30, 11, -8, 30, 38, 12, -13, 4, 0, 2, -17, -5, 15, -9, -56, -21, 23, 26, -2, 7, 36, -4, -16, 12, 26, -6, -51, -58, -23, -11, -25, -17, 8, 0, -38, -3, 55, 47, -2, 5, 22, -12, -17, 3, 2, -4, -20, -49, -4, 27, 18, 19, 37, 38, -2, 8, 68, 45, 4, -27, -23, -38, -33, -22, 4, 14, -24, -38, 2, 49, 21, -2, 15, 4, -36, -23, 27, 22, -13, -51, -41, -30, -13, -3, 21, 34, 1, -26, 25, 61, 36, -11, -2, 4, -28, -18, 27, 48, 21, -18, -21, 20, 31, 16, 19, 31, -5, -29, -13, 32, 24, -20, -15, -21, -20, -25, 12, 31, -3, -27, -37, -7, 4, -14, -26, 0, -20, -48, -15, 33, 31, -2, 2, 31, 18, 5, 34, 29, 12, -33, -48, -5, 17, -7, -13, 18, 27, 0, 14, 67, 62, 1, -17, 4, 5, -17, -23, -20, -24, -59, -67, -23, 32, 3, -2, 22, 52, 10, 9, 35, 0, -34, -79, -52, -33, -18, -20, -23, -5, -11, -29, 23, 72, 54, 17, 35, 56, 21, 10, 22, -16, -53, -77, -55, -22, 23, 14, 23, 54, 36, 20, 39, 57, 14, -43, -37, -32, -32, -44, -31, -17, -42, -63, -48, 12, 41, 23, 17, 43, 31, -3, 15, 25, -19, -69, -89, -46, -22, -28, -8, 31, 28, 1, 15, 45, 54, 21, -6, 14, 5, -16, -14, 8, -1, -41, -54, -30, 1, 8, 5, 26, 35, 15, 7, 12, 30, -27, -64, -47, -34, -39, -35, 10, 16, -5, -35, -7, 24, 8, -5]
4068eOK3k8j0K9J9l7m1J8K0LpL3J8j8j5J4J3k8k8MJ5Lj9K2L0k4l6JK7Mk9%L1q
4103@k3J5K8ln1j0L4Jj3J1L0Nk5j0K6Rl5jK0Ok4j0M6Jk4j3K9%l0j1L8oj5j9K9
4138EK3k7j6RJ2rj8K7Rk5k4K3J3j1j1J7Qk0j3J4K4j6lLJ2oj8PJ3jk0%M4Kk7J5
4174A5Oj8k9PK7j4j3J5L3j6k0kJ3Nl3J5J8Lk4K0lNk0k5K5j8k5K4M1K1k6pM1j2
4208B9n5kK2Nk1J6L1K1l5j3K3j0l1J5K6Rj2LL3j4m3j6ooj3JL4N1k3rJ5pk9l7J4
4243c4K2j0nL2K2k0k8J2kk1j7K6M5LnJ6J8l5l9j%k3PJ5N4J4k3KMj1k6j7K5Pj2
4278eJ1L6nn4oJ6k3k6L0L6J1j9J0J2rl3k4J7Qk0J2N6Rl2RJj4k1mL0oJlL4Pj9m0
4315a7K9rl1kM6K0k2jK0Ql2k1rJ9j1k6J8N2k1k8K1J3l3j7L0Mj3j1K5Pmrj3L8k7
$$ y = [-5, 1, 24, -4, -14, 15, 34, -3, -44, -26, -6, -3, -10, 23, 41, 23, 8, 22, 35, 7, -21, -17, -2, 1, -18, 4, 34, 10, -26, -25, 2, 6, -23, -23, 8, 0, -23, -8, 20, 17, -34, -44, -10, -9, -22, -11, 19, 24, -1, -11, 15, 24, -11, -12, 8, 14, -10, -20, 26, 27, 3, -10, 19, 19, -11, -22, 16, 10, -5, -24, 5, 28, 1, -15, -6, 6, -3, -21, 6, 15, -10, -34, -11, 2, -9, -20, -3, 5, -15, -28, -14, 10, -6, -9, -6, 6, 0, -18, -11, 2, 1, -19, -19, 25, 27, 0, 15, 21, 3, -26, -19, 8, -6, -19, -4, 29, 13, -7, -9, 4, 9, -24, -9, 9, 12, -12, 8, 5, 10, -10, -35, -10, -28, -53, -29, 12, 33, 7, 0, 41, 29, -26, -28, -6, -1, -22, -6, 25, 46, 11, -2, 21, 11, -20, -5, 21, 30, 18, 21, 54, 40, -3, -19, -25, -31, -44, -43, -9, 42, 19, 10, 25, 18, -11, -48, -34, -12, -22, -27, 5, 27, 7, -21, -9, -11, -32, -49, -23, 22, 25, 20, 36, 54, 19, -20, -21, -21, -44, -37, -22, 32, 46, 23, 25, 29, 18, -8, -25, 0, 7, -5, 6, 42, 37, -17, -23, -7, -30, -56, -26, 10, 21, 2, 12, 24, 15, -18, -42, -25, -17, -37, -25, 31, 40, 8, 17, 18, 4, -17, -21, 9, 3, 4, 1, 35, 42, 23, -17, 12, 3, -28, -30, 16, 36, 14, 13, 33, 41, 9, -12, -21, -2, -13, -39, -21, 31, 10, -18, 3, 16, -17, -34, -4, 0, -13, -24, 1, 8, 4, -5, -18, 20, -7]
4350gk4K3L9pk1K4Rj7k4QJ0j7j0J2K0jj9NL1j0m9QK9j2l6K7J0%j4LJ8mk2LK0n
4386@k7%L1Jj9mK5Mk2qK2%j2PJ1J7%k3K0Qm4k0L3K0j1pK4Pk0j0lJ3k9k2L1J6O
4423A5j3K0Nl6k8J8J2j9nJ7L7j1J1Jpl6k7kM8J3j0J6L5k0l4J4Ll7k4K0L5J7K0
4456D8nNk0o0oJ3Rj8K3M8%k0J0Ml9m3rK5L0J8lK7Ol9l0K0km7NM7J3J2J7J4k5m0
4492a2j9JK3J1OK5J9j7k3J9Kn1m5J7M1RK4K8j4l9l0ORj9pJ2K9LjL0Km4m0pJ7J5
4528b0K4RL1k5k0MK4k5k6pJ2K3QL8J6l0m4j3J4LKRJ5kk3K7K4j7n2k6MK4NL5K4
4563D5j8l5mJ3Nj9rPoJJ3M0Jm5l4K1J5J9NKjk9nL3K6j4l6L%lNN4pl7k8K3J6J0
4601B7j4%j9k8jM4L8j3l1k0J3nJ2MJ8n4l2K9N2K2l2rqk2KK9M1lo0OK3K1j6Npm3
$$ y = [-7, -31, -8, 31, 24, 3, 27, 36, 19, -5, 3, 13, -4, -14, -2, 18, 17, -2, 3, 34, 24, -25, -17, 12, 0, -36, -9, 1, 1, -13, -10, 8, 4, -18, -15, 5, 0, -27, -27, 4, 5, -14, -18, 7, 11, -11, -19, 3, 3, -9, -2, 9, 26, 26, 3, 23, 31, -13, -33, 0, 20, 9, 2, 26, 33, 13, 3, 0, 13, -16, -38, -7, 9, 15, 2, 22, 27, -9, -37, -19, -7, -26, -31, -14, 23, 12, 23, 24, 17, -19, -46, -48, 0, 13, 3, 19, 54, 34, 0, 14, 17, -20, -44, -24, 11, 28, 48, 43, 48, 28, -32, -38, -25, -16, -34, -11, 37, 37, 17, 27, 31, -8, -51, -60, -35, -5, 13, 10, 37, 43, 4, -26, -6, -8, -55, -50, -3, 10, 22, 39, 53, 28, -12, -31, -30, -7, 4, 10, 35, 54, 37, 14, 33, 35, -16, -61, -44, -3, 6, 30, 58, 44, 5, -25, -19, -10, -29, -36, -24, 5, 8, 7, 37, 39, -5, -45, -52, -35, -20, 4, 13, 44, 19, -1, 3, 27, 2, -24, -31, -19, 4, 12, 50, 66, 36, -8, -21, -7, -4, -2, 7, 22, 20, -3, 24, 48, 31, -21, -47, -43, -19, -14, 21, 45, 27, -8, -12, 1, 6, -13, -22, -15, -21, -20, -7, 33, 34, -11, -45, -24, -9, 10, 15, 17, 16, -13, -18, 15, 41, 27, -9, -6, -6, -9, -4, 50, 43, 6, -22, 1, 17, 27, 13, 13, -6, -34, -35, 9, 47, 34, 3, -17, -4, -9, 3, 7, 25, -29, -61, -32, 20, 42, 10, 1, -7, -29, -27, 2, 43, 40, -20, -14, 9, 30, 14, 19, 12, -31]
4637c1k7K5N3L8oj6j6rj6J5K4rn3j4K3M2mLk3j6l8MO4K8ol5lOnLQj5n8j4L1M7
4673@K6J0j0nj9J3L2J0l8l5j1J0J9J4J4j2m7l8L8N0K5lLj0j5RK1j4n0p3rM2L9
4706a4L0K0Mm8j7K3L9kl1j5NkK7K0rm6q5nN6N4M0K5Rl0l3J7L0j5o9n2J7M2K3L9
4740D7K1m7p3j5M7M3lKRpnmJ0j5o5o3K9N4M2L3J6j6n1j7L5L0j4k9nlJK9K3j2m6
4775a9m8J3M8L6K8J1l0l5j2L5J7j8o0j8PL0J2L7Nm5n7K1M3L7j5j5j2l4PL9M1l0
4807A9m7j5QL3K0K3pl8k4J3N1J2l9oj9j4J7L1L7j0m2k5J6K9Pj3J3m6k0J2O0J7
4839E3k6m3j4NkL1K7j7l6k6L4L7Pj4rl5k9K6M6L9l7l4j1J9J3K7Oj5l8k4L1N6l
4872D4j6j5j6k2J3L9J0k2m3jL7K5Opj0m0m1K4N0J4j3oj5oPK7qj4n0jM1M3Okk9
$$ y = [-31, -58, -33, 20, 58, 52, 36, 20, 11, -5, 10, 34, 25, -28, -42, -19, 23, 19, 22, -1, -17, -55, -51, 13, 41, 35, 0, -3, 3, -2, 1, 9, -6, -64, -78, -47, 0, 26, 36, 26, 21, 2, 15, 47, 57, 19, -16, -27, -17, 2, 16, 30, 18, -29, -67, -29, 21, 46, 43, 46, 36, 21, 30, 51, 37, -13, -86, -95, -53, -14, 16, 36, 40, -8, -25, -2, 37, 35, 4, -11, -6, -8, 19, 39, 30, -16, -101, -106, -50, 4, 44, 69, 78, 48, 15, 32, 62, 47, -22, -74, -57, -15, 8, 47, 68, 21, -52, -67, -20, 23, 20, 22, 31, 24, 19, 15, 25, 10, -55, -118, -89, -35, 7, 40, 56, 40, -11, -28, 7, 37, 23, -6, -11, -14, -13, 16, 39, 27, -19, -67, -54, -6, 30, 58, 69, 39, 4, -8, 27, 44, 26, -34, -52, -45, -15, -3, 34, 39, -6, -63, -42, 1, 38, 23, 8, -4, -38, -31, 8, 49, 19, -28, -43, -35, -2, 18, 41, 34, -4, -28, -15, 36, 48, 9, 3, -16, -30, -13, 18, 55, 45, 3, -22, -6, 23, 30, 17, 30, -16, -36, -24, 36, 53, 27, -16, -30, -25, -27, 4, 31, 14, -22, -48, -14, 23, 30, 16, 7, -28, -57, -31, 15, 54, 17, -17, -28, -9, 4, 31, 37, 22, -16, -40, -9, 47, 44, 28, 13, -3, -25, -12, 27, 37, 15, -28, -29, 8, 33, 39, 32, 22, -18, -59, -35, 15, 29, 16, 10, -5, -11, -4, 23, 15, 1, -49, -50, -9, 34, 40, 38, 9]
4907Il0k9K7N2jk1j9J8%K7J9ol3l7j6L8L2Rpkl3k0K4K7j8k6j6J5J6L1J5rl1l6
4941c1k2K0L7Kk6POj4K9L2mn0k6J8K8J2J3pJ0l7k0K6L1l0j6%PJ1K7K1Pl2m1j6
4975b8K2J9j0KJj5qK6K6l7l5oK2kL5K4Kj5m7qL1Oj6JLJ1jL4J8l1l3k9K0J8NJ8
5011B3J8j0l2LPRm6MJ3J9OJ7L3l0l8k3NJ3J0jJ2mk7%J5J6j6l1QK7OOJ7jm3j7J3
5048a9K5kNJ2J0j8j4K1Nj4l2K5K2j1MOj8j6k1J7J9%n%Onj9J2Rk5rJ1J1K3j9P%
5085Ck0k4PL8LnKQQk4rK5rj6LL1K4k1Jpnk7rK7J4mpJ5kj6j6Njj6RJ2K2jopqk1
5127b4mQJ9qlK0J4j9j5J7kj7mK2J%kPQj7j0QJ7Jj6J8Lj5j7MK3j3j2QKkrj0L1j5
5167cj2J2NLj7j2K3rqpL5Jk2LJ1Ol2J2J0Rj5OJ5Oj3j3J9j9j0mL8Pqj0J0Mj2l5
$$ y = [9, -21, -50, -23, 29, 28, 7, -12, 6, 6, 33, 52, 46, 13, -24, -40, -2, 30, 39, 32, 30, -3, -23, 1, 28, 10, -16, -32, -17, -1, 30, 45, 36, 5, -31, -53, -33, 4, 6, -20, -13, -7, -21, 8, 40, 36, -14, -40, -22, 6, 18, 31, 24, 34, -3, -23, 3, 34, 4, -12, -12, -5, 6, 33, 54, 61, 29, -12, -28, -6, 13, 3, 5, 6, -9, -17, 9, 35, -2, -37, -43, -21, -23, 12, 36, 38, 23, -24, -32, -1, 5, -11, -10, -7, 4, 3, 37, 55, 24, -9, -38, -18, 0, 5, 23, 41, 31, -1, 2, 9, 18, -28, -24, -11, 8, 14, 31, 64, 34, -4, -27, -22, -9, 1, 0, 12, 8, -19, -19, -4, 12, -4, -35, -27, 0, 6, 12, 29, 28, -15, -32, -19, 6, 4, 9, 21, 31, 13, -1, 20, 25, 11, -21, 4, 26, 15, 19, 25, 7, -9, -30, -13, 6, 6, 1, 1, 7, 2, -17, -5, 4, -21, -30, -19, -8, 15, -4, 3, 3, -17, -41, -34, 4, 7, 2, 4, 12, 20, -4, -13, 12, 3, -13, -10, 21, 45, 24, 25, 18, 13, -14, -23, 4, 18, 14, 7, 22, 20, 4, -12, -7, -8, -24, -15, -3, 19, 18, 12, 5, -3, -24, -28, -20, -1, -9, -12, 8, 22, 3, -12, 5, 3, -14, -18, 4, 5, 5, 3, 10, 18, 1, -9, -1, 16, 17, 1, 19, 22, 7, -10, -6, 17, 4, -8, 0, 2, 0, -9, -19, 12, -3, -15, -3, 2, 5, -12, -24, -1, -10, -18, -25, 10, 11, -11, -8, 3, 9, -23, -11, -1, 8, -7, -1, 14, 20, 7, -6, 13, -6, -16, -20, 18, 25, 17, 7, 17, 21, 9, -26]
5205b6K7Kj4%J3J0jj0j1j4pRJ1J9j2j0J2O%j7Ljk2JK9L2k2mpJ0j7RJ1Rj7olK8
5243B0j3lPoj3mJ7J9Jk3j6J1Nj5PK1k1k5J5J9J2j6Oj2j7J3rL9rl3LNJ0%RJ2j6
5280@j8J1K6Mnj7J1j0kJ3Pkkk2LK3pNlnj6qK2J2j2j3j1klRK3mj2k5J2K5Kj4nj
5320a1j2mK7K3j8k8OJ0J0NMRj0k3J7J6Oj2j9Oj9J1K9lJ5m9lJ3J7pj0JronL1mj4
5358a0j3kKPK9Nj9j2k5K7J4okLkj2J9K8Lj9j6j0lJ1J0J2j4j6j2K5K4j8j0lJ4n
5394DMK5nk9k8lJ2OJJ0kk6%J8L3j1qqjj0%K5pj0l1J1K0J7PQKk1rK3K3k1j6Oj5
5433fJpK3%j8j6nK8J8Pj9MprjK6j0m4LqK3jK6lj5oLK4K2mk2pj1j2J0J3jj6rJ8
5473hJ4K6j5Oqj6j4L3J6j6j3j0qpKK0Lj8pK1mJ4Jpj4j4oK3J9jl4J2j0NPJ2Lj7
$$ y = [-26, 1, 3, -11, -11, 2, 12, 11, 1, -10, -24, -31, -22, -11, 8, -4, -14, -2, 4, 4, -13, -10, -11, -33, -32, -3, 29, 7, 3, -4, 6, -11, -2, 9, 18, 1, -5, -8, 20, 7, 4, 11, 5, -8, -12, 5, 24, 25, 2, -14, -3, 2, -13, -6, 15, -6, -31, -16, 3, 15, -1, 5, -7, -24, -11, -20, 19, 10, -23, -20, -15, -5, -5, 4, 16, 0, -18, -7, 19, 23, 18, 1, 12, 2, 0, 13, 20, 18, 16, -6, -3, 20, 13, 18, 15, 10, -6, -14, 8, 20, 8, -5, -16, -18, -21, -12, 11, 7, -5, -30, -18, 7, 9, -5, -10, -11, -23, -27, 0, 23, 5, -23, -17, -7, 3, 8, 12, 21, 11, -12, 5, 21, 27, 15, -4, 2, -17, -6, 23, 20, 35, -14, -17, -4, 13, 6, -4, -3, -12, -18, -23, 8, 4, -10, -23, -25, -23, -16, 13, 18, -1, -13, -38, -11, 3, -3, -5, -2, -4, -16, 3, 31, 34, 15, -1, -11, -14, -3, 7, 19, 5, -11, -23, 2, 26, 8, -2, -5, 9, 4, 8, 33, 28, -1, -29, -32, -20, -14, -13, -3, -5, -31, -31, -13, 20, 9, 1, -7, -8, -18, -18, 7, 0, -10, -41, -30, -10, 7, 14, 22, 24, 3, -6, 17, 40, 19, 3, 9, -6, -5, -12, 11, 11, -7, -23, -28, 0, 18, 25, 6, 10, 3, -6, -7, 19, 9, -35, -32, -40, -17, -18, 8, 5, -10, -16, -13, 11, 33, 29, 7, 0, -11, -23, -13, 0, -1, -17, -26, -8, 6, 32, 17, 23, 15, -1, -15, 18, 34, 18, 5, -5, -13, -20, -18, 2, 5, -13, -20, 1, -3, 11, 12, 5, -9, -23, -29, -6, 13, 12, -22, -10, -20, -15, -8, 4, 7, -10]
5511a0j4J2L3pj4pPk1LJ8K4j7oqJ7OlKlj3j2RJ2Oqj2LnKMK1k1k3lJ1K4j1Nk4P
5551a6nLK2J1kk9J1MjJJ4J0l3pJ4OLrQNk0J3L0mj8j9KNKpRmj6j0J9K7rj7jRqj8
5593b5K1J8k0j8J0pJ1LJ4j6M%kK7mj5njlMJ8Mj2j3QJ4J0k0nJ0loMJ3Jk8oJ6Pj3
5633eqK4rj2j1J9J3j6Pj3Mj3J1J3Kj6j2NJ9nOLj2JNJ0Ppj4OJ5j5PL%Mk0jL0k2
5673CqJ0qkmMNQk3OOj8JK0Mnk0J1J6nqJ0Pk0KJ7JmNrNLlJ%jj7J0NMl%jJpJ2Qj0
5721Ij7mJJ1j9PJ2kk5J4J7%j4j0J8pmnK3Jj7mK3opMnJ2lj2K3jkj2JKknK6j2pj4
5763a2QJ3j7%J2poJQJ3j7pJ5j6Jk%RrmJ1Oj1j5OJ9qjkK1k1lJ4J2JpPQqk0QQoj7
5807a5K0LjjnJ0lppoJ3ppJ6mJom%jjJ4kKoRj4qoJ5NnQMRj1oKKMj7K9J0j9MqJ1
$$ y = [-10, -24, -12, 21, 14, 0, -7, 0, -21, -18, 0, 24, 7, 1, -7, 10, 16, 13, 15, 12, -1, -13, -4, 8, 14, 6, -6, -3, -8, -6, -2, 19, -2, -25, -28, -17, 7, -4, 1, -23, -16, -21, -18, 4, 15, 13, -16, -5, -1, -2, -1, 13, 23, -10, -17, -3, 3, 6, -3, 5, 10, -10, 3, 33, 29, 11, -8, -6, -1, 1, -6, 3, -1, -17, -27, -8, 19, 10, -7, -8, 1, -7, -25, -4, 14, -6, -24, -14, -21, -10, -7, 7, -9, -5, -5, -7, 20, 16, 1, -4, -5, -8, -4, 14, 18, 6, -7, 1, 15, 25, 5, 0, 10, 7, 1, 5, 18, 19, -9, -15, 1, 8, -5, -13, 11, 2, -10, -21, -2, 11, -5, 2, -11, -7, -20, -9, 4, 6, -10, -22, -17, 2, -3, 3, 6, -6, -5, 0, 10, 17, 10, -4, 2, 17, 2, 9, 12, 12, 16, -4, -5, 25, 3, -5, 5, -3, -5, -9, -5, 0, 8, -15, -9, -3, -21, -20, 0, 4, -1, -21, -10, 6, 1, -7, 3, 10, -10, -8, 9, 10, 6, 11, 2, 7, 10, 7, 8, 8, 7, -10, 0, 5, 9, 6, 6, 5, 6, -1, 11, 19, 9, -8, -12, -11, 0, -19, -12, 0, -2, -27, -13, 4, 4, -10, -20, -2, -9, -13, -18, 5, 6, -11, -15, 8, 2, -5, -1, -6, 6, 3, -9, 14, 13, 11, -1, 0, 2, 0, -5, 21, 9, 2, -12, -4, 9, -8, -8, 4, -3, -9, -8, 0, 13, -4, -11, 4, -12, -11, -13, -13, -4, -13, -17, -6, 0, -11, -26, -20, -1, -9, -10, -12, 9, -12, -15, -1, 11, 12, 5, 12, 20, 12, -8, 0, 8, 2, -15, 5, 8, 7, 6, 1, 11, 8, 1, -6, -12, 1, -6, -13, 3, -1, 0, -6, -10, -10, -11, -12, 2, 0, 2, -4, 5, -9, -17, -23, -8, -3, -8, 0, 4, 13, 2, -4, -2, 0, 4, -13, 16, 26, 7, 11, 3, 14]
5854A4k4KOKPnJ1Lj6j3jKKJ%J6k1PNkj0lJ6Nj2J3k1J7ko%Q%kJ2JKj2KMrlRMM%
5900A3j7K3j1qJ%J3j1Qj3J4j2pnNjjJ0oMKkQpnj2J4Kj1K2j6KJMk%kJ3NmMqMmn
5945BJ0%mlPjj6Oj0J3nj2J0K%j5J2JqlkJ4j1lJ8%mj0J4plQQ%Lj5KQJ3j0njP%j0
5990@K8j3j8oJ2Pj9RJ0mrlJ2opOOMk0OkJ0k5PKJ7j3KnK1ok4J4Lj2QRNlrJ1%Jn
6034AJ4LqnO%rMPnkj8KJ3Jj4J1Oj7kMLKj9%J8nj4K1mKmnQjjkPJj0J0Qj0lJJ3J
6081IKmNj1nkJ8Ok1mJ0j0%J7lnk0JJNnJ1Mj4Jj6J1J5j1LnNjJ0jLpKJ0mMKpJ4j7
6126dLKK4k3pRJjJQj0prLJ3J1j3Lj3Oj1QQnj0lLRRpkkllK9pqkKOj5PJ2mk0J5R
6173A2lJPKj3j2QJ4Oj7k2QLj%J2%nj5MK2j5Lkj5qJK2kkj2NMJ7j0OOjLj1J4kk2
$$ y = [14, -10, -8, -2, 0, 7, 2, 13, 16, 0, -13, -14, -12, -10, -9, -9, 7, -14, -7, -2, -4, -14, -17, -1, 4, -8, 5, -16, 1, -1, -7, -7, 1, 1, -1, 11, 12, 14, 2, 4, 8, -1, -4, 5, 9, 13, 13, -4, 19, 8, 0, 1, 1, 14, 3, 11, -2, 12, 0, -7, -12, -7, -8, -9, 1, -5, -1, 1, -1, 7, 0, -5, -17, -3, -1, -12, 10, -6, -4, -3, 1, -1, -1, -3, 10, 15, 11, 15, 7, 11, 7, 2, 12, 12, 8, 5, 12, 11, -5, 1, -9, 4, -1, -13, -3, -1, -1, -16, -4, -3, -11, -14, -16, -2, -13, -16, 2, 2, -2, -12, 2, -5, -8, 0, 8, 8, 11, -4, -2, 6, 19, 9, 4, 3, 10, 10, 0, 28, 15, -3, -9, 3, 10, -9, 0, 10, 6, -3, -6, 6, 0, -7, -1, 5, 9, -11, -5, -7, 3, -22, -15, -13, 4, -9, -7, -12, 9, 3, -21, -7, -4, -16, -8, 1, 6, 3, -6, 5, 5, 6, 1, 15, 18, 10, 5, 11, 11, 2, 6, 13, 8, 6, -12, -10, 3, 4, -10, 1, 7, -10, -12, -8, -5, -3, -22, -22, -4, -9, -23, -2, -6, -4, -8, -13, -5, -6, -7, -9, -2, -1, -11, -1, 7, -3, -6, -5, 8, 9, 11, 7, 12, 1, -4, -6, 12, 18, -3, -7, 3, -7, -7, 10, 7, 2, -18, -17, -16, -11, -16, -5, -1, -15, -14, -30, -19, -4, -15, -12, -17, -12, -13, -3, -4, -1, -8, -6, 4, 0, 4, 6, -1, 13, -4, -1, 1, 25, 2, -5, 4, 5, 4, 5, 13, 3, -4, -13, -10, 3, 14, 1, 4, -9, -3, -14, -6, 2, -3, -13, -16, -13, -4, 5, -2, -4, -6, -9, -12, 17, 10, 2, 0, 2, 8, -7, 0, 12, 8, -12, 3, 12, 9, 10, 17, 19, 6, -6, 2, 16, 22, 5, -17, -9, -6, -7, -7, 5, 5, 0, -15, -11, 11, -4, -1, -3, -18, -26, -25, -3, -5, -7, -19, -14, -10, 7, -3, 3, 9, 8, 11, 0, 14, 12, -10]
6216a0Qj4J2jK7Oj6qpJ2KlJ%j7oJ3J0j3kj4ORKJ2mj8lNPm%NnqJJ3J5r%j4KJ2M
6260HQj6%j1lK7PqnMo%J6Rnk0k3J2K0mj1oQj2JK5Jk1PlJp%J4qj6nLK3kjOqjpJ8
6306IJ6j1j5%J6pLJpj1j0MK6KLPnoj2Pnmj6rJ5J0j4RJ4k5oJ1J9kPj5oJ0qrJ4m
6348dk0KK8J0j0J2njj0mK4kk3jOJk%jNj3mJ0K0qj1j1J1nKmJ0j2rKPJ4lNj0kj5
6390b1K4J3j4j4KmKoL2qj5KLJ8N%j0J1k4KMJ3roj2J4j2QJ9mj5knOJmpPj3NRJ3
6432Hmj8K%J4mJ1J0k6j4K6j0J8j2LJrRJ0Q%k4lNNKJMj9PQPoJj0MJj0lJ2oLj2r
6476a9J0oMJ3j1oMRJ5j4%Nj0KjMJ0oj3K0K%mJrJjRJ2j0j5PKKklOk0lOJ3%mqkl
6522a3nRKQj5QJ6%lnokj0J2RmqPJ2nLlJ0jk0lJ0J4qoMoj6lJ2oNj3L0NqPj3mj8
$$ y = [-10, -2, -16, -4, -5, 22, 28, 12, 4, -3, 9, 11, 8, 9, 9, -8, -14, -1, 9, -4, -6, -20, -14, -5, -3, 9, 5, -13, -16, -11, -4, -8, -8, -3, -8, -16, -15, -2, 13, 4, 4, -10, -8, 4, 8, 16, 0, 0, -11, -14, 13, 20, 12, 7, 11, 5, 5, 21, 30, 25, 5, -18, -6, 14, 10, -1, -7, 1, -11, -10, 15, 16, -5, 2, -1, 0, -7, -7, 7, -1, -17, -22, -19, 4, 2, 1, 7, -1, -2, -9, 9, 25, 14, -1, -1, 15, 8, 11, 12, 5, -6, -16, -12, 14, 16, 19, 26, 21, 15, 3, 10, 5, 1, -15, -24, -9, 1, -13, -4, 10, -15, -21, -10, 9, 7, 14, -1, -7, 3, -5, -14, 0, -4, -24, -22, 6, 16, 6, 18, 13, 12, 2, -2, 22, 20, -3, -4, 2, 3, 1, 1, 0, 5, -8, -12, -2, 18, 10, -1, -12, -1, -6, -4, -8, 2, -10, -19, -17, -10, 4, 1, 6, -4, -6, -21, 3, 16, 2, -12, -10, -14, -12, -18, 14, 6, -9, -7, -4, 14, 19, 19, 9, 20, -4, -2, 2, 15, 6, 0, -12, 2, -10, -2, 17, 13, -2, -4, -9, -3, -2, -6, -13, -6, -19, -14, -5, 8, 4, -14, -12, -12, 2, -2, 9, 19, -7, -21, 5, -5, 13, 1, 4, 5, -4, 5, 15, 23, 23, -1, -4, 1, 6, 8, 9, 13, -6, 1, 9, 16, 10, 11, 1, 5, 6, -4, -7, 5, -1, 2, -10, -19, -9, -15, -11, 2, -9, -15, -11, -2, 13, -1, -1, 4, -6, -4, -5, -1, 9, 3, -10, 10, 12, 12, 8, 9, 0, 1, 0, 9, 21, 11, -4, 3, 5, 7, 5, 2, 8, -12, -15, -9, 4, 4, 0, -8, -10, -13, -18, -9, -7, 1, -14, -6, 10, 10, 7, 2, -4, -6, -16, -4, 5, 1, -7, 0, 12, 7, 10, 7, 17, 16, -4, -7, 3, 17, 9, 3, 7, 1, -15, -18, -6, -12, -7, -20, 10, 15, 7, 14, 1, -3, -21]
6567b1oJ9kJ0j6JJ7Jj6PMj2MO%J1%Nrj6Jj5K5JNjJ4Kl%oroR%J0j2J0Lj4j6PMk
6611frJ0QjlQoJl0J4%MNnJ3J3j4J0qKqmJ7klKJ2j9j2RlJ2oj1K5j%oNkj3j0JNJ5
6656Ij5jJ5j6lkJ4mj5J6Mj8JJ8kpJ0j1J1j%%%J3q%nPrKJ0mj7K0Mj2PlnrMoJ7m
6700Ej0rJ3j1K%J0Kj9QOKpNN%j8LK1j7oJ0POj6RRmKlJ9j5k0J5NJjj2K5jk4llJ0
6744AoJRjj6LjJ5lj3pJ5pRJ2j0kqJ1nnj8J6J6LMkmmlKMkpQJ0mj4J2j1Rj3lPjm
6790gJ4J5j6ok1J0rKLJ2Pj1MJ0nqj6J1MnKJ4RopNLj9oJ8lJ0lJ6Jj4qOpqkJ9Pj3
6834BNJ2%qj8Mrn%J4Mmj0OMj9qJ6QplJ7J2oj1jkj2jJ9J2nJ6j3J0k0oNOkpRJ2%
6878A6rKOj5k2K3jJkJ0nkj7MpPpLK1kj4K0pmJj5J1qj1J9J0Pj4LJKrJ0lRKj2J7
$$ y = [-21, -27, -8, -10, 0, -16, -15, 2, 3, -13, -6, -2, -14, -10, -4, -4, 7, 7, 12, 3, -13, -12, -27, -2, -1, 4, 3, 17, 19, 16, 16, 10, 1, -5, 4, 4, 14, 2, 12, 15, 1, -15, -8, -4, -6, -15, -5, 3, 2, -1, 7, 1, 2, -28, -14, -14, -10, -5, -10, 3, 16, 2, 12, 4, 6, -2, -6, 11, 9, 6, 8, 20, 1, -11, -2, -5, 7, 1, -10, 15, 14, 14, 8, 13, 11, -2, -12, -11, -6, 9, -6, -7, 8, -8, -11, -13, 1, -3, -18, -2, 2, -16, -15, 3, 1, -6, 4, -7, 4, 3, 3, 3, 3, 16, 8, 8, 3, 10, 1, 3, 13, 9, -8, 12, 16, 4, 11, 8, 3, -6, -2, -8, 9, 5, -5, -14, -1, -12, -10, -10, 0, 2, -17, -9, -3, -1, -8, -3, 2, 2, -16, -13, 8, -9, -15, -5, 2, 8, -8, 1, 10, 6, 8, 5, 24, 9, -11, 4, 9, 10, 9, -3, 22, 21, -3, -6, -9, 1, -5, -4, 5, 4, -12, -9, -10, 5, 2, -11, -18, -3, -10, -1, 11, 1, -1, -9, 2, -3, -8, -26, -10, 6, 9, 13, 11, 7, 3, 0, 2, 6, 4, -3, 5, 15, 11, -3, 9, -2, 7, -6, -9, -2, -3, -7, 7, 22, 6, 0, -21, -11, -20, -18, -15, -3, 4, -7, -3, 7, 2, -6, -22, -11, -7, -12, -10, 4, 13, 7, 0, 5, 8, -11, -17, 1, -2, 8, 5, 21, 22, 8, 0, 6, -1, -9, -11, 8, 15, 2, 7, 19, 19, 11, -7, -3, -12, -17, -17, -3, 1, -3, -13, -7, -3, -22, -30, -14, -6, -13, -16, 1, 13, 7, -4, -5, -7, -19, -20, -1, 11, 6, 22, 9, 19, -1, -7, -2, 4, 2, -5, 4, 16, 16, 7, 9, 15, 0, -22, 1, 0, 1, -1, 9, 4, 2, -15, -11, -18, -11, -18, -15, 6, 4, -10, 10, 3, -1, 0, -15, -4, -12, -23, -4, 6, 13, -1, 2, 3, 5, -4, 6, 3, 12, 14, 2, 19]
6921A9jj0mQj0KnPQj0K%Nj6jPkr%J%Jj2J4Pj2jOJ%QrJ9k3kK1onKkKKrK4mLj0N
6969A1Qj1j4qJ1J2j7JJ5jj1NQj7%nQOj1lRmj6J4nNkJ2J0kqRNmk2LJ6poPJ8ooK
7013Ij5J5j3oJ8J4j2%Lj3qQj0mrNJ5J8ooLnj2lnK3j7qJ3J0Kj2Nnjj7K2K2J1j2
7053A7J2j5Jj3%JqrK0J4MmnJj3jrJ6qnJ2kQk0JJ0lk7K1PMJ5j2Plj9LJjrRPqR%
7098FOmj1kJ7J5j6J4pJorPj1krJ8Qj0RLoj3nJ0qQm%Jj3MkJ5j3qJ8PmjQkmk1K0
7143Dlk%JJ2mjJ2qnqJ8nNplj0NnkK2j7oJ9j2pKRLj5nNK2%j3Nj3mpJ7J1Mj0j3M
7188eJ2jJJkj4J8M%ljnkj0J4%Pj5%J5Npq%mj1LPOkj3RL%qJQk5OJ1J0JjoLj9J3
7235dKK2nj3J2LMrloMj0J3J0J0j0j3Rj5KkJ9j4j1RlK0k0jJj5kmJ5NmJjJ5nmNn
$$ y = [19, 18, 8, 4, 12, 2, 4, -1, 6, 14, 4, 6, 6, 11, -5, -6, 1, -1, -10, -10, -9, -9, -8, -20, -6, 1, -11, -12, -6, -5, -5, 3, -6, 13, -10, -12, 9, 3, -2, 0, -2, 0, 2, -7, 17, 13, 16, 6, 11, 19, 8, -6, -14, -3, 9, -8, -7, 8, 7, -4, 1, 9, -8, -8, -13, -5, 1, -10, -13, -4, -8, -24, -10, -15, -10, -12, 0, 10, 8, 0, 9, 14, 10, -12, -9, 7, 0, -6, 1, 19, 13, 7, 9, -6, 9, -4, -10, 8, 22, 10, 10, 13, 0, -8, 0, -10, -14, -23, -18, -3, 15, 9, 3, 6, 1, -11, -14, -19, 4, -13, -21, -8, 2, 4, -8, -3, -8, -9, -26, -4, 18, 29, 17, 29, 14, 15, 2, 2, 3, -5, -14, 6, 20, 24, 20, 15, 16, 3, 2, -7, 9, 1, -4, 8, 6, 14, -6, -5, 5, 2, -25, -4, 3, 7, 22, 10, 17, 14, -5, -2, -1, -2, -11, -2, 5, -3, 6, 6, 12, 8, -3, -5, 12, 27, 11, 25, 18, 19, 13, 4, 11, 0, -2, -11, 7, 15, 5, 14, 17, 11, -2, -7, 3, -5, 3, -1, -1, 0, -13, -9, -11, 4, -9, -17, 1, 8, 4, 3, 11, 9, 5, -16, 4, 1, -1, -1, 0, 12, 8, 7, 19, 11, 6, -2, 16, 11, 16, 9, 6, -4, 1, -4, -6, 16, -1, -7, 12, 0, -7, -5, 4, 7, -8, -13, -8, 14, 14, 1, 6, -7, -11, -18, -1, 10, 14, 4, -9, -5, 7, 6, 7, 8, 6, -8, 10, 14, 14, 11, 10, 5, 3, -7, 7, 7, 14, -1, -1, 14, 19, 12, 4, 4, 0, -11, -8, -1, 5, 3, -10, -1, 2, 2, -6, -5, 3, -22, -16, -5, 5, 6, 5, -1, 2, -17, -4, -2, 20, 15, 2, 14, 17, 21, 12, 9, 3, 7, -3, 10, 20, 30, 20, 7, 16, 1, 3, 1, 20, 6, -5, 4, 1, 21, 1, 0, 1, -14, -16, -20, -5, 0, -4, -3, -4, 11, 6, 2, 7, 2]
7278Bk0QJ1K3j3mjjlqK3jj2%J3OmqRj0j7oOQJ0prJ2j1Q%pj8lK9pOJQj4ok4QK6
7322CrmNJ2olRLoj7OMQLRr%k0J5J2kj1OPjj2PKqj8qJ9lMrJ9Ok8pK3Lj7jKJ2oN
$$ y = [2, -18, -10, 1, 24, 11, 7, 6, 5, 2, -6, 17, 16, 4, 4, 17, 23, 19, 11, 20, 10, -7, -13, -7, 1, 11, 4, -5, 7, -4, 4, 4, -3, -21, -24, 5, -2, 4, 5, 13, -1, -7, -31, -23, 3, -6, -10, -5, 7, 1, -2, 7, 10, 4, -13, -7, -3, 5, 8, 17, 8, 8, -12, 3, 15, 13, 2, 8, 15, 14, 2, 9, 11, 3, -15, -23, -4, -7, -3, -12, 7, 13, -15, -22, 1, 4, -13, -14, -12, 0, -6, -1]
$$ [...]
8191c
##END NTUPLES=NMR FID
##END=
