##TITLE=1H_LY-acetophenone2
 , 8 sc, 
 28.6.2019
##JCAMPDX= 6.0         $$ Bruker NMR JCAMP-DX V2.0
##DATA TYPE= NMR FID
##DATA CLASS= NTUPLES
##ORIGIN= UXNMR, Bruker Analytische Messtechnik GmbH
##OWNER= root
$$ XWIN-NMR		Version 3.5
$$ Fri Jun 28 14:17:41 2019 Russian Standard Time (UT+4h)  she@DPX200
##.OBSERVE FREQUENCY= 200.13155
##.OBSERVE NUCLEUS= ^1H
##.DELAY= (6, 6)
##.ACQUISITION MODE= SIMULTANEOUS
##.ACQUISITION SCHEME= undefined
##.AVERAGES= 8
##.DIGITISER RES= 18
##SPECTROMETER/DATA SYSTEM= spect
##.PULSE SEQUENCE= zg30
##.SOLVENT NAME= CDCl3
##.SHIFT REFERENCE= (INTERNAL, CDCl3, 0, 15.7039)
##AUDIT TRAIL= $$ (NUMBER, WHEN, WHO, WHERE, WHAT)
$$ ##TITLE= Audit trail, XWIN-NMR		Version 3.5
$$ ##JCAMPDX= 5.01
$$ ##ORIGIN= Bruker BioSpin GmbH
$$ ##OWNER= she
$$ F:/spectra/data/she/nmr/H-F/1/audita.txt
$$ ##AUDIT TRAIL=  $$ (NUMBER, WHEN, WHO, WHERE, WHAT)
(   1,<2019-06-28 14:16:46.07 +0400>,<she>,<DPX200>,
      <created by zg, POWCHK disabled, PULCHK disabled
       configuration hash MD5:
       00 E9 B6 7A A2 85 ED C7 34 08 36 98 17 FE 4E 26
       data hash MD5: 16K
       5B 50 32 8B 7A D2 77 AD 05 6E 3A 7E 36 56 9A 4A>)
$$ ##END=
$$ 
$$ hash MD5
$$ 8F EE 25 78 71 B2 55 57 D6 8B C7 F4 5B EB 5C 19
##$RELAX= 
##$RELAX= 
##$RELAX= 
##$RELAX= 
##$RELAX= 
##$RELAX= 
$$ Bruker specific parameters
$$ --------------------------
##$DU= <F:/spectra>
##$EXPNO= 1
##$NAME= <H-F>
##$PROCNO= 1
##$TYPE= <nmr>
##$USER= <she>
##$AMP= (0..31)
100 100 100 100 100 100 100 100 100 100 100 100 100 100 100 100 100 100 
100 100 100 100 100 100 100 100 100 100 100 100 100 100 
##$AQSEQ= 0
##$AQ_mod= 1
##$AUNM= <au_zg>
##$AUTOPOS= <>
##$BF1= 200.13
##$BF2= 200.13
##$BF3= 200.13
##$BF4= 200.13
##$BF5= 200.13
##$BF6= 200.13
##$BF7= 200.13
##$BF8= 200.13
##$BYTORDA= 1
##$CFDGTYP= 0
##$CFRGTYP= 5
##$CHEMSTR= <none>
##$CNST= (0..31)
1 1 145 1 1 1 1 1 1 1 1 1 1 1 1 1 1 1 1 1 1 1 1 1 1 1 1 1 1 1 1 1 
##$CPDPRG= <>
##$CPDPRG1= <>
##$CPDPRG2= <>
##$CPDPRG3= <>
##$CPDPRG4= <mlev>
##$CPDPRG5= <mlev>
##$CPDPRG6= <mlev>
##$CPDPRG7= <mlev>
##$CPDPRG8= <mlev>
##$CPDPRGB= <>
##$CPDPRGT= <>
##$D= (0..31)
0 1.2 0 0 0 0 0 0 0 0 0 0.03 0 0 0 0 0 0 0 0 0 0 0 0 0 0 0 0 0 0 0 0 
##$DATE= 1561717005
##$DBL= (0..7)
120 120 120 120 120 120 120 120 
##$DBP= (0..7)
150 150 150 150 150 150 150 150 
##$DBP07= 0
##$DBPNAM0= <>
##$DBPNAM1= <>
##$DBPNAM2= <>
##$DBPNAM3= <>
##$DBPNAM4= <>
##$DBPNAM5= <>
##$DBPNAM6= <>
##$DBPNAM7= <>
##$DBPOAL= (0..7)
0.5 0.5 0.5 0.5 0.5 0.5 0.5 0.5 
##$DBPOFFS= (0..7)
0 0 0 0 0 0 0 0 
##$DE= 6
##$DECBNUC= <off>
##$DECIM= 24
##$DECNUC= <off>
##$DECSTAT= 4
##$DIGMOD= 1
##$DIGTYP= 9
##$DL= (0..7)
0 120 120 120 120 120 120 120 
##$DP= (0..7)
150 150 150 150 150 150 150 150 
##$DP07= 0
##$DPNAME0= <>
##$DPNAME1= <>
##$DPNAME2= <>
##$DPNAME3= <>
##$DPNAME4= <>
##$DPNAME5= <>
##$DPNAME6= <>
##$DPNAME7= <>
##$DPOAL= (0..7)
0.5 0.5 0.5 0.5 0.5 0.5 0.5 0.5 
##$DPOFFS= (0..7)
0 0 0 0 0 0 0 0 
##$DQDMODE= 0
##$DR= 18
##$DS= 0
##$DSLIST= <SSSSSSSSSSSSSSS>
##$DSPFIRM= 0
$$ [...]
##$SUBNAM2= <"">
##$SUBNAM3= <"">
##$SUBNAM4= <"">
##$SUBNAM5= <"">
##$SUBNAM6= <"">
##$SUBNAM7= <"">
##$SUBNAM8= <"">
##$SUBNAM9= <"">
##$SW= 24.9336996594482
##$SWIBOX= (0..15)
0 0 2 0 0 0 0 0 0 0 0 0 0 0 0 0 
##$SW_h= 4990.01996007984
##$TD= 16384
##$TD0= 1
##$TE= 0
##$TE2= 300
##$TE3= 300
##$TEG= 300
##$TL= (0..7)
0 120 120 120 120 120 120 120 
##$TP= (0..7)
150 150 150 150 150 150 150 150 
##$TP07= 0
##$TPNAME0= <>
##$TPNAME1= <>
##$TPNAME2= <>
##$TPNAME3= <>
##$TPNAME4= <>
##$TPNAME5= <>
##$TPNAME6= <>
##$TPNAME7= <>
##$TPOAL= (0..7)
0.5 0.5 0.5 0.5 0.5 0.5 0.5 0.5 
##$TPOFFS= (0..7)
0 0 0 0 0 0 0 0 
##$TUNHIN= 0
##$TUNHOUT= 0
##$TUNXOUT= 0
##$USERA1= <user>
##$USERA2= <user>
##$USERA3= <user>
##$USERA4= <user>
##$USERA5= <user>
##$V9= 5
##$VALIST= <valist>
##$VCLIST= <CCCCCCCCCCCCCCC>
##$VD= 0
##$VDLIST= <DDDDDDDDDDDDDDD>
##$VPLIST= <PPPPPPPPPPPPPPP>
##$VTLIST= <TTTTTTTTTTTTTTT>
##$WBST= 1024
##$WBSW= 4
##$XGAIN= (0..3)
0 0 0 0 
##$XL= 0
##$YL= 0
##$YMAX_a= 192850
##$YMIN_a= -186019
##$ZGOPTNS= <>
##$ZL1= 120
##$ZL2= 120
##$ZL3= 120
##$ZL4= 120
##$ABSF1= 10
##$ABSF2= 0
##$ABSG= 5
##$ABSL= 3
##$ALPHA= 0
##$AQORDER= 0
##$ASSFAC= 0
##$ASSFACI= 0
##$ASSFACX= 0
##$ASSWID= 0
##$AUNMP= <proc_1d>
##$AZFE= 0.1
##$AZFW= 0.1
##$BCFW= 1
##$BC_mod= 2
##$BYTORDP= 1
##$COROFFS= 0
##$CY= 11.3945322036743
##$DATMOD= 1
##$DC= 2
##$DFILT= <>
##$DTYPP= 0
##$F1P= 18.9103706918063
##$F2P= -1.10871071338519
##$FCOR= 0.5
##$FTSIZE= 0
##$FT_mod= 4
##$GAMMA= 1
##$GB= 0.15
##$INTBC= 1
##$INTSCL= 1
##$ISEN= 128
##$LB= 0.24
##$LEV0= 0
##$LPBIN= 0
##$MAXI= 10000
##$MC2= 0
##$MEAN= 0
##$ME_mod= 0
##$MI= 1.114404
##$NCOEF= 0
##$NC_proc= 0
##$NLEV= 6
##$NOISF1= 3.799351
##$NOISF2= 2.8
##$NSP= 1
##$NTH_PI= 0
##$NZP= 0
##$OFFSET= 15.70392
##$PC= 1
##$PHC0= -8580.697
##$PHC1= 14.00098
##$PH_mod= 1
##$PKNL= yes
##$PPARMOD= 0
##$PSCAL= 0
##$PSIGN= 0
##$REVERSE= no
##$SF= 200.130013532006
##$SI= 16384
##$SIGF1= 3
##$SIGF2= 2
##$SINO= 400
##$SIOLD= 16384
##$SREGLST= <1H.CDCl3>
##$SSB= 0
##$STSI= 0
##$STSR= 0
##$SW_p= 3612.71676300578
##$SYMM= 0
##$S_DEV= 0
##$TDeff= 0
##$TDoff= 0
##$TI= <>
##$TILT= no
##$TM1= 0
##$TM2= 0
##$TOPLEV= 0
##$USERP1= <user>
##$USERP2= <user>
##$USERP3= <user>
##$USERP4= <user>
##$USERP5= <user>
##$WDW= 1
##$XDIM= 8192
##$YMAX_p= 0
##$YMIN_p= 0
$$ End of Bruker specific parameters
$$ ---------------------------------
##NTUPLES= NMR FID
##VAR_NAME=  TIME,          FID/REAL,        FID/IMAG
##SYMBOL=    X,             R,               I
##VAR_TYPE=  INDEPENDENT,   DEPENDENT,       DEPENDENT
##VAR_FORM=  AFFN,          ASDF,            ASDF
##VAR_DIM=   8192,          8192,            8192
##UNITS=     SECONDS,       ARBITRARY UNITS, ARBITRARY UNITS
##FACTOR=    0.0002004,     1,               1
##FIRST=     0,             0,               0
##LAST=      1.6414764,     0,               0
##MIN=       0,             -186019,         0
##MAX=       1.6414764,     192850,          0
$$ Real data points
##PAGE= N=1
##DATA TABLE= (X++(R..R)), XYDATA
0@%%%%%%%%%%%Qj6J6j6J6k4L2l2L7m5N3o1O9p7Q8j04J20j35J51j69J90k14K38
34A25k66K98l30L63m04M51m98N48o05O73p49Q28r18J024j148J291j457J662j916
53a028K235k654L236m098N497q144J4829o1048j30078J02453M672j11891O4848
66a21171J79496j3355n2611J25868P4623j37535n9191Q6425n5173j55575M0693
77h7506J04589p5545n1797J40888N7090j15802K353J13949o0670j25793O8438
88b9806Q3656r4092k8314J44177L0760j09207L0928R4807r6865j24168O0552K7140
100a0432j28272j1812J45290J6817o7587J03033J27293p4363p0776Q4577j1024
111A02744j65316l4244Q1861o2892r5229R9784J04857o4361j937J41269J2415
$$ plain form
0 0 0 0 0 0 0 0 0 0 0 0 0 8 -8 8 -8 8 -16 16 -16 21 -24 29 -32 37 -40 48 -56 64 -71 80 -89 101 -113 125
34 125 -141 157 -173 190 -214 237 -261 287 -318 355 -394 434 -484 540 -608 683 -774 888 -1028
53 -1028 1207 -1447 1789 -2309 3188 -4956 9873 -51175 -181253 -78800 -74128 -186019 -121171
66 -121171 58325 44970 -7641 118227 192850 55315 -3876 82549 27376 -128199 -87506
77 -87506 17083 -58462 -110259 30629 87719 -28083 -25730 88219 27549 -98244 -29806
88 -29806 53850 -40242 -68556 75621 106381 -2826 28102 122909 26044 -98124 -37572 -10432
100 -10432 -138704 -150516 -5226 11591 -55996 47037 174330 99967 29191 113768 102744
111 102744 -62572 -96816 -14955 -77847 -173076 -73292 31565 -32796 -34733 106536 118951
122A18951j15612K5444Q0559r5890r8777Q3576M0094j11172l030J24019k0473
133B7689j02489O0981Q1092r4332n8828J07496K6445j00387L2468J20571m1318
144E9388q3929P5838M6296j22481n2198Q6644k5221j13873M7764J08354m8732
155b2150m0722J20708N7545r5264l907R3590n1326j17670L8618N3565r7134m6950
167a11097J04405K1745q8211L8222J07955m4830p1526Q1190N0130r8370k3295
178c3682R8070j7147j01728L8397P4460p8747o5979Q2572K4967r6344J0808J07228
190D2875k1105o7615P7929P2440q1053l8904Q4901j2595j15624J0385P4251o3563
202c7678o9122Q5749N6234p6370K261J08686r569q6109M4950O6639q0074n8568
$$ plain form
122 118951 3339 28783 109342 13452 -85325 -1749 38345 -72827 -75857 48162 27689
133 27689 -74800 -13819 67273 -27059 -85887 21609 48054 -52333 -19865 100706 59388
144 59388 -24541 51297 97593 -24888 -77086 9558 -15663 -129536 -81772 26582 -22150
155 -22150 -62872 57836 115381 20117 16210 109800 58474 -59196 -20578 32987 -64147 -111097
167 -111097 -6692 15053 -73158 -34936 73019 28189 -43337 37853 87983 -10387 -33682
178 -33682 64388 47241 -54487 -16090 58370 -20377 -86356 -3784 21183 -75161 -64353 42875
190 42875 21770 -45845 32084 104524 23471 -15433 69468 56873 -58751 -48366 25885 -37678
202 -37678 -106800 -21051 35183 -41187 -38926 69760 60191 -25918 19032 85671 5597 -52971
214e2971P8993J3756r7834R314R0042m0085p5945O6669N6561q1268k4607R7114
226C9739M791q3206L8152Q4705n5120o2846O8777K3546r9984j8913P7036k9462
238a2785p9487N6133P4908n4700k3756R6823K1843q4102J1456P1709n5294q2451
250e9703M9732L6988q2071j9791Q9726K491p0513M2832P6598n2078m9824P0467
262C4854K2517q5588l322P8465k8482p2837N0339N5199p0085l5794P6623N431
274B7320q2573J9445P7890l7633n3277O9755M5445p1350j3907P6069j9136q4688
286d6640K7209N4335o4056m6312P4902K6840p0062J5510Q6842k3135o3550N1182
298B3065M5387p4610l5704O7596m209p9616K2012O9728m0911m7202O7451L5907
$$ plain form
214 -52971 26022 39778 -58056 -48742 41300 1215 -74730 -8061 48500 -32768 -57375 39739
226 39739 44530 -38676 -524 84181 29061 -33785 34992 58538 -41446 -60359 16677 -12785
238 -12785 -92272 -36139 38769 -15931 -39687 57136 78979 -5123 6333 78042 22748 -59703
250 -59703 -9971 27017 -55054 -74845 14881 17372 -53141 -10309 66289 14211 -35613 34854
262 34854 57371 -28217 -31539 46926 18444 -54393 -4054 51145 -18940 -54734 21889 27320
274 27320 -55253 -35808 42082 4449 -48828 20927 66372 -4978 -18885 57184 38048 -46640
286 -46640 -19431 34904 -29152 -75464 -562 26278 -43784 -28274 58568 35433 -28117 23065
298 23065 68452 -6158 -41862 25734 21525 -58091 -36079 33649 -7262 -54464 12987 48894
310D8894o9675o520P4473j8235p0876L7569N4752n7979l7719O8475J4303p3822
322c6360P698O7817l2939n9366N0289M2395o1361j6830P3499M2o6265K6895N9262
335E4776m8135m8738N6037K1082p2009m888O9468j7598n9510M3882N3769n2039
347c903k8803O6030Q390p0491R922N9977l7236n4148N0513L5381o1529j2149P0171
360C2125n725o3790K9765N5740m7915m1739N8720J9773o7269N28O5984k1771n7367
373d2941M1816M4432n5486k5664O3448L882o5389J7124N9441l6409m6793N2519
385I980L0494o1675j0306O4175j1442o1167L0038N0138m6033l3954N7961J6293
397C4502o1105N179N9391k5316n2332M0118L6237n4486k0020O0507J259n8468
$$ plain form
310 48894 -20781 -27301 47172 28937 -41939 -4370 50382 -7597 -45316 23159 37462 -36360
322 -36360 -28662 39155 6216 -53150 -2861 39534 -21827 -38657 34842 34884 -31381 -4486 54776
335 54776 6641 -42097 13940 35022 -36987 -41875 27593 9995 -49515 -5633 48136 -3903
347 -3903 -32706 33324 41714 -28777 -18855 41122 3886 -50262 251 35632 -25897 -38046 32125
360 32125 26400 -37390 -7625 48115 200 -41539 17181 36954 -30315 -29787 36197 14426 -42941
373 -42941 -1125 43307 -12179 -37843 25605 29487 -35902 -18778 40663 4254 -42539 9980
385 9980 40474 -21201 -31507 32668 21226 -39941 -9903 40235 -5798 -39752 18209 34502
397 34502 -26603 -21424 37967 12651 -39681 437 36674 -17812 -37832 22675 23934 -34534
409c4534K1079N5368l5330m1043M9593K4159n9568q498N7237j4989n5858L0864
421a1520M4828m4145k6801N7519J2812n6881R926N6102k7885m8489M0693L0988
433C7147n5678j7687N7285l730n7087K2699N1510l5940l5088N1971K2341n5335
445a7592j440N6586j8062n2931L1784L7714m9303k6347N4077O265n6748J3422
457b2575N5229k6860m1081M5387L1036n1244j1875N4991p803n5410K1076M2287
469C3158m0803l4021M7574J5692n2966L747N5883j5928m3343L7476L7812m4594
481c13k0867N0397N84n6991R079M4034l2264m0114M1433K6360m5753l604N6711
494B8692m498m5280K6967M0354m0448l1189M3461P836n5788J590M8696k0960m2238
$$ plain form
409 -34534 -13455 41913 6583 -34460 15133 39292 -20276 -28774 28463 13474 -42384 -11520
421 -11520 33308 -10837 -37638 19881 32693 -24188 -14262 41840 13955 -34534 6159 37147
433 37147 -18531 -36218 21067 17337 -39750 -17051 34459 -1481 -36569 15402 37743 -17592
445 -17592 -19032 37554 19492 -33439 -1655 36059 -13244 -39591 14486 20751 -35997 -22575
457 -22575 32654 5794 -35287 10100 41136 -10108 -21983 33008 25205 -30205 -9129 33158
469 33158 -7645 -41666 5908 21600 -31366 -27619 28264 12336 -31007 6469 44281 -313
481 -313 -21180 29217 29801 -27190 -18111 25923 -6341 -46455 -5022 21338 -24415 -28019 28692
494 28692 24194 -21086 5881 46235 5787 -25402 18059 25895 -29893 -28303 20393 -567 -42805
507d2805L7100L4737m2080j4181N2929K240m9081J6825M4712l1775l5792M0379
519A3208J7734n2328p488M7637j4645m7795K8082L9971l5976j9868N3191J4395
531C6118m6697Q859M7155k5872m5388K9089K1416n0456j7063M7719j334m3665
543d0119K4590M8182k6168k6163M4984J7306m9861n221M3522j8595m7231K5086
555i688L2426l8899k0448M6271P450m5418J0663M4976k1603l3073L7897K6634
567C7188m0595q451M5782p734m8846J3876L1416l8098l1911L9292J5908m0370
579c2543Q041N3748o666l2992L1731K9963m2355k4823L4933n939n2416P392M0315
592H389k2729k7435M3409K8390l7253l492M6557q965m6039J7649L2264l5444k5848
$$ plain form
507 -42805 -5705 29032 -13048 -27229 25700 27940 -21141 -4316 40396 8621 -27171 13208
519 13208 30942 -21386 -28874 18763 4118 -43677 -15595 24376 -11600 -31468 21723 36118
531 36118 -10579 -1720 45435 19563 -25825 3264 24680 -25776 -42839 4880 3546 -40119
543 -40119 -15529 32653 6485 -19678 25306 42612 -7249 -12470 31052 12457 -34774 -9688
555 -9688 22738 -16161 -36609 9662 17112 -28306 -17643 27333 5730 -27343 10554 37188
567 37188 -3407 -11858 33924 26190 -22656 -8780 22636 -15462 -47373 -8081 7827 -32543
579 -32543 -24502 29246 22580 -10412 21319 51282 8927 -15896 19037 13098 -39318 -31926 8389
592 8389 -14340 -41775 1634 30024 -7229 -10721 35836 26871 -19168 -1519 30745 -4699 -30547
605c0547M1186J2167m3590L566M1968k0112m0249K7104K5547l8417j1274M9281
617A6630P434l6017K0194M2300k7353l5320K7357P315n3010j3691L7984r193l3909
630d9279L2319M4439j9913j0645M5201Q326m6888l541K8120l0398m2889K4663
642b0485K3712l3251m369N0028O668l4688J6970L4432k9949l2067K9686J1994
654A8681m0311k89M4083o628l2969K4421K7062l7725k5163L1463m36m3518R448
667c1881M4478j0458k0129M1316K9452l4789j2633L1458j6729n3223L664K4372
679e102l0515k0389M5095K5787k4805J3607M7965j0905l8475J6283J4940m6067
691a2581k6253L2235J948l6097J6509M4875j2880k3063L2861J7690m0469j2185
$$ plain form
605 -30547 10639 22806 -20784 -17218 24750 4638 -35611 -8507 17040 -21377 -32651 16630
617 16630 24064 -11953 8241 50541 23188 -12132 15225 22540 -30470 -44161 -6177 -15370 -49279
630 -49279 -16960 27479 7566 -3079 42122 50448 3560 19 28139 -2259 -45148 -20485
642 -20485 3227 -30024 -34393 15635 22303 -12385 4585 39017 9068 -22999 6687 18681
654 18681 -21630 -21919 22164 15536 -17433 6988 34050 -3675 -28838 2625 2189 -41329 -31881
667 -31881 12597 2139 -17990 23326 52778 17989 5356 36814 20085 -33138 -29474 -5102
679 -5102 -35617 -56006 -10911 14876 -9929 3678 51643 40738 2263 18546 33486 -12581
691 -12581 -38834 -6599 -4651 -40748 -24239 20636 7756 -15307 17554 35244 -5225 -17410
703a7410L3249r281l6849K0409L5008k2391j6544L6935Q651m2515m768K8557k1740
716h689l6645K4343K8213k3817k357M7516J0374l1645J0311K6956l1735l8057
728b5232J7568N999m0224l633M2360J989k2150L0335L6538k3685j9166K9327k37
741B9789m5606l973K9025j8373k8917K9027K6189k7288o428L7821j651l7176J0591
754f970K8688k4580k2900L3414J6611l2115O96L6673j1779l6905J4867J9870l3991
767a8421j9365L4137Q478k9511J4100M0958j1160k3802K6543J5348l8605j5567
779a6867K7328r839l7688J3831L1384j9145j5242L6645J6217l0817Q63L2736j3284
792A6122l3112J7347K0450k9515j4400L2245L216l3110P668L0076j8510k4976
$$ plain form
703 -17410 15839 6558 -30291 -9882 25126 2735 -13809 23126 31777 -10738 -15506 13051 -8689
716 -8689 -45334 -20991 7222 -16595 -18952 28564 38938 7293 17604 44560 12825 -25232
728 -25232 -7664 -1665 -41889 -45522 -3162 -1173 -23323 7012 43550 19865 699 30026 29789
741 29789 -15817 -19790 9235 -9138 -38055 -9028 17161 -10127 -16555 21266 19615 -17561 -6970
754 -6970 21718 -2862 -25762 7652 24263 -7852 -7156 29517 17738 -19167 -4300 15570 -18421
767 -18421 -37786 -3649 4829 -24682 -10582 30376 19216 -4586 21957 37305 -1300 -16867
779 -16867 10461 622 -37066 -23235 8149 -10996 -26238 10407 26624 -4193 -3330 29406 16122
792 16122 -16990 357 20807 -8708 -23108 9137 12353 -20757 -13089 16987 -1523 -26499
804b6499K6533J7738k8816k950L6552j953l0170J4620K4506k7447k3793K4604
816B925M912l5083J428L4014q396k2796K6884K5263k5757j0626L1115k172l6705
829a4994N890K6128k1768k3986K7647J5823k9741k112L4197o131l0334J6699K4614
842B1932k4721j5682L1478P674l1297M610L0173j6378k9189J9436J5420l1387
854a7931j0208L2981J917k7031J6199L2326j6586j9373K5772Q881l5174p376K5715
867A0112j1974k9760J8004K4915k0493r372L3682P691k9356M932K6848j7800k7308
880a9879J9745J4978k8105o754L1632m87k7642J2523K4852k1188j9996K4704Q907
893A3290k9332J153L1744p002k3963K0038K0944k6302j4996K5516r55l3376M859
$$ plain form
804 -26499 34 17772 -11044 -13994 22558 20605 -9565 5055 29561 2114 -21679 2925
816 2925 7837 -27246 -25818 8196 -200 -22996 3888 29151 3394 -7232 23883 21711 -14994
829 -14994 -9104 17024 -4744 -28730 -1083 14740 -15001 -17113 17084 10953 -19381 -2682 21932
842 21932 -2789 -18471 13007 20681 -10616 -6006 24167 7789 -21400 -1964 13456 -17931
854 -17931 -28139 4842 6759 -20272 -4073 28253 11667 -7706 18066 26947 -8227 -15603 10112
867 10112 -1862 -31622 -13618 11297 -9196 -18568 15114 22805 -6551 -1619 25229 7429 -19879
880 -19879 -134 14844 -13261 -20015 11617 11130 -16512 -3989 20863 -325 -20321 4383 13290
893 13290 -16042 -14889 16855 9853 -14110 5928 26872 570 -14426 11090 10135 -23241 -18382
906a8382K7448j4289j9125K7561J9104k4314l154L0118o186l1570R702J9498k5207
919h796j8708K6976R153k6963N407L2495q755k3855J9501J7594k7657j2836K6610
932A0166m01k9340R059K7224j5481j8820K4479J2397k8370m514K7164p363k7200
945b1000J4970K2779k0025j2595K8145P171k7926K318K5141j4263k5333J7235
957c383J5171k4640p144K9215J780k4264J1731K4932j7375j9062K1445Q056k9196
970a2734l579K6377p240k4119J6978K1963k0001j1408K6676M057k8193L549K4237
983A6563j4624k2062K0294J4951k4424n122K8478k132k6398J1210K2092k0024
995a198j7643K3665Q392k6866R49K7982p878k2847J7329J8218k3215j1595K4863
$$ plain form
906 -18382 9066 -5223 -24348 3213 22317 -1997 -5151 24967 18781 -12789 -3087 16411 -8796
919 -8796 -27504 -528 8625 -18338 -12931 19564 10809 -13046 6455 24049 -3608 -16444 10166
932 10166 9765 -19575 -10516 16708 1227 -17593 6886 19283 -9087 -13601 13563 6200 -21000
945 -21000 -6030 16749 -3276 -15871 12274 19445 -8481 -6163 18978 4715 -20618 -3383
957 -3383 11788 -12852 -19996 9219 10999 -13265 -1534 23398 6023 -13039 8406 16462 -12734
970 -12734 -16313 10064 2824 -21295 -4317 17646 -2355 -13763 12913 16970 -11223 -7674 16563
983 16563 1939 -20123 171 15122 -9302 -14424 14054 11922 -14476 -3266 18826 -1198
995 -1198 -18841 4824 13216 -13650 -12701 15281 7403 -15444 1885 20103 -3112 -14707 10156
1008A0156Q48k7642O315K4537j4109j8538K2327J3803k4384m150K6309m785k6088
1021a5401J1067K0024j9473j4803K3887P674k4647K493K5732r448k1821J6304
1033A588J5207k3156r647K4504N03k4831Q406K3762j3977j6984K1185J0961k4841
1046g320l986K4083o269k4228J2510J9215j8620j1802K4523N952k4348L708K3973
1059A7391j1832k1195J7162J3731k3454p341K5288p43k4236R799K2240j6019j6290
1072a5499K1411Q838k4881j280K4723p037k2117J4942J7999k0112j0942K3649
1084I694K598k5637M247K2725j2788j9069J9143J3854k1726m517K5280j960k3454
1097a1610R601J9091j7807j5697K0210O663k3901P07K4272p009j9564J6016J6799
$$ plain form
1008 10156 11004 -16638 -10323 14214 105 -18433 3894 17697 -6687 -10837 15472 10687 -15401
1021 -15401 -4334 15690 -3783 -18586 5301 12975 -11672 -9179 16553 7105 -14716 1588
1033 1588 16795 -6361 -16008 8496 8999 -15832 -7426 16336 2359 -14625 6560 17521 -7320
1046 -7320 -11306 12777 6508 -17720 -5210 14005 -4615 -16417 8106 14058 -10290 -6582 17391
1059 17391 5559 -15636 1526 15257 -8197 -15538 9750 9007 -15229 -5430 16810 791 -15499
1072 -15499 5912 14750 -10131 -11411 13312 6275 -15842 -900 17099 -3013 -13955 9694
1084 9694 12292 -13345 -9098 13627 839 -18230 913 14767 -6959 -11476 13804 11844 -11610
1097 -11610 -2009 17082 -725 -16422 3788 10451 -13450 -12743 11529 4520 -15044 972 17771
1110A7771j9552r387K2510J115k4442M760K0654j3233j7434J8375J1498k1354
1122h719l350K3585l356k1565J1109J8300j7000j2674K1246N731k3226J679K2316
1135A4076r646k0180J5039J3971k0692p897K3164Q88k2015Q385K1509j3283j5329
1148a2010J9320Q833k3489l193K1821o865k2202J2373J7439j7513j0089K3253
1160G678N369k2090M074K2012j0956j9044J5490J1728k1518o610K2082j512k1669
1173a4966R028J9476j4356j3670J9763Q074k1569l86K2257o245j9710J2703J5219
1186A5618j8373j0502J9830J913k2329L899K0250j0219j5353J7680J2539j8653
1198c700l714K1625k980k1714P763J5988j6516j3808J8705O644k0436J737K2469
$$ plain form
1110 17771 -1781 -11168 11342 12457 -11985 -7225 13429 196 -17238 1137 12635 -8719
1122 -8719 -12069 11516 8160 -13405 -2296 16004 -996 -13670 7576 13307 -9919 -8240 14076
1135 14076 4430 -15750 -711 13260 -7432 -15329 7835 8723 -13292 -4907 16602 3319 -12010
1148 -12010 7310 16143 -7346 -10539 11282 4417 -17785 -5412 12027 -5486 -15575 7678
1160 7678 13047 -9043 -4969 17043 6087 -12957 2533 14261 -7257 -13867 8215 6703 -14966
1173 -14966 -5938 13538 -818 -14488 5275 13349 -8220 -8606 13651 7406 -12304 399 15618
1186 15618 -2755 -13257 6573 8486 -13843 -9944 10306 87 -15266 2414 14953 -3700
1198 -3700 -7414 14211 11231 -10483 -2720 13268 -3248 -17056 1649 8293 -12143 -10406 12063
1211A2063o133j7550J4051J4074j8635q749K0021L46k1784N739J9330j2229j5096
1224a4552J7550R482k0892l167K1273m313j9906J1445J7528j5016j0108K0559
1236I883M875k1734J203J8672j1013j9108J3513J1957j8283m814K2940J757j8411
1249h563Q828J8822j3623j5295J5493N762k2246k994J9923m717j7382J2995J6770
1262A3773j4426q575J9267K650k1221K070J7799j0315j5922J5305J1905j7256
1274d946m112K0287j809k0320O428J5287j4464j2918J7601P869j7486J988K1542
1287A4947m836j7029J1192J1617j9114j0893J6758K08k0153N806K0524p856j1814
1300a0643J8090J1193j8613m698J7685n715k1571P135J4704j4288r791K0062P252
$$ plain form
1211 12063 5930 -11620 2431 16505 -2130 -10879 9142 9488 -12296 -6557 12773 544 -14552
1224 -14552 2998 12480 -8412 -11579 9694 5381 -14525 -3080 14448 -568 -10676 9883
1236 9883 14758 -6976 -5773 12899 1886 -17222 -3709 8248 -10035 -14849 8091 9848 -8563
1249 -8563 265 19087 5464 -9831 5662 11424 -10822 -13816 6107 1390 -15992 -2997 13773
1262 13773 -653 -9228 10039 12689 -8532 -6462 11337 1022 -14900 405 12310 -4946
1274 -4946 -9058 11229 9420 -10900 -4472 10815 -3649 -16567 1034 8903 -8583 -6595 14947
1287 14947 10111 -6918 4274 15891 -3223 -14116 2642 2850 -17303 -11497 9027 1171 -10643
1300 -10643 7447 18640 27 -4671 13014 7299 -14272 -7137 7567 -6721 -16512 3550 10802
1313A0802j7721K785J9574q446j8029J1556J0719j8299o940J9961J633j7795P412
1326b788J8343j1424j4271J4333O262k0370l482J8615l525j6026J2213J6811j2476
1339B215q219J7798K649k0939k61J5285j0381j6457J3244J2209j4451k836K0885
1352A0741J307j7182O277J4613j3726j4173J3713N458j8352m35J9451l584j5057
1365a0949J1779J3704j5111r069J6586J363j9336L261J7599q445j3115J5029J0394
1378A3690j6886m315J7417l518j9095O930J4471j2898r958J7999O969j6838J768
1391d264J8639o856j6931J0332J0510j7068p930J7425J337j7240N976J7642r113
1404B459j2281J4670Q039j7616l326J7203l742j7105Q635J4103j2903r438J6293
$$ plain form
1313 10802 -6919 -4134 15440 6994 -11035 521 11240 -7059 -13999 5962 7595 -10200 -2788
1326 -2788 15555 4131 -10140 4193 10455 -9915 -13397 5218 1693 -14333 -2120 14691 2215
1339 2215 -6004 11794 14443 -6496 -6757 8528 -1853 -18310 -5066 7143 -7308 -10144 10741
1352 10741 12048 -5134 1143 15756 2030 -12143 1570 7028 -11324 -11759 7692 4108 -10949
1365 -10949 830 14534 -577 -9646 6940 8303 -11033 -7772 9827 1382 -11733 3296 13690
1378 13690 -3196 -7511 9906 6388 -12707 -5777 8694 -4204 -14162 3837 10806 -6032 -4264
1391 -4264 14375 7519 -9412 920 11430 -5638 -13568 3857 5194 -12046 -6070 11572 2459
1404 2459 -9822 4848 12887 -4729 -8055 9148 5406 -11699 -3064 11039 -1864 -11302 4991
1417D991M279j7713J114J6828o874j4432J2031J1327j4522n321J7151K9j7409
1430h521M727J4368j1185j2282J4099P236j6093r43J7912l308j5407R216J2621
1443A2440j3748q901J5581K797j7132K675J6460p664j3382J2462R255j6017m739
1456i913J6714j472j6546P261J5232j0711r936J5557N878j7330j047J5813o532
1469B968j6181R705J1648j3586n978J7767K924j5803M554J5560r716j3667J1829
1482B024P026j6761l523J6995j635j4870Q620J4369j1256r447J4296L750j7188
1495g600j43J5340n910j3392J1312J1459j2865n288J5749K27j6970L170J3188
1508H277j0059j1803J3179Q216j3691p21J7297k023j4666P228J1005j3494j0041
$$ plain form
1417 4991 9270 -8443 -7329 9499 2625 -11807 224 11551 -2971 -8292 8859 8888 -8521
1430 -8521 -3794 10574 -611 -12893 1206 8442 -7651 -8594 9318 6010 -9397 -181 12440
1443 12440 -1308 -10209 5372 8169 -8963 -6288 10172 2508 -10874 1588 10843 -5174 -9913
1456 -9913 6801 5329 -11217 -3956 11276 565 -9371 6186 12064 -5266 -6313 9500 2968
1469 2968 -13213 -3508 8140 -5446 -11424 6343 9267 -6536 -1982 13578 3862 -9805 2024
1482 2024 9050 -7711 -11234 5761 4126 -10744 -2124 12245 989 -8458 5838 9588 -7600
1495 -7600 -7743 7597 1687 -11705 -393 11066 -1799 -7087 8662 8889 -8081 -4911 8277
1508 8277 -1782 -13585 -406 7810 -5881 -6602 10695 8672 -5994 1234 12239 -1255 -11296
1521a1296J3169K672j5871K427J6562n138j1441J2349J0109j4311n525J4585j824
1534F467j7003M646J3467r799r718J4633P154j4625m01J5713m920j5229Q137J0479
1548I001j3297p056J5688K997j4793L979J5411p758j2685J0863P160j5645m546
1561a0681J5064j334j4207P517J4192r180q301J3859M644j5836j183J3493o232
1574A815j4268Q812J0489j1768n058J5796K658j4052L740J3619q442j2050J0397
1587A688O409j4472l072J4842j585j3295P427J2436j0203q238J3115L518j5233
1600f663L54J4045n673j2401J0107R915j2274m780J4581K44j4984L801J2386r320
1614f62j0561J2088O481j3562o95J5602k622j3185P893J0751j2180q299J2793
$$ plain form
1521 -11296 1873 4545 -11326 -8899 7663 2525 -8916 3433 13542 -769 -6294 8291 6467
1534 6467 -10536 -5890 7577 -2222 -11940 2693 9847 -4778 -5179 10534 5614 -9615 -1478 9001
1548 9001 -4296 -11352 4336 7333 -7460 -3481 11930 4172 -8513 2350 9510 -6135 -10681
1561 -10681 4383 3049 -11158 -3641 10551 1371 -6930 6929 11573 -4263 -5446 8047 1815
1574 1815 -12453 -3641 6848 -4920 -9978 5818 8476 -5576 -1836 11783 3341 -8709 1688
1587 1688 8097 -6375 -9447 5395 3810 -9485 -2058 10378 175 -8063 5052 8570 -6663
1600 -6663 -6309 7736 2063 -10338 -231 9684 -2590 -7370 7211 7455 -7529 -3728 8658 -662
1614 -662 -11223 865 7346 -6216 -6911 8691 6069 -7116 777 11528 -652 -8951 3842
1627C842J923j5265J796J4302n795j0814J1463R371j2380l785J4096j313j5060
1640g619M175J1334r974r531J2488N870j3034K67J4985l307j2647P672R527j2051
1654a845p272J2596J797j3752K904J3682n890j0056J0557P365j2997l925J2780
1667E944k018j3773N427J1729q561p402J2998N259j3016j21J2835n345j3147P173
1681b018Q385j1642n211J3940K263j2214M532J3236p308j0386R878N228j4300
1694e617l307J3066k320j2422P519J2062q853o584J2884L212j4257R2J1986o418
1708A043j1967R071Q718j1026l379J4283P88j2985M018J1209r033j0186J0208
1721G62N118j2706r28J3983j844j1191P358J0008j0235p256J1045J637j3603J215
$$ plain form
1627 3842 5765 -9500 -7704 6598 803 -10011 1452 10823 -1557 -5342 8754 7441 -7619
1640 -7619 -3444 7890 -2084 -11615 873 6743 -6291 -6024 8961 5654 -6993 679 10206 -1845
1654 -1845 -9117 3479 5276 -8476 -5572 8110 2220 -7836 2721 10086 -2911 -6836 5944
1667 5944 3926 -9847 -4420 7309 -1252 -8654 4344 9603 -3413 -3534 9301 3956 -9191 -2018
1681 -2018 6367 -5275 -10486 3454 5717 -6497 -1965 11271 3963 -6423 3455 8683 -5617
1694 -5617 -8924 4142 1822 -10600 -3081 8981 128 -6456 6428 9640 -4617 -4525 7461 1043
1708 1043 -10924 -1853 6865 -4161 -7540 6743 7531 -5454 -1436 9773 740 -9446 762
1721 762 5880 -6826 -7754 6229 4385 -6806 552 10560 325 -6931 4114 5751 -7852 -6637
1735f637J2360n077r578R956Q360j0803l609J2275j007j3356L465J0242q290q296
1749i995J1136N587j1342J0J3023l223j1591O557Q237j0911o297J1706J723j2278
1763g658L014J2533n747r312R710O499j2106l231J2098j828j2357N418J0474q552
1777a045p048J1552L812j2437L94J2177m661j0941Q066Q267j0586m582J2309P10
1791E987j2533L068J0993p200r123R792N879j1323j529J2597j788j1325N776R309
1805H580r273p028J0672K795j2027R72J1915m330r828Q047P538j0389m356J1335
1819D623J89j1661L599J0754o497p839R760N014j1507j863J0958l145j1360N863
1833c112R066q346n025J1957L300j1015J664J0839o021j0662O977N586j1235l428
$$ plain form
1735 -6637 5723 646 -8932 1024 9384 -1419 -5028 7247 6240 -7116 -3651 6591 -1699 -9995
1749 -9995 1141 6728 -4614 -4604 8419 5196 -6395 162 8399 -2512 -8809 2897 4620 -7658
1763 -7658 -4644 7889 2142 -7170 2540 9039 -3067 -6298 5800 3972 -8385 -2967 7507 -1045
1777 -1045 -8093 3459 7271 -5166 -4772 7405 2744 -8197 -131 8136 -2450 -7032 5277 5987
1791 5987 -6546 -3478 7515 315 -8808 984 6863 -4460 -5989 6608 4820 -6505 -729 8580
1805 8580 -693 -7721 2951 5746 -6281 -5309 6606 2276 -7552 495 8033 -2356 -6712 4623
1819 4623 4812 -6849 -3250 7504 1007 -6832 2928 7942 -3565 -5428 5530 2385 -8975 -3112
1833 -3112 5954 -2392 -7417 4540 7840 -3175 -1511 9328 3307 -7355 -378 5208 -6027 -9455
1847i455J2062L73j0064N748J1135p017p384R608L135j2799j582J0706l874j0384
1861i792P532R202q494m212J1658J407j2079J586R843o673r183Q887O482r731
1875c567j349J2335q82j1078M201Q130r312q092R153L223j0612J338J2700j867
1889D321q155P787P598j0002n928Q600j105j2566J653R993n016o487J0552P303
1903H548q709j128J0874k521j1848L229P016r005o643J0108L741r489K028J1608
1917G809l606r177O660N830j0506m468J0338K39j0092M475J0744n777p121Q835
1931D183L625j1901k519R579l380j0104O600R480o656l337J1754K739j0875P47
1945f5Q538p129j0662O142N132r720j912J2296J415q398N503R923o872p571P647
$$ plain form
1847 -9455 2607 2980 -7084 -1336 9799 2782 -4602 5006 8141 -4658 -6240 4466 592 -9792
1861 -9792 -2260 6942 -1552 -5764 5894 7301 -4778 -3192 6651 -22 -9205 -318 6164 -3567
1875 -3567 -4916 7419 6537 -4541 -340 7790 -1522 -9614 -461 2762 -7850 -6512 6188 4321
1889 4321 -3834 3953 11551 1549 -4379 4221 3116 -9450 -7797 2196 -2820 -9307 1245 8548
1903 8548 -161 -1289 9585 7064 -4784 -1555 5461 -3544 -10187 -79 3662 -5827 -3799 7809
1917 7809 4203 -4974 1686 7516 -2990 -7458 2880 3119 -6973 -2498 8246 2469 -4652 4183
1931 4183 7808 -4093 -6612 2967 -413 -10517 -3917 5563 -1093 -4430 7324 10063 -812 -65
1945 -65 8473 1344 -9318 -3176 1956 -7764 -9676 2620 4035 -4363 1140 11063 4191 -3380 4267
1960D267K181j1784j663R716k848q747O886Q432p369m051R948J239j0726J308
1974c211R148n184p845P968O043q809k099J0040j341j0555L115P416p564o361
1988i239R191M015q662J554J1241k427q460N987N823r977n579Q305m32j0631K740
2003f551R997m379n858R502N831q915j387R688k673j0532L898O917q188n685R351
2018A016K585r630J455J0208l757q038P130O330q624l045R907K1r943K835Q165
2033F615o657p398P533L577r583o95J0286j404p964O083Q024p023m793Q622J204
2048F427j0496K21Q247m758q057O673N865p897k075J0001K95q699L666Q243n973
2063A683o233P756L129r603j044Q698l171r009M996O649p349l619R840K323q288
$$ plain form
1960 4267 6448 -5336 -6999 2717 -131 -8878 -1992 6440 -929 -4980 4968 6207 -4519 -3211
1974 -3211 5937 753 -7092 876 6919 -1890 -3989 6051 4710 -5845 -2730 4686 -2878 -9239
1988 -9239 -48 3967 -4695 -3141 8100 5673 -2787 3200 9023 -954 -6533 1772 1340 -9291 -6551
2003 -6551 3446 -933 -6791 2711 8542 -373 -1760 7928 5255 -5277 -1379 5538 -2650 -8335 1016
2018 1016 3601 -6029 -4574 5634 1877 -6161 969 7299 -1325 -4370 5537 5558 -4385 -1550 6615
2033 6615 -42 -7440 93 3670 -5913 -6608 3678 2274 -5690 393 8417 1394 -3399 5223 6427
2048 6427 -4069 -3848 4399 -359 -8416 -1743 4122 -3775 -5850 4151 4446 -4253 -587 7656 1683
2063 1683 -4550 3206 6335 -3268 -4312 4386 1215 -7794 -2798 3851 -3498 -7117 2723 5046 -3242
2078c242K795R343m671p636O229L530j0177l217Q472j600q852M973Q879n284m118
2093d576R551L262r387j23Q281m500r136N191N581q023l149R587J040q681K875
2108b207Q425n332o781P245M170q518r78R613j148q343M270O618p493o063P054
2123E32J366r347P77R481k072n841P554O916o965l138P760j344j0661O95O270
2138A983o096o226Q021N272o577Q44J0256r58q011L924N436q196n816P062J047
2153A965q828J723R137l115o248O859N041q223k707Q286q95q595L683P956n211
2168H28m965P923K802r243j124P482l870q520N077O447o198k074J0086K377p668
2183f40K270P555n787q258M805K659r237k183Q947Ko607N450Q490m813m442P405
$$ plain form
2078 -3242 -447 8896 4225 -3411 2818 6348 -3829 -7046 1426 -174 -9026 -4053 4826 -458 -4576
2093 -4576 4975 8237 -1150 -1273 7008 2508 -6628 -1437 4144 -3879 -7028 2559 3599 -5082 -2207
2108 -2207 6218 886 -5895 1350 5520 -2998 -3976 5637 4489 -3854 416 7034 -459 -6522 532
2123 532 1898 -7449 -6672 2809 737 -5104 2450 9366 2401 -737 7023 5679 -4982 -4287 1983
2138 1983 -4113 -10339 -2318 2954 -3623 -2779 7477 6519 -1492 2432 7868 -328 -6144 918 1965
2153 1965 -6863 -5140 3997 882 -5366 1493 6534 -1689 -4396 3890 2995 -5600 -1917 6039 828
2168 828 -4137 3786 6588 -2655 -3779 3703 -167 -8687 -3610 2837 -3361 -5435 4651 7028 -640
2183 -640 1630 9185 3398 -4860 -55 2604 -6633 -8816 131 133 -6474 -1024 7466 2653 -1789 5616
2199E616J746r445j037P040l769p727N229N878o474k598Q610J030q000K153P495
2214E747m535n992O545M042p612j283P999j678q237L228N781o567m710P562K451
2229B741p401J726Q951k457o297N743M669p953l633O986j112q849K322P191m741
2244b114m750P828M124p143J27Q570k080p679M195N324p301m548P077O45q569
2259f294J308P860l492n640O857N324o538j337Q305p70q275K340N655o414n832
2274f943O318K495p542M62Q655j389o132N278N844o369l693O961L99q243J126
2289b773O914m040n921N807L960p179j696P625q17p121L786O937m630l831P391
2304D412K423p943n48O379m135p909L926M537o365j864Q966K043n919L574P592
$$ plain form
2199 5616 7362 -2083 -3120 3920 151 -7576 -2347 3531 -2943 -5541 3069 4099 -3901 -1748 5747
2214 5747 1212 -4780 1765 5807 -1805 -3088 4911 3233 -5004 -1776 4005 -2562 -7272 290 2741
2229 2741 -4660 -2934 6017 3560 -2737 3006 7675 -278 -3911 3075 1963 -6886 -4564 2627 -2114
2244 -2114 -6864 964 5088 -2055 -1928 6642 4562 -3117 1078 6402 -899 -5447 1630 2275 -6294
2259 -6294 -4986 2874 -618 -6258 599 5923 -615 -1952 6353 5583 -2692 -352 5303 -1111 -6943
2274 -6943 -625 1870 -5672 -5210 3445 2056 -4076 1202 7046 677 -3016 3945 4344 -3899 -2773
2289 -2773 4141 101 -5820 -13 3947 -3232 -4928 2697 1880 -5241 -1455 5482 852 -2979 4412
2304 4412 6835 -1108 -1656 4723 588 -7321 -3395 1142 -5223 -7087 1879 3922 -1997 1577 9169
2319I169m630o250M881J518r159k249O951j715o476N239P269m519k773P747J516
2334F519q141K00O419m146o642N301M590o459j788P739l60p742K162N965n223
2349a606m990O757L733o126P30Q456j325o874L230L973p598n302N466M52p186
2364h210K177Q648j338l725O967M921o701k815N578k506q938J301N330m771l753
2379g835P569L950n743Q99P537k378o922L618M152o541l106P130R58o804K061
2394a455O593m365o014M896K714p289j065P957l3n387M993O831m869m174N601
2409D934k7r200j221N543l636n728O087O223m301l51Q590O93p253J334M762o101
2425C48o471M697K383o691l6Q028m66n589M267N396n531l909O096J137o937J077
$$ plain form
2319 9169 4539 -1711 3170 4688 -4471 -6720 231 -1484 -7960 -2721 4548 29 -2744 5003 6519
2334 6519 -1622 -1422 4997 851 -5791 -490 4100 -2359 -4147 3592 3232 -4510 -2348 3617 -1606
2349 -1606 -6596 161 3894 -2232 -1502 6954 5629 -1245 1985 5958 -1640 -6942 -1476 -1024 -8210
2364 -8210 -6033 2615 1277 -2448 4519 9440 2739 -76 5502 2996 -5942 -4641 689 -4082 -7835
2379 -7835 -266 3684 -2059 -1160 6377 3999 -2923 695 4847 -1694 -4800 2330 3288 -3516 -1455
2394 -1455 5138 773 -5241 -345 2369 -4920 -5985 1972 1939 -3448 1545 8376 3507 -667 4934
2409 4934 4907 -4293 -5514 29 -3607 -9335 -3248 2975 -1326 -1677 6913 7606 353 1687 6449 348
2425 348 -6123 -1426 957 -5734 -5770 2258 1792 -3797 470 5866 335 -3574 2522 3659 -3278 -2201
2441b201P017k583n439M695L540o950l124N736q47o893K783O976k766k829P289
2456D404L627o320r24N460l636q123K109L680n913k628P707K627n040K986P495
2471G511l017n520M326K285p650k519O089j137o381L528O129m357l580O304J774
2486C785o977K28O699k274n357N068M937n480k496O161o59p874O22M985m486m733
2502g851O105M291m766P53Q053l98o126K578L853o567n293M568O89o751R78P404
2518A520j194m078N524M812n362k491N715p13p173J311N372l933m334N542K945
2533C463o128p56O219j670o113L435N154m392k421O829J835o086Q01N451m023
2548A598o379L375K560o416j530P109P05m753M097O615l624l902N108R71p737
$$ plain form
2441 -2201 4816 2233 -3206 1489 5029 -1921 -5045 691 -156 -7049 -4266 2710 -56 -2885 4404
2456 4404 8031 1711 787 6247 2611 -5512 -3403 277 -5636 -8264 -557 2070 -2970 16 7511
2471 7511 4494 -1026 3300 5585 -2065 -4584 1505 368 -6013 -2485 3644 -713 -4293 2011 3785
2486 3785 -3192 -2964 3735 1461 -3896 1172 6109 629 -1867 4294 3635 -4239 -3617 1368 -3118 -7851
2502 -7851 -1746 2545 -2221 -1468 6585 6187 61 2639 6492 -75 -5368 -800 -111 -6862 -5884 1520
2518 1520 326 -3752 1772 6584 1222 -1269 4446 3733 -3440 -2129 3243 -690 -5024 518 3463
2533 3463 -2665 -3421 2798 1128 -4985 -1550 3604 -788 -3209 3620 5455 -631 170 5621 1598
2548 1598 -4781 -1406 1154 -5262 -6792 317 1022 -3731 366 6981 3357 -545 4563 5534 -2203
2563b203j434N147k839n838M268N162m338j494P081J142o158J386N438l988n245
2578c913M593K859o030j072O410q77o074K678M813m714l709N683K098n624R73
2593a906O763j621m995L850L486o046l372M896n30o569J572N989k526l227O068
2608A832L835n068p13N716j808o720J795L744n216l510N655J873n282J448O565
2623D146j969m699M256L368n758k231N668m77o122K109N253l892l991N148K117
2638B926o052k75O107j501n075M017M745m536k440N760L98o625M84M897l737m990
2654e897M466L439m933m77O819J71n193K671M671m555m337M388J122o323k37N818
2670A613j538m600M143M543m400k196N625M57n995R75N110l184m457M373K860
$$ plain form
2563 -2203 -3637 1510 -1329 -7167 -2899 2263 -2075 -3569 3512 4654 -1504 -118 5320 1332 -3913
2578 -3913 680 3539 -2491 -3563 2847 1970 -4104 -1426 3387 -1327 -5036 647 2745 -2879 -1906
2593 -1906 4857 3236 -1759 2091 5577 -469 -3841 1055 525 -6044 -4472 1517 -1009 -4236 1832
2608 1832 5667 599 -114 5602 3794 -2926 -1131 2613 -2603 -6113 -458 1415 -3867 -2419 4146
2623 4146 2177 -2522 1734 5102 -656 -2887 2781 2304 -3818 -1709 3544 -348 -4339 809 2926
2638 2926 -3126 -3401 2706 1205 -3870 147 4892 356 -2084 3676 4074 -2551 -2067 2830 -907 -5897
2654 -5897 -1431 2008 -2925 -3402 3417 3588 -1605 1066 5737 1182 -3155 1233 2355 -3968 -4205 1613
2670 1613 75 -4525 -382 4161 -239 -2435 3190 3647 -2348 -1373 3737 553 -3904 469 3329
2685C329n432j225N609r14n555K545M767l776k831N694K033n351M21N373k643
2700B044n576K979K887n541k114N783O76m833K763N891k827l653M591J733o337
2715a534j438M900j979n416L297M719l816k014N995J297n630O74M981l158m880
2730d002L895L171m949j127N946j73n466J875M331m248m035M533K035n037N41
2745b710O409o41m300L393L656n150l678L898l85o253P10N506j624k834N566M239
2761E802m049j072M856j551o686O12L230m425l375N243K831l971J313O254j262
2776C750m808K690K633n536k943M722L59m891K151N667k370l606M169J836n992
2791b169j651M730j275m733L538N339k782j724N575J045o145p52L468l968n590
$$ plain form
2685 3329 -2103 -3328 2281 1367 -4188 -1643 3124 -652 -3483 2211 4244 -1107 -686 4687 2044
2700 2044 -3532 -553 2334 -3207 -5321 462 1138 -3695 -932 4959 2132 -1521 3070 4803 -1534
2715 -1534 -2972 1928 -51 -5467 -2170 2549 -1267 -3281 2714 4011 -1619 -945 4036 878 -4002
2730 -4002 -107 3064 -1885 -3012 2934 2761 -2705 -830 3501 -747 -4782 -249 1786 -3251 -2710
2745 -2710 3699 3058 -1242 2151 5807 657 -3021 877 492 -5761 -5051 455 -1169 -4003 1563 5802
2761 5802 1753 681 5537 3986 -2700 -2088 1142 -3283 -6658 -1415 1416 -2555 -1242 5012 3750
2776 3750 -1058 1632 4265 -1271 -4214 508 867 -4024 -1873 3794 1424 -2182 1987 3823 -2169
2791 -2169 -3820 910 -365 -5098 -1560 3779 997 -727 4848 5893 -252 -1004 2464 -1504 -7094
2806g094L197L402l640J25P189J656l894K335M202m481n241K538L59o248q09N557
2822h47k12l262M371N147l168k307M414R6o206l16M199k620l974M100L626m016
2838i75j106N088n42n581J127L885l451l050M975K900l884O84N500j462n211J740
2854F37K158n594l349M247P20m226K436O343j027k548M574K490n406k181L602
2869B876k216o010J602L888l283j998N640K362m164R72N156k009m531K969K685
2884C939m811k035M707j17n163J323M279l128l530M131K441m325M2N647l61m086
2900a047K697L619m156l358L629J46n665k5M534j755l454M115L893l398q49N188
2916D114J70m871J125L660l592l991L325J416n018o44M775q75l891L269M379k882
$$ plain form
2806 -7094 -3897 -495 -4135 -4010 3179 4835 941 3276 7478 2997 -2244 294 653 -5595 -6404 -847
2822 -847 -1059 -4321 50 5197 2029 -278 4136 4232 -1974 -2290 1909 -711 -4685 -585 3041 -975
2838 -975 -2081 3007 2465 -3116 -1989 1896 -1555 -4605 370 3270 -614 70 5570 4108 -1103 637
2854 637 2795 -2799 -6148 -1901 -1181 -5407 -2971 3372 2345 -203 4371 6861 1455 -726 2876
2869 2876 660 -5350 -3748 140 -3143 -5141 499 2861 -1303 -331 4825 2816 -1715 1254 3939
2884 3939 -872 -2907 1800 1683 -3480 -2157 2122 -1006 -4536 -405 2036 -2289 -2247 3400 3039 -1047
2900 -1047 1650 5269 1113 -2245 1384 1530 -4135 -4160 374 -1381 -4835 -720 3173 -225 -1074 4114
2916 4114 4284 -587 538 4198 606 -3385 -60 1356 -3662 -4306 469 -406 -4297 -1028 3351 469
2932D69j538N097J050m865K28L640l392m893K487J859m623q80N430O27l439L160
2948D17M845k755k785L852P36n624q71L940k211m376L036L424l672j439M973O09
2964B099m552J401M548k376l146M071K450m385r80M206j573n427J178K864l840
2979c462k550M792K373l170J777N832q38l683K420J808n469l421K928q27m898
2994f388J529N015j223j785N006L017l846p70L925j671n205J397L017l625k346
3009c953M433J307m312N15M251k168l925L123K872l556n49N354O02l891J699L357
3025E159l942m312K412K98n283l16N004j04k365M527M733k584j532L854o28o058
3041a137q40K612l405l835L638L110k948L96N609K91l918J749L159l679l314L427
$$ plain form
2932 469 -1069 4028 5078 213 441 4081 689 -4204 -1717 142 -4481 -5361 69 696 -2743 417
2948 417 5262 2507 -278 3574 4310 -1314 -2185 1755 -456 -4832 -1796 1628 -2044 -3483 1490 2099
2964 2099 -2453 -1052 3496 1120 -2026 2045 4495 110 -870 3336 1763 -3664 -2486 378 -3462
2979 -3462 -6012 -1220 1153 -2017 -240 5592 4754 1071 3491 5299 -170 -3591 -663 -1490 -6388
2994 -6388 -4859 156 -1067 -2852 2154 5171 1325 555 4480 2809 -2396 -999 2018 -1607 -3953
3009 -3953 480 1787 -2525 -2010 2241 73 -3852 -729 2143 -1413 -1962 3392 3994 103 1802 5159
3025 5159 1217 -3095 -683 -385 -5668 -5984 -980 -1084 -3449 1078 5811 3227 1695 5549 4921 -1137
3041 -1137 -1977 635 -2770 -6605 -2967 143 -2805 -2409 3200 3491 -427 1322 4481 802 -2512 915
3057I15J187m351J58M529j287l969K328K538m109k180M092P64l661J947N129j228
3073B802k589L429J729m985k304K781j913n053J540L847k023j016N486K668l142
3088A257O86L979k337m847J457J463m673j986M156N01l526K124M588j980k615
3103a753L667J692m315n86M152j088l967K305L059l594k420L581K23m652N12M107
3119I23j589k711L989L260l113o26M256o30m839O32K567l725l320L298J615l593
3135c606O40N021k37l059K863L119l430k295L416qm721J64L526k225l310L062
3151a080K443l435o23M538K04l516J997L666k673k707L173Q28m682p13L495j635
3167g20l662K659L232k801r73M581Q09l805J031L517k612l460K784J497m179p71
$$ plain form
3057 915 2102 -2249 -2091 2438 1151 -2818 -490 2048 -2061 -4241 -149 615 -3046 -1099 4030 2802
3073 2802 213 3642 5371 386 -1918 863 -1050 -6103 -4563 -716 -2739 -3755 1731 4399 1257
3088 1257 1943 5922 3585 -1262 195 1658 -3015 -5001 -845 -344 -3870 -1746 2842 862 -1753
3103 -1753 1914 3606 -709 -1295 2857 1769 -2198 107 3166 -428 -2848 733 956 -3696 -3184 923
3119 923 -666 -3377 612 3872 759 133 4389 3759 -1080 -448 2119 -1606 -4926 -1628 -13 -3606
3135 -3606 -2966 2055 1818 -1241 1622 4741 1311 -984 2432 2424 -2297 -2133 1393 -832 -4142 -1080
3151 -1080 1363 -2072 -2695 1843 2047 -1469 528 4194 1521 -1186 1987 2815 -1867 -2580 915 -720
3167 -720 -4382 -1723 1509 -1292 -2265 2316 3125 -680 351 3868 1256 -2204 580 2077 -2102 -2873
3183b873M059p14l735K158L302k923j973M025J149l770P18M151j614l430K533
3198A063J953m230j896L422m51m032J591M025j712j851M173K166l573m77L487
3213C658j678m533J254K345l374j936L999J405l236J141M277j416l231K491J949
3228C115l912j541L657j39l767J496L597k336k603L172J301m029m54L820q73l245
3244b741K627L313k671j533L707K69m384P1K961k527l292K918K283l031n9M619
3260B530J38l376J778K848l269k888K836N24m144J73L968j024k795K996K813l142
3276c4j401L590j47m113Q65L322k215k584L281J931l509n20L720r10l838J605
3292i57K806k819j916L716J298l381N92L790j494l401K119J915l659j622L508
$$ plain form
3183 -2873 1186 472 -3263 -1105 2197 -726 -2699 1326 2475 -1295 -577 3574 1960 -1470 1063
3198 1063 3016 -1214 -3110 312 -139 -4171 -2580 1445 -267 -2118 2055 4221 648 171 3658
3213 3658 1980 -2553 -1299 1046 -2328 -4264 -265 1140 -2096 -955 3322 1906 -1325 1166 3115
3228 3115 -797 -2338 1319 1180 -2587 -1091 2506 170 -2433 739 2040 -1989 -2443 1377 504 -2741
3244 -2741 -114 3199 528 -1005 2702 2971 -1413 -1342 1619 -908 -4200 -1282 1001 -2030 -2089 2530
3260 2530 2668 -708 1070 3918 649 -2239 597 1121 -3023 -2850 1118 94 -2701 295 3108 -34
3276 -34 -1435 2155 2008 -2105 -1240 2082 -133 -2717 564 2495 -1014 -1534 2186 1276 -2562 -957
3292 -957 1849 -970 -2886 830 2128 -1253 -661 3129 1635 -1766 353 2268 -1391 -3013 495
3307D95J71l430J476L773j760k301L118J538l772q49L299j105l648J850K931k584
3323g98j543L769R76l577M55L331j935l267K407J928l355q23L928M8l280J644
3339i2L176k559k509K908Q54l926j59L617j069k910K620K858k799j360L502P9
3355B231l980M77L022k163k739K988K066l022l06L893m04l535J344K503k983k427
3371c035L033J089l278N41M030p51k783K314K184l410k026K790k50l823Q60L557
3387A042j320j885L497K269l042o94L094j224m130Q99K271k761j775L704J583
3402A528k738R03L775j346l211J836J477l722j532L324J24k987J811L628j793
3417A077k152K792Q31m080q36K954j213k958K526L266j963p75L773M60l859j24
$$ plain form
3307 495 666 -2764 -1288 2485 725 -1576 1542 3080 -692 -1541 1758 653 -2995 -1145 1786 -798
3323 -798 -2341 1428 2404 -1173 -718 2613 678 -2589 -182 1746 -1609 -2432 1496 1544 -1736 -92
3339 -92 3084 525 -1984 924 1778 -2148 -2307 1310 241 -2669 -49 2809 10 -1350 2152 2231
3355 2231 -1749 -1272 1750 -413 -3152 -164 1902 -1120 -1426 2467 2063 -1472 -128 2375 -608 -3035
3371 -3035 -2 1087 -2191 -1650 2380 1629 -1154 1160 3344 -66 -2092 698 448 -3375 -2515 1042
3387 1042 -278 -2163 1334 3603 561 -133 2961 1737 -2393 -1494 777 -1984 -3759 -55 1528
3402 1528 -1210 -307 3468 2122 -1089 747 2224 -1498 -3030 294 418 -2569 -758 2870 1077
3417 1077 -1075 1717 2548 -1532 -2368 586 -627 -3585 -1059 2207 244 -531 3242 3702 -157 -281
3433b81K213k789l439K155J874k579K19M583P85k486J771K624k953l102J847O2
3449E04m047k78L561l59k087K982L179k275j417K908k20m150j3K715j825k346
3465c168L025K362k539m16L358o40l791P35K159k696k009L311J700k449R30L897
3481C769q88l036J509J255l885k204K548j18l016J605L945q31j344L392J649l310
3497A040r68K450j674l919J123K231k479j209L678J267k708Q86L310j518k851
3512a341K100J581l172j015L230j27l166J186K716k258k310K578J089l143KL525
3528A475m05k486K190K602k487j705K632K1l755l9K664j643k509K525K219k392
3544a093l76L573J83k913J210K578k265k367K309P34l494m69K880j034k748K090
$$ plain form
3433 -281 1932 -857 -4296 -2141 -267 -2846 -2627 1956 2741 255 2026 4650 1697 -1405 442 504
3449 504 -3543 -3821 -260 -619 -2706 276 3455 1180 -237 2671 2451 -1699 -1712 1003 -822 -3168
3465 -3168 -143 2219 -320 -736 2622 1982 -1809 -1074 1085 -1611 -3620 -309 1391 -1058 -128 3769
3481 3769 2881 -155 1354 2609 -1276 -3480 -932 -1050 -4066 -2461 1484 653 -691 2701 4350 1040
3497 1040 72 2522 848 -3071 -1948 283 -2196 -3405 273 1540 -1168 -282 3028 1510 -1341
3512 -1341 759 2340 -832 -1847 1383 1256 -1910 -724 1992 -266 -2576 2 1091 -2052 -2050 1475
3528 1475 1070 -1416 774 3376 889 -816 1816 1837 -1918 -1957 707 -936 -3445 -920 1299 -1093
3544 -1093 -1469 2104 2287 -626 584 3162 897 -1470 839 1573 -1921 -2390 490 -544 -3292 -1202
3560a202K599k051p50L577P79k888O86K589k192l014J711Q58l405p07L228q4k328
3577b594K223L113j765j402K860M80l525k49K501j657k771K065J998k502p87L182
3593A170N4l065Q95K625j838j943K792J637k545j1L143p70l226R00J561l057k119
3610c797K505Q08k444J166L941k37j700K449J721l131j861J855j093l788M91K560
3626e55j393j266L416K144k120J79L010r86l249R77J578k783j610K797O60k656
3642a857P92K931j413k399J979J330k830n96L154J20k302J747K715j969j940K055
3658A517P6l726o40K322j177k177K530K795j468j34L423L41l024J67J735k625
3674f5k941J641J005k621%L488K64k006J880K494k034j788K232L52l138q8K617
$$ plain form
3560 -1202 1397 -654 -1404 2173 2952 64 750 3339 1147 -1867 -156 702 -2703 -3410 -182 -266 -2594
3577 -2594 -371 2742 977 -425 2435 2915 -610 -859 1642 -15 -2786 -721 1277 -1225 -2012 1170
3593 1170 1224 -1841 -946 1679 -159 -2102 690 2327 -218 -229 2914 2144 -1082 -182 1379 -1678 -3797
3610 -3797 -1292 -484 -2928 -1762 2179 1942 242 2691 4412 1281 -580 1275 182 -3606 -3115 -555
3626 -555 -1948 -3214 202 2346 226 405 3415 2429 -820 157 1735 -1048 -2658 139 799 -1857
3642 -1857 -1065 1866 453 -1946 33 1363 -1467 -2063 1091 1211 -1091 656 3371 1402 -538 1517
3658 1517 1593 -2133 -2773 -451 -1628 -3805 -1275 1520 52 -82 3341 3682 658 825 2560 -65
3674 -65 -3006 -1365 -360 -2981 -2981 507 771 -1235 645 3139 1105 -683 1549 1901 -1237 -1325 1292
3691A292j063k354J866J824k446j144K605N9k769Q94K808j193j552K636J550k578
3707D35n77K321j107l281P32J676k281j337K943J254j991J053L218q50k194J656
3723A670J083l115j440K134n35k824J112K609j386j264K802J266k474J6K626r80
3739A300k572J478J694k370j215K514J50k806N14K361j488j970K198J555k175
3754h32j46L015n1k375J097J930k257k069J781L32k927p6K702n00j776K191K399
3771B438j731q11K540M9l010L3J853j849k309J836J382k174j39L026O4k184J331
3788C45K131j934j671K109M99k714N0K488r68k152J710J581k305r58K443j9k450
3805a815R62K499j267j392K380J115k493m17K117j161k804R88J562k014r06K826
$$ plain form
3691 1292 229 -2125 -259 1565 -881 -2025 580 639 -2130 -1236 1572 379 -1173 1463 3013 435
3707 435 -142 2179 1072 -2209 -1477 199 -2082 -3419 -476 778 -1213 -160 3058 2208 14 1670
3723 1670 2753 -362 -1802 332 -203 -3027 -1915 694 -692 -1956 846 2112 -362 -346 2280 1300
3739 1300 -1272 206 1900 -470 -1685 829 979 -1827 -1313 1048 -440 -2410 -212 1343 -832
3754 -832 -978 2037 1986 -389 708 2638 381 -1688 93 425 -2502 -2578 124 -376 -2152 39 2438
3771 2438 707 -104 2436 2485 -525 -492 1361 -488 -2797 -961 421 -1753 -1892 1134 1198 -986 345
3788 345 2476 542 -1129 980 1479 -1235 -1185 1303 335 -1817 -107 1474 -831 -1789 654 635 -1815
3805 -1815 -853 1646 379 -1013 1367 2482 -11 -428 1689 528 -2276 -1288 274 -1740 -2646 180
3821A80R81j890R87K684j130k129J408P84k906j153K118l11k278J319K583j152
3837I5j110K420R35k532l50K111j043k472J318J802j841q78K551M91k437L29K097
3854A486j425k139J686J368k039k81K792J75k114J029J883j955j972J596L50k659
3870b219o5K579l55j567K047K092j715r09K090k55k888P7J738j576j704K123J454
3887I47j832J01K655l46k257R78J504k107j451K057M92k200N12K486q47j807J600
3904D85J192k308r28K124j57k213J005K286j176j287K113Q89k373m74J961q72
3920B67k346J111J765j579q26K471P58k082L47K086j199k155J303J109k151o85
3936a806K360J58j995R74K126j376j575J786O99k355k99K210n45j949J410J763
$$ plain form
3821 180 1161 -729 258 2942 1812 -317 1091 1875 -1031 -2184 -66 -377 -2655 -1336 1247 95
3837 95 -1015 1405 2340 -192 -542 1569 526 -1946 -628 1174 -667 -1545 1006 1497 -940 -611 1486
3854 1486 61 -2078 -392 976 -1063 -1344 1448 1623 -491 538 2421 466 -1506 90 440 -2219
3870 -2219 -2284 295 -60 -1627 420 2512 797 -112 1978 1723 -1165 -1088 650 -926 -2630 -507 947
3887 947 -885 -784 1871 1525 -732 246 1750 -357 -1808 249 741 -1459 -947 1539 692 -1115 485
3904 485 1677 -631 -1559 565 408 -1805 -800 1486 310 -977 1136 2025 -348 -822 1139 267
3920 267 -2079 -968 797 -782 -1608 863 1621 -461 -114 1972 773 -1382 -79 1030 -1121 -1806
3936 -1806 554 712 -1283 -309 1817 441 -1134 652 1351 -1004 -1303 907 362 -1587 -177 1586
3952A586j700r74K110K15k369L00J981j179j675J785J228j929l28K264k94k162
3968a141Q71J648j688j302J970O35k070K43K244p52j817J396J291k022q89K024
3984F41K5k150O91K059j095j392J839J012k073l83K014n27k141R20J641j563j122
4001a604K054O78k014K16K144p80j846J324J320j910q64K012P2k140N80J949j178
4018A3j488J756J012j971k60K117l72j981J048J617j603j127J900M13k143J93
4034h76J945r61j698J470J248j782m49K194Mj898Q29J718j455j448J585M76k204
4051a302j46J990n78j639J471J644j417o50K040J89k154K50J586j331j725J411
4067c61R80j797k23K210j5j729R77J663j424j296J640N18k042n1J962n78j721
$$ plain form
3952 1586 -114 -1088 1022 1237 -1132 -832 1149 -30 -1705 80 1308 -621 -949 1315 1021 -1141
3968 -1141 -270 1378 -310 -1612 358 993 -1077 -834 1410 658 -1159 237 1528 -494 -1383 641
3984 641 666 -1484 -793 1266 171 -1221 618 1630 -443 -826 1188 661 -1480 -560 1081 -482 -1604
4001 -1604 450 1128 -886 -670 1474 694 -1152 172 1492 -418 -1282 730 802 -1338 -758 1191 13
4018 13 -1475 281 1293 -678 -938 1179 807 -1174 -126 1491 -112 -1239 661 1074 -1069 -876
4034 -876 1069 108 -1590 -120 1128 -654 -1103 1091 1095 -803 26 1744 289 -1159 426 902 -1302
4051 -1302 -1448 542 -36 -1675 -204 1440 23 -627 1413 1602 -552 -302 1284 -47 -1772 -361
4067 -361 619 -1178 -1401 809 794 -935 42 1705 281 -1015 625 1143 -899 -950 1012 434 -1287
4084a287J215J365j712r37J809J56j994M90J991q07j263J721J158j799n35J731
4100A302n47k250N38J390j448j048J997R17j544M54K178n95j710J084R41k047
4116c88j019J620j24j927P04J902r27j057J808R04j804j55J823n74j819R79J335
4133A281j525r22J757K11j970K27J680r34j446J483J221j483k35K077Nj797O15
4150B45J360j500j514J298M87j916m7K017k54j416J314J587j325q24J724K04k019
4167e79J13J580j030j635J230R84j711m81J934L3j630R11J805r93j030J653O08
4184A762j977l02J510r09j908R04J198j423n27K107N12j465P26J768j008j460
4200d92J164N23k006n06J665l44j588J037J548j186q49J676L89j826J55J722o80
$$ plain form
4084 -1287 -72 1293 -419 -1356 453 609 -1385 -895 1096 289 -974 747 1905 106 -429 1302
4100 1302 755 -1495 -957 433 -1015 -2063 -66 851 -693 -239 1939 1344 -366 718 1659 -388
4116 -388 -1407 213 89 -1838 -1134 768 -159 -1216 592 1496 -308 -463 1360 786 -1033 -54 1281
4133 1281 -244 -1166 591 802 -1168 -941 739 -195 -1641 -158 1063 -420 -655 1422 1427 -370 245
4150 245 1605 105 -1409 -111 376 -1540 -1587 430 176 -1240 74 1661 336 -488 1236 1440 -579
4167 -579 -466 1114 84 -1551 -321 663 -1048 -1529 405 438 -1192 -281 1524 531 -499 1154 1762
4184 1762 -215 -517 993 84 -1824 -920 278 -1145 -1672 435 947 -518 208 1976 968 -492
4200 -492 672 1195 -811 -1317 348 4 -1584 -547 1001 -185 -1034 642 1031 -795 -640 1082 402
4217D02j356J367J180j513o10J563k72k102K36J310j174j115J734J194j180L00
4233c6K149k08j726N59Q58j938j503J189J83j706M71K200j54r31J598J274j577
4250G02q26J326m24k140K84J463r84r80J749R91j517j21J657o04j841P62J199
4267F96j330o05J966O23j446M46J559j098j783P77M07j955m98J836J96j054J414
4284A51J958p85q38J357N5k294o14J063j031j572J225J483q84m0K143M01j575
4301B03L05J198j354j615J018O33j558j03J921J1j417Q60J274j391j215J272L60
4318D02j675K28J955k09j132J318J170j572j004J175m14k107J68J497p17q04J895
4335A74J392j118J1J715n16k016K71P66j709j125J499N63j283O23K017l90j177
$$ plain form
4217 402 -954 413 1593 80 -530 1033 761 -1341 -1105 205 -969 -2084 -350 844 -336 -36
4233 -36 2113 1905 179 738 1596 -342 -1845 -656 -473 -2179 -1708 492 338 -593 1005 2279 702
4250 702 -124 1202 778 -1362 -1078 385 -599 -1579 170 1161 -356 -477 1180 576 -1265 -503 696
4267 696 -634 -1239 727 1350 -96 350 1909 811 -972 -195 212 -1743 -2241 -405 -209 -1263 151
4284 151 2109 1324 486 1843 1898 -396 -1010 53 -978 -2550 -1325 158 -726 -766 1377 1778 203
4301 203 508 1706 352 -1263 -245 388 -1170 -1273 648 659 -758 102 1376 -15 -1230 42 402
4318 402 -1273 -1045 910 701 -431 887 2057 485 -519 656 242 -1865 -1697 -200 -917 -1721 174
4335 174 1566 448 459 2174 1658 -358 -87 679 -1030 -2155 -656 -93 -1376 -753 1264 874 -303
4352c03J150P72j732p54J395k40j608P21J542q83q90J445M94j751k28J390o20
4369a00j455J072J365r94l59J801L12j646J21J120j269j642R02O87j401r6K005
4386D23L17j115R80J480j144j241J045J01j964l03J492m39j231J247J456j048
4402E6n58J597J18j785J13J336r29j261J296R86j335k39J670k26j679M77J110
4419G47j315j007J475O32j320L84J842l93j268R27P78j718r20J198j82j606N74
4436a172J646n67p12J631Q26j438k28J301o99j729N86R83j235o26J649N00j315
4453e99L92J515p61j357R45P17j505m55J584M3j329P06J423r67j097J158L77j698
4471i08k57J475l22j255J086J403r91n87J482J81j748o1J205r42j379J087J005
$$ plain form
4352 -303 847 1619 -113 -867 528 288 -1320 -599 943 60 -830 615 1109 -642 -870 520 -100
4369 -100 -1555 -483 882 -112 -471 1330 1642 -4 117 1237 -32 -1674 -772 -85 -1486 -1582 423
4386 423 740 -375 605 2085 941 -300 745 846 -1118 -1421 71 -368 -1599 -352 1104 56
4402 56 -502 1095 1213 -572 -459 877 -52 -1313 -17 969 -366 -605 1065 839 -840 -363 747
4419 747 -568 -1575 -100 532 -788 -404 1438 1045 -223 704 1482 -236 -1156 42 -140 -1746 -1172
4436 -1172 474 -93 -805 826 1652 214 -14 1287 588 -1141 -555 428 -807 -1433 216 716 -599
4453 -599 -207 1308 547 -810 135 852 -653 -1108 476 519 -810 -104 1319 352 -745 413 790 -908
4471 -908 -1165 310 -12 -1267 -181 1222 231 -356 1126 1307 -441 -502 703 -239 -1618 -531 474
4488D74j177j80J809J19j405N41J212j198j204J134L96j534J2J636l02j211J046
4505A68J081j293p38J356lj600L43J420p33r55J332P76j375k44J377m45j548O29
4523d52J063j114o79J518M87j307K70J433o48j348Q76P11j427n05J443P1j314
4540i22O23J410q28j005J156N24j548k65J401l09j334Q52J263j003p03J394K80
4557I86j593J4J323p05j295J061J014j203l27J574N3j478M09J186j074j109J175
4574A1N84j364J1J597k55j245Q12R96j289q15J258J03j471L45J481n68r25J231
4592D97P95j366m11J250l91j558N32J119r50o44J488O03j238J80J372o46j369
4609g37P20O98j354n50J424J69j224N78J401p25j013J041M96j491l30J336k18
$$ plain form
4488 474 -703 -883 926 1045 -360 181 1393 195 -1009 125 521 -1013 -1001 635 333 -878 168
4505 168 1249 -44 -782 574 571 -1029 -686 734 1 -954 378 1154 -221 -465 912 467 -1081 -452
4523 -452 611 -503 -1182 336 823 -484 -214 1219 571 -777 99 810 -617 -1122 321 392 -922
4540 -922 -299 1111 283 -722 434 958 -590 -855 546 237 -1097 -245 1018 15 -688 706 986
4557 986 -607 -593 730 25 -1270 -209 805 -398 -725 849 902 -576 -167 1019 -55 -1164 11
4574 11 595 -769 -758 839 584 -661 151 1147 -142 -957 301 404 -1067 -722 759 191 -734 497
4592 497 1292 -74 -485 765 374 -1184 -652 467 -483 -1127 361 964 -274 -94 1278 632 -737
4609 -737 -17 681 -673 -1223 201 370 -854 -276 1125 400 -613 428 924 -567 -897 439 221
4626B21j268Q32J277r02p15J275K73j588j18J205o48j245J004J086r91k87J614
4643A025J84j418K86J081j085j281R36N18j361m8J633n2j071R34J173j092q29
4660d67J144N9j594M9J271o19j020J151Q96j147k65J375j82j422M75J070r55q05
4678i86J288N28j235R5J354n17j290O69P38j282o03J322J81j162N49J452n49q83
4696c31J053N69j440m85J113l91j436N60J150q05n98J429O32j205J01J329n44
4713G01j337O72P68j277o29J291J51j299M28J353o64r71J081O68j301k44J359
4730G50j96j273O62J068j000p79J156K39j460K9J247n65j025J024R51r90k31J429
4748A036J2j312L45R32j068j047R22L55j288L2J437j51r29R73J038r63n74J135
$$ plain form
4626 221 -1047 -215 1062 160 -555 720 993 -595 -713 492 -156 -1401 -397 689 -302 -589 1025
4643 1025 1209 -209 77 1158 73 -1208 -272 246 -1115 -1163 470 418 -653 281 1454 362 -467
4660 -467 677 736 -858 -809 462 -157 -1177 -26 870 -277 -542 833 651 -771 -296 774 -181 -986
4678 -986 302 830 -405 -310 1044 527 -763 -94 644 -638 -1241 81 262 -900 -351 1101 552 -331
4696 -331 722 1291 -149 -634 479 88 -1348 -788 362 -443 -1041 388 1020 -185 -84 1245 701
4713 701 -636 36 804 -473 -1102 189 340 -959 -531 822 158 -813 268 936 -365 -609 750
4730 750 554 -719 -57 1011 11 -768 388 627 -833 -804 443 -122 -1147 -123 828 -162 -393 1036
4748 1036 1048 -264 81 1013 -55 -1102 -180 175 -1113 -1081 356 205 -724 249 1287 324 -250 885
4766H85pj485P5J041p39r96R97P60j081j78J383o9j212N46J075q78q01J149M13
4785H78j274m2J228m72j266O40Q26j121n75J309K97j108M60J416n24r49R48N59
4803A230j418n38J054l41j375N45J146p11n44J387N98j131R7J220n71j248O48
4820D8O64j191n17J209O5j187M32J163p11q27J038N57j154m0J313k18j074O73
4838B43Q49j097p32R50J2j360J29J178m24p39J167R30q99j96J208j93j378J73
4856a79P74j022r37R89N28j053J38J443j34r94P42Q79j043p00J061J43j294J64
4874d95J189n65j010Q48O62j186l97J198k4j120O13J236o20o12J138M06j324k46
4892c09R23o67j308N84Q15q83k56J466M13r13M93J111p37j037O69K59j346l23
$$ plain form
4766 885 878 -607 -532 509 -230 -1226 -229 531 -550 -728 655 586 -626 -80 995 117 -684 465 878
4785 878 -396 -438 790 318 -948 -308 518 -603 -1178 131 428 -680 -220 1196 672 -277 671 1230
4803 1230 -188 -726 328 -13 -1388 -843 303 -408 -952 435 1033 -98 -1 1219 648 -600 48
4820 48 712 -479 -996 213 278 -909 -477 686 -25 -852 186 743 -411 -451 862 644 -430 243
4838 243 1092 -5 -737 213 225 -1135 -1006 172 -252 -991 176 1106 207 11 1219 1026 -352 -179
4856 -179 595 -427 -1364 -375 153 -900 -762 681 547 -447 295 1174 131 -569 492 635 -659 -495
4874 -495 694 129 -881 -33 629 -557 -954 244 220 -900 -287 949 329 -283 855 1261 -63 -309
4892 -309 614 -53 -1361 -777 38 -845 -1101 365 778 -135 358 1469 732 -305 364 623 -723 -1046
4910a046J095j78r62P53J057p33n13J094K33j190O9J062m89r12Q30P18j000l95
4928e07J031j58j269K35R08o99o95J143P07q29J17J283k01j183L97N89j206q72
4946a209Q77J76j089K98J399j90o94R90P94j044m99R56k23j340K34R73p17p15
4964a023J070N32j045m3J138l18j050O45Q58q44m21J165K10j102J60R19p67j038
4982i54O61M28j068j39J255R5p66P55J037o84o63Q22M2j349j77Q27n06q94Q04
5001d74Q51p14j57J216J21j033K64Q64p32q71P80M43j042j57J095j87j016M61
5019b88Q18q07n99J045L66r44J77J198l17r04O52N53j130o09Q77j08j143L32J122
5038B91m28n40J115O63r28j47R77l72j196L47O29r13n74J021L02r25K66J121m07
$$ plain form
4910 -1046 49 -129 -1091 -338 719 -14 -527 567 800 -390 -321 741 252 -660 170 888 -112 -507
4928 -507 524 366 -903 -668 240 -459 -1154 -11 696 -133 -16 1267 1066 -117 280 869 -337 -1209
4946 -1209 -332 -156 -1245 -947 452 262 -432 558 1352 308 -191 765 542 -798 -564 409 -308 -1023
4964 -1023 47 579 -466 -509 629 311 -739 -94 764 -80 -501 664 874 -228 -68 851 84 -954
4982 -954 -293 135 -933 -1072 183 278 -488 267 1304 620 -43 779 821 -528 -705 122 -384 -1278 -474
5001 -474 377 -337 -494 722 843 -190 74 938 206 -665 115 558 -484 -641 454 267 -749 -288
5019 -288 530 -277 -876 169 535 -409 -232 966 649 -255 397 950 -180 -789 88 -20 -1163 -831 291
5038 291 -137 -677 438 1101 173 26 1003 631 -565 -218 411 -502 -1076 -55 247 -678 -412 709 302
5057C02p89P49N59r59k97R89p7r93L89Q14p49o65Q00K39j040QJ013k33p12P63
5077A11Q11p19l27R18j7j131M7O98o98q02P46N47p97RJ173M2q35M84P90p88p08
5098d46P38J74j098l5R70k96q32O80P54p72l88R96J23j023K50R55n34p34P80M69
5118G31r80k55R07k18j030M07P88o53m65J028L82q32J52J000m15r01N36M04r99
5137d13m23Q50j3q84M52R38m38m84Q90L78r08j04Q02l57r27M48O00p42l99R24
5157A90J64q58K22Q71m34o98O92M84q12k10R17n6r08L39P30o91o48P31K58q95
5177f12j4R94j82p04O53P47p01m27Q22L3j060K6P50n10p52P14N94p45r7J048Q
5198E85q63L72P17o98o72P17K31r32j5R12k49p18N91O27p37l40Q34L9q62K41Q11
$$ plain form
5057 302 -487 262 821 -138 -435 554 477 -516 -127 687 -62 -727 73 312 -728 -720 293 60 -652 111
5077 111 922 203 -124 794 777 -354 -307 391 -307 -1109 -363 184 -613 -604 569 611 -224 260 1050 262 -446
5098 -446 292 466 -632 -667 303 7 -825 -145 609 -163 -551 445 568 -455 -205 750 216 -518 262 731
5118 731 -249 -504 403 185 -845 -438 350 -303 -768 260 642 -190 -38 962 547 -354 182 586 -413
5137 -413 -836 14 1 -883 -431 507 69 -415 475 853 -55 -159 643 286 -641 -193 407 -335 -734 190
5157 190 354 -504 -282 589 155 -543 149 633 -179 -389 528 472 -436 -97 633 -58 -706 25 283 -612
5177 -612 -626 368 186 -518 135 882 181 -246 576 609 -451 -425 325 -185 -937 -223 371 -374 -471 577 585
5198 585 -278 94 811 113 -559 158 389 -543 -558 354 105 -613 -22 605 -132 -472 362 401 -461 -220 591
5219E91m68n75P08L56q60j52P80k41q37M06O39n81l43Q90K42p47J65P86m13p63
5239d17M76L77q36l03Q03J9p47L55Q53m42n14P20L45q80j46P96k47q32M35O57
5259D72o38m17Q16K12q58J06Q10l61p16O13N33p30k45Q75qq64K58O77n88o10O88
5280B5L13p90nQ97j59o75M96O03o83m04P16M9q80J25P41l99n78O57M34p00j12
5301c29P90j14p64L49N81n66m40P06K11p73L7P59l12o69M71M87o40k72P88O8p26
5322c58K47P13m56n74N76L08p86j66P73j05p31L98O97n38m19P35K15q34J3P38
5342D46l20o98M97N40o45k89Q02P4p97K14O88m67n96O22L60p38r9Q32j30p19M05
5363a8N82o05m48O85J20p97J12P70l09n68N82M71o66k08O87q8p68K53N77m99m20
$$ plain form
5219 591 123 -452 256 612 -248 -400 380 139 -698 -292 347 -234 -577 313 555 -192 -27 759 346 -417
5239 -417 59 436 -400 -703 100 119 -628 -273 580 138 -376 344 689 -191 -337 459 212 -620 -185 472
5259 472 -166 -583 233 445 -413 -307 503 142 -574 39 572 -158 -403 472 464 -400 -142 535 -53 -663 25
5280 25 338 -452 -457 440 281 -394 102 705 22 -382 334 383 -497 -372 369 -30 -608 49 483 -217 -329
5301 -329 461 347 -417 -68 513 -53 -493 213 424 -349 -312 447 135 -534 -63 424 -216 -488 300 368 -358
5322 -358 -111 602 146 -428 148 456 -330 -496 277 172 -559 -161 536 -2 -421 314 529 -305 -292 446
5342 446 126 -572 -75 465 -180 -469 333 407 -390 -176 512 45 -551 71 431 -307 -406 426 296 -423 -18
5363 -18 564 -41 -489 196 316 -481 -369 401 92 -476 106 577 -89 -297 390 302 -466 -213 364 -135 -555
5384e55O57K97o56L5P36k36o63L88M42o24l37O66R7o83K06P26l33n29N38L73p13
5405a68k26O79j00p33K97O34m27m04P07K86p19l6P09k69p46L83M98o07l24P73
5425B07J60o90J85P51l78o25N16L10p46k15P30o4o49L89O85m74m01O35J80q09
5445c03m7O32l08o26N01N17n21j42P77N0o96J54N06n23n72M76K68o33L0P88n0
5466B78m97M31N04n71m33N04Mp73M1O54k27m36O12N05n37j60O22j13p92J13M86
5487B15m50m41O61L88n38M0P55j57p36K57L93o73m38O57J84n88K45Q31j96n19
5507a10M70L33p95l89N42j29p24L17P32k67k61P51L23o81j05N23l80p97K76M30
5527E9n23j57Q07K38n23K30O00m31o16L49J72o91j42P08Om53M52O02m37l87M57
$$ plain form
5384 -555 102 399 -257 -222 514 278 -385 3 445 -179 -516 150 247 -436 -230 496 163 -366 172 545 -168
5405 -168 -394 285 185 -548 -251 383 -44 -448 259 545 -174 -210 499 230 -516 -133 365 -242 -566 207
5425 207 367 -323 -138 613 235 -390 126 436 -310 -525 205 141 -508 -119 566 92 -309 326 506 -303
5445 -303 -350 282 -26 -652 -151 366 -155 -297 480 530 -166 -12 494 -29 -601 -125 143 -490 -460 328 278
5466 278 -219 212 716 145 -288 216 220 -553 -512 142 -85 -521 91 596 59 -101 521 408 -384 -271 215
5487 215 -235 -676 -15 373 -165 -125 630 473 -263 -6 387 -286 -724 -67 117 -471 -226 605 409 -110
5507 -110 360 693 -102 -491 51 -78 -802 -485 247 -20 -281 470 793 112 7 530 150 -647 -371 59
5527 59 -464 -621 186 424 -99 131 731 300 -316 33 205 -486 -628 80 86 -367 85 687 250 -137 320
5548C20J0p85r0N71k17m27N78N67l90j33O40o7p86K6L64m81n40N57M13m53Q7Q17
5570E81mo09K77L83o54n43M97J01o49J16Q00j17m43N07M65o54l43N37p3p48J84
5591c89O52k98l67O59L51o41j06N52k63p32K82M60m67k23P60K32n23J70N62l73
5611B98o09L08K00o66j61O45L6m52L81O07l39l69M70R4o94r0N20k15n02M12M89
5632C63m33j91N96L0o60Q2N01l41m56N23L67m86o7O47q8o73J87M24n39m35N56
5653i3K54n21J06P63j30n05L63L71o58l85N08j1o71K02O69k39l71N80L42o04j49
5674a79N52j95o60K70M99m07k75O44J89n91J8N12l26n72L65L41m77r5O92Q9m83
5695h9K43M67m56m91L28Q8o37m8O21m4l66M85N38l86k64M83n3p16k2M39l14m41
$$ plain form
5548 320 330 -455 -545 26 -191 -618 -40 527 137 4 644 577 -209 -183 181 -300 -840 -283 130 -323 -236 581
5570 581 577 -32 245 628 -26 -569 -72 29 -620 -504 296 179 -264 243 708 54 -289 248 175 -573 -389
5591 -389 263 -35 -402 257 608 -33 -139 413 150 -582 -300 160 -307 -530 230 462 -61 109 671 298
5611 298 -311 -3 197 -469 -630 15 51 -401 -20 587 248 -121 349 443 -251 -341 179 -36 -538 -126 363
5632 363 -70 -261 335 365 -295 -213 288 -53 -509 14 381 -105 -172 475 387 -286 -99 325 -214 -649 -93
5653 -93 161 -360 -254 509 379 -126 237 608 -50 -435 73 62 -609 -407 262 23 -348 232 574 -30 -179
5674 -179 373 178 -482 -212 287 -120 -395 249 438 -153 -135 377 51 -521 -156 185 -292 -387 305 394 -89
5695 -89 154 621 165 -326 2 90 -547 -595 26 -18 -384 101 639 253 -11 472 419 -297 -319 120 -194 -635
5717f35M98M29m25n1O40l3o23J36M39m62m19N25K66n29M3O70j56n77K84L48n82
5738b14l52N47J19n44K31O99j98l91M65K70o75k68M44j80o44K41N58k90k01O69
5758B86K66n22J4N17l23o08K60K92n07j88N96R0m80K23N18l39l95M20J82n39m8
5779b85N67p3m53L09M04m41l30M15L1n95M5N37j72l60N03M28m26j41N30p2o83
5800b62P9L90m31l99M81L00m61L8O68p5n05L05L86n03l46N11Q2o10Q6N63k45m76
5822d24L99L29n49j51N95Pn22K88N46l36l48M67J23o39r1M48k38n13L44M36l50
5843a79r5O27J12m96J37M33l74m88L22J67n29r2N36l2m34L14M56l56k66M74J21
5864C58n05L6M80k01m58L37K74m93k27M77k6n28J82N28k32k86N17L08m76q8N03
$$ plain form
5717 -635 -137 292 -133 -184 456 423 -200 -64 375 -87 -506 19 285 -244 -201 469 313 -264 20 368 -214
5738 -214 -566 -19 100 -444 -213 486 288 -103 362 632 -43 -311 133 -47 -691 -450 108 -182 -383 286
5758 286 552 30 44 561 238 -370 -110 182 -325 -513 83 173 -307 -84 434 95 -300 120 302 -237 -285
5779 -285 282 209 -244 65 469 28 -302 113 144 -451 -406 131 -41 -401 102 530 104 -37 493 421 -262
5800 -262 -183 207 -224 -623 -142 158 -303 -265 403 328 -177 128 514 11 -335 176 258 -352 -266 297 52 -424
5822 -424 -25 304 -245 -396 199 206 -316 -28 518 182 -166 301 424 -215 -306 142 -96 -609 -265 171 -179
5843 -179 -274 353 465 -31 106 539 165 -323 -1 166 -363 -455 81 49 -385 -71 385 29 -237 237 358
5864 358 -147 -111 369 168 -290 47 321 -172 -399 78 52 -476 -294 234 2 -284 233 541 65 -23 480
5885D80j89o17J69L29m75l16N44J84m58J56O19j61m17L83L14n35k30M66n3n97
5905d04J45M53l45l39M77K30m68K6N84r9m28L27L75m45k73M26k9n96M7M35k90
5926a91l55M51L20l58rN52k2m60K00L31m35l31L71O9n00QM90j64l71L47L47l78
5948h8j23N07O5m63J45M40l17m13L15J31n62j52M95r1m24L63N23k44j77N56J43
5969F29n68m9L69l44n71K67K91m41j13O15J28m15K44N05l22l78L73J54n69o0M82
5990B27j41m44K81L61m18k45M34N7m91J21N24j65k65M67K82m22j60L73k00o09
6010d33P0K77l60k22N33L03k75J78N63j04m19J94J40n70l23L28l7m46J93N42j33
6031ak22M60K74m61j16M15j40n15J94L78l13k50M65J37n21j5M11k47m57L30L68
$$ plain form
5885 480 291 -326 -157 172 -303 -619 -75 109 -349 -193 426 265 -152 231 545 10 -220 246 193 -404
5905 -404 -259 194 -151 -490 -13 217 -251 -225 359 260 -168 159 534 89 -184 242 213 -383 -336 99 -191
5926 -191 -546 -95 225 -133 -142 410 388 -72 128 459 24 -307 64 133 -367 -359 131 -33 -404 -57 290 -88
5948 -88 -211 296 361 -102 43 483 166 -247 68 199 -363 -515 -20 -111 -535 -172 351 107 -70 486 629
5969 629 61 12 381 37 -534 -267 24 -417 -530 85 213 -202 42 547 225 -153 220 374 -195 -255 227
5990 227 86 -358 -77 284 -134 -379 55 112 -379 -258 266 101 -164 303 585 163 3 376 176 -433
6010 -433 -363 -86 -446 -668 -135 168 -107 71 634 530 111 305 445 -125 -448 -120 -157 -603 -410 132 -1
6031 -1 -223 237 511 50 -66 349 209 -306 -112 266 -47 -297 168 305 -216 -231 180 -67 -524 -194 174
6052A74l30n1O05J21m28J42L64m42n12K09Q3n67n1N67L9k56M61N20k82k07L94
6073E53o1o30j04K77l23l90L99L36k86PN63K0m23J69K94l63l36L59J37m15N9M60
6095C02j27m00K40K26m44k38L95K4l75K28N21j07k12M27J79n08k38K76k63n69
6115f63J26L71k38r0O18L36k97J07M63k58n34J22J12n55k68M61P7l72K80N78j66
6136B10k84L75J54n22j49L92j34m35K73M31k98j97M55M6n32m3L35k54l75L72L39
6157A59k48M8N68L8m10Q2K14m90m50K08L9m24R9N76P1j31M36L83l56k60K27j67
6179B12o13n1K97k17k22M73L80k42L5M42q8m89O7K23l77k88M13J94l33J29M98
6200D43j46m32J86J80n10k64M18P0l32K69N99j09k43L53J28n92k67K51k47n09
$$ plain form
6052 174 -156 -207 398 519 91 233 597 155 -357 -148 -65 -632 -683 -116 -77 -333 128 648 366 159 553
6073 553 492 -138 -242 35 -288 -678 -279 57 -229 -222 341 361 -62 107 401 38 -298 61 198 -217 -158 302
6095 302 175 -225 15 241 -203 -441 -46 -22 -397 -169 352 245 33 460 639 131 -107 169 -94 -663
6115 -663 -537 -166 -404 -494 124 460 163 270 733 475 -59 63 175 -380 -648 -187 -110 -482 -202 376 210
6136 210 -74 301 455 -67 -216 176 42 -393 -120 311 13 -184 271 317 -215 -258 77 -177 -552 -180 159
6157 159 -89 -41 527 565 155 237 451 -39 -489 -281 -242 -666 -567 9 80 -51 385 768 412 152 379 212
6179 212 -401 -452 -155 -372 -594 -121 259 17 52 494 406 -83 -16 207 -170 -458 -45 149 -184 -55 443
6200 443 297 -135 51 231 -279 -543 -125 -55 -387 -118 481 372 129 482 610 18 -249 2 -245 -754
6220g54K45M53j62j5O20K44l80L4K97l61n41J36J13m01p9N19J11k49K61M11k76
6241B26l20K65K4m82o3M08p4k66L37L60l11j75L19p4m91j0L20k09k30M10L39k35
6263F8QM43r1m86L4J98m11l22L46J81l19J49N40n3l08K69K32m44k70L22l2m57
6285d03J34M55j80k53L78K27m06j20L84j15m25J92L77k71j81M14J37m24mL52k43
6306B5l93K40K41l17o7M70M3l60J58L42k98l14K60J09l95rM13o0k98K57K93l28
6328A2k02L10ql97O7L77j35k28L34K45l60r6L16j20m45J29K95k59j87M32K22l43
6350d1M2L88j58m23J51J94l66j78M19J04l23J61M45k15l37K40J23m80j42L96l8
6371c8l11K82M62k06j96L60M4n16r7K64k20l74K95L37k15j1N02P5l91R2K36l61
$$ plain form
6220 -754 -509 -56 -218 -233 387 631 251 285 582 221 -320 -184 -71 -472 -551 -32 79 -170 91 502 226
6241 226 -94 171 195 -287 -350 58 -16 -282 55 415 104 -71 248 174 -317 -327 -7 -216 -446 -36 303 68
6263 68 76 519 428 -58 -24 174 -237 -559 -213 -32 -351 -202 338 285 -23 246 478 34 -236 86 54 -403
6285 -403 -269 186 6 -247 131 358 -48 -168 216 101 -324 -132 245 -26 -207 207 344 -80 -84 268 25
6306 25 -368 -128 113 -204 -271 199 242 -118 40 382 84 -230 30 139 -256 -265 148 88 -210 47 340 12
6328 12 -190 120 112 -285 -218 159 24 -204 130 375 15 -81 235 115 -330 -201 94 -165 -352 80 302 -41
6350 -41 1 389 231 -192 -41 153 -213 -391 28 132 -191 -30 415 200 -137 103 226 -254 -396 0 -38
6371 -38 -349 -67 395 189 -7 353 397 -119 -216 48 -172 -546 -251 86 -129 -140 362 437 46 138 374 13
6393A3l79K47J07l32L5M64J6k61K23K69l38k58K41J3l93R2M01r1j89L31K30l59
6415H2j56K45j50m50O3L23j89j19M75K73k54L8L68j97m75O2J29m09k17L81J51
6436b6k66K06M89j16k91K74J41m62j86L41p4l91K01L78k16k02L47J03m35n5L43
6457A03j24l28L10L24k17q5M24K1m43rK03l23l85K43J79k69P4M99Q1k14K34K77
6479E75l28k78J85m9m62l3L28j41k01L36K78k18n1L64ql59Q1K67k42k41K89J14
6501B06l74n1L29j17l68J85K67k47j18M18J60k94J17L75j76l74J73J21m72k05
6521d45L26m6l48K27M24j17j24M28K13l57n4L21k11m75J08J66l76j86L70J04k75
6542c27J79M42q2k00L04J80l95j26K63j25m15Q9K30k53j84L44J44k80P6L73q2
$$ plain form
6393 13 -366 -119 -12 -344 -309 155 171 -90 133 402 64 -194 47 60 -333 -241 160 69 -120 211 441 82
6415 82 -74 171 21 -429 -366 -43 -232 -351 124 397 143 181 549 352 -123 -61 68 -341 -558 -177 -26
6436 -26 -292 -86 403 287 -4 270 411 -51 -237 104 30 -361 -160 218 2 -200 147 250 -185 -240 103
6457 103 -21 -349 -39 285 68 -17 407 428 -15 -24 179 -144 -529 -286 -107 -376 -302 197 278 64 298 575
6479 575 247 -31 154 105 -357 -390 -62 -203 -404 -68 210 -8 -59 305 297 -62 19 286 44 -197 92 206
6501 206 -168 -219 110 -7 -375 -190 77 -170 -288 130 290 -4 113 488 312 -62 111 232 -240 -445
6521 -445 -119 -165 -513 -286 138 21 -103 325 538 181 127 448 237 -238 -130 36 -340 -526 -156 -52 -327
6542 -327 -148 294 212 12 316 496 101 -25 238 113 -302 -213 17 -236 -420 -76 68 -212 -136 237 155
6563A55k52K47K40k91j34L12l0l91J7K17k75l28K59J61k70O4N01P5j80K74L15
6584F86k99k99J74j24n46j21K63j61k34M03M12j18O2M80N1m07KJ84l86m11K15
6605a74R6l48PM59J5k71K38L08k92j90L12O8l50J02L83j18k75K23J19m45k24J89
6627a68j10l63J85M23l4K0N11K53k58m1J73l32n46m1K5l87j09M39K34q0L11N08
6649F13p8k16J68J4n02k22J66j21l45K05L42j32j31L66J26l56nK94j28k59K67
6670F6L09k26r1L40l8m79o8J55l36l47K87K66j77J68N98J34k14K13J95m31m32
6691a08O7j40m99m3L85nq8M46M15j49l7L36p2m51k6J33k85k88K48J53k72J5L57
6714I2n5k77J70K38k18j01L61J33k36Q5K88k11l44P1J2m30j70K73L0j69L07M61
$$ plain form
6563 155 -97 150 390 99 -35 277 247 -144 -127 90 -185 -513 -254 -93 -363 -299 202 277 97 371 686
6584 686 387 88 262 138 -408 -529 -266 -427 -661 -258 154 36 98 578 629 222 224 408 22 -389 -174
6605 -174 -78 -426 -419 40 55 -216 22 330 38 -152 160 228 -122 -20 363 245 -30 193 312 -133 -357 -168
6627 -168 -278 -641 -456 -33 -67 -47 464 717 459 418 591 259 -287 -328 -303 -690 -799 -360 -126 -206 105 613
6649 613 535 319 487 501 -1 -223 -57 -178 -523 -318 24 -108 -239 127 253 -103 -108 186 58 -201 66
6670 66 375 149 58 398 360 -119 -187 -32 -368 -715 -428 -162 -339 -171 427 561 347 560 755 324 -108
6691 -108 -41 -181 -680 -723 -338 -343 -431 15 430 281 244 580 508 57 31 164 -121 -409 -161 -8 -280 -265 92
6714 92 37 -240 -70 168 -50 -151 210 343 107 192 480 269 -75 -4 8 -422 -592 -319 -289 -458 -151 310
6736C10op2L50J07m14j81J14l02m50J04J92k34k3M82J81j71J59L82j86l00K01
6757B43P2l90j61K96n3l50J22K94k29j98L15J40k97P5L97k9k15K64K24l20k06
6778fJ95j25m63k0K30j85j58L72K90j02J10M22k0l05O7Q4l81l24J30j6l24P3L72
6801h4%j10L31K65k05q5K62n7l62MK02k42k33K33J14k80j1L12m0k84K18K71j98
6824B1q9L45J20l25M0K38k37l67J12R4l50j16L77N1j85K81M24r9j69K90N3m40
6846F9j54J58k30l67J60K45j78l6M41J56k25J20K97k01k90J71N6l45r5K69m6k60
6868b85J47K58j99j57K76R6k67N2L14m9k28K13J65k72j59J99p9l69M7K31j50j36
6890c52L28K40j78M5L49n6l30P6J17l18k54K27K8l01Q0L71l5j86K76K49k74j03
$$ plain form
6736 310 304 232 582 689 275 94 208 -94 -544 -440 -248 -482 -505 -23 158 -13 146 528 342 42 243
6757 243 315 -75 -236 60 7 -343 -221 73 -156 -354 -39 101 -196 -121 276 247 32 296 520 200 -6
6778 -6 189 64 -399 -419 -189 -374 -532 -160 130 28 138 560 540 235 302 386 5 -319 -189 -205 -529 -456 -84
6801 -84 -84 -194 137 402 197 112 374 317 -45 -41 161 -81 -314 -81 33 -247 -258 54 14 -270 -52 219 21
6824 21 -68 277 397 72 112 350 113 -254 -142 -48 -398 -514 -137 -86 -271 10 434 335 166 456 509 69
6846 69 -85 73 -157 -524 -364 -119 -297 -333 108 264 39 159 456 255 -35 136 192 -153 -248 21 -25 -285
6868 -285 -138 120 -79 -236 40 136 -131 -79 235 186 -42 171 336 64 -95 104 25 -344 -297 -66 -216 -352
6890 -352 -24 216 38 83 432 376 46 122 239 -79 -333 -106 -78 -379 -299 72 37 -149 127 376 102 -1
6912aK74l6l55M6K36k40k42K65J25l10RL34k1k53K03K60k16j45K85J1l39%K40
6935A30j85k61K23J62k36l0L26Kk46J36K23j96j88K45O6k67J6K53j07k66J53J56
6957A09k53j25K80M2k23J29L17j04j73K16J04l34j29J97j13l15J24K65j34p1L61
6978A70J72k65L4K49j87l62J13J14k96r2L45Q4k17J81L21j66k68J95M2l66j02
6999c01K96l0k17K24L08j54j23K65Ol89o2J97j87k43K45K63j39QL74K2k98L1J30
7022B26l00k67J78R4k29Q5L72K9j51J78J77k87k06J41p1l23N5K85m2r1L08K17
7044C78k36n9J80j24l73J9J64k13j11L37J90j66R5L13r8l15Q0R1l31j79K63N9
7066c6k38J61L46r6j87K40J06l50j12K34q1k75J69K86j61j03K98O3l20k3K14j69
$$ plain form
6912 -1 273 237 -118 -72 164 -76 -318 -53 72 -238 -229 105 84 -169 34 294 78 -67 218 229 -110 -110 130
6935 130 -55 -316 -93 69 -167 -197 129 131 -115 21 244 48 -140 105 171 -96 -80 173 66 -200 -47 109
6957 109 -144 -269 11 53 -170 -41 276 172 -1 215 319 -15 -144 53 -60 -375 -251 14 -120 -191 170
6978 170 342 77 111 360 173 -189 -76 38 -258 -350 -5 79 -138 43 364 198 -70 125 167 -199 -301
6999 -301 -5 -35 -252 -28 280 126 3 268 274 -115 -177 20 -167 -410 -165 98 -41 -33 341 363 65 96 226
7022 226 -74 -341 -163 -69 -298 -213 159 188 37 215 392 105 -101 40 -31 -354 -299 -14 -56 -147 161 378
7044 378 142 83 263 139 -234 -215 -51 -264 -375 -38 152 -14 81 394 296 -19 61 152 -179 -358 -95 -36
7066 -36 -274 -113 233 137 -50 190 296 -54 -166 68 -13 -288 -119 167 6 -97 201 264 -56 -79 135 -34
7088c4k72J70K15j91k4L30P5k38Q8K05k29k75J57L5k91j9K92qj52K12K53j68j16
7111A5K21pl12k4J99j51k12J71J71k09m0K80Qk28J13K33j81j53K27Q5k70j9K50
7134A67j21k63J24J73k30j08K88N6k31J25K85j00k01K01J23l16r9K23q3l10R8
7155a99K30j73j21L10J35k10M6L01j12k45J44J29l00j45K09j8k66O7K71j19j40
7176b06K46J68j96j2K57m6k42Q3J45k28j69J86J0k50J6K37n2j44K11K17j62j7
7198E2K47j2k62K6J22k26k28J34O9k27J2L17K8j30K06K39j71j35J89j7l34m3J86
7221D2j53k03J87J87j98l7L05Qk27J07K26j67j63K39J02k70m7K28j32l01J06J34
7243b7k27q8K90J13j50J64L08p3j67J35K7l53j81J31j20k64J52K55m1RL24J55
$$ plain form
7088 -34 -306 -136 79 -112 -136 194 269 31 119 324 95 -180 -23 12 -279 -298 -6 -14 -166 46 299 131 15
7111 15 236 229 -83 -107 92 -59 -271 -100 71 -138 -178 102 110 -118 -5 228 47 -106 121 206 -64 -83 167
7134 167 46 -217 -93 80 -150 -258 30 86 -145 -20 265 165 -36 165 288 -28 -127 96 13 -297 -199
7155 -199 31 -142 -263 47 182 -28 18 319 207 -38 106 235 -65 -210 -1 -19 -285 -218 53 -66 -206
7176 -206 40 208 12 0 257 211 -31 52 197 -31 -200 -14 -4 -254 -238 -1 -53 -197 14 231 69 52
7198 52 299 287 25 51 173 -53 -281 -147 -78 -305 -293 24 52 -78 128 367 196 61 250 233 -101 -144 42
7221 42 -111 -314 -127 60 -138 -175 130 138 -89 18 244 77 -86 153 255 -15 -62 166 34 -267 -161 -27
7243 -27 -254 -342 -52 61 -89 75 383 310 143 278 305 -48 -229 -98 -218 -482 -330 -75 -116 -107 217 372
7265C72j90J6J61j77k83L8P5k31r3K51N1j55J00K34j10j45J42J04k17k0K55j3
7287A65j84J37J62k32j75J14k5l01qK47l9q8K87K77j19oK38p7l49o6O2k75k43
7310d98J99J49j68J31L74N5j34J70J48k65k02J31m7l03K9K00p6j24K00J64j91
7331e8l5K17k5k15J08K03j18r6K01P1k41n6J31j54k37P8J22j29k1L11J27r5J24
7354B13K24j48k32Q3l9l03j22J58l3j65J79K69m6m2K62P7k48j0J50j52k48J03
7376g0J17k08q9K48K0k09R4K32j21j39K17J24k09PK30o2k34P4J12k42j71J68M1
7399g0k08Q4K79j0r8K25J39j85q1J54j02k63pJ12j61j30K01J23j31O3K63k2j54
7422B1J40J11j99j25J33j8k34PJ68j07j32J68J23j49KK26K0j77J01J52j50j37
$$ plain form
7265 372 182 198 359 182 -101 -63 12 -219 -312 -61 -10 -165 -65 169 59 -86 56 160 -57 -77 178 165
7287 165 -19 118 280 48 -127 -13 -38 -339 -347 -100 -139 -227 60 337 218 212 450 373 24 -42 20 -255 -498
7310 -498 -299 -150 -318 -187 187 242 108 278 426 161 -41 90 43 -260 -231 -31 -107 -231 -31 133 -58
7331 -58 -93 124 99 -116 -8 195 77 -19 182 253 12 -44 87 -67 -304 -226 -104 -233 -254 57 184 89 213
7354 213 437 289 57 140 101 -202 -324 -166 -199 -364 -185 84 38 -4 258 335 87 77 227 75 -173 -70
7376 -70 47 -161 -250 -2 18 -191 -97 135 14 -125 92 216 7 14 244 182 -52 22 134 -108 -279 -111 -70
7399 -70 -278 -194 85 75 -23 202 341 156 75 229 127 -136 -143 -31 -192 -322 -121 2 -129 -66 197 175 21
7422 21 161 272 73 -52 81 63 -171 -164 4 -103 -235 -67 56 -93 -91 135 155 -22 79 231 81 -56
7444e6J52J8k58k0J58q2j64J44J72j31j8K63L8j86O3J69j52k09J31L0k55m4K12
7467b5m5j68J60K17r3p4K25M8k25J2J58j29k08R6Q4j98n4K10K7j64J05K01j03
7490E7j19J91O9k11j6J62q0k04J01J00j61q9J87M0j59P1J97n9j22J57R2j73p2
7513d1J54l3k17M2J39j41j04J69Q4j74P2J96k9j45J16J25j93j06J55rk31J4J76
7536A9r1j37J88J48j54k9K53k6k04O4J41k00j35J55M4k07L0K19p0j33J52J39j61
7559Eq4J82j6j93N2J61j10j22J70Q0j78l0J63o0j72O8J45j17o5J96Q4j46L5J39
7583A87r5j77P3O0j91p0J85K2j18J28J91o7r6J29K9k34p5J35q7j72J33J65r1k7
7607f3K27L6j83PJ36j53j97J22Q4j76LK51L5j53J01J47j71j75J22K2k25PK16j1
$$ plain form
7444 -56 96 114 -144 -164 -6 -88 -252 -108 64 -67 -85 178 216 30 93 262 110 -99 32 62 -193 -237 -25
7467 -25 -70 -238 -78 139 46 -28 197 245 20 32 190 61 -147 -51 33 -165 -219 -9 18 -146 -41 160 57
7490 57 -62 129 198 -13 -29 133 53 -151 -50 50 -111 -200 -13 27 -132 -61 136 77 -45 112 204 31 -41
7513 -41 113 80 -137 -95 44 -97 -201 -32 52 -122 -50 146 117 -28 88 213 20 -86 69 60 -171 -157 19
7536 19 -72 -209 -21 127 -27 -56 197 171 -33 31 172 -28 -163 -8 36 -171 -141 78 8 -125 27 166 5
7559 5 -79 103 87 -106 -54 107 -3 -125 45 125 -53 -83 80 20 -152 -84 61 -56 -121 75 159 13 48 187
7583 187 92 -85 -12 48 -143 -213 -28 -6 -124 4 195 128 32 161 190 -44 -119 16 -71 -243 -110 55 -36 -63
7607 -63 164 200 17 24 160 7 -190 -68 16 -160 -157 94 129 -24 77 224 53 -122 0 22 -203 -196 20 9
7631Ij07J61J78j52r0J39n4k35j4J44r9r9J91J62j10J0K05n9j94LP0j90j05J41
7655i5P3j19R9K24k8j15R4N6j87j34J01j6j82P4K00m0n5J83R1j73l6J24r9k19
7679a79O6J13j21n7K25O4j32M9J79j04j87R1O4j81o3K03Jj40J05J92j13j31J44
7702H8N1k35l2J75o0j52J37J67j19o2J87J6k01JJ43j26j61J27R4j56NK10J6j49
7726c6J03J32j36j22J17Rj86j5J54n2j27J21J41j06m3J65K2j79L2J22j16j37J21
7749a6O1j57j9J84pj53J10J43j42r2J51K7j78RJ88q3j31J28J28j76o0J62l7j76
7773a36L9J68j10r6J84J05j47PJ81o4j99O4R0j98j02J60M3j34P0K28l7j17J39
7796A38Q4j96q0J13o2k01O7J47q0p2J84Q7j38J5J40o6j62P0R2j38n8J69K4j48
$$ plain form
7631 9 -98 63 241 89 -1 138 84 -151 -165 -21 -120 -219 -28 134 24 34 239 180 -14 -11 59 -131 -236 -95
7655 -95 -22 -141 -42 182 154 39 133 189 2 -132 -31 -47 -229 -155 45 5 -50 133 224 51 15 139 40 -179
7679 -179 -113 0 -121 -178 47 111 -21 28 207 103 -84 7 71 -110 -173 30 31 -109 -4 188 75 -56 88
7702 88 139 -96 -128 47 -13 -165 -28 139 20 -42 145 161 -40 -39 104 -22 -183 -56 38 -118 -113 97 113 -36
7726 -36 67 199 63 -59 58 67 -119 -134 20 -32 -159 -38 103 -3 -46 119 141 -38 -6 116 0 -137 -16
7749 -16 45 -112 -131 53 46 -107 3 146 4 -88 63 90 -88 -79 109 26 -105 23 151 -25 -85 77 40 -136
7773 -136 -97 71 -39 -135 49 154 7 14 195 131 -68 -4 86 -112 -214 -54 -11 -145 -75 153 116 -1 138
7796 138 222 26 -54 59 -3 -204 -137 10 -70 -142 42 129 -9 6 146 80 -82 -12 80 -58 -116 53 77 -71
7820g1M6J36r7j30J00P3j55k7J81Oj23J02J48j15j10J16Qk09k2J52o9j24J36J59
7844A11j19j8J95J4j96L5J18j46j51J25P0j78j3K11k5j46J25J43j31j04J86J7
7866A23k02J9J54n5j71J18R2j73l7J74j1j53O8J69r2r0J53N4j65k0J38p4j49P7
7890e3J08j35n5J61M8j44N2J51p0j13R8R7j65n2J56k7j77O2J20j13j04J54O4j27
7914f4K0J76k7j40J05J05j87r7J52j3j93L0J68o6j03J76J17j54k1J71l9k10O8
7937b6J23j53r5J67N9j77L1J75o7j38J16R2j68k9J65K1j57N6J50j01j38J34K9
7960F9j71m1J63k8j31J20J46q6n9J57J7j83rJ12j03j41J06R4j24j2J78K3j28N6
7984B5J32j16j18J12K5j67MJ61m1j28J17J21j54o1J41J3j71K8J62p5r9J36J04
$$ plain form
7820 -71 -25 111 14 -116 -16 57 -98 -125 56 62 -61 41 189 74 -36 80 88 -121 -143 9 -60 -184 -48 111
7844 111 -8 -26 169 183 -13 22 140 -6 -157 -32 38 -140 -153 58 33 -113 12 155 24 -80 106 123
7866 123 -79 -60 94 39 -132 -14 78 -95 -132 42 31 -122 -54 115 23 -67 86 140 -25 -45 93 19 -130 -53
7890 -53 55 -80 -135 26 74 -70 -18 133 63 -50 48 145 -20 -72 84 57 -120 -58 62 -51 -155 -1 63 -64
7914 -64 -44 132 105 -35 70 175 -12 -109 43 30 -163 -133 35 -31 -134 42 159 5 -16 155 116 -94 -26
7937 -26 97 -56 -151 16 75 -102 -71 104 37 -101 15 107 -61 -90 75 96 -61 -5 145 44 -94 40 69
7960 69 -102 -143 20 -8 -139 -19 127 41 -18 139 156 -27 -36 76 -27 -168 -62 32 -92 -104 74 97 -31 25
7984 25 157 41 -77 35 60 -107 -103 58 17 -111 6 127 -27 -88 53 66 -105 -77 85 10 -89 47 151
8007A51j68l6J49l4j95O1J38j32q1J68P9j47L8J77p2j49Q8Q2j76p2J47%j40N6
8031f8J79q1r7J41Q0j82n0J65m4j52P9J04j02o6J51M5j54J9J31q1j45J14P5j21
8055f0l2J73Pj38N3J24j16j11J02M9j54j7J67l3j16J08J33j14p3J37%j69J5J36
8079G1q3j29J29R5j32k9J80j8j61P5J27j30j19J49L5j48J8J79o0j47J23R8j42
8102a9q1J61nj55K8J56q6r6J39P2j40l8J54l5j67O9J17j08q8J46N3j49J9J50n7
8127D0j24R0Q4j33o4J56K0j62M8J48r6r9J25O3j47k6J54n0j39Q6J34j25p2J53
8151F4L2j68K3J53r2j31J21R9j59l5J65jj53O4J39j15j03J62L3j66LJ58n9j75
8175a41J18J03j27p2J66L4j56M6J50q1j25J19P1j69l4J45
$$ plain form
8007 151 -17 -53 96 62 -133 -72 66 -66 -147 21 100 -47 -9 168 96 -53 35 117 -59 -131 16 16 -124 -68
8031 -68 111 30 -67 74 154 -28 -78 87 43 -109 -30 74 -28 -94 57 102 -52 -33 98 17 -128 -14 61 -60
8055 -60 -92 81 88 -50 3 127 11 -100 2 51 -103 -120 47 14 -102 6 139 25 -48 89 89 -80 -65 71
8079 71 -12 -141 -12 83 -49 -78 102 84 -77 -2 125 -5 -124 25 60 -88 -70 109 49 -98 25 123 -19
8102 -19 -100 61 56 -99 -71 85 -1 -97 42 114 -26 -64 90 55 -112 -43 74 -34 -122 24 77 -72 -53 97 40
8127 40 -84 6 90 -43 -107 49 69 -93 -45 103 7 -92 33 96 -51 -77 77 27 -112 -26 108 -17 -89 64
8151 64 96 -72 -49 104 12 -119 2 101 -58 -93 72 71 -82 -18 121 6 -97 65 98 -68 -65 93 34 -141
8175 -141 -23 80 -47 -119 47 81 -75 -29 121 40 -85 34 105 -64 -98 47
8191D7
$$ Imaginary data points
##PAGE= N=2
##DATA TABLE= (X++(I..I)), XYDATA
0@%%%%%%%JrJ6j6K4l2L8m6N4o2P2q8J04j21J45j69J94k26K58k94L34l78M27m83
31b57N45o11O83p64Q53r50J055j171J300j442J598j767J955k167K404k666K965
48A563l309L705m167M716n383O212p276Q694j0698J3770j9127L1135j04004k657
62h6826J22174r4157P6082J61398j8901j26357O2376L5510j56397r7755R7936
73b4917j0730j18694N6171J50138m3626o2331J17508N9526j34842l3622J07001
84F1582l7257j24621O8906J11838p3526n0369J24252K6438j37279j4364Q7480
95D3080p9605j19757P8741Q5308p8958K880J62226L4746r5732M5449Q8989j09387
107E7980j25986N3780P285j41274j5463J32935K632o6569J07002J22732o8904
$$ plain form
0 0 0 0 0 0 0 0 0 1 -8 8 -8 16 -16 22 -24 30 -32 40 -48 56 -65 80 -89 105 -121 137 -157 177 -201 226 -257
31 -257 288 -323 360 -404 449 -501 554 -617 683 -759 839 -928 1027 -1140 1264 -1402 1563
48 1563 -1746 1959 -2208 2508 -2875 3337 -3939 4755 -5943 7827 -11300 19835 -84169 -86826
62 -86826 35348 -58809 17273 178671 159770 33413 95789 131299 -25098 -122853 -24917
73 -24917 -35647 -154341 -98170 51968 8342 -53989 63519 123045 -11797 -45419 61582
84 61582 24325 -100296 -31390 80448 6922 -43447 80805 107243 -30036 -44400 43080
95 43080 -36525 -156282 -77541 7767 -71191 -68311 93915 128661 32929 78378 167367 57980
107 57980 -68006 -14226 -6941 -148215 -163678 -30743 -28111 -94680 12322 135054 66150
118F6150m8907J00282m406j46552j0822Q4190p2051r5526R1993P5621r1218j4204
130f5450J25297n146j13368M1264R2675p8235o8846J05927M7498j01677M721J10285
142I4945m3071j12712M8173N4606j09658n4715J06950K0541q9608N2119J28104
153I5674l5970o7434Q7619M4717j20296m5550Q0063l7983j16975M1203Q8145o2286
165d9073m0740J14001M6087q8426J4260J01645m3258r4679N8618N5744r6751m2292
177f4864R5251m46j04042K6293Q8398n8891o8927Q5931N1994q3417N25J10106
189G7911j1357q6876M8233O5249q9350o6800P3719M732j06925J0666R9645l0291
201a1444o2888Q6234P3053p5192k3844R3406r862j05111K0042O9880o9691o7756
$$ plain form
118 66150 17243 117525 113119 -33433 -44255 39935 -32116 -127642 -35649 39972 -51246 -65450
130 -65450 59847 54701 -58667 -17403 75272 -2963 -71809 34118 81616 -20061 -15340 94945
142 94945 51874 -60838 -12665 41941 -67717 -122432 -15482 5059 -84549 -32430 95674
153 95674 59704 -7730 79889 124606 4310 -41240 38823 840 -116135 -74932 13213 -49073
165 -49073 -89813 24188 70275 -18151 -3891 97754 54496 -40183 18435 74179 -22572 -64864
177 -64864 30387 29941 -74101 -47808 40590 -18301 -87228 -1297 50697 -32720 -32195 77911
189 77911 66554 -20322 27911 93160 3810 -62990 10729 15461 -91464 -80798 18847 -11444
201 -11444 -74332 11902 84955 9763 -14081 79325 69463 -35648 -15606 54274 -15417 -83173
213h3173P8617L6743q7864O10R8536k1763q1002N7030O9834p2486l8791R2256
225D8547J5836r1721J4987Q1332n2661q1076N6493L8442q8691k1674R2833O65
237A3312p1084N2434Q6487n0215m7309P5565J8147r9467j4437O9910m1093q2448
249i0198N2515O3213o1269k1590R4530J7661p6745K2439P4020n0659o7851N7911
261A3977L2805q2071j4907Q2359j2819p6318M0406O5252o0727m5633P5218K2353
273C9895p8513R842Q4275k6398o4847N4599M8451p4867l4641O9541p536q5108
285f5307K1864P1198m3198m6094P6404M2995o8612k825Q0059k1549q0213L2432
297b846M9597o8683m4508P0628J6479p2264J6901P9751k8120n6288N6700M2538
$$ plain form
213 -83173 -4556 32187 -55677 -55067 43469 21706 -59296 -2266 67568 -4918 -43709 48547
225 48547 64383 -27338 -12351 68981 16320 -64756 -8263 30179 -58512 -80186 12647 13312
237 13312 -57772 -5338 81149 30934 -16375 59190 77337 -22130 -36567 33343 -7750 -90198
249 -90198 -37683 25530 -35739 -57329 37201 54862 -21883 556 74576 23917 -43934 13977
261 13977 46782 -35289 -50196 32163 19344 -56974 -16568 48684 -12043 -57676 17542 39895
273 39895 -38618 -28776 55499 29101 -35746 18853 67304 -7563 -42204 27337 19801 -65307
285 -65307 -43443 27755 -15443 -61537 14867 57862 -10750 -13575 66484 44935 -35278 -2846
297 -2846 46751 -21932 -66440 4188 20667 -51597 -34696 45055 16935 -39353 17347 59885
309E9885p0285k3015P1106p947p5311K7138O2915m8775m6947O4079K6315p2132
321c2974l206P2090j9981o3407M3584N3084n5133k8854O8843Q194p2021J1715
333a8066O1276m0422n6755N1557L5105o4104j1414P4109l849o2978L2899N8199
345E5557m8895m3044N7935J6554p1398r49O5107k4099n7195M5774M6984n5153
357a2822k2695O7673L568o8128J7283N9621m0388n0231N3475L0940o3732r408
369c4844O7994j0857o2182L2437N1588m9478l5712O0130J4848o5312O853O3418
381C8883k6970n3705M5100L9051n8073k0903O3558p49o3513K1236N6669l8264
393B320m2272N2938K5427o0574o008O0541j6027n7054L2989M4979m7517k7790
$$ plain form
309 59885 -10400 -33415 37691 29744 -45567 -18429 44486 -4289 -51236 12843 39158 -32974
321 -32974 -36180 35910 15929 -47478 -3894 49190 -5943 -34797 34046 42240 -29781 -18066
333 -18066 43210 2788 -53967 -2410 32695 -31409 -42823 31286 27437 -35541 -2642 55557
345 55557 6662 -36382 21553 38107 -33291 -34240 30867 6768 -50427 -4653 42331 -12822
357 -12822 -35517 32156 35724 -32404 -15121 44500 4112 -46119 7356 38296 -25436 -34844
369 -34844 33150 22293 -39889 -7452 44136 -5342 -41054 19076 33924 -31388 -24535 38883
381 38883 11913 -41792 3308 42359 -15714 -36617 26941 26192 -37321 -16085 40584 2320
393 2320 -39952 12986 38413 -22161 -28169 32372 16345 -40709 -7720 37259 -10258 -38048
405c8048N9150J1610n9629J0416N7624k9128m9729M1905L1835n6339j7238N8998
417B1427k956n6496K4474N2419l6687l5207N2210K0195n8438k387N5998k0611
429A3941n4415L3641L9549m9089k4381N8023Q215n6634J4776N6318k8795m3329
441c2180M4635K8666n5285j3244N5334r857n6759K4361M5426m1078l1909N3449
453A1559J7856n4626N138N8054j9519m8406L6462L5830n0178k3239N2178M45n7301
466c5747J3735M9136l1117l7823M6191K6916m9023m153N6731q965m9934K6612
478B559L9896m3514l2027M5673Q617n6116L455N1359j9773m0551M0067L6612m1475
491e218j3126N3047n06n2872J3819M0643l7134l8984M0495J8631n0382k249N4689
$$ plain form
405 -38048 21102 32712 -26917 -16501 41123 11995 -37734 4171 36006 -20333 -37571 21427
417 21427 18471 -38025 -13551 38868 2181 -33026 19184 39379 -19059 -21446 34552 13941
429 13941 -40474 -6833 32716 -16373 -40754 17269 25484 -31150 -16374 39944 11149 -32180
441 -32180 12455 41121 -14164 -27408 27926 18069 -38690 -14329 31097 -9981 -41890 11559
453 11559 29415 -25211 -20073 37981 18462 -29944 6518 42348 -7830 -31069 21109 21554 -35747
466 -35747 -22012 27124 -3993 -41816 4375 31291 -17732 -21885 34846 25881 -24053 2559
478 2559 42455 -1059 -33086 12587 21204 -34912 -31457 19902 129 -40422 -355 36257 -5218
491 -5218 -18344 34703 34197 -18675 -4856 35787 -1347 -40331 164 18795 -31587 -33836 20853
504B0853r204m3641L1667M0841l8928k4235M8024P603n2919N879M5844k6428m2495
517c7139L5091K5992m7613j2767N1422k128m6210K4265M7251l0011k8525M5955
529B5583J6860n2415n659M3923k1377n0237K5572L2999l9581j7227N3252J1992
541B3685m2300J6442M8607k5243l8705L3742J8793n1586j4624M4827q242m6357
553d0961K2827M1769l0575k4803M5041J5731m5119K665M6576j5851l9357K9901
565G844K9440m1293j9934M1074k531n0593R071M0015k5506k9671M2999K8738l5771
578f118j62N0035p166m5799J5705K6869m2945l2657L5757Q141m3470R602N1295
591A9087j0383k9708L7031L0199m0799j7644L9827n920m9928J1187L8291k7322
$$ plain form
504 20853 11649 -31992 -325 40516 1588 -22647 25377 32980 -19939 -14060 31784 5356 -37139
517 -37139 -2048 23944 -23669 -36436 14986 12858 -33352 -9087 38164 8153 -20372 25583
529 25583 42443 -9972 -15631 28292 6915 -43322 -17750 15249 -24332 -41559 11693 23685
541 23685 -18615 -2173 46434 21191 -17514 16228 35021 -16565 -31189 13638 5396 -40961
553 -40961 -18134 23635 -6940 -31743 13298 29029 -16090 -13425 33151 17300 -22057 7844
565 7844 37284 -4009 -23943 17131 14600 -35993 -26922 13093 -12413 -42084 915 29653 -6118
578 -6118 -6280 43755 36589 -9210 6495 33364 -9581 -42238 -6481 1660 -41810 -32208 19087
591 19087 8704 -21004 16027 46226 5427 -12217 27610 21690 -28238 -17051 21240 -6082
603f082k9152L9525J9939m2600m331M3166j2184m1398K4983L5193l0649j5797
615a9387M6991J0976m3350M510L5907k9172m4815K2907J8430m1476q549N0768
627C740Q680k9267K7422M4171k4892k9478K8591L157n3867j2583L3286j5663l5116
640e1819L1440L8959k3464q958M5853P085m3620K804L1625k7202l6354K8881K2390
653A7620l4269m519M4302k547l9602J4031K7965l3984k8143L4924J4290l4393
665b4325R801M9697n910l0548K5779K1804m4370k8456K6356p786m5967J0792M3241
678A08j0641j4481M6368K9851l1974o285L3381j8703n1412O315K1200l4777k0959
691e2009M2514J9159k8792J2783M4952j3065l4797K0984J7438m0461j7600L6262
$$ plain form
603 -6082 -35234 4291 24230 -18370 -22701 20465 8281 -33117 -8134 27059 -3590 -19387
615 -19387 27604 38580 -4770 -260 35647 6475 -38340 -15433 2997 -38479 -47028 3740
627 3740 12420 -16847 10575 54746 29854 376 28967 32124 -21743 -34326 -1040 -16703 -51819
640 -51819 -20379 18580 -4884 -13842 32011 39096 -4524 -1720 29905 2703 -33651 -4770 17620
653 17620 -16649 -21168 23134 20587 -19015 -4984 22981 -11003 -39146 -4222 10068 -24325
665 -24325 -14524 35173 29263 -1285 24494 46298 1928 -26528 -172 -7958 -53925 -43133 108
678 108 -10533 -25014 21354 51205 19231 12946 46327 27624 -23788 -17473 3727 -31050 -52009
691 -52009 -9495 9664 -19128 -6345 38607 25542 -9255 11729 29167 -11294 -28894 7368
703G368J833l3963J7149L8263k0873k6702K8068R763m3517r354L4962p666l0018
716c4687K8009L8240j9462j2099L7163M593m4553o256K2739k7394l7094K3773
728b7028K4241k4629J653M8935R100k8440J5875K8347l1306l3720K0877M380m1500
741c3215l238L8731m665k5752K7794L1063k6669j5960L2359J043l9566N017L2897
754A9839j7579k5345L0341K0611l3370r145L2915q746l9653J1877K8311k3713
766a3657j7370L8137J8078k8610N341L6534j3940l5690J4969J5221l7223j8727
778c6937L2149L505l0627J5605L9132j2863k0659K9862J6018l5490j0005K9457
790A9147r771l5520J4164K6576k3598j7060L2128R728l2434K878L2618j2592k7017
$$ plain form
703 7368 9201 -24762 -7613 30650 9777 -16925 11143 20906 -22611 -31965 2997 -4669 -34687
716 -34687 -6678 31562 12100 1 37164 41757 -2796 -9052 13687 -13707 -50801 -27028
728 -27028 -2787 -27416 -25763 23172 32272 3832 19707 48054 16748 -16972 3905 8285 -33215
741 -33215 -36453 2278 -2387 -28139 -345 30718 4049 -11911 20448 21491 -18075 -13058 19839
754 19839 2260 -23085 7256 27867 -5503 -14648 18267 9521 -30132 -18255 10056 -13657
766 -13657 -31027 7110 25188 -3422 1919 38453 24513 -11177 3792 19013 -18210 -36937
778 -36937 -4788 -1283 -31910 -16305 22827 9964 -10695 19167 35185 -305 -10310 19147
790 19147 9376 -26144 -11980 14596 -9002 -26062 6066 15794 -16640 -13762 18856 6264 -20753
803b0753K3867K2747k7140r998L2952m99l5599O098K5153k3555k6026K5949J5304
816H500k8332R81L8155k088k6637J8910K4114k8165k0521K6038J625l6497K886
829b1031L1640j3311k4016K6741K1823k7725q226L2787k055l2940J1296K7645
841B2628k1093k0478K8373J1465l2549k588K9843j1942l1097J7744K2951k4511
853a1254j1000L5079Q572k8416Q322L0031j7941k8537J8511J1248l3443r804L0590
866A958j326k5965J8029L0647j7005j5755K7921P992l3555l532K6266j3358k8600
879b6283J8717K1855k3241r789L1374L902k9788O410K6105j7661k3072K3298J5098
892A6925k6559k971L1771l738k8448J2798K1290k5264j9940K5012O622k9407M352
$$ plain form
803 -20753 3114 25861 -1279 -11277 21675 21176 -14423 -8325 16828 -6727 -32753 -6804 8500
816 8500 -19832 -18851 19304 17216 -9421 9489 33603 5438 -15083 10955 12580 -23917 -21031
829 -21031 10609 -2702 -26718 23 21846 -5879 -14105 18682 16627 -16313 -5017 22628
841 22628 1535 -18943 9430 20895 -11654 -14242 15601 3659 -27438 -9694 13257 -11254
853 -11254 -22254 12825 21397 -7019 1303 31334 13393 -15144 3367 14615 -18828 -28632 1958
866 1958 632 -25333 -7304 23343 6338 -9417 18504 26496 -7059 -10591 15675 2317 -26283
879 -26283 -7566 14289 -8952 -18741 12633 16535 -13253 -6843 19262 1601 -21471 1827 16925
892 16925 -9634 -12605 19166 15428 -13020 -222 21068 -4196 -24136 876 7498 -21909 -17557
905a7557L2920p341k1341K2810K0069k6748j2731K5362m061l3618O327K5106j7406
918h209j8106K8415J6321k5279m13L0847p388k9541J2889J9406k5317j6376K7182
931D431O546k7654N746K9534j1836k3097K0057J5322k7398r093K7882j354k7057
944a7971J2104K6166j7053j7561K4279R366k9466l667K5729r242k5923J6274K1384
957A4419j9922r837K8651N468k6744M763K4078j6059k3742J8357J2794k6047n677
970a9498K8921p65k4343J3383K4128j8457j7105K3051P001k8748j009K6105r313
983C351k3230J8222J9391k2078r783K6946J356k8202O263K4111j6164k0245K2313
996B251J3594k5098l215K8242m310k5844J2404K0236k1194j5700K3977O171k6424
$$ plain form
905 -17557 15363 8022 -13319 9491 29560 2812 -9919 15443 11382 -22236 -15909 9197 -8209
918 -8209 -26315 2100 18421 -6858 -7271 23576 16188 -13353 -464 18942 -6375 -22751 4431
931 4431 10977 -16677 -10931 18603 6767 -16330 3727 19049 -8349 -17442 10440 9086 -17971
944 -17971 -5867 20299 3246 -14315 9964 19330 -10136 -13803 11926 2684 -23239 -6965 14419
957 14419 -5503 -15340 13311 18779 -7965 -3202 20876 4817 -18925 -568 12226 -13821 -19498
970 -19498 9423 8658 -15685 -2302 21826 3369 -13736 9315 16316 -12432 -13441 12664 3351
983 3351 -19879 -1657 17734 -4344 -14127 12819 14175 -14027 -7764 16347 183 -20062 2251
996 2251 15845 -9253 -12468 15774 11464 -14380 -1976 18260 -2934 -18634 5343 11514 -14910
1009a4910L244K7067r671k1254J8847J6479k3930r559K5081r40k7055P769K3344
1022A4512j5205j7182K2536J1895k4244k486K5426o406k4595J2549J8361k0216
1034e055j2566K4412N615k4468M508K4985j1229k0803J7421J3618k3927q108K4450
1047H853j220k4296R960K2596j5149j5178K2198R105k4970j528K3961q427k3400
1060a7495J4381J7628k0473j0390K5095L759k4769N524K3637j3178j9714J8766
1072B771J2552k3577n146K5234k808k3620J1203K0293j7930j4888K1901O607k5135
1085a2543Q53K4690q296k0691J6693J7140k0451r246K3618Q58k5337N198K0900
1098A3386j4345j7820J9376J1711k1727k287K5152l332k1839J1731J8233j8517
$$ plain form
1009 -14910 -11666 15401 5730 -15524 3323 19802 -4128 -13687 11394 10454 -16601 -8832 14512
1022 14512 -693 -17875 4661 16556 -7688 -10174 15252 8846 -15749 -3200 15161 -5055
1034 -5055 -17621 6791 12406 -12062 -7554 17431 6202 -14601 2820 16438 -7489 -15597 8853
1047 8853 7633 -16663 -6703 15893 744 -14434 7764 16869 -8101 -9629 14332 5905 -17495
1060 -17495 -3114 14514 -5959 -16349 8746 12505 -12264 -6740 16897 3719 -15995 2771
1072 2771 15323 -8254 -13400 11834 9026 -14594 -3391 16902 -1028 -15916 5985 12592 -12543
1085 -12543 -11690 13000 4704 -15987 706 17846 -2605 -11851 11767 12625 -12712 -7514 13386
1098 13386 -959 -18779 597 12308 -9419 -11706 13446 10114 -11725 6 18239 -278
1110b78j3879K0638M690k4240J631K2861q914j8920J6487J5123j9739p232K2928
1123A1156J9k2978P199K0042j4438j5867J9198R155k2724k252K2881n872k1612
1136a6093J2539J7492j7785j0636K2737M918k2480M009K2041j1267j9189J5847
1148B133J1507k2383o596K2758j768k1902J0404K0903j4332j3270K1120P989k3182
1161f619j089K1698q365k1495J2871J5230j8857r145K2461L011k1672N815K1195
1174A5039j1596j6634J7327J0994k1044m453K1995l232k1589R225J7289j6102
1186b781j3298J9274O394k1017J574K2266o412j7374J4588J4295j8649q774J9606
1199I692n62k2885M746J8713j2316j4724J8562J1235j8931j710K2276l800k0447
$$ plain form
1110 -278 -14157 6481 11171 -13069 -11438 11423 2509 -16411 76 15199 -4540 -11772 11156
1123 11156 11175 -11803 -4604 15438 1000 -14867 4331 13486 -9238 -11490 11391 5519 -16093
1136 -16093 -3554 13938 -3847 -14483 8254 13172 -9308 -5299 16742 5475 -13714 2133
1148 2133 13640 -8743 -15339 7419 5651 -16251 -5847 15056 724 -12546 8574 16563 -6619
1161 -6619 -7708 13990 5625 -15870 -2999 12231 -6626 -15771 6690 9701 -11971 -6156 15039
1174 15039 3443 -13191 4136 15130 -5914 -10367 11628 8396 -13193 -3968 13321 -2781
1186 -2781 -16079 3195 9589 -11428 -9854 12412 6000 -11374 3214 17509 -1140 -9914 9692
1199 9692 9130 -13755 -9009 9704 -2612 -17336 1226 12461 -6470 -8180 14096 10296 -10151
1212a0151R786J5415j7213j2147J9166M389k1197K864K1067q895j7294J5205J2523
1225A3518j9458o311K1572l06k0512Q364J9262j3359j4181J7572O843k2317k694
1238a2007J9798o514j9021J3061J6722j4889p275K1879L888k0980K998J7807j2691
1251B776j8616J3650J0013j9183l984K2301K74j7718R907J7863j3874j3225J6381
$$ plain form
1212 -10151 -365 15050 -2163 -14310 4856 9245 -11952 -9088 11979 3084 -14210 995 13518
1225 13518 -5940 -12251 9321 9015 -11497 -3133 16129 2770 -11411 6161 13004 -9313 -12007
1238 -12007 7791 1277 -17744 -4683 12039 -2850 -10125 11754 15642 -5338 -2340 15467 2776
1251 2776 -15840 -2190 7823 -11360 -15344 6957 7231 -10487 -580 17283 3409 -9816 6565
$$ [...]
8191D9
##END NTUPLES=NMR FID
##END=
