##TITLE=1H_LY-acetophenone
 CDCl3, 8 sc, 
 5.6.2019
##JCAMPDX= 6.0         $$ Bruker NMR JCAMP-DX V2.0
##DATA TYPE= NMR FID
##DATA CLASS= NTUPLES
##ORIGIN= UXNMR, Bruker Analytische Messtechnik GmbH
##OWNER= root
$$ XWIN-NMR		Version 3.5
$$ Wed Jun  5 13:45:47 2019 Russian Standard Time (UT+4h)  she@DPX200
##.OBSERVE FREQUENCY= 200.13155
##.OBSERVE NUCLEUS= ^1H
##.DELAY= (6, 6)
##.ACQUISITION MODE= SIMULTANEOUS
##.ACQUISITION SCHEME= undefined
##.AVERAGES= 8
##.DIGITISER RES= 18
##SPECTROMETER/DATA SYSTEM= spect
##.PULSE SEQUENCE= zg30
##.SOLVENT NAME= CDCl3
##.SHIFT REFERENCE= (INTERNAL, CDCl3, 0, 15.7039)
##AUDIT TRAIL= $$ (NUMBER, WHEN, WHO, WHERE, WHAT)
$$ ##TITLE= Audit trail, XWIN-NMR		Version 3.5
$$ ##JCAMPDX= 5.01
$$ ##ORIGIN= Bruker BioSpin GmbH
$$ ##OWNER= she
$$ F:/spectra/data/she/nmr/H-F/1/audita.txt
$$ ##AUDIT TRAIL=  $$ (NUMBER, WHEN, WHO, WHERE, WHAT)
(   1,<2019-06-05 13:44:23.15 +0400>,<she>,<DPX200>,
      <created by zg, POWCHK disabled, PULCHK disabled
       configuration hash MD5:
       00 E9 B6 7A A2 85 ED C7 34 08 36 98 17 FE 4E 26
       data hash MD5: 16K
       40 1C C1 9C 26 BC D4 1F 80 47 27 40 F5 47 99 17>)
$$ ##END=
$$ 
$$ hash MD5
$$ 7B 6E AB FB 0B 28 13 46 E7 00 86 90 C8 D9 93 3D
##$RELAX= 
##$RELAX= 
##$RELAX= 
##$RELAX= 
##$RELAX= 
##$RELAX= 
$$ Bruker specific parameters
$$ --------------------------
##$DU= <F:/spectra>
##$EXPNO= 1
##$NAME= <H-F>
##$PROCNO= 1
##$TYPE= <nmr>
##$USER= <she>
##$AMP= (0..31)
100 100 100 100 100 100 100 100 100 100 100 100 100 100 100 100 100 100 
100 100 100 100 100 100 100 100 100 100 100 100 100 100 
##$AQSEQ= 0
##$AQ_mod= 1
##$AUNM= <au_zg>
##$AUTOPOS= <>
##$BF1= 200.13
##$BF2= 200.13
##$BF3= 200.13
##$BF4= 200.13
##$BF5= 200.13
##$BF6= 200.13
##$BF7= 200.13
##$BF8= 200.13
##$BYTORDA= 1
##$CFDGTYP= 0
##$CFRGTYP= 5
##$CHEMSTR= <none>
##$CNST= (0..31)
1 1 145 1 1 1 1 1 1 1 1 1 1 1 1 1 1 1 1 1 1 1 1 1 1 1 1 1 1 1 1 1 
##$CPDPRG= <>
##$CPDPRG1= <>
##$CPDPRG2= <>
##$CPDPRG3= <>
##$CPDPRG4= <mlev>
##$CPDPRG5= <mlev>
##$CPDPRG6= <mlev>
##$CPDPRG7= <mlev>
##$CPDPRG8= <mlev>
##$CPDPRGB= <>
##$CPDPRGT= <>
##$D= (0..31)
0 1.2 0 0 0 0 0 0 0 0 0 0.03 0 0 0 0 0 0 0 0 0 0 0 0 0 0 0 0 0 0 0 0 
##$DATE= 1559727862
##$DBL= (0..7)
120 120 120 120 120 120 120 120 
##$DBP= (0..7)
150 150 150 150 150 150 150 150 
##$DBP07= 0
##$DBPNAM0= <>
##$DBPNAM1= <>
##$DBPNAM2= <>
##$DBPNAM3= <>
##$DBPNAM4= <>
##$DBPNAM5= <>
##$DBPNAM6= <>
##$DBPNAM7= <>
##$DBPOAL= (0..7)
0.5 0.5 0.5 0.5 0.5 0.5 0.5 0.5 
##$DBPOFFS= (0..7)
0 0 0 0 0 0 0 0 
##$DE= 6
##$DECBNUC= <off>
##$DECIM= 24
##$DECNUC= <off>
##$DECSTAT= 4
##$DIGMOD= 1
##$DIGTYP= 9
##$DL= (0..7)
0 120 120 120 120 120 120 120 
##$DP= (0..7)
150 150 150 150 150 150 150 150 
##$DP07= 0
##$DPNAME0= <>
##$DPNAME1= <>
##$DPNAME2= <>
##$DPNAME3= <>
##$DPNAME4= <>
##$DPNAME5= <>
##$DPNAME6= <>
##$DPNAME7= <>
##$DPOAL= (0..7)
0.5 0.5 0.5 0.5 0.5 0.5 0.5 0.5 
##$DPOFFS= (0..7)
0 0 0 0 0 0 0 0 
##$DQDMODE= 0
##$DR= 18
##$DS= 0
##$DSLIST= <SSSSSSSSSSSSSSS>
$$ [...]
##$SUBNAM2= <"">
##$SUBNAM3= <"">
##$SUBNAM4= <"">
##$SUBNAM5= <"">
##$SUBNAM6= <"">
##$SUBNAM7= <"">
##$SUBNAM8= <"">
##$SUBNAM9= <"">
##$SW= 24.9336996594482
##$SWIBOX= (0..15)
0 0 2 0 0 0 0 0 0 0 0 0 0 0 0 0 
##$SW_h= 4990.01996007984
##$TD= 16384
##$TD0= 1
##$TE= 0
##$TE2= 300
##$TE3= 300
##$TEG= 300
##$TL= (0..7)
0 120 120 120 120 120 120 120 
##$TP= (0..7)
150 150 150 150 150 150 150 150 
##$TP07= 0
##$TPNAME0= <>
##$TPNAME1= <>
##$TPNAME2= <>
##$TPNAME3= <>
##$TPNAME4= <>
##$TPNAME5= <>
##$TPNAME6= <>
##$TPNAME7= <>
##$TPOAL= (0..7)
0.5 0.5 0.5 0.5 0.5 0.5 0.5 0.5 
##$TPOFFS= (0..7)
0 0 0 0 0 0 0 0 
##$TUNHIN= 0
##$TUNHOUT= 0
##$TUNXOUT= 0
##$USERA1= <user>
##$USERA2= <user>
##$USERA3= <user>
##$USERA4= <user>
##$USERA5= <user>
##$V9= 5
##$VALIST= <valist>
##$VCLIST= <CCCCCCCCCCCCCCC>
##$VD= 0
##$VDLIST= <DDDDDDDDDDDDDDD>
##$VPLIST= <PPPPPPPPPPPPPPP>
##$VTLIST= <TTTTTTTTTTTTTTT>
##$WBST= 1024
##$WBSW= 4
##$XGAIN= (0..3)
0 0 0 0 
##$XL= 0
##$YL= 0
##$YMAX_a= 20043
##$YMIN_a= -23428
##$ZGOPTNS= <>
##$ZL1= 120
##$ZL2= 120
##$ZL3= 120
##$ZL4= 120
##$ABSF1= 10
##$ABSF2= 0
##$ABSG= 5
##$ABSL= 3
##$ALPHA= 0
##$AQORDER= 0
##$ASSFAC= 0
##$ASSFACI= 0
##$ASSFACX= 0
##$ASSWID= 0
##$AUNMP= <proc_1d>
##$AZFE= 0.1
##$AZFW= 0.1
##$BCFW= 1
##$BC_mod= 2
##$BYTORDP= 1
##$COROFFS= 0
##$CY= 11.3945322036743
##$DATMOD= 1
##$DC= 2
##$DFILT= <>
##$DTYPP= 0
##$F1P= 18.9103706918063
##$F2P= -1.10871071338519
##$FCOR= 0.5
##$FTSIZE= 0
##$FT_mod= 4
##$GAMMA= 1
##$GB= 0.15
##$INTBC= 1
##$INTSCL= 1
##$ISEN= 128
##$LB= 0.24
##$LEV0= 0
##$LPBIN= 0
##$MAXI= 10000
##$MC2= 0
##$MEAN= 0
##$ME_mod= 0
##$MI= 1.114404
##$NCOEF= 0
##$NC_proc= 0
##$NLEV= 6
##$NOISF1= 3.799351
##$NOISF2= 2.8
##$NSP= 1
##$NTH_PI= 0
##$NZP= 0
##$OFFSET= 15.70392
##$PC= 1
##$PHC0= -8575.108
##$PHC1= 11.60018
##$PH_mod= 1
##$PKNL= yes
##$PPARMOD= 0
##$PSCAL= 0
##$PSIGN= 0
##$REVERSE= no
##$SF= 200.130013532006
##$SI= 16384
##$SIGF1= 3
##$SIGF2= 2
##$SINO= 400
##$SIOLD= 16384
##$SREGLST= <1H.CDCl3>
##$SSB= 0
##$STSI= 0
##$STSR= 0
##$SW_p= 3612.71676300578
##$SYMM= 0
##$S_DEV= 0
##$TDeff= 0
##$TDoff= 0
##$TI= <>
##$TILT= no
##$TM1= 0
##$TM2= 0
##$TOPLEV= 0
##$USERP1= <user>
##$USERP2= <user>
##$USERP3= <user>
##$USERP4= <user>
##$USERP5= <user>
##$WDW= 1
##$XDIM= 8192
##$YMAX_p= 0
##$YMIN_p= 0
$$ End of Bruker specific parameters
$$ ---------------------------------
##NTUPLES= NMR FID
##VAR_NAME=  TIME,          FID/REAL,        FID/IMAG
##SYMBOL=    X,             R,               I
##VAR_TYPE=  INDEPENDENT,   DEPENDENT,       DEPENDENT
##VAR_FORM=  AFFN,          ASDF,            ASDF
##VAR_DIM=   8192,          8192,            8192
##UNITS=     SECONDS,       ARBITRARY UNITS, ARBITRARY UNITS
##FACTOR=    0.0002004,     1,               1
##FIRST=     0,             0,               0
##LAST=      1.6414764,     0,               0
##MIN=       0,             -23428,          0
##MAX=       1.6414764,     20043,           0
$$ Real data points
##PAGE= N=1
##DATA TABLE= (X++(R..R)), XYDATA
0 0 0 0 0 0 0 0 0 0 0 0 0 0 0 0 0 0 0 0 0 0 0 0 0 0 0 4 -8 8 -8 8 -8 8 -8 8 -12 16 -16 16 -16 20 -24 24 -28 32 -33
45 -33 37 -41 46 -52 60 -68 76 -86 101 -122 148 -193 262 -403 795 -4142 -15147 -7632 3257 2730
65 2730 -9155 -14517 -6558 3388 666 -10427 -14342 -5068 3827 -367 -11687 -13232 -2677 4759
79 4759 -1565 -11892 -11018 8 5408 -1944 -11081 -8354 2606 6491 -1887 -9910 -5456 5512 7582
94 7582 -1700 -8361 -2222 8331 8472 -1590 -6695 1048 10869 8786 -1666 -4821 4183 12592 8506
109 8506 -1746 -3090 6635 13618 7771 -2333 -1855 8672 13872 6017 -3319 -550 10029 12768
123 12768 3669 -4145 251 10135 10941 1205 -5380 387 9797 8678 -1811 -6759 551 8912 5674
138 5674 -4781 -7714 480 7417 2661 -7335 -8616 253 5960 -162 -9684 -9105 367 4556 -2883
153 -2883 -11424 -8934 684 3233 -5143 -12461 -8195 1316 2175 -6906 -12689 -6741 2286 1349 -8011 -12034
169 -12034 -4720 3487 896 -8460 -10654 -2147 4942 643 -8342 -8486 793 6290 575 -7520 -5804
184 -5804 3627 7558 790 -6383 -3089 6366 8682 868 -5165 -272 8790 9184 770 -3834 2256
199 2256 10478 9204 540 -2777 4241 11588 8707 -152 -2032 5860 12031 7463 -1216 -1459 6936
214 6936 11649 5681 -2458 -1162 7458 10617 3419 -3916 -1016 7536 8967 826 -5342 -962 7157
229 7157 6799 -1875 -6608 -946 6423 4385 -4448 -7568 -867 5452 1875 -6680 -8107 -727 4397
244 4397 -409 -8415 -8236 -392 3491 -2419 -9643 -7833 214 2657 -4053 -10175 -6930 939 2043
259 2043 -5156 -10176 -5659 1930 1692 -5935 -9713 -3985 3090 1360 -6452 -8743 -2022 4151 1055
274 1055 -6574 -7429 1 5149 769 -6536 -5864 2086 5945 338 -6314 -4057 3989 6373 -161 -5839
290 -5839 -2191 5632 6451 -721 -5239 -407 6891 6185 -1327 -4567 1259 7736 5582 -1985 -3855 2682
306 2682 8162 4670 -2664 -3135 3862 8139 3517 -3314 -2463 4729 7773 2233 -3934 -1816 5383 7123
322 7123 773 -4512 -1155 5813 6153 -738 -4930 -485 5988 4987 -2153 -5151 214 6034 3709
337 3709 -3497 -5196 988 5920 2315 -4644 -4918 1803 5619 894 -5510 -4386 2563 5151 -413
352 -413 -6093 -3646 3295 4618 -1619 -6353 -2724 3978 3975 -2703 -6320 -1618 4551 3234 -3607 -6010
368 -6010 -485 4961 2445 -4313 -5468 666 5224 1622 -4866 -4767 1803 5308 711 -5271 -3896 2848
384 2848 5169 -253 -5507 -2934 3704 4795 -1212 -5558 -1942 4400 4212 -2190 -5501 -892 4903
399 4903 3434 -3142 -5235 147 5135 2469 -3955 -4803 1092 5134 1438 -4628 -4263 1963 4945 339
415 339 -5161 -3590 2740 4582 -728 -5477 -2795 3379 4052 -1761 -5593 -1914 3917 3438 -2681 -5536
431 -5536 -995 4360 2727 -3496 -5252 32 4683 1944 -4164 -4729 1091 4882 1147 -4627 -3999 2154
447 2154 4944 334 -4885 -3075 3200 4855 -445 -4910 -1967 4165 4585 -1178 -4675 -755 4925
462 4925 4176 -1807 -4233 449 5506 3658 -2331 -3683 1624 5891 2999 -2781 -2992 2701 6005 2225
478 2225 -3122 -2240 3599 5860 1353 -3409 -1514 4260 5475 394 -3697 -838 4714 4838 -683 -3934
494 -3934 -215 4905 3936 -1820 -4081 339 4873 2836 -2936 -4194 802 4633 1601 -4005 -4149 1239
510 1239 4224 289 -4936 -3959 1681 3667 -1031 -5611 -3567 2041 2983 -2219 -6016 -2995 2392 2281
526 2281 -3253 -6127 -2267 2735 1535 -4109 -5933 -1365 3036 844 -4654 -5427 -370 3265 223
541 223 -4947 -4696 687 3489 -313 -5033 -3765 1759 3608 -803 -4894 -2644 2784 3619 -1221 -4566
557 -4566 -1456 3697 3506 -1609 -4117 -246 4450 3258 -2009 -3582 935 4994 2813 -2366 -2946 2012
573 2012 5270 2228 -2704 -2272 2924 5309 1515 -2976 -1565 3683 5112 711 -3198 -860 4258
588 4258 4687 -175 -3325 -155 4629 4078 -1026 -3330 514 4822 3340 -1865 -3279 1155 4858 2469
604 2469 -2635 -3066 1770 4724 1524 -3279 -2703 2326 4452 585 -3716 -2215 2840 4072 -336 -4015
620 -4015 -1609 3322 3594 -1184 -4092 -889 3685 3002 -1957 -3991 -160 3935 2355 -2609 -3737 591
636 591 4041 1608 -3142 -3345 1303 4003 810 -3621 -2899 1887 3763 -57 -3986 -2392 2364 3346
652 3346 -934 -4267 -1911 2683 2774 -1849 -4488 -1413 2874 2038 -2781 -4611 -918 2898 1165 -3626
668 -3626 -4589 -433 2790 255 -4367 -4415 98 2625 -665 -4931 -4064 672 2375 -1508 -5240 -3468
684 -3468 1261 2088 -2190 -5242 -2664 1895 1856 -2689 -4952 -1663 2548 1635 -2969 -4384 -501 3219
700 3219 1459 -3037 -3570 713 3792 1312 -2913 -2599 1957 4260 1203 -2647 -1503 3122 4630 1062
716 1062 -2320 -378 4149 4816 819 -1932 730 4971 4757 500 -1560 1679 5504 4448 43 -1276
732 -1276 2450 5738 3841 -556 -1060 3040 5642 2973 -1234 -919 3347 5171 1872 -1988 -869 3420
748 3420 4468 606 -2757 -868 3333 3518 -723 -3465 -858 3069 2449 -2024 -3986 -830 2705 1284
764 1284 -3191 -4328 -718 2311 132 -4162 -4481 -533 1897 -920 -4899 -4377 -213 1501 -1807 -5325
780 -5325 -4017 209 1190 -2525 -5449 -3400 729 954 -2997 -5261 -2547 1358 811 -3268 -4776 -1476
796 -1476 2024 729 -3291 -4021 -290 2679 704 -3158 -3125 946 3272 686 -2898 -2083 2131 3739
812 3739 595 -2569 -985 3154 3970 450 -2210 15 3965 3996 176 -1918 908 4531 3761 -250
828 -250 -1662 1645 4787 3261 -772 -1465 2205 4765 2535 -1376 -1313 2566 4476 1612 -2008 -1195
844 -1195 2765 3962 584 -2618 -1071 2834 3281 -490 -3128 -913 2772 2462 -1514 -3479 -720 2632
860 2632 1606 -2416 -3666 -475 2449 738 -3162 -3635 -121 2260 -43 -3685 -3404 299 2087 -700
876 -700 -3967 -2984 806 1948 -1258 -4055 -2384 1367 1807 -1705 -3953 -1663 1934 1651 -2025 -3668
892 -3668 -808 2471 1467 -2281 -3234 75 2914 1225 -2445 -2687 935 3238 932 -2544 -2052 1759
908 1759 3400 562 -2559 -1357 2462 3392 126 -2523 -687 3006 3226 -332 -2439 -31 3413 2892
924 2892 -834 -2325 581 3632 2398 -1328 -2151 1094 3655 1805 -1805 -1951 1527 3529 1106 -2255
940 -2255 -1719 1894 3243 348 -2628 -1425 2146 2852 -404 -2915 -1092 2329 2342 -1125 -3083 -736
956 -736 2462 1799 -1781 -3109 -301 2519 1207 -2352 -2998 157 2519 614 -2790 -2770 643 2473
972 2473 38 -3095 -2374 1135 2369 -495 -3245 -1875 1637 2202 -993 -3263 -1291 2088 1966 -1427
988 -1427 -3152 -644 2456 1687 -1813 -2895 16 2742 1338 -2121 -2560 671 2920 923 -2368 -2152
1004 -2152 1273 2943 455 -2539 -1684 1806 2857 -17 -2633 -1170 2252 2652 -526 -2651 -629
1019 -629 2593 2335 -1018 -2596 -101 2808 1918 -1464 -2429 411 2899 1438 -1874 -2213 888 2910
1035 2910 907 -2213 -1914 1333 2811 346 -2470 -1566 1728 2609 -214 -2659 -1171 2055 2328 -767
1051 -767 -2736 -725 2338 1973 -1287 -2714 -238 2517 1526 -1772 -2592 259 2625 1061 -2173 -2365
1067 -2365 752 2648 542 -2479 -2044 1238 2560 15 -2692 -1626 1667 2385 -490 -2755 -1139
1082 -1139 2043 2156 -967 -2739 -606 2332 1826 -1379 -2615 -73 2553 1441 -1738 -2384 465 2658
1098 2658 1024 -2041 -2080 972 2653 560 -2263 -1713 1418 2582 68 -2430 -1304 1803 2384 -415
1114 -415 -2515 -864 2112 2096 -892 -2517 -415 2338 1725 -1356 -2447 50 2488 1304 -1777 -2301
1130 -2301 500 2528 815 -2148 -2054 963 2486 319 -2402 -1722 1361 2348 -189 -2579 -1319 1739
1146 1739 2152 -684 -2637 -862 2055 1874 -1126 -2585 -372 2294 1534 -1525 -2427 139 2453 1157
1162 1157 -1851 -2183 642 2516 736 -2119 -1862 1111 2492 290 -2286 -1486 1516 2366 -172 -2385
1178 -2385 -1054 1877 2157 -600 -2396 -613 2163 1876 -1028 -2333 -123 2355 1521 -1407 -2167 341
1194 341 2477 1125 -1752 -1934 800 2509 682 -2005 -1674 1217 2429 212 -2203 -1313 1606 2279
1210 2279 -262 -2315 -889 1922 2046 -708 -2335 -460 2183 1736 -1130 -2293 -21 2342 1366 -1535
1226 -1535 -2140 428 2419 947 -1872 -1936 844 2393 481 -2127 -1624 1236 2303 12 -2313 -1284
1242 -1284 1572 2110 -459 -2405 -890 1858 1840 -904 -2396 -469 2056 1514 -1316 -2314 -57 2177
1258 2177 1120 -1669 -2147 366 2200 700 -1983 -1932 746 2147 251 -2206 -1662 1085 2029 -208
1274 -208 -2384 -1336 1383 1831 -681 -2474 -972 1643 1548 -1136 -2497 -569 1844 1218 -1526 -2408
1290 -2408 -146 1967 863 -1858 -2220 305 2061 488 -2107 -1939 753 2062 104 -2275 -1565 1216
1306 1216 2042 -259 -2301 -1098 1645 1940 -581 -2237 -559 2026 1809 -848 -2036 3 2342 1609
1322 1609 -1075 -1785 553 2566 1363 -1254 -1466 1069 2679 1073 -1406 -1128 1523 2684 720 -1539
1338 -1539 -765 1889 2565 294 -1636 -420 2158 2331 -160 -1696 -83 2327 1979 -619 -1741 237
1354 237 2390 1543 -1092 -1729 524 2347 1052 -1537 -1686 772 2198 488 -1948 -1577 976 1975
1370 1975 -96 -2267 -1408 1164 1667 -665 -2484 -1195 1312 1339 -1196 -2604 -908 1431 956 -1655
1386 -1655 -2619 -560 1505 570 -2040 -2506 -187 1552 179 -2301 -2272 208 1563 -191 -2454 -1944
1402 -1944 627 1547 -512 -2515 -1539 1034 1493 -797 -2466 -1039 1416 1391 -1039 -2271 -489 1764
1418 1764 1267 -1208 -2024 54 2062 1106 -1357 -1690 611 2257 874 -1460 -1317 1136 2362 628
1434 628 -1513 -919 1580 2369 332 -1568 -534 1928 2241 -21 -1586 -128 2188 2000 -414 -1564
1450 -1564 225 2339 1689 -812 -1531 548 2375 1271 -1188 -1433 845 2324 794 -1551 -1318 1105
1466 1105 2155 284 -1830 -1138 1310 1934 -218 -2018 -888 1488 1639 -696 -2135 -608 1637 1316
1482 1316 -1102 -2133 -285 1734 977 -1442 -2007 88 1788 631 -1708 -1836 428 1809 300 -1882
1498 -1882 -1555 813 1802 -27 -1983 -1219 1164 1703 -370 -2019 -841 1450 1555 -664 -1967 -443
1514 -443 1709 1367 -960 -1891 -39 1893 1111 -1242 -1736 375 1981 765 -1497 -1535 744 1990 409
1531 409 -1701 -1283 1050 1904 27 -1866 -990 1324 1755 -384 -1960 -690 1551 1502 -777 -1972 -367
1548 -367 1700 1202 -1147 -1939 -51 1777 861 -1462 -1833 287 1785 481 -1722 -1640 585 1718 98
1565 98 -1919 -1414 856 1603 -285 -2042 -1130 1127 1441 -627 -2073 -791 1364 1254 -947 -2020 -405
1582 -405 1570 1054 -1204 -1872 17 1726 797 -1391 -1641 439 1835 547 -1542 -1352 847 1891
1598 1891 272 -1630 -1016 1238 1867 -7 -1646 -632 1574 1781 -309 -1618 -254 1836 1621 -578
1614 -578 -1543 156 2033 1369 -866 -1424 521 2120 1078 -1123 -1253 845 2109 719 -1344 -1073
1630 -1073 1122 2016 328 -1513 -854 1351 1839 -91 -1659 -612 1516 1607 -491 -1738 -331 1629
1646 1629 1309 -868 -1741 -61 1696 962 -1203 -1671 223 1713 614 -1470 -1523 497 1666 249
1662 249 -1684 -1331 774 1578 -113 -1812 -1080 1029 1439 -458 -1910 -803 1234 1249 -784 -1908 -467
1679 -467 1419 1019 -1101 -1843 -143 1548 744 -1366 -1709 204 1603 439 -1584 -1547 515 1594 100
1696 100 -1756 -1291 839 1524 -222 -1857 -1008 1085 1376 -549 -1898 -691 1297 1191 -860 -1874
1712 -1874 -368 1467 952 -1136 -1756 -20 1557 691 -1353 -1591 309 1614 412 -1524 -1377 643
1728 643 1600 122 -1628 -1099 956 1558 -156 -1678 -789 1240 1446 -429 -1647 -427 1474 1305 -665
1745 -665 -1552 -42 1678 1151 -875 -1400 343 1831 927 -1041 -1173 732 1927 696 -1168 -910 1100
1762 1100 1941 415 -1258 -626 1415 1872 109 -1308 -304 1653 1723 -186 -1318 -13 1820 1519
1778 1519 -498 -1291 282 1891 1199 -812 -1226 522 1891 836 -1117 -1159 735 1794 439 -1374
1794 -1374 -1041 905 1607 14 -1597 -927 1017 1365 -424 -1760 -772 1102 1073 -827 -1868 -577 1135
1811 1135 759 -1184 -1883 -353 1166 446 -1479 -1832 -97 1181 129 -1722 -1687 175 1153 -162 -1881
1828 -1881 -1471 457 1114 -444 -1931 -1164 745 1050 -686 -1915 -826 1011 950 -893 -1808 -439 1247
1845 1247 817 -1088 -1657 -33 1449 658 -1214 -1421 373 1592 493 -1300 -1132 763 1661 301
1861 301 -1339 -830 1110 1654 67 -1334 -483 1383 1587 -157 -1309 -159 1620 1450 -401 -1222 179
1878 179 1774 1264 -627 -1125 469 1825 1006 -833 -1005 749 1832 701 -1047 -846 949 1742 349
1895 349 -1213 -698 1137 1597 1 -1353 -508 1265 1381 -367 -1425 -313 1347 1120 -696 -1466 -89
1912 -89 1414 838 -992 -1431 159 1428 538 -1244 -1330 402 1423 235 -1420 -1165 652 1351 -72
1929 -72 -1546 -940 895 1264 -359 -1594 -654 1102 1116 -628 -1594 -362 1256 939 -855 -1509 -78
1946 -78 1373 723 -1068 -1400 216 1421 480 -1243 -1223 495 1410 207 -1374 -1029 732 1348 -81
1963 -81 -1475 -817 926 1213 -372 -1534 -592 1074 1038 -656 -1535 -343 1196 842 -910 -1498 -80
1980 -80 1253 594 -1131 -1397 184 1291 331 -1299 -1234 441 1300 65 -1431 -1006 719 1259 -176
1997 -176 -1489 -758 961 1157 -418 -1482 -475 1157 1029 -660 -1427 -159 1331 863 -854 -1315 168
2014 168 1435 674 -1013 -1147 481 1502 448 -1121 -923 766 1515 245 -1197 -672 1031 1473 21
2031 21 -1211 -392 1257 1376 -196 -1187 -111 1444 1238 -415 -1118 166 1541 1040 -634 -1020 432
2048 432 1606 797 -823 -913 654 1599 526 -996 -763 862 1497 214 -1147 -626 993 1342 -103
2065 -103 -1286 -472 1107 1120 -476 -1369 -314 1160 853 -799 -1433 -137 1166 563 -1092 -1421 32
2082 32 1126 245 -1359 -1353 206 1059 -82 -1554 -1216 404 963 -369 -1657 -1030 598 838 -639 -1686
2100 -1686 -788 778 725 -852 -1632 -491 941 601 -996 -1504 -158 1093 471 -1095 -1297 173 1228
2117 1228 362 -1137 -1054 514 1308 200 -1157 -767 833 1339 58 -1152 -468 1113 1317 -103 -1083
2134 -1083 -159 1332 1246 -268 -1011 130 1492 1109 -463 -916 400 1561 899 -647 -817 634 1575
2151 1575 643 -817 -696 839 1530 353 -990 -552 999 1392 37 -1121 -424 1102 1184 -297 -1217
2168 -1217 -270 1159 952 -606 -1277 -111 1167 661 -902 -1288 58 1147 366 -1147 -1225 225 1077
2185 1077 83 -1339 -1122 388 1003 -193 -1456 -964 565 893 -447 -1502 -753 732 790 -658 -1495
2202 -1495 -486 883 653 -832 -1386 -208 1024 527 -962 -1245 91 1156 400 -1035 -1030 409 1226
2219 1226 247 -1091 -804 692 1255 77 -1110 -547 936 1205 -104 -1099 -293 1153 1144 -306 -1068 -24
2237 -24 1297 971 -509 -992 210 1365 785 -699 -914 425 1374 522 -893 -824 621 1318 253 -1024
2255 -1024 -680 779 1220 -25 -1154 -539 908 1080 -281 -1206 -358 1007 900 -534 -1212 -172 1081
2272 1081 708 -753 -1159 50 1136 511 -917 -1054 282 1164 305 -1034 -917 493 1152 106 -1123
2289 -1123 -724 700 1101 -107 -1161 -519 885 1014 -320 -1172 -301 1025 865 -533 -1147 -73 1121
2306 1121 690 -742 -1081 139 1162 468 -909 -993 343 1151 224 -1076 -886 519 1068 -29 -1207
2323 -1207 -747 672 958 -320 -1283 -585 776 793 -565 -1327 -405 868 620 -786 -1312 -201 929
2340 929 425 -975 -1234 11 947 228 -1099 -1093 237 987 53 -1173 -903 488 985 -94 -1170 -670
2358 -670 719 984 -235 -1132 -384 945 954 -353 -1031 -76 1149 896 -441 -891 228 1318 807 -511
2376 -511 -693 535 1426 688 -579 -523 804 1487 531 -649 -334 1036 1436 315 -707 -149 1180 1328
2394 1328 77 -775 4 1255 1144 -199 -844 135 1260 868 -502 -892 227 1196 558 -790 -924
2411 -924 290 1068 232 -1050 -934 352 896 -136 -1282 -915 379 705 -463 -1441 -852 428 500 -759
2429 -759 -1531 -731 480 301 -984 -1536 -556 533 149 -1154 -1452 -324 612 9 -1238 -1292 -60 701
2447 701 -96 -1263 -1065 222 773 -185 -1221 -782 531 858 -251 -1112 -454 832 893 -310 -977 -125
2465 -125 1073 899 -369 -835 212 1266 838 -406 -641 527 1406 763 -480 -442 798 1456 610 -536
2483 -536 -275 1004 1443 408 -601 -107 1142 1336 183 -663 30 1231 1172 -86 -734 138 1227 943
2501 943 -342 -787 229 1185 654 -607 -805 322 1083 359 -851 -816 379 963 55 -1049 -784 439
2519 439 799 -238 -1187 -709 494 641 -517 -1309 -605 555 453 -748 -1335 -458 615 307 -925 -1275
2537 -1275 -246 686 155 -1042 -1161 -20 741 2 -1137 -998 210 770 -131 -1151 -771 456 804
2554 804 -242 -1118 -505 684 779 -357 -1048 -271 865 714 -472 -962 -16 1011 633 -564 -846 230
2572 230 1096 507 -662 -705 435 1132 361 -738 -580 629 1102 175 -802 -422 768 1029 -12 -865
2590 -865 -272 881 918 -211 -877 -112 965 782 -390 -861 46 998 599 -585 -825 229 1024 418
2608 418 -725 -748 385 1010 224 -846 -622 540 954 18 -905 -488 675 878 -178 -952 -317 794
2626 794 765 -359 -957 -143 882 632 -546 -917 34 950 483 -685 -831 230 962 309 -802 -731 398
2645 398 966 141 -889 -610 567 916 -39 -917 -432 713 863 -212 -923 -260 828 752 -380 -898
2663 -898 -58 911 611 -519 -842 118 949 453 -652 -781 266 956 294 -775 -675 420 918 89
2681 89 -876 -573 540 836 -132 -960 -472 628 714 -341 -1026 -351 695 563 -555 -1042 -223 706 380
2700 380 -758 -1031 -79 717 167 -926 -979 66 693 -21 -1045 -897 217 656 -207 -1116 -746 365
2718 365 629 -355 -1134 -559 523 557 -493 -1083 -337 671 498 -589 -981 -91 804 445 -644 -839 165
2737 165 926 373 -670 -659 412 1028 297 -662 -441 642 1059 221 -626 -228 869 1089 126 -587 -1
2756 -1 1038 1039 22 -529 197 1165 958 -110 -486 374 1223 815 -241 -422 545 1235 630 -388 -356 665
2776 665 1186 417 -541 -311 752 1066 169 -682 -249 785 897 -111 -799 -199 781 692 -393 -911 -145
2795 -145 747 444 -651 -979 -105 663 181 -879 -1003 -40 584 -72 -1072 -989 22 494 -289 -1202 -905
2814 -905 128 403 -490 -1251 -788 244 343 -628 -1256 -608 341 257 -752 -1196 -404 476 189 -827 -1083
2833 -1083 -182 601 146 -849 -889 88 720 94 -835 -684 355 810 34 -798 -451 587 846 -20 -736
2852 -736 -216 801 862 -99 -661 14 959 813 -204 -582 221 1064 712 -312 -498 417 1101 574 -397
2871 -397 -402 569 1095 408 -492 -311 694 1041 221 -581 -219 791 953 26 -651 -115 849 813 -160 -690
2891 -690 -6 883 661 -352 -692 114 892 493 -508 -669 229 851 319 -648 -626 328 823 122 -762 -549
2911 -549 422 759 -61 -829 -440 523 666 -236 -881 -332 592 530 -421 -891 -209 653 411 -582 -878 -57
2931 -57 666 254 -723 -831 53 675 88 -834 -757 200 644 -94 -938 -675 312 592 -281 -972 -538 427 507
2952 507 -417 -987 -394 507 407 -543 -961 -210 597 307 -667 -893 -68 650 210 -737 -776 139 704 101
2972 101 -765 -631 340 732 18 -756 -436 518 767 -55 -719 -245 702 766 -116 -636 -24 864 743 -181
2992 -181 -557 203 985 686 -240 -436 416 1060 601 -300 -316 575 1100 463 -372 -200 720 1056 306 -448
3012 -448 -109 814 978 129 -520 -17 854 825 -94 -596 43 850 638 -331 -673 83 792 390 -553 -709
3032 -709 128 689 152 -767 -749 142 583 -97 -928 -738 176 451 -342 -1056 -675 212 323 -542 -1122 -587
3052 -587 276 220 -692 -1126 -467 346 124 -795 -1064 -285 404 39 -853 -948 -93 481 -37 -865 -783 123 560
3073 560 -84 -832 -569 352 624 -116 -783 -348 554 654 -178 -692 -108 747 672 -206 -591 123 886 635
3093 635 -258 -456 323 983 564 -314 -341 516 1029 448 -373 -226 653 1016 314 -420 -135 759 950 152
3113 152 -479 -38 834 842 -35 -532 55 851 671 -224 -574 116 818 495 -413 -593 188 765 298 -572 -588
3134 -588 239 697 99 -708 -559 302 604 -106 -819 -491 357 519 -268 -871 -424 424 426 -407 -866 -286 494
3155 494 323 -544 -852 -140 549 235 -635 -776 28 590 131 -696 -677 183 622 24 -739 -539 337 624
3175 624 -79 -735 -376 476 598 -188 -732 -234 590 539 -304 -694 -72 680 456 -406 -655 79 727 348
3195 348 -495 -576 214 732 215 -582 -511 331 705 75 -649 -424 427 660 -51 -686 -311 526 610 -191 -695
3216 -695 -186 605 522 -312 -671 -39 663 418 -422 -633 88 704 326 -505 -557 230 728 203 -562 -460 363
3237 363 726 92 -602 -346 494 679 -35 -623 -221 586 616 -172 -634 -97 660 546 -284 -620 23 713
3257 713 405 -419 -584 155 712 274 -525 -531 270 703 138 -596 -442 367 664 -10 -665 -371 457 602 -149
3278 -149 -699 -251 535 523 -276 -680 -145 594 414 -389 -678 -21 629 315 -492 -634 104 629 188 -593
3298 -593 -556 215 615 61 -653 -486 311 598 -76 -699 -384 420 529 -201 -717 -264 482 457 -331 -715 -132
3319 -132 551 356 -439 -684 -1 599 245 -531 -622 135 600 133 -599 -538 257 609 32 -646 -426 389 594
3340 594 -80 -665 -291 476 540 -197 -652 -153 577 498 -279 -606 7 670 428 -344 -535 141 707 341 -415
3361 -415 -447 297 732 235 -472 -366 409 736 130 -498 -245 529 706 40 -503 -130 625 655 -85 -511 -28
3382 -28 697 569 -191 -487 90 731 459 -301 -468 195 743 348 -405 -428 297 707 199 -502 -387 364 652
3403 652 22 -598 -329 431 550 -148 -661 -271 465 439 -314 -708 -197 474 302 -489 -742 -116 459 138
3423 138 -610 -725 -50 435 -4 -720 -702 37 404 -146 -799 -631 130 345 -271 -849 -532 227 329 -372
3443 -372 -831 -397 318 272 -441 -797 -247 410 252 -483 -697 -68 513 205 -523 -578 113 586 170 -512 -454
3464 -454 288 653 120 -496 -304 452 679 64 -475 -125 611 678 6 -425 38 718 659 -61 -367 173 796
3485 796 585 -144 -321 310 835 479 -224 -271 419 835 364 -305 -212 509 804 218 -377 -161 572 712 58
3506 58 -455 -93 599 615 -95 -494 -32 616 486 -241 -523 38 617 356 -378 -531 86 574 198 -508 -521
3527 -521 160 539 62 -603 -482 229 476 -83 -665 -416 282 405 -221 -717 -340 326 337 -342 -726 -253
3547 -253 385 258 -459 -697 -125 419 151 -542 -659 -18 457 73 -615 -601 104 437 -59 -656 -506 197
3567 197 419 -157 -690 -404 295 393 -252 -684 -281 375 326 -341 -662 -152 458 269 -419 -614 -13 512 208
3588 208 -478 -531 130 550 129 -505 -427 262 565 54 -533 -319 382 562 -20 -513 -195 485 555 -92 -481
3609 -481 -58 589 520 -147 -430 87 670 467 -208 -367 229 733 401 -258 -300 360 743 315 -305 -219 442
3630 442 728 218 -362 -144 532 670 72 -404 -61 579 592 -64 -445 -9 603 472 -206 -457 50 584
3650 584 346 -334 -476 128 567 185 -462 -466 167 499 29 -575 -443 215 424 -131 -651 -398 242 340 -260
3671 -260 -698 -335 293 266 -382 -712 -249 324 172 -476 -695 -157 361 98 -566 -650 -50 388 26 -607 -566
3692 -566 83 414 -49 -608 -457 196 418 -116 -608 -326 321 415 -171 -569 -182 420 418 -229 -507 -41 546
3713 546 379 -250 -431 124 618 330 -287 -348 269 660 287 -316 -250 400 677 202 -344 -144 501 659 107
3734 107 -358 -47 573 610 3 -364 43 614 525 -108 -382 109 624 425 -221 -357 182 622 293 -323 -361
3755 -361 226 571 163 -430 -353 278 509 13 -515 -325 291 426 -139 -579 -280 323 347 -265 -624 -206 338
3776 338 245 -390 -634 -138 362 146 -471 -613 -52 367 51 -550 -565 45 373 -36 -607 -488 140 359 -140
3797 -140 -617 -391 225 345 -220 -618 -283 300 294 -303 -597 -162 384 257 -350 -549 -28 434 196 -400 -470
3818 -470 95 485 149 -422 -381 214 512 86 -424 -274 334 524 19 -428 -172 432 519 -36 -416 -47 515
3839 515 474 -101 -375 64 583 440 -164 -338 176 635 363 -240 -280 274 646 279 -284 -231 356 619 179
3860 179 -340 -173 421 577 56 -385 -114 454 503 -59 -430 -63 491 401 -178 -444 2 490 292 -315 -460
3881 -460 54 465 168 -411 -442 110 439 45 -482 -401 169 388 -78 -554 -356 236 344 -185 -588 -291 281
3902 281 280 -272 -585 -192 339 231 -353 -559 -97 374 175 -404 -507 11 402 103 -452 -445 118 419 18
3923 18 -486 -373 211 417 -45 -502 -276 294 402 -101 -489 -175 366 387 -166 -457 -74 447 326 -245 -438
3944 -438 37 481 267 -299 -373 159 526 185 -344 -302 243 523 112 -381 -233 316 500 6 -412 -159 390
3965 390 456 -86 -420 -89 441 393 -162 -417 9 471 313 -247 -390 75 490 232 -330 -373 155 476 120
3986 120 -399 -330 217 442 31 -444 -280 284 421 -68 -478 -218 325 371 -166 -481 -140 376 293 -250 -470
4007 -470 -50 396 235 -313 -460 30 424 172 -370 -404 129 442 81 -411 -332 207 423 -11 -446 -267 284
4028 284 387 -92 -465 -190 343 350 -171 -470 -109 386 287 -249 -453 -11 419 228 -326 -412 73 432 139
4049 139 -384 -351 172 421 61 -404 -293 233 411 -7 -426 -223 309 393 -100 -451 -137 363 342 -176 -424
4070 -424 -50 421 292 -240 -386 47 445 244 -285 -354 123 468 172 -336 -301 210 488 104 -356 -231 284
4091 284 467 28 -378 -157 360 423 -64 -389 -91 404 366 -156 -393 -15 437 285 -234 -381 59 440 203
4112 203 -309 -354 135 445 98 -363 -305 202 404 28 -430 -264 244 371 -74 -459 -214 306 303 -193 -475
4133 -475 -138 330 251 -262 -472 -66 341 184 -328 -443 0 363 105 -396 -404 78 357 33 -426 -347 158
4154 158 366 -41 -436 -279 221 344 -100 -455 -193 293 304 -176 -452 -114 347 263 -237 -422 -20 394 212
4175 212 -285 -381 78 417 160 -319 -327 155 435 94 -357 -260 240 416 16 -365 -187 319 393 -63 -379 -109
4197 -109 373 354 -132 -377 -28 399 296 -194 -356 52 445 228 -254 -320 136 444 156 -301 -264 214 441
4218 441 78 -335 -218 275 430 18 -357 -158 323 399 -72 -372 -86 380 342 -136 -362 -10 403 288 -203
4239 -203 -351 55 432 200 -275 -321 135 426 128 -314 -281 206 420 46 -364 -222 255 387 -43 -390 -172
4260 -172 302 331 -112 -411 -105 325 274 -207 -409 -55 351 195 -288 -401 13 354 113 -348 -382 95 346
4281 346 30 -408 -317 136 323 -46 -436 -273 191 287 -135 -456 -213 242 247 -209 -462 -131 274 200 -265 -424
4303 -424 -63 309 147 -323 -406 24 342 100 -343 -347 112 368 44 -371 -291 195 361 -8 -390 -214 277
4324 277 358 -65 -366 -118 336 350 -113 -340 -13 393 305 -157 -295 70 439 263 -196 -257 170 477 209
4345 209 -228 -203 243 468 147 -260 -147 326 459 74 -272 -77 365 395 -13 -303 -31 384 355 -105 -319
4366 -319 13 401 270 -198 -315 67 386 167 -267 -323 107 362 79 -351 -307 148 326 -19 -406 -276 176
4387 176 289 -111 -439 -238 203 230 -196 -462 -182 225 172 -274 -472 -113 260 130 -333 -444 -38 282 66
4408 66 -378 -392 34 299 16 -385 -325 119 302 -45 -397 -250 202 301 -93 -390 -158 266 296 -142 -373 -66
4430 -66 350 261 -187 -339 25 383 222 -213 -290 120 405 171 -242 -235 201 411 116 -261 -170 276 429 64
4452 64 -268 -102 346 408 15 -287 -26 385 358 -61 -278 26 409 322 -129 -271 86 432 229 -189 -259 149
4474 149 427 165 -273 -231 177 385 73 -308 -206 227 337 -16 -365 -173 252 281 -118 -387 -138 270 231
4495 231 -201 -406 -82 279 142 -270 -397 -30 278 85 -339 -363 25 280 7 -376 -333 98 277 -39 -384
4516 -384 -263 164 263 -104 -406 -203 219 242 -154 -393 -111 284 205 -198 -348 -23 316 185 -245 -326 49
4537 49 356 130 -276 -284 129 364 87 -300 -227 195 367 31 -310 -170 260 341 -31 -304 -95 318 309 -92
4559 -92 -326 -26 339 267 -150 -308 23 359 206 -203 -287 97 371 153 -262 -252 150 362 69 -301 -214 212
4581 212 343 -6 -325 -152 252 312 -69 -336 -100 305 284 -129 -333 -21 323 219 -196 -317 19 327 164
4602 164 -262 -294 80 336 86 -291 -262 143 328 22 -330 -222 198 321 -40 -355 -154 239 258 -121 -350
4623 -350 -102 269 233 -157 -347 -44 303 193 -209 -322 27 333 134 -250 -294 100 329 84 -292 -246 162
4644 162 341 16 -323 -184 224 319 -33 -319 -133 271 288 -99 -329 -69 294 237 -169 -331 -20 318 156
4665 156 -216 -302 48 323 103 -265 -279 106 318 48 -304 -233 155 309 -10 -329 -189 211 283 -77 -356
4686 -356 -122 255 243 -130 -343 -53 289 197 -193 -314 8 311 160 -235 -298 60 325 108 -266 -259 137 325
4708 325 52 -301 -208 189 305 -6 -316 -153 226 277 -66 -331 -108 276 239 -134 -316 -47 307 194 -187
4729 -187 -309 13 323 153 -227 -275 84 324 98 -282 -238 150 317 11 -311 -200 186 295 -40 -323 -139
4750 -139 243 281 -101 -332 -76 264 222 -151 -309 -23 301 178 -208 -300 41 316 114 -249 -266 93 313
4771 313 73 -279 -222 160 312 17 -306 -173 208 303 -32 -313 -123 270 272 -89 -300 -55 296 235 -142 -288
4793 -288 3 306 186 -202 -274 63 309 128 -245 -257 111 319 65 -271 -201 172 303 7 -302 -159 219
4814 219 283 -59 -313 -115 250 231 -127 -325 -68 270 194 -185 -308 -5 286 137 -234 -283 61 293 90
4835 90 -267 -245 128 300 31 -302 -190 172 286 -36 -311 -146 222 271 -81 -313 -88 267 235 -142 -303
4856 -303 -37 291 196 -185 -276 21 308 136 -231 -274 81 311 88 -257 -229 137 302 34 -283 -187 190 273
4878 273 -29 -308 -138 226 260 -86 -303 -82 268 222 -144 -304 -19 288 179 -207 -286 42 298 115 -246
4899 -246 -248 84 291 60 -278 -222 147 281 1 -307 -175 193 265 -54 -299 -124 231 236 -117 -312 -62 253
4921 253 178 -166 -299 -10 276 150 -218 -287 45 294 120 -241 -246 108 302 58 -258 -202 156 292 11 -286
4943 -286 -144 216 277 -35 -268 -85 273 251 -81 -264 -12 304 236 -125 -243 45 311 187 -180 -222 97
4964 97 336 123 -211 -191 146 319 69 -248 -152 202 305 0 -266 -126 223 261 -67 -288 -79 243 216 -140
4986 -140 -297 -39 253 155 -204 -294 3 249 90 -272 -288 33 229 30 -302 -272 69 229 -34 -330 -230
5007 -230 121 219 -92 -336 -177 167 194 -139 -327 -112 202 168 -153 -324 -35 265 151 -197 -279 23 293
5028 293 122 -219 -235 109 308 83 -241 -183 166 306 41 -246 -118 236 300 -2 -242 -68 276 279 -36 -223
5050 -223 0 315 255 -82 -217 58 319 213 -128 -198 103 323 133 -187 -185 125 314 80 -223 -161 182 284
5072 284 29 -261 -130 203 252 -64 -271 -91 225 224 -120 -284 -59 222 163 -174 -293 -10 245 108 -230
5093 -230 -289 18 235 51 -277 -260 57 223 -14 -303 -229 104 207 -75 -329 -182 145 191 -114 -337 -133
5114 -133 193 169 -155 -326 -68 228 154 -190 -289 4 255 109 -207 -251 64 275 84 -226 -191 133 275 52
5136 52 -228 -129 214 286 3 -238 -71 256 265 -40 -209 -5 298 255 -78 -208 42 315 217 -109 -193 98 313
5159 313 170 -167 -183 129 313 99 -200 -168 158 295 42 -226 -124 192 260 -40 -256 -104 206 210 -110 -295
5181 -295 -75 210 165 -161 -282 -40 217 123 -215 -273 15 230 64 -250 -252 60 227 2 -287 -220 108 220
5203 220 -40 -299 -187 161 215 -89 -292 -118 187 194 -128 -285 -63 214 152 -184 -271 -12 239 109 -192 -244
5225 -244 52 254 69 -235 -204 108 248 35 -251 -164 161 256 -15 -250 -126 198 225 -64 -261 -70 233
5246 233 218 -95 -246 -3 267 191 -125 -227 45 281 146 -169 -198 92 294 108 -204 -180 146 297 47
5267 47 -213 -144 199 273 -5 -226 -84 216 251 -42 -235 -39 259 215 -106 -245 3 261 157 -149 -221 51
5289 51 265 119 -196 -204 76 264 56 -220 -176 114 244 -11 -257 -167 158 211 -60 -277 -114 189 190 -104 -285
5312 -285 -68 203 154 -161 -274 -27 220 111 -197 -266 17 236 60 -232 -242 68 241 25 -253 -194 120
5333 120 221 -36 -269 -162 144 210 -71 -269 -109 182 180 -117 -265 -53 227 155 -149 -252 -1 236 127
5354 127 -184 -245 41 251 77 -209 -198 98 256 41 -237 -160 150 242 -13 -224 -104 188 230 -51 -230 -46
5376 -46 230 201 -84 -224 -4 259 195 -123 -210 45 266 148 -163 -181 100 291 105 -173 -145 147 286 54
5398 54 -193 -113 178 263 0 -215 -76 221 237 -48 -228 -34 240 211 -90 -231 6 250 166 -133 -224 31
5420 31 244 98 -179 -213 74 233 55 -220 -193 97 218 4 -254 -170 130 198 -62 -291 -133 145 167 -109
5442 -109 -285 -85 181 136 -162 -275 -52 189 100 -190 -262 11 199 57 -222 -217 50 206 21 -247 -193 99
5464 99 215 -25 -260 -137 148 204 -53 -252 -100 177 188 -81 -237 -40 223 163 -124 -225 23 249 129
5485 129 -173 -205 64 267 98 -169 -172 127 259 63 -187 -130 150 250 11 -226 -89 198 236 -42 -205 -48
5507 -48 226 212 -77 -212 -1 242 172 -112 -210 44 250 117 -166 -189 71 245 79 -202 -164 109 239 37
5529 37 -224 -139 135 210 -27 -236 -121 157 184 -87 -262 -73 194 150 -141 -268 -45 198 101 -169 -248 -2
5551 -2 210 71 -203 -217 47 193 25 -224 -186 89 207 8 -236 -144 139 201 -32 -238 -98 177 192 -62
5573 -62 -222 -57 220 176 -94 -209 6 251 164 -132 -186 63 252 130 -144 -161 108 257 79 -177 -124 136
5595 136 256 29 -202 -106 168 223 -35 -224 -73 186 178 -86 -243 -49 200 132 -137 -240 -12 195 78 -197
5617 -197 -235 11 186 29 -245 -213 40 167 -16 -263 -193 77 177 -51 -264 -169 118 157 -87 -264 -109 156
5639 156 150 -117 -249 -52 196 123 -126 -206 20 236 124 -138 -177 69 252 98 -153 -133 127 272 75 -167
5661 -167 -100 183 261 29 -172 -55 209 245 -14 -168 -8 233 227 -42 -159 29 266 180 -79 -155 72 267
5683 267 148 -120 -158 102 261 87 -164 -138 131 224 39 -197 -128 133 190 -40 -225 -95 147 160 -103 -242
5705 -242 -70 159 129 -140 -257 -78 165 78 -193 -254 -32 158 15 -238 -256 -4 139 -26 -263 -227 45 145
5727 145 -57 -283 -193 73 148 -98 -272 -144 132 134 -131 -272 -93 171 115 -142 -237 -16 199 122 -152 -205 48
5750 48 241 106 -153 -139 111 257 82 -153 -107 163 259 47 -147 -46 213 264 31 -144 10 260 234 -14
5772 -14 -134 47 270 211 -63 -132 72 267 148 -91 -129 99 252 116 -132 -140 115 225 44 -185 -119 140
5794 140 219 -17 -202 -103 135 184 -64 -235 -86 152 134 -119 -237 -54 162 99 -166 -238 -31 170 51 -211
5816 -211 -221 21 174 21 -222 -203 44 165 -15 -233 -164 95 162 -53 -233 -125 119 140 -84 -240 -84 149
5838 149 128 -133 -224 -44 173 88 -160 -208 18 198 75 -173 -172 51 195 37 -195 -154 92 182 -4 -199 -110
5861 -110 140 183 -30 -205 -74 162 171 -66 -201 -22 190 160 -83 -178 16 213 140 -100 -156 62 235 111
5883 111 -138 -129 110 248 85 -133 -88 152 242 53 -147 -55 183 223 12 -166 -26 212 209 -31 -154 -1 229
5906 229 175 -71 -163 42 233 136 -108 -149 77 227 87 -148 -138 90 212 36 -172 -117 121 186 -7 -201
5928 -201 -101 144 160 -64 -227 -72 138 130 -121 -242 -55 148 88 -146 -231 -22 154 46 -197 -233 4 160
5950 160 12 -217 -196 34 142 -27 -243 -175 66 137 -67 -250 -136 85 119 -96 -236 -90 136 116 -107 -217
5972 -217 -46 156 94 -135 -201 11 172 86 -164 -171 60 193 67 -170 -124 114 209 45 -153 -71 157 205 8
5995 8 -159 -35 189 206 -9 -142 19 223 188 -37 -123 57 240 166 -63 -110 98 266 140 -81 -87 126 259
6018 259 91 -118 -83 152 221 36 -141 -65 168 203 -7 -161 -46 169 162 -64 -193 -36 159 106 -123 -217 -24
6041 -24 165 71 -159 -215 -6 156 19 -204 -208 27 137 -29 -234 -189 42 115 -75 -260 -174 64 100 -105 -254
6064 -254 -127 98 92 -134 -245 -78 123 54 -155 -230 -35 147 58 -171 -197 12 153 37 -167 -149 60 180
6086 180 16 -172 -97 118 184 -6 -164 -61 154 181 -29 -148 -30 199 181 -42 -152 29 228 149 -61 -131
6108 -131 69 223 141 -75 -101 105 247 108 -111 -77 140 234 67 -127 -54 160 218 24 -144 -45 179 200 -15
6131 -15 -161 -11 173 166 -59 -162 0 192 128 -115 -160 27 187 78 -136 -153 49 170 31 -181 -144 70
6153 70 147 -31 -206 -143 79 116 -74 -246 -125 80 87 -126 -241 -93 100 70 -146 -246 -65 112 18 -183 -223
6176 -223 -20 123 12 -191 -187 22 135 -9 -211 -164 61 142 -33 -198 -114 108 152 -52 -185 -70 152 137
6198 137 -62 -167 -9 185 134 -70 -152 34 203 121 -86 -120 78 216 101 -81 -84 110 218 59 -123 -59
6220 -59 143 204 32 -134 -51 165 173 -6 -129 -26 187 162 -48 -146 -7 176 113 -86 -166 18 189 86 -125
6243 -125 -144 62 173 54 -143 -127 77 168 15 -184 -107 98 160 -26 -172 -86 121 137 -63 -185 -64 143
6265 143 115 -92 -177 -21 162 87 -128 -155 11 171 69 -131 -152 47 166 34 -149 -122 88 164 5 -161
6287 -161 -107 113 162 -25 -166 -72 134 132 -59 -175 -33 150 111 -86 -173 -9 159 97 -103 -153 36 165 72
6310 72 -128 -134 46 161 30 -154 -127 75 157 -9 -168 -106 97 144 -44 -177 -66 113 106 -90 -187 -47 130
6333 130 86 -120 -183 -39 132 47 -155 -173 -11 124 22 -175 -167 36 129 -1 -177 -128 74 130 -37 -188 -111
6356 -111 96 138 -52 -181 -52 125 125 -70 -165 -20 156 122 -86 -129 40 181 101 -89 -112 85 206 93 -90
6379 -90 -86 123 225 73 -93 -43 154 220 57 -92 -11 183 188 9 -106 9 193 162 -23 -125 13 182 129
6402 129 -82 -120 43 186 96 -108 -108 53 165 36 -131 -117 56 151 -12 -168 -98 84 120 -52 -190 -92 89
6425 89 105 -79 -200 -74 103 64 -122 -200 -45 114 50 -136 -183 -14 128 34 -173 -169 18 133 -2 -184 -144
6448 -144 38 110 -25 -183 -112 89 118 -54 -184 -78 108 104 -73 -163 -46 122 93 -95 -163 -16 141 74 -109
6471 -109 -135 35 155 53 -142 -124 60 158 24 -133 -86 97 156 13 -130 -61 131 167 -5 -130 -14 165
6493 165 147 -40 -128 13 167 134 -48 -115 46 184 120 -67 -96 78 198 96 -94 -73 109 199 66 -104 -58
6516 -58 128 178 23 -117 -45 138 156 -8 -123 -25 144 127 -41 -132 -1 148 96 -88 -148 1 133 48 -118
6539 -118 -141 30 134 19 -161 -128 46 108 -14 -177 -112 50 94 -45 -183 -107 70 89 -94 -202 -83 83
6561 83 48 -137 -200 -56 97 41 -150 -179 -18 100 12 -163 -165 13 101 -2 -167 -146 24 128 -25 -174 -110 74
6585 74 117 -42 -170 -66 107 105 -53 -156 -34 126 114 -75 -129 7 163 112 -77 -105 56 185 92 -69 -68 102
6609 102 200 79 -76 -43 129 202 66 -80 -15 167 194 39 -70 27 186 183 23 -79 59 209 161 -7 -79
6632 -79 65 190 116 -46 -83 80 171 86 -76 -90 76 163 42 -112 -86 90 120 -11 -138 -77 86 109 -62 -181
6656 -181 -95 74 63 -114 -188 -86 58 16 -144 -199 -60 73 -5 -178 -189 -37 69 -45 -196 -194 -30 59 -64
6679 -64 -207 -155 19 62 -73 -206 -130 58 75 -82 -192 -78 87 74 -100 -180 -37 112 67 -99 -141 -2 134
6702 134 53 -96 -107 61 168 52 -97 -66 97 164 48 -86 -29 131 173 28 -89 -14 149 168 1 -95 18
6725 18 174 154 -15 -80 55 186 127 -42 -78 68 180 87 -63 -59 92 181 69 -66 -61 110 165 35 -88 -43
6749 -43 118 144 -3 -110 -38 116 115 -34 -122 -18 117 88 -76 -159 -12 116 57 -106 -140 3 112 17 -141 -131
6773 -131 19 85 -9 -171 -130 26 89 -41 -184 -109 47 74 -79 -193 -91 63 55 -107 -177 -70 72 37 -121
6796 -121 -172 -28 89 22 -127 -150 12 108 10 -126 -125 42 106 9 -135 -82 67 126 8 -117 -44 96 131 -13
6820 -13 -105 -18 125 117 -30 -92 17 159 126 -35 -80 52 173 102 -56 -75 79 172 76 -71 -66 97 155 40 -79
6845 -79 -47 124 161 22 -101 -30 117 143 -20 -105 -28 116 103 -56 -123 -2 126 80 -69 -106 24 120 52 -102
6869 -102 -104 35 116 29 -111 -101 60 114 6 -116 -73 65 108 -41 -135 -63 85 88 -60 -137 -50 93 75 -91 -147
6894 -147 -31 98 44 -114 -132 -12 98 4 -132 -134 11 95 -5 -144 -104 39 83 -28 -152 -101 55 81 -59
6917 -59 -145 -68 69 79 -80 -152 -44 89 64 -94 -127 -11 112 36 -94 -120 25 107 45 -99 -101 51 121 18 -105
6942 -105 -73 78 126 9 -103 -40 95 107 -20 -121 -26 103 94 -49 -99 -3 108 76 -62 -103 11 126 63 -76
6966 -76 -91 47 125 36 -98 -75 67 126 26 -100 -67 81 111 -5 -115 -40 101 113 -3 -101 -7 138 104 -43
6990 -43 -97 -3 135 96 -56 -95 28 140 67 -75 -87 52 131 49 -87 -75 64 134 13 -95 -59 87 120 -12
7014 -12 -112 -53 89 89 -43 -125 -40 90 72 -77 -129 -16 81 53 -99 -140 -10 94 11 -116 -128 2 72 -16 -139
7039 -139 -122 20 83 -34 -151 -91 40 76 -57 -145 -73 58 65 -55 -150 -53 81 63 -75 -114 -17 87 32 -103 -133
7064 -133 4 94 26 -98 -94 34 95 21 -100 -85 54 98 -22 -119 -59 72 92 -16 -100 -42 101 96 -43 -117 -13
7089 -13 106 83 -72 -99 10 120 56 -80 -97 25 114 34 -91 -85 51 117 33 -91 -56 76 119 -2 -99 -39 99
7114 99 111 -14 -79 -18 118 105 -26 -94 3 122 86 -50 -81 29 123 71 -68 -91 45 126 42 -74 -69 59 125 18
7140 18 -91 -65 72 116 -10 -105 -48 98 84 -30 -103 -39 88 66 -66 -110 -27 81 47 -96 -119 -3 77 20 -110
7165 -110 -91 24 82 14 -124 -98 25 88 -19 -124 -82 54 78 -32 -121 -62 71 61 -66 -118 -34 73 51 -63
7189 -63 -126 -6 85 37 -83 -110 5 87 24 -76 -88 34 100 0 -93 -70 56 102 7 -99 -49 68 97 -8 -88
7214 -88 -28 86 89 -31 -81 -7 113 83 -41 -83 27 117 60 -50 -68 47 128 62 -60 -58 64 119 37 -70 -49 86
7240 86 126 20 -70 -15 99 112 -3 -69 -10 109 91 -28 -74 -1 109 72 -51 -83 13 105 54 -74 -88 21 96 21
7266 21 -95 -80 20 69 -12 -117 -86 38 58 -32 -128 -69 42 49 -57 -123 -62 52 44 -72 -120 -44 67 22 -90 -122
7292 -122 -20 67 3 -106 -115 14 64 5 -104 -84 35 76 1 -107 -54 64 94 -4 -100 -24 86 92 -15 -68 -15 95
7318 95 87 -36 -64 15 121 79 -36 -62 39 112 49 -44 -60 59 127 36 -66 -38 74 111 14 -69 -28 77 91 -4 -77
7345 -77 -16 96 94 -20 -72 4 102 77 -37 -69 8 85 66 -54 -67 35 97 35 -66 -69 50 102 9 -88 -46 59 87
7372 87 -8 -76 -48 64 67 -29 -102 -27 59 76 -49 -97 -14 82 49 -63 -100 -5 78 26 -88 -86 6 66 0 -103 -78 28
7400 28 68 -15 -98 -76 37 67 -14 -98 -61 60 61 -29 -95 -27 74 58 -50 -87 -24 75 44 -51 -89 8 94 41 -52 -70 33
7429 33 110 44 -57 -45 63 102 18 -76 -29 73 104 3 -74 -15 87 105 -9 -77 -3 96 81 -31 -84 14 95 49 -56
7456 -56 -74 20 86 21 -67 -77 15 78 14 -92 -76 38 79 -12 -89 -55 53 74 -20 -98 -46 61 58 -45 -90 -18 76 43
7484 43 -44 -80 18 85 56 -52 -62 25 81 26 -72 -64 31 82 11 -78 -48 65 83 3 -76 -41 65 85 -11 -76 -33 80 79
7513 79 -30 -70 -10 81 52 -53 -74 4 82 32 -62 -83 6 77 10 -79 -67 33 84 -4 -95 -59 29 69 -18 -86 -43 55 66
7542 66 -20 -82 -34 70 69 -37 -74 7 81 43 -46 -75 15 90 42 -61 -68 20 85 27 -59 -46 48 88 10 -69 -39 51 82 8
7572 8 -72 -20 73 70 -17 -78 -10 73 63 -38 -73 -6 81 39 -44 -66 17 83 39 -74 -66 36 77 15 -71 -60 36 82 10 -73
7602 -73 -39 57 71 -10 -73 -16 67 73 -30 -62 -1 81 64 -39 -69 2 89 42 -58 -58 9 64 40 -68 -69 18 79 14 -80 -60
7632 -60 26 60 -13 -98 -59 43 45 -33 -93 -37 54 36 -42 -86 -24 59 35 -63 -89 -6 51 28 -73 -74 -3 52 16 -79 -67 4
7662 4 61 0 -83 -49 43 88 -2 -69 -26 67 65 -16 -69 -5 75 69 -27 -59 6 92 66 -18 -36 45 101 56 -30 -45 41 93 39 -51
7694 -51 -49 44 80 10 -60 -33 68 57 -11 -74 -18 68 67 -29 -74 -14 66 47 -49 -76 -6 68 42 -49 -76 -3 74 12 -63 -74 25
7725 25 73 0 -67 -51 39 66 -2 -85 -53 45 54 -31 -71 -30 47 52 -24 -63 -15 54 40 -44 -62 11 74 46 -57 -57 13 68 34
7756 34 -56 -50 29 70 13 -59 -44 39 62 -10 -66 -27 40 62 -26 -77 -21 59 49 -34 -78 -19 56 40 -40 -70 5 72 38 -44 -54
7787 -54 16 71 27 -57 -49 31 59 7 -53 -33 39 65 -12 -73 -20 40 71 -22 -66 -15 65 49 -26 -48 -9 68 49 -47 -68 -3 58
7818 58 30 -50 -66 8 68 8 -61 -63 26 69 5 -82 -36 44 55 -9 -73 -15 51 55 -14 -70 -17 69 51 -30 -51 3 80 53 -34
7849 -34 -42 31 77 42 -35 -45 40 73 27 -49 -33 48 78 13 -48 -18 71 81 13 -43 -4 78 78 2 -41 7 67 56 -25 -54 7
7880 7 81 42 -35 -55 23 66 21 -52 -62 20 56 15 -64 -53 23 56 -16 -74 -47 39 42 -21 -74 -39 38 39 -40 -68 -15 47 35 -53
7912 -53 -71 5 57 14 -64 -59 23 58 11 -41 -45 33 73 10 -50 -30 43 67 6 -58 -24 64 57 -6 -49 -5 67 63 -3 -38 5 72
7944 72 57 -25 -29 27 76 34 -43 -46 25 71 20 -42 -29 31 56 13 -55 -24 45 59 3 -55 -10 62 62 -3 -51 -6 64 52 -31 -45
7976 -45 5 63 40 -20 -41 17 66 34 -24 -30 28 73 24 -40 -38 43 55 6 -54 -19 53 63 0 -51 -23 64 51 -17 -56 -1 68
8007 68 41 -35 -58 3 55 35 -42 -47 1 59 5 -59 -63 13 50 16 -55 -35 25 52 -7 -69 -16 38 44 -14 -54 -19 41 50 -11 -59
8039 -59 -1 59 48 -18 -38 16 66 44 -25 -35 24 68 36 -36 -26 43 64 23 -49 -19 42 62 -6 -52 -13 51 58 -6 -48 -18 54
8070 54 51 -26 -48 -8 54 30 -37 -62 2 55 6 -33 -39 21 58 1 -60 -40 27 44 6 -68 -40 11 49 -3 -64 -26 36 42 -19 -60
8102 -60 -9 40 38 -28 -47 10 66 42 -19 -36 30 71 29 -37 -29 34 69 36 -42 -13 47 69 29 -24 -10 48 69 1 -47 -7 48
8133 48 49 -12 -50 -6 56 43 -27 -48 12 59 39 -31 -52 14 57 18 -51 -55 21 52 9 -59 -41 23 40 -12 -59 -29 39 50 -8
8164 -8 -59 1 57 39 -27 -44 6 60 32 -31 -48 9 58 31 -32 -51 17 55 27 -46 -24 42 55 14 -50 -22 24
8191B4
$$ Imaginary data points
##PAGE= N=2
##DATA TABLE= (X++(I..I)), XYDATA
0 0 0 0 0 0 0 0 0 0 0 0 0 0 0 0 0 0 -1 8 -8 8 -8 8 -8 9 -16 16 -16 17 -24 24 -25 32 -33 40 -41 49 -54 58 -65 73
40 73 -81 89 -100 111 -122 136 -152 168 -189 210 -240 272 -310 359 -425 516 -650 860 -1259 2270
60 2270 -10420 -17989 -3952 -9873 -20081 -23428 -11815 -4217 -8664 -19721 -19325 -8581 -933 -7623
74 -7623 -17180 -15377 -3027 2154 -5629 -14309 -9601 2122 5416 -3437 -10120 -4189 7132 8452 -775
89 -775 -6257 1189 11737 11248 1322 -2559 6055 15652 13041 2850 604 10313 18529 13767 3552
104 3552 3296 13678 19942 13279 3696 5211 15692 20043 11880 2942 6125 16711 18985 9197 1431
119 1431 6630 16696 16351 5733 -148 6444 15236 12911 2222 -2111 5451 13289 9179 -1687
133 -1687 -4187 4516 10942 4921 -5370 -5736 3462 8115 891 -8391 -7024 2344 5550 -2626 -10953
148 -10953 -7819 1695 3268 -5806 -12738 -7841 1377 1208 -8335 -13652 -7225 1397 -462 -10192 -13714
163 -13714 -5931 1735 -1803 -11346 -12912 -4170 2276 -2784 -11804 -11464 -2039 2953 -3530 -11729 -9367
178 -9367 334 3480 -4094 -10992 -6886 2465 3845 -4333 -9895 -4422 4449 4165 -4558 -8673 -1866
193 -1866 6176 4057 -4800 -7182 511 7345 3704 -4886 -5787 2478 8158 3167 -5098 -4459 4333 8600
209 8600 2230 -5375 -3066 5854 8505 1094 -5487 -1679 7050 8048 -134 -5540 -302 7995 7235 -1428
225 -1428 -5342 1130 8565 6113 -2624 -4906 2511 8814 4777 -3659 -4244 3792 8702 3304 -4446
240 -4446 -3358 4863 8262 1888 -4982 -2427 5737 7611 429 -5381 -1443 6411 6681 -1014 -5537
255 -5537 -434 6735 5551 -2333 -5585 407 6864 4329 -3641 -5561 1288 6824 2874 -4913 -5290
270 -5290 2173 6471 1300 -5942 -4848 2904 5941 -250 -6803 -4216 3630 5220 -1872 -7378 -3365
285 -3365 4234 4258 -3344 -7572 -2328 4661 3183 -4633 -7428 -1197 4942 2052 -5637 -6953 -14 5065
301 5065 929 -6356 -6173 1166 5027 -155 -6776 -5181 2306 4847 -1146 -6866 -3983 3342 4547
316 4547 -2001 -6741 -2710 4292 4170 -2817 -6414 -1326 5106 3611 -3530 -5825 93 5692 2908
331 2908 -4098 -5092 1452 6082 2128 -4597 -4243 2755 6248 1187 -4970 -3194 3942 6077 160 -5133
347 -5133 -2072 4872 5667 -832 -5114 -951 5603 5032 -1831 -4977 156 6083 4198 -2782 -4653 1234
363 1234 6304 3173 -3605 -4194 2204 6271 2082 -4281 -3615 3068 6010 928 -4827 -2932 3831 5592
379 5592 -226 -5190 -2116 4487 4958 -1380 -5326 -1178 4974 4201 -2397 -5233 -227 5313 3329 -3313
395 -3313 -4940 772 5516 2348 -4090 -4420 1790 5476 1286 -4651 -3717 2687 5239 239 -5018 -2927
411 -2927 3465 4829 -791 -5224 -2038 4089 4229 -1819 -5276 -1130 4527 3446 -2787 -5150 -247
426 -247 4767 2569 -3668 -4917 605 4842 1596 -4442 -4529 1414 4715 512 -5111 -4004 2165 4426
442 4426 -591 -5561 -3335 2841 3935 -1679 -5848 -2532 3446 3354 -2675 -5845 -1581 3914 2617 -3557
458 -3557 -5609 -563 4218 1815 -4241 -5114 461 4371 991 -4719 -4427 1452 4389 159 -5023 -3579
474 -3579 2386 4248 -638 -5071 -2608 3225 3972 -1328 -4931 -1579 3926 3636 -1948 -4641 -467 4559
490 4559 3211 -2487 -4178 665 5054 2690 -2924 -3550 1798 5377 2107 -3249 -2778 2888 5548 1457
506 1457 -3455 -1910 3886 5528 715 -3547 -951 4722 5263 -58 -3493 41 5342 4754 -854 -3335
522 -3335 961 5712 4058 -1633 -3118 1764 5812 3149 -2425 -2834 2467 5586 2055 -3154 -2518 2927
538 2927 5107 847 -3844 -2219 3185 4386 -472 -4474 -1948 3269 3464 -1815 -4988 -1655 3210
553 3210 2359 -3101 -5354 -1341 3007 1176 -4268 -5536 -973 2725 6 -5218 -5482 -477 2444 -1081
569 -1081 -5924 -5107 129 2146 -2019 -6250 -4412 840 1915 -2727 -6222 -3480 1641 1766 -3204 -5865
585 -5865 -2281 2517 1653 -3445 -5161 -896 3377 1564 -3452 -4198 589 4183 1552 -3264 -3058 2088
601 2088 4879 1517 -2944 -1766 3547 5415 1419 -2508 -402 4797 5723 1232 -2036 872 5811
616 5811 5751 915 -1606 1993 6493 5423 399 -1265 2900 6759 4728 -272 -1028 3501 6592 3709
632 3709 -1089 -951 3757 5985 2391 -2038 -1025 3720 5038 846 -3065 -1205 3412 3809 -823 -4029
648 -4029 -1415 2912 2411 -2473 -4873 -1648 2315 932 -4007 -5554 -1766 1704 -489 -5344 -5984 -1710
664 -1710 1132 -1793 -6339 -6030 -1444 674 -2855 -6941 -5697 -941 402 -3626 -7099 -4925 -172
679 -172 327 -4054 -6751 -3749 810 425 -4125 -5960 -2264 1887 668 -3853 -4821 -584 3027 1003
695 1003 -3363 -3427 1178 4070 1342 -2732 -1916 2853 4897 1601 -2028 -394 4327 5496 1728 -1368
711 -1368 998 5483 5782 1653 -808 2164 6290 5706 1324 -398 3077 6697 5236 795 -173 3673
727 3673 6667 4403 50 -151 3986 6274 3266 -856 -255 4013 5500 1876 -1843 -417 3804 4424
743 4424 362 -2819 -654 3420 3224 -1197 -3680 -839 2946 1912 -2657 -4289 -915 2385 569
758 569 -3899 -4685 -895 1858 -646 -4873 -4811 -721 1408 -1684 -5522 -4637 -383 1029 -2533 -5840
774 -5840 -4145 99 760 -3137 -5806 -3383 691 564 -3512 -5463 -2434 1349 462 -3659 -4855 -1326
790 -1326 2026 394 -3646 -4039 -110 2632 319 -3478 -3073 1072 3116 239 -3212 -2057 2149 3455
806 3455 84 -2913 -1042 3086 3561 -162 -2597 -71 3770 3438 -479 -2272 802 4225 3137 -881
822 -881 -1977 1520 4458 2626 -1334 -1684 2136 4477 1954 -1805 -1379 2639 4273 1202 -2205 -1024
838 -1024 3005 3912 385 -2563 -649 3258 3418 -429 -2776 -238 3424 2818 -1204 -2855 229 3467
854 3467 2134 -1882 -2774 697 3430 1425 -2421 -2565 1161 3314 743 -2854 -2237 1624 3098 34
870 34 -3107 -1815 2040 2797 -624 -3266 -1338 2355 2426 -1244 -3321 -814 2635 1979 -1830 -3253 -239
887 -239 2816 1448 -2335 -3064 308 2876 878 -2790 -2777 864 2847 252 -3122 -2400 1384 2719
903 2719 -378 -3382 -1936 1840 2429 -1011 -3487 -1388 2211 2080 -1598 -3464 -821 2504 1648 -2114
919 -2114 -3316 -203 2699 1163 -2537 -3036 409 2793 636 -2849 -2640 989 2766 135 -3065 -2155
935 -2155 1526 2673 -397 -3156 -1604 2027 2475 -886 -3144 -989 2458 2198 -1328 -2981 -338 2756
951 2756 1853 -1728 -2720 316 2994 1463 -2049 -2389 962 3127 995 -2309 -1947 1556 3122 510
967 510 -2470 -1463 2096 3012 -8 -2581 -928 2528 2790 -518 -2590 -380 2874 2453 -1046 -2531
983 -2531 176 3074 1980 -1542 -2378 668 3165 1464 -1986 -2158 1159 3136 868 -2350 -1871 1604
999 1604 2982 261 -2628 -1488 1978 2730 -354 -2794 -1060 2299 2387 -939 -2847 -597 2529 1977
1015 1977 -1448 -2784 -88 2680 1509 -1908 -2598 420 2754 1000 -2242 -2313 916 2716 474 -2546
1031 -2546 -1965 1375 2599 -63 -2747 -1546 1762 2367 -610 -2835 -1103 2069 2057 -1136 -2853 -637
1047 -637 2300 1668 -1620 -2794 -152 2456 1204 -2090 -2649 337 2520 697 -2465 -2375 817 2467
1063 2467 162 -2743 -2025 1266 2350 -356 -2904 -1592 1674 2138 -878 -2962 -1092 2021 1857 -1344
1079 -1344 -2888 -540 2315 1522 -1739 -2704 18 2495 1133 -2045 -2411 592 2607 723 -2276 -2023
1095 -2023 1129 2631 305 -2407 -1560 1628 2542 -117 -2443 -1074 2063 2378 -525 -2415 -524 2415
1111 2415 2150 -911 -2296 37 2698 1831 -1258 -2081 582 2859 1467 -1558 -1812 1105 2929 1046
1127 1046 -1821 -1454 1592 2920 572 -2015 -1079 2024 2760 78 -2136 -670 2340 2508 -443 -2207
1143 -2207 -255 2565 2112 -963 -2214 168 2683 1648 -1461 -2148 547 2658 1087 -1907 -2014 873
1159 873 2539 486 -2303 -1831 1158 2294 -137 -2622 -1599 1404 1957 -758 -2832 -1298 1576 1568
1175 1568 -1324 -2925 -945 1708 1170 -1820 -2903 -550 1809 720 -2220 -2755 -90 1887 293
1190 293 -2519 -2474 378 1896 -106 -2672 -2064 860 1889 -466 -2729 -1571 1350 1822 -786 -2654
1206 -2654 -1001 1797 1702 -1081 -2456 -383 2190 1532 -1328 -2204 234 2489 1315 -1526 -1855 847
1222 847 2681 1022 -1676 -1456 1402 2762 693 -1790 -1032 1896 2724 307 -1857 -591 2256 2571
1238 2571 -113 -1886 -170 2527 2272 -556 -1850 260 2670 1874 -994 -1788 621 2679 1388 -1433
1254 -1433 -1686 916 2575 833 -1817 -1555 1184 2360 240 -2137 -1363 1398 2055 -345 -2379 -1139
1270 -1139 1535 1714 -899 -2557 -877 1659 1299 -1413 -2607 -539 1747 889 -1886 -2542 -168 1799
1286 1799 458 -2209 -2328 270 1839 84 -2420 -2014 720 1855 -289 -2518 -1584 1200 1817 -589
1302 -589 -2472 -1051 1650 1744 -861 -2317 -470 2055 1609 -1074 -2072 135 2367 1429 -1262 -1750 703
1319 703 2580 1168 -1430 -1396 1228 2667 842 -1553 -1032 1658 2616 472 -1669 -663 1982 2423
1335 2423 20 -1755 -336 2184 2126 -449 -1822 -36 2290 1717 -938 -1864 252 2287 1229 -1399
1351 -1399 -1850 501 2178 684 -1840 -1771 738 1994 109 -2200 -1639 929 1742 -443 -2473 -1415
1367 -1415 1147 1450 -965 -2618 -1133 1317 1117 -1434 -2653 -776 1482 799 -1824 -2560 -366 1601
1383 1601 457 -2092 -2342 95 1696 138 -2268 -2010 574 1742 -150 -2315 -1575 1045 1777 -414
1399 -414 -2271 -1070 1486 1736 -645 -2133 -519 1888 1645 -852 -1918 37 2207 1466 -1044 -1639
1415 -1639 581 2421 1253 -1184 -1314 1076 2528 989 -1317 -979 1504 2543 630 -1425 -641 1850
1431 1850 2413 244 -1516 -309 2094 2185 -189 -1597 -5 2226 1850 -637 -1616 296 2272 1434
1447 1434 -1070 -1613 569 2246 946 -1463 -1525 827 2110 434 -1819 -1377 1056 1918 -83 -2074
1463 -2074 -1188 1263 1690 -570 -2227 -922 1447 1386 -1008 -2293 -595 1577 1071 -1397 -2242 -242
1479 -242 1669 717 -1713 -2088 118 1719 365 -1949 -1846 496 1690 8 -2093 -1562 850 1640
1495 1640 -320 -2159 -1188 1169 1507 -650 -2153 -800 1443 1352 -943 -2079 -393 1675 1127 -1225
1511 -1225 -1936 15 1827 854 -1452 -1730 432 1911 550 -1648 -1488 819 1926 229 -1786 -1158
1527 -1158 1189 1848 -109 -1855 -820 1510 1741 -456 -1880 -439 1750 1514 -789 -1823 -56 1922
1543 1922 1247 -1104 -1712 323 2016 911 -1362 -1533 663 2024 578 -1572 -1295 1015 1974 212
1559 212 -1717 -1009 1304 1851 -146 -1795 -674 1555 1669 -479 -1797 -346 1745 1453 -800 -1730
1575 -1730 20 1891 1172 -1093 -1601 382 1975 853 -1330 -1413 731 1975 518 -1528 -1177 1035
1591 1035 1904 143 -1681 -911 1319 1762 -238 -1774 -612 1532 1540 -610 -1796 -300 1693 1267 -973
1608 -973 -1776 25 1781 938 -1281 -1678 329 1785 571 -1560 -1517 627 1747 194 -1774 -1308 914
1625 914 1640 -174 -1904 -1037 1161 1500 -532 -1952 -715 1389 1292 -857 -1921 -372 1554 1046 -1124
1642 -1124 -1814 3 1684 787 -1369 -1640 358 1735 488 -1547 -1422 689 1717 178 -1674 -1140
1658 -1140 1006 1646 -142 -1749 -836 1251 1496 -466 -1788 -515 1473 1303 -780 -1753 -197 1612
1674 1612 1038 -1087 -1663 130 1696 740 -1343 -1520 465 1715 422 -1548 -1325 765 1681 73
1690 73 -1710 -1069 1056 1576 -271 -1783 -765 1304 1420 -569 -1788 -435 1503 1216 -877 -1716 -88
1707 -88 1643 982 -1128 -1596 279 1756 705 -1318 -1372 623 1794 441 -1440 -1105 949 1763 155
1724 155 -1511 -816 1247 1685 -132 -1547 -491 1498 1535 -409 -1512 -150 1685 1335 -666 -1421 195
1741 195 1820 1101 -916 -1285 526 1875 807 -1137 -1115 816 1865 490 -1316 -934 1091 1765 128
1758 128 -1451 -702 1290 1602 -255 -1577 -459 1443 1352 -625 -1640 -227 1516 1018 -1002 -1655 -1
1775 -1 1530 668 -1350 -1613 222 1464 278 -1641 -1514 439 1349 -114 -1855 -1331 652 1210 -469
1792 -469 -1975 -1104 853 1055 -784 -1993 -810 1035 874 -1045 -1920 -456 1218 698 -1246 -1770 -86
1809 -86 1377 516 -1383 -1533 295 1492 338 -1446 -1230 699 1564 156 -1457 -890 1070 1588 -54
1826 -54 -1429 -515 1380 1535 -257 -1353 -140 1639 1421 -476 -1267 210 1799 1217 -707 -1156 545
1843 545 1892 955 -919 -1002 816 1878 627 -1126 -849 1044 1784 263 -1298 -660 1228 1605 -90
1860 -90 -1453 -486 1351 1352 -490 -1523 -271 1405 1066 -837 -1548 -79 1423 749 -1149 -1514 156
1877 156 1408 405 -1402 -1430 378 1353 62 -1593 -1246 598 1257 -246 -1701 -1024 817 1147 -518
1894 -518 -1730 -748 1034 1002 -761 -1687 -429 1203 862 -947 -1562 -52 1386 695 -1105 -1386 321
1911 321 1511 517 -1205 -1112 682 1583 313 -1260 -810 1028 1603 117 -1256 -482 1329 1550 -113
1928 -113 -1248 -174 1539 1420 -354 -1186 129 1693 1204 -607 -1128 395 1742 921 -870 -1052 616
1945 616 1681 593 -1101 -943 784 1558 226 -1318 -838 919 1372 -172 -1493 -703 1004 1124 -567
1962 -567 -1626 -562 1056 831 -916 -1692 -395 1055 538 -1226 -1691 -191 1065 228 -1471 -1601 39
1979 39 1038 -74 -1658 -1440 289 1007 -319 -1747 -1194 556 947 -553 -1762 -893 811 886 -732
1996 -732 -1666 -525 1068 826 -885 -1505 -125 1291 712 -972 -1279 272 1476 595 -1045 -1019 668
2013 668 1613 465 -1045 -702 1040 1655 313 -1024 -362 1364 1658 127 -978 -34 1611 1576 -49
2030 -49 -915 290 1780 1419 -259 -812 551 1847 1195 -472 -739 782 1851 904 -700 -652 937
2047 937 1756 559 -910 -562 1063 1564 181 -1120 -487 1119 1316 -207 -1286 -373 1149 1032 -613
2064 -613 -1420 -269 1128 689 -982 -1503 -147 1045 322 -1312 -1508 -6 974 -11 -1580 -1446 163
2081 163 868 -347 -1749 -1295 343 771 -649 -1839 -1094 526 656 -880 -1816 -809 712 538 -1078
2098 -1078 -1736 -477 888 396 -1198 -1562 -141 1040 282 -1278 -1345 199 1135 154 -1296 -1066 545
2115 545 1223 29 -1278 -761 857 1252 -113 -1223 -419 1133 1225 -263 -1135 -98 1367 1136 -399
2132 -399 -1013 214 1517 1009 -557 -882 526 1616 831 -678 -719 782 1634 598 -811 -552 1010
2149 1010 1581 332 -915 -363 1181 1461 60 -992 -176 1328 1290 -231 -1046 44 1395 1072 -497
2166 -497 -1032 228 1429 821 -747 -993 420 1415 537 -961 -898 617 1358 243 -1119 -765 757
2183 757 1238 -41 -1224 -606 911 1109 -319 -1282 -414 1024 928 -569 -1294 -205 1099 724 -803
2200 -803 -1270 -15 1124 491 -1027 -1198 177 1110 212 -1196 -1102 363 1041 -61 -1357 -980 512
2217 512 935 -337 -1466 -819 642 774 -621 -1529 -639 750 594 -862 -1537 -426 830 401 -1086
2234 -1086 -1478 -193 874 196 -1262 -1351 61 923 -9 -1361 -1150 330 962 -183 -1389 -906 585
2251 585 956 -334 -1342 -586 874 946 -442 -1229 -242 1119 919 -527 -1066 121 1334 872 -569
2268 -569 -842 451 1483 771 -619 -616 788 1585 643 -643 -390 1066 1607 481 -675 -155 1275 1549
2286 1549 280 -686 60 1434 1417 48 -721 233 1506 1212 -223 -731 383 1497 947 -493 -757
2303 -757 506 1413 613 -777 -750 601 1275 250 -1026 -743 644 1083 -126 -1247 -699 690 844
2320 844 -482 -1405 -613 700 590 -807 -1492 -490 719 339 -1098 -1510 -335 718 93 -1304 -1443
2337 -1443 -151 702 -133 -1430 -1309 63 705 -326 -1496 -1105 294 693 -478 -1471 -838 532 688
2354 688 -592 -1396 -534 774 656 -672 -1251 -203 982 617 -726 -1058 128 1144 541 -764 -844
2371 -844 446 1265 449 -799 -627 731 1316 293 -819 -387 969 1299 116 -831 -160 1143 1205 -71
2389 -71 -833 36 1259 1048 -304 -832 227 1312 844 -510 -803 402 1295 592 -720 -733 551 1243
2407 1243 328 -886 -644 688 1148 63 -1016 -535 802 1024 -194 -1072 -372 903 881 -412 -1078
2424 -1078 -165 1006 731 -604 -1043 33 1070 552 -736 -951 242 1092 380 -859 -824 440 1080
2441 1080 188 -955 -682 619 1038 -32 -1021 -521 744 948 -242 -1073 -342 870 783 -476 -1092 -174
2459 -174 925 604 -688 -1091 -23 939 383 -894 -1040 123 905 150 -1064 -984 276 856 -109 -1206
2477 -1206 -852 423 769 -353 -1297 -706 548 641 -572 -1314 -520 658 511 -741 -1270 -304 770 390
2495 390 -869 -1181 -64 874 269 -952 -1008 199 933 154 -988 -796 456 989 40 -969 -556 699
2513 699 1006 -52 -927 -285 945 1002 -155 -825 -13 1132 968 -242 -723 257 1282 876 -340 -591
2531 -591 507 1366 760 -429 -443 732 1404 566 -520 -322 899 1348 366 -629 -190 1033 1232 119
2549 119 -712 -65 1080 1053 -150 -787 41 1094 815 -421 -869 122 1062 556 -684 -883 200 958
2567 958 256 -932 -911 257 826 -67 -1129 -871 312 684 -338 -1268 -796 382 508 -588 -1352 -689
2585 -689 439 375 -794 -1363 -516 510 234 -965 -1300 -321 585 107 -1053 -1166 -87 664 -16 -1098
2603 -1098 -997 163 732 -107 -1096 -767 427 777 -206 -1049 -513 673 783 -292 -963 -236 872 774
2621 774 -364 -836 58 1047 728 -420 -699 334 1159 637 -489 -535 570 1239 507 -548 -389 775
2639 775 1249 350 -595 -205 942 1196 181 -639 -50 1044 1084 -15 -676 83 1109 925 -230 -696
2657 -696 203 1109 724 -436 -684 319 1086 485 -644 -661 390 987 235 -813 -638 468 870 -36
2675 -36 -949 -580 526 726 -292 -1071 -492 568 557 -539 -1141 -390 600 376 -757 -1151 -261 615 183
2694 183 -927 -1115 -121 637 25 -1048 -1011 63 637 -138 -1103 -860 256 626 -289 -1126 -662 458 612
2713 612 -392 -1091 -434 641 589 -487 -1001 -177 798 538 -568 -863 85 938 470 -602 -705 350
2731 350 1025 400 -626 -519 567 1076 294 -636 -330 771 1076 174 -638 -148 927 1036 30 -640
2749 -640 24 1035 934 -140 -607 185 1096 790 -293 -598 322 1093 594 -451 -550 431 1057 382 -624
2768 -624 -509 528 984 151 -764 -461 605 855 -91 -874 -373 657 689 -340 -947 -270 679 521 -553
2787 -553 -972 -164 706 342 -732 -961 -11 713 156 -871 -882 142 707 -14 -950 -769 294 686 -158
2806 -158 -1001 -611 446 646 -294 -994 -428 593 585 -410 -937 -234 700 523 -512 -876 -45 802 407 -607
2826 -607 -794 155 848 299 -695 -679 332 862 139 -779 -547 476 817 -28 -830 -435 584 729 -202
2845 -202 -871 -311 672 614 -392 -890 -169 719 493 -541 -863 -22 760 322 -693 -808 136 772 173
2864 173 -770 -710 298 770 22 -846 -552 458 766 -106 -841 -379 633 733 -212 -815 -174 776 682 -292
2884 -292 -727 52 908 636 -358 -613 264 999 547 -417 -475 473 1064 448 -464 -330 657 1073 323 -496
2904 -496 -201 794 1044 186 -528 -70 887 947 15 -576 49 942 799 -188 -590 145 947 617 -380 -619
2924 -619 228 897 396 -572 -627 286 806 141 -767 -622 315 683 -120 -934 -600 350 523 -379 -1060 -556
2944 -556 373 360 -589 -1122 -476 379 177 -793 -1140 -357 393 17 -945 -1098 -225 416 -108 -1023 -984 -35 451
2965 451 -217 -1051 -832 146 480 -287 -1026 -632 338 507 -344 -941 -377 544 528 -376 -815 -109 747 556
2985 556 -379 -652 162 891 539 -379 -481 395 1021 489 -379 -316 616 1070 410 -396 -159 786 1073 281
3005 281 -422 -2 912 1014 133 -445 116 985 882 -58 -477 226 1009 721 -230 -493 303 973 517 -415
3025 -415 -508 381 903 294 -584 -467 435 790 65 -732 -435 481 687 -152 -818 -379 519 543 -351 -874 -271
3046 -271 558 403 -513 -892 -179 565 262 -665 -860 -57 580 120 -760 -794 87 570 -19 -840 -696 229
3066 229 556 -154 -887 -567 336 513 -294 -905 -429 447 441 -417 -906 -296 523 358 -532 -846 -133 600 268
3087 268 -629 -776 54 642 156 -696 -660 219 664 50 -744 -519 388 687 -49 -726 -357 545 665 -162
3107 -162 -720 -195 660 627 -240 -657 1 784 563 -326 -577 188 865 485 -385 -481 347 913 399 -427 -358
3128 -358 509 938 293 -471 -239 658 908 156 -500 -105 753 841 18 -515 -5 819 747 -129 -528 118 853
3149 853 610 -286 -515 216 853 441 -429 -513 307 801 260 -561 -485 360 725 53 -701 -444 411 613 -148
3170 -148 -785 -398 435 471 -368 -871 -336 433 312 -555 -910 -242 449 162 -720 -921 -144 444 -7 -837
3190 -837 -857 -37 431 -147 -917 -751 107 417 -261 -947 -634 229 387 -354 -925 -458 381 392 -416 -845 -254
3211 -254 513 373 -464 -738 -39 639 357 -473 -612 171 748 316 -475 -447 377 824 262 -465 -281 563
3231 563 855 200 -438 -132 719 852 102 -442 27 820 790 -12 -421 150 882 692 -146 -402 267 890
3251 890 549 -293 -397 362 873 355 -412 -368 436 808 182 -532 -332 489 705 -25 -649 -273 506 569 -205
3272 -205 -702 -221 553 430 -386 -749 -139 544 297 -530 -752 -47 533 161 -633 -717 52 523 29 -728
3292 -728 -628 167 510 -111 -790 -539 283 478 -213 -802 -412 373 439 -330 -778 -261 483 376 -419 -746
3312 -746 -112 551 308 -486 -648 58 628 239 -524 -552 229 661 140 -575 -428 376 679 55 -574 -285
3332 -285 508 665 -56 -576 -154 615 609 -145 -555 -10 692 533 -248 -518 116 739 434 -361 -475 233 762
3353 762 310 -439 -416 351 743 181 -496 -327 456 700 41 -566 -262 501 614 -107 -607 -176 556 506 -255
3374 -255 -641 -99 585 383 -402 -638 -13 575 248 -524 -622 72 558 121 -619 -568 170 524 -33 -715 -520
3395 -520 241 460 -180 -758 -435 333 431 -295 -776 -314 411 344 -420 -750 -160 470 266 -493 -687 -27 538
3416 538 185 -552 -578 134 582 119 -579 -484 283 613 28 -582 -327 439 616 -36 -559 -184 571 601 -105
3437 -105 -521 -17 674 551 -186 -480 116 749 499 -253 -397 241 770 399 -331 -346 356 757 279 -402
3457 -402 -282 445 720 137 -454 -217 518 654 -1 -526 -163 551 539 -177 -580 -84 565 431 -323 -599
3477 -599 -15 557 265 -461 -594 67 541 135 -577 -564 146 509 -10 -656 -510 234 466 -139 -694 -416
3497 -416 324 411 -254 -706 -296 406 360 -351 -694 -163 479 296 -429 -634 -24 529 228 -474 -553 123 580
3518 580 168 -515 -455 267 602 93 -518 -324 400 625 10 -515 -201 510 581 -62 -495 -68 592 540 -151
3539 -151 -475 42 645 460 -244 -455 139 669 342 -346 -419 240 648 205 -446 -378 300 598 55 -549 -338
3560 -338 344 518 -115 -619 -276 400 406 -248 -668 -227 417 295 -397 -686 -145 411 169 -532 -673 -57 413
3581 413 52 -615 -625 49 404 -54 -672 -548 151 395 -142 -687 -413 278 399 -204 -657 -272 396 405 -243
3602 -243 -599 -113 509 392 -301 -502 52 611 359 -308 -422 218 688 312 -334 -294 363 712 257 -336
3622 -336 -189 496 723 160 -358 -73 599 701 64 -362 14 641 619 -48 -369 105 690 511 -166 -372
3642 -372 180 671 384 -295 -369 231 639 231 -399 -354 292 579 65 -511 -333 332 499 -80 -577 -275 358
3663 358 393 -235 -638 -232 377 297 -365 -660 -152 390 183 -484 -652 -81 378 73 -572 -626 17 375 -27
3684 -27 -629 -552 95 376 -131 -686 -463 199 336 -210 -687 -349 274 309 -288 -661 -233 356 271 -365 -620
3705 -620 -107 445 229 -402 -542 44 494 171 -435 -438 183 554 122 -462 -323 326 557 55 -452 -192 451
3726 451 549 -8 -417 -75 545 532 -93 -397 36 611 482 -166 -367 156 658 393 -248 -329 242 650 294
3747 294 -330 -288 329 629 168 -382 -237 385 579 54 -432 -194 442 511 -77 -472 -126 463 407 -198 -517
3768 -517 -68 470 316 -314 -523 -6 465 209 -411 -497 75 453 91 -505 -455 149 440 -19 -569 -404 215
3789 215 389 -125 -601 -329 279 348 -237 -604 -228 330 273 -327 -612 -119 397 211 -406 -543 -10 428 141
3810 141 -468 -495 101 450 60 -501 -400 215 450 -7 -492 -287 312 471 -68 -488 -181 429 439 -126 -454
3831 -454 -59 502 417 -182 -407 60 567 362 -234 -353 177 596 292 -283 -291 276 603 195 -329 -235 353
3852 353 584 95 -368 -175 430 531 -6 -406 -101 475 452 -116 -438 -39 482 358 -253 -447 23 487
3872 487 244 -349 -458 82 458 123 -434 -431 143 433 12 -518 -368 214 375 -106 -561 -306 261 332 -210
3893 -210 -568 -230 310 274 -290 -563 -134 378 219 -371 -532 -14 413 155 -416 -475 77 431 87 -447 -389
3914 -389 183 453 18 -464 -303 280 435 -54 -476 -214 356 415 -108 -452 -98 418 376 -198 -427 -8 471
3935 471 329 -261 -394 90 509 255 -321 -345 193 519 151 -370 -284 269 494 60 -411 -225 333 464 -43
3956 -43 -438 -149 396 406 -144 -439 -88 427 331 -250 -444 -18 444 239 -323 -425 69 440 153 -385 -396
3977 -396 151 436 66 -442 -339 219 418 -37 -477 -265 281 383 -114 -492 -187 345 342 -201 -466 -94 400
3998 400 286 -276 -448 -3 444 222 -331 -405 95 445 146 -375 -351 198 453 65 -399 -275 273 450 4
4019 4 -423 -197 355 431 -73 -424 -98 415 387 -143 -408 -6 468 328 -214 -368 87 490 257 -288 -343 172
4041 172 493 169 -336 -272 252 479 84 -362 -209 325 460 -14 -412 -158 379 393 -107 -426 -95 402 337
4062 337 -192 -430 -23 407 246 -287 -435 35 415 151 -375 -407 98 392 50 -445 -380 146 361 -44 -497
4083 -497 -312 196 323 -139 -526 -262 257 273 -231 -526 -189 302 210 -297 -519 -93 322 151 -370 -488 -3
4104 -3 359 83 -407 -415 88 372 30 -442 -338 182 378 -35 -434 -233 281 368 -96 -436 -141 359 356 -153
4126 -153 -385 -19 431 320 -189 -358 73 481 268 -240 -298 170 510 220 -269 -236 264 517 143 -301 -175
4147 -175 347 510 66 -315 -95 402 467 7 -319 -31 442 415 -70 -321 42 471 339 -166 -329 102 462
4168 462 259 -249 -324 138 443 139 -333 -301 182 405 27 -413 -273 219 350 -76 -459 -236 249 280 -193
4189 -193 -497 -196 269 202 -303 -506 -140 278 133 -368 -481 -50 308 66 -421 -449 35 309 0 -456 -376
4210 -376 118 314 -57 -459 -287 201 324 -105 -445 -183 299 315 -148 -410 -68 382 298 -175 -341 43 445
4231 445 281 -202 -292 135 484 242 -227 -243 229 484 174 -267 -191 301 493 93 -295 -118 358 452 9
4252 9 -316 -77 396 391 -82 -334 -13 416 310 -173 -349 41 421 229 -265 -344 91 406 138 -336 -316 133
4274 133 369 29 -402 -298 179 323 -77 -447 -249 223 266 -162 -480 -190 253 215 -256 -473 -118 279 151
4295 151 -309 -445 -52 303 104 -368 -411 31 317 39 -390 -353 110 322 -17 -417 -284 185 319 -75 -422
4316 -422 -189 278 319 -122 -381 -96 344 292 -161 -343 10 416 282 -190 -307 101 456 234 -207 -250 204
4337 204 473 180 -236 -182 284 475 114 -273 -105 342 455 44 -281 -49 398 407 -41 -290 -2 423 335
4358 335 -124 -295 48 420 255 -225 -311 92 384 134 -299 -308 137 367 41 -375 -281 150 305 -65 -420
4379 -420 -262 188 264 -145 -444 -208 213 213 -230 -471 -143 241 158 -297 -440 -65 280 100 -355 -393 10 301
4401 301 61 -367 -354 83 314 16 -397 -291 175 331 -48 -383 -194 242 309 -98 -378 -106 316 306 -143
4422 -143 -352 -17 363 271 -170 -304 67 408 222 -223 -257 158 430 160 -260 -196 237 433 90 -283 -138
4443 -138 285 396 10 -291 -89 343 371 -52 -290 -16 387 307 -117 -302 29 386 273 -188 -291 93 397
4464 397 188 -263 -271 130 381 88 -306 -252 182 344 -4 -362 -228 209 302 -88 -401 -186 241 239 -174 -407
4486 -407 -125 263 190 -239 -402 -69 289 126 -308 -389 -1 300 63 -341 -341 80 296 4 -382 -294 141 285
4508 285 -50 -393 -212 201 284 -108 -392 -132 275 264 -152 -358 -52 341 233 -189 -310 34 371 202 -226
4529 -226 -272 123 390 132 -249 -212 178 394 92 -261 -171 243 385 32 -285 -105 308 362 -38 -299 -52
4550 -52 341 308 -111 -293 2 365 245 -173 -301 55 372 190 -237 -278 109 367 114 -291 -253 171 342
4571 342 24 -326 -213 211 331 -38 -346 -154 243 269 -115 -349 -97 274 225 -196 -357 -33 308 168 -247
4592 -247 -326 29 316 120 -288 -307 93 330 43 -327 -255 165 297 -11 -332 -209 209 294 -84 -343 -134
4613 -134 259 265 -132 -335 -73 304 210 -160 -323 10 330 180 -218 -300 88 354 130 -256 -258 139 345 74
4635 74 -304 -210 195 347 18 -308 -160 249 305 -62 -318 -94 289 280 -120 -315 -27 325 244 -178 -299 37
4657 37 335 173 -232 -279 91 343 109 -271 -243 147 309 31 -318 -210 193 288 -36 -342 -165 214 254 -115
4679 -115 -363 -118 257 214 -178 -355 -61 268 152 -244 -336 -5 295 107 -282 -308 61 301 49 -323 -267
4700 -267 124 297 -2 -339 -209 186 278 -53 -344 -144 241 262 -103 -329 -72 292 244 -143 -304 0 337
4721 337 208 -187 -269 80 359 158 -215 -227 148 369 110 -239 -169 223 369 60 -258 -125 280 346 7
4742 7 -265 -61 312 321 -65 -275 8 344 245 -127 -261 39 345 199 -177 -259 92 347 132 -243 -231 146
4764 146 335 60 -275 -191 189 304 -20 -319 -152 219 274 -96 -336 -124 237 217 -160 -333 -76 249 171
4785 171 -227 -340 -21 264 118 -264 -317 45 272 38 -323 -308 90 256 -30 -374 -260 120 237 -101 -374
4806 -374 -206 169 211 -149 -380 -145 201 179 -197 -359 -62 254 150 -225 -321 21 295 121 -241 -268 86
4827 86 322 79 -267 -193 178 325 39 -255 -132 252 341 7 -245 -62 305 319 -27 -227 11 353 293 -79
4849 -79 -217 83 378 256 -116 -190 132 373 185 -168 -191 189 361 116 -219 -144 220 337 45 -264 -134
4870 -134 235 289 -39 -307 -110 234 237 -133 -322 -73 245 167 -210 -335 -43 252 105 -262 -327 9 239 42
4892 42 -325 -313 46 234 -26 -347 -267 100 220 -97 -371 -208 153 195 -136 -373 -163 189 182 -186 -357 -80
4914 -80 234 134 -223 -325 -4 255 110 -252 -271 62 294 78 -254 -217 141 316 43 -247 -162 212 314
4935 314 3 -251 -75 278 305 -32 -246 -18 321 276 -63 -222 48 353 251 -102 -198 118 371 208 -139
4956 -139 -176 164 382 151 -184 -140 203 373 77 -224 -111 238 312 -8 -248 -86 255 253 -84 -287 -57 254
4978 254 184 -171 -303 -28 240 125 -240 -307 -7 227 41 -306 -303 26 217 -29 -343 -287 70 199 -85 -358
5000 -358 -238 109 173 -143 -375 -184 153 148 -190 -363 -112 205 135 -213 -318 -40 250 126 -231 -286 37 286
5022 286 89 -234 -235 125 303 59 -238 -161 195 309 19 -239 -100 248 293 -3 -233 -29 310 285 -71 -225
5044 -225 16 317 235 -101 -212 83 344 189 -156 -185 126 334 126 -204 -153 167 318 68 -230 -134 214
5065 214 302 3 -243 -86 231 263 -56 -259 -58 258 222 -131 -268 -9 274 165 -180 -249 32 272 112
5086 112 -232 -247 86 280 54 -260 -223 124 260 -5 -290 -177 149 235 -64 -303 -141 184 206 -130 -319
5107 -319 -94 199 154 -162 -305 -41 228 102 -209 -282 22 253 95 -242 -249 64 263 34 -263 -208 137 255
5129 255 -10 -278 -152 178 234 -44 -271 -99 220 215 -93 -270 -35 258 188 -140 -251 30 287 161 -171
5150 -171 -227 78 279 115 -201 -190 141 292 60 -236 -169 169 283 5 -238 -109 204 237 -34 -249 -67
5171 -67 249 218 -102 -253 -22 264 184 -139 -236 34 276 144 -188 -219 80 282 84 -219 -187 137 284 32
5193 32 -235 -162 171 265 -18 -259 -110 213 238 -71 -271 -61 239 189 -123 -255 -20 260 162 -159 -244 30
5215 30 259 100 -209 -225 84 251 48 -233 -190 128 260 1 -262 -158 166 216 -50 -283 -106 190 202 -115
5237 -115 -284 -75 223 166 -149 -282 -17 234 130 -193 -251 35 249 96 -226 -229 71 239 48 -239 -184 137
5259 137 252 11 -235 -133 187 246 -38 -242 -88 232 230 -85 -247 -29 257 188 -113 -233 33 269 162
5280 162 -156 -215 78 296 106 -190 -178 131 282 57 -223 -153 147 268 -13 -238 -105 190 232 -66 -250
5301 -250 -69 215 187 -118 -272 -35 226 141 -163 -238 17 241 99 -202 -229 54 244 49 -239 -205 105 241
5323 241 16 -248 -158 148 219 -33 -252 -118 175 212 -78 -254 -85 205 179 -126 -259 -23 240 151 -160 -246
5345 -246 27 262 113 -196 -204 72 264 64 -214 -194 123 250 18 -232 -141 168 233 -44 -243 -91 204 201
5367 201 -75 -246 -48 231 185 -116 -240 3 241 151 -155 -206 42 244 102 -187 -197 96 253 72 -213
5388 -213 -162 145 251 17 -219 -110 195 240 -35 -234 -70 214 220 -72 -236 -34 231 176 -122 -231 13 240
5410 240 131 -180 -225 33 236 88 -224 -205 87 231 37 -247 -185 117 208 -23 -266 -151 150 203 -73 -275
5432 -275 -116 178 171 -132 -274 -55 208 135 -165 -259 1 230 99 -196 -225 54 228 75 -222 -184 90 239
5454 239 24 -219 -132 164 243 -12 -213 -96 186 226 -46 -214 -37 221 200 -86 -213 11 254 158 -126 -193
5476 -193 58 255 131 -153 -177 96 252 80 -182 -155 137 248 25 -217 -133 163 221 -19 -236 -104 176
5497 176 195 -80 -242 -57 211 161 -128 -245 -22 224 119 -171 -238 26 214 77 -196 -205 71 220 32 -217
5519 -217 -165 99 214 -19 -248 -132 148 203 -62 -250 -95 182 175 -96 -230 -48 199 156 -131 -239 -3 218
5541 218 120 -167 -213 43 232 83 -185 -175 96 250 49 -199 -140 149 227 8 -205 -92 182 227 -22 -217
5563 -217 -42 223 214 -70 -201 -2 248 189 -106 -198 36 253 150 -138 -189 79 253 98 -165 -159 98 231
5585 231 28 -203 -138 135 216 -25 -239 -124 149 181 -80 -259 -93 174 143 -141 -274 -66 181 89 -187 -267
5607 -267 -28 179 53 -220 -230 27 169 5 -244 -213 64 192 -23 -241 -156 111 187 -47 -222 -109 161
5628 161 183 -73 -225 -49 206 176 -90 -193 13 248 166 -101 -170 75 280 141 -123 -137 132 290 114 -129
5650 -129 -93 170 281 64 -144 -72 201 255 19 -173 -31 240 228 -38 -183 -7 229 182 -90 -196 23 224
5672 224 141 -140 -199 43 228 74 -191 -189 58 195 15 -222 -177 80 173 -39 -244 -145 123 158 -84 -257 -114
5695 -114 138 121 -124 -261 -72 159 97 -163 -245 -25 171 68 -200 -235 24 191 44 -203 -194 63 200 16
5717 16 -213 -158 111 205 -11 -213 -102 161 198 -38 -199 -54 198 188 -77 -189 -8 221 159 -100 -180 44
5739 44 273 117 -135 -151 92 249 92 -148 -121 127 253 60 -157 -95 163 232 11 -186 -55 190 201 -34
5761 -34 -193 -43 197 174 -83 -203 -2 210 127 -147 -186 11 206 88 -179 -201 50 183 31 -206 -170 81
5783 81 181 -17 -244 -143 105 160 -58 -251 -124 134 152 -106 -239 -71 159 116 -131 -222 -21 184 105 -151
5805 -151 -218 24 205 80 -171 -175 79 225 50 -169 -122 130 220 27 -179 -87 167 215 -9 -179 -41 202
5827 202 196 -59 -175 -16 231 161 -79 -174 26 227 136 -128 -169 49 221 80 -160 -154 102 211 25 -189 -129
5850 -129 113 191 -25 -218 -124 132 160 -73 -226 -89 152 134 -123 -234 -44 168 97 -146 -214 -7 174 79
5872 79 -176 -197 31 191 43 -196 -168 65 188 14 -206 -133 123 186 -22 -187 -77 161 182 -37 -201 -36
5894 -36 190 166 -74 -180 -12 215 146 -100 -172 37 214 109 -126 -164 87 228 72 -147 -127 115 208 24
5916 24 -175 -99 139 182 -19 -202 -67 159 172 -47 -192 -36 184 131 -102 -193 -2 196 112 -134 -188 28 191
5939 191 73 -159 -175 71 183 22 -193 -143 106 190 -8 -198 -118 124 182 -32 -206 -87 152 160 -93 -209
5961 -209 -50 164 117 -118 -197 -16 171 88 -153 -199 31 185 51 -179 -173 66 182 30 -185 -156 100 174 -12
5984 -12 -198 -114 119 173 -52 -205 -72 158 140 -86 -193 -28 183 123 -114 -196 1 193 93 -136 -163 51
6006 51 201 62 -159 -133 101 196 29 -163 -100 124 189 -6 -179 -71 161 185 -31 -174 -30 196 170 -68
6028 -68 -187 -10 199 125 -101 -174 29 208 100 -127 -145 60 200 67 -158 -131 99 199 30 -179 -120 122
6050 122 185 -8 -184 -73 155 172 -47 -187 -39 180 154 -76 -166 14 188 131 -105 -161 29 207 93 -133
6072 -133 -136 81 204 62 -148 -122 101 192 17 -178 -104 128 171 -34 -186 -73 143 135 -64 -191 -37 155 107
6095 107 -108 -197 -15 157 55 -149 -209 3 156 31 -180 -168 38 156 7 -197 -150 68 148 -27 -202 -119
6117 -119 111 142 -60 -201 -84 123 141 -88 -200 -39 150 116 -101 -185 0 186 93 -129 -159 47 192 75
6139 75 -143 -129 81 189 35 -141 -93 132 191 3 -165 -72 144 168 -23 -167 -36 173 156 -65 -156 -4 180
6162 180 126 -77 -160 35 198 96 -114 -142 60 193 62 -133 -111 103 187 31 -156 -89 127 183 9 -163
6184 -163 -60 161 170 -39 -161 -30 160 136 -67 -159 3 183 114 -104 -162 30 185 72 -133 -158 56 177
6206 177 32 -168 -137 78 167 -3 -191 -107 94 144 -42 -197 -104 111 124 -88 -201 -72 129 98 -114 -202 -37
6229 -37 148 73 -149 -184 5 146 45 -157 -164 30 159 20 -171 -119 87 157 15 -168 -85 127 165 -12 -147
6252 -147 -45 170 175 -36 -150 4 200 146 -59 -128 47 206 124 -71 -127 62 210 86 -110 -110 87 202 53
6275 53 -126 -89 119 195 8 -155 -81 129 165 -28 -171 -51 146 124 -75 -186 -35 152 99 -117 -183 -7 139
6298 139 51 -152 -178 17 127 18 -176 -158 36 131 -19 -200 -151 67 118 -45 -186 -113 87 109 -80 -193 -64
6321 -64 132 94 -88 -181 -19 138 81 -106 -170 16 155 61 -119 -134 42 173 56 -135 -112 101 181 32 -136
6344 -136 -70 132 173 10 -122 -42 167 178 -19 -117 8 195 177 -31 -116 51 215 151 -47 -101 64 208 114
6367 114 -81 -86 107 213 77 -104 -80 109 203 36 -129 -61 121 164 -13 -145 -52 133 129 -61 -160 -35 145
6390 145 102 -99 -177 -22 135 60 -138 -182 -5 108 17 -182 -177 18 113 -19 -194 -157 40 108 -52 -214 -135 69
6414 69 107 -81 -201 -93 90 90 -86 -183 -49 129 89 -95 -154 -3 157 80 -103 -134 41 175 66 -102 -103 95
6438 95 190 53 -116 -62 134 198 26 -107 -36 152 183 5 -116 -6 191 167 -17 -104 31 185 144 -45 -119
6461 -119 53 181 93 -80 -101 70 179 67 -119 -93 91 165 16 -147 -91 101 146 -13 -160 -78 98 123 -70
6484 -70 -170 -50 108 85 -90 -183 -36 124 60 -131 -163 7 133 51 -142 -163 15 141 13 -162 -137 52 136
6507 136 -13 -159 -110 85 125 -37 -171 -88 98 122 -63 -165 -42 131 98 -80 -154 -5 147 94 -95 -137 39
6530 39 167 59 -118 -103 59 176 44 -119 -87 91 157 15 -126 -52 119 146 -7 -137 -30 138 134 -19 -111
6553 -111 5 171 124 -45 -108 36 169 110 -74 -91 68 176 78 -93 -74 89 167 43 -118 -74 118 157 19
6576 19 -125 -63 119 144 -31 -145 -29 136 122 -47 -143 -30 136 97 -93 -145 -3 127 57 -124 -138 19 124
6599 124 13 -146 -141 34 110 -10 -173 -118 62 107 -42 -175 -102 80 87 -66 -171 -70 90 90 -95 -174 -24 113
6623 113 57 -105 -154 -5 132 44 -125 -127 35 122 29 -141 -103 61 129 8 -130 -89 92 127 -15 -137 -52 132
6647 132 138 -33 -133 -18 134 121 -48 -111 8 153 106 -75 -113 39 165 79 -93 -91 73 173 55 -92 -70
6670 -70 112 171 41 -109 -46 123 153 15 -104 -31 141 148 -15 -112 -4 148 123 -44 -112 20 162 96 -75 -117
6694 -117 35 139 56 -110 -102 50 137 16 -138 -94 53 113 -22 -168 -97 56 90 -61 -169 -86 72 65 -93 -183
6718 -183 -70 85 45 -130 -179 -45 85 23 -145 -163 -23 91 -3 -147 -148 15 93 -11 -162 -112 48 99 -31
6741 -31 -153 -74 83 116 -32 -143 -29 122 112 -41 -111 7 154 122 -41 -98 52 164 102 -56 -82 79 184
6764 184 89 -70 -49 112 174 56 -88 -34 122 165 27 -91 -20 146 148 -5 -104 -9 148 123 -35 -104 8 144
6788 144 100 -61 -93 32 152 69 -87 -102 48 140 39 -102 -84 69 117 0 -127 -78 89 115 -24 -136 -69
6811 -69 88 88 -53 -154 -42 101 51 -102 -139 -36 109 41 -118 -151 -20 95 19 -153 -142 15 94 -17 -150
6834 -150 -124 42 91 -31 -161 -103 54 78 -63 -160 -80 75 72 -71 -147 -36 100 75 -79 -130 1 124 65 -73
6858 -73 -97 40 145 64 -86 -77 70 145 48 -87 -33 104 147 38 -84 -22 136 147 19 -84 -2 146 138 -3 -81
6883 -81 33 140 121 -38 -90 34 158 84 -63 -94 57 148 53 -99 -80 70 130 13 -122 -89 67 118 -25 -131
6907 -131 -70 72 93 -52 -142 -47 92 85 -69 -140 -16 97 55 -91 -127 -7 96 26 -106 -129 17 104 19 -118
6931 -118 -119 43 105 -7 -127 -87 78 105 -32 -123 -61 85 97 -50 -129 -28 100 71 -60 -108 -15 115 68 -81
6955 -81 -100 26 128 57 -80 -98 63 139 39 -96 -65 70 136 11 -99 -39 106 129 8 -99 -22 121 118 -24
6979 -24 -109 4 134 101 -40 -90 35 134 81 -53 -95 33 137 56 -81 -82 62 133 30 -107 -79 70 118 -13
7003 -13 -119 -57 81 93 -45 -137 -56 86 69 -74 -137 -44 70 48 -100 -134 -17 72 26 -121 -136 -5 69 -6 -128
7028 -128 -119 14 90 -20 -130 -89 30 83 -30 -135 -70 69 90 -44 -130 -44 95 77 -51 -124 -7 107 76 -53
7052 -53 -89 16 124 77 -76 -78 48 138 61 -78 -53 71 139 33 -74 -39 102 129 5 -91 -43 108 118 1 -89
7077 -89 -11 121 102 -43 -97 12 116 69 -72 -91 23 127 43 -80 -86 37 112 18 -92 -72 53 102 -2 -94 -63
7102 -63 71 101 -33 -115 -55 79 87 -50 -111 -30 78 67 -58 -117 -7 101 43 -76 -117 23 113 37 -77 -99 31
7127 31 102 11 -100 -80 60 100 2 -93 -69 76 103 -22 -120 -46 97 84 -31 -113 -28 102 64 -63 -90 -3 103 54
7153 54 -85 -95 34 112 43 -79 -71 45 116 19 -100 -49 71 105 7 -89 -42 86 107 -17 -92 -16 107 94 -22 -88
7179 -88 1 118 92 -46 -79 27 119 62 -67 -73 44 115 38 -90 -71 51 97 3 -87 -67 71 97 -11 -108 -63 63
7205 63 74 -41 -127 -56 70 43 -63 -121 -25 77 45 -89 -125 -21 71 31 -97 -102 12 92 10 -115 -86 30 79 0
7231 0 -112 -74 52 94 -29 -119 -45 72 82 -49 -98 -22 85 70 -52 -99 0 90 65 -56 -82 23 109 52 -55 -63
7257 -63 49 112 22 -68 -50 65 119 19 -78 -40 89 111 1 -84 -20 94 101 -7 -80 7 105 77 -33 -72 27 110 77
7284 77 -56 -63 40 123 58 -49 -53 67 121 43 -63 -35 69 107 18 -77 -26 96 105 -6 -82 -26 97 82 -27 -79 1
7311 1 96 75 -56 -90 5 94 49 -83 -98 19 78 4 -96 -80 21 65 -22 -125 -94 27 55 -47 -128 -86 31 38 -63
7338 -63 -126 -68 37 21 -78 -129 -33 53 21 -75 -105 -4 72 35 -76 -84 20 96 14 -93 -76 41 95 11 -96 -43 72
7365 72 109 6 -71 -14 104 106 -6 -71 9 120 94 -20 -58 26 127 85 -20 -44 50 122 68 -38 -43 64 116 43 -48
7392 -48 -36 82 125 25 -62 -25 86 103 -3 -64 -23 80 81 -29 -86 -23 92 71 -40 -82 -1 86 54 -58 -88 17
7418 17 102 28 -82 -79 27 70 -5 -91 -68 44 64 -10 -96 -61 44 54 -37 -117 -62 47 49 -61 -114 -39 44 27 -78 -113
7446 -113 -25 59 22 -85 -98 5 58 1 -102 -88 17 72 -9 -104 -68 38 69 -21 -104 -44 57 76 -18 -76 -20 84
7472 84 77 -21 -74 8 97 78 -19 -62 31 112 72 -31 -41 47 123 54 -48 -21 78 117 53 -35 -11 92 113 20 -50 -3 106
7501 106 89 -11 -59 6 88 72 -34 -69 3 97 49 -52 -68 9 93 37 -67 -76 22 86 5 -87 -81 33 72 -11 -89 -58
7529 -58 32 61 -37 -101 -48 51 39 -54 -96 -31 64 49 -56 -96 -5 62 24 -66 -85 6 70 18 -73 -78 34 83 18 -87 -55
7558 -55 43 77 8 -74 -40 49 72 -14 -76 -31 58 54 -24 -90 -6 64 61 -56 -72 1 86 51 -45 -55 37 89 29 -68 -58 43
7588 43 87 21 -63 -28 56 89 -2 -67 -27 70 71 -13 -66 -15 76 68 -26 -66 -5 78 51 -51 -69 15 89 40 -56 -66 30 79 10
7619 10 -80 -62 35 71 -9 -79 -45 33 61 -19 -91 -49 45 57 -42 -94 -22 62 47 -45 -92 -18 65 38 -62 -84 6 71 22 -58
7649 -58 -59 33 86 29 -63 -53 49 88 17 -58 -34 59 95 10 -42 1 81 84 7 -52 12 90 81 -14 -45 16 110 67 -29 -46 37
7680 37 97 52 -39 -42 63 100 32 -46 -35 57 96 10 -58 -20 54 79 -14 -92 -25 53 44 -44 -79 -24 57 46 -49 -83 -12 45 20
7711 20 -77 -66 0 51 11 -82 -65 20 48 -7 -69 -64 21 51 -21 -87 -37 47 51 -28 -85 -30 57 52 -32 -78 -5 73 51 -44 -70 16
7743 16 64 43 -63 -56 19 80 23 -47 -41 33 68 16 -63 -40 53 66 -1 -64 -24 54 70 -15 -75 -10 61 59 -25 -63 -7 55 49 -38
7775 -38 -52 12 66 38 -40 -52 37 86 23 -57 -42 43 66 3 -56 -29 56 67 -2 -50 -13 78 61 -10 -61 11 76 49 -26 -67
7805 -67 10 78 46 -37 -59 28 68 25 -55 -47 24 72 14 -55 -37 43 53 0 -70 -42 36 52 -22 -87 -36 54 52 -31 -73 -12 58
7836 58 43 -42 -56 -3 58 28 -53 -65 11 64 24 -62 -56 35 72 12 -62 -42 49 74 3 -65 -11 56 60 -9 -59 -19 61 55 -36 -54
7868 -54 -5 77 35 -49 -71 7 68 25 -56 -58 20 65 12 -62 -43 26 64 7 -69 -36 31 59 -8 -69 -30 50 53 -35 -59 -11 52
7899 52 51 -42 -64 -8 60 45 -42 -37 16 70 34 -43 -39 32 81 21 -41 -23 50 72 17 -41 -30 59 72 1 -51 -14 63 62 -10 -56
7931 -56 8 72 58 -31 -50 2 61 33 -36 -55 22 69 25 -61 -50 19 58 -3 -75 -44 32 56 -15 -67 -43 27 46 -29 -75 -24
7961 -24 32 43 -27 -67 -10 49 26 -39 -72 -11 53 26 -47 -60 16 58 13 -52 -47 29 73 12 -47 -33 44 64 5 -44 -11 53 67
7992 67 -8 -53 3 55 48 -8 -52 -2 69 38 -36 -42 10 60 35 -51 -50 17 60 13 -61 -50 24 68 8 -52 -31 33 57 -4 -58 -20
8024 -20 53 51 -17 -54 -7 49 40 -28 -49 12 58 41 -36 -37 5 56 30 -44 -45 19 64 18 -41 -45 33 61 6 -44 -32 36 61 -3 -56
8057 -56 -14 53 49 -22 -56 -5 58 47 -23 -50 3 69 22 -58 -54 15 61 19 -54 -52 18 42 -3 -65 -27 34 54 -2 -56 -27 49 58
8089 58 -7 -50 -13 67 57 -14 -41 0 66 45 -13 -34 20 64 46 -16 -24 29 74 41 -34 -31 45 76 9 -37 -15 52 67 -6 -40
8120 -40 -10 46 44 -7 -46 -17 31 40 -17 -60 -6 44 32 -47 -62 -9 41 21 -58 -48 -6 37 7 -75 -59 4 41 -13 -75 -38 16
8151 16 40 -20 -77 -31 33 40 -12 -56 -21 51 27 -32 -60 7 47 45 -32 -51 18 55 35 -30 -27 39 64 24 -38 -9 33 80 11 -29
8183 -29 -8 50 55 -1 -36 -12 55 63
8191F3
##END NTUPLES=NMR FID
##END=
