##TITLE=1H_LY-aceton Pd240
 CDCl3,8 sc, 
 23.9.2021
##JCAMPDX= 6.0         $$ Bruker NMR JCAMP-DX V2.0
##DATA TYPE= NMR FID
##DATA CLASS= NTUPLES
##ORIGIN= UXNMR, Bruker Analytische Messtechnik GmbH
##OWNER= root
$$ XWIN-NMR		Version 3.5
$$ Thu Sep 23 11:05:49 2021 Russian Standard Time (UT+4h)  she@DPX200
##.OBSERVE FREQUENCY= 200.1314
##.OBSERVE NUCLEUS= ^1H
##.DELAY= (6, 6)
##.ACQUISITION MODE= SIMULTANEOUS
##.ACQUISITION SCHEME= undefined
##.AVERAGES= 8
##.DIGITISER RES= 18
##SPECTROMETER/DATA SYSTEM= spect
##.PULSE SEQUENCE= zg30
##.SOLVENT NAME= CDCl3
##.SHIFT REFERENCE= (INTERNAL, CDCl3, 0, 15.7039)
##AUDIT TRAIL= $$ (NUMBER, WHEN, WHO, WHERE, WHAT)
$$ ##TITLE= Audit trail, XWIN-NMR		Version 3.5
$$ ##JCAMPDX= 5.01
$$ ##ORIGIN= Bruker BioSpin GmbH
$$ ##OWNER= she
$$ F:/spectra/data/she/nmr/H-F/1/audita.txt
$$ ##AUDIT TRAIL=  $$ (NUMBER, WHEN, WHO, WHERE, WHAT)
(   1,<2021-09-23 11:04:13.14 +0400>,<she>,<DPX200>,
      <created by zg, POWCHK disabled, PULCHK disabled
       configuration hash MD5:
       00 E9 B6 7A A2 85 ED C7 34 08 36 98 17 FE 4E 26
       data hash MD5: 16K
       75 AE AD 8D 94 F2 92 5B C7 97 57 0A 6D 31 B9 1B>)
$$ ##END=
$$ 
$$ hash MD5
$$ 32 46 00 DD C3 10 E5 64 3B 8A 04 8F D8 FF B7 B8
##$RELAX= 
##$RELAX= 
##$RELAX= 
##$RELAX= 
##$RELAX= 
##$RELAX= 
$$ Bruker specific parameters
$$ --------------------------
##$DU= <F:/spectra>
##$EXPNO= 1
##$NAME= <H-F>
##$PROCNO= 1
##$TYPE= <nmr>
##$USER= <she>
##$AMP= (0..31)
100 100 100 100 100 100 100 100 100 100 100 100 100 100 100 100 100 100 
100 100 100 100 100 100 100 100 100 100 100 100 100 100 
##$AQSEQ= 0
##$AQ_mod= 1
##$AUNM= <au_zg>
##$AUTOPOS= <>
##$BF1= 200.13
##$BF2= 200.13
##$BF3= 200.13
##$BF4= 200.13
##$BF5= 200.13
##$BF6= 200.13
##$BF7= 200.13
##$BF8= 200.13
##$BYTORDA= 1
##$CFDGTYP= 0
##$CFRGTYP= 5
##$CHEMSTR= <none>
##$CNST= (0..31)
1 1 145 1 1 1 1 1 1 1 1 1 1 1 1 1 1 1 1 1 1 1 1 1 1 1 1 1 1 1 1 1 
##$CPDPRG= <>
##$CPDPRG1= <>
##$CPDPRG2= <>
##$CPDPRG3= <>
##$CPDPRG4= <mlev>
##$CPDPRG5= <mlev>
##$CPDPRG6= <mlev>
##$CPDPRG7= <mlev>
##$CPDPRG8= <mlev>
##$CPDPRGB= <>
##$CPDPRGT= <>
##$D= (0..31)
0 1.2 0 0 0 0 0 0 0 0.06 0 0.03 0 0 0 0 0.0002 0 0 0 0 0 0 0 0 0 0 0 0 
0 0 0 
##$DATE= 1632380652
##$DBL= (0..7)
120 120 120 120 120 120 120 120 
##$DBP= (0..7)
150 150 150 150 150 150 150 150 
##$DBP07= 0
##$DBPNAM0= <>
##$DBPNAM1= <>
##$DBPNAM2= <>
##$DBPNAM3= <>
##$DBPNAM4= <>
##$DBPNAM5= <>
##$DBPNAM6= <>
##$DBPNAM7= <>
##$DBPOAL= (0..7)
0.5 0.5 0.5 0.5 0.5 0.5 0.5 0.5 
##$DBPOFFS= (0..7)
0 0 0 0 0 0 0 0 
##$DE= 6
##$DECBNUC= <off>
##$DECIM= 32
##$DECNUC= <off>
##$DECSTAT= 4
##$DIGMOD= 1
##$DIGTYP= 9
##$DL= (0..7)
0 120 120 120 120 120 120 120 
##$DP= (0..7)
150 150 150 150 150 150 150 150 
##$DP07= 0
##$DPNAME0= <>
##$DPNAME1= <>
##$DPNAME2= <>
##$DPNAME3= <>
##$DPNAME4= <>
##$DPNAME5= <>
##$DPNAME6= <>
##$DPNAME7= <>
##$DPOAL= (0..7)
0.5 0.5 0.5 0.5 0.5 0.5 0.5 0.5 
##$DPOFFS= (0..7)
0 0 0 0 0 0 0 0 
##$DQDMODE= 0
##$DR= 18
##$DS= 0
##$DSLIST= <SSSSSSSSSSSSSSS>
$$ [...]
##$SUBNAM2= <"">
##$SUBNAM3= <"">
##$SUBNAM4= <"">
##$SUBNAM5= <"">
##$SUBNAM6= <"">
##$SUBNAM7= <"">
##$SUBNAM8= <"">
##$SUBNAM9= <"">
##$SW= 20.0188988654967
##$SWIBOX= (0..15)
0 0 2 0 0 0 0 0 0 0 0 0 0 0 0 0 
##$SW_h= 4006.41025641026
##$TD= 16384
##$TD0= 1
##$TE= 0
##$TE2= 300
##$TE3= 300
##$TEG= 300
##$TL= (0..7)
0 120 120 120 120 120 120 120 
##$TP= (0..7)
150 150 150 150 150 150 150 150 
##$TP07= 0
##$TPNAME0= <>
##$TPNAME1= <>
##$TPNAME2= <>
##$TPNAME3= <>
##$TPNAME4= <>
##$TPNAME5= <>
##$TPNAME6= <>
##$TPNAME7= <>
##$TPOAL= (0..7)
0.5 0.5 0.5 0.5 0.5 0.5 0.5 0.5 
##$TPOFFS= (0..7)
0 0 0 0 0 0 0 0 
##$TUNHIN= 0
##$TUNHOUT= 0
##$TUNXOUT= 0
##$USERA1= <user>
##$USERA2= <user>
##$USERA3= <user>
##$USERA4= <user>
##$USERA5= <user>
##$V9= 5
##$VALIST= <valist>
##$VCLIST= <CCCCCCCCCCCCCCC>
##$VD= 0
##$VDLIST= <DDDDDDDDDDDDDDD>
##$VPLIST= <PPPPPPPPPPPPPPP>
##$VTLIST= <TTTTTTTTTTTTTTT>
##$WBST= 1024
##$WBSW= 4
##$XGAIN= (0..3)
0 0 0 0 
##$XL= 0
##$YL= 0
##$YMAX_a= 180985
##$YMIN_a= -184114
##$ZGOPTNS= <>
##$ZL1= 120
##$ZL2= 120
##$ZL3= 120
##$ZL4= 120
##$ABSF1= 10
##$ABSF2= 0
##$ABSG= 5
##$ABSL= 3
##$ALPHA= 0
##$AQORDER= 0
##$ASSFAC= 0
##$ASSFACI= 0
##$ASSFACX= 0
##$ASSWID= 0
##$AUNMP= <proc_1d>
##$AZFE= 0.1
##$AZFW= 0.1
##$BCFW= 1
##$BC_mod= 2
##$BYTORDP= 1
##$COROFFS= 0
##$CY= 11.3945322036743
##$DATMOD= 1
##$DC= 2
##$DFILT= <>
##$DTYPP= 0
##$F1P= 2.36226072786647
##$F2P= -0.459571619588291
##$FCOR= 0.5
##$FTSIZE= 0
##$FT_mod= 4
##$GAMMA= 1
##$GB= 0.15
##$INTBC= 1
##$INTSCL= 1
##$ISEN= 128
##$LB= 0.24
##$LEV0= 0
##$LPBIN= 0
##$MAXI= 10000
##$MC2= 0
##$MEAN= 0
##$ME_mod= 0
##$MI= 1.114404
##$NCOEF= 0
##$NC_proc= 0
##$NLEV= 6
##$NOISF1= 3.799351
##$NOISF2= 2.8
##$NSP= 1
##$NTH_PI= 0
##$NZP= 0
##$OFFSET= 15.70392
##$PC= 1
##$PHC0= -14164.89
##$PHC1= 23.40088
##$PH_mod= 1
##$PKNL= yes
##$PPARMOD= 0
##$PSCAL= 0
##$PSIGN= 0
##$REVERSE= no
##$SF= 200.130013532006
##$SI= 16384
##$SIGF1= 3
##$SIGF2= 2
##$SINO= 400
##$SIOLD= 16384
##$SREGLST= <1H.CDCl3>
##$SSB= 0
##$STSI= 0
##$STSR= 0
##$SW_p= 3612.71676300578
##$SYMM= 0
##$S_DEV= 0
##$TDeff= 0
##$TDoff= 0
##$TI= <>
##$TILT= no
##$TM1= 0
##$TM2= 0
##$TOPLEV= 0
##$USERP1= <user>
##$USERP2= <user>
##$USERP3= <user>
##$USERP4= <user>
##$USERP5= <user>
##$WDW= 1
##$XDIM= 8192
##$YMAX_p= 0
##$YMIN_p= 0
$$ End of Bruker specific parameters
$$ ---------------------------------
##NTUPLES= NMR FID
##VAR_NAME=  TIME,          FID/REAL,        FID/IMAG
##SYMBOL=    X,             R,               I
##VAR_TYPE=  INDEPENDENT,   DEPENDENT,       DEPENDENT
##VAR_FORM=  AFFN,          ASDF,            ASDF
##VAR_DIM=   8192,          8192,            8192
##UNITS=     SECONDS,       ARBITRARY UNITS, ARBITRARY UNITS
##FACTOR=    0.0002496,     1,               1
##FIRST=     0,             0,               0
##LAST=      2.0444736,     0,               0
##MIN=       0,             -184114,         0
##MAX=       2.0444736,     180985,          0
$$ Real data points
##PAGE= N=1
##DATA TABLE= (X++(R..R)), XYDATA
$$ [...]
2764H99M66k689L64K569j177k188J851J633k372q95K657O4k669P72K412j523j946
2781a772K133J285k528m88K681l48k561J145K199j817j646K355Q96k644o8K664
2797A486p46k443J513J966k120j304K517N25k676L23K554j111k215J788J668k321
2813e96r30K608J21k658P10K420j462j970K086J319k506n26K661k99k579J113
2829d88K214j780j664K317R32k591j31K659p17k421J473J963k092j307K492N35
2845A394k653K81K563j076k231J785J666k303r41K576J46k633O79K406j429j968
2861a738K053J316k468n43K627k72k545J065K229j759j671K269R70k571j65K607
2877A404o43k399J405J959k008j349K444N93k625K35K541j036k211J706J707k253
$$ y = [899, 1365, -1324, -960, 1609, 432, -1756, 95, 1728, -644, -1539, 1118, 1182, -1487, -715, 1697, 174, -1772, 361, 1646, -882, -1370, 1311, 963, -1598, -453, 1746, -71, -1717, 638, 1534, -1110, -1178, 1486, 740, -1703, -190, 1776, -344, -1648, 869, 1394, -1282, -959, 1595, 484, -1731, 57, 1725, -596, -1526, 1082, 1203, -1455, -745, 1675, 213, -1757, 329, 1648, -858, -1384, 1277, 978, -1601, -488, 1726, -54, -1718, 599, 1531, -1060, -1191, 1468, 751, -1670, -197, 1766, -326, -1633, 859, 1394, -1259, -978, 1585, 509, -1722, 63, 1729, -574, -1515, 1061, 1207, -1426, -747, 1659, 230, -1738, 315, 1631, -837, -1380, 1247, 975, -1570, -505, 1724, -35, -1706, 563, 1533, -1038, -1203, 1404, 761, -1638, -233, 1726, -282, -1631, 813, 1406, -1219, -984, 1557, 521, -1690, 16, 1723, -530]
2893e30j004K568J83k593N93K429j380j969J981J350k418n87K584k17k525J002
2909e33K219j702j685K228J003k541k10K599o07k397J341J992j969j363K393O18
2925A386k576J76K527r55k227J669J694k193j012K494K49k569N43K399j289j993
2941a677J914J394k353o65K550j45k498R25K204j614j699K151J031k479k54K537
2957A322n23k398J284J988j899j395K340O47k508J20K481q87k206J571J722k104
2973d45j056K433K95k518M82K371j222j990J851J410k280o88K483q1k458Q38K192
2990A617j523j733K068J074k393l17K478m33k366J177J982j795j435K237P41k481
3006a102L4K469p85k231J493J755k022j123K367L90k483L94K359j138k003J765
$$ y = [-530, -1534, 1034, 1217, -1376, -783, 1646, 266, -1703, 278, 1628, -790, -1377, 1207, 990, -1535, -533, 1686, -16, -1701, 527, 1530, -1011, -1221, 1378, 771, -1626, -285, 1707, -262, -1625, 768, 1386, -1190, -1014, 1513, 558, -1669, 0, 1694, -499, -1511, 983, 1232, -1337, -794, 1605, 316, -1677, 237, 1631, -722, -1387, 1163, 1018, -1480, -555, 1649, 35, -1664, 487, 1518, -961, -1215, 1322, 799, -1599, -315, 1673, -226, -1621, 719, 1366, -1142, -1022, 1459, 572, -1634, -63, 1659, -445, -1501, 932, 1227, -1291, -809, 1562, 340, -1650, 201, 1611, -669, -1357, 1126, 1045, -1413, -575, 1617, 94, -1639, 429, 1503, -890, -1207, 1271, 838, -1528, -351, 1631, -164, -1599, 638, 1379, -1102, -1068, 1401, 616, -1615, -122, 1633, -389, -1512, 855, 1245, -1238, -844, 1515, 377, -1626, 139]
3022A39J459k216p59K447kk436P61K205j452j758J997J136k347m09K486l83k365
3039a497J104K014j724j469K185P74k424k0K427p36k211J421J768j978j144K331
3055H21M13k462L61K345j063k015J705J470k164p87K386N6k418P27K191j406j750
3072a590J956J134k309m29K454l45k327J062K004j688j487K152Q01k389n4K402
3088A347p01k184J382J745j922j150K272M42k423L16K323j041j995J661J468k094
3104e54q28K369P0k371O62K187j359j744J891J165k254m58K404l05k304J021J981
3121A573j630j469K084Q37k347j03K368o36k178J318J756j876j157K221M71k362
3137a130K57K299j008j961J595J462k050q14K299J05k343O28K136j292j733J833
$$ y = [139, 1598, -618, -1377, 1070, 1068, -1368, -607, 1598, 146, -1612, 385, 1521, -826, -1235, 1251, 868, -1497, -393, 1621, -103, -1572, 613, 1387, -1037, -1057, 1370, 634, -1577, -156, 1612, -366, -1510, 821, 1234, -1228, -867, 1478, 415, -1600, 105, 1575, -589, -1376, 1010, 1066, -1352, -625, 1566, 160, -1590, 366, 1500, -809, -1238, 1216, 871, -1456, -394, 1610, -78, -1565, 587, 1388, -1001, -1055, 1347, 646, -1538, -156, 1589, -333, -1483, 789, 1231, -1192, -876, 1447, 406, -1589, 72, 1540, -554, -1382, 987, 1057, -1314, -652, 1535, 176, -1568, 323, 1488, -766, -1224, 1180, 875, -1429, -408, 1573, -57, -1526, 558, 1395, -952, -1055, 1313, 677, -1501, -183, 1573, -303, -1460, 761, 1232, -1130, -873, 1426, 418, -1543, 52, 1514, -536, -1350, 949, 1054, -1289, -661, 1475, 183, -1550, 283]
3153B83J156k186m64K337k63k251R77J944j577j448K028Q04k273r8K318o24k121
3170a458J282J719j817j149K165M68k297K40K218r46j931J553J438j999q10K244
3186I20J16k279N98K086j248j701J777J150k151m70K296k45k203R17J922j514
3202b9j438J962Q27k223j13K253n81k082J243J683j752j148K119M69k250K25K190
3219A355r05j906J485J432j925q29K186J31k224N50K057j207j671J729J127k079
3235f94m77K230k20k157Q91J879j482j421J922Q15k167j37K211n39k037J179J664
3252A460j691j138K056M85k206K14K128q56j881J457J421j896q28K147J65k192
3268a155N16K034j170j666J691J118k032m82K183k22k113Q81J843j457j400J881
$$ y = [283, 1439, -747, -1211, 1126, 863, -1388, -411, 1533, -44, -1492, 536, 1340, -933, -1031, 1287, 663, -1458, -176, 1543, -274, -1423, 742, 1210, -1087, -847, 1371, 425, -1506, 47, 1485, -514, -1324, 920, 1036, -1243, -645, 1441, 193, -1508, 269, 1419, -732, -1202, 1094, 849, -1354, -437, 1485, -29, -1467, 495, 1322, -901, -1014, 1239, 658, -1424, -181, 1502, -250, -1398, 721, 1190, -1060, -835, 1355, 450, -1456, 29, 1461, -464, -1293, 893, 1024, -1200, -650, 1407, 200, -1471, 258, 1385, -694, -1171, 1059, 839, -1318, -427, 1452, -30, -1451, 471, 1286, -881, -1018, 1193, 654, -1383, -204, 1460, -231, -1369, 687, 1172, -1034, -820, 1308, 452, -1429, 28, 1449, -447, -1275, 872, 1037, -1155, -639, 1395, 225, -1441, 250, 1368, -664, -1146, 1037, 815, -1298, -417, 1426, -31, -1431, 450]
3284D50Q10k121j48K183n44k003J167J636j668j123K029M78k156J88K095q40j835
3301a402J430J395j857q20K101J68k150N08J986j121j638J635J127j996m96K143
3317A013j71k097Q26J831j411j384J845Q03k096j67K146n04j989J131J634j643
3333b33j112J975N11k135J57K074q07j808J370J388j798q27K068J79k129N00J975
3350A348j108j624J612J121j978m86K112j53k068Q05J815j373j387J789Q30k058
3366h03j87K116m74j964J086J621j592j133J941N30k120J28K075p60j843J328
3382e1J427j769q65K035K33k102M25J974j052j632J564J152j931n39K096j03k065
3399a203P45J828j307j422J755Q66k028k40K101m19j963J030J643j543j169J900
$$ y = [450, 1260, -861, -1009, 1174, 630, -1373, -206, 1430, -238, -1361, 668, 1146, -1010, -822, 1273, 433, -1402, 28, 1423, -434, -1254, 847, 1015, -1135, -627, 1359, 238, -1400, 235, 1362, -634, -1130, 1013, 842, -1255, -429, 1402, -9, -1393, 452, 1255, -841, -1008, 1138, 634, -1355, -224, 1410, -233, -1345, 630, 1141, -994, -837, 1237, 430, -1378, -8, 1380, -418, -1245, 823, 1002, -1127, -627, 1348, 240, -1384, 228, 1349, -629, -1115, 997, 844, -1224, -419, 1396, 23, -1364, 425, 1255, -803, -990, 1126, 652, -1312, -226, 1395, -197, -1330, 611, 1141, -979, -851, 1224, 464, -1379, -51, 1376, -393, -1258, 777, 1010, -1092, -667, 1307, 255, -1377, 187, 1339, -592, -1131, 965, 862, -1203, -458, 1370, 63, -1359, 396, 1262, -766, -1006, 1095, 676, -1287, -257, 1386, -157, -1326, 574]
3415E74N67k083Q5K047p12j825J275J430j735q90K024K50k087L87J984j017j641
3432a367J522J156j879n74K072p7k045P22J826j291j418J728Q93k011k55K089
3448A091l97j975J009J649j516j181J889N85k061M8K045o79j853J271J434j711
3464c52r23K009K87k089L72J955r82j657J506J184j877n89K062m9k052P02J829
3481A336j263j448J722R10j984k98K095l65j979R83J671j486j220J877O16k059
3497h92K2K055o62j847J237J448j694r28J986L14k090L51J973r73j671J486J208
3514A323j871o22K068l0k053O55J860j243j454J698R29j983l15K090l48j964R43
3531c17J687j480j210J856O44k065J1K054o47j844J203J490j689r58J986L28k074
$$ y = [574, 1141, -942, -857, 1190, 478, -1347, -72, 1358, -377, -1267, 757, 1007, -1080, -693, 1291, 274, -1367, 155, 1311, -568, -1142, 930, 853, -1192, -470, 1356, 65, -1353, 375, 1268, -743, -998, 1091, 694, -1281, -272, 1377, -139, -1320, 569, 1154, -907, -859, 1186, 507, -1346, -75, 1359, -352, -1275, 734, 1021, -1068, -696, 1259, 277, -1380, 126, 1310, -567, -1156, 906, 857, -1195, -493, 1336, 73, -1375, 347, 1257, -727, -1025, 1070, 705, -1274, -291, 1380, -106, -1326, 551, 1167, -892, -870, 1185, 523, -1324, -87, 1361, -333, -1261, 725, 1039, -1051, -700, 1273, 300, -1371, 115, 1323, -548, -1170, 898, 868, -1185, -530, 1330, 87, -1367, 331, 1260, -723, -1038, 1052, 704, -1260, -317, 1370, -110, -1320, 536, 1180, -885, -874, 1180, 533, -1311, -108, 1382, -307, -1265, 721, 1049, -1025]
3548a025L12J980r44j687J477J221j855o56K062Pk055O30J863j217j481J674R56
3565A262j978l48K093l00j990R25J702j467j234J855O54k041l1K071o20j866J192
3582a21J493j662r72J963L78k093K95J981r04j711J438J257j820o92K052L6k063
3599a145N96J874j189j508J670R86j984l62K084k80k002Q91J731j449j272J849
3615D90O95k065l9K070n96j875J180J509j647r96J962L91k095K78J999q92j714
3632a345J421J277j834o94K048N3k065N95J881j187j507J643R99j957l95K076
3648A009k56j998Q73J725j426j286J839O98k042o6K065n73j884J157J539j639
3664b65j019J936M23k075K47J996q64j730J421J284j812p14K035P6k054N54J886
$$ y = [-1025, -713, 1267, 323, -1364, 113, 1334, -521, -1177, 885, 892, -1163, -533, 1330, 113, -1368, 306, 1262, -716, -1064, 1029, 729, -1261, -336, 1366, -101, -1335, 520, 1174, -867, -898, 1173, 553, -1313, -121, 1372, -290, -1262, 701, 1079, -1014, -719, 1262, 358, -1353, 85, 1342, -478, -1170, 882, 918, -1145, -549, 1325, 136, -1372, 298, 1284, -700, -1062, 1022, 742, -1260, -369, 1362, -87, -1359, 490, 1185, -880, -919, 1151, 555, -1320, -140, 1369, -278, -1274, 688, 1079, -1016, -738, 1261, 369, -1345, 76, 1353, -481, -1175, 873, 926, -1139, -544, 1337, 150, -1357, 286, 1285, -672, -1067, 1009, 753, -1245, -372, 1353, -73, -1359, 480, 1178, -864, -930, 1135, 562, -1322, -165, 1374, -265, -1284, 652, 1075, -1000, -753, 1243, 379, -1351, 70, 1354, -458, -1172, 863, 939, -1115, -561, 1325]
3681A325j145j527J617J021j935m11K066k42j989Q53J725j401j290J803P17k028
3697h41j02K064n47j894J143J531j603j039J930M32k063K18J994q37j733J392
3713D5J285j785p39K039Q2k051N59J877j130j517J600J024j934m15K056k24j983
3730a211Q45J724j394j290J797P10k005j02K049n46j875J124J515j600j016J918
3746F43M22k067K42J976q56j698J376J276j797o95J996P6k012N56J848j140j486
3763a340J611R96j933l77K055k64j960Q65J700j406j247J781P05k017o2K030n82
3780E55j847J159J478j621r83J919L81k041K73J938q75j663J397J219j778o77
3796a166J996L7j994N86J822j158j466J620R44j893l49K015k74j930Q68J668j392
$$ y = [1325, 180, -1347, 270, 1291, -644, -1055, 1011, 769, -1220, -367, 1358, -43, -1333, 470, 1187, -841, -943, 1121, 574, -1320, -177, 1354, -249, -1288, 642, 1074, -989, -771, 1223, 386, -1347, 45, 1330, -455, -1194, 845, 927, -1124, -565, 1312, 182, -1335, 265, 1289, -645, -1060, 996, 772, -1211, -366, 1358, -36, -1326, 471, 1181, -824, -926, 1123, 577, -1298, -174, 1341, -259, -1275, 643, 1065, -1002, -760, 1216, 360, -1338, 38, 1314, -483, -1178, 818, 894, -1118, -562, 1286, 146, -1340, 271, 1267, -666, -1043, 1012, 748, -1212, -347, 1353, -53, -1300, 481, 1186, -831, -893, 1137, 555, -1292, -133, 1345, -276, -1259, 660, 1041, -1000, -727, 1211, 336, -1327, 70, 1289, -489, -1166, 830, 867, -1127, -541, 1281, 123, -1343, 277, 1221, -672, -1021, 994, 720, -1210, -342, 1326, -66]
3813f6j225J771O76j994l9K009n90j818J149J453j603r52J907L53k012K70J919
3830A208q62j670J405J210j766o64J972M6j998N93J799j151j453J599R49j893
3846f76l63K027k80j931Q86J647j390j216J782O66j983l6J987n83j809J158J454
3863A340j604r52J894L55k005K62J918q54j645J373J214j767o55J971K3j975N81
3880e26J798j150j431J590R45j899l52J998k79j904Q68J642j379j195J740O61
3896A127j960n2J980n54j809J119J460j573r61J882L63j991K62J916q53j651J366
3913G1J222j738o78J944P6j977N51J804j123j449J576R60j886l58J980k56j922
3930a203Q59J639j357j218J743O68j953o6J975n53j804J131J440j583r39J878
$$ y = [-66, -1291, 480, 1156, -838, -877, 1132, 542, -1276, -127, 1326, -277, -1229, 678, 1031, -981, -711, 1208, 346, -1324, 81, 1291, -475, -1139, 833, 879, -1119, -526, 1273, 122, -1331, 268, 1217, -676, -1039, 988, 708, -1223, -337, 1310, -80, -1296, 486, 1152, -831, -867, 1120, 537, -1272, -114, 1340, -264, -1216, 678, 1033, -972, -710, 1208, 354, -1291, 82, 1296, -471, -1126, 845, 868, -1107, -526, 1272, 122, -1309, 281, 1226, -673, -1025, 973, 694, -1210, -342, 1300, -79, -1274, 466, 1127, -833, -885, 1095, 541, -1268, -149, 1311, -262, -1223, 659, 1022, -969, -707, 1209, 356, -1295, 71, 1293, -445, -1123, 821, 897, -1080, -529, 1275, 152, -1297, 279, 1239, -647, -1005, 975, 719, -1203, -344, 1295, -62, -1280, 463, 1131, -822, -888, 1087, 534, -1270, -139, 1301, -282, -1221, 657]
3946F57L58j985K67J897q53j632J377J195j741o57J952N9j987N79J794j132j449
3963a301J589R49j892l45J983k72j913Q79J628j384j199J751O45j946o6J985n63
3980E28j809J129J456j591r40J869L62j986K75J907q75j632J385J211j749o66
3996a126J962M4j986N91J783j142j428J600R35j885l32J976k79j899Q67J626j379
4013g2j209J760O58j954n8J974n66j786J126J427j575r49J873L64j987K46J903
4030A175q40j638J354J213j744o51J942O9j971N59J791j107j438J552R53j865
4046f46l65J984k52j890Q42J635j352j217J723O68j930o8J960n52j789J101J436
4063A288j537r76J855L92j972K21J895q13j639J327J223j710p07J934R9j960N17
$$ y = [657, 1015, -970, -703, 1194, 341, -1291, 86, 1281, -460, -1117, 835, 894, -1093, -514, 1280, 148, -1301, 288, 1237, -655, -1000, 983, 711, -1202, -323, 1305, -79, -1278, 473, 1118, -828, -894, 1091, 528, -1281, -152, 1304, -287, -1227, 642, 1004, -982, -707, 1200, 325, -1307, 78, 1289, -460, -1126, 836, 880, -1106, -515, 1268, 126, -1302, 298, 1233, -652, -984, 992, 713, -1186, -319, 1307, -72, -1281, 479, 1137, -817, -875, 1099, 533, -1253, -127, 1300, -275, -1224, 649, 1013, -974, -728, 1175, 335, -1303, 51, 1264, -480, -1131, 811, 880, -1091, -532, 1259, 152, -1286, 266, 1219, -646, -1011, 973, 721, -1169, -327, 1308, -44, -1261, 462, 1130, -800, -868, 1092, 540, -1249, -148, 1288, -249, -1225, 630, 1022, -950, -729, 1166, 353, -1286, 41, 1264, -446, -1153, 781, 880, -1080, -563]
4080e63J793j078j451J529R75j826l97J951k16j883Q04J651j331j221J714O90
4096A141j917j11J957n05j789J067J450j516r83J826M12j954K09J866p81j635
4112a263J297J224j675p13J904J09j933M94J762j031j457J502R82j809m20J933
4128I06j86j866P82J623j273j222J664O96j890j06J928m98j757J036J447j495
4144b11r73J782M21j923J90J856p65j605J258J217j645p02J872J05j905M76J739
4161A187j026j415J461R65j762m10J885j71j841P52J592j240j204J630O84j830
4177g43j17J876m70j742J029J410j451r61J747M25j889J78J828p48j598J261J169
4194A204j603o82J826J07j848M69J707j015j388J438R38j732m04J861j96j797
$$ y = [-563, 1230, 152, -1299, 230, 1205, -621, -1018, 933, 717, -1166, -362, 1289, -42, -1263, 451, 1141, -776, -887, 1070, 565, -1224, -157, 1293, -223, -1206, 620, 1032, -922, -713, 1153, 372, -1263, 34, 1258, -417, -1130, 774, 883, -1050, -556, 1206, 175, -1282, 220, 1202, -607, -1027, 906, 720, -1146, -364, 1259, -14, -1236, 428, 1124, -766, -872, 1056, 558, -1199, -163, 1284, -211, -1184, 598, 1019, -904, -714, 1142, 377, -1228, 30, 1247, -398, -1100, 772, 877, -1028, -552, 1187, 161, -1254, 207, 1172, -590, -1000, 885, 714, -1127, -375, 1217, -23, -1227, 403, 1087, -743, -860, 1016, 546, -1196, -167, 1243, -208, -1169, 578, 1003, -886, -708, 1120, 372, -1226, 35, 1204, -399, -1081, 745, 852, -996, -527, 1180, 165, -1223, 215, 1153, -579, -983, 878, 682, -1115]
4210a115P53J563j242j171J615O62j816j01J840m76j685J004J382j451r06J730
4226E86L69j846J97J787p55j536J233J160j589o66J800R7j817M72J668r93j368
4243a201J419R15j707l66J823j92j777P40J527j218j142J575O39j779q4J805m85
4260D92j641R83J343j396r16J687L81j810J99J742p46j505J216J142j564o40J759
4277G26R3j782M72J628r71j326J375Q99j650l75J769j88j722P22J498j186j127
4294a145J540O31j732j06J765m33j640R50J322j370q99J643L96j763J64J704o78
4311C49j502J169J125j510o55J711J10j735M21J612r19j326J345R03j619m01J754
4328H32j45j703O81J477j133j132J487O70j698j34J743m14j619R06J334j320r10
$$ y = [-1115, -362, 1201, -41, -1212, 403, 1065, -751, -852, 988, 512, -1173, -169, 1213, -238, -1144, 586, 955, -891, -694, 1093, 338, -1198, 35, 1195, -394, -1060, 740, 837, -980, -508, 1160, 167, -1201, 218, 1133, -574, -940, 883, 691, -1086, -346, 1181, -37, -1179, 396, 1035, -744, -828, 977, 492, -1149, -166, 1177, -219, -1135, 552, 933, -877, -678, 1064, 318, -1187, 29, 1171, -393, -1033, 726, 819, -963, -491, 1137, 166, -1160, 215, 1114, -536, -911, 858, 670, -1052, -330, 1168, -18, -1145, 395, 1026, -706, -812, 953, 520, -1120, -170, 1152, -218, -1117, 526, 922, -841, -677, 1027, 349, -1153, 16, 1141, -369, -1024, 687, 797, -938, -517, 1095, 176, -1150, 195, 1098, -521, -922, 832, 687, -1016, -335, 1142, 9, -1123, 364, 1034, -664, -798, 945, 531, -1088, -182, 1152, -168, -1078]
4345a078J594M14j734J12J700o51j484J106J141j464o92J678J76j731L70J609
4361A066q83j325J312R02j574m27J717j04j682O39J472j086j124J436O79j652
4377f34j71J713l65j589Q61J313j272r30J576M21j691Q7J663n93j495J075J141
4394A110j424p03J641J88j698L33J591q45j317J251R24j532m42J668p3j646O06
4411c68J455j042j142J403O89j609j73J673l43j575Q36J314j251r17J522M56j672
4428g44P6J639n99j449J054J107j385o87J592J91j664L35J553q16j301J228R06
4445A036j510m36J635p0j615N78J439j028j120J384O90j604j67J648l60j522Q22
4462b00J291j222r09J511M32j641P9J618n78j427J006J112j351p02J586J89j634
$$ y = [-1078, 516, 930, -804, -692, 1008, 357, -1127, -21, 1120, -344, -1036, 642, 818, -913, -543, 1066, 183, -1142, 170, 1072, -502, -929, 788, 684, -998, -359, 1113, 27, -1097, 339, 1018, -634, -805, 908, 543, -1046, -185, 1128, -144, -1074, 502, 923, -768, -681, 982, 389, -1106, -31, 1110, -314, -1017, 624, 812, -886, -553, 1038, 193, -1124, 127, 1051, -481, -923, 745, 672, -974, -368, 1087, 45, -1097, 306, 995, -614, -787, 886, 543, -1032, -196, 1118, -133, -1050, 472, 928, -744, -668, 971, 372, -1077, -23, 1084, -301, -988, 604, 795, -869, -534, 1019, 203, -1098, 130, 1036, -474, -910, 725, 655, -960, -382, 1057, 29, -1091, 293, 983, -621, -788, 860, 500, -1022, -200, 1091, -131, -1040, 471, 903, -738, -659, 959, 381, -1046, -40, 1072, -279, -981, 605, 794, -840]
4479h40L09J548q11j285J210R06j482m46J609n0j608N64J422j022j093J350O77
4496I58j564j88J617l13j516P88J271j180q95J456M46j599N9J581n43j412R90
4513d4J106j347o69J560J87j604K93J517p84j269J184Q93j452m41J582n6j563
4530i07N40J394r80j087J313O83j539k02J589k87j499P65J262j162r02J438M53
4547H72j580M9J571n50j380R63J100j320o66J507K13j585K90J485p55j241J146
4564A19Q95j420m45J558m9j545N31J362r54j060J284O58j485k04J551l02j466
4581i72P62J228j142q69J406M19j534O2J511n21j359R47J059j281o40J473J95
4598G44j539K83J455p33j211J110Q75j381m25J510m4j514N24J346r24j050J242
$$ y = [-840, -531, 1017, 206, -1079, 131, 1037, -445, -891, 718, 668, -940, -376, 1046, 24, -1069, 281, 958, -606, -794, 823, 510, -1006, -218, 1053, -127, -1022, 434, 880, -719, -660, 921, 378, -1034, -44, 1062, -285, -954, 606, 793, -811, -518, 999, 215, -1054, 130, 1023, -429, -870, 712, 656, -907, -367, 1027, 47, -1040, 273, 956, -583, -785, 804, 517, -982, -217, 1045, -117, -1019, 419, 872, -708, -659, 912, 362, -1018, -55, 1045, -275, -941, 566, 779, -806, -516, 969, 214, -1027, 119, 1014, -406, -851, 707, 658, -887, -356, 1006, 52, -1008, 276, 934, -551, -755, 796, 494, -972, -210, 1018, -124, -993, 413, 832, -702, -640, 871, 350, -1009, -62, 997, -284, -924, 549, 744, -795, -512, 943, 210, -1001, 109, 984, -397, -822, 688, 644, -870, -346, 1000, 76, -974, 268]
4615B68O76j485k06J532k70j449P24J211j100q69J368M23j498M7J494n19j327
4632i80R20J041j246o57J453J98j492K55J421p08j195J088Q51j359m21J497l1
4649F35j471M93J299q95j021J218O29j407j93J486k76j398P02J179j074q42J337
4666D01M21j473N0J433m76j304Q82J014j206o38J403J97j453K55J383o89j165
4683i65J047Q34j310m19J439k3j429M82J268q81r79J177O41j396j85J443k56j365
4701h77O93J141j043q18J297M11j430L0J422m69j270Q60R90j170o21J357J90j420
4719g27K39J355o65j142J014Q26j276m34J413j7j396M50J267q50r87J147O18j327
4737d92k08J418k34j337O46J146r98q32J249M43j389kJ386m26j264Q35R71j111
$$ y = [268, 944, -541, -747, 785, 515, -934, -210, 1001, -99, -968, 400, 823, -675, -628, 866, 347, -980, -60, 981, -265, -922, 531, 729, -763, -508, 913, 205, -990, 98, 949, -410, -831, 666, 635, -836, -343, 956, 61, -960, 258, 887, -520, -713, 773, 497, -901, -199, 980, -94, -936, 401, 822, -651, -601, 832, 356, -948, -66, 948, -258, -896, 507, 704, -749, -494, 889, 200, -965, 82, 916, -394, -813, 626, 603, -826, -344, 924, 43, -936, 241, 882, -514, -699, 744, 488, -877, -184, 957, -86, -904, 393, 804, -626, -596, 826, 357, -913, -53, 937, -233, -854, 503, 693, -727, -488, 867, 202, -940, 74, 900, -376, -810, 603, 586, -810, -360, 907, 57, -930, 217, 835, -492, -700, 718, 484, -853, -207, 939, -59, -891, 358, 801, -588, -590, 796, 370, -894, -59, 912, -199]
4755a99o43J317K22j394K16J331o43j116R80Q06j235m21J367nj369M34J218q08
4773E8r69J124O02j302k02J371k25j299O38J093r69p93J222M25j353QJ347m34
4791C42j213Q21R66j119o05J285K17j367K20J295o23j102R51Q05j197m31J329
4808E74J6j345M15J206p83r73J076O29j269k34J345j93j287O16J073r31p91J184
4826C28M14j315LJ323m09j200P87R39j059o16J258K35j337K02J263n85j075R19
4844G5P88j174m20J314j0j297L97J167p50r55J059O08j235k25J302j85j251N66
4862b26J081r08p89J149M35j290k5J289l80j165P42R54j046o16J234K24j300J79
4880d58J247n61j064Q91P89j145m21J277J7j273L84J153p45r13J028N94j221k14
$$ y = [-199, -842, 475, 697, -697, -481, 850, 207, -909, 71, 877, -358, -779, 588, 583, -786, -352, 866, 58, -911, 213, 815, -487, -689, 682, 457, -842, -204, 889, -80, -873, 349, 774, -579, -571, 776, 342, -871, -50, 916, -203, -808, 477, 694, -673, -453, 842, 219, -883, 68, 873, -324, -755, 574, 590, -755, -340, 866, 83, -890, 186, 815, -454, -688, 657, 464, -823, -207, 866, -65, -856, 328, 742, -573, -570, 753, 344, -856, -69, 870, -189, -805, 453, 688, -649, -447, 816, 231, -844, 75, 863, -311, -731, 583, 573, -724, -327, 840, 90, -865, 194, 802, -433, -658, 644, 459, -792, -226, 855, -53, -842, 307, 742, -548, -573, 716, 336, -829, -87, 867, -179, -795, 439, 663, -637, -458, 789, 228, -836, 55, 844, -301, -722, 555, 572, -701, -317, 836, 91, -822, 206, 800, -421, -635]
4898f35J283j92j210N61J042q98p79J141M12j270k4J269l70j157P44R18j025o01
4916g91J209K23j279J95J207n49j056Q93P69j123m25J259K8j251L55J140p05r14
4934h15R97O03j186k33J261j57j213N24J050q63p76J107M14j222l1J231l52j141
4952h02P10R09r88o00J174K25j242J55J194n24j035Q60P47j072m21J218M3j224
4970f73L27J132o78r20R65O16j156k35J226j27j214N15J033q21p72J072M42j224
4988d92p0J248l26j135O77R22r72o22J151K73j244J26J192m96j041Q09P97j070
5006b73m52J192Q5j223L06J123o55r17R53O21j152k52J214j10j176M96R98p84
5024fp73J048M51j186q4J213l02j114O48R10r31o17J114K74j214J02J177m68j024
$$ y = [-635, 648, 456, -754, -193, 849, -49, -828, 313, 725, -545, -569, 700, 330, -827, -83, 835, -190, -791, 418, 641, -638, -443, 764, 215, -841, 52, 821, -302, -727, 532, 560, -691, -336, 804, 99, -815, 182, 785, -401, -634, 627, 470, -743, -219, 831, -32, -808, 299, 713, -509, -540, 691, 339, -802, -92, 817, -171, -771, 403, 628, -614, -459, 735, 211, -824, 36, 783, -289, -710, 508, 551, -673, -346, 786, 108, -812, 153, 769, -387, -622, 604, 477, -737, -222, 811, -10, -782, 290, 732, -492, -562, 686, 360, -775, -98, 824, -148, -770, 381, 654, -590, -464, 728, 232, -809, 0, 797, -273, -725, 467, 552, -671, -365, 758, 103, -814, 139, 760, -392, -644, 570, 460, -716, -220, 778, -6, -779, 269, 720, -466, -550, 663, 361, -753, -105, 805, -126, -743, 371, 645, -569, -467, 710, 242, -782]
5043g82P79Q03j061m59J171R0j184K72J104o18r14R05O32j101k86J201r1j170
5061g09M56J027p82p70J021M56j162q9J188k77j100O28Q99r10n99J079K81j170
5079e33Q3J148m51j002P62P57j009m31J125R3j164K62J079o14q79Q84O05j071
5097c56k68J148q1j131M44R83p49p44R81M45j126j03J173k59j075O03Q82q68o19
5116g20J060K88j148P1J131m25r97P30P83r76m63J100J15j140K37J060n64q94
5134g52Q70O06j061k83J144r0j100M22R62p21p35R53M33j086r9J113k41j043N79
5153a29Q54q32n92J019K86j114O9J091m05r68P04P58r33m56J074J12j099K12J048
5172F99n48q70Q15O34j022l11J087k0j086L58R82o72p80R19M85j077j40J116k03
$$ y = [-782, -3, 800, -261, -720, 451, 541, -643, -371, 733, 115, -799, 106, 738, -363, -649, 552, 461, -709, -253, 774, -8, -778, 243, 699, -463, -552, 636, 359, -741, -113, 786, -124, -723, 356, 637, -533, -450, 698, 247, -755, 7, 764, -245, -676, 449, 542, -622, -360, 719, 105, -774, 110, 715, -356, -624, 524, 443, -688, -244, 739, -10, -754, 227, 672, -454, -557, 616, 357, -718, -115, 767, -101, -720, 340, 628, -520, -449, 682, 257, -740, -10, 773, -203, -666, 434, 549, -591, -354, 706, 142, -752, 118, 724, -337, -620, 524, 434, -666, -244, 718, -3, -738, 215, 648, -438, -537, 576, 335, -708, -129, 725, -107, -699, 320, 606, -508, -439, 652, 247, -721, -17, 741, -192, -648, 426, 538, -561, -349, 699, 151, -719, 96, 730, -292, -603, 484, 464, -622, -264, 718, 46, -734, 185, 670, -407, -547, 569, 366]
5191C66j039N12Q92q14o28R99L09j083K2J087l68r66O74P58r01m75J045J62j094
5210e42J87J049n28q64P73O29r82l17J077j9j067L48R54o52p51Q86M76j040j53
5229e36J076j71j028M96Q72p70o43R69L35j073OJ062l21r74O30P69q69m85J019
5248C64J78j080J63J036m73q86P50O48r51l40J060K2j074L35R44o23p64Q54N07
5267F70j017j76J061j66j006M72Q47p40o20R32L33j047pJ049l27r34O07P56q49
5286a62m83R99J69j052J55J005m59q59P37O20r15l45J034L5j057L05R47n92p59
5305f77Q35N07r89k09J050j19j015M33Q77p02o61R19L64j028n1J045k85r48N86
5324f8P56q25n17R77K05j029J19R86m13q63O99O33q97l58J004N1j019K81R33n72
$$ y = [366, -673, -161, 731, -83, -711, 288, 597, -486, -464, 623, 255, -711, -37, 721, -180, -655, 390, 552, -542, -355, 694, 166, -698, 75, 704, -278, -595, 482, 463, -604, -256, 698, 46, -705, 181, 657, -383, -536, 540, 369, -659, -163, 709, -61, -704, 265, 600, -473, -467, 595, 274, -700, -70, 699, -170, -655, 364, 542, -538, -375, 661, 188, -698, 52, 700, -251, -591, 469, 491, -583, -248, 696, 73, -691, 163, 670, -347, -523, 538, 372, -634, -162, 685, -55, -675, 257, 590, -457, -464, 585, 258, -676, -69, 687, -162, -645, 354, 523, -529, -374, 631, 172, -687, 50, 670, -245, -590, 444, 479, -578, -273, 674, 82, -677, 158, 665, -324, -533, 517, 398, -617, -184, 693, -9, -670, 249, 613, -415, -466, 579, 294, -654, -68, 688, -137, -654, 323, 528, -501, -382, 604, 191, -672, 27, 660, -237, -595, 409, 460, -559, -278, 655, 83]
5344H3p53Q09M91r57j89J009j13r78M30Q52o93o25Q80L54r94m0J002k69r38N70
5364f9P54q05n10R58K15j020R2R93m11q82P03O33q87l51R98O3j033K68R30n60
5384G9p59Q04N17r58k05J023j17r69M06Q35o73o25Q90L35r77l8R86k56r18N56
5404f4P30p77m98R43J86r87J15R49m15q35O75O12q55l59R74O2j009K62R19n54
5424G4p42P69N22r39k14J004r7r74M00Q61o68o45Q74L69r81o4J010k61r23N43
5444h2P51p65m94R12K13r88R5R53l91q30O47O24q35l63R43O5r87K61Q84n29p24
5465f40P44M88r06j95R60r8r22L83Q06o38o10Q34L43r43m1R63k51q71N15P14p36
5486a01m95R10K04r58Q9R41l85q19O25O32q28l53R26P3r67K31Q88n18p16P24M91
$$ y = [83, -670, 139, 630, -327, -516, 493, 380, -598, -168, 684, -9, -634, 246, 600, -394, -434, 568, 299, -639, -69, 685, -120, -630, 328, 543, -477, -385, 608, 197, -685, 18, 651, -236, -587, 411, 474, -559, -291, 639, 79, -680, 124, 641, -317, -522, 501, 384, -585, -179, 656, -17, -642, 248, 583, -394, -432, 554, 298, -620, -64, 666, -111, -609, 334, 520, -467, -352, 597, 182, -653, 22, 634, -221, -580, 394, 456, -553, -291, 628, 74, -668, 101, 623, -316, -530, 474, 377, -597, -197, 664, -4, -649, 225, 594, -387, -451, 559, 298, -625, -82, 669, -96, -590, 322, 535, -453, -358, 595, 204, -626, 21, 645, -190, -553, 390, 455, -532, -271, 613, 84, -640, 104, 592, -314, -509, 451, 353, -569, -186, 620, -18, -628, 206, 549, -394, -435, 528, 277, -594, -79, 635, -101, -596, 314, 518, -440, -351, 590, 205, -614, 11, 643, -185, -538, 388, 461, -506, -275, 613, 95, -621, 103, 594]
5507E94q81k19R55q8r22L81P86o32n94Q15L34r19l8R22k28q55N07O95p17m83Q81
5528B94J92r23J15Q83l76p79O29N62p78l40R03M7r09K39Q36n00o72O94M69q53
5548b67k03R06p8q89L57P70n98n93P81L52r04o4R14k05q60M78P00o97m82Q43K12
5569D73r00O1R03l43p84N94N79p57l50Q78P5q99K04Q28m56o75O63M76q21j94Q58
5590D13p3q39L27P57n84n61P48L26q50o4Q57j96q10M50O64o62m48P89K20q68O6
5611c38Q46l35p50N55N78p35l42Q54Q0q61J70Q21m51o64O52M85q09k28Q77n7q29
5632d81L14P37n57n63P31L35q31q1Q59j96p89M29O56o34m50P76K06q43M6Q20l15
5653A69p18N37N36o94l22Q05P5q31J76P80m26o32O14M46p48k10Q23m3q11K96P28
$$ y = [594, -287, -506, 449, 361, -561, -180, 606, -26, -620, 195, 529, -390, -428, 494, 266, -589, -82, 613, -104, -587, 294, 486, -437, -322, 561, 185, -594, 35, 597, -181, -521, 382, 429, -480, -241, 595, 95, -577, 117, 586, -267, -470, 436, 358, -531, -174, 596, -2, -595, 186, 538, -366, -430, 484, 279, -581, -103, 597, -100, -582, 261, 473, -427, -366, 537, 194, -590, 4, 583, -174, -524, 354, 429, -470, -266, 562, 106, -569, 94, 570, -251, -445, 413, 340, -499, -172, 585, 1, -560, 188, 514, -336, -400, 457, 261, -549, -99, 565, -97, -545, 244, 464, -404, -338, 508, 173, -577, -22, 556, -179, -521, 333, 413, -448, -278, 543, 92, -572, 80, 565, -244, -472, 405, 348, -481, -167, 570, 13, -550, 181, 516, -315, -396, 463, 267, -522, -93, 563, -71, -521, 255, 461, -382, -336, 484, 169, -549, -12, 524, -170, -492, 313, 388, -443, -267, 513, 87, -545, 69, 515, -233, -443, 380, 337, -474, -178, 550]
5674E50n28n53O99L30p90r8Q23j59p86M16O60o14m66P54K30q32K2Q24k81p28M99
5695b8N78o99l51P86J14q16J55P58l97o38N88M57p27k17P82k2p83K77O97m89n35
5716e10O59L32p58r6P92j59p32L77O17n57m48P12K21p86K2P63k50o92M81N32o37
5737a17l52P48J07p91J33P40l60o30N54M61o91k58P75jp66K46O84m52n46O33L69
5758D86p50j33P90j29p19L33O39n50m47O91K27p48%P56k37o70M29N27o08l32P13
5779B68J22p56J30O87l32n83M99M25o37k33P18%p21K16O53m17n29N79L43o89j23
5800c80P25r6o96L28O04n08m43O41K55p24l0P27j96o59L96N50n75l63O92J34p24
5821c42R2O91l05n97M83M60o45k49P11L3p21K03O35m01n12N60L24o63j14O91r5
$$ y = [550, 22, -531, 168, 498, -292, -390, 433, 274, -512, -96, 564, -50, -516, 238, 468, -364, -342, 482, 201, -527, -28, 550, -149, -500, 286, 400, -416, -261, 497, 100, -538, 50, 507, -220, -437, 345, 323, -460, -183, 514, 25, -510, 149, 481, -277, -373, 419, 260, -472, -95, 522, -35, -483, 229, 450, -336, -314, 449, 199, -493, -12, 520, -117, -469, 279, 386, -405, -272, 468, 108, -522, 32, 493, -198, -456, 319, 318, -448, -202, 482, 30, -516, 117, 486, -264, -397, 393, 264, -455, -122, 517, -33, -480, 211, 438, -310, -310, 446, 209, -461, -32, 495, -113, -445, 268, 390, -366, -236, 451, 119, -464, 35, 460, -177, -410, 308, 308, -413, -197, 456, 39, -490, 89, 432, -257, -380, 345, 249, -447, -119, 485, -23, -466, 175, 430, -294, -324, 403, 207, -452, -56, 494, -81, -444, 248, 382, -342, -250, 441, 136, -461, 22, 482, -163, -412, 299, 332, -389, -186, 449, 48, -464, 96, 420, -243, -357, 334, 239]
5842B39o62L05N57m75m11N92K38o70j6O79k01o09L98M90n56l14O50J27o74Q8O48
5863D23k91n73M71M24n98k37O78K4o79J78O26l82n14N34L45o56j24O85p8o60K67
5884a37N82m73m15N94K31o67k0O72j67o28L77M80n11l22O14J33o53P1O31k69n41
5905d18M43L94n54k19O19L8o27J67N72l47m80M90L25n96j26O33p4o09K55N41m26
5926Am24N50K49o30m2O31j57n85L27M90m94l35O06J54o55N4O25k39n40M11M19
5947D16n46k41O25M0o27J49N84l30m75M83L26n78j36O18n9n85K30N09l97l88N09
5968A27K25n86m7N95j49n34L09M44m55l08N47J41n95N2N74k26n00L84L75n15k05
5989c47N67N7n83J23N44k91m49M47L02n32j46N71k3n73K12N12l64m05M99K36n64
$$ y = [239, -423, -118, 439, -36, -447, 145, 383, -287, -303, 376, 175, -434, -36, 454, -102, -416, 234, 361, -313, -225, 423, 132, -441, 30, 454, -144, -381, 297, 321, -358, -180, 446, 64, -450, 84, 429, -227, -351, 334, 256, -404, -137, 445, -28, -443, 151, 382, -285, -305, 367, 200, -428, -51, 429, -82, -404, 210, 343, -310, -239, 392, 123, -418, 25, 419, -135, -354, 265, 303, -324, -157, 415, 68, -412, 78, 403, -193, -319, 314, 240, -369, -114, 427, 1, -423, 127, 376, -254, -296, 335, 178, -407, -80, 410, -84, -419, 187, 341, -314, -260, 365, 126, -414, -3, 416, -130, -371, 254, 294, -333, -184, 400, 70, -405, 78, 404, -174, -310, 308, 249, -336, -106, 403, 6, -382, 127, 352, -234, -281, 314, 165, -369, -60, 384, -71, -379, 168, 309, -286, -234, 340, 114, -386, -2, 373, -142, -347, 220, 277, -306, -183, 361, 70, -379, 68, 370, -162, -308, 263, 240, -333, -121, 391, 27, -378, 121, 357, -207]
6010b07o8N86j15n48K84M64m41l20N24J49n68K2N59j98m97L42L90m69k22N22P6
6031B65n58J08N26k80m20L99L03m92j48N38k7n20J98M67l38l66M58K21n23o5N46
6052B92r5n10K43M40l84l34M95J74n58QN51j79m95L26L91m48k59N17R7n58R0N18
6074C22k47m40L82L35m98j65N38on35J83M57k90l79M29K45m92r8N30q9m88K43
6095f3M13l67l09M56J74n08JM99j50m46K75L69m09k45M85P6n00O5M79k11m23L42
6117CL18m59j67N18J2n13J38M60k77l83M11K64m82j13N23o5m95K12M40l32l42
6138c29M48J86n03k5N10j27m68K72L76l82k42M50J00m90M7M78j82m32L24L13m17
6159i3j75M58K2m76J15M56k72l54L63K46m49r5M62k4m75J81M20l12l26M21J98
$$ y = [-207, -275, 311, 196, -352, -68, 396, -45, -365, 159, 308, -260, -238, 321, 123, -374, -32, 358, -111, -333, 189, 265, -293, -185, 341, 61, -359, 40, 343, -149, -297, 241, 214, -306, -108, 359, 21, -345, 113, 334, -189, -254, 292, 197, -313, -70, 370, -14, -348, 147, 321, -237, -229, 322, 143, -352, -26, 365, -83, -342, 175, 272, -286, -196, 322, 75, -365, 17, 352, -146, -311, 227, 221, -314, -131, 326, 36, -343, 86, 331, -161, -259, 271, 182, -306, -63, 350, -17, -326, 130, 304, -204, -203, 296, 146, -300, -25, 344, -65, -310, 175, 251, -249, -184, 295, 84, -339, 3, 321, -138, -305, 213, 225, -288, -150, 310, 33, -350, 61, 325, -157, -270, 253, 188, -307, -95, 345, 13, -329, 119, 305, -198, -223, 287, 160, -308, -36, 340, -42, -284, 166, 266, -224, -177, 301, 119, -313, 11, 324, -93, -268, 190, 212, -264, -149, 307, 35, -319, 44, 290, -159, -254, 208, 184, -291, -110, 310, -2, -328, 93, 291]
6180B91m62o3N04j10m68K60L87l64k79M51J34m88J3M91j70m38L00L47m15k17M79
6201A83O9n01Q9M61k37l94L59K74m40j39M80Lm79J52M24k82l35L85K08m39p3M56
6223B24o5m42K13L73l36k49M00J46m65J7M46j37l99K41L41l65k22M47P1m54O3
6244a52M40j99l97L31K91m21j61M59K1m83J34M31k81l39L73K46m54j05M77l0m75
6265b94J89M00l04k99L96J80m48l1M73j23m20K48L28l43k24M17J11m54L8M41j81
6286A00l81K94K86l83j72M40L6m46R5M13k26l52L29K36m03j17M44l1m43J72M06
6307B97k99l15M00J79m48l2M47r3m32K35L73l52k51M19J42m72J1M70j69m08L00
6328BL10l88j88M49N0m49P8M26k21l65L49K33m01j32M48j5m41J52L94k88k82L59
$$ y = [291, -171, -234, 270, 160, -308, -48, 339, -25, -304, 147, 281, -207, -194, 297, 127, -311, -11, 336, -79, -296, 183, 252, -249, -160, 301, 64, -330, 29, 303, -137, -276, 204, 207, -272, -120, 304, 22, -313, 72, 280, -159, -232, 224, 159, -283, -70, 303, -33, -282, 118, 264, -201, -184, 262, 125, -274, -33, 308, -57, -279, 168, 239, -215, -152, 288, 89, -308, 23, 314, -107, -268, 191, 212, -271, -137, 294, 13, -326, 47, 293, -161, -266, 211, 181, -294, -105, 295, -9, -308, 88, 268, -180, -211, 262, 139, -281, -33, 295, -48, -272, 145, 256, -198, -160, 281, 100, -281, 13, 299, -84, -256, 184, 220, -226, -131, 282, 56, -296, 33, 269, -134, -251, 193, 162, -281, -109, 297, -2, -317, 83, 262, -186, -218, 229, 136, -296, -61, 312, -40, -291, 128, 270, -202, -191, 279, 110, -298, 2, 312, -76, -264, 185, 235, -214, -136, 290, 69, -296, 53, 286, -115, -247, 201, 186, -255, -103, 291, 3, -279, 80]
6350H0J71m19n8M48j08l98K13L49l17k36L89J20m25J0M28j38l88K71L00l60j79
6371b47M15N1m34P7M46k32l60L24K60l99j46M52j4m40J44M06k82l22L64K15m33
6392a55o8M52q1m30K05L64l20k53L86J31m24kM29j23l88K58K90l38j86M02P7m42
6414b16P3L99j79l40L01K37l80j23M24j4m03J19L80k34l04L40J93m05p7M21o0
6435A52m15J84L61k96k61L65J59m34lM24j21m01K48L28l55k21M22Q2m28M7M26
6456B63j89l58K98K62l70j44M12K7m13J03L91k32l23L36K06l90q0M04l7l87J58
6477f3L40k75k57L53J31l84k7M03j04l73K16L15l25k12L80Q2m07M4L94j58l52
6498b79K72K73l69j42M08L1m27J04M03k18l42L32K32l96r0M14k4m23J62L64k69
$$ y = [80, 251, -168, -226, 222, 114, -284, -71, 278, -39, -275, 114, 234, -191, -181, 247, 109, -279, -8, 292, -68, -247, 168, 219, -215, -138, 308, 76, -284, 40, 300, -99, -245, 207, 193, -247, -103, 303, 21, -301, 63, 278, -155, -223, 229, 148, -282, -77, 287, -33, -286, 100, 231, -193, -195, 234, 111, -277, -19, 271, -67, -253, 149, 226, -216, -143, 256, 77, -263, 38, 275, -105, -228, 196, 182, -221, -102, 278, 44, -260, 80, 273, -132, -209, 212, 152, -263, -79, 282, -14, -275, 90, 249, -185, -188, 236, 115, -286, -38, 290, -65, -286, 136, 218, -210, -163, 263, 74, -284, 14, 276, -94, -238, 174, 201, -212, -109, 282, 50, -273, 63, 269, -121, -201, 203, 166, -221, -63, 277, 2, -255, 98, 229, -155, -182, 221, 117, -256, -40, 275, -50, -262, 118, 200, -207, -163, 231, 73, -279, -7, 266, -103, -245, 163, 194, -233, -129, 274, 56, -286, 46, 278, -118, -208, 206, 182, -241, -79, 285, 16]
6519A6k83L64J61m00l7M21j07l83K08L15l09k25L83R2l99K4L93j58l41K56K66
6540B57l40j65L87M0m05R2L77k10k98L00K10l60j08M09j8l97J56L34k43k75L46
6561H9J74m06l8M07r0l84J97L41l11k35L83J10m29PM36j46l86K65K90l66j76M24
6583A56L6m22Q6L95k09l28L11K22l66j19M10j9l91J46L53k41k73L28J70l86m7
6604a88M04p0l78J87L17k93k25L74J09m00PL87j28l55K52K78l40j81L86O0m22
6625b19P0L88j80l49L02K47l65j29M15%m21J42L70k39l18L44K02m07o1M12n6m00
6647b52J92L42l01k43L82J37m22J6L88j25l62K41K76l18j79L78O1m02O4L70j75
6668F8l20K64K43l60j28L86J6l98J17L61k29k92L22J86l86o4M08m2m01J74L35
$$ y = [16, -267, 97, 258, -142, -179, 242, 135, -248, -40, 275, -34, -259, 124, 216, -183, -159, 234, 76, -265, -9, 257, -83, -248, 139, 179, -226, -134, 243, 33, -265, 35, 245, -115, -223, 186, 168, -229, -73, 261, 18, -257, 89, 263, -143, -181, 226, 136, -248, -51, 290, -21, -256, 127, 237, -192, -185, 251, 105, -281, -16, 274, -92, -268, 156, 192, -230, -144, 251, 42, -286, 25, 247, -119, -238, 172, 153, -238, -92, 261, 20, -253, 75, 245, -141, -188, 216, 146, -232, -45, 272, -21, -246, 128, 237, -163, -156, 231, 103, -252, 0, 278, -62, -243, 143, 203, -219, -149, 239, 59, -290, 12, 259, -106, -235, 180, 180, -241, -99, 271, 32, -286, 58, 260, -147, -208, 204, 148, -252, -60, 282, -19, -262, 120, 257, -165, -149, 239, 114, -248, -7, 269, -49, -228, 150, 211, -191, -127, 243, 68, -252, 12, 255, -105, -233, 153, 169, -229, -112, 249, 20, -272, 50, 236, -150, -214, 194, 152, -249, -75, 260]
6689B60k85k43L64J49m15j3M24j18l74K27L16l45k15M13R5m32M1M17j81l57K80
6710HK73l73j39M00J7l99R4L73k19l10L09K03l75p8L97m1l83J71L25k76k36L30
6732G1J48l76j9L72p7l67K10L06l15j92L61J13m16M1L86j57l41K66K58l53j43
6753b24L86M3m15P4M05k22l28L19K34l90j11M24k7m16J59L52k63k84L56J58m10
6774a80j9M13q7l86K14L08l15k02L74Q7l90K9L93j47l42K49K56l20j63L91L7m01
6796b01R5L59j90l11K98K12l66j07L93k1l90J47L41k53k60L26J53l88l3L93p4
6817A23l83K01L15k98k34L77J27m19J0M09j33l54K39K85l35j85L97O4m09Q1L75
6838B53j85l19K87K32l64j09L79Jl81J18L60k47k69L17J56l57o0L83p5l42J60
$$ y = [260, -25, -268, 96, 245, -170, -183, 241, 123, -251, -24, 292, -53, -268, 145, 240, -192, -151, 266, 85, -272, 8, 281, -92, -231, 169, 186, -213, -119, 254, 35, -275, 34, 237, -138, -216, 181, 140, -243, -72, 253, -23, -259, 71, 219, -157, -176, 196, 119, -248, -38, 268, -47, -239, 122, 235, -181, -140, 246, 89, -252, 14, 272, -81, -224, 162, 205, -210, -136, 269, 47, -281, 38, 272, -118, -229, 195, 168, -248, -89, 263, 0, -284, 72, 230, -180, -199, 214, 127, -259, -45, 263, -52, -254, 120, 207, -183, -154, 239, 92, -250, -1, 255, -65, -228, 163, 200, -201, -106, 253, 63, -248, 50, 262, -104, -211, 182, 161, -229, -82, 259, 6, -254, 72, 225, -163, -196, 197, 123, -260, -59, 256, -42, -276, 101, 228, -191, -181, 228, 95, -259, -20, 265, -70, -255, 142, 206, -203, -122, 253, 68, -251, 36, 268, -96, -205, 174, 175, -206, -88, 272, 25, -244, 73, 229, -128, -188, 195, 120, -222, -62]
6859f2L08k74k12L38J00l70NL64j20l29K35K62l09j68L63N8l81N7L71j65l12K55
6881A4K40l41j26L83Jl76J09L65k36k69L03J94l75p7L94m8l82J59L17k62k27L38
6903I8J27l94OL67j15l37K16K76l16j61L46O9l79N8L35j46k82K42K20l09j25L55
6925A51jl34J07L03j93k63K85J81l45n8L62n0l45J61K98k57k25L13J39l66k9L80
6947B14j18l36K05K83l07j86L58P5l67M4L51j45l19K60K24l32j28L57K6l65J05
6968a01L35k10k57K81J76l33n7L39l2l45J52K93k42k14L10J15l33k1L44r5l15
6989b10J85K51k49j86L20P8l43K0L43j36l08K39K08k86j29L37M1l73Q5L26j80
7010C3k86K75J93l26q3L59k5l56J44L08k26k37L04J41l43l4L56q2l28J81K79k72
$$ y = [-62, 246, -28, -240, 98, 198, -172, -167, 197, 77, -252, -17, 245, -64, -232, 131, 189, -192, -135, 236, 71, -241, 14, 254, -87, -213, 170, 171, -205, -96, 269, 33, -236, 67, 261, -114, -191, 203, 155, -227, -68, 249, -13, -240, 98, 225, -169, -163, 204, 89, -248, -32, 244, -72, -233, 113, 182, -197, -139, 196, 50, -232, 10, 230, -79, -204, 151, 150, -184, -77, 226, 33, -230, 55, 236, -109, -167, 195, 145, -200, -39, 259, 2, -223, 90, 229, -137, -166, 214, 96, -240, -35, 248, -59, -245, 113, 188, -179, -135, 216, 71, -248, 12, 236, -96, -224, 133, 159, -206, -101, 234, 24, -233, 48, 224, -109, -166, 173, 141, -204, -52, 241, -1, -215, 95, 210, -123, -144, 200, 105, -210, -25, 226, -23, -209, 111, 189, -154, -134, 209, 73, -235, 4, 212, -74, -203, 134, 175, -198, -113, 213, 33, -253, 22, 215, -111, -194, 165, 140, -216, -72, 236, 10, -227, 77, 218, -125, -159, 197, 115, -213, -32, 247, -25]
7032b5j92L26Q0l36J1L47j34k85J99K19k79j36L17M3l49P8L24j72k65K45J87k96
7054i3r3L19j1l29J24K97k05k34K89J31l18m1L49p3l12J61K74k54j92L19J01l54
7076a45NL48j23l08K16K47k94j58L30O7l56N4L29j60k79K43J93k91j15L34Ol48
7098b05J12L03j90k52K67J62l11n5L24l6l25J41K75k20j89K77J06l15kL24r3k94
7120a96J91K33k69j54L08O5l39M5L28j50k92K36K21l10j13L29Kl37Q5L30j98k55
7142b40K86J57l29p1L50l1l42J44K95k23k27L09J06l22k4L45r0l02J78K54k57
7163c4j67L11P7l40L7L10j23k79K16K05k79j15L07L0l33P9L03j68k62K62J56l13
7185a20n8L21k7l17J27K86k27k15K98J15l20k7L33p9l06J87K57k70j68L12Q1l41
$$ y = [-25, -217, 109, 189, -147, -136, 211, 77, -208, -9, 210, -69, -205, 112, 155, -194, -116, 208, 36, -229, 16, 203, -93, -186, 133, 122, -207, -83, 214, 9, -225, 64, 195, -123, -164, 185, 112, -200, -39, 235, -19, -211, 108, 209, -145, -140, 208, 85, -223, -7, 240, -54, -212, 118, 185, -171, -117, 212, 52, -227, 16, 209, -82, -197, 137, 143, -205, -93, 210, 20, -232, 35, 197, -114, -169, 155, 119, -206, -65, 210, -10, -199, 78, 184, -131, -133, 191, 98, -196, -5, 228, -41, -195, 113, 178, -161, -116, 212, 62, -230, 6, 227, -83, -196, 133, 135, -202, -117, 213, 15, -240, 46, 203, -126, -197, 153, 122, -220, -76, 219, -4, -231, 78, 184, -138, -162, 183, 93, -209, -31, 223, -34, -201, 110, 187, -153, -116, 194, 71, -208, 8, 213, -66, -181, 126, 156, -177, -98, 205, 37, -225, 37, 193, -120, -178, 143, 116, -201, -74, 212, -15, -230, 68, 183, -137, -164, 169, 90, -216, -29, 228, -42, -210, 102, 183, -158]
7207a58K5L36j27k90K18K30l04j32L40K4l27P0L16j80k55K51J70l05p7L35m0l19
7229a99J40K66k24k01K67J33l21k4L26p7l04J78K53k51j59K91P2l23L4L09j26
7250F0k81K17K25k74j39L20L6l29Q6L04j82k51K64J67l08q9L31j9l28J24K95k31
7272bk09K82J28l35k9L25o3l13J70K53k60j63L10O9l22K3L08j15k73K02K19k69
7294f4j23L14J9l05N3L12j66k32K26J80k87q4L13k4k95J16K63j96k24K69J38l12
7316a09l9L14n9l07J60K58k36j98K89J00l22J1L13j10k92K06K21k67j46L28L4
7337A49l31P1L07j55k46K32J73k80r1L17ml08R5K80k00j95K47J37l04l5L06n2
7359A13k77J24K47k21j81K70J05l05pL00r5k65J77K18k58j43K92M1k96M2K89j31
$$ y = [-158, -133, 203, 76, -214, 4, 234, -70, -202, 138, 162, -165, -95, 221, 41, -214, 37, 207, -98, -175, 160, 120, -199, -59, 207, -17, -218, 49, 182, -139, -163, 163, 86, -218, -40, 213, -38, -197, 94, 166, -157, -123, 186, 60, -221, -4, 221, -53, -192, 128, 164, -165, -79, 225, 43, -208, 56, 223, -85, -174, 157, 138, -190, -66, 229, -2, -211, 71, 199, -136, -165, 160, 97, -216, -46, 207, -53, -216, 94, 163, -159, -136, 172, 57, -216, -14, 205, -64, -187, 127, 146, -159, -106, 206, 40, -192, 34, 214, -73, -157, 156, 132, -163, -47, 216, 20, -204, 65, 203, -109, -148, 166, 107, -200, -40, 218, -18, -216, 73, 173, -149, -138, 175, 65, -227, -21, 200, -67, -213, 115, 149, -182, -111, 196, 41, -205, 27, 200, -80, -171, 146, 142, -166, -71, 209, 9, -186, 61, 198, -106, -141, 165, 113, -164, -40, 207, -14, -195, 75, 180, -125, -132, 168, 73, -192, -15, 203, -55, -198, 94, 135, -161, -119, 170, 39]
7381C9k58K32J87k88j05L33J0l31R6K88j88k21K57J41l00m5L18m2l11J38K77k34
7403gk00K94R4l08pL09r3k74J65K24k42j37K80M5k95M0K93j40k49K16J79k74r4
7426a81L03mk84P8K64j54k19K40J42k86o0L07k8k90J24K54k21j74K60J10l09n
7448a33L14p9k89J72K28k46j57L09N5l24L3L04j29k65K08K07k90j08L05J9l07
7469a73P0L03j93k26K45J48k81n4L01l1k89J31K44k11j81K62J05k80j2K88p4k69
7491a77J55K28k33j62K94O8l07L5K83j20k58J94K02k60j21K87K7l09P4K94j72
7512B2k36K57J39k96n8L10k1l07J16K67k06k03K63J38l09k3L15p7k83J79K18k45
7534d0j51K91P3l06K7K96j15k61K01J95k71j15K98K4l00O9K71j55k22K22J48k69
$$ y = [39, -219, 13, 200, -88, -193, 140, 150, -181, -85, 203, 15, -206, 51, 192, -108, -153, 165, 123, -188, -50, 227, -7, -207, 87, 181, -127, -134, 175, 82, -192, -27, 197, -45, -182, 98, 143, -152, -112, 181, 41, -208, 8, 187, -87, -181, 122, 118, -166, -88, 176, 22, -197, 43, 185, -101, -161, 146, 118, -172, -48, 206, -15, -189, 71, 181, -128, -133, 181, 102, -187, -15, 213, -33, -190, 119, 174, -150, -117, 187, 58, -207, 1, 208, -82, -190, 115, 134, -173, -103, 200, 7, -219, 26, 174, -107, -161, 140, 109, -180, -49, 195, -16, -197, 65, 170, -110, -122, 166, 92, -177, -22, 206, -27, -189, 105, 173, -134, -99, 184, 64, -194, 0, 202, -58, -179, 108, 135, -174, -100, 194, 22, -214, 43, 182, -114, -172, 138, 117, -190, -74, 193, -13, -216, 47, 185, -124, -147, 168, 91, -192, -13, 205, -40, -191, 100, 173, -133, -106, 190, 75, -186, 15, 210, -61, -176, 122, 146, -154, -85, 186, 31, -191, 31, 179, -90]
7556i0p1K98k7l05J20K50j89j97K68J10k92k8L06p2k84J60K44k35j54K81P9l21
7578a49L3L07j20k68K10K09k95j12L13K9l23P5L05j78k48K53J62k98p8L37l9l10
7600a85J34K61k22k09K80J12l06k5L13p7k83J64K33k34j61K98N8k91QL04j10k62
7622b00K03J94k59j15L07J2l01P9K89j74k44K50J60k96o1L21l4l13J17K83k21
7643ck07K89J10l21j7L21r0k95J70K44k47j71L02Q3l38M7L09j30k78K22K05k96
7665i1j04L24J1l17R7K91j84k20K37J55k87n6L04l8k98J34K52k15j82K64J03l04
7687a24%K91q8k76J81K22k48j66L03O2l24M1L03j25k74K29J95k82j11L25Pl31
7709a90R3L00j86k40K60J60l17n1L29m0l10J34K81k28j98K95R2l08nL11r5k81
$$ y = [-90, -161, 137, 110, -195, -75, 175, -14, -211, 57, 167, -125, -153, 153, 81, -203, -43, 201, -34, -188, 93, 172, -149, -116, 191, 71, -197, 13, 222, -73, -185, 128, 157, -166, -91, 214, 36, -212, 41, 203, -95, -173, 164, 125, -185, -51, 210, -12, -221, 59, 171, -135, -160, 153, 76, -207, -43, 190, -44, -205, 93, 151, -140, -132, 172, 62, -200, 3, 197, -62, -177, 130, 142, -159, -80, 209, 35, -209, 41, 201, -95, -156, 165, 131, -182, -65, 218, -3, -210, 79, 189, -132, -149, 172, 82, -213, -43, 201, -46, -217, 85, 168, -170, -123, 186, 56, -222, 0, 205, -91, -195, 129, 140, -177, -80, 211, 27, -193, 44, 199, -88, -144, 160, 122, -176, -42, 210, -5, -187, 77, 180, -124, -124, 167, 79, -197, -16, 206, -42, -208, 95, 157, -167, -126, 177, 52, -222, 7, 202, -80, -191, 134, 141, -190, -97, 203, 17, -223, 37, 197, -120, -171, 158, 118, -192, -58, 223, -5, -203, 92, 184, -124, -129, 182, 87, -194]
7731a94J72K26k42j55K99L9l04M2L06j50k43K05J92k66j23L13Pl06Q4K76j69k41
7753b32K67J45k96n8L32m3l18J50K63k27j89K87J06l18j1L40j05k93J86K35k58
7774c7j58L12N1l32N6L13j47k65K25J97k85j26L29Jl28R9L02j96k28K51J59l11
7796a18n2L16l8l13J39K54k00j95K77J17l20j1L15q1k86J68K38k52j59L05O5l13
7818a44L7L16j36k79K30J85k76j03L12kl19Q9K92j77k52K72J69l26n9L30n0l19
7840b10J46K72k27k01K93J09l31pL42j00k97J91K36k59j61L24N3l24L2L12j23
7861G0k67K24J92k89j01L23Ol15Q6K77j61k46K47J52k93o8L18l6l26J49K77k23
7883dk15K79J26l24qL12q0l09J86K40k51j61L13P5l45M1L23j42k71K21K31l03
$$ y = [-194, -22, 204, -38, -193, 106, 145, -159, -117, 189, 39, -204, 1, 193, -73, -196, 117, 124, -182, -98, 178, 9, -232, 35, 180, -116, -174, 158, 115, -203, -53, 210, -17, -206, 81, 187, -131, -142, 198, 93, -200, -14, 221, -37, -195, 117, 168, -164, -108, 205, 58, -207, 18, 215, -70, -196, 133, 134, -194, -95, 207, 11, -217, 34, 193, -118, -170, 146, 108, -205, -66, 188, -12, -207, 70, 187, -133, -144, 171, 90, -196, -28, 210, -42, -201, 104, 169, -144, -107, 209, 73, -206, 24, 209, -67, -170, 142, 140, -179, -90, 202, 25, -227, 45, 214, -112, -171, 159, 109, -210, -64, 208, -19, -220, 73, 182, -149, -156, 186, 86, -211, -20, 216, -43, -204, 120, 173, -151, -119, 193, 70, -197, 27, 219, -70, -171, 152, 158, -157, -71, 206, 45, -201, 46, 198, -95, -163, 155, 119, -207, -58, 219, -4, -219, 60, 186, -138, -146, 166, 86, -223, -37, 203, -48, -209, 104, 179, -166, -125, 198, 56, -215, 6, 237, -66]
7905f6j23L27J3l40J06L07j88k49K60J76l13p4L34l4l30J38K72k25k15K94J19
7926A89l32rL23o9l12J76K53k57j77L03P7l28K3L22j26k71K13K08k73j31L23L0
7948A55l36R0L13j88k47K54J81l13p5L38l3l37J29L03k25k35L09J34l57j9L44
7969A85q4l34J95K58k66j85L28Q2l60L9L31j35k95K24K32l03j28L44K2l43P2L20
7991A99j56k72K56J87l09r1L53k4l35J30L00k23k35L05J18l23l7L57p9l31J79
8012c1K78k67j94L18Q6l64K0L49j25l19K38K43l05j62L69K7l56P6L26j74k80K79
8034C2J89l35q4L68k6l56J30L16k18k45K98J57l47n0L67p1l31J77K76k70j92L28
8056A13R2l55J8L49j38k97K24K30l03j53L53L9l66P8L37j83k91K61K19l39q5L52
$$ y = [-66, -189, 138, 151, -189, -83, 224, 36, -213, 47, 223, -90, -164, 170, 136, -194, -56, 216, -9, -224, 70, 189, -143, -152, 171, 102, -210, -34, 219, -38, -215, 88, 165, -163, -140, 182, 56, -215, -2, 206, -67, -198, 125, 155, -181, -91, 222, 34, -213, 41, 222, -91, -166, 172, 139, -198, -69, 234, 9, -226, 83, 217, -140, -159, 185, 101, -233, -38, 220, -46, -231, 97, 179, -181, -142, 189, 54, -241, -17, 215, -88, -216, 128, 150, -193, -121, 199, 43, -229, 27, 214, -95, -186, 167, 143, -192, -62, 238, 15, -220, 85, 203, -120, -157, 200, 121, -210, -31, 247, -20, -214, 104, 190, -174, -154, 195, 70, -249, -11, 232, -73, -235, 134, 161, -195, -119, 207, 33, -247, 32, 221, -114, -198, 170, 144, -212, -82, 234, 16, -229, 69, 226, -121, -171, 196, 125, -206, -29, 247, -23, -215, 113, 205, -150, -132, 217, 79, -218, 6, 236, -67, -220, 133, 172, -194, -116, 221, 38, -253, 8, 227, -112, -197, 155]
8078A55j5l63J41L08k30k47L11J66l61m7L89q6l43J83K96k78k06L38J10l77jL82
8100B25j26l28K41K50l21j59L62M2l64O0L45j72l12K71K08l26j18L76j4l57J10
8121a07L37k21k59L06J69l59n5L81p6l50J85K92k70k03L30J16l79OL82j23l47
8142b45K30K75l07j75L64N0l86O5L65j78l04K69K19l47r3L60ol72J25L34k26k76
8164b59L10J76l72n6L84p2l47J78K92k54k29L35J20l78J0L77j30l09K04K73l13
8185f0j63L63N2l69N7L55
$$ y = [155, 140, -223, -82, 226, -4, -251, 60, 226, -135, -182, 207, 121, -222, -39, 257, -21, -227, 111, 221, -156, -157, 225, 99, -229, 12, 262, -59, -218, 144, 186, -178, -118, 227, 55, -257, 14, 222, -104, -222, 154, 140, -217, -107, 230, 9, -250, 56, 225, -134, -189, 192, 116, -234, -49, 243, -27, -230, 100, 216, -163, -157, 225, 102, -245, -15, 260, -47, -222, 142, 192, -194, -129, 236, 58, -246, 23, 242, -105, -198, 162, 156, -216, -91, 243, 17, -259, 51, 227, -145, -201, 183, 111, -236, -58, 234, -20, -249, 86, 206, -172, -162, 215, 85, -224, -20, 253, -60, -223, 140, 192, -177, -120, 235]
8191B35
$$ Imaginary data points
##PAGE= N=2
##DATA TABLE= (X++(I..I)), XYDATA
0@%%%%%%%%%%%%Qj6J6j6J6k4L2l2M0m9N7p0Q0r2J08j25J47j70J95k24K54k88L25
35A72l67M14m62N16n78O44p17P96q83R78j079J191j315J450j595J758j939K135
53A119k355K601k877L188l543L953m432N001n690O544p635R088j1121J4191j9403
68a1371L0500r2339J22173J28912l07430R661K73591p4132k63679J69403J95696
79A80985k18809j33237K65957M1179k70078L8714K60409j24508k15094J86754
89A2272J58427k37047q0780K56757L163k56502P7503K27385j44713j80862J99587
100C5190J15385k31538m2714K42710l4325k28700J04980J94347j65342j40952
110a50959K07720P5832k30051m090K29400o6199k07237J29072J65502j78269j08904
$$ y = [0, 0, 0, 0, 0, 0, 0, 0, 0, 0, 0, 0, 0, 8, -8, 8, -8, 8, -16, 16, -16, 24, -25, 32, -38, 42, -50, 58, -67, 80, -90, 105, -119, 135, -153, 172, -195, 219, -243, 273, -305, 339, -378, 418, -465, 513, -566, 625, -690, 760, -835, 923, -1016, 1119, -1236, 1365, -1512, 1676, -1867, 2086, -2346, 2655, -3035, 3509, -4126, 4962, -6159, 8032, -11371, 19129, -73210, 48963, 177875, -129555, -119894, 153697, 79565, -184114, -14711, 180985, -37824, -171061, 94896, 136075, -134003, -95289, 165120, 40612, -174482, 12272, 170699, -66348, -147128, 109629, 112792, -143710, -66207, 161178, 16465, -164397, 35190, 150575, -80963, -123677, 119033, 84708, -143992, -39012, 155335, -10007, -150959, 56761, 132593, -97458, -101548, 127852, 61653, -145584, -16512, 148990, -29279, -138183]
121a38183K09634M2821k20197K6039K09406r1133j78573J46162J31046j85946
131d8924p1787K06888O806k07370N7431J87859j14696j50750J59642J00028j88177
142f3050m0963J98013k0593j88600P8656J61251j27650j19063J63061O6479j81841
153g4300q822J82647m8225j65922R9274J33759j39673q9574J65891L7800j75741
164h2886J6498J68629o8102j45535J12170J08969j44632o2683J62637J1180j64680
175h8435M0527J50920q7589j22864J25589Q3377j51030l6361J61620j3580j56500
186i4326O1571J36306j02900j03269J33600O0832j50902j3258J53268l4663j40843
197i4584P8380J15047j13722p8623J37415L5273j47393J0610J42992n4575j24913
$$ y = [-138183, 71451, 114272, -105925, -79886, 129520, 38387, -140186, 5976, 137022, -48924, -120711, 86177, 92983, -114387, -56956, 130903, 16207, -134543, 25099, 125127, -63050, -104013, 94000, 73407, -115193, -36537, 124714, -2936, -121999, 41062, 107541, -74300, -83122, 99525, 51300, -114622, -15348, 118411, -21262, -110836, 55055, 92855, -82886, -66388, 102241, 34139, -111396, 774, 109743, -34889, -97572, 65065, 76245, -88435, -47908, 103012, 15423, -107441, 18148, 101525, -49505, -85866, 75754, 62174, -94326, -32755, 103551, 651, -102618, 30982, 91814, -59088, -72346, 80922, 46259, -94584, -16204, 98843, -14879, -93502, 43913, 79186, -68207, -57597, 85395, 30820, -94093]
208i4093R2353R5255j20465n7138J36394J4452j38905K8637J28085o8049j05229
219h8703J00135P2752j21978l3863J31704p574j28615M7648J13188q2492q7166
230h4964J08957N3130j24587j4484J28054k5036j19196O1701R8937r1974o9368
241g8830J13001L3395j22831N440J20631m3355j06736P6692Q2606j02247n0741
252g2975J17647J4296j21531K3145J13608n7894r4825Q6599O7094j06482l3277
263f4595J15695l195j13540L8744J00384o9896p7760R3724M8057j08093j4261
274e4736J11836k0291j04800N2255Q7909p8659o2930R7044L2448j05814N68J04320
286E9150l2926r2910O1603P2788q3958m5990R7977J5130j02473J6884R7074m6988
$$ y = [-94093, -1740, 93515, -26950, -84088, 52306, 66758, -72147, -43510, 84575, 16526, -88703, 11432, 84184, -37794, -71657, 60047, 52473, -76142, -28494, 84694, 2202, -84964, 23993, 77123, -47464, -61948, 66106, 41070, -78126, -16425, 82512, -9462, -78830, 34171, 67566, -55265, -49825, 70806, 27451, -79285, -2593, 80013, -22234, -72975, 44672, 58968, -62563, -39418, 74190, 16296, -78529, 8070, 75164, -31318, -64595, 51100, 47905, -65635, -26891, 73493, 3597, -74163, 19561, 67618, -40475, -54736, 57100, 36809, -67991, -15736, 72173, -6486, -69416, 27628, 60076, -45738, -45170, 59150, 26224, -66686, -5083, 67705, -16253, -62243, 35734, 50864, -51609, -34725, 62349, 15361]
298A5361q2390P2341N9894r0534l1783R9845Q63r9462K9892Q9489n7531p0915
310f4930P9305M5678r3237j6200R7991j4571r3199M3651P9429o8255n8109Q5985
322B3538L1439r5216k085R5160k7020q5996N3076O8752p3610m5198Q6694J7719
334D7253r1213J0936Q6903l8037p4312O0982N4830p7690l0469Q6711L597q7320
346d7829K3180P9602m7289o4476O6554M3457p9193j8624Q4136p653q0969L2859
358a6245P0126n4678n2636P1023L0254q0402n126Q1983k0316p5662M3664O2092
370E4077o2661m2630P5507J9181q0962N899P8584l0244o8564N1412N1981o7366
382a5786l0536P6622O325p8319J8209P2394m0670n9562N8901M1184p1227j9140
$$ y = [15361, -67029, 5312, 65206, -25328, -57111, 42734, 43597, -55865, -25973, 63516, 5985, -64930, 14375, 60053, -33184, -49384, 48607, 34036, -59163, -15512, 63917, -4338, -62447, 23538, 54977, -40239, -42324, 52836, 25816, -60180, -7104, 61648, -11962, -57160, 29534, 47253, -43960, -33024, 53879, 15842, -58470, 2512, 57342, -20348, -50817, 35894, 39491, -47829, -24649, 54953, 7664, -56812, 9742, 53199, -25994, -44618, 39518, 31865, -49104, -16245, 53881, -797, -53433, 17590, 47844, -32558, -37684, 44299, 23983, -51679, -8015, 54077, -8584, -51214, 24293, 43474, -37488, -31589, 46995, 16751, -51813, -401, 51580, -15786, -46322, 30300, 36625, -41694, -23485, 48909, 8239, -51323, 7578, 48762, -22465, -41605]
394d1605P6523m382p4396K7022O5229m6675m9990O1492L0287p0151q062P1950
406C7242j4535o6823L5351N5399n2450l8847O4282J8847o9823K698O8646k3713
418A6274o0947M2243M7498n6544k9658O5312R101o7696J2157O3543l2120n3227
430d4064M8833L7804o0743j8761O6677k010o6126K2525N9145m0738m6471N4877
442A0948K9379o3602r569O6044j0966o2037L0213N2034m6270l7096N7604J8734
454C5416o3164J149O2542k0630n5878L7834M3948n1123k7974N9290R574o1620
466c0636R387N8040k7173m8911M2002L5276n2553j8466N7864J57n7546J7905N1725
479C7071l4072m0969M6786K6380n4896r367N7654q428n4850K5294M6784l9625
$$ y = [-41605, 34918, 30536, -43860, -16838, 48391, 1716, -48274, 13218, 43505, -26646, -34708, 37242, 22707, -44116, -8765, 46634, -5816, -44663, 19619, 38466, -31357, -28659, 39987, 16274, -44673, -2430, 45068, -11476, -41134, 24178, 33279, -34417, -22260, 41283, 9163, -44064, 4769, 42573, -18170, -36931, 29746, 27736, -38390, -15865, 43280, 2542, -43929, 10948, 40327, -23275, -32844, 33200, 22234, -39803, -9590, 42444, -3826, -40922, 16682, 35416, -27748, -26599, 35943, 15313, -40565, -2731, 41217, -9906, -37880, 21410, 30984, -30636, -21249, 36791, 9618, -39293, 2709, 37985, -14568, -33034, 24830, 24987, -32559, -14654, 37071, 2999, -37970, 8816, 35196, -19700, -29067, 28587, 20159, -34691, -9397, 37387, -2238]
491b238l4203M9992J8405n5464q65N5478j6676n0043L2506L9728m5096k5536N3214
504A9202Q864n6053Q588N3371k5081m5474L8966L3232m8895j7913N3945J059n3695
517b9884J5655M8248l0612l8192M2369K4550m9806q741N2262p647m9609K3013
529h394M2178l5891l0837M5096J6721m9777j259M9635j4081m4736K7852L5567
541C2074l8713k3077M5701Q489m8172O808M5912k1321l9177L3664K8672m2656
553a1796j5411M7454O80m7604J4070M3086k7373l4351L7928K2275m4689q050M6964
566B3183o863m4582K0986L7812l2924k7370M1511J4322m5940j1M5822j4138m1245
579b9437K6759L2682l6587k1069M2673P608m4515O358M1976j9420l5415L0321
$$ y = [-2238, -36441, 13551, 31956, -23508, -24373, 31105, 14429, -35614, -3108, 36620, -8476, -34012, 19202, 28066, -27987, -19399, 33972, 8891, -36583, 2383, 35615, -13280, -31193, 22752, 23811, -29884, -14229, 34019, 3407, -34785, 7584, 32134, -17672, -26413, 25849, 18202, -31407, -8394, 33784, -2107, -32944, 12152, 28873, -20904, -22163, 27472, 13391, -31345, -3493, 32074, -6639, -29716, 15985, 24474, -23698, -16890, 29022, 7701, -31476, 2188, 30860, -11796, -27207, 20247, 20927, -26677, -12607, 30479, 3106, -31245, 6683, 28958, -15731, -23781, 23183, 16320, -28262, -7276, 30536, -2388, -29758, 11753, 26075, -19865, -19876, 25946, 11808, -29437, -2678, 30004, -6583, -27652, 15021, 22629, -21886, -15528, 26448, 7028, -28387, 1934]
591A934K5582l8093j3465M2071K70m1940J2726L7815k4318l0155L3437J9703l9218
604a3651p530M1188n222l9156J7297L3398k7563k4491L5089J3270l9159q29L9400
617B2041j1645l5779K2928K8681l1975j8754L7846P031l9987N335L8200j7121
629F801l2680K7156K4000l4455j3042L8329Q91l8405J1228L4719k2126k7646L0718
642E488J7977l6214o692L8097n027l6315J6105L1059k5424k2928L2127J2769l5643
655a4621j588L5673r535l2283J9548K5823k7499j7006L2706O653l4675M183L3290
668B0669j4494k8742K3316K1487k9832j2220L3426J833l3758Q675L0817j8285
680B892k4889K6059J6571l1239o669L3369l871l2211J4002K7912k2761k0882K9268
$$ y = [1934, 27516, -10577, -24042, 18029, 18299, -23641, -10915, 26900, 2582, -27573, 5864, 25567, -13651, -21181, 20007, 14785, -24371, -7074, 26324, -1239, -25730, 9359, 22629, -16530, -17359, 22041, 10396, -25383, -2455, 26226, -5749, -24503, 13343, 20374, -19613, -14278, 23922, 6801, -25879, 1277, 25277, -9178, -22220, 16109, 17000, -21405, -10177, 24542, 2416, -25230, 5488, 23465, -12749, -19441, 18656, 13629, -22686, -6581, 24478, -946, -23874, 8253, 21022, -14621, -16209, 19464, 9929, -22354, -2806, 23017, -4482, -21488, 11218, 17871, -16804, -12621, 20669, 6175, -22567, 749, 22236, -7596, -19816, 13610, 15443, -18315, -9640, 21177, 2892, -21997, 4062, 20633, -10606, -17275, 16094, 12223, -19988, -5986, 21926, -835, -21717, 7551]
693G551J1837l2874j663L3263q638l0364J7986K4527k5459j6351L0343O684l2196
706a5354L479L0895j3174k6600K1442J9800k7519j1204L0853J661l1188P874K8530
719A9495j6526k3167K3404J5722k7932o902K9697k399k8627J1352K4822j9091
731a52j8696K4960J0786k8332j899K8945p119k6744J5420K1920k2154j5028K6734
744H641O668k8660K298K7801j1023k4215J8650J8258k4437j0477K7779J669k8351
757a5399P267K6123j5455k1320K2064J4468k6451o298K8245k401k7286J0756K3700
770A8013j7966j7878K3316J0409k6318k045K6725o365k4516J3980K0013k0132
782b764j3664K4238O169k6007J802K5271r493k2152J6158J6987k1227j0247K4201
$$ y = [7551, 19388, -13486, -15149, 18114, 9476, -20888, -2902, 21625, -3834, -20185, 10158, 16842, -15354, -11875, 19020, 5846, -20754, 688, 20488, -7031, -18235, 12618, 14279, -16909, -9035, 19495, 2969, -20198, 3206, 18928, -9004, -15906, 13791, 11392, -17235, -5883, 18939, -152, -18848, 6112, 16898, -11434, -13333, 15612, 8493, -18251, -2831, 19089, -3065, -18093, 8641, 15309, -13351, -11053, 16748, 5725, -18490, 160, 18418, -6019, -16496, 11283, 12952, -15399, -8132, 17991, 2536, -18784, 3280, 17748, -8703, -15001, 13244, 10843, -16443, -5687, 18013, 47, -17831, 5485, 15894, -10424, -12469, 14256, 7891, -16625, -2645, 17368, -2764, -16428, 7810, 13979, -12028, -10226, 15045, 5552, -16600, -442, 16545, -4682, -14929, 9272]
795I272K604k4812N202K3024j2437j9036J8437J3238k2604o211K4601j431k4211
808a4364Q929K1471j5552j6657K0673J0218k3759k797K4513m886k2839J2032J8922
821A5904j7949j3187K2086O191k4014J360K3585q721k0864J5175J6148k0076r915
834a4277K2992K821k3633M436K1963j1114j8256J6608J2877k0406o391K2194n90
847I224k1867P422J9451j3452j5215J8103R581k0980l105K1813l588k0561R868
860c306J7342j5125j2504J8898O502k0820O3K0746o644j8626J2596J4649j7282
873c511r233K0283K887k1253L745K0124r983j7043J5239J2278j8976o327K0835
886I065k05k0604O642J8402j2424j4350J6894Q944j9639k755K0456l646j9251
$$ y = [9272, 11876, -12936, -7734, 15290, 2853, -16183, 2254, 15492, -7112, -13323, 11278, 9847, -14364, -5435, 16036, 484, -16173, 4500, 14718, -9041, -11838, 12675, 7789, -15050, -3018, 15904, -2045, -15232, 6854, 13045, -10969, -9609, 13976, 5255, -15609, -434, 15714, -4362, -14277, 8715, 11536, -12097, -7661, 14302, 3188, -15068, 1540, 14417, -5989, -12380, 9814, 9224, -12643, -5221, 14230, 778, -14437, 3666, 13247, -7733, -10838, 10975, 7387, -13174, -3306, 14036, -1089, -13593, 5305, 11807, -9013, -8950, 11796, 5152, -13474, -878, 13771, -3511, -12744, 7539, 10426, -10827, -7082, 13042, 3059, -13984, 1255, 13533, -5443, -11770, 9065, 8860, -11744, -5102, 13300, 876, -13474, 3420, 12364, -7275, -10030, 10426, 6780, -12471]
899a2471R567J6211j4482j1682J7914O132j9608o0J9373n883j7319J1184J3625
912A2501j5315q689J7905L006j8750K898J7782q459j5114J3138J1048j6538n920
925a0507J8341K46j8366N436J6587j0560j3224J4649Q537j7259l033J8170k772
938F245j7275Q298J4654j2986j0578J6386N452j8163K16J8129n850j6288J0867
951h93J2857j4787q190J7213K757j7923K895J6848q166j4151J2587J0102j5692
964d543n145J7239k39j7101N521J5320j0200j2076J3814P752j6049k741J6692
977H244k436j5742P302J3284j1398r577J4328M997j5871N8J5836n084j4235R561
991g33J1274j3119p195J5392K421j6142K576J5318p366j2953J1390R317j4282
$$ y = [-12471, -2904, 13307, -1175, -12857, 5057, 11189, -8419, -8479, 10894, 5011, -12308, -1124, 12501, -2814, -11503, 6402, 9408, -9342, -6444, 11338, 2879, -12235, 903, 11951, -4587, -10507, 7834, 8080, -10286, -4850, 11737, 1177, -12047, 2602, 11139, -6120, -9153, 9017, 6245, -11030, -2732, 11922, -1064, -11642, 4744, 10196, -7967, -7751, 10378, 4528, -11760, -893, 11964, -2823, -11013, 6200, 8957, -8966, -6071, 10777, 2611, -11540, 1047, 11149, -4543, -9688, 7551, 7312, -9789, -4268, 11052, 852, -11224, 2590, 10342, -5707, -8448, 8244, 5808, -9934, -2632, 10652, -746, -10323, 4005, 9002, -6869, -6811, 9025, 3941, -10294, -733, 10541, -2578, -9773, 5619, 8040, -8102, -5526, 9792, 2426, -10527, 863, 10180, -4102]
1004d102m776J5792k75j5680N285J4010r771j0926J3230O804j5381k011J5997
1017H196k941j5029P567J2601j1393q958J4048M503j5287L07J5020n007j3312
1030i685R166J0321j2346o401J4293J913j4831K671J3936o946j1735J0497Q455
1043I308j3010m402J4240j1j4103M377J2627q288r946J1383O315j3353k092J4029
1057G074k344j3334O563J1329j0134q219J2717M289j4043O9J3991m419j2567Q336
1071f92R892j1403o258J3358K000j3968K447J3177o615j1098J0102P936j2551
1084c673m044J3772k16j3659M411J2187q101r579J0952O096j2697k101J3202k045
1098D505j2417N933J0434r143p508J1455L900j2633K7J2609l926j1364P416R054
$$ y = [-4102, -8878, 6914, 6639, -9041, -3756, 10254, 483, -10443, 2787, 9591, -5790, -7801, 8196, 5255, -9774, -2207, 10394, -999, -9957, 4091, 8594, -6693, -6386, 8634, 3627, -9685, -519, 9802, -2544, -8945, 5348, 7261, -7570, -4899, 9037, 2091, -9644, 853, 9308, -3702, -8104, 6136, 6125, -7978, -3601, 9026, 738, -9208, 2175, 8490, -4863, -6955, 7074, 4730, -8604, -2041, 9288, -846, -9065, 3652, 7941, -6102, -6033, 7958, 3539, -9028, -692, 9200, -2203, -8461, 4897, 6897, -7071, -4624, 8553, 1938, -9160, 942, 8878, -3673, -7717, 6055, 5839, -7820, -3409, 8778, 677, -8902, 2050, 8146, -4551, -6652, 6550, 4505, -7912, -1979, 8455, -688, -8196, 3259, 7159, -5474, -5447, 7162, 3236, -8128, -712, 8342]
1112H342j0178n871J1909K168j2527J764J1902n512j0097Q687P324j1041l811
1125f941J2296p4j2342L985J1136p503q833J0282N651j2027j915J2593k023j1881
1139g596N705J0023q817p194J1019L679j2119J71J2025l943j0753P308Q435r921
1153a978n346J1532J784j1991J897J1324n349r575Q215O954j0240l729J1280J88
1167D966j1239L331J0113o503q037R023N192j0642j878J1229j605j0735M926R196
1181G337p743o783R823L695j0931k52J0961l212r920O362P892q901n063J0544
1195C809J730j1143J786J0630n129r038P947O583r983l488J1022P3j0977L332
1209b846R872o353p821Q753M995j0229j756J0716j624j0138M771Q608p426o289
$$ y = [8342, -1836, -7707, 4202, 6370, -6157, -4393, 7509, 1997, -8100, 587, 7911, -3130, -6941, 5355, 5281, -7061, -3076, 8060, 557, -8276, 2006, 7657, -4370, -6285, 6308, 4285, -7596, -1891, 8132, -685, -7879, 3140, 6819, -5300, -5129, 6896, 2953, -7800, -492, 7943, -1978, -7324, 4208, 5992, -5999, -4102, 7222, 1873, -7702, 513, 7467, -2773, -6502, 4778, 4966, -6273, -2942, 7171, 668, -7369, 1654, 6846, -3796, -5674, 5555, 3950, -6785, -1859, 7337, -406, -7189, 2634, 6329, -4602, -4854, 6107, 2895, -7025, -663, 7229, -1672, -6735, 3809, 5539, -5604, -3818, 6812, 1683, -7355, 592, 7175, -2808, -6296, 4726, 4799, -6178, -2846, 7026, 673, -7148, 1605, 6600, -3629, -5385, 5331, 3707, -6431, -1660, 6948, -478, -6767]
1223f767R320L399j0311k40J0323k918r346N755P482p989m918R436J914r973J243
1238c590R528m235q193O834O055q753l337R828K92r967K816R100n639p345P903
1253A297M883r409j897R941j222r528M231Q183o817o025Q715L282r771j97R837
1268E503k868q962N664P189p844m782R277J886r771J127R326l993p992O414N935
1283F109q214l325R209M30r299K478Q502n102o903P214M654q592k005R168q13
1298C511q858L525P707n895n800P648L380q698n99Q866k227q150M822O630o952
1313a090m457Q393J836q999R73Q701l679p578O040N688p807l233Q798M66q925
1328d873K370Q130m938o541O995M325q341j716Q883j060q538L693P387n927n535
$$ y = [-6767, 2553, 5952, -4359, -4599, 5724, 2806, -6540, -785, 6697, -1292, -6210, 3226, 5140, -4833, -3590, 5938, 1703, -6490, 344, 6399, -2354, -5691, 4137, 4429, -5538, -2722, 6378, 739, -6606, 1297, 6180, -3229, -5126, 4815, 3593, -5935, -1704, 6479, -338, -6363, 2352, 5634, -4137, -4334, 5503, 2635, -6327, -663, 6526, -1318, -6100, 3177, 5063, -4708, -3581, 5745, 1752, -6240, 174, 6109, -2105, -5430, 3779, 4209, -5090, -2612, 5890, 788, -6115, 1099, 5753, -2839, -4844, 4324, 3511, -5347, -1822, 5885, -10, -5810, 1838, 5218, -3480, -4079, 4787, 2560, -5590, -768, 5862, -1090, -5547, 2846, 4682, -4317, -3344, 5357, 1678, -5900, 140, 5828, -1979, -5212, 3586, 4052, -4873, -2503, 5627, 689, -5852, 1143, 5468, -2873, -4589, 4294, 3234, -5304, -1611, 5776, -151, -5686]
1343e686P569L180q455n55Q544k106p782M488O318o424m243P701J807q248P58
1358c134P986l217o977N376N307p023l130P963O84q162J839P569m199o219O107
1373G70M293p444j918Q019o02p853L103O889n291n236O959L063p943n88Q146j947
1389B420p531M264O198o175m237P447J886p984O44P750l092o754N216N089o797
1404a656k951P703N58p867J866P262m090n967N875M114p077j909P596m42p382
1419d367K718O482m724m943O264K939p157o93P361j626o850L778N680n557l943
1434d638O775J852p350M38P205k689o350M680M849o204k871P114O05p303J706
1449b181O781l867n574N627L834o832j732P367n32p203K758O310m689m823O137
$$ y = [-5686, 1883, 5063, -3392, -3947, 4597, 2491, -5291, -803, 5515, -909, -5152, 2549, 4356, -3892, -3134, 4852, 1635, -5342, 34, 5341, -1682, -4812, 3151, 3835, -4327, -2488, 5081, 882, -5337, 770, 5063, -2381, -4299, 3720, 3118, -4735, -1632, 5257, -34, -5270, 1689, 4752, -3191, -3779, 4367, 2420, -5111, -847, 5351, -824, -5061, 2386, 4272, -3712, -3068, 4682, 1590, -5164, 52, 5141, -1656, -4607, 3096, 3654, -4213, -2347, 4915, 825, -5142, 733, 4847, -2230, -4139, 3457, 3015, -4367, -1649, 4833, 109, -4834, 1430, 4369, -2788, -3481, 3880, 2254, -4596, -818, 4862, -695, -4638, 2137, 3989, -3361, -2923, 4282, 1593, -4757, -77, 4772, -1432, -4303, 2811, 3416, -3887, -2181, 4600, 733, -4841, 786, 4620, -2212, -3944, 3423, 2891, -4312, -1554, 4756, 67, -4756, 1381]
1464A381K863o951o92P118j535o581L590N425n263l766O415J769o940L87O790
1479D010k457o021M299M664n694k881O537Q46o741J242O312l208n276M847L729
1494D208o012j828O604k42o555K299N848m123m581N554K863o452q64O698j233
1509B184o274L191N244m837l699O006J795o568K77O479k324n761M147M468n532
1524a204k761O377P83o585J249O159l115n166M675L693n770j870O292q3o223K024
1540a525N555l747m381N090K774n922r47O197r45n902K743N039m282l688N387
1555A446K014n974j55N993j740n413L447M329m831k781N712R85o043R03N793k727
1571I58m951M255L647n384j991O007J06o003J764N416l446m324M816K784n656
$$ y = [1381, 4244, -2707, -3399, 3719, 2184, -4397, -807, 4618, -645, -4411, 2004, 3773, -3167, -2780, 4010, 1553, -4468, -169, 4495, -1199, -4080, 2457, 3303, -3438, -2196, 4116, 908, -4368, 479, 4208, -1804, -3632, 2972, 2730, -3825, -1526, 4322, 199, -4382, 1172, 4035, -2417, -3281, 3417, 2184, -4090, -899, 4345, -492, -4191, 1815, 3610, -2958, -2681, 3798, 1474, -4287, -140, 4328, -1204, -3965, 2412, 3195, -3390, -2141, 4018, 903, -4263, 412, 4105, -1665, -3535, 2757, 2674, -3549, -1525, 4030, 283, -4098, 992, 3766, -2156, -3103, 3094, 2149, -3753, -1010, 4029, -253, -3941, 1446, 3460, -2514, -2669, 3324, 1584, -3829, -382, 3947, -884, -3665, 2047, 3032, -3011, -2108, 3685, 958, -3993, 262, 3909, -1475, -3466, 2541, 2647, -3356, -1592, 3824, 378, -3946, 870, 3654, -2002]
1586b002r96N944q72n670K633M845m120l566N207J945n784j62N796j606n266L208
1602d66M223m467k814N289J151n606O08N384k289m636L729L486m823j999N441
1617B211L30n540J392N105k968m158M216K833n076j233N445m78n280K149M586
1632C534l594l446M692J971n341k84N428j411n005K965M094m237k773N093J172
1647B858n422M87N254k126m574L534L449m570k018N192L94n300J252M892k734
1662E68m052L963K834m805j366N189k11n078J763M496l116l499M156K192m818
1677a784o71N007r00m718K391L967l634k861M542J448m981P2M973j623m471L015
1693b28L520m110k225M791P23n004Q46M728k337l991L596K867m497j462M963q4
$$ y = [-2002, -2998, 2946, 2074, -3596, -963, 3882, -238, -3804, 1403, 3348, -2436, -2598, 3198, 1592, -3674, -466, 3757, -710, -3524, 1765, 2916, -2690, -2082, 3302, 1013, -3623, 106, 3592, -1231, -3230, 2211, 2541, -2999, -1607, 3498, 530, -3628, 588, 3421, -1655, -2888, 2557, 2079, -3201, -1052, 3534, -60, -3506, 1186, 3157, -2184, -2468, 2960, 1549, -3456, -491, 3603, -634, -3407, 1686, 2858, -2564, -2077, 3177, 1051, -3523, 11, 3460, -1110, -3128, 2064, 2458, -2842, -1590, 3302, 568, -3484, 479, 3313, -1492, -2858, 2331, 2120, -2958, -1195, 3301, 185, -3314, 842, 3034, -1784, -2455, 2552, 1652, -3066, -675, 3292, -342, -3203, 1339, 2787, -2194, -2122, 2851, 1228, -3243, -228, 3292, -818, -3043, 1748, 2471, -2533, -1687, 3041, 704, -3287, 309, 3176, -1321, -2783, 2180, 2096]
1709B096m938J615M443k981l513M038K270m711q05M914p13m656K159L949l368
1724b01k888M247J564m738p6M743j376m325K691L499l753k351M451R89m734M58
1740a800M575j872l957L077K984l990j722M520L11m624J129M270k464l506L574
1755E05K393m330j042M652l91m535J805L961l029l009L963J768m507l44M605j111
1771A354m234K445L453l531k365M268J062m605L62M485j744l930K916L024l823
1786h63j841M356M88m457Q80M146k161l443L224K433l977j185M338j49m287J477
1802a021L818k641k997L556J898m141o03M311p35m070K008L405l062k427L827
1817A126J210m206J12M188j430l746K607K941l543j836M120N61m288P58M032k009
$$ y = [2096, -2842, -1227, 3216, 235, -3278, 760, 3030, -1681, -2486, 2428, 1715, -2941, -782, 3167, -201, -3089, 1158, 2722, -2016, -2092, 2651, 1275, -3050, -359, 3140, -613, -2964, 1487, 2476, -2258, -1800, 2775, 903, -3054, 23, 3007, -983, -2705, 1815, 2126, -2498, -1369, 2901, 437, -3069, 505, 2898, -1432, -2474, 2178, 1787, -2748, -943, 3018, -11, -3020, 943, 2711, -1796, -2140, 2465, 1354, -2880, -435, 3018, -513, -2878, 1390, 2452, -2153, -1791, 2694, 950, -2980, -64, 2960, -863, -2704, 1652, 2140, -2317, -1437, 2709, 548, -2895, 329, 2762, -1215, -2400, 1938, 1789, -2498, -1021, 2797, 156, -2841, 715, 2613, -1528, -2131, 2180, 1445, -2625, -617, 2788, -274, -2701, 1126, 2336, -1870, -1758, 2430, 1000, -2746, -139, 2802, -741, -2577, 1543, 2104, -2184, -1426, 2606, 597]
1833E97l378L033K414l781j201M137r8m100J386L642k517k858L406J801l960n81
1849b058M136o80l911J879L319k877k427L596J317l962j03L978j138l604K259
1864b76K883l149j897L731P36l956M83L819j672l298K683K454l429j391L848J93
1880A762l896J020L571k135k886L040J911l651p47L886m76l741J641L241k656
1895a16k429L424J364l829j90L891j014l553K104K875k957j960L554Q42l798L42
1911a450L683j472l229K470K444l213j467L673L31l755Q03L487j858k912K742
1926B77K046l334j026L649j21l576J236L177k222k494L021J547l520m42L667p05
1942A180l441J761K901k641k095L283J075l594N2L562j168l187K160K505k931
$$ y = [597, -2781, 252, 2666, -1115, -2316, 1821, 1723, -2377, -991, 2651, 134, -2724, 682, 2483, -1477, -2058, 2078, 1398, -2513, -634, 2685, -192, -2619, 977, 2294, -1668, -1771, 2207, 1069, -2535, -276, 2607, -542, -2439, 1292, 2028, -1928, -1445, 2374, 702, -2596, 87, 2541, -888, -2279, 1569, 1762, -2134, -1114, 2457, 322, -2564, 476, 2387, -1264, -2011, 1875, 1399, -2342, -701, 2540, -116, -2545, 879, 2243, -1586, -1776, 2115, 1101, -2452, -348, 2527, -430, -2390, 1164, 2006, -1792, -1450, 2233, 761, -2468, 2, 2446, -767, -2234, 1439, 1770, -1985, -1182, 2305, 447, -2465, 277, 2323, -1011, -2037, 1612, 1491, -2085, -849, 2328, 106, -2388, 633, 2180, -1340, -1782, 1885, 1180, -2261, -500, 2401, -240, -2335, 948, 2023, -1571, -1519, 2043, 875, -2312, -152, 2353, -578]
1957e78j580L429M85l577O27L396j693k860K547K080l187j111L527J3l506J060
1973i28L164k024k533K795J654l309o15L484m66l310J486K852k350k138L005J218
1989A985l378j79L433q63l157J830K559k591j755L127P72l345K80L248j312k831
2005b177K209K143k887j235L280K13l349Q11L107j783k541K564J730l096p58L304
2021A535k76l213J277K817k159k143K826J246l196k56L276p56l035J685K522k459
2037c09j757K995Q29l223J65L138j112k767J949K156k612j353L036L98l152N84
2053a035K972j507k512K282J797k839r28L117k1l100R72K790j824k210K505J420
2069A879k935n07L092m69k940J394K496k175j810K733R63l035k9L051r14k751
$$ y = [-578, -2158, 1271, 1756, -1821, -1194, 2202, 509, -2351, 196, 2276, -911, -2022, 1505, 1518, -1988, -928, 2236, 212, -2321, 474, 2128, -1181, -1796, 1688, 1222, -2088, -602, 2250, -100, -2238, 767, 1985, -1393, -1572, 1861, 998, -2159, -329, 2230, -361, -2116, 1011, 1783, -1562, -1282, 1966, 654, -2177, 32, 2175, -712, -1947, 1333, 1546, -1803, -992, 2115, 332, -2209, 355, 2085, -1011, -1769, 1535, 1259, -1954, -677, 2140, -19, -2162, 664, 1910, -1286, -1542, 1734, 978, -2057, -372, 2150, -309, -2066, 929, 1758, -1465, -1300, 1838, 726, -2041, -92, 2064, -548, -1901, 1135, 1533, -1619, -1035, 1937, 430, -2082, 200, 1997, -842, -1770, 1347, 1326, -1774, -802, 1988, 164, -2046, 459, 1879, -1056, -1563, 1529, 1060, -1880, -486, 2010, -165, -1975, 758, 1721, -1314, -1343, 1708, 794, -1957]
2085a957J749K220k441j452K888N46l047M17K895j308k476K074J834k643j021
2100a722K958J05k987Q08K741j648k238K315J536k787o86K975k18k889J113K528
2116A904j902j919K491J130k838k47K924o47k731J499K264k202j590K696P49k921
2132a340J56K870j048k521J824J954k433j195K811L12k905O09K715j458k261K158
2148B48J602k680p64K921j24k881J011K547j783k000K393J249k770l90K866n02
2164I43k710J353K284k068j630K573Q45k837K2K844r00k559J677K048k306j325
2180a746K705M86k850L97K709j235k330J980J701k493r43K795O3k811Q13K566
2196A807j606k074K245J369k678n43K840l34k723J194K341j924j728K454R57k777
$$ y = [-1957, -208, 2012, -429, -1881, 1007, 1553, -1494, -1077, 1818, 510, -1966, 108, 1942, -701, -1722, 1236, 1341, -1646, -838, 1903, 255, -1983, 332, 1868, -919, -1605, 1370, 1152, -1737, -624, 1904, 2, -1917, 574, 1704, -1134, -1381, 1543, 896, -1835, -336, 1928, -274, -1864, 832, 1581, -1340, -1184, 1686, 638, -1883, -59, 1895, -538, -1733, 1078, 1390, -1515, -906, 1809, 351, -1910, 248, 1850, -830, -1594, 1327, 1203, -1678, -667, 1880, 97, -1903, 490, 1739, -1031, -1421, 1445, 943, -1767, -414, 1870, -198, -1828, 745, 1590, -1247, -1225, 1619, 719, -1840, -163, 1885, -421, -1746, 959, 1445, -1405, -1008, 1701, 466, -1864, 116, 1817, -676, -1619, 1176, 1239, -1572, -759, 1807, 201, -1873, 372, 1741, -937, -1480, 1360, 1026, -1697, -503, 1838, -86, -1814, 640, 1597, -1180]
2212a180p0K780p88k544J597K053k235j351K655N46k819L14K722j150k359J882
2228E3J762k420j005K708J77k767O79K553j462k100K120J437k561o49K753k01
2244A077k707J048K357j767j823K336J102k676k46K724n91k536J380K110k045
2259b57j466K496O81k719J78K669j018k355J746J837k309j122K651L08k754N69
2275h65K543j340k129K007J485k451p23K691j23k651R49K358j681j841K242J137
2291A608k592l46K689m80k536J262K155j939j547K400Q09k650K7K633q51k366
2307a724J592J873k173j207K552M20k687M24K554j210k182J880J600k365q60K622
2323A109M5k638P93K381j526j898K131J212k509m33K661l92k552J185K192j868
$$ y = [-1180, -1250, 1530, 742, -1802, -205, 1848, -387, -1738, 917, 1463, -1356, -1042, 1680, 530, -1829, 53, 1815, -605, -1610, 1098, 1275, -1492, -813, 1740, 278, -1822, 298, 1735, -826, -1475, 1278, 1077, -1630, -582, 1775, 8, -1815, 521, 1623, -1053, -1299, 1425, 834, -1702, -322, 1788, -257, -1723, 773, 1454, -1265, -1087, 1582, 564, -1791, -45, 1792, -517, -1639, 1012, 1320, -1434, -865, 1678, 338, -1791, 216, 1701, -750, -1473, 1218, 1095, -1556, -607, 1751, 70, -1771, 471, 1608, -984, -1330, 1359, 879, -1657, -395, 1760, -179, -1726, 674, 1483, -1167, -1140, 1493, 642, -1724, -132, 1741, -432, -1639, 913, 1333, -1354, -930, 1624, 414, -1768, 112, 1712, -653, -1513, 1109, 1154, -1484, -691, 1690, 164, -1734, 397, 1609, -900, -1333, 1328, 936, -1616, -431, 1761, -107]
2339a07j614K357Q76k626o0K627p54k397J498J927k097j278K509M90k665L42K567
2356A595j136k216J810J664k306r57K597J59k654O82K433j422j992K041J349k455
2372h08n85K646k53k554J046K232j759j697K300R86k607j81K661o35k472J408
2388b72K031k041j390K472O06k657K09K602j039k267J737J726k273j013K594K01
2404A226k662O16K490j395k034K020J407k448o51K654j94k576R84K280j689j745
2420a717K245J040k579k41K645n73k483J348K070j987j457K423P12k657J19K614
2436A522r31k314J634J811k192j136K551L27k642N06K488j285k098J958J480k411
2452g32p44K648p9k619Q90K331j606j819K177J144k533l47K646m88k482J242K108
$$ y = [-107, -1721, 636, 1512, -1114, -1174, 1453, 699, -1698, -200, 1727, -370, -1648, 861, 1351, -1314, -972, 1595, 459, -1757, 53, 1717, -589, -1546, 1051, 1210, -1444, -762, 1671, 249, -1743, 298, 1647, -808, -1393, 1253, 1000, -1554, -508, 1724, -35, -1732, 568, 1554, -1053, -1234, 1427, 792, -1680, -272, 1759, -282, -1672, 800, 1406, -1251, -1042, 1560, 521, -1746, -9, 1717, -556, -1569, 1025, 1226, -1436, -820, 1670, 275, -1759, 261, 1668, -780, -1431, 1223, 1029, -1547, -563, 1717, 28, -1717, 528, 1568, -1011, -1252, 1393, 820, -1663, -315, 1755, -232, -1689, 734, 1446, -1211, -1092, 1522, 591, -1723, -89, 1722, -470, -1606, 945, 1272, -1370, -864, 1624, 339, -1759, 199, 1679, -732, -1476, 1172, 1093, -1526, -636, 1695, 89, -1730, 447, 1591, -942, -1289, 1357, 869, -1613, -371, 1737]
2469A737j915j510K394P68k640M4K612q37k354J572J863k151j205K522M23k642
2485a319L93K501j164k149J848J565k337q20K591K2k600P88K347j510j888K098
2501C66J248k487m73K629l58k513J129K179j811j603K310Q76k582p7K622p55k385
2518a685J492J935k098j276K476N03k635L16K540j097k191J776J626k287r14K554
2534A035J11k577O91K375j435j936K056J301k457n36K625k71k556J057K232j742
2550b7j694K282R70k570j74K621o42k410J381J988k015j352K437O10k630J96K565
2567A536r85k266J684J734k218j056K562K38k623N82K442j350k012J971J398k418
2583g81o47K631j82k585J007K260j707j718K225J048k572k43K657n81k457J338
$$ y = [1737, -178, -1688, 706, 1474, -1166, -1122, 1490, 653, -1701, -129, 1734, -417, -1622, 900, 1323, -1319, -926, 1575, 411, -1738, 110, 1675, -662, -1482, 1109, 1131, -1469, -681, 1666, 156, -1732, 366, 1614, -873, -1346, 1283, 925, -1588, -459, 1720, -91, -1694, 616, 1492, -1090, -1167, 1455, 700, -1685, -193, 1742, -356, -1632, 844, 1347, -1288, -972, 1568, 471, -1720, 56, 1682, -605, -1519, 1035, 1146, -1431, -740, 1635, 200, -1736, 320, 1621, -836, -1372, 1253, 982, -1574, -517, 1715, -27, -1721, 561, 1531, -1039, -1213, 1408, 766, -1644, -263, 1725, -290, -1642, 795, 1405, -1225, -1029, 1536, 551, -1715, -31, 1703, -515, -1571, 991, 1229, -1394, -812, 1630, 280, -1732, 239, 1637, -781, -1428, 1203, 1021, -1564, -557, 1703, -4, -1722, 503, 1551, -1021, -1264, 1393, 812, -1645, -307]
2599c07K057j987j422K430O43k622J67K587r83k282J696J743k237j051K570K69
2615A271k662N51K478j327k083J986J459k439o91K652j24k620R53K302j666j797
2631a757K247J095k580l06K684n39k506J306K126j994j483K432P38k664Q6K648
2647A533r19k347J636J841k210j140K579L34k696N16K520j282k120J944J523k433
2663g21p76K675o6k641Q66K383j632j863K201J190k578l78K694m53k564J272K159
2680A768j946j555K423Q19k692L4K671q53k397J595J913k203j234K591M12k697
2696a351M37K556j226k192J922J584k408q37K677j1k674Q44K411j594j914K197
2712D21J231k586m29K712m06k596J220K197j921j581K403Q40k674j1K683q36k401
$$ y = [-307, 1750, -237, -1659, 771, 1414, -1208, -1041, 1546, 563, -1719, -23, 1720, -517, -1568, 1002, 1271, -1391, -840, 1638, 311, -1772, 214, 1673, -766, -1457, 1195, 1071, -1549, -596, 1706, 40, -1757, 490, 1585, -995, -1301, 1383, 844, -1662, -356, 1770, -224, -1707, 725, 1463, -1201, -1115, 1533, 614, -1733, -97, 1744, -466, -1606, 973, 1307, -1389, -873, 1647, 365, -1755, 189, 1712, -721, -1497, 1178, 1112, -1529, -663, 1720, 88, -1775, 426, 1616, -962, -1340, 1354, 901, -1663, -391, 1768, -178, -1733, 690, 1509, -1183, -1149, 1522, 669, -1728, -133, 1780, -423, -1657, 934, 1346, -1351, -914, 1642, 416, -1776, 146, 1730, -678, -1515, 1162, 1151, -1523, -679, 1732, 138, -1776, 421, 1652, -934, -1363, 1349, 943, -1653, -433, 1764, -157, -1738, 665, 1505, -1169, -1180, 1503, 667, -1734]
2729a734J564J947k186j246K565M50k697L88K582j206k187J885J601k390q47K648
2745A137J9k664Q19K417j582j917K166J236k548m49K698l87k588J201K203j875
2761a14j624K372Q80k651l0K646p82k404J537J920k146j253K532M73k681L59K574
2778A608j164k205J843J627k354q84K632P0k645P54K411j510j933K105J292k520
2794h73m95K674l39k578J139K228j829j658K354R15k631j07K653p21k439J488
2810b19J967k088j306K490N19k648K87K578j107k213J805J648k329r29K633J02
2826A190k649P13K435j481j950K074J302k488n17K657l04k563J114K204j810j639
2842a712K314R38k623j12K643o98k428J444J976k068j325K473N43k632K77K536
$$ y = [-1734, -170, 1777, -409, -1655, 910, 1360, -1337, -949, 1633, 427, -1760, 125, 1726, -664, -1511, 1137, 1156, -1508, -689, 1728, 146, -1771, 395, 1631, -917, -1366, 1332, 945, -1643, -442, 1761, -114, -1738, 634, 1514, -1137, -1167, 1479, 697, -1707, -170, 1750, -396, -1649, 883, 1356, -1325, -966, 1608, 444, -1761, 82, 1709, -645, -1529, 1103, 1173, -1472, -718, 1693, 183, -1750, 355, 1647, -873, -1368, 1306, 967, -1611, -472, 1756, -73, -1731, 623, 1538, -1093, -1200, 1453, 732, -1707, -219, 1748, -340, -1646, 844, 1363, -1285, -998, 1580, 473, -1740, 65, 1713, -616, -1545, 1088, 1190, -1459, -746, 1689, 208, -1742, 332, 1634, -854, -1371, 1286, 982, -1581, -467, 1737, -73, -1712, 602, 1540, -1083, -1195, 1448, 750, -1678, -234, 1742, -326, -1651, 822, 1365, -1267, -990, 1546]
2858A546j076k202J768J659k287r36K585J27k610O82K391j415j966K022J345k453
2874h20n71K640k59k541J038K213j728j671K255R77k561j73K610o41k413J404
2890b41J968k002j364K425O07k620K16K543j012k207J688J679k223r79K527J84
2906A189k595O17K406j370j978K003J343k410o09K607k04k526R81K233j691j691
2922a695K203J020k513k33K580n67k396J328J963j927j376K354O42k563J55K514
2938A489r45k218J638J705k162j022K466K57k547N44K366j280j975J891J392k338
2954g39o43K540j57k483R16K197j587j719K133J049k453k79K534n02k376J247
2970c22J979j855j394K288O90k510J03K464q74k182J557J706k087j069K415L06
$$ y = [1546, 470, -1732, 36, 1695, -592, -1528, 1057, 1184, -1426, -744, 1647, 232, -1734, 288, 1633, -820, -1391, 1249, 990, -1551, -513, 1700, -28, -1699, 556, 1533, -1028, -1201, 1409, 768, -1645, -241, 1727, -275, -1639, 786, 1393, -1227, -1011, 1532, 520, -1687, 1, 1680, -543, -1522, 1005, 1189, -1406, -789, 1617, 247, -1731, 272, 1615, -795, -1404, 1203, 999, -1527, -546, 1687, -4, -1695, 508, 1528, -985, -1218, 1362, 795, -1601, -273, 1690, -237, -1613, 741, 1383, -1180, -1025, 1489, 544, -1674, -36, 1669, -493, -1515, 951, 1208, -1339, -795, 1571, 291, -1684, 207, 1599, -739, -1382, 1158, 1001, -1482, -566, 1631, 44, -1675, 458, 1507, -946, -1225, 1309, 807, -1569, -322, 1657, -198, -1592, 696, 1386, -1124, -1021, 1443, 569, -1613, -56, 1650, -437, -1506, 909, 1215]
2986A215k508M71K363j204j988J821J420k265p15K478o6k460Q33K199j506j725
3002a637K048J095k385l63K498m26k365J159K006j769j448K226P52k467J6K464
3018A404p83k212J464J745k001j116K352L80k467L89K348j121k012J761J451k193
3034f11p94K454J3k453P51K206j436j768K000J124k330m04K452l66k342J102K005
3051A603j717j468K185P78k418l2K430p16k199J415J742j957j134K309M16k443
3067a206L56K328j086j999J715J466k177p81K413M0k426P26K190j393j772J956
3083C50J126k278m41K439l38k326J053J989j671j471K143Q04k396n6K397o98k177
3100a551J379J745j904j161K275M50k402L08K297j012j997J644J476k090q30K362
$$ y = [1215, -1293, -822, 1541, 337, -1651, 170, 1590, -675, -1390, 1088, 1022, -1438, -605, 1594, 88, -1637, 411, 1506, -879, -1242, 1256, 830, -1535, -376, 1630, -139, -1587, 639, 1391, -1076, -1060, 1404, 621, -1591, -127, 1618, -383, -1499, 853, 1233, -1234, -845, 1503, 382, -1630, 131, 1582, -611, -1405, 1049, 1062, -1391, -640, 1566, 130, -1638, 362, 1486, -844, -1248, 1204, 838, -1504, -402, 1603, -114, -1582, 603, 1381, -1037, -1069, 1361, 645, -1554, -139, 1603, -354, -1488, 821, 1237, -1206, -850, 1478, 392, -1607, 108, 1574, -603, -1384, 1029, 1069, -1357, -631, 1559, 166, -1606, 350, 1476, -802, -1243, 1196, 858, -1468, -415, 1574, -97, -1568, 575, 1379, -1017, -1073, 1324, 626, -1551, -172, 1573, -331, -1492, 783, 1233, -1169, -861, 1436, 424, -1573, 71, 1547, -543, -1373, 989]
3116I89Q0k389O64K174j342j759J889J166k251m60K382k73k303R87J994j604j485
3133a541K068Q27k315j04K344o31k146J299J747j855j159K211M58k348K70K269
3149A394r82j947J584J456k041q11K287R9k309O33K119j307j694J823J143k180
3165g33m62K331k81k233R64J925j560j445K014Q11k271j11K301o00k102J252J696
3182A496j783j149K148M76k280K46K202r41j912J541J432j989q10K238J14k276
3198a247O04K069j234j683J754J147k120m77K261k17k200R11J907j511j430J954
3214D88Q31k215j26K255n89k055J209J673j722j141K087M69k229K16K162q98j872
3231a457J471J409j906q14K170J27k210N59K051j200j676J724J131k075m67K210
$$ y = [989, 1069, -1320, -656, 1518, 176, -1583, 306, 1472, -779, -1239, 1143, 870, -1433, -446, 1548, -56, -1541, 527, 1354, -961, -1065, 1279, 648, -1498, -199, 1548, -307, -1466, 745, 1203, -1145, -875, 1394, 412, -1535, 49, 1505, -536, -1347, 940, 1039, -1270, -637, 1482, 175, -1519, 304, 1447, -733, -1195, 1136, 855, -1378, -414, 1511, -49, -1494, 520, 1331, -940, -1051, 1250, 650, -1452, -200, 1496, -287, -1436, 712, 1188, -1092, -846, 1356, 415, -1497, 44, 1476, -513, -1323, 915, 1029, -1247, -643, 1426, 192, -1491, 263, 1410, -710, -1187, 1074, 857, -1343, -432, 1475, -36, -1466, 488, 1319, -896, -1022, 1233, 644, -1411, -202, 1471, -251, -1392, 695, 1164, -1065, -849, 1313, 415, -1457, 14, 1423, -483, -1297, 873, 1000, -1210, -651, 1400, 200, -1476, 248, 1379, -696, -1163, 1047]
3247A047k08k147Q80J876j465j417J903Q19k154j48K203n54k016J176J651j688
3263b42j124K045M93k196J80K145q74j853J447J395j888p98K128J45k194N57K003
3280A369j174j641J690J117k041m82K182k04k120Q72J834j432j388J877Q06k106
3296h41j51K155n20j991J137J643j661j111J998M92k162J83K112q48j840J414
3312IJ394j856q03K090J57k143N05J983j127j625J643J099j987m76K134j77k096
3329a276Q35J834j395j401J829Q20k083j68K136m96j979J112J625j606j119J968
3345F36N01k123J70K058q07j816J370J396j812q13K058J74k130M93J968j093j628
3362a398J602J119j958n01K101j47k059P84J821j356j395J800Q23k042k00K113
$$ y = [1047, 839, -1308, -428, 1448, -17, -1434, 469, 1288, -866, -1014, 1189, 635, -1381, -205, 1446, -242, -1366, 679, 1172, -1024, -844, 1301, 427, -1426, 21, 1416, -472, -1270, 858, 1003, -1191, -634, 1369, 195, -1446, 244, 1361, -680, -1162, 1020, 816, -1304, -432, 1402, -30, -1418, 459, 1265, -841, -992, 1163, 643, -1348, -211, 1432, -229, -1340, 658, 1150, -1012, -829, 1283, 435, -1405, 9, 1403, -453, -1256, 834, 991, -1152, -647, 1336, 209, -1416, 227, 1326, -661, -1137, 997, 820, -1276, -441, 1393, -2, -1403, 426, 1246, -837, -1005, 1131, 635, -1344, -232, 1393, -213, -1332, 636, 1137, -986, -816, 1242, 435, -1381, -11, 1385, -427, -1240, 818, 992, -1138, -645, 1323, 230, -1398, 204, 1323, -635, -1136, 965, 818, -1241, -457, 1364, 8, -1387, 413, 1236, -806, -1006, 1107]
3378A107m57j962J066J630j558j155J917N47k089J13K057p67j811J337J395j759
3394c89q47K026K23k101M31J963j047j636J555J150j911n72K104r8k060P40J823
3411A354j302j420J731Q82k022k44K092m10j968J020J643j530j164J905N81k090
3427i42Q4K050p21j820J295J413j726q78K000K55k087M09J949j003j655J546J161
3444A330j899n93K093p2k052P01J824j275j424J709R07k007k62K078l77j954R80
3461b93J661j525j183J887N90k067N8K048o88j831J260J449j715r15J999K84k081
3478a062L71J969r86j657J499J187j868o06K066l9k053O83J841j253j460J708
3494C40R22j993l03K074l41j970R60J661j484j191J854O18k061M0K043o71j845
$$ y = [1107, 650, -1312, -246, 1384, -174, -1329, 588, 1135, -954, -841, 1216, 449, -1362, -25, 1370, -389, -1236, 790, 1013, -1088, -657, 1306, 259, -1377, 178, 1328, -583, -1155, 949, 851, -1209, -469, 1354, 52, -1368, 363, 1245, -777, -1021, 1071, 661, -1307, -287, 1356, -174, -1338, 567, 1148, -942, -858, 1192, 471, -1349, -54, 1359, -367, -1245, 755, 1010, -1077, -668, 1281, 278, -1377, 169, 1330, -569, -1162, 931, 859, -1193, -492, 1332, 57, -1367, 342, 1249, -758, -1020, 1058, 681, -1273, -293, 1368, -157, -1340, 547, 1137, -930, -872, 1176, 488, -1343, -83, 1366, -349, -1264, 735, 1019, -1062, -691, 1278, 292, -1365, 134, 1321, -547, -1153, 913, 874, -1179, -496, 1345, 92, -1368, 340, 1262, -731, -1034, 1040, 699, -1271, -311, 1350, -134, -1325, 529, 1147, -914, -874, 1169, 498, -1347]
3511a347J250J447j695r21J984K98k080L42J981r59j674J495J198j859o32K076
3527I04l1k051O60J852j229j462J702R22j983l21K098l35j987R38J701j489j216
3544a327J847O47k058mK050o35j849J208J468j667r51J972L28k084L28J984r21
3561C36j705J463J231j837o68K061J7k051O09J867j198j490J667R63j967l42K076
3578A032k98j986R11J711j457j245J853O61k051l0K049n91j867J174J491j650
3594b93r76J960L66k077K78J988q99j720J439J259j832o94K059M6k066O09J874
3611A321j183j513J650J008j973l90K100k81j979Q89J714j438j255J822O95k044
3627h57m4K065o14j871J166J519j654r83J956L79k079K82J985q85j720J423J265
$$ y = [-1347, -97, 1350, -345, -1266, 718, 1016, -1064, -722, 1259, 300, -1374, 121, 1319, -540, -1172, 904, 873, -1178, -518, 1334, 105, -1357, 345, 1267, -716, -1037, 1061, 726, -1261, -323, 1378, -111, -1327, 520, 1167, -891, -895, 1155, 520, -1329, -121, 1347, -320, -1271, 701, 1029, -1055, -727, 1257, 336, -1369, 94, 1325, -512, -1180, 881, 898, -1153, -544, 1323, 125, -1365, 302, 1265, -702, -1044, 1032, 734, -1252, -341, 1370, -87, -1332, 521, 1182, -869, -899, 1150, 559, -1308, -134, 1357, -293, -1269, 691, 1057, -1020, -742, 1246, 347, -1373, 66, 1325, -507, -1201, 858, 904, -1162, -553, 1321, 138, -1375, 275, 1283, -690, -1080, 1020, 739, -1240, -351, 1363, -75, -1330, 492, 1187, -857, -901, 1164, 550, -1321, -155, 1364, -290, -1273, 683, 1062, -1017, -735, 1250, 365, -1355, 68, 1333]
3644A333j829o93K046N9k057N83J873j176j511J646J007j966l94K072k51j996
3660a254Q78J731j417j279J811P26k033q0K053n64j868J135J534j631j014J945
3676F73M12k081K35J999q69j718J409J289j807p34K032Q5k068N72J874j133j537
3693a367J625J019j945m11K068k34j987Q56J726j403j285J788P37k019j09K062
3709A121n34j888J126J534j607j019J922M16k051K28J988q52j713J377J286j783
3725d49p35K018J00k048N52J871j140j525J618J019j948m02K053k27j991Q58J713
3742A337j392j281J791P21k007q9K041n54j869J139J497j592j001J911L99k039
3758i88K51J966q75j688J397J244j772o95K005O2k034N78J849j150j482J613R83
$$ y = [1333, -496, -1189, 857, 916, -1141, -558, 1315, 139, -1372, 274, 1281, -685, -1079, 993, 742, -1254, -376, 1355, -62, -1341, 470, 1196, -837, -917, 1136, 572, -1296, -161, 1373, -258, -1272, 673, 1085, -996, -761, 1238, 369, -1349, 60, 1349, -458, -1192, 840, 925, -1143, -571, 1303, 170, -1367, 258, 1277, -668, -1079, 989, 755, -1232, -376, 1350, -53, -1338, 450, 1187, -832, -941, 1121, 587, -1301, -175, 1359, -248, -1267, 655, 1071, -980, -752, 1236, 384, -1329, 48, 1334, -449, -1184, 834, 934, -1114, -562, 1309, 169, -1356, 262, 1281, -667, -1069, 984, 757, -1234, -376, 1337, -55, -1336, 455, 1176, -831, -920, 1121, 567, -1302, -163, 1334, -258, -1259, 652, 1051, -988, -737, 1229, 354, -1334, 63, 1307, -465, -1160, 845, 907, -1127, -549, 1300, 150, -1332, 281, 1264]
3775A264j925l79K042k63j952Q63J677j395j244J777O78j993o2K032n81j832J148
3792a45J464j605r61J904L70k023K64J947q72j670J401J223j774o74J997M0k000
3809a114N82J813j148j460J613R48j898l55K015k77j936Q74J662j392j221J775
3825D81O60j983m6J991n80j803J142J445j587r49J888L56k010K70J915q66j642
3842a318J377J226j770o55J979L4j983N69J820j147j450J597R45j888l51J999
3858I84k63j917Q84J633j401j211J783O44j967m9J991n76j801J137J441j590r42
3875a220J887L46j993K73J911q83j624J373J216j779o49J967M4j974N77J795j142
3892A25j441J588R51j884l63K006k67j914Q48J648j363j216J754O78j970n4J986
$$ y = [1264, -661, -1040, 1002, 739, -1213, -350, 1327, -68, -1312, 465, 1143, -850, -912, 1120, 539, -1293, -145, 1319, -286, -1247, 657, 1027, -996, -732, 1215, 343, -1327, 74, 1297, -477, -1151, 846, 886, -1114, -532, 1281, 133, -1327, 286, 1234, -664, -1019, 996, 719, -1217, -343, 1319, -73, -1294, 481, 1141, -842, -888, 1103, 523, -1280, -138, 1307, -280, -1229, 659, 1015, -995, -725, 1190, 324, -1318, 59, 1285, -485, -1140, 839, 873, -1110, -541, 1279, 132, -1318, 279, 1224, -664, -1015, 984, 721, -1196, -312, 1321, -80, -1291, 492, 1136, -831, -880, 1111, 535, -1266, -129, 1312, -278, -1220, 667, 1013, -980, -707, 1204, 321, -1303, 70, 1286, -493, -1142, 825, 869, -1105, -528, 1267, 125, -1316, 272, 1223, -661, -1024, 982, 715, -1199, -351, 1297, -66, -1282, 472, 1150, -820, -874, 1112]
3909A112n82j794J123J462j583r53J876L67j992K52J906q54j647J375J202j742
3925d72o65J962N8j987N63J802j130j447J591R58j882l64J972k48j902Q51J650
3942A310j377j210J758O54j972l2J969n73j793J132J441j570r43J867L63k000
3958i76K74J910q70j638J378J198j747o48J936N2j969N69J796j123j451J586R35
3975A212j871l65J995k57j927Q66J648j370j218J757O66j960n3J979n70j795J122
3992a41J460j587r39J873L51j990K74J905q71j624J373J196j752o59J964L6j973
4009a104N84J785j137j434J583R38j879l50J980k52j914Q64J633j367j216J738
4025D52O65j945n5J967n46j799J118J438j567r43J855L75j961K30J901q41j637
$$ y = [1112, 530, -1264, -141, 1321, -262, -1215, 661, 1028, -964, -712, 1194, 340, -1307, 68, 1270, -472, -1137, 825, 883, -1104, -541, 1261, 131, -1316, 275, 1233, -649, -1013, 959, 711, -1191, -340, 1310, -67, -1277, 481, 1135, -837, -869, 1100, 527, -1266, -134, 1307, -263, -1206, 661, 1024, -976, -702, 1208, 338, -1300, 78, 1276, -471, -1119, 817, 869, -1100, -531, 1265, 142, -1309, 277, 1212, -659, -1024, 971, 714, -1213, -347, 1301, -69, -1287, 470, 1136, -824, -877, 1102, 532, -1263, -141, 1319, -268, -1207, 666, 1017, -973, -699, 1206, 335, -1289, 84, 1280, -472, -1131, 833, 869, -1104, -520, 1265, 128, -1306, 277, 1215, -664, -1014, 966, 714, -1200, -336, 1297, -70, -1286, 452, 1117, -828, -883, 1084, 538, -1261, -143, 1295, -272, -1215, 640, 1015, -946, -716, 1185, 344, -1293]
4042a293J355J221j740o67J932O0j943N40J794j107j440J544R63j849l84J972
4058I58k41j897Q26J634j332j221J713O96j933q7J955n17j804J080J455j530r76
4075a221J840M01j968K23J895q15j633J322J225j710o80J913Q4j933N03J793j079
4092A60j438J530R60j830l94J952k10j886P89J645j302j234J683P11j917j07J941
4109A053m96j789J061J447j501r90J810M14j927J82J877p74j627J286J223j668
4125d19p04J893J03j900M80J757j032j439J500R65j799m08J921j97j850P70J610
4142A251j275j223J670O96j869j23J907m79j754J022J422j472r62J769M10j900
4158i10J84J847p66j599J253J215j638o93J844J24j890M72J741j012j424J467
$$ y = [-1293, 62, 1283, -457, -1124, 808, 868, -1075, -535, 1259, 152, -1288, 256, 1219, -630, -1014, 958, 717, -1180, -354, 1280, -52, -1273, 440, 1136, -797, -884, 1071, 554, -1250, -170, 1285, -245, -1221, 619, 1020, -948, -725, 1170, 355, -1278, 44, 1269, -441, -1121, 792, 876, -1057, -554, 1239, 160, -1278, 252, 1212, -618, -1012, 940, 730, -1156, -367, 1278, -24, -1258, 425, 1136, -781, -888, 1053, 557, -1232, -171, 1276, -225, -1215, 595, 1009, -918, -736, 1141, 367, -1260, 26, 1249, -419, -1123, 770, 873, -1027, -547, 1210, 178, -1261, 239, 1204, -595, -1003, 918, 721, -1129, -359, 1251, -24, -1247, 423, 1119, -750, -873, 1034, 555, -1199, -177, 1245, -227, -1189, 580, 990, -910, -726, 1121, 355, -1244, 9, 1224, -414, -1107, 737, 861, -1029, -557, 1184, 172, -1252, 215]
4174B15R53j751m09J888j84j820P52J596j257j205J629O91j834j22J887m83j726
4191a180J020J396j451r48J748L93j865J78J800p38j562J230J176j598o70J813
4207G42R9j852M64J708j006j371J426R28j720l79J833j85j794P61J540j229j154
4224a189J600O48j787r6J819m67j691J010J368j426r17J714L71j819J89J764p48
4241C43j532J219J144j576o55J786R2j811M69J655r85j344J410R04j698l68J812
4258H65j95j753P40J529j213j155J584O43j765r2J782m51j653R90J323j387q96
4275a104J681L66j785J67J747p20j506J193J120j545o35J727J06j771M54J625
4291A120r66j321J373Q97j664l75J774j79j709O95J497j173j136J531O73j739
$$ y = [215, 1168, -583, -992, 896, 712, -1108, -356, 1240, -17, -1222, 407, 1098, -736, -858, 1029, 546, -1180, -160, 1236, -215, -1163, 585, 978, -887, -709, 1091, 353, -1209, 21, 1197, -401, -1071, 742, 841, -1011, -547, 1161, 155, -1216, 210, 1138, -582, -961, 872, 687, -1107, -346, 1194, -35, -1189, 411, 1059, -728, -824, 995, 528, -1163, -153, 1215, -211, -1128, 586, 957, -862, -673, 1091, 343, -1189, 30, 1174, -402, -1057, 729, 821, -990, -521, 1134, 149, -1195, 215, 1119, -579, -947, 865, 670, -1083, -343, 1186, -27, -1182, 402, 1045, -720, -812, 970, 519, -1134, -144, 1179, -208, -1104, 577, 943, -842, -675, 1072, 352, -1154, 39, 1159, -386, -1021, 706, 812, -959, -505, 1120, 154, -1167, 206, 1103, -561, -936, 838, 659, -1050, -355, 1142, -31, -1167, 364, 1037, -702]
4307g02j05J751m28j621R38J329j356q96J625L86j741J63J700o88j509J166J130
4324A142j504o68J713J11j734M26J612r28j323J334R11j608m17J749j40j693O65
4341c52J478j136j133J489O74j695j42J730l91j618Q94J333j306r17J587M27j714
4358g92J04J686o37j476J092J144j449o89J662J67j715L79J600q71j339J284R26
4375A076j574m26J703j06j668O18J465j067j139J435O88j644j80J694l47j588
4391a060Q53J319j270r15J542M37j681Q3J667o09j473J059J147j415o87J625J78
4408H00j679L54J560q35j299J245R18j539m50J693q7j656O16J442j036j137J397
4425C07O90j611j93J667l36j560Q34J303j237r34J521M43j646O8J635n88j438
$$ y = [-702, -807, 944, 516, -1105, -167, 1162, -194, -1090, 535, 921, -820, -657, 1043, 355, -1154, 12, 1142, -362, -1030, 683, 794, -940, -514, 1098, 170, -1153, 181, 1092, -516, -933, 816, 676, -1017, -352, 1126, -10, -1143, 346, 1020, -675, -817, 913, 522, -1096, -202, 1131, -175, -1092, 495, 922, -792, -688, 998, 361, -1115, -23, 1121, -328, -1017, 645, 812, -903, -524, 1076, 205, -1134, 150, 1076, -498, -924, 779, 673, -995, -377, 1088, 21, -1118, 317, 1005, -639, -819, 875, 528, -1060, -207, 1112, -158, -1073, 469, 906, -775, -692, 975, 366, -1107, -48, 1099, -316, -1003, 622, 800, -879, -525, 1035, 200, -1099, 146, 1064, -475, -925, 768, 681, -975, -359, 1083, 47, -1090, 307, 997, -614, -807, 860, 524, -1036, -202, 1101, -136, -1070, 451, 894, -752, -684, 951, 363, -1075]
4442a075J042J105j389o66J586J77j633L20J560q28j285J214R23j506m33J622
4458G34p0j598N63J442j033j108J370O77j572j90J650l27j550Q20J270j201r16
4475a039J484M43j610N5J593n56j417R97J101j349o87J565J97j620L07J528p93
$$ y = [-1075, -33, 1072, -317, -983, 603, 780, -853, -533, 1027, 199, -1086, 128, 1051, -455, -888, 734, 664, -934, -371, 1071, 38, -1070, 300, 977, -595, -785, 865, 538, -1012, -192, 1078, -123, -1039, 445, 888, -722, -667, 926, 370, -1047, -50, 1051, -298, -985, 580, 777, -843, -536, 992, 199]
$$ [...]
8191A02
##END NTUPLES=NMR FID
##END=
