##TITLE=1H_LY-acetoacetic ether
 CDCl3, 8 sc, 
 6.6.2019
##JCAMPDX= 6.0         $$ Bruker NMR JCAMP-DX V2.0
##DATA TYPE= NMR FID
##DATA CLASS= NTUPLES
##ORIGIN= UXNMR, Bruker Analytische Messtechnik GmbH
##OWNER= root
$$ XWIN-NMR		Version 3.5
$$ Thu Jun  6 14:04:56 2019 Russian Standard Time (UT+4h)  she@DPX200
##.OBSERVE FREQUENCY= 200.13155
##.OBSERVE NUCLEUS= ^1H
##.DELAY= (6, 6)
##.ACQUISITION MODE= SIMULTANEOUS
##.ACQUISITION SCHEME= undefined
##.AVERAGES= 8
##.DIGITISER RES= 18
##SPECTROMETER/DATA SYSTEM= spect
##.PULSE SEQUENCE= zg30
##.SOLVENT NAME= CDCl3
##.SHIFT REFERENCE= (INTERNAL, CDCl3, 0, 15.7039)
##AUDIT TRAIL= $$ (NUMBER, WHEN, WHO, WHERE, WHAT)
$$ ##TITLE= Audit trail, XWIN-NMR		Version 3.5
$$ ##JCAMPDX= 5.01
$$ ##ORIGIN= Bruker BioSpin GmbH
$$ ##OWNER= she
$$ F:/spectra/data/she/nmr/H-F/1/audita.txt
$$ ##AUDIT TRAIL=  $$ (NUMBER, WHEN, WHO, WHERE, WHAT)
(   1,<2019-06-06 14:03:30.45 +0400>,<she>,<DPX200>,
      <created by zg, POWCHK disabled, PULCHK disabled
       configuration hash MD5:
       00 E9 B6 7A A2 85 ED C7 34 08 36 98 17 FE 4E 26
       data hash MD5: 16K
       53 E5 2B 5E D4 6F 2E 61 E2 DA 5B A7 0F 1F ED CA>)
$$ ##END=
$$ 
$$ hash MD5
$$ CD 98 75 95 12 D6 BD 71 9D 67 D3 17 7B 0D 4B D5
##$RELAX= 
##$RELAX= 
##$RELAX= 
##$RELAX= 
##$RELAX= 
##$RELAX= 
$$ Bruker specific parameters
$$ --------------------------
##$DU= <F:/spectra>
##$EXPNO= 1
##$NAME= <H-F>
##$PROCNO= 1
##$TYPE= <nmr>
##$USER= <she>
##$AMP= (0..31)
100 100 100 100 100 100 100 100 100 100 100 100 100 100 100 100 100 100 
100 100 100 100 100 100 100 100 100 100 100 100 100 100 
##$AQSEQ= 0
##$AQ_mod= 1
##$AUNM= <au_zg>
##$AUTOPOS= <>
##$BF1= 200.13
##$BF2= 200.13
##$BF3= 200.13
##$BF4= 200.13
##$BF5= 200.13
##$BF6= 200.13
##$BF7= 200.13
##$BF8= 200.13
##$BYTORDA= 1
##$CFDGTYP= 0
##$CFRGTYP= 5
##$CHEMSTR= <none>
##$CNST= (0..31)
1 1 145 1 1 1 1 1 1 1 1 1 1 1 1 1 1 1 1 1 1 1 1 1 1 1 1 1 1 1 1 1 
##$CPDPRG= <>
##$CPDPRG1= <>
##$CPDPRG2= <>
##$CPDPRG3= <>
##$CPDPRG4= <mlev>
##$CPDPRG5= <mlev>
##$CPDPRG6= <mlev>
##$CPDPRG7= <mlev>
##$CPDPRG8= <mlev>
##$CPDPRGB= <>
##$CPDPRGT= <>
##$D= (0..31)
0 1.2 0 0 0 0 0 0 0 0 0 0.03 0 0 0 0 0 0 0 0 0 0 0 0 0 0 0 0 0 0 0 0 
##$DATE= 1559815409
##$DBL= (0..7)
120 120 120 120 120 120 120 120 
##$DBP= (0..7)
150 150 150 150 150 150 150 150 
##$DBP07= 0
##$DBPNAM0= <>
##$DBPNAM1= <>
##$DBPNAM2= <>
##$DBPNAM3= <>
##$DBPNAM4= <>
##$DBPNAM5= <>
##$DBPNAM6= <>
##$DBPNAM7= <>
##$DBPOAL= (0..7)
0.5 0.5 0.5 0.5 0.5 0.5 0.5 0.5 
##$DBPOFFS= (0..7)
0 0 0 0 0 0 0 0 
##$DE= 6
##$DECBNUC= <off>
##$DECIM= 24
##$DECNUC= <off>
##$DECSTAT= 4
##$DIGMOD= 1
##$DIGTYP= 9
##$DL= (0..7)
0 120 120 120 120 120 120 120 
##$DP= (0..7)
150 150 150 150 150 150 150 150 
##$DP07= 0
##$DPNAME0= <>
##$DPNAME1= <>
##$DPNAME2= <>
##$DPNAME3= <>
##$DPNAME4= <>
##$DPNAME5= <>
##$DPNAME6= <>
##$DPNAME7= <>
##$DPOAL= (0..7)
0.5 0.5 0.5 0.5 0.5 0.5 0.5 0.5 
##$DPOFFS= (0..7)
0 0 0 0 0 0 0 0 
##$DQDMODE= 0
##$DR= 18
##$DS= 0
##$DSLIST= <SSSSSSSSSSSSSSS>
$$ [...]
##$SUBNAM2= <"">
##$SUBNAM3= <"">
##$SUBNAM4= <"">
##$SUBNAM5= <"">
##$SUBNAM6= <"">
##$SUBNAM7= <"">
##$SUBNAM8= <"">
##$SUBNAM9= <"">
##$SW= 24.9336996594482
##$SWIBOX= (0..15)
0 0 2 0 0 0 0 0 0 0 0 0 0 0 0 0 
##$SW_h= 4990.01996007984
##$TD= 16384
##$TD0= 1
##$TE= 0
##$TE2= 300
##$TE3= 300
##$TEG= 300
##$TL= (0..7)
0 120 120 120 120 120 120 120 
##$TP= (0..7)
150 150 150 150 150 150 150 150 
##$TP07= 0
##$TPNAME0= <>
##$TPNAME1= <>
##$TPNAME2= <>
##$TPNAME3= <>
##$TPNAME4= <>
##$TPNAME5= <>
##$TPNAME6= <>
##$TPNAME7= <>
##$TPOAL= (0..7)
0.5 0.5 0.5 0.5 0.5 0.5 0.5 0.5 
##$TPOFFS= (0..7)
0 0 0 0 0 0 0 0 
##$TUNHIN= 0
##$TUNHOUT= 0
##$TUNXOUT= 0
##$USERA1= <user>
##$USERA2= <user>
##$USERA3= <user>
##$USERA4= <user>
##$USERA5= <user>
##$V9= 5
##$VALIST= <valist>
##$VCLIST= <CCCCCCCCCCCCCCC>
##$VD= 0
##$VDLIST= <DDDDDDDDDDDDDDD>
##$VPLIST= <PPPPPPPPPPPPPPP>
##$VTLIST= <TTTTTTTTTTTTTTT>
##$WBST= 1024
##$WBSW= 4
##$XGAIN= (0..3)
0 0 0 0 
##$XL= 0
##$YL= 0
##$YMAX_a= 41685
##$YMIN_a= -45634
##$ZGOPTNS= <>
##$ZL1= 120
##$ZL2= 120
##$ZL3= 120
##$ZL4= 120
##$ABSF1= 10
##$ABSF2= 0
##$ABSG= 5
##$ABSL= 3
##$ALPHA= 0
##$AQORDER= 0
##$ASSFAC= 0
##$ASSFACI= 0
##$ASSFACX= 0
##$ASSWID= 0
##$AUNMP= <proc_1d>
##$AZFE= 0.1
##$AZFW= 0.1
##$BCFW= 1
##$BC_mod= 2
##$BYTORDP= 1
##$COROFFS= 0
##$CY= 11.3945322036743
##$DATMOD= 1
##$DC= 2
##$DFILT= <>
##$DTYPP= 0
##$F1P= 18.9103706918063
##$F2P= -1.10871071338519
##$FCOR= 0.5
##$FTSIZE= 0
##$FT_mod= 4
##$GAMMA= 1
##$GB= 0.15
##$INTBC= 1
##$INTSCL= 1
##$ISEN= 128
##$LB= 0.24
##$LEV0= 0
##$LPBIN= 0
##$MAXI= 10000
##$MC2= 0
##$MEAN= 0
##$ME_mod= 0
##$MI= 1.114404
##$NCOEF= 0
##$NC_proc= 0
##$NLEV= 6
##$NOISF1= 3.799351
##$NOISF2= 2.8
##$NSP= 1
##$NTH_PI= 0
##$NZP= 0
##$OFFSET= 15.70392
##$PC= 1
##$PHC0= -8579.804
##$PHC1= 17.20019
##$PH_mod= 1
##$PKNL= yes
##$PPARMOD= 0
##$PSCAL= 0
##$PSIGN= 0
##$REVERSE= no
##$SF= 200.130013532006
##$SI= 16384
##$SIGF1= 3
##$SIGF2= 2
##$SINO= 400
##$SIOLD= 16384
##$SREGLST= <1H.CDCl3>
##$SSB= 0
##$STSI= 0
##$STSR= 0
##$SW_p= 3612.71676300578
##$SYMM= 0
##$S_DEV= 0
##$TDeff= 0
##$TDoff= 0
##$TI= <>
##$TILT= no
##$TM1= 0
##$TM2= 0
##$TOPLEV= 0
##$USERP1= <user>
##$USERP2= <user>
##$USERP3= <user>
##$USERP4= <user>
##$USERP5= <user>
##$WDW= 1
##$XDIM= 8192
##$YMAX_p= 0
##$YMIN_p= 0
$$ End of Bruker specific parameters
$$ ---------------------------------
##NTUPLES= NMR FID
##VAR_NAME=  TIME,          FID/REAL,        FID/IMAG
##SYMBOL=    X,             R,               I
##VAR_TYPE=  INDEPENDENT,   DEPENDENT,       DEPENDENT
##VAR_FORM=  AFFN,          ASDF,            ASDF
##VAR_DIM=   8192,          8192,            8192
##UNITS=     SECONDS,       ARBITRARY UNITS, ARBITRARY UNITS
##FACTOR=    0.0002004,     1,               1
##FIRST=     0,             0,               0
##LAST=      1.6414764,     0,               0
##MIN=       0,             -45634,          0
##MAX=       1.6414764,     41685,           0
$$ Real data points
##PAGE= N=1
##DATA TABLE= (X++(R..R)), XYDATA
0@%%%%%%%%%%%%%%%%%%%%qJ6j6J6j6J6j6J6k3L1l2L2l4M2m8N0n8O4p1P9q7R6j05
$$ 0 0 0 0 0 0 0 0 0 0 0 0 0 0 0 0 0 0 0 0 0 -8 8 -8 8 -8 8 -8 8 -15 16 -16 16 -18 24 -24 26 -32 32 -39 40 -47 49 -56
43e6J19j32J45j61J80k00K25k57K93l37L96m76N86p48J022j556K950j2879l4748
$$ -56 63 -69 76 -85 95 -105 120 -137 156 -181 215 -261 325 -423 599 -957 1993 -10886 -45634
62d5634L5348L8670j4522k4375J0225Q086j7054o122K0509R641j1723o939J277
$$ -45634 -10286 28384 13862 -10513 -288 7798 -9256 -15378 5131 14772 3049 -3890 -2613
75b613m698K703J5183j774k1066L621K7229n662l7755L38M4040J2263l6799j8223
$$ -2613 -7311 -4608 10575 8801 -12265 -8644 18585 12923 -24832 -24494 19546 31809 -4990 -23213
89b3213K1165Q966j4324N240K1768o637k8626m891J9216J1619J298j462j4579
$$ -23213 -2048 6918 -7406 -2166 19602 12965 -15661 -20552 -1336 10283 11581 10119 -4460
102d460j7094J2745K8187n216k8218L197K6030o209k7769O782K9548l683k6058
$$ -4460 -21554 -8809 19378 14162 -14056 -10859 15171 8962 -18807 -12025 17523 13840 -12218
115a2218K900K0591o648k0107P287K1954Q78j4838r458m090M664K1033J2741k2159
$$ -12218 -9318 11273 4625 -15482 -8195 13759 14637 -201 -9659 -13749 -9085 11948 24689 2530
129B530k6135J1848K4182o788j4486J4103J2012k4356j9838K5460K8225j6988
$$ 2530 -23605 -11757 12425 5637 -8849 5254 17266 -7090 -26928 -1468 26757 9769
141I769k8185P721K1117l209j3365J142O608J440K269j406j2320m406J6549J0959
$$ 9769 -18416 -10695 10422 7213 -6152 -5010 1598 3038 5307 3901 -8419 -12825 3724 14683
155A4683j2922r343J0456Q07j8040K422L0413O806l3526j9972K2527K3147p664
$$ 14683 1761 -7582 2874 3681 -14359 -11937 18476 25282 -8244 -28216 -5689 17458 9794
168I794j3616J139J311m070M029P962k983o239K582O21o584L328J2376m300j6950
$$ 9794 -3822 -2683 -1372 -5442 -1413 6549 3566 -2673 -91 530 -6054 -2726 9650 5350 -11600
183a1600M556K1456l410k6524k528K7176J1194j8862j3969O645O665j038L362
$$ -11600 -7044 14412 11002 -15522 -18050 9126 20320 1458 -12511 -5866 799 -239 3123
196C123M716n716q865l6M509M565P076r7j6560j1348J7186K1362j0815k4255M220
$$ 3123 7839 2123 -6742 -6778 -2269 2296 9372 9275 -7285 -18633 -1447 19915 9100 -15155 -10935
211a0935K1763j184j8291K68J5320J22j2068N56R745j603r725n49Q847O429j967
$$ -10935 10828 9644 -8647 -8379 6941 7063 -5005 -4449 5296 3693 -6032 -6581 2266 8695 6728
226F728j0104j0105N449J9260N564j9260j4430J2399J5324o515j0508O576O815
$$ 6728 -3376 -13481 -8032 11228 16792 -2468 -16898 -4499 10825 4310 -6198 378 7193
239G193j0524q441J2196J3085q149j5224P97J2156N366n509q319k197P940R479
$$ 7193 -3331 -11772 424 13509 5360 -9864 -9067 3089 8455 2946 -5373 -7570 370 9849
253I849m018j3915j992J3335N852r566m662Q038J203j1277j197J5731O722j5525
$$ 9849 5831 -8084 -10076 3259 9111 -455 -5117 2921 4124 -7153 -8350 7381 14103 -1422
267a422j3869Q530J6685J647j2340q915L689R865L529o651o122M017N738m301
$$ -1422 -15291 -6761 9924 11571 -769 -9684 -5995 3870 7399 748 -5374 -1357 4381 80
281H0n892O314Q156p834j2476O941J7489k166k0192n745J7345J2548r450j3944
$$ 80 -5812 502 8658 824 -11652 -4711 12778 10612 -9580 -15325 2020 14568 5118 -8826
295h826J107J0028L180m858l113K567J809l828l105N789Q276m350j4123k052J6007
$$ -8826 -7719 2309 5489 631 -2482 85 1894 -1934 -5039 750 9026 4676 -9447 -11499 4508
310D508J0165j2087j5248N043J5338J219j1671m350O980M192l999k407L985K225
$$ 4508 14673 2586 -12662 -7619 7719 8938 -2733 -7083 -103 4089 90 -2317 1668 3893
324C893n236n247M010R460J236j0766q363P177J3400k47j3636o512R341R480l659
$$ 3893 -1343 -6590 -2580 6880 8116 -2650 -11013 -3836 9564 9317 -4319 -10831 -1490 7990 4331
339D331p971N46M903j115m112K539O274j333q993l128R044Q923n071j2874k016
$$ 4331 -3640 -3094 1809 694 -3418 -879 5395 4062 -4931 -8059 985 9908 4837 -8037 -10053
354a0053J2334Q853p280j1669J024R923K430o543k413N086J176o177j655Q192
$$ -10053 2281 11134 3854 -7815 -6791 3132 5562 -981 -3394 1692 2868 -3309 -4964 3228
368C228N163q290j0362M270J3823K970j2366r489O641J1669k85r579l299N979
$$ 3228 8391 101 -10261 -5991 7832 10802 -1564 -11053 -4412 7257 6972 -2607 -5906 73
382G3L593l825k239M327J996o226m838O419R456k576j2136l975J0203R395m660
$$ 73 3666 -159 -2398 1929 3925 -2301 -7139 -720 8736 6160 -5976 -9951 252 9647 4987
397D987j0906j372Q466M889m211m908J279K758j491j704L403L778l635p417L18
$$ 4987 -5919 -7291 1175 6064 1853 -3055 -1776 982 -509 -2213 1190 4968 1333 -6084 -5766
412e766R206N157p105r641J705J0590M351p363p757K179P026J329m038j392K416
$$ -5766 3440 8597 1492 -8149 -6444 4146 8497 1134 -6623 -4444 2582 3911 -127 -1519 897
427H97k74l635M91O231K240p332p008N033J1051O48j1381o906P300J0008j478
$$ 897 623 -3012 -2521 3710 5950 -1382 -8390 -3357 7694 8342 -3039 -9945 -2645 7363 5885
442E885q779k330N447K803l239j502L499J020n338l149O150P500l558j1110k377
$$ 5885 -2894 -5224 223 3026 -213 -1715 1784 2804 -2534 -5683 467 7967 4409 -6701 -9078
457i078J0667Q402o099j0936L02R415L442n944m034L244K571k978j521M533L034
$$ -9078 1589 9991 3892 -7044 -6742 2673 6115 171 -3863 -619 1952 -1026 -2547 1986 5020
472E020n186o585K591R115K782q023p897L445J0022K326q350o365M314O932r04
$$ 5020 -166 -6751 -4160 4955 7737 -286 -8183 -4738 5284 7610 -740 -7105 -2791 4141 3237
487C237m815M95L159k296m273L044P237o29q891m007P082Q120k141r243l751O621
$$ 3237 -1578 -1083 2076 -220 -4493 -1449 5788 5159 -3732 -7739 -657 7463 5322 -3921 -7672 -1051
503a051P695j938q124j864O183K963m625k141N058J624p027l245Q641P093p492
$$ -1051 6644 4706 -3418 -5282 901 3864 -761 -2902 2156 3780 -3247 -6492 2149 9242 1750
518A750j1191K621J2185L709q503p492K438O946J986m054l198K185K647k634k878
$$ 1750 -9441 -6820 5365 9074 571 -6921 -4483 2463 4449 395 -2803 -618 2029 -605 -3483
533c483M349N296n098r255L237J2501J097j2843n757R963Q524n318q276R78N451
$$ -3483 866 6162 1064 -8191 -4954 7547 8644 -4199 -9956 7 8531 3213 -5063 -4085 1366
548A366J207j879o35K02p17j305m37K655M571o58q486m839Q616J0271m802j2394
$$ 1366 2573 694 59 261 -456 -1761 -2198 457 5028 4370 -4116 -8955 -339 9932 5130 -7264
564g264Q4J0712K634p407k661M898J294m108l47M022P37l439j915J532L058J916
$$ -7264 -7180 3532 6166 -1241 -3902 996 2290 -1818 -2165 1857 2594 -845 -2760 -1228 1830 3746
580C746l010o468K68J0147N172j0114j0189O113J1178j974q184J392N309l751
$$ 3746 736 -5732 -5464 4683 9855 -259 -10448 -4335 6843 4869 -3315 -1923 3386 -365
594c65n536N107P895l020q800j241O137M481r34m749m024K608P178P3q655k480
$$ -365 -5901 -794 7101 4081 -4719 -5960 177 4658 3724 -1025 -5049 -2441 4737 4810 -3845 -6325
610f325R005M379q163m943O939L639p363k426R677M042j0604p888P117R492q09
$$ -6325 2680 7059 -1104 -6047 892 4531 -2832 -5258 4419 8461 -2143 -10031 -2914 6578 5769
625E769o047l347l46K747M946L38n594j945M470N27m768J692P212k135r734P50
$$ 5769 -278 -3625 -3971 -1224 3722 4060 -1534 -3479 991 1518 -3250 -1558 5654 3519 -6215 -5465
641e465J0698Q18j0407k169R460L839o770m676K046K400J789K653j574o306j248
$$ -5465 5233 6051 -4356 -6525 2935 6774 4 -4672 -2626 -226 1563 4216 2642 -3664 -4912
656d912N554J922k835J822L046o536p657P456J2735l737j3810o65J0548K005o629
$$ -4912 642 2564 -271 1551 4597 -1939 -9596 -2140 10595 6858 -6952 -7617 2931 4936 -1693
671a693n83M658p97l622J010J776j570L03K758j221k891K357J597n901k017J0474
$$ -1693 -2276 2382 1585 -2037 -1027 749 -821 -518 2240 1019 -1872 485 2082 -3819 -5836 4638
687D638O344j1704j1622P796J2738k731q674J537L884m435k835O845M945n193
$$ 4638 10982 -722 -12344 -4548 8190 5459 -3215 -1678 2206 -2229 -5064 1781 6726 1533
701A533n609J030K227J397K928m41o352j452P812K386r226l463J0413N609r284
$$ 1533 -4076 -3046 -819 578 3506 3065 -3287 -4739 3073 5459 -3767 -7230 3183 8792 -492
716d92o682O337M561n139j144P139O06r030l455O679N243p15k007l759m708L016
$$ -492 -7174 -837 3724 -1415 -2559 4580 5186 -3844 -7299 -620 4623 3908 1901 -1858 -6566 -3550
732c550R637Q04r841k805P851J301p727P11R657n44j0698p74R764J076q629r85
$$ -3550 6087 6891 -2950 -5755 2096 3397 -4330 -3619 6038 5494 -5204 -5978 3786 4862 -3767 -4752
748d752P879K182n435l394L67J347M330L947m846q398K076Q393n22n592L217M797
$$ -4752 3127 5309 -126 -3520 -3153 -1806 2524 6471 1625 -6773 -4697 3696 3174 -2418 799 5596
764E596p573q241Q683J2614n179j3192Q48R639M87n581O01L411j424j771J391
$$ 5596 -1977 -10218 -1535 11079 5900 -7292 -6444 3195 3682 -1899 -1298 2113 689 -1082 309
779C09o57k142K812L537l365l657L878K126o499j776J0300M802j1623r114Q329
$$ 309 -348 -2490 322 3859 494 -3163 715 2841 -3658 -5434 4866 9668 -1955 -11069 -2740
794b740J0310l276o751J217J807l309N5N609J347m451k050R25n92J290M714q19
$$ -2740 7570 4294 -2457 -1240 567 -2742 -2687 2922 4269 -182 -2232 -1307 -1899 -609 4105 3286
810C286p442m74Q725J258r770k406J0226M270q622n060N611L263l922k54M813
$$ 3286 -4156 -4630 4095 5353 -4417 -6823 3403 7673 -949 -6009 -398 2865 -1057 -1311 3502
825C502p09o061j210M304K966O23r15m926m338N095Q643k292r242L38P696q75
$$ 3502 2793 -3268 -4478 -174 2792 3415 2500 -2426 -6764 -1669 6974 4682 -4560 -4222 3474 2599
841B599o992K037P600k092p858J427P190j034o401M53N483R52l210k058q43R20
$$ 2599 -4393 -2356 5244 3152 -4706 -3279 3911 2877 -3524 -3071 2412 3364 154 -1904 -2747 -1827
857a827M509K606n308n810L305O010j651l682K945K247n924l871P042O721m927
$$ -1827 2682 5288 -20 -5830 -2525 3485 1834 -1848 1097 3344 -2580 -6451 591 7312 2385
872B385p442J689N416O9k484r1J45m20J578J088k918k007L481K661l229k197L345
$$ 2385 -5057 -3368 2048 2117 -367 -458 -313 -733 845 1933 -985 -2992 489 3150 -79 -2276 1069
889A069R02m838n25P033K343p647n229N199O263j277m015r82L50L40J701J243
$$ 1069 1971 -2867 -3392 3641 5984 -1663 -6892 -1693 4570 3293 -722 -1704 -1354 -1014 687 1930
905A930j476j310Q71l06j536J919L397k500n392J919O926n47p513j307O770K863
$$ 1930 454 -856 15 -291 -1827 92 3489 989 -4403 -2484 4442 3895 -3618 -4925 1845 4708
921D708m689l216K268J899q52PJ160p28j875l94J017J687J853r28m603j970N063
$$ 4708 19 -3197 -929 970 118 125 1285 557 -1318 -1712 -695 992 2845 1917 -2686 -4656 407
938D07M912l370n930J219N195n7l850K9K781n29k385Q72K493n16k530o10J743
$$ 407 5319 1949 -3981 -2762 2433 2376 -1474 -1445 1336 807 -1578 -706 1787 1271 -1259 -1869 -126
955a26J905K06k392k857J220M877J309m942l627L143M108j273k866R93J622j995
$$ -126 1779 1985 -407 -3264 -2044 2833 4142 -800 -4427 -1284 2824 1551 -1315 -322 1300 -695
971f95j858K623L140j680m053m78L519K686j453l790j252L237L424j607m135m0
$$ -695 -2553 70 3210 1530 -2523 -3001 518 3204 1751 -2039 -3291 -54 3370 1763 -2372 -2412
987b412L671Q00k918n33K760Ll537k56M580J874m484m077K508N135M83m102k727
$$ -2412 1259 2059 -859 -1392 1368 1371 -2166 -2422 2158 4032 -452 -4529 -2021 3114 3597 -505 -3232
1004c232J804L180K26k366j071J510Q38j470n41K341J101l154k789K852M522j067
$$ -3232 -1428 1752 1978 -388 -1459 51 889 -581 -1122 1219 2320 -834 -3623 -771 3751 2684
1020B684n186j296M209L101k151l479K2K495J061j109q43N62K82j190o18J938
$$ 2684 -2502 -3798 411 3512 1361 -2118 -2096 399 1460 351 -492 70 352 -838 -1456 482
1036D82K108j559l707k23M270K515l179m152R86M233J132k879k025J294J604o01
$$ 482 2590 1031 -2676 -2899 1371 3886 707 -3445 -2459 1774 2906 27 -1998 -704 900 299
1052B99r25R24J062j361k136R37L388O76l740k903K550M469k00m394j981K902
$$ 299 -626 298 1360 -1 -2137 -1200 2188 2864 -876 -3779 -1229 3240 3040 -1354 -3335 -433
1068d33K780j200k345L79J593n45j492R34K285o02l340r41L565L006k230m312
$$ -433 2347 1147 -1198 -819 774 229 -1263 -329 1956 1354 -1986 -2927 638 3644 1414 -2898
1084b898j31M047K099k485k827P91K345J12j431nJ113n02j733L27K691R93k762
$$ -2898 -3029 1018 3117 632 -2195 -1404 941 1053 -378 -383 730 228 -1505 -1178 1513 2506 -256
1101b56k779J466L785O40l319k418J740K989N3k291j007J082Q08n13j35R87J15
$$ -256 -3035 -1569 2216 2856 -463 -2881 -1141 1848 1901 -390 -1397 -315 493 -20 -155 832 947
1118I47j765j158J760K574n68l336j343K742L002j013l385r36K404J891r67j618
$$ 947 -818 -1976 -216 2358 1790 -1546 -2889 -147 2855 1842 -1543 -2479 -75 1816 849 -769
1134g69J87R10m22p60R83J485r44k611j63L211J983k494l480O08L662J340k497
$$ -769 -582 328 -94 -854 129 1614 670 -1941 -2104 1107 3090 596 -2884 -2276 1386 2726 229
1151B29k234R49J942k4j184M9Q32m88j320M85K289N59k701k287J855L550k0l505
$$ 229 -2005 -1056 886 862 -322 -273 559 71 -1249 -764 1525 2084 -617 -2904 -1049 2501 2481 -1024
1169a024j731K315K491p84k149k10J213K65n53K34P93m22j552m04J821J867r28
$$ -1024 -2755 -440 2051 1267 -882 -1092 121 386 -167 67 860 438 -1114 -1518 303 2170 1242
1186A242k920q75K760K593j455l301k51K756J247j540j142P86M46r34k07J472
$$ 1242 -1678 -2553 207 2800 1345 -1956 -2207 549 1796 256 -886 -100 346 -588 -795 677
1202F77P86j488j765N91K389R92k027k616O38L368J248k858k513J574K638n94
$$ 677 1463 -25 -1790 -1199 1190 2182 155 -2461 -1823 1545 2793 -65 -2578 -1004 1634 1040
1218A040j961N44J485j128j831J422K786o37l407j028K748K513q89k793j085J855
$$ 1040 -921 -377 1108 -20 -1851 -429 2357 1720 -1687 -2715 33 2546 1657 -1136 -2221 -366
1234c66K203n86k360k75K082N22j903l76K134K41k825o74L441J820l191l110J788
$$ -366 1837 1251 -1109 -1384 698 1220 -683 -1059 1075 1316 -1509 -2183 1258 3078 -113 -3223 -1435
1251a435L506J30k498j457O51J438Q36m72j159j73O79k85o13J316J650j722l127
$$ -1435 2071 2201 -297 -1754 -1103 335 1171 699 -460 -633 46 -239 -852 464 2114 392 -2735
1268b735J012M041K67l944j424L146K037j895j974O28J165J53o3r5n86k45L40
$$ -2735 -1723 2318 2585 -1359 -2783 363 2400 505 -1469 -841 324 477 414 319 -267 -512 -172
1285a72PJ63J282J63k856j818L298L890k093m786K58L987O36k569k83J879m03
$$ -172 -165 -2 1280 1443 -1413 -3231 67 3957 1864 -2922 -2664 1323 1959 -610 -893 986 583
1302E83j904L87J899R9j374n61M30Q06P59p77k162J70L466J196l872k773L072
$$ 583 -1321 -934 965 1064 -310 -871 -441 365 1124 347 -1815 -1645 1821 3017 -855 -3628 -556
1319e56L383j742k614J280J381k103j139L013K194k511l015O38K241R14j87j014
$$ -556 2827 1085 -1529 -249 1132 -971 -2110 903 3097 586 -2429 -1791 450 1364 1177 163
1335A63j568J58K320N01k484p21K688Q35k817r40K683P18k659k52L116L04l616
$$ 163 -1405 -1247 1073 1574 -910 -1631 1057 1892 -925 -1865 818 1536 -1123 -1375 1741 2045 -1571
1352a571j243L004K160j024j612r33n61J200K590O1k882r78J944K80j593J114
$$ -1571 -2814 190 2350 1326 -286 -1219 -1780 -580 2010 2071 -811 -1789 155 435 -1158 -44
1368d4K578j647l829R57M242j07l758k92L084M70k320o45J153L69K70P25r16k023
$$ -44 2534 887 -2942 -1985 2257 2150 -1608 -1900 1184 1654 -666 -1311 -158 211 481 1206 290 -1733
1386a733M61K254J5j266Q98O45k873j788L942L869k895m747R47L600j27j818Q26
$$ -1733 -1272 982 997 -269 629 1274 -1599 -3387 555 4424 1529 -3218 -2271 1329 1202 -616 210
1403B10R97j651j113J539R72r21j21P01q16q87J391P93k030n76L198J070m103
$$ 210 1207 -444 -1557 -18 954 33 -88 613 -203 -1090 301 1094 -936 -1512 1686 2756 -1347
1420a347k472L566L401j819k551P22N81j433L83K750M01k626j329Q59O54P36J382
$$ -1347 -3819 -253 3148 1329 -1222 -500 81 -1352 -969 1781 2182 -444 -1773 -914 -260 476 1858
1437A858p69l034j71L440P72l284p14L414P26l579j063L110J083k313k96K145
$$ 1858 1089 -1945 -2116 1324 2096 -1188 -1902 1512 2238 -1341 -2404 706 1789 -524 -820 1325
1453A325l87k694p6K505J146o72r98j615r82K258L227j136l755j6K785l39k124
$$ 1325 938 -1756 -1832 673 1819 1147 149 -1466 -2448 -190 3037 1901 -1854 -1870 915 576 -1548
1470a548J616K694k126l729J457L862n34l079K43K230k51j612l3O17K10R40N71
$$ -1548 68 2762 636 -3093 -1636 2226 1692 -1387 -1144 1086 835 -777 -810 -193 17 957 1528
1487A528k013j976J694K544q55j656J191O48k796j160L922K850l184l799J327
$$ 1528 -485 -2461 -767 1777 922 -734 457 1105 -1691 -2851 1071 3921 737 -3062 -1735
1502a735K928j47j144L66N7j067J05J106k40n79R09L48j735m85K111M41k482j25
$$ -1735 1193 1046 -98 268 325 -742 -637 469 229 -350 559 907 -828 -1313 798 1239 -1243 -1368
1520a368L338L74m126j597L720K614k037k174O19N47o83O08J531l08j593m81K79
$$ -1368 1970 2344 -1782 -3379 341 2955 918 -1256 -637 -90 -773 -165 1366 1058 -535 -1016 -737
1537g37K79J294J151j799k672J220L311n47l235L45L145k49l095n4K629K07j889
$$ -737 -458 836 1987 188 -2484 -1264 2047 1500 -1735 -1390 1755 1506 -1589 -1643 986 1193 -696
1554f96K36J562o66j784K81J627O36k91q50j521l35K421J959j886k663R16K133
$$ -696 -460 1102 436 -1348 -1067 560 1196 905 55 -1466 -1801 620 2579 693 -1970 -1054 1079
1571A079p23j361J367J324j932j867J715K178j027j880M60J292j23o41k09k58
$$ 1079 356 -1005 362 1686 -246 -2113 -398 1780 753 -1127 -667 625 502 -139 -348 -606
1587f06L08J347K63k039j187J791J572j134j016J089K57j918k76K668J238k428
$$ -606 -298 1049 1312 -727 -1914 -123 1449 315 -701 388 645 -1273 -1549 1119 2357 -71
1603g1k073J175J902R1q19m73l17J90Q43Q0r23m2J047j26j278L00J513n01j867
$$ -71 -2144 -969 933 1024 205 -268 -585 -395 448 528 -395 -437 610 484 -794 -494 1019 518 -1349
1622a349N84K431j89k794o80K331J404j178j266Q8L59K22M57J49n73l70R4r0J56
$$ -1349 -765 1666 1477 -1317 -1997 334 1738 560 -706 -618 -259 -37 420 569 -4 -374 -280 -370 -214
1641b14R97L26j620j238J515J962r42k133K96J876J72j366l61P38J96k90J78K53
$$ -214 783 1109 -511 -1749 -234 1728 786 -1347 -1051 825 997 -369 -730 8 204 -86 92 345
1659C45l11m26mK78N29M58o58j439L8K015R80j729j681R02J637k20j099J13O39
$$ 345 34 -392 -396 -118 411 869 211 -1228 -1190 825 1805 76 -1605 -703 934 714 -385 -272 367
1678C67l47o13M56Q29j77r48l82O92R92l7j327q70J075J647l79j864l66J519P20
$$ 367 20 -593 -137 692 515 -433 -815 -123 869 832 -495 -1365 -290 1357 978 -886 -1252 267 987
1697I87j000n95P82K81r73k93J243Q06j102j427L40J606O61j094j332K18J391
$$ 987 -13 -608 174 455 -518 -811 432 1238 136 -1291 -951 655 1316 222 -1110 -892 499
1714D99N44j005q80N56Q27l42o34M75O51o82j039N93J502kj642q13J202J402l26
$$ 499 1043 38 -842 -286 541 199 -435 40 691 9 -1030 -437 1065 1063 -579 -1392 -190 1212 886
1733H86j438n29R39R27k79q09o2N24n4m87K28Q56j22j255m44J330J175q73j685
$$ 886 -552 -1081 -142 785 506 -303 -365 159 105 -382 -154 702 580 -675 -1119 211 1386 513 -1172
1752a172K7J627P79j054j139L34J000P5o73q9N62l5p82q5J114N72j122j287O68
$$ -1172 -1145 482 1261 207 -932 -598 402 477 -196 -285 277 242 -540 -625 489 1061 -61 -1348 -680
1771f80J757J97j648r90J014J330l06j136j36P91J77o01o4P43J32j005n79J024
$$ -680 1077 1274 -374 -1364 -350 980 674 -462 -598 193 370 -231 -295 448 580 -425 -1004 20
1789B0J213n39j610k96J475J001q55j270J35J066L14o51l47L87J43m52j62P06
$$ 20 1233 694 -916 -1212 263 1264 409 -861 -726 340 654 3 -344 43 186 -266 -428 278
1807B78N13p31j045K96J352M41j178j073N51J294J73j002o39N20N86j43l45J77
$$ 278 791 60 -985 -689 663 1104 -74 -1147 -596 698 871 -131 -770 -250 336 193 -152 25
1825B5K41l71m91M04R00k1j134o26R20J185k69j332m69R96Q90m11q43j5N99L0
$$ 25 266 -105 -596 -192 708 687 -447 -1073 -153 1032 763 -569 -1038 -42 848 437 -406 -421 178 208
1845B08m21Q5O00j29q99j95J080P65q38j273J73J360N42r47r11K94Q67J02n23
$$ 208 -213 -128 472 343 -556 -751 329 1094 256 -1017 -844 516 1058 111 -800 -506 361 463 -60
1864f0k14L05R5l88o1O58L45q11q61N59J284M0j309o65Q92J010k88q75j89M68
$$ -60 -274 31 126 -262 -323 335 680 -131 -992 -433 851 891 -418 -1083 -191 819 531 -344 -533 -65
1884f5L06r6j36N0mk76j56L98O28j25j020m64R64J084n18j324j05J124N02o48
$$ -65 241 145 9 59 55 -221 -377 21 649 524 -496 -960 4 1088 570 -754 -859 265 767 119
1904A19n14K70K82j61j08K36J55k62l94L8O09M61n52j050O1J390O31j191j181
$$ 119 -395 -125 157 -4 -112 124 279 17 -377 -339 270 731 179 -871 -810 580 1211 20 -1161
1923a161O65J216k23q69J30N83l27o12M27Q36j55r36l50O38P83j0q53o53N86J105
$$ -1161 -496 720 497 -372 -242 341 14 -598 -171 665 510 -426 -776 -138 645 635 -218 -871 -285 820
1943H20j50j278k57J196M87r43m71Q32K63r50k43J200N88j166j034N96J130K05
$$ 820 670 -608 -865 331 818 -125 -596 236 499 -451 -694 506 1094 -72 -1106 -510 620 825
1961H25o39p05j44O47P08k95q56P4P82j80q05L73J064m28j352K75J519k2j522
$$ 825 186 -519 -663 -16 692 397 -459 -385 397 217 -588 -215 849 421 -931 -656 863 841 -681
1980f81l42J294O93p37p64lL87M49K71m48o14J86N11k79k48Q10M35j379j073J423
$$ -681 -1023 271 964 227 -537 -540 -153 296 567 119 -495 -309 202 -77 -325 485 920 -459 -1532 -109
2000a09J707r09j847L28J517q3j066R5P70j03n04P6J79j14Q5J56k53j7N59j89
$$ -109 1598 689 -1158 -830 687 604 -462 -367 403 300 -204 -128 51 -63 22 178 -75 -92 467 278
2020B78j200N7J856N72j981j267J468J369q22q83O85L51j020l17J193N96p87o40
$$ 278 -922 -865 991 1563 -418 -1685 -217 1152 330 -553 132 483 -537 -854 339 935 148 -492
2038d92J57J54K08M87k13r31J58J234j45j568k1J760L56j580m74J169J49j015
$$ -492 -335 -181 27 514 301 -630 -472 762 617 -951 -972 788 1144 -436 -910 259 408 -607
2056f07K80J326k54j525k59J066N73j00j25n97q01N76J384k04j341J61J114n01
$$ -607 -327 999 745 -780 -1039 27 600 500 375 -222 -1023 -447 937 733 -608 -447 667 166
2074A66j223P73J524o97j594N34J438n74j301N35J285k36r37j38J18KO80O85q68
$$ 166 -1057 -284 1240 543 -1051 -517 921 347 -954 -419 866 630 -307 -445 -327 -325 355 1040 172
2093A72j235N04J077l73n24R29M06j715r20J836J528j298j503P48R60o50n03P85
$$ 172 -1063 -559 518 145 -379 550 956 -759 -1679 157 1685 387 -1116 -368 592 -58 -561 224
2111B24L13o78p0M65m23m77P96P06q11o38P54J93j141Q4J862K63k124r60J605
$$ 224 537 -141 -211 254 -169 -646 150 856 45 -593 161 354 -787 -703 1159 1422 -702 -1662 -57
2130e7J098p65m59M74l14q35M98J089j97p28J36Q3o37K40J217j60j440R0J504
$$ -57 1041 276 -183 291 -23 -858 -360 729 532 -196 -60 23 -614 -374 843 683 -757 -667 837
2149H37k31j708K22J910Q9j691l61J088Q5o25N26O95p20r63L10O57Q8K82K19j071
$$ 837 606 -1102 -880 1030 1119 -572 -933 155 240 -385 141 836 116 -847 -537 120 208 490 709 -362
2169c62j021J074J616o69j535N27J208p66j195R65J361q28j274N99R39o08o79
$$ -362 -1383 -309 1307 638 -897 -370 838 72 -1123 -158 1203 375 -899 -300 639 31 -648
2186f48O63O20m12l85ql29L8J166M89j413j113J049J110p31n70R74K67j526n73
$$ -648 15 635 223 -162 -170 -499 -461 705 1194 -219 -1332 -283 827 96 -474 500 767 -759 -1332
2205a332J663J048j186j056N77N84l31j04L22j71j95M22K7q40l2J195K34j202
$$ -1332 331 1379 193 -863 -286 298 -33 -137 185 14 -181 241 268 -572 -604 591 825 -377
2223c77k88J066j8j219L02J687n4j931n47J481Q49o45m58J49j93k13M74L52l33
$$ -377 -665 401 383 -836 -534 1153 1099 -832 -1379 102 951 306 -152 -3 -196 -409 65 417 84
2242H4j28K50l69n09P04R40p54j200O99J302o98j432N83J532k60j318o6Q10k1
$$ 84 -44 206 -163 -672 32 972 218 -982 -283 1019 321 -1111 -528 1004 744 -574 -640 170 149
2261A49l46L71L11n38m35K36K32J56M15j19j052m08J234R02r90r88P50Q18p21
$$ 149 -197 174 485 -53 -488 -252 -20 136 551 432 -620 -1028 206 1108 118 -870 -120 698 -23
2280b3o90P62O83o88o23N42M66m47l45L52K82r5q3k29m38L40R79K1j231m42J026
$$ -23 -713 49 732 44 -579 -37 429 -18 -363 -11 271 176 93 -136 -574 -234 745 766 -465 -907 119
2301A19N32p23k72P19K8r71j08J073M15q71n45M17M33m5j73j51j32K71M05l10
$$ 119 651 -72 -344 375 403 -568 -676 397 812 -59 -604 -187 246 201 28 -123 -255 16 421 111
2321A11o58K56P66j33p26J57O40l25p39M63J006l08j155r6R06M23m00l24n7LJ95
$$ 111 -547 -291 475 342 -384 -227 413 88 -651 -188 818 510 -645 -741 165 588 188 -136 -193 -190 5
2342EK55j25l02J18K11k40j84M60K77o35m53O63O62n63p93L20P69j3n50j72J84
$$ 5 260 135 -167 -49 162 -78 -262 198 475 -160 -613 50 712 149 -644 -324 445 432 -118 -290 -106
2363a06J11J15P3j34k12N5R4q9J27L38j80o87m2Q62L66p37o09M64O21j98m71O0
$$ -106 5 120 193 59 -153 -98 -4 -93 34 372 192 -495 -537 325 691 -46 -655 -191 430 232 -239 -179
2385a79K89k1j77L0J46j1j31j40J11L19J07n04m33M73P66k04q68j24P10L18m57
$$ -179 110 89 -88 -58 88 77 -54 -194 -83 236 343 -161 -594 -121 645 441 -427 -551 159 477 20
2406B0l00K89J95k93j52L43K57k89m20N8M79K79l52n56N4O30K75n11m73K81M99
$$ 20 -280 9 204 -89 -241 102 359 70 -350 -292 187 466 114 -442 -388 242 517 6 -467 -186 313
2427C13j22l81P5K99j27l55J28M81L5n30l26L87N60o2n83k93M01M98j07m87j00
$$ 313 191 -190 -115 184 57 -298 -170 311 346 -184 -510 -123 437 375 -208 -501 -100 398 291 -196 -296
2448b96L66J37k86p5L15R7m12k40M27M78k78o54m2O60L65m39n51J28N19J16l86
$$ -296 70 207 -79 -154 161 258 -154 -394 33 511 233 -421 -463 197 562 123 -428 -300 219 335 -51
2469e1k04K79J77k72j88L26L17l34n32J64P03J45o63m68M35O12j08n67j55M29
$$ -51 -255 24 201 -71 -259 67 384 50 -482 -318 385 530 -133 -601 -166 446 338 -229 -384 45
2489D5K25k73k06K32K09k78l08K68M92j20o13j76N78M65l46n98J8N53K25l66k84
$$ 45 270 -3 -209 23 232 -46 -354 -86 406 286 -327 -503 75 540 194 -404 -386 167 392 26 -258
2510b58J62K72j32k09J80K67j83l85K0N04K35m64m81K23N91Q7n16l02K83L57r5
$$ -258 -96 176 44 -165 15 282 99 -286 -266 238 473 9 -472 -249 342 429 -87 -389 -106 251 156
2531A56k93N2J95n6k51P7L51M5m27k63L38M84j15n57j88M52L85k05m39J1L50O7
$$ 156 -137 -85 110 54 -197 -120 231 276 -151 -414 -76 408 293 -264 -452 0 385 180 -259 -248 102 169
2553A69k50m5K60J7l52q5M05K87l36m78J07N20J77l68l59J18L98Q4k76j81J66
$$ 169 -81 -126 134 151 -201 -286 119 406 70 -408 -301 219 396 28 -331 -213 185 269 -7 -188 -22
2574b2J69j46j36K09J77k48l32K02M82k0n35k17L89L79j29l46j15J84J84Nj36
$$ -22 147 1 -135 74 251 3 -329 -127 355 335 -200 -417 -28 351 222 -124 -239 -55 129 134 -2
2595bp5P3K2j02OK51P2m06k54L99M51k64n33L7M93J35l21j93J20J55Nl9l0k9L7
$$ -2 -77 -4 18 -84 -78 173 245 -161 -415 -16 435 171 -362 -325 168 303 -18 -211 -91 64 69 30 0 -29 8
2620Hl9o7J48K36j52m94j0O44K86n73m87L47N04j93l25J15K29j50j91J43J77n8
$$ 8 -31 -98 50 286 134 -360 -370 274 560 -13 -500 -153 351 158 -167 -52 177 27 -164 -21 156 98
2642I8j63m6O0J66J14k67l31K46N73q3p30j26O48K56m44k17L36N5l87mM73J22
$$ 98 -65 -111 -51 115 229 -38 -369 -123 450 367 -363 -489 159 415 -29 -246 90 145 -242 -246 227 349
2664C49m10k73J50K58J29j8k80k52K84M19k28n07J94N71j59n84J16N57j22n18
$$ 349 -61 -334 -184 74 203 185 -95 -347 -63 356 128 -379 -185 386 227 -357 -241 316 194 -324
2684c24J86N46j67o13kN35K14k18k34j76j1L90K79l20m01K48L15l45k63N54L78
$$ -324 -138 408 241 -372 -374 161 375 157 -77 -253 -264 126 405 85 -316 -68 247 -98 -361 193 571
2705E71o69n74O10O53m72o07L47N29k32m47Q6K53L2O7J4l04j83L28K19k68l1L99
$$ 571 -98 -672 -62 591 119 -488 -141 388 156 -291 -205 48 80 147 161 -143 -326 2 221 -47 -78 321
2727C21j50p58O3J034K64r80m78O70M10m64j56M43M8m66p4L38N8j37J17K0k98
$$ 321 171 -587 -524 510 774 -206 -684 -14 396 -68 -224 219 267 -199 -273 65 123 -14 103 123 -175
2748a75K0L72j22m61L05P05l67r81J72R94Q3p38o8M50j97m63L77O34k58n70NK02
$$ -175 -155 217 95 -366 -61 644 277 -704 -532 462 545 -193 -261 189 -8 -471 -94 540 282 -288 -283 -81
2770h1MJ93K69l56n19L31N61l67n13N14O24n97p46M78O86l79m57M58L58o26m43
$$ -81 -77 116 385 29 -490 -159 402 35 -478 36 660 63 -683 -205 481 102 -355 103 461 -165 -608
2791f08N27N10j97k11k7l03j20O15M54n63n26M17K89n04r7P96J88r61l54Q18L65
$$ -608 -81 429 232 21 -6 -309 -429 186 640 77 -449 -32 257 -247 -344 452 640 -321 -675 143 508
2812E08o34j97N99O7n81j00M03K5j33L24J5o47k18P06L38m97j29M36k39p35L42
$$ 508 -126 -323 276 343 -238 -338 65 90 -43 281 296 -351 -569 137 475 -22 -151 285 46 -689 -347
2833c47J066o8j021k03O63Q2l48K35L21l76m07L31K53k87M3M43j89o37J51O31
$$ -347 719 651 -370 -573 90 172 -176 59 380 4 -403 -72 181 -106 -63 380 191 -446 -295 336
2853C36j77n18M01O14o07q47M49R37j55o17P5K05l52o9N93K39n28k42K15p6j22
$$ 336 159 -359 42 656 49 -798 -349 588 433 -184 -109 96 -256 -325 268 507 -21 -263 -48 -124 -246
2874b46N01L44o77n72N69N49n00m15O48L83p27n08N76M62l51j76L61n9n16K2N13
$$ -246 255 599 -78 -650 -81 468 -32 -447 201 584 -143 -651 -75 387 36 -140 221 162 -354 -332 181
2895A81O7k01Q7r6n18M1Q67K57q27l91N88K19n55K3P41k0q06j57O34J76l78kK73
$$ 181 248 47 134 38 -480 -439 428 685 -142 -533 55 274 -281 -258 483 463 -343 -500 134 310 -68 -70 203
2918B03j45k65J40J20j58J62L96l29p25J96Q16Jo24O9M55l47n65M40Q30k37q11
$$ 203 58 -207 -67 53 -105 57 453 124 -601 -405 411 412 -212 -143 312 -35 -600 -160 670 433 -378
2939c78o5M81R7j20J09j9k43J2K10r9j84L37K59m67m19M64M34m34l58N53L70o41
$$ -378 -443 38 135 15 124 105 -138 -126 84 -15 -199 138 397 -70 -489 -25 409 -25 -383 170 540 -101
2961a01n49N10O46k27m35K3R6j05R5K75m2k56jK4j73J35M62l5o53j39O38K07n71
$$ -101 -650 -140 506 279 -156 -133 -37 -142 -47 228 186 -70 -71 -47 -220 -85 377 342 -311 -450 188 395 -176
2984a76j68N55J72n42k46M35K33k40j02J60n7j91O9J55J2L8P0k76l29L09N70j30
$$ -176 -344 211 383 -159 -405 30 263 23 -79 81 24 -167 -98 57 69 107 177 -99 -428 -119 451 321
3006C21o29j0N04j6l93J01M33j03m88RM25O2k50n9J21K6m8Kj09j2K88J34l75l17
$$ 321 -308 -318 186 170 -223 -122 311 208 -280 -271 154 216 -34 -93 28 54 6 8 -101 -113 175 309 -66 -383
3030c83L25L86k06l20J92K08k66k68L52L72k43m25L9L02Q3r3p0o2qJ23M4j60m0
$$ -383 -58 328 122 -198 -6 202 -64 -332 20 392 149 -276 -237 65 148 55 -15 -77 -85 38 82 -78 -118
3053a18K18N9k81p5K90R4l11q0L40J29l54k28K62K89r8k10l0L6N6Q6J3j13k2Q1
$$ -118 100 159 -122 -197 93 187 -124 -204 136 265 -89 -317 -55 234 136 -74 -104 -68 -12 74 87 -26 -48 33
3077C3k4j00J14J99j46l08O2L57L8l30j14K57J44j64j58R5J05k1l9k3OJ7Nn8J
$$ 33 9 -91 23 222 76 -232 -170 187 225 -105 -219 38 182 18 -140 -45 60 39 0 -23 -17 0 5 -53 -52
3102e2J45L8k54j29K36K92j66l42M2K91N3k11o6J51M9j03n7R3R1n5j24l4J56J14
$$ -52 93 131 -123 -252 -16 276 110 -232 -190 101 154 -57 -123 28 77 -26 -83 10 101 46 -78 -112 44 158
3126A58j11k20L7K85P0k76j82K15K27j14k06M8J59k5j57K0J78K6j87j16J37K22
$$ 158 47 -173 -136 149 219 -57 -239 -24 203 89 -117 -69 90 65 -92 -72 106 132 -55 -171 -34 188
3148A88l0k56j27K25K04j19k51K4K45L6k05n8J79O9j90j15J81K01j47k58J0L06
$$ 188 158 -98 -225 0 204 85 -166 -142 103 139 -66 -124 55 124 -66 -181 0 201 54 -204 -194 112
3170A12J15k45k28J55K54j3k43o6J84J21j58j49J74J62j37k35Q8K98K1k94j60
$$ 112 227 -18 -246 -91 163 150 -93 -159 25 146 -12 -161 13 175 38 -197 -109 189 210 -84 -244
3191b44K27K56r9k99oK58Q4j82j43J48J41j16j85R0K36m6k64p7K74K03k16k78
$$ -244 -17 239 140 -159 -165 93 177 -5 -148 0 141 25 -160 -70 166 120 -144 -221 53 256 40 -238
3213b38Q5K99N8k65j32J71J63j23j52P8J69m5k14OK38J02k33k21J61K85nl27p8
$$ -238 -153 146 204 -61 -193 -22 141 18 -134 -56 113 68 -146 -140 98 200 -33 -254 -93 192 187 -140 -218
3236b18K57J57j64j84J10J71n5j81K5J93K7k10j07J89K05j01k74k4K77J41k22
$$ -218 39 196 32 -152 -42 129 74 -107 -82 111 138 -72 -179 10 215 114 -160 -184 93 234 12
3257A2k09J23K27n8k02J2J96%k15l4K22R6j89j71R7K13Qj81j28J33J72j6k11m5
$$ 12 -197 -74 153 95 -107 -95 101 101 -114 -148 74 170 -19 -190 -93 120 128 -53 -181 -48 124 108 -103 -148
3281a48J92R9j72j16J50J29j74j39J63K03j16k49K2K38P6j20j14jO8R0j7j13J0
$$ -148 44 143 -29 -145 5 134 -40 -179 -16 187 71 -178 -156 82 158 38 -76 -77 -9 81 64 -49 -39
3304c9J04Jj73J2K26K6k44q6K45J34k41j57J89J89j01j80OQ2M8K9k7j01JQ8rj08
$$ -39 65 66 -107 -95 131 157 -87 -173 72 206 -35 -192 -3 186 85 -95 -89 -7 41 70 43 -58 -57 31 22 -86
3330h6R0J72j26k98P6L74J6l42p7K62Q0j98o8J69N1j18j3K6k6K5Q9l4j20P8J15
$$ -86 4 176 50 -248 -172 202 218 -124 -201 61 141 -57 -125 44 95 -23 -36 -10 -36 -11 78 44 -76 2 117
3355A17j53j87K39L26k29m21J07L99rk82L7J80j09j91J35J88n2j10j6l9k9J52
$$ 117 -36 -223 16 342 113 -308 -201 198 189 -93 -56 124 15 -176 -41 147 95 -15 -31 -70 -99 53
3377E3J34k03j70K45J67l24k32L66L38l20l65J92L00j71j65K30J47k59k22J61
$$ 53 187 -16 -186 59 226 -98 -330 36 374 54 -311 -119 181 10 -155 75 222 -37 -259 -98
3397i8J61K5N3q7k50m5L54J52l43j12L44N7m76o2N56J70m83k07L71J18l32o4L67
$$ -98 63 88 141 54 -196 -241 113 265 -78 -190 154 211 -265 -327 229 399 -84 -291 80 198 -134 -198 169
3420A69P9k67j36O9nJ37K47j22m08k2M09pl32J64M09k68o15J93P05l4n56m1L86
$$ 169 248 -19 -155 -86 -91 46 293 171 -237 -259 150 143 -189 -25 384 116 -499 -306 399 365 -191 -232 154
3443A54q3k99J34L19q8k06K6l6j39K27L19k03l72J63K85l09k46M98M43n59o25
$$ 154 71 -228 -94 225 137 -69 -43 -79 -218 9 328 125 -247 -84 201 -108 -354 144 587 28 -597
3464e97L54O09j79l62K13J79l70k06L82K63j86j00M2k12r8L90K60l70k52L41J22
$$ -597 -243 366 187 -175 38 217 -153 -359 23 286 100 0 42 -170 -268 122 382 12 -240 101 223
3485B23n28p7O97K71o90l95M85K45l42qM40p2n52m5M03Q4q2J44p8m51m5N60J64
$$ 223 -305 -382 315 586 -104 -499 -14 231 -111 -119 321 249 -303 -348 55 139 57 201 123 -328 -373 187 351
3508C51m46n4M05j44o06J81P69k4o56m7M20j12l45K82M52k29m41P8J61j30J67
$$ 351 -95 -149 256 112 -494 -313 456 432 -224 -271 149 37 -308 -26 426 197 -244 -166 -5 -135 32
3529C2L99k15o28M0N75j3l59K52L52m90n76M45O98k42n06J78K33l47j49M72K13
$$ 32 431 216 -412 -372 203 190 -169 83 435 -55 -631 -186 512 270 -236 -58 175 -172 -321 151 364
3550C64l73j31K11j59k65L88M71l63n21K44L33l32j61N84K70p31m59N32M51k90
$$ 364 -9 -140 71 -88 -353 35 506 143 -378 -134 199 -133 -294 290 560 -171 -630 -98 353 63
3570F3j34K74j24m54J24N16l2l10J42R1m06j59O34K64n51k56M39P9n33N0O96O1
$$ 63 -71 203 79 -375 -251 265 233 -77 65 156 -250 -409 225 489 -62 -318 121 200 -333 -283 413 474
3592D74o77j79M17N1k18K30K68l60l97K66K88j91J9L53j88o40J17P06M0n60J1
$$ 474 -203 -382 35 86 -132 98 366 6 -391 -125 163 -28 -9 344 156 -484 -367 339 379 -181 -170
3613a70M50k00n34K77O05j30m92N7K15j84o9L67J10l84j14K48q8k34L65M33m40
$$ -170 280 80 -454 -177 428 298 -194 -137 78 -106 -175 192 302 -82 -196 52 -36 -270 95 528 88
3634H8o31L03N91j80m09L02K90m48l88M30M46k51k76J32L5j92Q4K85j24k17J80
$$ 88 -543 -240 351 171 -238 64 354 -94 -482 -52 394 143 -133 -1 34 -158 -74 211 87 -130 50
3655E0J29m13j25N81K73n64l51M28K45m15r9N26J30n77k59M08K72j62p1N4j63
$$ 50 179 -234 -359 222 495 -69 -420 8 253 -162 -261 265 395 -182 -441 -33 239 77 6 60 -103
3676a03j05K42J37k00l0K62j26m28J17N91l6n68NM68m4m92J07M98J3m61p6K60
$$ -103 -208 34 171 -29 -59 203 77 -351 -234 357 321 -247 -242 226 182 -310 -203 295 308 -153 -229 31
3698C1M6q3R5J3j80l7J55l2j20K08K07l41l63L34M39k29m22K05L44k30l56K41
$$ 31 77 -6 89 102 -78 -115 40 8 -112 96 303 -38 -401 -67 372 143 -279 -74 270 40 -316 -75
3720g5L56j55k78N5J38p5kR5j7q6O1K3k05J5L37R5m04k12L37K52k55j91K55J41
$$ -75 281 126 -152 -97 41 -34 -36 59 42 -44 17 40 -165 -150 187 282 -122 -334 3 255 0 -191 64 205
3744B05k73j72K60J84j54j49O0M8j7L7J5j05M8J59o8k61N6L08Pk99o2K65L0k40
$$ 205 -68 -240 20 204 50 -99 -39 9 -8 29 44 -61 -13 146 78 -183 -127 181 188 -111 -173 92 122 -118
3768a18pK74J1k64q6J81J34o8p7l5lN0P2n7r0P0J15j05j45J14J81j00k08Q9K00
$$ -118 -125 149 160 -104 -190 -9 125 57 -20 -55 -58 -8 64 7 -83 -13 102 -3 -148 -34 147 47 -161 -72 128
3793A28m5k15J8J98K2j32o3O3M4K5jn1m4O4K8m9m4J12L8j30r2J50J46j34j61O7
$$ 128 83 -132 -114 84 106 -26 -89 -26 18 43 42 -9 -53 11 39 -10 -54 58 96 -34 -126 24 170 36 -125 -58
3819e8J47pj24j2O7L0k1m2k5L6N4l5o8K4R3k4j16j3J64M8j46j34J31J40k9j58
$$ -58 89 82 -42 -54 13 43 22 -20 -45 -9 45 10 -58 -34 59 35 -81 -94 70 118 -28 -162 -31 109 80 -78
3845g8RR9K8p3m3N2N9l0r7J6J06O1j40q7R2J46m1j88mJ71P3j45j00J10J03n8j33
$$ -78 -69 30 58 -15 -58 -6 53 23 -74 -58 48 109 -31 -118 -26 120 79 -109 -113 58 131 -14 -114 -4 99 41 -92
3872i2O0J14lj30n6J36J00r4j69M9J85L0j75j11J26J66q4j50J5J66Kj61m6J68
$$ -92 -32 82 79 -51 -107 29 129 35 -134 -85 100 130 -45 -156 -30 136 52 -98 -83 83 85 -76 -122 46
3896D6Q7j39j57J11J76k6k03m5J62J31j12j68N8J82j3j80j7J55P7j46j19J25J74
$$ 46 133 -6 -163 -52 124 98 -105 -150 12 143 31 -137 -79 103 90 -90 -107 48 125 -21 -140 -15 159
3919A59q8k13K4K23M3j68j20J05J67n2j62j4J63M8j50q8J16J61j17j86N0K18K6
$$ 159 71 -142 -118 105 148 -20 -140 -35 132 80 -82 -96 67 115 -35 -123 -7 154 37 -149 -99 119 145
3942A45k23q6J83J37j30j77P0J66mj40l1R6Q2q0j21N5J40lj66q0J87J54j41j92
$$ 145 -78 -164 19 156 26 -151 -81 85 81 -59 -90 6 88 8 -113 -58 82 79 -87 -167 20 174 33 -159
3966a59O6K23k9j91k7J71O1j59n9J08R8p1j07K7Q1M4p7j10N1J67J7k01q6J91J41
$$ -159 -93 130 101 -90 -117 54 115 -44 -103 5 103 32 -75 -48 33 77 0 -110 -59 108 125 -76 -162 29 170
3991A70j64j58J26J48j25j40J27J64q2j73K5J07L2m5m3j4L2O3k0j26K2J83rj97
$$ 170 6 -152 -26 122 -3 -143 -16 148 66 -107 -82 25 57 12 -31 -45 -13 50 30 -96 -74 109 100 -97
4015i7m7K01O5k01l8K05N0k36o0K07Q8j43n6N5k4j4P7N9j26l7J29j3j62O5K20
$$ -97 -144 57 122 -79 -117 88 138 -98 -158 49 137 -6 -62 -7 -31 -45 32 91 -35 -72 57 44 -118 -53 167
4040A67n3k55L4K36n0k09P1K11p9j95M2J39n5l5J09ok14OK40lj99N0J81j36k37
$$ 167 114 -141 -107 129 79 -130 -59 152 73 -122 -80 59 4 -31 78 72 -142 -136 104 101 -98 -48 133 -3 -240
4065b40J66L14j24l07Q6K18r9j51J57J37j70j17J28K0j14R2J89j46k60J49K32
$$ -240 -74 240 116 -191 -105 113 14 -137 20 157 -13 -130 -2 18 -96 -4 185 39 -221 -72 160
4086A60j52j77K54J89l35k93L19L23k19k36J81Q5k26l1K83N3k33j4J16j28p7K84
$$ 160 8 -169 85 274 -61 -354 -35 288 69 -167 14 99 -127 -158 125 178 -55 -69 47 -81 -158 126
4108A26J54l38k01L13J46l55p3M65Q1n12j80M36J52k80j5K60j16l21J22K83n3
$$ 126 280 -58 -259 54 200 -155 -228 237 318 -194 -374 62 214 -66 -81 179 63 -258 -136 147 94
4129I4j32J34n8l05N8M69K6m57k1L89j02m32J88N60j33n84M7M15o8k59K09K45
$$ 94 -38 96 38 -267 -209 260 286 -171 -192 197 95 -337 -149 411 278 -306 -259 156 88 -171 38 283
4151B83k56k86J91J48j11R2K27k58m29K25M90j68l70K53K80m32l85N06N29l78
$$ 283 27 -259 -68 80 -31 61 288 30 -399 -174 316 148 -222 31 311 -121 -506 0 529 151
4171A51m87K30K74k69j15L91J15l78j12K11m5j22K83K43m18l56L66K84l41j10
$$ 151 -336 -106 168 -101 -216 175 290 -88 -200 11 -34 -156 127 370 -48 -404 -38 246 -95 -205
4191b05M87R1o83k23O64L11m50j88L37o0l97J22M95n4l56L7J15k45j5M94J13n30
$$ -205 282 373 -310 -533 131 442 -8 -196 141 81 -316 -194 301 247 -109 -72 43 -202 -217 277 390 -140
4213a40j72M33J8m30J75N94j64p20lO05J9l59J63K98l56l96L17L93j64j64J83
$$ -140 -312 121 139 -291 -116 478 314 -406 -409 196 215 -144 19 317 -39 -435 -118 275 111 -53 130
4234A30j10l85J61N67o9n04O8L60k75l68M38N29l89n69K59L70k55j85M33J68n11
$$ 130 20 -365 -204 363 294 -210 -142 218 -57 -425 13 542 153 -416 -157 213 -42 -227 206 374 -137
4255a37k53L74J79k22J25K60l31m69K91N26j79l33K60J38m84j93O17L29m76l07
$$ -137 -390 -16 163 -59 66 326 -5 -474 -183 343 164 -169 91 229 -255 -448 169 498 22 -285
4275b85L25O2l62J18N11j01n12L0L31j57j77L91K36m97l47L73K98l10o1M30n9
$$ -285 40 102 -260 -142 369 268 -244 -214 117 -40 -217 174 410 -87 -434 -61 237 -73 -134 296 237
4296B37n95l6N77J15l60PK23k60k92L75L77k75l00K39P1l57J8N67N3n67j29M21
$$ 237 -358 -394 183 298 -62 -55 168 -92 -384 -9 368 93 -207 32 103 -254 -236 331 384 -183 -312 109
4318A09J3l53J92M39k32n25J17M00p6j69K39O6m31j39M45J54k98qK77k15m23K59
$$ 109 122 -231 -39 400 168 -357 -240 160 84 -85 154 220 -211 -350 95 249 -49 -57 220 5 -418 -159
4340a59N45j47m81J11L22k29k69L49L27l25l15K02J50j94N3L14j03l92N1L28j11
$$ -159 386 239 -242 -131 191 -38 -307 42 369 44 -271 -69 81 -113 -60 254 151 -241 -190 138 27
4361B7k07L01K21m51l44M12M03k89k84K77J14l51j12M15J60k98j40J68k7j42K11
$$ 27 -180 121 342 -109 -453 -41 362 73 -211 66 180 -171 -283 132 292 -6 -146 22 -5 -147 64
4382F4J72k33j92K26Q3k85k1M36M0n02j17M35J17l55JL57n1m15jL68N6k08nP3
$$ 64 236 3 -189 37 120 -165 -186 250 290 -212 -329 106 223 -132 -131 226 175 -240 -241 127 183 -25 -30 43
4406D3j42l1K40L7j98rJ86j18k59J98L53j54l94R6L38j25k61J80K67j77k86R7
$$ 43 -99 -130 110 147 -51 -60 126 8 -251 -53 300 146 -248 -152 186 61 -200 -20 247 70 -216 -119
4428a19K29n3p1N8jj38J4J69m8j15J25R3k26j58K78K23k43k31J97J72k04j39K27
$$ -119 110 57 -14 44 43 -95 -81 88 40 -75 50 143 -83 -241 37 260 17 -214 -17 155 -49 -188 39
4451C9J55j87j52J03R0p0K2O1n9p8P8L3j12L0J74j9k64qK56N4k13n7K04Nj93J
$$ 39 194 7 -145 -42 48 -22 0 61 2 -76 2 35 -77 -47 127 108 -156 -164 92 146 -67 -124 80 85 -108 -107
4477a07J95M0j67m4Q3L2m9J9K3m2NN5m1p5O6J23p3j39L2J44n3j08N3J36p4j42
$$ -107 88 128 -39 -83 0 32 -17 2 25 -17 -12 43 2 -73 -7 116 43 -96 -64 80 27 -81 -28 108 34 -108
4503a08N3J18j6q5J2K3k1J4L6Jo3J4M1k2n0O1N0o3o3N0P3n5n1M7L8k5l5ML8j5
$$ -108 -55 63 47 -38 -26 -3 -24 -10 26 27 -36 -22 19 -3 -53 8 58 -5 -68 -18 55 0 -51 -4 34 9 -26 -22 16 1
4533AJ9Jj3m9N1L1l8l5L9L3n6k8O4L4n0m8L4M1Nn2lK8J7rk5j0MK4rj7mL4kj9k9
$$ 1 20 21 8 -41 10 41 3 -32 7 40 -16 -44 20 54 4 -44 -10 31 36 -16 -19 9 26 17 -8 -18 -14 10 1 -16 -20 14 12 -7 -36
4568c6M5J5m0l7L5N2Mp4kN0J5k4k9RL5kk4j3L2K7m1m2K8P0rr1nQ2M0n9o5L5Q0
$$ -36 9 24 -16 -53 -18 34 38 -36 -38 12 27 3 -26 -17 18 16 -8 -21 11 38 -3 -45 -17 53 44 -47 -52 30 70 11 -54 -19 61
4601F1k7q4K0O6J1o6l7O5O7o1q0K0R7K0r3o7R2Q7o9j04L7J12k7r2k3J12K8j00
$$ 61 34 -50 -30 36 47 -19 -56 9 76 15 -65 -45 52 72 -21 -88 4 91 22 -82 -45 67 40 -52 -75 37 65 -35
4629c5m9R2O1l3q7j4Q8M0o1o7M2R8k2j08kJ10K7j09n3J01P4q4q8O3J00l7r6%O3
$$ -35 -84 8 69 36 -51 -65 23 63 2 -65 -23 75 53 -55 -57 53 80 -29 -82 19 93 9 -79 -16 84 47 -49 -49 14
4658A4N1n7l4kN7J6o3l9P4O9n9j20M0J36nj46qJ31K2j11m5J02L6n7m2NM1KLk4
$$ 14 65 8 -26 -28 29 45 -18 -57 17 86 27 -93 -53 83 78 -68 -76 55 77 -34 -79 23 59 2 -40 -35 6 8 11 -13
4688a3k2N5K6p5n5J04J06j30j22J07J39j02j20Q7J21q0j25N6J17k6q6K6K3j8K1
$$ -13 -35 20 46 -29 -84 20 126 -4 -126 -19 120 18 -102 -15 106 26 -99 -43 74 48 -38 -12 11 -7 14
4713A4Qk5kO3kj38nJ67N6j72q6J58N4j68k6J88L7j73o3J42L8r9K1Q5p2q2O5P4
$$ 14 22 -3 -5 58 56 -82 -87 80 136 -36 -122 36 90 -78 -104 84 121 -52 -115 27 65 -34 -13 72 0 -82 -17 57
4741E7o8l2J06j0j50pK02jj66J8J53p4j68R2J99p5j73O0R6r7o0J74O2j84q6J65
$$ 57 -11 -43 63 53 -97 -104 98 97 -69 -51 102 28 -140 -48 151 76 -97 -37 59 -38 -98 76 138 -46 -132 33
4767C3K6j42N2J84r1k19O0K05n1j49J13J01j74j19K01J18j40q0J34k4k04O9K56
$$ 33 59 -83 -31 153 62 -157 -97 108 57 -92 21 122 -52 -171 30 148 8 -72 62 38 -166 -97 159
4790A59j8k50K1J71j05j42K01J83j97k30J55J35j30l3K11kk77j4K45J3j74Q2J65
$$ 159 141 -109 -88 83 -22 -164 37 220 23 -207 -52 83 -47 -80 131 129 -148 -162 83 96 -78 4 169
4813A69j90k36K17K61j62j97J68R4k55r2L35J46k77j32J67J1j73J32K46j44k56
$$ 169 -21 -257 -40 221 59 -138 30 124 -131 -223 112 258 -19 -151 16 27 -146 -14 232 88 -168
4834a68J06J50j41n4K69O8l81j41L58J35k71l4K87n2l93L1M06K4k82J4J55j61
$$ -168 -62 88 -53 -107 162 230 -151 -292 66 201 -70 -104 183 131 -262 -231 175 199 -83 -69 86 -75
4856g5j34K42K05k05j61J53j3k17J22L66r9m07K0L46q0k47J99L00k81l74K06L59
$$ -75 -209 33 238 33 -128 25 12 -205 -83 283 184 -223 -203 143 63 -184 15 315 34 -340 -134 225
4878B25j41j85J81O3l10o7L14J25k33LJ55j91k31K69L44k21l21J81J93k72j23
$$ 225 84 -101 80 143 -167 -234 80 205 -28 -25 130 -61 -292 -23 321 100 -221 -40 153 -119 -242
4899b42M15J88m27k56L14J46k16L2K67j14l47N8K97m6j42J91O6l61j48L99J98
$$ -242 173 361 -66 -322 -8 138 -78 -46 221 107 -240 -182 115 69 -73 118 184 -177 -325 74 272
4920B72l03j14K94m4l88N7M90J9m06p6K90p9k01K09K77k22k98J42J51j31J2K86
$$ 272 -31 -145 149 105 -283 -226 264 283 -123 -199 91 12 -189 20 297 75 -223 -81 70 -61 -49 237
4942B37o6m05j0L79rk53J30K80k83l77K53M18j30l26J53J51k85j30L69K08l09
$$ 237 171 -234 -244 135 126 -127 3 283 0 -377 -124 294 164 -162 -9 142 -143 -273 96 304 -5
4963ej75J92%j82J58K90j63l45J05K43j34j36L07J25l76k34L29K17k55m8K62o6
$$ -5 -180 12 12 -170 -12 278 115 -230 -125 118 -16 -152 155 280 -96 -330 -1 216 -39 -87 175 109
4985A09l54L0L87K1k75L9J63j84j99K87K65k28k32J68Q3k24K1L40J4l82o6K83
$$ 109 -245 -215 172 193 -82 -43 120 -64 -263 24 289 61 -171 -3 80 -144 -123 217 231 -151 -217 66
5007F6J3k00J49K24k19l00J60K80j23j45J87N9l02r0L28J20k39o4K03q9k48J55
$$ 66 79 -121 28 252 33 -267 -107 173 50 -95 92 151 -151 -241 87 207 -32 -96 107 18 -230 -75
5029g5L05r8k83P7J70j55r9K63J26k68j86K24J06j83QK56n1l30J5K78Pj84R6J22
$$ -75 230 132 -151 -74 96 -59 -158 105 231 -37 -223 1 107 -76 -68 188 137 -193 -178 100 107 -77 19 141
5053A41j86j68J95J90j49j12J41rk16N1K91mk86J5J98q7j71J76K24j75k75J23
$$ 141 -45 -213 -18 172 23 -89 52 43 -173 -122 169 165 -121 -106 92 5 -166 10 234 59 -216 -93
5075i3K07j08r3J53O8k12p5J78N3j07K2J02j15j59J48J86j28j38J41R5k22q8K63
$$ -93 114 6 -87 66 134 -78 -153 25 78 -29 -7 95 -20 -179 -31 155 27 -111 30 125 -97 -185 78
5098G8J26k28j38J80O9j74JK05qj99pJ25j5n1O8P6j75o0J47N9j35KJ59l0k05J5
$$ 78 204 -24 -162 18 87 -87 -86 119 111 -88 -95 30 15 -36 32 108 -67 -127 20 79 -56 -54 105 75 -130 -115
5124a15K32lj95JJ55m4j40O3J50n8j17L6N7o5J1J00j2j41L4J04m2r5Q3J28j22
$$ -115 117 114 -81 -80 75 31 -109 -46 104 46 -71 -35 22 -43 -32 68 56 -85 -51 53 11 -84 -1 127 5
5149Ej53J07J51p3j26P4R2j03p8J04Q8o1o7L4pj6K2N4m6n7O8K8r6j3J22L2j38
$$ 5 -148 -41 110 37 -89 -15 77 -26 -104 0 88 27 -40 -6 -13 -29 -7 47 1 -56 12 40 -56 -69 53 85 -53
5176e3l8J13N7j09n0J22K2j10l9J03M4p5m0N9kk4J1J8j6qM1k1o2M0Q0l7r3L5P4
$$ -53 -91 22 79 -30 -80 42 64 -46 -85 18 62 -13 -53 6 4 -20 -9 9 -7 -15 26 5 -57 -17 63 26 -67 -32 42
5205D2l4p2M5Q8m4p3J1P9j6n6OM0ql3L0Mj3J0J2k9mK1J5l1k5L7K0k7k8M4K0l4
$$ 42 8 -64 -19 69 25 -48 -37 42 26 -30 -24 16 8 -25 5 9 -4 6 18 -11 -15 6 21 -10 -35 2 22 -5 -33 11 31 -3
5237cl5L2K9k9j4J8J7k7qK2jk0J2kkj4K7Ok5rJ5J2j9lK7J4m0MJ8Kk7jK7J5k4j2
$$ -3 -38 -6 23 -6 -20 -2 15 -12 -20 2 1 -19 -7 -9 -11 -25 2 8 -17 -26 -11 1 -18 -21 6 20 -20 -16 2 4 -23 -24 3 18 -6 -18
5273a8J2NRj1pJ8pj0j0nK8rj7pL3J3k9j7J5K4j7l4L4J5ol3J8L7j7l6jL9J8m2j8
$$ -18 -6 -1 8 -3 -10 8 1 -9 -19 -24 4 -5 -22 -29 4 17 -12 -29 -14 10 -7 -41 -7 8 2 -31 -13 24 7 -29 -30 9 27 -15 -33
5308c3L0J7k6j0kL6J3l1k8K9L3k8l1K1N0j6n3mM7J8l8l3M4J6k5k3ML8Kl4j9L0
$$ -33 -3 14 -12 -22 -24 12 25 -6 -34 -5 28 0 -31 -10 40 24 -29 -33 14 32 -6 -39 5 21 -4 -27 -23 15 17 -17 -36 -6
5340fK2k6k3J1L0J7m8pL3K9m9k7M4L7l6n0K5L2lm0J7K0pmj9PPK5j3l0LM4Oo9J1
$$ -6 16 -10 -33 -22 8 25 -23 -30 3 32 -17 -44 0 37 1 -49 -24 8 5 -35 -18 2 -5 -9 -28 -21 -14 11 -2 -32 -29 15 21 -48 -37
5375c7Q2Kp3j5N4J7m6k4O7jl5k1K7J0Jk0mk8L8K5j6l8L3M0n3n7O1P6m1q9L7P9
$$ -37 45 47 -26 -41 13 30 -16 -40 27 26 -9 -30 -3 7 8 -12 -16 -44 -6 19 3 -35 -2 38 -15 -72 -11 65 24 -65 -28 51
5407E1m6o9M8Q3n5o6K9L0j4j1K5Rm1J9L5m0l1P3Ko1n9J15M1r9m5J07J8j08j5J09
$$ 51 5 -64 -16 67 12 -54 -25 5 -9 -20 5 14 -27 -8 27 -13 -44 29 31 -30 -89 26 67 -32 -77 30 48 -60 -75 34
5437C4L8r1l3Q4j5q0M8P1l1o8L3L7o5lJ05Jj26kJ16k1r6K9J13m6j32N0J30n8r5
$$ 34 72 -19 -52 32 17 -63 -15 56 25 -43 -10 27 -38 -41 64 65 -61 -63 53 32 -64 -35 78 32 -100 -50 80 22 -73
5466g3P2O0j07m3J15N2r4l7P9qj11N3J43n8j26M8Q3o5p6J19R1j37j06J25P7j04
$$ -73 -1 59 -48 -91 24 76 -18 -55 24 16 -95 -42 101 43 -83 -35 48 -17 -93 26 117 -20 -126 -1 76 -28
5492b8l0J14Kj39j3J41J3j10L4R3j09r2J15J11r6q3J19K2j61nJ98K0k01k0J64
$$ -28 -58 56 58 -81 -94 47 60 -50 -16 77 -32 -124 -9 102 6 -77 42 64 -97 -102 96 116 -85 -105 59
5517E9j6j48P0J71q5j86O6J44p4q0J16M7j43o9J40O9j13JJ18q3j58J09J78q5j41
$$ 59 43 -105 -35 136 51 -135 -69 75 1 -79 37 84 -59 -128 12 81 -32 -31 87 4 -154 -45 133 48 -93
5542i3R9R3j67q9K23J15j95j26J56O3j58JJ92Nk20j2J72k1j00R6Q6j63j07J51
$$ -93 6 99 -68 -157 66 181 -14 -140 16 79 -79 -78 114 119 -101 -113 59 38 -62 34 120 -43 -150 1
5566AJ10j42k3J48j1k43L1K41K6k17K8J51j03j66J39K07j22j83Q3J17j14n5J88
$$ 1 111 -31 -54 94 83 -160 -129 112 138 -79 -51 100 -3 -169 -30 177 55 -128 -45 72 -42 -97 91
5589I1M0k13n4J64K1j37R4J65j49k24J25K13r9j40J37R8k01j11K21J13j48r2J46
$$ 91 131 -82 -136 28 49 -88 6 171 22 -202 -77 136 37 -103 34 132 -69 -180 41 154 6 -86 60
5612F0j9j74O8K21p7j78O6R5j15o9K08Q5k17j43J97R0j72LK13k1k87MK37K6j63
$$ 60 41 -133 -65 156 79 -99 -33 62 -53 -122 86 171 -46 -189 8 98 -74 -71 142 121 -166 -162 75 101 -62
5637f2M8J23j30j50J35J63j00r4J06Lj81L6K41qk35JJ93p2j66J44J98j48k37J15
$$ -62 -14 109 -21 -171 -36 127 27 -67 39 42 -139 -103 138 130 -105 -104 89 17 -149 -5 193 45 -192 -77
5661g7J77r2j06J73O2k15q7J88O8j31J5J27q4j77J07J96r9j27R5Q1j92n9K29J17
$$ -77 100 8 -98 75 137 -78 -165 23 91 -40 -25 102 18 -159 -52 144 45 -82 13 94 -98 -157 72 189
5685A89k18j06J47M1j52L9K05m3k27J3J76m9q7J16R3j88j10J53J01j09m5J50k8
$$ 189 -29 -135 12 53 -99 -60 145 102 -125 -112 64 15 -72 44 137 -51 -161 -8 93 -16 -61 89 61
5708F1j88J4K20Qj78LJ35q0j45J42J56j01j45O2P8j07j8J80J5j79m3J32Kr2P8
$$ 61 -127 -113 107 115 -63 -60 75 -5 -150 -8 148 47 -98 -36 42 -65 -83 97 112 -67 -110 22 24 -68 10
5733A0J36j34j56Q4J54p2r8J10P6j83r1J92R0j27p4J09Nj34M6J62l4j45J5P9l7
$$ 10 146 12 -144 -60 94 22 -76 34 110 -73 -164 28 118 -9 -83 26 31 -103 -57 105 71 -74 -59 20 -17
5758a7m8J13N4j46m9J03M3j06J2J36l9j68K7J50rj20M2J16q5j32J04J18o0q8M5
$$ -17 -65 48 102 -44 -93 10 53 -53 -41 95 56 -112 -85 65 56 -64 -22 94 9 -123 -19 99 39 -49 -4
5783dL2q1rJ06K9r6j5N8m5n3Q5R6r8r8O7Q5p6m8R9N2j36n1J23O2j11k5Q4pr1L4
$$ -4 28 -53 -62 44 73 -23 -38 20 -25 -78 7 103 5 -93 -26 59 -17 -65 34 86 -50 -101 22 84 -27 -52 32 25 -66 -32
5813c2Q1op6J6O0n9m1Q6N2r4m7Q2J6r7J8J12qj17QQ3j4o0K1O2m1o3M3M4k4l3N4
$$ -32 49 43 -33 -17 43 -16 -57 29 81 -13 -60 22 38 -59 -41 71 63 -54 -46 37 23 -37 -16 46 5 -58 -15 29 5 -28 26
5844B6j0o2QR2j8p6K2O1m8o7N2R6o1q2L0O9k5m3L0L7l6k9K0J7lpJ6j9k7L3M1m7
$$ 26 16 -46 -38 54 36 -40 -18 43 -5 -72 -20 76 15 -67 -37 32 7 -36 -6 31 -5 -34 -14 3 0 -7 9 -10 -37 -4 37 -10
5876a0k4O4Op3k3Q0L5p8k9P1J7n0m0Q0On4pK2J7k0OJ5k2kNQj7RL1j9n7K9O4k4
$$ -10 -34 30 36 -37 -60 20 55 -23 -52 19 36 -14 -54 26 32 -22 -29 -7 10 -10 -4 11 -11 -13 -8 0 -17 -8 23 4 -53 -24 40 16
5910A6n1K0M7k0n1K3L8Jm6PK4j1j3NJ3njLj0RQJ2pm8M9Nj7k2J2L4l2k0L6Oj1j9
$$ 16 -35 -15 32 12 -39 -16 22 23 -23 -16 8 -3 -16 -11 2 -3 -4 -1 -11 -2 6 18 11 -37 12 17 0 -22 -10 24 -8 -28 8 14 3 -16
5946a6JR%j0NJ9nMj0j8K2Koj2LL0Nl3j0L3j8k0lL9Rl3LJ4J3k5rJ1K9k4j4JJ9J
$$ -16 -15 -6 -6 -16 -11 8 3 7 -3 -21 1 3 -3 -15 -12 18 23 -10 -20 13 -5 -25 -28 11 20 -13 -10 4 17 -8 -17 -6 23 -1 -15 -14 5 6
5984Fj9KlL0rk6jL6jj6oK0Rj4l3K0K7k0k8L1K2j3k5LK7Lj8j5J0J4kj4j1J9Ok7
$$ 6 -13 -11 -14 16 7 -19 -20 16 15 -1 -7 13 22 8 -25 -5 22 2 -26 5 27 14 -11 -8 19 22 4 -11 -1 13 11 -3 -14 5 11 -16
6020a6jJ1K0ql6OL6j0l0J0L3Om1oL4rj4qK7LOk4lKK3j2j4oL1Mj2k2K5J1j2k3K5
$$ -16 -17 -6 14 6 -30 -24 12 2 -28 -18 15 21 -20 -26 8 -1 -15 -23 4 7 13 -11 -14 -12 11 -1 -15 -21 10 14 2 -20 5 16 4 -19 6
6057FJ5j5k6lM0j3k1J4O%%pmjK3Kl4KM8km8j9N1J4n6lM6J7m9j7K7MqKJ1jm%j2
$$ 6 21 6 -20 -23 17 4 -17 -3 3 3 3 -4 -8 -9 14 16 -18 -16 32 30 -18 -37 14 28 -28 -31 15 32 -17 -34 -7 -3 -11 -9 2 1 -3 -3 -15
6096a5j4K7L4k7m3K7M0k6n9N8M5m3n0L1P6l9n4K9M2k5m3L3K6j6j5Mll9M3K6k2
$$ -15 -29 -2 32 5 -38 -11 29 3 -56 2 47 4 -46 -15 61 22 -32 -3 39 14 -29 4 30 14 -1 3 0 -39 4 30 8
6127Hk7M2km9j2P6L3r3k9P8K4p8%P1J0r7NO9Lm9J6K9m3k2M5L2m3k4N6k3o8K5Q8
$$ 8 -19 23 21 -28 -40 36 69 -24 -53 25 49 -29 -29 42 52 -45 -40 29 32 -17 -1 28 -15 -37 8 40 -3 -27 29 6 -62 -37 51
6160E1%q7OP6n0n8O1P0m4q6M3N5m3k6O9Np4j6P4On4L3N2o5p1N2Q7m1o9N4M5j01
$$ 51 51 -36 -30 46 -4 -62 -1 69 25 -61 -18 37 -6 -32 37 42 -32 -48 26 32 -22 11 63 -2 -73 -21 66 25 -44 10 55 -46
6192d6l3J06O1r8m5O9K2r2K0R5k2r4J0P7l5m3Q5L9j03o3J02L9q6NJ05l8j49K4
$$ -46 -79 27 88 -10 -55 14 36 -56 -36 59 37 -57 -47 30 -5 -48 37 76 -27 -90 12 51 -35 -30 75 37 -112 -88
6220h8J47J0j10J2R0p6q9R4J00n7q5L2N4p6oJ25Kj31rR8j9o6P1R9j15j31J03J07
$$ -88 59 69 -41 -29 61 -15 -104 -10 90 33 -52 -20 34 -42 -48 77 79 -52 -61 37 18 -48 23 122 7 -124 -21 86
6248H6q3m3R5L2j57n5J63N5j14j6Q8l2j16N1J42m5j12L5O1q5m4J52N4j50n0R5
$$ 86 3 -40 55 87 -70 -125 38 93 -21 -37 51 19 -97 -46 96 51 -61 -26 35 -50 -94 58 112 -38 -88 7
6274GL0j08M9J41n3j74JJ74k7r1O8Q9j31j11J23J08p5m9P7k0j33K8J83j7j56K7
$$ 7 37 -71 -22 119 66 -108 -107 67 40 -51 17 106 -25 -136 -13 95 20 -29 48 28 -105 -77 106 89 -67 -40
6300d0R9q2q9J19J57j45j50J03J01r2l6J42K1j68o4J36N1q9L9P0r6j24J08J14
$$ -40 59 -23 -112 7 164 19 -131 -28 73 -19 -55 87 108 -60 -124 12 63 -26 13 83 -13 -137 -29 85
6324H5p5p0J10J5j69k4K06N8j65p5J33%j34M6J87l1j85rJ19k0n9J12N6j48p5J18
$$ 85 10 -60 50 65 -104 -128 78 136 -29 -104 29 29 -105 -59 128 97 -88 -97 22 2 -57 55 111 -37 -112 6
6350FM8q0K2J13q6j70P0J69l4j35O7J04j33j15J47J43j08j20Q2O0j30J4J52L0
$$ 6 54 -26 -4 109 23 -147 -77 92 58 -77 -10 94 -39 -154 -7 136 28 -92 -10 50 -80 -66 86 116
6374A16j70j8R6l7o3R7J18j41j39J09J00q2l9J20K7j93l9J83N8j15k8J02n7j14
$$ 116 -54 -72 24 -13 -76 21 139 -2 -141 -32 68 -14 -53 67 94 -99 -138 45 103 -12 -40 62 5 -109
6398a09P4J36l9j39N7O3r5k6J53L3j49m6R9K7j15M9J51n2j83L2J42k5q6O7N4r7
$$ -109 -35 101 62 -77 -20 43 -52 -78 75 108 -41 -87 12 39 -76 -27 124 72 -111 -79 63 38 -48 19 73 -24
6424b4r4J17R1q3k9O2k3j04N3J33l0j18J4Q1p0p5J37R1j13j20R4N9r1j1J23J9
$$ -24 -118 -1 90 7 -22 40 17 -87 -34 99 69 -49 -35 46 -24 -99 38 129 16 -104 -10 49 -42 -53 70 89
6450H9j62k6J25J3o9K8O0o5q7O6R1n0m8N4K4j09KJ10L7j02l7R4j2j09N5J19m6
$$ 89 -73 -99 26 39 -30 -2 58 -7 -94 -28 63 13 -35 19 43 -66 -64 46 83 -19 -56 38 26 -83 -28 91 45
6477D5j11L3P6n0m8Q2M7q2p3P6L7m1j3O1k2q1K9Q9k8m6K2L4o7k9Q8N3r2m7O0K3
$$ 45 -66 -33 43 -7 -55 27 74 -8 -81 -5 32 -9 -22 39 17 -64 -35 54 26 -20 2 36 -31 -60 28 81 -11 -58 2 25
6507B5o5nQ9J0p8k5O2On0L5M3l8n0M5L3m2j4N2j2q3LR7K2p6j4O3k1o5K8Q8k4o5
$$ 25 -40 -45 44 54 -24 -49 13 19 -31 4 47 9 -41 4 37 -5 -19 33 21 -62 -59 38 60 -16 -30 33 12 -53 -25 63 39 -26
6539b6oM8k3j9L6J2l0mK2j0k6M1K7l3o4M9O0m2m8L8M8o3m6N7M9k0n5OL8l0rJ0
$$ -26 -32 16 -7 -26 10 22 -8 -12 10 0 -26 15 42 9 -55 -6 54 12 -36 2 50 -13 -59 -2 47 27 -28 -22 16 -14 -23 -13
6571a3L0j8Mqj6J1L4mm3qM1J5o0jO1Po5j3N6K2n5j4K7K5l2k0M9Rj1k4kRKJ9k7
$$ -13 17 -1 3 -5 -21 -10 24 20 -23 -31 10 25 -35 -36 25 32 -33 -46 10 32 -23 -37 -10 15 -17 -37 12 21 10 -14 -16 -7 -5 14 -13
6606a3pK4K0k5k4J3M9j8n2J6N0j4m3QK9nj6j2K4J6j7mj1%J6mjpJ1J0k3j3L5Jk7
$$ -13 -20 4 24 -1 -25 -12 37 19 -33 -17 33 19 -24 -16 13 8 -8 -20 4 20 3 -1 -12 -12 4 0 -1 -8 3 13 -10 -23 12 13 -14
6641a4k1K2K9j6k9J2L0j5j0jK5qqqlJ4Rk7kJ1K5j3j9LJ6Rk9OK8Kl0NJ9Nj4l2K5
$$ -14 -35 -13 16 0 -29 -17 13 -2 -12 -13 12 4 -4 -12 -15 -1 8 -19 -21 -10 15 2 -17 -14 2 11 -18 -12 16 18 -12 -7 12 17 3 -29 -4
6678dJ6qj2R%%jj8K2NnQj5JOnj1NK5k7lJ1J5j1k9L9J1k4j3J7%qJJJ3j2j0jkJ1
$$ -4 12 4 -8 1 1 1 0 -18 4 9 4 12 -3 -2 4 -1 -12 -7 18 -9 -12 -1 14 3 -26 13 24 0 -13 4 4 -4 -3 -2 11 -1 -11 -12 -14 -3
6718cJ2rpKRLoj2K2lj6J4J0mk5PK4j8oLJ7Lk2MJJ1oLJ5j5lJoj3J8Mj8j2J4K8l1
$$ -3 9 0 -7 -5 4 7 1 -11 11 8 -8 6 16 12 -13 -6 18 0 -6 -3 14 17 -5 -1 0 11 5 8 23 8 5 6 0 -13 5 9 -9 -21 -7 21 -10
6759a0j5J0L5m4MJ9Opj8K0mkQ%pNL3l6k5J4M4j5l2j1N3Km9kM8Qn7qN2J6m3mJ6
$$ -10 -25 -15 20 -24 -20 -1 5 -2 -20 0 -4 -6 2 2 -5 0 33 -3 -28 -14 30 15 -17 -28 25 27 -22 -24 24 32 -25 -33 19 35 -8 -12 4
6796D%j2PMNQJl2j6L0M8m3m1L9M4n3m4N0M7l1o2L1N6l6l4J7K4k3k4L1oQJ3J0n0
$$ 4 4 -8 -1 3 8 16 17 -15 -31 -1 47 4 -37 2 46 -7 -51 -1 46 15 -47 -16 40 4 -30 -13 11 -12 -36 -5 -11 -3 10 20 -30
6831c0j0M4J9m4j8P1J5p7l0P8L3p3j0M2J5m9k0Q7j3l8lK3k4oN0mo6JN7Ro7K1P6
$$ -30 -40 4 23 -21 -39 32 47 -30 -60 18 51 -22 -32 10 25 -24 -44 43 30 -8 -11 12 -12 -18 32 28 -38 -37 20 29 -38 -17 59
6864E9k7q6J7Q3lq4L8M4m6n7M1N6k8l5K7Qn0J6O2k1n9L4N0n1o4P6O8q2o8N9P2
$$ 59 32 -54 -37 46 43 -41 -3 41 -5 -62 -21 35 7 -28 -1 7 -43 -27 35 14 -45 -11 39 -12 -76 0 68 -14 -82 -23 49
6895D9n4m6P5K9q5k3N6L9m3LL9m4n1M9O1l7m2N3J2r1j6J12L1j04k7Q4Jr2M0J06
$$ 49 -5 -51 24 53 -32 -55 1 40 -3 0 39 -5 -56 -7 54 17 -25 28 40 -51 -67 45 76 -28 -55 29 30 -62 -22 84
6925H4m3j03L3P5k8o3P4M5r0p0R6M6o5j5Q3k6j05K9R9oq6L3N3p7n0R0Q3r8p5Q8
$$ 84 41 -62 -29 46 18 -45 29 74 -16 -86 10 56 -9 -24 59 33 -72 -43 56 50 -36 -3 50 -27 -77 13 96 -2 -77 11
6955A1K4q9LJ18Kj29JR9j3p8M9Q0p0j04O3R0m9m6P6J2j13j1J14K4q7oQ6n0r9P3
$$ 11 35 -54 -51 67 69 -60 -59 40 27 -51 -2 78 8 -96 -33 57 8 -38 38 50 -63 -74 40 64 -23 -29 57 7 -92 -19
6985a9J28o9j18M6O2n1n5J08N4j06o5R2L0q7L8R9o9j15N2J13n6p2Q7N2j11r4J41
$$ -19 109 40 -78 -32 30 -21 -76 32 86 -20 -85 7 37 -50 -12 87 18 -97 -45 68 12 -60 27 79 -32 -126 15
7012A5Q7j08n8Q7K0j06j2J40J4j25j8P8l8l2Q1P2j11o2Q8K6r1kJ54j9j71j1J57
$$ 15 102 -6 -64 23 43 -63 -75 65 79 -46 -64 14 -24 -56 25 97 -14 -76 12 38 -53 -55 99 80 -91 -102 55
7039E5K0j25J4J10m7j22M0J38k5r8L7L4o6j2Q9L1j06j5Q1l0j04R9J24q9j49O6
$$ 55 75 -50 -36 74 27 -95 -55 83 58 -40 -3 31 -35 -47 42 73 -33 -48 33 3 -101 -2 122 33 -116 -50
7065e0J26p8q7J09R4j29j07J12Q7p2m7Q3k1j02K0J20j9p8M6N2j18n1J45Q7j29
$$ -50 76 -2 -89 20 114 -15 -122 -10 77 5 -42 41 20 -82 -62 58 39 -39 7 59 -59 -110 35 122 -7
7090gq9J07M9j18j1J58%j48k7J12Jo8M0P3p0p2O3P0p1k1Q7nj41K6J29J4j38J3
$$ -7 -96 11 60 -58 -69 89 89 -59 -86 26 27 -41 -1 72 2 -70 -7 63 -8 -29 58 53 -88 -62 67 81 -57 -44
7118d4J12n2j24O0J44l5j17K5O6m9m1R7J7q1l8P1Mp1N6Q6q1j06P3R9n0q7Q0O6
$$ -44 68 16 -108 -48 96 61 -56 -31 35 -14 -55 42 59 -22 -60 11 15 -56 0 86 5 -101 -28 71 21 -66 14 80
7146H0j14p3J16Q3q8o5Q4J6q9qJ17mr8K0N6m2o5Q6O6q2o4P4M1o4l1R7Nj03jR0
$$ 80 -34 -107 9 92 4 -61 23 39 -50 -58 59 55 -43 -23 33 -9 -74 12 78 -4 -68 6 47 -17 -48 49 54 -49 -50 40
7176D0no5J3O2l4p5M8Q6o1n5N9K1q3j2R6K8r7mN0J2o0J5P7l5q7M3O3l0m7M7L7
$$ 40 35 -30 -17 45 11 -64 -16 70 9 -46 13 34 -49 -61 35 63 -34 -38 12 24 -36 -21 56 21 -66 -23 40 10 -37 10 47
7207D7p6j9Q4Pp2JP8k7q0J4P1Kn6J6L7l9k5N5K3n0j0L2km4J6P1l7o0K2O4k1o0
$$ 47 -29 -48 36 43 -29 -28 50 23 -57 -43 28 30 -26 -10 27 -12 -37 18 41 -9 -19 13 11 -33 -17 54 17 -43 -21 43 22 -38
7239c8L2O0m2p0K9N8j0l2J1J7l0%K2Ok0jK5m3k2N1M6o4l7O8K4n3k9L8N9n3m5L4
$$ -38 -6 54 12 -58 -29 29 19 -13 -2 15 -15 -15 7 13 -7 -8 17 -26 -48 3 49 -15 -52 16 40 -13 -42 -4 55 2 -43 -9
7271iN2k3m1NL2j5j1n%K1K4l4l1L1K2Ln3PO6j2p0LP7Ko0nL3K7l7k5K3J2oj7PJ0
$$ -9 43 20 -21 -16 16 1 -10 -15 -15 6 30 -4 -35 -4 18 21 -32 -25 41 29 -41 -38 39 41 -19 -24 9 36 -1 -26 -3 9 3 -14 -7 3
7307CJ6mk7k1M4K0l0l5L2M4l0o0J3N9Jn2mN2kl3rJ3K8rl6PL5Jj8k4J1K9Kj7k5
$$ 3 19 15 -12 -33 11 31 1 -34 -2 42 12 -48 -35 24 25 -27 -31 21 19 -14 -23 -10 18 9 -27 -20 15 16 -2 -26 -15 14 16 -1 -26
7342b6L9Lk0k9K8M3k2m6K1L8rl5j7K9L0j9l2J5L3rj5l0K2L2j4l2KL0J5n3mN4J9
$$ -26 13 16 -4 -33 -5 38 16 -30 -9 29 20 -15 -32 -3 27 8 -24 -9 24 15 0 -30 -8 24 10 -22 -20 10 25 -28 -32 22 41
7375D1l3m3M1J8k4j9J6K9j3j3k0K3J2k6lnJ9J1%l7J4K9j6j0kL2jj8%J1%oj3J7
$$ 41 8 -35 6 24 0 -19 -3 26 13 0 -20 3 15 -11 -14 -19 0 11 11 -26 -12 17 1 -9 -11 21 20 2 2 13 13 7 -6 11
7409A1j0KJ0j0PoJ1k5lRL6k3k4K0jJ3j9MQjj6MnJ0j1QNj2J7lk0qJ8J4k9MmL7p
$$ 11 1 3 13 3 10 4 15 -10 -13 -4 32 9 -15 5 4 17 -2 2 10 9 -7 -3 -8 2 -9 -1 4 -8 9 6 -14 -22 -4 10 -19 -15 -19 18 11
7448A1l3J2K5j4j4K0Lmjj1n%J2J1j7OK4J1n6KK5J2l0qK3J3qrNQkj0J0k1K2J9k1
$$ 11 -22 -10 15 1 -13 7 10 6 5 -6 -11 -11 1 12 -5 1 25 36 -20 -18 7 19 -11 -19 4 17 9 0 5 13 11 1 11 -10 12 31 10
7485A0m8RO2j7l9JO1k9m0lO3Pn1rL2J5l0j7J7J7o%k0lM0Rm6l5M3M7n0l8O1N2p1
$$ 10 -38 -29 33 16 -23 -22 39 10 -30 -33 30 37 -14 -23 9 24 -6 -23 -6 11 5 5 -15 -18 22 31 -15 -50 -7 40 -10 -48 13 65 -6
7520fp4O3O7k4o8L0L5k7j3J6LjJ3kk8jN0nn3rO0J7q9NQ1K7j00l3P9L7o3j3M3Q
$$ -6 -80 -17 50 26 -42 -12 23 -4 -17 -1 2 1 14 12 -16 -17 33 28 -25 -34 26 43 -46 -41 40 67 -33 -66 13 50 -13 -26 17 25
7554B5m2JK2j3J1K6k6n9L0Q1m1p9M4Q3m5r1M7J07k5j11K3P1l2l7K0N1l3l3J6Q
$$ 25 -17 -16 6 -7 4 30 4 -55 -25 56 15 -64 -20 63 18 -73 -26 81 56 -55 -32 39 7 -30 -10 41 8 -25 -9 -1
7584aj0L5K5o2o0O3O7o1m7P9M8j00p5J20P5r3o4P0M2o4k9P6K5n9k6K7rj9P0K6
$$ -1 -11 24 49 -13 -73 -10 57 -4 -51 28 76 -24 -99 21 96 3 -61 9 51 -13 -42 34 59 0 -26 1 -8 -27 43 69
7614F9j05l7Q9K9p7jJ24k6j45oJ24J8r2J1P3l4q2L8R4l9n4L3J2o6OJ08j3r4KP1
$$ 69 -36 -73 16 45 -32 -33 91 65 -80 -86 38 56 -36 -25 48 14 -68 -30 64 25 -29 4 16 -50 -44 64 51 -43 -41 30
7644C0j2p8M5J20n5j32K4R9l2m9P5L9r9n6Q4M8o7QP0n3r6N5J21l8j07L8Q5p9p6
$$ 30 18 -60 -15 105 50 -82 -58 41 9 -40 35 74 -25 -81 3 51 -16 -8 62 9 -87 -32 89 51 -56 -18 67 -12 -88
7673h8J02R0r1q5O4M4r4J9J07j0j07pQ4l0n7Q5O9j13r2J00R6p7o4Q4M0j33k5J22
$$ -88 14 104 13 -72 -8 36 -58 -39 68 58 -49 -56 28 -2 -59 26 95 -18 -110 -10 86 9 -55 29 69 -64 -89 33
7701C3M0r4j7P8m8p3R2Q0o5r4P3M1r8l3J51N6j55p0J24M5j04mJ27l5j29PJ25j1
$$ 33 73 -21 -38 40 -8 -81 11 91 26 -68 5 46 -52 -85 66 122 -33 -103 21 66 -38 -42 85 50 -79 -72 53 42
7729D2o4L9K8q9k8J08M0j02oR7m6j37O1J70k0j81J3J44l9j12P8J22q2j13K4R1
$$ 42 -22 17 45 -44 -72 36 76 -26 -32 65 19 -118 -57 113 93 -88 -75 69 30 -82 -4 118 36 -77 -53 38
7755C8m5QN6k0j05J4R1oq2P6P1j13j17J24J46j04j12Q2Q1j20o0J19R3r9q3N6K7
$$ 38 -7 1 57 37 -68 -54 37 31 -51 25 96 -17 -134 -10 136 32 -80 2 83 -37 -97 22 115 16 -67 -11 16
7782A6n2L5P1n5q1N9M6o4k0J32J4j75n5J75N9j21n7J20J6j25j9J35J9q0j8M5m3
$$ 16 -36 -1 70 15 -66 -7 39 -25 -45 87 101 -74 -129 46 105 -16 -73 47 63 -62 -81 54 73 -7 -25 20 -23
7809b3j8O7L4p3qO8m1r8N2J65m7j75J2J51kj19K6J25n8j23K9J18mp3K3J1n5MP0
$$ -23 -41 26 60 -13 -21 47 6 -92 -40 125 78 -97 -85 66 64 -55 -29 96 38 -85 -56 62 58 -15 8 19 -36 -32 38
7838C8Po9K5O6o2r6J02J00q0j19Q1Q9r6p1R3J00j04q7P0O2m6k5O2k6p1J6Q3k4
$$ 38 45 -24 1 67 5 -91 11 111 31 -88 -7 82 -14 -85 8 108 4 -83 -13 49 3 -22 40 14 -57 -41 42 18
7866A8n7O1K9j00m5J19O8j12m4R0K5j04l2J20K0p4l8N7Ol1L4L1m9m9O4K7n6jQ1
$$ 18 -39 22 51 -49 -94 25 93 -19 -63 27 52 -52 -84 36 56 -18 -56 1 7 -24 10 41 -8 -57 7 34 -22 -23 58
7895E8j2j09j0J16K0r8lP8nq4K7O9j5m7JL2l3pN5qm6pO2k4o5L4R9m5q5J8O7j0
$$ 58 46 -63 -73 43 63 -35 -38 40 35 -49 -22 47 32 -15 -14 18 -15 -22 33 25 -21 -28 34 10 -55 -21 78 33 -52 -34 33 23
7927B3m8L0L7m9n7O8K9m1LL0l0l2L0N9m8n6M5N4m6n7M6O3l5o3L7M9m1k9K6K1j6
$$ 23 -25 5 42 -7 -64 4 33 -8 -5 25 -5 -37 -7 52 4 -52 -7 47 1 -56 -10 53 18 -45 -8 41 0 -29 -3 18 2
7958Bj8J0JkK8J1m8l1O5M2o5m8O9L4n5n9P8N1o5m4L2L4nk6qK3knj2rK5L3k3m8
$$ 2 -16 -6 -5 -7 21 32 -16 -47 18 60 -5 -53 16 50 -5 -64 14 65 0 -44 -12 22 17 -9 -17 6 4 -1 -13 -22 3 36 13 -35
7992c5J5M1J1q3K6O5Lq7j1P7L1n4m8M3K7mm3QJ8K4mm0j2N8J4n5m0N9M4l7o5L5
$$ -35 -20 21 32 -51 -25 40 43 -44 -55 22 53 -1 -49 -6 21 17 -26 -18 0 24 20 -20 -32 26 40 -15 -55 4 48 11 -54 -19
8024a9O6j6n8j4N9L7n5l2K3M0rl8pN8jl4m6L0N8j9n6j6O0M9p5l9M7O1m4n8J5N6
$$ -19 47 31 -27 -41 18 55 0 -32 -9 31 22 -16 -23 35 34 0 -46 -16 42 23 -33 -49 11 60 -15 -54 -7 54 10 -48 -33 23
8056B3Mo4mM7L5m2m1J5N9J1o4k1M4M6l2n2J0O0%n5j3N9J5m8m2N4N2m3l9JM9K0
$$ 23 27 -37 -41 6 41 -1 -42 -27 32 43 -21 -42 2 48 16 -36 -26 34 34 -21 -34 25 40 -8 -50 4 56 13 -26 -25 24 44
8088D4l7l5K3M1Jn1j3L8Mln7L6M7l5l4lN9J0m2l6M4L9k4m8J0L1j0rk1K6K4ml3
$$ 44 7 -28 -5 36 37 -14 -27 11 15 12 -45 -9 38 3 -31 -34 25 35 -7 -43 1 40 16 -32 -22 9 -1 -10 -31 -5 19 15 -18
8121a8rL3K2m0j7K7M2k3n9K5L5Om6%K5J5j8pj0K4jkk6K4K8k1m7jO0K0n2k7L6L3
$$ -18 -27 6 28 -12 -29 -2 40 17 -42 -17 18 24 -22 -22 3 18 0 -7 -17 7 6 4 -22 2 30 9 -38 -39 21 41 -11 -38 -2 31
8155C1k9l6L0K1j7j4J0J3J2j5j3j0K2J6qk8JM6Kn7lL6K1m1lK7kk7jK3lnJ0k3m
$$ 31 2 -34 -4 17 0 -14 -4 9 21 6 -7 -17 5 21 13 -15 -14 32 34 -23 -26 10 31 -10 -13 14 12 -15 -16 7 4 -1 9 -14 -18
8190a8K7
$$ -18 9
8191I
$$ Imaginary data points
##PAGE= N=2
##DATA TABLE= (X++(I..I)), XYDATA
0@%%%%%%%%%%%%%Qj6J6j6J6j6K4l2L2l8M6m9N7o5P3q6R5j06J22j38J54j70J91
$$ 0 0 0 0 0 0 0 0 0 0 0 0 0 0 8 -8 8 -8 8 -8 16 -16 16 -22 24 -25 32 -33 40 -46 49 -57 65 -73 81 -89 102
36A02k15K39k64K92l24L58l96M39m86N36n94O65p43Q30r34J056j205J392j631
$$ 102 -113 126 -138 154 -170 188 -208 231 -255 281 -313 352 -391 439 -495 561 -644 748 -883
55h83J949k397L084m277O919k2477J1624M8143k7920l0050O954J6495j4455l338
$$ -883 1066 -1331 1753 -2524 4395 -18082 -6458 41685 13765 -16285 -9331 7164 -7291 -10629
69a0629J9422Q748j8850r097N628K986J400J0698l458j8290K322K4639n274l2480
$$ -10629 8793 17541 -1309 -10406 -4778 -1792 -392 10306 6848 -11442 -9120 15519 10245 -22235
83b2235L386M2373O109m1464j7166K8536J4620j5578p23J7452q355k7193J088
$$ -22235 -18849 23524 29633 -11831 -28997 -461 14159 -1419 -2142 15310 6955 -20238 -19150
96a9150K6417J0665q796q847j0422q269J5594K4818q472k9553K609K6527m135
$$ -19150 7267 17932 9136 289 -10133 -18402 -2808 22010 13538 -16015 -13406 13121 8986
109H986k5852P298K8682n993k8618L103K3637m460k0078P423K1426l594j9571
$$ 8986 -16866 -9568 19114 13121 -15497 -12394 11243 6783 -13295 -5872 15554 11960 -7611
122g611o183N742Q719J4079L918k3390k1210J6850K6653p563j8673R523J1478
$$ -7611 -13794 -8052 667 14746 18664 -4726 -25936 -9086 17567 10004 -8669 854 12332
135A2332k0367j5328K6719K5311k1732k9771J1354K4917m470j6505K286R635m15
$$ 12332 -8035 -23363 3356 28667 6935 -22836 -11482 13435 8965 -7540 -5254 4381 3966
148C966k586j645p064q31J5048P776j5321j0980J1190N190j3454J867K4659J331
$$ 3966 1380 -265 -7329 -8160 6888 14664 -657 -11637 -447 4743 -8711 -6844 17815 19146
162A9146l3467j4072K8883K3056j4442j8994L216O787k422K221O841l416p691
$$ 19146 -14321 -28393 490 23546 9104 -9890 -6674 113 -2309 -88 6753 3337 -4354
175d354J960L012m200K193J0012l977j5230M009J9025l964k3691J104K7417O597
$$ -4354 -2394 618 -3582 -1389 8623 4646 -10584 -6575 12450 8486 -15205 -14101 13316 19913
189A9913k3998j3378J2926J1221k996j488K195n359p177L182P495K880J113l108
$$ 19913 -4085 -17463 -4537 6684 3688 2200 4395 -964 -8141 -4959 2536 5416 6529 3421
203C421j2477n512J7601J6887j4159k3303P282K3050k679k0052R49J7219Qj4078
$$ 3421 -9056 -14568 3033 19920 5761 -17542 -10260 12790 10111 -9941 -8992 8227 8235 -5843
217e843l43J0638q32r177J059R366K923o209q644l552Q800J5168m96k0308j0372
$$ -5843 -6186 4452 3620 -5557 -4498 4868 7791 1582 -7062 -10614 -1814 13354 12858 -7450 -17822
232a7822J6455J5722r294j3408O009Q521q264p216J1592J0620j0545j4382M665
$$ -17822 -1367 14355 5061 -8347 -2338 6183 -2081 -9297 2295 12915 2370 -12012 -7347
245g347J4003K282r126o935K023Q580N662o739j2196J405J4574M409j1911o117
$$ -7347 6656 8938 -188 -7123 -5100 3480 9142 2403 -9793 -8388 6186 10595 -1316 -7433
259g433Q337L205q899o38J3342L191j6311j0109J2941J5904l833j5487n757Q530
$$ -7433 904 4109 -4790 -5428 7914 11105 -5206 -15315 -2374 13530 9697 -5790 -11547 -3017
273c017J0287J83q835n489N276O404l767n891M931O726o952r831P784J4732n351
$$ -3017 7270 7453 -1382 -6871 -1595 4809 1042 -4849 82 6808 -144 -9975 -2191 12541 7190
288G190j9313j280J9816R528j4129j4271N110J2786J874p440l889L066K512k495
$$ 7190 -12123 -13403 6413 15941 1812 -12459 -7349 5437 7311 -129 -4018 -952 1560 -935
302i35j836M806N005n823j1206K005J5875N961j4992j3339Q942J6185j609j4077
$$ -935 -2771 2035 7040 1217 -9989 -7984 7891 13852 -1140 -14479 -5537 10648 9039 -5038
316e038l520R306M887m880l356L367J695m610l069N303P387k153j0879m710R872
$$ -5038 -8558 748 5635 755 -2601 766 2461 -2149 -5218 85 7472 5319 -5560 -10270 -398
331c98J1527m077j4475l552J2074Q903o285r380J300O306k59l830K025M709k643
$$ -398 11129 7052 -7423 -10975 1099 10002 3717 -5663 -4363 1943 1684 -2146 -121 4588 1945
346A945p812l12R737O033p821j1541J777J3531N934j0266j1154L811J1327J431
$$ 1945 -5867 -6179 3558 9591 1770 -9771 -7994 5537 11471 1205 -9949 -6138 5189 6620
360F620p981k833N181J587n229q04P363K918q928p854P004J2803p42j3959o868
$$ 6620 -1361 -4194 987 2574 -2655 -3459 3904 6822 -2106 -9960 -2956 9847 9105 -4854 -11722
375a1722R787J1388l035j0977k173P550L766m398k709L723J582n479k992O959
$$ -11722 -1935 9453 6418 -4559 -6732 818 4584 186 -2523 1200 2782 -2697 -5689 1270
389A270P329n081j1518p46J1851P287p559j0807J258R935L709o129n233K308L646
$$ 1270 8599 3518 -8000 -8746 3105 10392 2833 -7974 -6716 3219 6928 799 -4434 -2126 1520
404A520j076j734K670K434m107n821K375Q903K548q639p894M491J0656J641r222
$$ 1520 444 -1290 1380 3814 -293 -6114 -3739 5164 7712 -927 -8821 -4330 6326 7967 -1255
419a255o567M591P691L8n384j626K862L39k849Q05N141O23p205m744O583R430
$$ -1255 -7822 -3231 4460 4498 -886 -2512 350 689 -2160 -1355 3786 4409 -2796 -7540 -957 8473
435H473k281j1720m088R564Q949m192r655q04P001K749m100k045L231J023m532
$$ 8473 6192 -5528 -9616 -52 8897 4705 -4950 -5754 1247 3996 -104 -2149 1082 2105 -2427
450b427j893O062N395n223r674O55J1384N677q571j0100L046J0416J838p664l905
$$ -2427 -4320 1742 7137 1914 -7760 -7105 4279 9956 1385 -8715 -5669 4747 6585 -1079 -4984
465d984M459L328k986j894L774K111n102m835M165Q138N4q918n533N914R274n44
$$ -4984 -525 2803 -183 -2077 1697 3808 -1294 -6129 -1964 6174 6228 -2690 -8223 -2309 6965 6421
481F421r456m579O470O945k477o027M42L865j351l523K896N766k094q300j635
$$ 6421 -3035 -7614 -1144 5801 3324 -2703 -2261 1604 253 -3270 -374 5392 3298 -5002 -6637
496f637Q281O213m834q987p73Q257N930m420q235r6P343K636n365k690M697J876
$$ -6637 1644 7857 3023 -5964 -6737 1520 7450 3030 -5205 -5301 2042 4678 -687 -3377 1320 3196
512C196n940k254P890M964q383r171N448J2108M86j0850n972N623P678K7n674
$$ 3196 -2744 -4998 2892 7856 -527 -9698 -4250 7858 8344 -2506 -8478 -2855 4823 4850 -824
527h24k913L017L036k177k704L398L872m815p121M444J0979j337j2999l414J1787
$$ -824 -3737 -720 2316 139 -2565 833 4705 -110 -7231 -2787 8192 6855 -6144 -9558 2229
542B229P386p891q790L094P229M66l701j339O61l1l67N65K085K161k147o723j746
$$ 2229 9615 1724 -7066 -3972 3257 3723 22 -1317 -656 -687 -1054 -489 1596 3757 1610 -5113 -6859
559f859R094P695p135j1803K481J1993J551r206l018O029K164m263p41L897L52
$$ -6859 2235 9930 2795 -9008 -6527 5466 7017 -2189 -5207 822 2986 -1277 -2018 1879 2231
574B231l754j142K698K449j28l292m001K149Q607K128j0815p991Q556J1427l810
$$ 2231 -1523 -2665 33 2482 2354 -938 -4939 -2790 5817 7945 -2870 -10861 -2305 9122 5312
589E312j0087J071O504k307m914M742O536m566q692J090P983L113l801n053j656
$$ 5312 -4775 -3704 2800 493 -4421 321 6857 2291 -6401 -5311 2672 5785 1984 -3069 -4725
604d725L953N907j345q195j350R082L618q721m993P363M472o756k714Q421K694
$$ -4725 -772 5135 3790 -4405 -5755 3327 6945 -1776 -6769 594 5066 -1690 -4404 4017 6711
619F711j0667n903R551R328m043q519j854K899L766L181j318n814j553N081J643
$$ 6711 -3956 -9859 -308 9020 4977 -3542 -5396 -2497 1269 4450 3132 -2682 -4235 846 2489
634B489m256O03N692k222q551J689J0472mj0735j503J0157L062q397m631M444
$$ 2489 -1767 -1164 4528 2306 -6245 -4556 5916 5912 -4823 -6326 3831 6893 -1504 -6135 -1691
649a691M065L19Q1k249n050J15O478K217m028n31K263m481m928P756J0539o054
$$ -1691 2374 2693 2774 525 -4525 -4410 2068 4285 257 -274 1989 -2492 -7420 336 10875 4821
665D821j4027J255J2594J918q400j515N289k98m112J079K836j243p27K174q16
$$ 4821 -9206 -7951 4643 6561 -1839 -3354 1935 1637 -2475 -1396 1440 197 -530 1644 828
680H28k985J604K179l882j350Q418L853j1797r288J0196J2948m957j1079J435
$$ 828 -2157 -553 1626 -2256 -3606 4812 8665 -3132 -12420 -2224 10724 5767 -5312 -3877
694c877N924k757k760O127L801o598n813L106M461P05L85j281n066n87P268K095
$$ -3877 2047 -710 -3470 2657 6458 -140 -5953 -2847 1614 2319 2704 1423 -3643 -4230 3038 5133
710E133q453k858R900M471j0123o420P849N911n368k730N917L91q415j919Q461
$$ 5133 -3320 -6178 3722 8193 -1930 -8350 -501 5410 42 -2688 3229 3620 -4795 -6714 1747
725A747M837l765m311k082j271L981P754j106j0252k304Q762K341p377m1Q617
$$ 1747 6584 2819 -1492 -3574 -4845 -864 6890 5784 -4468 -6772 1990 4331 -3046 -3087 5530
740E530r57j0531j52J0482J138r103r99Q247J421o955k934L118K824K265J096
$$ 5530 4573 -5958 -6110 4372 5510 -3593 -4592 3655 5076 -1879 -4813 -1695 1129 3394 4490
755D490n097o570L624Q919q78p048J443M734n560o162Q713J0705p282j3518K760
$$ 4490 -607 -7177 -3553 5366 4488 -2560 -1117 3617 -1943 -8105 608 11313 4031 -9487 -6727
770f727J1670K56p399qM323j250k720J414O88j551J908K806l310l834L496K998
$$ -6727 4943 5199 -2200 -2208 2115 865 -1855 -441 247 -1304 604 3410 100 -3734 -238 2760
786B760m892j631Q392K915j1448p031J0449J0286n748q959J734M138j959l80M714
$$ 2760 -2132 -3763 4629 7544 -3904 -10935 -486 9800 4052 -4907 -3173 965 -994 -1374 3340
801C340M66n440k048K735J059N16K749j262o318Q6Q131R06r201j660J0165L272
$$ 3340 3806 -1634 -3682 -947 112 628 3377 2115 -4203 -4117 4014 4920 -4281 -5941 4224 7496
817G496r761m938P216M497m460j757M086o18n572jN659K315k075k459l121j475
$$ 7496 -2265 -7203 13 4510 50 -1707 2379 1761 -3811 -3812 1847 4162 2087 -372 -3493 -4968
833d968N513O831l853r362J041Q533l97p184J535P264k190p851J730P547j190
$$ -4968 545 7376 3523 -5839 -4798 3735 3338 -3846 -2311 4953 2763 -5088 -3358 4189 2999
848B999o726Q71O031J06m608j684J378J898K899N97n367m443M542O381k220n013
$$ 2999 -3727 -2856 3175 3281 -1327 -3011 -1633 265 3164 3761 -1606 -6049 -1507 4874 2654 -2359
864b359J894K671m414k681O875N338o329p453L282O700o01l937k28J234j00P63
$$ -2359 -465 2206 -2208 -4889 1986 7324 995 -6458 -3176 3524 2923 -1014 -1242 -8 -108 655
880F55O82k363j522L362K452l404k630L100J590l874m64N967J121p706l819O839
$$ 655 1337 -1026 -2548 814 3266 -138 -2768 332 1922 -1952 -2416 3551 4672 -3034 -6853 -14
896a4O133l232n567k29K179R91J012N01j832j530J094O72j002J169K344k365m380
$$ -14 6119 2887 -2680 -2909 -730 261 1273 1774 -58 -1588 -494 178 -824 345 2689 324 -4056
913d056K359O260j361p389l43P353K221n877l276L419K768j329q89Q18o54j605
$$ -4056 -1697 4563 3202 -4187 -4530 2823 5044 -833 -4109 -690 2078 749 -140 678 24 -1581
929a581L44J782J202K31j676l420l32N191L604m418n728K215N776m75m519r0L187
$$ -1581 -1237 545 1747 1978 302 -3118 -3450 1741 5345 927 -4801 -2586 3190 2715 -1804 -1894 1293
946A293k51k465P72K406q18k608J7K308J319r09k352j543K042M078m7n187k661
$$ 1293 1042 -1423 -651 1755 937 -1671 -1654 654 1973 1064 -1288 -2831 -789 3289 3242 -1945 -4606
963d606M168M193k060l607Q93K074j453j500K494K463k370l770O86M012J702k640
$$ -4606 -438 3755 1695 -1912 -1019 1055 -398 -1898 596 3059 689 -3081 -2395 1617 3319 679
979F79l452Q0L711K520k474l973O76L993N69l238p40K706K15l070L9M138R19m774
$$ 679 -2773 -2693 1018 3538 1064 -2909 -2233 1760 2329 -909 -1649 1057 1272 -1798 -1759 2379 3298 -1476
997a476l015L699M842j014m838j826K999L135o34k845p87J840J001j363o01J864
$$ -1476 -4491 -792 4050 3036 -1802 -3628 -629 2506 1872 -973 -1760 80 1081 -282 -883 981
1013I81O51k852j862L205L730k071n052j57M866K356l238l458J002L092O74j745
$$ 981 1632 -1220 -3082 123 3853 1782 -3270 -3427 1439 3795 557 -2901 -1899 1193 1867 122
1029A22j055O97N01p95k79J639J297j916l001P79M191J380l890l475K133M383
$$ 122 -933 -236 265 -530 -809 830 2127 211 -2790 -2011 2180 3560 -330 -3805 -1672 2711
1045B711J70l667j724K023J891q22j200O97Q80j213j538J283K798k39l719j788
$$ 2711 2881 -786 -2510 -487 1404 582 -618 79 959 -254 -1792 -509 2289 2050 -1669 -3457
1061c457L329L831j434m648r97L749K536j989k649O76J923l88j452P64J816q80
$$ -3457 -128 3703 2269 -2379 -3376 373 2909 920 -1729 -1053 870 482 -970 -206 1610 730
1077G30k851m8L622J977l062l835J107M383J209l365k608J590K709k35j881j59
$$ 730 -2121 -2169 1453 3430 368 -3467 -2360 2023 3232 -133 -2741 -1151 1558 1323 -558 -717
1093g17J177k51j318N26K238K29k875j906K261L426m50l716j635K641K872q37
$$ -717 460 209 -1109 -583 1655 1884 -991 -2897 -636 2790 2340 -1376 -3011 -370 2502 1665
1109A665k762o68J691J021o89m50O44Nj408n36J896J873j303l079l36L208K256
$$ 1665 -1097 -1765 -74 947 258 -192 452 457 -951 -1487 409 2282 979 -2100 -2436 772 3028
1126C028j984l377kL036J573j685j878M56J266k11p22O96J032j068k041N38L024
$$ 3028 1044 -2333 -2335 701 2274 589 -1289 -833 433 222 -500 196 1228 160 -1881 -1343 1681
1143A681J011l035k836J667L772M36l225j948J700K242l74j584p1R02k42r67N99
$$ 1681 2692 -343 -3179 -1512 2260 2696 -529 -2477 -777 1465 1091 -493 -564 338 96 -871 -272
1160b72J773r3k625j377K444L044j016l715r44L037K270j548k458J79J708L73
$$ -272 1501 1408 -1217 -2594 -150 2894 1878 -1837 -2781 256 2526 978 -1480 -1301 407 780
1176G80q03n5N53m38j129J33J811J091j522k516P3L056J807k246l115N75L193
$$ 780 -23 -78 475 37 -1092 -959 852 1943 421 -2095 -2022 1034 2841 595 -2520 -1945 1248
1193A248Q96k160j351J065Q02p44k16J208L80j574j267J164K171J34k355j859
$$ 1248 2144 -16 -1367 -302 500 -244 -460 748 1128 -446 -1713 -549 1622 1756 -599 -2458
1209b458J466L130L22l269k027K236K762r86k350M45J625q04j526J376K272j182
$$ -2458 -992 2138 2460 -809 -2836 -600 2162 1176 -1174 -729 896 92 -1434 -58 2214 1032
1225A032l237j31L282J882j934k838j66K433J789j202k378P5K228M78j946m79
$$ 1032 -2205 -2336 946 2828 894 -1944 -2110 323 2112 910 -1468 -1393 835 1313 -633 -1112
1241a112J949K67k447l55L208J177l478k535K621L490q09l174r54J622J615K23
$$ -1112 837 1104 -1343 -1698 1510 2687 -791 -3326 -705 2785 1976 -1198 -2152 -530 1085 1308
1257A308r87j157K3R31R8n18Q16R99j669k405J497L715l99m114q99L614J819k538
$$ 1308 321 -836 -813 118 216 -302 514 1513 -156 -2561 -1064 2651 2252 -1862 -2761 853 2672 134
1275A34k096J201J642j47n88k01l60j22N37K69l8N41j93k127q57L310K905k886
$$ 134 -1962 -761 881 734 146 -55 -415 -537 0 269 231 772 579 -1548 -2405 905 3810 924
1293I24m543J149M535L80l258n53K089j12j848M92J980j94j681l72R30P16J61
$$ 924 -3619 -2470 2065 2445 -813 -1366 723 611 -1237 -745 1235 1041 -640 -1012 -82 634 795
1310G95q47j455N54K879M50l809k033L596L247k375l137J326J968j580j071K656
$$ 795 -52 -1507 -953 1926 2376 -1433 -3466 130 3377 1002 -2135 -809 1159 -421 -1492 1164
1326A164J596k992k756J645K849K91j270j145q37O29K063K47k406o70K582P68
$$ 1164 2760 -232 -2988 -1343 1506 1797 527 -618 -1455 -826 1237 1484 -922 -1592 990 1758
1342A758k798r03K768Q92k634m80K819J87l418p04L491J813k126k132o9O32J332
$$ 1758 -1040 -1943 825 1717 -917 -1397 1422 1609 -1809 -2513 978 2791 665 -1467 -1536 -904 428
1359D28J716o49k967o70K441P99j591M43J966j537l284J392M185m95m046j48L420
$$ 428 2144 1495 -1472 -2142 299 1098 -493 -50 1916 379 -2905 -1513 2672 2177 -1869 -2017 1403
1376A403L67k730n69J793O27m22N3p35j424P95K326j24j846K19P99j855j003L670
$$ 1403 1770 -960 -1529 264 891 469 522 -213 -1637 -842 1484 1360 -486 -267 532 -1323 -2326 1344
1394A344K819l665m547J895M357l21k656L57J241j317j015J707J137j230o04P43
$$ 1344 4163 498 -4049 -2154 2203 1882 -774 -417 824 -493 -1508 199 1336 106 -498 245
1410B45l86p99J150R01j658o54K560O92l772j705M058L125k770l222J076J578
$$ 245 -141 -940 210 1111 -547 -1201 1359 2051 -1721 -3426 632 3757 987 -2235 -1159 419
1426D19q62J44K142j53k942r65J856J228P2K89r44k337L35L373N53l373p73L322
$$ 419 -443 -299 1843 1690 -1252 -2217 -361 867 939 1228 284 -2053 -1718 1655 2208 -1165 -1938 1384
1444A384O43l556q74L433J168k677p56K088j56k400L14K787O53j778j329n41J56
$$ 1384 2027 -1529 -2403 1030 2198 -479 -1235 853 697 -1703 -1389 1398 2051 273 -1056 -1597 -1441
1461a441K236K233j854l758M25L375L4k322R66K272k020l257J907L947r47l539
$$ -1441 795 3028 1174 -2584 -2159 1216 1250 -1072 -106 2166 146 -3111 -1204 2743 1796 -1743
1477a743L09K632k78j927J63J206J96J38M3j621j298K022K471j232k228Q13J026
$$ -1743 -1434 1198 920 -1007 -844 362 558 696 739 -882 -2180 -158 2313 1081 -1147 -334 692
1494F92j923o58L548J951l797l517K265L573n51k056J08M73p56R5J195j20q67
$$ 692 -1231 -1889 1659 3610 -187 -3704 -1439 2134 1583 -473 -365 108 -648 -553 642 522 -345
1511c45N14M05j365m00J981N03k260k55K848J35l832r22M125K251k974k601J179
$$ -345 169 574 -791 -1191 790 1293 -967 -1222 1626 1761 -2071 -2993 1132 3383 409 -2192 -1013
1528a013J415m68K07J110o10j743j46J070N89N67L26j706j985J585L140q30l324
$$ -1013 402 -66 141 1251 641 -1102 -1248 -178 411 978 1304 -402 -2387 -802 2338 1508 -1816
1545a816L99L166l18l165J33K920K05k254m3J630n18j654N93J846J65j097q92
$$ -1816 -1417 1749 1431 -1734 -1601 1319 1524 -730 -773 857 339 -1315 -722 1124 1289 192 -700
1562g00o54L84K159J179k295k486J362K505o72j713R80J242j733j580J929K113
$$ -700 -1354 -970 1189 2368 73 -2413 -1051 1454 782 -931 49 1291 -442 -2022 -93 2020
1578B020j404k094P10J602k78r80m6K29L22Q21j13j802p08K008J494j442j382
$$ 2020 616 -1478 -768 834 556 -424 -470 -241 81 902 789 -1013 -1721 287 1781 339 -1043
1595a043R98N80j429j15K362O91k690j743J857K157m68j434m01K13L62O31lq96
$$ -1043 -45 535 -894 -1009 1353 2044 -646 -2389 -532 1625 1157 -277 -678 -465 -103 528 525 -371
1613c71j08R76m1j161K13J390l98j668N79K133m57k687k14K667J110j801j453
$$ -371 -479 497 456 -705 -492 898 500 -1168 -589 1544 1087 -1600 -1814 853 1963 162 -1291
1630a291N64Q68J93J07q3o17l46L70K48Q3N41qj377p58J642J658j254k120O07
$$ -1291 -727 141 334 441 358 -259 -605 -235 13 96 637 629 -748 -1506 136 1794 540 -1580 -973
1649i73K068l2j648l07J055L24m75j0K26l04l42K24L98K88K6o83r60M37J813M61
$$ -973 1095 1063 -585 -892 163 487 12 2 228 -76 -418 -194 204 492 518 -165 -1125 -688 1125 1586
1669A586j973j407J345J754n07j409J06Q25k23n65M31O99l61r12r2Q70P11m13
$$ 1586 -387 -1794 -449 1305 798 -611 -505 320 97 -468 -37 662 301 -611 -703 167 878 465
1687D65j207m21J270J302p70j832k0J748O11j254o97Q39M37q34k42J128N06j246
$$ 465 -742 -1163 107 1409 639 -1193 -1213 535 1146 -108 -805 34 471 -363 -605 523 1029 -217
1705b17j130P91J592J55j421j055O86J439J96j247p64P72R00m21p10L75O00n98
$$ -217 -1347 -556 1036 1191 -230 -1285 -599 840 1036 -211 -975 -203 697 276 -434 -59 541 -57
1723e7p97O88J279l44j655l83J488J155p95j500j22J230Q02n81r37M2O45P7m67
$$ -57 -854 -166 1113 769 -886 -1269 219 1374 579 -921 -1043 187 989 408 -529 -487 158 235 -232
1742b32J48O26k17j071j38J367Q13j164j494M81J723M14j383j025O85J111p2q39
$$ -232 -84 542 325 -746 -884 483 1296 132 -1362 -881 842 1256 -127 -1152 -467 644 572 -267
1760b67j04N77J2o33J9R37L04j190r14R62J582k55j786o26J378J231o53j271L6
$$ -267 -371 206 218 -415 -396 541 845 -345 -1259 -297 1285 1030 -756 -1382 -4 1227 574 -697 -661
1779f61R55J88o60j26O39O3q77l07J064Q86q33j478J58J607O88j195j225M78J219
$$ -661 294 482 -178 -304 335 398 -479 -786 278 1164 331 -1147 -989 618 1306 111 -1114 -636 583
1798E83J36q53l69M71K34l58j27N96K81p68p71N57J252N4j318q09R17J251j70
$$ 583 719 -134 -503 -32 202 -156 -283 313 594 -174 -945 -388 864 918 -400 -1209 -292 959 789
1817G89j206m41P33O81k91m66J15K52k74l32M37P05k76j056k91J101R43o40j317
$$ 789 -417 -858 -125 556 265 -201 -86 166 -108 -440 -3 702 426 -630 -921 180 1123 483 -834
1836h34j19J208P24o83r08J48P16N3m52L4M65j71p16OJ022M61j015j069N54J391
$$ -834 -953 255 979 296 -612 -464 252 305 -147 -113 352 181 -535 -529 493 954 -61 -1130 -576 815
1856H15J78j191p89O16R49o7o98k02L93J62l17m0N08J55p58n90P40J107k79j354
$$ 815 993 -198 -987 -371 578 511 -187 -389 4 166 -151 -191 317 472 -286 -876 -136 971 692 -662
1876f62l85J151Q64n69r88LO99K96k61k23K3J1j40k5L69L98l26q73j38J056Q09
$$ -662 -1047 104 968 399 -589 -586 113 409 148 -75 -52 -41 -181 -206 163 561 235 -638 -776 280 1089
1897A089p85j261K00J263L52q95n60M29M10j85j67J78J26k91k54J80N06J94o14
$$ 1089 304 -957 -757 506 858 -37 -597 -168 242 57 -110 68 194 -97 -351 -171 335 529 -85
1916h5p81L70J267K79j352r65R71J257m17j053J20O95k08n60M08P26l38r29p4
$$ -85 -866 -496 771 1050 -302 -1267 -296 961 544 -509 -389 306 98 -462 -54 672 334 -595 -669
1935f69Q33O07l55q64l42P46R21l74j203q6J247M20j086n06Q50L88q58k31J095
$$ -669 164 771 416 -448 -790 -44 877 503 -700 -786 461 881 -205 -711 139 527 -331 -562 533
1954E33L66j245q14R27J150j84r62n04K52P32M75m95q27J60Q14j07p50K87R26
$$ 533 899 -346 -1160 -233 917 733 -229 -733 -481 251 726 231 -596 -436 378 271 -479 -192 734
1973G34m44j217L79J453j57j530j54J430N46j058p94L80O20L00p1m90m93K82O13
$$ 734 290 -927 -548 905 748 -782 -936 494 1040 -18 -812 -432 188 488 417 -73 -566 -284 329
1992C29j72l47N10K81j148p10J489J433j222j856O01J712j57j284O6Q99j08o28
$$ 329 157 -190 320 601 -547 -1257 232 1665 443 -1413 -812 900 743 -541 -475 424 316 -312
2010c12Q9L38j00k4J40j56j16L70j06q40J99J535K19k013r55J777J421j114j167
$$ -312 -223 115 15 -9 131 -25 -141 229 123 -717 -518 1017 1236 -777 -1732 45 1466 352 -815
2029h15O77N65q18k64J157M56j054o81M76M47Q9J64k30p45J85J074j48j403R7
$$ -815 -138 427 -391 -655 502 958 -96 -777 -301 146 235 399 169 -576 -391 683 535 -868 -771
2048g71J710J84j723m70J370L52j029R3J155l59j485J9J397M82o03m20l60l42
$$ -771 939 1123 -600 -1070 300 652 -377 -284 871 512 -973 -954 443 925 322 -98 -458 -800
2066h00P02J163m12j406J10J205k94j132O77J374p68j619O09J535n27j353N81
$$ -800 -98 1065 653 -753 -643 562 268 -864 -187 1187 419 -1200 -591 944 417 -936 -355
2083c55J301m27j165lN74J47L56L27q94j020P02J265l66q04N88L67j356n95J880
$$ -355 946 519 -646 -649 -75 72 428 755 -139 -1159 -457 808 442 -362 226 593 -763 -1358 522
2102E22J267j617j609R95J249o42o77P19L73p44k30N57j46m39O36O06q57p27P52
$$ 522 1789 172 -1437 -442 807 165 -512 207 580 -164 -394 163 17 -422 214 820 -37 -764 -12
2121a2M33q79K6J500j7k082o17J933J129j137q62N20K0o09N05J008l52r82R1L97
$$ -12 421 -458 -432 1068 1051 -1031 -1648 285 1414 277 -585 -65 -45 -654 -149 859 507 -475 -384 13
2141A3l15J33R37k05j392J16J468j55j576K71J831q7j864k82J413K94p76J97O13
$$ 13 -302 -169 768 563 -829 -713 755 600 -976 -705 1126 1039 -825 -1107 306 600 -176 21 634
2160F34o85q86N72R12m7k22n1p52n96J167J408q85j647N35J354o06j169R09J272
$$ 634 -51 -937 -365 547 500 278 227 -525 -1121 46 1454 569 -1078 -543 811 205 -964 -55 1217
2179A217r27j369O83J129n73p87O58O41n88n56K01O9J02P73J84j392q73J304J211
$$ 1217 290 -1079 -396 733 160 -627 31 672 84 -472 -271 -202 -100 673 857 -535 -1408 -104 1107
2198A107q21q84P68L60j256l52J671Q30j471j120Q56Q55m05l13L16o1k73K72J15
$$ 1107 286 -598 170 530 -726 -1078 593 1423 -48 -1168 -312 543 138 -175 141 80 -193 79 194
2217A94o03j1J052J36j241l05J123J58j074K02J439k59j878k50J793P83j072p35
$$ 194 -409 -420 632 768 -473 -778 345 503 -571 -369 1070 811 -1067 -1317 476 1259 187 -548
2235e48L21J30j38L99L29m49k87K35j02l42N80P18p63j095P32J249p02j351O68
$$ -548 -227 -97 -235 164 493 44 -243 -8 -110 -452 128 846 83 -1012 -280 969 267 -1084 -416
2254d16J497m30j476N6J103O2n22J86K66n07l77M32M14j3K9j83p74j13J210O87
$$ -416 1081 651 -825 -769 334 396 -126 60 326 -181 -558 -126 288 275 304 121 -653 -766 444 1131
2274A131j138r98Q60R23p12p51P46O99p52o68O13N52m91l95M17L14k53k12q1j45
$$ 1131 -7 -1005 -145 778 66 -685 61 760 8 -660 -47 505 14 -381 36 350 97 -115 -196 -341
2294c41L30P11j80j174k47J169N38q49m34O65J20q28m2J073K67j027n21O61N45
$$ -341 -11 700 520 -654 -901 268 806 -43 -477 188 308 -520 -562 511 778 -249 -770 -109 436
2313D36k45l05n9QK35K59k96n45K91P45j94p57J16O86k45o54M34Q52m22j109R7
$$ 436 191 -114 -173 -165 70 329 33 -512 -221 524 330 -427 -311 375 130 -524 -90 762 340 -769 -672
2334f72J097K86o53m19J28J95J58J54j75k99J02K42j63j71L69J97n69l68O82N50
$$ -672 425 711 58 -361 -233 -38 120 274 99 -200 -98 144 -19 -190 179 376 -193 -561 121 671
2354F71o24p28M32Q08j63o81r4L57J75k7jj55j86R8J72l9K9J79j77n22J10P93
$$ 671 47 -681 -249 559 396 -285 -379 -22 153 126 125 -30 -216 -118 54 15 44 223 46 -476 -366 427
2376D27K09q35n15O20O46l23n54J01L87m4k08M5J39l3j35n4J24K49l1m50k43N36
$$ 427 636 -199 -714 -94 552 229 -325 -224 163 119 -89 -44 95 62 -73 -127 -3 246 215 -235 -478 58
2398E8N89l64q30L2Q16K36n91l13L58K27k77j41L16J76l24l43J77M80J12m35m35
$$ 58 647 283 -547 -515 301 537 -54 -367 -9 218 -59 -200 116 292 -32 -375 -198 282 394 -41 -476
2419d76K01O19J23n89l96L98M97j87m43P9L38r5l19J50M15n7n27j82M93M47k30
$$ -476 -275 344 467 -122 -518 -120 377 190 -253 -174 164 69 -250 -100 315 258 -269 -451 42 489 259
2440B59o04j24N16M22k51n21J1M13J38l22r2K93O3l60j69M43L58l72n78J17O93
$$ 259 -345 -469 47 469 218 -303 -292 121 259 -63 -155 138 201 -159 -328 115 473 101 -477 -360 333
2461C33K10n71m83K66N90pm63j79L26J85k58j71L05K39l56m25K88O26l1p07l23
$$ 333 543 -28 -511 -245 345 338 -125 -304 22 207 -51 -222 83 322 -34 -459 -171 455 424 -283 -606
2482f06N84N55k50o34l4M95K08l31k19K32J91k47k28K90L70j97n71l5O35L40m70
$$ -606 -22 533 283 -351 -385 110 318 -13 -232 0 191 -56 -284 6 376 179 -392 -427 208 548 78
2503G8n70J83O02J13m75k51K59K57j27k23J44K16j73l34J27M68R3n22l53L60N55
$$ 78 -492 -309 293 406 -69 -320 -61 196 69 -154 -10 206 33 -301 -174 294 387 -135 -488 -128 427
2524D27o8n67k24M15L46j85l26M2K45m6k21Q9K91l0m06j48M24L79k47n36m4N32
$$ 427 359 -208 -432 -17 329 144 -182 -140 105 59 -162 -73 218 188 -218 -366 58 437 190 -346 -390 142
2546A42K99l38m41J04M11L8k92o0K38J9k93k5L70J88l75m03K23N17N2m68k97K63
$$ 142 441 103 -338 -234 177 215 -77 -137 101 120 -173 -198 172 360 -15 -418 -195 322 374 -94 -391 -128
2568a28L84ll45j42K11J78j38j31J51J54k31k64K41M25j37n28r9M82L15k70l86
$$ -128 256 253 -92 -234 -23 155 17 -114 37 191 -40 -304 -63 362 225 -303 -402 80 395 125 -261
2589b61QK85J58q7j71n0R5N2p5RJ88%l37j51M19L55l19n33J55N37M5m12j76K26
$$ -261 -253 32 190 103 -68 -118 -23 29 -46 -37 151 151 -186 -337 82 437 118 -415 -260 277 322 -90 -266 -40
2613d0J74l8r9k0k6L3ppQ3J37j63l65Q3N72J77o46m03M67N19k63m27J32K80j25
$$ -40 134 96 -3 -23 -49 -16 -23 -30 53 190 27 -338 -255 317 494 -152 -555 -88 431 168 -259 -127 153 28
2637B8k00J46J90j22j71K8J17J02Mk16k17K76M57j90o62LO94K08n38k75L80J29
$$ 28 -172 -26 164 42 -129 -101 16 118 122 -94 -311 -35 422 232 -430 -427 267 475 -63 -338 42 171
2659A71l20j6M28N3m81j96L02K74Nj53k24j13K81L54k53m69K06N29j56n98J51
$$ 171 -149 -165 263 316 -165 -361 -59 215 220 67 -157 -270 11 365 112 -357 -151 378 222 -376 -225
2680b25N64j10n25J51N11j90n95J00O06J10l89k76RJ60L04J53l76l73K86L51k58
$$ -225 339 229 -296 -145 366 176 -419 -319 287 397 8 -268 -259 -99 205 358 -18 -391 -105 246 -12
2701a2k73M54K90o39m68O57O24n30o30L91N66k87m97J71L67oj00l3k04r1L33K19
$$ -12 -285 169 459 -180 -648 9 633 103 -527 -136 430 143 -354 -183 184 178 78 45 -159 -250 83 302
2723C02k91j53L18o7n94J55R38Q6j059m04Q35M85n38k88M20Q9m63o4M39N8k32
$$ 302 11 -142 176 109 -485 -330 608 694 -365 -769 66 551 13 -275 145 234 -229 -293 146 204 -28
2744b8L3M2k27K5L47o7m22K33N66l83q43L03J031k2q98j16N61m1m16L30N31l55
$$ -28 5 47 -180 -155 192 125 -297 -64 502 119 -724 -421 610 588 -310 -426 135 94 -322 8 539 184
2766A84o35J09M22N7J4J09l15m09L49N63l28n30M42N40n75o91N74P19l96n88M00
$$ 184 -451 -342 80 137 151 260 -55 -464 -115 448 120 -410 32 572 -3 -694 -120 599 203 -385 15
2787A5L66n34m01O29M93l72l99K8l4pN08K87o22n37M58M41m19j79O63R4r18k73
$$ 15 381 -153 -554 75 568 196 -203 -175 -209 -216 292 579 -43 -580 -122 319 -100 -279 384 478 -440 -713
2809g13R09M02p16k91N95J14n95q0N26P7k49J07L8m88r7P25K95n94k72M31p9n36
$$ -713 196 598 -118 -409 186 300 -295 -375 151 228 -21 86 124 -364 -461 264 559 -35 -307 124 45 -491
2831d91L31R45k55j083r4Q50J86m56O3L08l53l71L71L53k75j15L47j36n59J63
$$ -491 -160 785 530 -553 -647 203 389 -67 -4 304 -49 -420 -49 304 29 -86 261 125 -434 -271
2851b71O76j46n71K82N28n45p20N79R49l31q01N8L79j79q3N10J32o17k77L69J31
$$ -271 405 259 -312 -30 498 -47 -767 -188 761 430 -371 -313 66 -113 -196 314 446 -171 -448 -79 52
2872E2j22L02K14o43m78O35N94n17m78N71L80p13m60O92N18m59l39L30M0m34P6
$$ 52 -70 232 446 -197 -675 -40 554 37 -441 130 510 -203 -663 29 547 88 -251 79 119 -315 -239
2893b39N51K5l68m4L7k98J21P36Q6q96l53P06L33n30p1O11n2p98o8P49J95n03
$$ -239 312 337 -31 -75 -38 -336 -215 521 607 -289 -642 64 397 -133 -204 407 355 -443 -511 238 433 -70
2915g0j03L07j17k58J62K07j29L6K44k75n85K85Q09p3p34j3N08j86m96M38P08
$$ -70 -173 134 17 -241 -79 128 -1 35 279 4 -581 -296 513 440 -294 -307 201 15 -481 -43 665
2936F65l67q61P6O68J17k78oM1k08%K67m3j87K32J88m16l50M90M39m18m17M83
$$ 665 298 -563 -487 181 298 20 14 55 -153 -153 114 71 -116 116 304 -112 -462 28 467 49 -368 115
2958A15L49o17m47O13O16l75n85R4K69m5M5K01j10k83MJ41m8O1L21r9n93n0O47
$$ 115 464 -153 -600 13 629 254 -331 -237 32 -13 32 233 123 -160 -156 -15 -63 -2 319 220 -373 -423 224
2981B24K14n89k10N39J81n75k12N02K57l18j88J77K1j63O2K03l1n2j0j73j78L29
$$ 224 438 -151 -361 178 359 -216 -428 74 331 13 -175 2 23 -140 -78 125 94 42 32 -141 -319 10
3003A0M77k47o29N3N64K5m32N1M04j09m68P2M63L7l42q1J87K9n8j4k0j2J99N4
$$ 10 487 240 -389 -336 228 253 -179 -128 276 167 -301 -229 234 271 -71 -152 35 64 6 -8 -28 -40 159 213
3027B13l36k28L56L79k71l66J73K72k38k27L34L24l14m25J41L82L5k02p9%K9R2
$$ 213 -123 -351 5 384 113 -253 -80 192 -46 -273 61 385 71 -354 -213 169 204 2 -77 -77 -48 44
3049D4M1j50l3J93K9k51o0K92Q8l11p2L22J12l65j78L32K67j90k52nJ36Q1L6l6
$$ 44 85 -65 -98 95 124 -127 -187 105 193 -118 -190 132 244 -121 -299 33 300 110 -142 -147 -11 70 106 70
3073G0j06l0R0Nq7Q9J37j31k64J07L53j8l70p5L05J28k09j64J27J41n1q5oK5K1
$$ 70 -36 -66 24 29 -58 31 168 37 -227 -120 233 215 -155 -230 75 203 -6 -170 -43 98 47 -38 -44 -19 2
3098BJ1m5NJ06Mk06q0K63K24k38l04Q7L31K5k72m5J71N1j20m7J04O1p6r8J3J58
$$ 2 13 -32 -27 79 83 -123 -203 60 284 46 -258 -171 160 185 -87 -132 39 90 -30 -77 27 88 12 -86 -73 85
3124H5N5j29j85R6K50K3l12j15K53J87j36k14O7J88n9j47M3J67rj92p9J83J80
$$ 85 140 11 -174 -78 172 195 -117 -232 21 208 72 -142 -75 113 54 -93 -50 117 108 -84 -163 20 200
3147B00r9k48m5K55J65j68k66P7K54K2k17o0J96P1j96q7J86J51j66k31P9K87N3
$$ 200 101 -147 -192 63 228 60 -206 -129 125 147 -70 -130 66 137 -59 -146 40 191 25 -206 -127 160 213
3170B13k82j73J83K49n1k53n2K29Q9j82j00J55J29j44j99J17K70m0l01j01K78
$$ 213 -69 -242 -59 190 139 -114 -166 63 152 -30 -130 25 154 10 -189 -72 198 158 -143 -244 34
3191C4K19j82k72M3K75O2k21j24J63J40j24j66J14J99o5k59k2K94J36k58k43J41
$$ 34 253 71 -201 -158 117 179 -42 -166 -3 137 13 -153 -39 160 95 -164 -186 108 244 -14 -257 -116
3213a16L14k1k73j08K39J29j35j74J12J61p1j87K1K36N2k52j68K09K58q3l25k8
$$ -116 198 177 -96 -204 35 164 29 -145 -33 128 57 -130 -109 127 179 -73 -241 -32 226 143 -182 -210
3235b10K97J17j98j77J32J85q5j79M8J92k6k04n4K15J45j42k44N3K69Q4k61j83
$$ -210 87 204 6 -171 -39 146 61 -118 -70 122 96 -108 -162 53 198 56 -188 -135 134 218 -43 -226
3257b26J68K43r5k23L3K06j1k06pK17N7k16j29J55K14o1k17o2J61J61p8j95qJ90
$$ -226 -58 185 90 -133 -100 106 95 -111 -118 99 156 -60 -189 -34 180 119 -98 -160 1 162 84 -111 -119 71
3281G1P4j80j03J60J09j57j34J74J73j38k40P8K49K4j66j17N1J11N0n7r6mJ26
$$ 71 145 -35 -138 22 131 -26 -160 14 187 49 -191 -113 136 160 -6 -123 -72 39 89 32 -64 -68 58
3304E8oj43J0J88%k15n7K44J05k44j42K14J85j52k01N8J43L7l6m1p6J0R9K2j02
$$ 58 52 -91 -81 107 107 -108 -165 79 184 -60 -202 12 197 45 -156 -98 45 82 46 5 -71 -61 38 60 -42
3329d2M9J31j09k46J08L49l8l53o6L02R9k27p6J74P7j46o1O8J9nP3n0j03N4J15
$$ -42 7 138 29 -217 -109 240 202 -151 -217 85 184 -43 -119 55 132 -14 -75 -7 12 7 80 30 -73 -19 96
3354I6j27j38K18K44k52l83J72M19l9l47J1K22q2j81J32K11r6j75J9K6oJ28P8
$$ 96 -31 -169 49 293 41 -342 -170 249 210 -137 -126 96 14 -167 -35 176 80 -95 -76 -50 -56 72 150
3377A50j90j54K15J79k90j93L62K91l64l68K63L29j72k01J94J45k73j78K36K06
$$ 150 -40 -194 21 200 -90 -283 79 370 6 -362 -99 230 58 -143 51 196 -77 -255 -19 187
3397A87o5q1o6j66K2L41J08l51j50L34P9m06m3N14J22n36k10M18J86l34q5L44
$$ 187 122 41 -25 -191 -169 172 280 -71 -221 113 192 -214 -257 257 379 -157 -367 51 237 -97 -182 162
3419A62O4l44j15J84Q8M8J12j47l60N3M36L3l45N5L39k33n01K62O75j00o55l2
$$ 162 226 -118 -233 -49 39 87 199 52 -308 -255 181 214 -131 -76 263 30 -471 -209 466 366 -289 -321
3441c21M83j6l32J22L16j20k77M1Q2n1J41K32k32l75J78L47k12k56M29L07n68
$$ -321 162 146 -186 -64 252 132 -145 -104 -22 -73 68 300 68 -307 -129 218 6 -250 179 486 -82
3462h2n50M88O59k51n09J68K55k99j71L93K53k92k15Q1l6n6L22J91l89k95L51
$$ -82 -632 -144 515 264 -245 -77 178 -121 -292 101 354 62 -153 -72 -108 -164 158 349 -40 -335 16
3483A6J93m26q8O41J61p41l42N83L45l67j18L61n4n08kN12J08k36ql2k96K8N44
$$ 16 209 -217 -305 336 497 -244 -586 -3 342 -25 -143 218 164 -344 -346 166 274 38 30 -2 -298 -270 274
3506B74J22n04j48M23n6m97K03P09j10p60k3N29rl56K28L91l18m68J69L22p9M7
$$ 274 396 -108 -256 167 111 -386 -183 526 416 -344 -367 162 153 -203 25 416 98 -370 -201 121 42 89
3528H9K36k40n52J29O38Om53J11L17l94m46M98O57l48o11J57L54k39j62M24J84
$$ 89 325 85 -467 -338 300 306 -147 -36 281 -113 -559 -61 596 248 -363 -206 148 -91 -253 171 355
3549C55m33k07K80Ok08L03L52l91n34K85M78k68k29M64J83p06l58O53M94l86l12
$$ 355 -78 -285 -5 1 -207 96 448 57 -477 -192 286 18 -211 253 436 -270 -628 25 519 133 -179
3570a79K39j7l66J58N23p6m16M3J83k75q5N55K05o12l03M90J69m66J9O25k6p24
$$ -179 60 43 -323 -165 358 282 -134 -91 92 -183 -268 287 492 -120 -423 67 236 -230 -211 414 388 -336
3592c36j41N70J31k83R3K13l33l44L44L66k05j53K55j30n03J65P10j0o62m7N00
$$ -336 -477 93 224 -59 34 247 -86 -430 -86 280 75 -78 177 47 -456 -291 419 409 -253 -300 200
3613B00j13m54K40N92k02n84P2L58q4j26K78Q5m10j30L22L2k03K35L10m43n52
$$ 200 87 -367 -127 465 263 -321 -249 109 25 -101 177 262 -148 -278 44 76 -127 108 418 -25 -577
3634e77M05O43k26n18K30L30l87l29M60M43l53l91J70J58j41N0K53j26k65J33
$$ -577 -172 471 245 -273 -43 287 -100 -429 31 474 121 -270 -100 58 -83 -33 220 94 -171 -38
3654c8J51k79q6N11J93n93l53N09L08m09j55M59J06n87j96N25K86k72j88P4n3
$$ -38 113 -166 -252 259 452 -141 -494 15 323 -86 -241 218 324 -263 -459 66 352 80 -108 -34 -87
$$ [...]
8191C8
##END NTUPLES=NMR FID
##END=
