##TITLE=1H_LY-THF
 CDCl3, 8 sc, 
 20.10.2020
##JCAMPDX= 6.0         $$ Bruker NMR JCAMP-DX V2.0
##DATA TYPE= NMR FID
##DATA CLASS= NTUPLES
##ORIGIN= UXNMR, Bruker Analytische Messtechnik GmbH
##OWNER= root
$$ XWIN-NMR		Version 3.5
$$ Tue Oct 20 13:49:55 2020 Russian Standard Time (UT+4h)  she@DPX200
##.OBSERVE FREQUENCY= 200.1315066352
##.OBSERVE NUCLEUS= ^1H
##.DELAY= (6, 6)
##.ACQUISITION MODE= SIMULTANEOUS
##.ACQUISITION SCHEME= undefined
##.AVERAGES= 8
##.DIGITISER RES= 18
##SPECTROMETER/DATA SYSTEM= spect
##.PULSE SEQUENCE= zg30
##.SOLVENT NAME= CDCl3
##.SHIFT REFERENCE= (INTERNAL, CDCl3, 0, 15.7039)
##AUDIT TRAIL= $$ (NUMBER, WHEN, WHO, WHERE, WHAT)
$$ ##TITLE= Audit trail, XWIN-NMR		Version 3.5
$$ ##JCAMPDX= 5.01
$$ ##ORIGIN= Bruker BioSpin GmbH
$$ ##OWNER= she
$$ F:/spectra/data/she/nmr/H-F/1/audita.txt
$$ ##AUDIT TRAIL=  $$ (NUMBER, WHEN, WHO, WHERE, WHAT)
(   1,<2020-10-20 13:47:58.48 +0400>,<she>,<DPX200>,
      <created by zg, POWCHK disabled, PULCHK disabled
       configuration hash MD5:
       00 E9 B6 7A A2 85 ED C7 34 08 36 98 17 FE 4E 26
       data hash MD5: 16K
       6C 42 1F CF 95 72 A0 EF 03 0F B2 8D D1 83 1A C1>)
$$ ##END=
$$ 
$$ hash MD5
$$ AC 41 B5 A7 AD 11 3F B6 A1 51 4A F5 91 A0 7E E9
##$RELAX= 
##$RELAX= 
##$RELAX= 
##$RELAX= 
##$RELAX= 
##$RELAX= 
$$ Bruker specific parameters
$$ --------------------------
##$DU= <F:/spectra>
##$EXPNO= 1
##$NAME= <H-F>
##$PROCNO= 1
##$TYPE= <nmr>
##$USER= <she>
##$AMP= (0..31)
100 100 100 100 100 100 100 100 100 100 100 100 100 100 100 100 100 100 
100 100 100 100 100 100 100 100 100 100 100 100 100 100 
##$AQSEQ= 0
##$AQ_mod= 1
##$AUNM= <au_zg>
##$AUTOPOS= <>
##$BF1= 200.13
##$BF2= 200.13
##$BF3= 200.13
##$BF4= 200.13
##$BF5= 200.13
##$BF6= 200.13
##$BF7= 200.13
##$BF8= 200.13
##$BYTORDA= 1
##$CFDGTYP= 0
##$CFRGTYP= 5
##$CHEMSTR= <none>
##$CNST= (0..31)
1 1 145 1 1 1 1 1 1 1 1 1 1 1 1 1 1 1 1 1 1 1 1 1 1 1 1 1 1 1 1 1 
##$CPDPRG= <>
##$CPDPRG1= <>
##$CPDPRG2= <>
##$CPDPRG3= <>
##$CPDPRG4= <mlev>
##$CPDPRG5= <mlev>
##$CPDPRG6= <mlev>
##$CPDPRG7= <mlev>
##$CPDPRG8= <mlev>
##$CPDPRGB= <>
##$CPDPRGT= <>
##$D= (0..31)
0 1.2 0 0 0 0 0 0 0 0.06 0 0.03 0 0 0 0 0.0002 0 0 0 0 0 0 0 0 0 0 0 0 
0 0 0 
##$DATE= 1603187277
##$DBL= (0..7)
120 120 120 120 120 120 120 120 
##$DBP= (0..7)
150 150 150 150 150 150 150 150 
##$DBP07= 0
##$DBPNAM0= <>
##$DBPNAM1= <>
##$DBPNAM2= <>
##$DBPNAM3= <>
##$DBPNAM4= <>
##$DBPNAM5= <>
##$DBPNAM6= <>
##$DBPNAM7= <>
##$DBPOAL= (0..7)
0.5 0.5 0.5 0.5 0.5 0.5 0.5 0.5 
##$DBPOFFS= (0..7)
0 0 0 0 0 0 0 0 
##$DE= 6
##$DECBNUC= <off>
##$DECIM= 32
##$DECNUC= <off>
##$DECSTAT= 4
##$DIGMOD= 1
##$DIGTYP= 9
##$DL= (0..7)
0 120 120 120 120 120 120 120 
##$DP= (0..7)
150 150 150 150 150 150 150 150 
##$DP07= 0
##$DPNAME0= <>
##$DPNAME1= <>
##$DPNAME2= <>
##$DPNAME3= <>
##$DPNAME4= <>
##$DPNAME5= <>
##$DPNAME6= <>
##$DPNAME7= <>
##$DPOAL= (0..7)
0.5 0.5 0.5 0.5 0.5 0.5 0.5 0.5 
##$DPOFFS= (0..7)
0 0 0 0 0 0 0 0 
##$DQDMODE= 0
##$DR= 18
##$DS= 0
##$DSLIST= <SSSSSSSSSSSSSSS>
$$ [...]
##$SUBNAM2= <"">
##$SUBNAM3= <"">
##$SUBNAM4= <"">
##$SUBNAM5= <"">
##$SUBNAM6= <"">
##$SUBNAM7= <"">
##$SUBNAM8= <"">
##$SUBNAM9= <"">
##$SW= 16.880792210976
##$SWIBOX= (0..15)
0 0 2 0 0 0 0 0 0 0 0 0 0 0 0 0 
##$SW_h= 3378.37837837838
##$TD= 16384
##$TD0= 1
##$TE= 0
##$TE2= 300
##$TE3= 300
##$TEG= 300
##$TL= (0..7)
0 120 120 120 120 120 120 120 
##$TP= (0..7)
150 150 150 150 150 150 150 150 
##$TP07= 0
##$TPNAME0= <>
##$TPNAME1= <>
##$TPNAME2= <>
##$TPNAME3= <>
##$TPNAME4= <>
##$TPNAME5= <>
##$TPNAME6= <>
##$TPNAME7= <>
##$TPOAL= (0..7)
0.5 0.5 0.5 0.5 0.5 0.5 0.5 0.5 
##$TPOFFS= (0..7)
0 0 0 0 0 0 0 0 
##$TUNHIN= 0
##$TUNHOUT= 0
##$TUNXOUT= 0
##$USERA1= <user>
##$USERA2= <user>
##$USERA3= <user>
##$USERA4= <user>
##$USERA5= <user>
##$V9= 5
##$VALIST= <valist>
##$VCLIST= <CCCCCCCCCCCCCCC>
##$VD= 0
##$VDLIST= <DDDDDDDDDDDDDDD>
##$VPLIST= <PPPPPPPPPPPPPPP>
##$VTLIST= <TTTTTTTTTTTTTTT>
##$WBST= 1024
##$WBSW= 4
##$XGAIN= (0..3)
0 0 0 0 
##$XL= 0
##$YL= 0
##$YMAX_a= 453538
##$YMIN_a= -447163
##$ZGOPTNS= <>
##$ZL1= 120
##$ZL2= 120
##$ZL3= 120
##$ZL4= 120
##$ABSF1= 10
##$ABSF2= 0
##$ABSG= 5
##$ABSL= 3
##$ALPHA= 0
##$AQORDER= 0
##$ASSFAC= 0
##$ASSFACI= 0
##$ASSFACX= 0
##$ASSWID= 0
##$AUNMP= <proc_1d>
##$AZFE= 0.1
##$AZFW= 0.1
##$BCFW= 1
##$BC_mod= 2
##$BYTORDP= 1
##$COROFFS= 0
##$CY= 11.3945322036743
##$DATMOD= 1
##$DC= 2
##$DFILT= <>
##$DTYPP= 0
##$F1P= 16.9975609425685
##$F2P= -3.02152046262296
##$FCOR= 0.5
##$FTSIZE= 0
##$FT_mod= 4
##$GAMMA= 1
##$GB= 0.15
##$INTBC= 1
##$INTSCL= 1
##$ISEN= 128
##$LB= 0.24
##$LEV0= 0
##$LPBIN= 0
##$MAXI= 10000
##$MC2= 0
##$MEAN= 0
##$ME_mod= 0
##$MI= 1.114404
##$NCOEF= 0
##$NC_proc= 0
##$NLEV= 6
##$NOISF1= 3.799351
##$NOISF2= 2.8
##$NSP= 1
##$NTH_PI= 0
##$NZP= 0
##$OFFSET= 15.70392
##$PC= 1
##$PHC0= -10685.59
##$PHC1= 7.600891
##$PH_mod= 1
##$PKNL= yes
##$PPARMOD= 0
##$PSCAL= 0
##$PSIGN= 0
##$REVERSE= no
##$SF= 200.130013532006
##$SI= 16384
##$SIGF1= 3
##$SIGF2= 2
##$SINO= 400
##$SIOLD= 16384
##$SREGLST= <1H.CDCl3>
##$SSB= 0
##$STSI= 0
##$STSR= 0
##$SW_p= 3612.71676300578
##$SYMM= 0
##$S_DEV= 0
##$TDeff= 0
##$TDoff= 0
##$TI= <>
##$TILT= no
##$TM1= 0
##$TM2= 0
##$TOPLEV= 0
##$USERP1= <user>
##$USERP2= <user>
##$USERP3= <user>
##$USERP4= <user>
##$USERP5= <user>
##$WDW= 1
##$XDIM= 8192
##$YMAX_p= 0
##$YMIN_p= 0
$$ End of Bruker specific parameters
$$ ---------------------------------
##NTUPLES= NMR FID
##VAR_NAME=  TIME,          FID/REAL,        FID/IMAG
##SYMBOL=    X,             R,               I
##VAR_TYPE=  INDEPENDENT,   DEPENDENT,       DEPENDENT
##VAR_FORM=  AFFN,          ASDF,            ASDF
##VAR_DIM=   8192,          8192,            8192
##UNITS=     SECONDS,       ARBITRARY UNITS, ARBITRARY UNITS
##FACTOR=    0.000296,      1,               1
##FIRST=     0,             0,               0
##LAST=      2.424536,      0,               0
##MIN=       0,             -447163,         0
##MAX=       2.424536,      453538,          0
$$ Real data points
##PAGE= N=1
##DATA TABLE= (X++(R..R)), XYDATA
0 0 0 0 0 0 0 0 0 0 0 0 0 -8 8 -8 8 -9 14 -16 19 -24 25 -32 41 -48 56 -65 78 -89 103 -119 136 -155 176 -200
34 -200 227 -255 286 -323 361 -403 449 -501 557 -615 680 -755 832 -916 1011 -1115 1227 -1352
52 -1352 1490 -1645 1813 -2004 2221 -2469 2752 -3084 3480 -3956 4545 -5292 6282 -7652 9686
67 9686 -13029 19649 -62333 344214 356761 -311209 -381724 185886 442389 -119495 -447163
78 -447163 33487 440610 52120 -395683 -135036 365367 195561 -307670 -236756 256548
88 256548 261335 -193380 -280530 139512 291319 -83598 -285824 48718 277834 -1861 -259246
99 -259246 -23557 257247 58155 -243405 -83783 229428 114786 -216655 -141093 201398
109 201398 167483 -180357 -198197 157367 234024 -123700 -254676 83106 273251 -33626
119 -33626 -288029 -18167 286770 64321 -279540 -126556 251010 176263 -221508 -219813 173651
130 173651 246947 -120697 -269504 63045 278226 -9891 -277764 -50800 252090 95168
140 95168 -226637 -142125 186424 168912 -151217 -189561 108137 200142 -60421 -201542 20362
151 20362 195306 12302 -178298 -40487 157042 64341 -140993 -83540 121496 95106 -95889
162 -95889 -98998 78411 108663 -57600 -104787 48542 109746 -28186 -108324 13652 109238
173 109238 1148 -104291 -12806 100510 29243 -93023 -41081 90994 59756 -75730 -66773
184 -66773 63832 77711 -45966 -84303 30685 87479 -17652 -88678 -2780 81560 20221
195 20221 -75569 -33294 65674 39828 -52670 -46345 37996 50877 -28692 -55849 12828 46379
207 46379 -6933 -44089 -5941 33700 6871 -31104 -11836 24155 12814 -17113 -12737 9052
219 9052 9701 -6820 -9169 3901 2809 -6062 -2419 1338 -1304 508 4289 2981 -5202 -4681 11535
234 11535 10593 -11324 -8704 14239 12458 -13620 -19137 14999 28994 -13580 -33186 12353 39999
247 39999 -782 -42048 -3473 54780 15516 -56096 -23651 55983 40660 -49649 -57293 43682
259 43682 68982 -35761 -77050 21639 86738 52 -92738 -18246 95181 36708 -87402
270 -87402 -55035 74464 71061 -65406 -89941 48055 96111 -32378 -103584 7602 103256
281 103256 11456 -102747 -28114 96349 41231 -88909 -58385 75321 69146 -67438 -81640
292 -81640 52051 82687 -43365 -89162 30221 94416 -17903 -99434 6517 103341 6974
303 6974 -103146 -20449 103428 36088 -105068 -54770 103454 73369 -95335 -91199 83653
314 83653 113431 -64123 -127471 49291 145042 -22237 -151573 -6176 157235 40676 -153941
325 -153941 -70884 144332 100042 -125427 -125558 103750 152722 -72070 -167023 42008 177124
336 177124 -3786 -174926 -31480 168340 62603 -156310 -92173 134622 114925 -110443
346 -110443 -134952 82040 145011 -54588 -148751 27982 147720 -3807 -145818 -20918
356 -20918 135360 38124 -127484 -58340 111941 68827 -104005 -82156 91229 92403 -79254
367 -79254 -104185 64983 114005 -51336 -123551 34848 129410 -18724 -138905 -4580 143441
378 143441 27443 -144582 -52603 139741 80322 -127513 -104370 115882 131147 -93610 -150435
389 -150435 67007 167000 -33044 -175174 -676 177395 35478 -169057 -66421 157451
399 157451 100938 -133138 -124463 109017 146368 -76145 -155296 45117 159798 -13007 -158720
410 -158720 -17401 151090 44549 -136623 -67039 118456 86081 -97269 -98255 79148 106982
421 106982 -60423 -111972 38576 111770 -21132 -113743 2214 108570 7705 -106035
431 -106035 -22307 99554 36431 -95892 -51272 89847 61263 -82304 -73186 68682 82887
442 82887 -59901 -98447 44632 105057 -29864 -110779 8770 112416 12687 -111942 -31169
453 -31169 109235 50370 -98732 -69017 83700 86247 -66586 -99290 48167 105881 -27037
464 -27037 -107057 6390 109298 18271 -102505 -34364 95151 52876 -78463 -64438 64408
475 64408 75812 -48851 -81504 33958 84692 -15449 -81367 316 79467 15153 -71598
486 -71598 -22950 66087 32578 -55872 -40792 45502 46347 -37536 -50441 26910 48955 -18947
498 -18947 -49844 9292 49930 -1777 -49073 -5277 44239 11019 -40675 -18910 33907 21187
510 21187 -33348 -27485 25572 27746 -20240 -30930 11888 30959 -7632 -30633 3497 27933
522 27933 1157 -26489 -7522 22524 9031 -19836 -11132 14322 10977 -11079 -11099 9783 12537
535 12537 -5566 -9223 4801 9226 -1397 -5803 2392 4993 -2256 -4150 3062 4045 -1561 -1231 4262
550 4262 2172 -3512 188 7409 2677 -5797 -1726 7678 2675 -9465 -2924 10995 4341 -12652
564 -12652 -7325 13653 10874 -13850 -12947 14941 16813 -14423 -22044 12208 27062 -10308 -33887
577 -33887 2870 34843 772 -39635 -10170 40302 18168 -41953 -28580 38468 37470 -32815
589 -32815 -46944 23479 53047 -16424 -60917 4185 61830 7036 -63977 -22460 60809 34871
601 34871 -55051 -45037 48194 54749 -37162 -62788 26153 69675 -13479 -72623 611 71011
613 71011 12563 -67757 -24305 65893 36351 -59429 -43021 53146 53807 -41070 -59108 33697
625 33697 65508 -24627 -67826 15979 70401 -4073 -72037 -6331 74076 17880 -70951 -25767
637 -25767 68681 38457 -63703 -50295 59371 61320 -52374 -71663 39611 78283 -27736
648 -27736 -87506 13220 93016 1327 -95599 -18777 93462 37405 -89305 -56067 80660
659 80660 69771 -71707 -85397 54229 95314 -38141 -106584 17253 109826 1410 -108693
670 -108693 -21500 103815 41413 -96603 -59713 85813 73517 -72033 -85459 53530 93048
681 93048 -36441 -98368 20256 100659 -2731 -97214 -12683 94508 30605 -86544 -42245
692 -42245 79821 53196 -69708 -62177 59457 71880 -47798 -78762 37791 84735 -23452
703 -23452 -85260 12284 90048 2766 -90166 -15104 90361 29683 -85945 -44821 78907
714 78907 58459 -71520 -71242 61003 82750 -47024 -92089 30762 99293 -12603 -102226
725 -102226 -6199 100022 22678 -97098 -42510 87709 57522 -78398 -72899 62113 82582
736 82582 -46142 -90087 28759 93225 -11851 -94370 -6846 90396 22230 -85265 -38188
747 -38188 74255 48545 -64510 -58679 52578 65926 -40523 -70112 28166 73407 -14629
758 -14629 -72486 3496 70967 6954 -68221 -16443 64378 26215 -58796 -34030 53370 42551
770 42551 -44957 -46092 39445 52989 -29292 -56256 21471 60536 -10905 -61218 1448 60643
782 60643 8956 -58090 -18389 56030 28642 -50120 -36060 43955 44303 -34162 -49819 24395
794 24395 53181 -15968 -55772 5225 53999 4283 -52957 -16055 48342 23147 -42865 -29193
806 -29193 35253 33822 -28166 -39569 18814 40078 -12850 -40556 2800 36400 2742 -35375
818 -35375 -9441 31948 12943 -27610 -16210 21787 19467 -16458 -21276 12312 20565 -9830 -19875
831 -19875 5211 18795 -1147 -18195 -993 17104 3500 -12888 -3120 11854 6260 -9339
843 -9339 -6363 9024 7073 -6310 -5926 4154 5701 -1843 -4451 2658 4994 -1191 -1907 1817 1568
858 1568 153 792 1371 -582 -3464 1026 4963 -2128 -6056 1654 6755 -556 -9220 -1531 11432
873 11432 3524 -12263 -5524 10920 7712 -11207 -12194 9432 13363 -10620 -17079 6068 17705
886 17705 -3413 -20268 -421 20954 2407 -21495 -5890 20556 9161 -21176 -14624 19020
898 19020 16277 -18253 -19870 15128 22618 -12757 -26265 10358 29965 -5441 -31136 1504 32893
911 32893 4387 -33903 -9700 34759 15731 -33538 -22272 31758 30021 -26649 -34614 22985
923 22985 41504 -15045 -44542 8921 49161 1200 -50110 -10554 49720 20699 -46936 -29625
935 -29625 42856 38676 -35871 -45803 28525 52994 -17948 -56284 7536 57772 2952 -57638
947 -57638 -13989 54378 22719 -51496 -33114 44106 39860 -36838 -45976 27883 49376 -20097
959 -20097 -52723 11022 53158 -3275 -54057 -6753 50681 13499 -49590 -21332 45716 26721
971 26721 -42542 -33576 37553 40213 -32218 -45512 26587 49673 -19783 -53861 11501 57325
983 57325 -2914 -60714 -6836 61385 17754 -58705 -27926 56250 40098 -50285 -48710 43948
995 43948 58488 -32422 -65334 20322 70996 -6844 -72487 -5257 72016 19631 -66791 -32437
1007 -32437 61696 45784 -52085 -53713 41680 60553 -28809 -65208 16077 67024 -4754 -66821
1019 -66821 -7785 62953 18994 -57468 -28839 51446 36046 -45078 -41570 36639 45689 -29023
1031 -29023 -50641 19464 51399 -13841 -53210 5796 51999 1245 -52640 -9875 51957 16763
1043 16763 -50238 -24151 45874 30923 -41882 -39095 36095 45060 -30556 -51060 21395 54749
1055 54749 -10978 -57241 1153 59007 9565 -56872 -18910 53516 30204 -46998 -39679 40058
1067 40058 46709 -30769 -50874 20921 54805 -8877 -55360 -299 55767 11397 -50742 -19534
1079 -19534 45586 27983 -39151 -33688 32790 37913 -25253 -40579 17120 42227 -9073 -41692
1091 -41692 3137 40688 3084 -38162 -8937 35667 14002 -33329 -19267 28571 21693 -25338
1103 -25338 -25454 20382 27650 -16753 -30326 11483 31771 -6370 -33021 415 31748 3969
1115 3969 -31863 -10284 29177 14038 -27545 -19922 22399 23394 -17810 -26149 12788 27571 -7245
1128 -7245 -28130 1800 27895 3704 -25879 -8764 22690 12133 -18945 -14667 15567 16857
1140 16857 -10865 -16859 7988 18076 -3179 -15936 996 15037 1803 -12735 -2943 11661
1152 11661 4748 -9907 -5182 8807 6092 -6007 -5320 5781 6248 -4357 -5805 4303 6219 -2964
1166 -2964 -6258 947 5694 -653 -5824 -383 4594 635 -4205 -1958 2813 2822 -1816 -2600 -116 520
1182 520 568 -619 -2943 -1435 1810 1937 -2406 -5554 916 7212 389 -8654 -2852 8429 5888 -8854
1198 -8854 -9443 7946 11351 -6700 -14493 2989 16575 964 -17776 -4662 17662 8841 -15658
1211 -15658 -12067 14343 16950 -11080 -19542 7963 20953 -3141 -21331 -980 21752 5327
1223 5327 -20681 -7479 19971 11542 -16235 -13774 15256 16829 -12288 -17271 10725 18165 -8171
1236 -8171 -19908 5318 21337 -2966 -22173 683 23130 2359 -23150 -5933 24364 9740
1248 9740 -25136 -14738 23483 18498 -21786 -24546 17876 29045 -14804 -33789 9266 36384
1260 36384 -2488 -38914 -5799 39220 13221 -38408 -21329 34222 27688 -30076 -35723 22909
1272 22909 40368 -15584 -43632 6863 44461 2337 -43729 -10345 42148 18372 -38011 -25087
1284 -25087 32180 30561 -26034 -34477 19237 36836 -12685 -37612 6727 38455 646 -36682
1296 -36682 -5211 35861 10534 -33043 -14341 31112 18517 -28425 -22346 26113 26686 -22696
1308 -22696 -29560 19529 33442 -14492 -36295 10388 39950 -4265 -42046 -2776 42855 9925
1320 9925 -42715 -18506 40253 25667 -37132 -33513 31634 40214 -24261 -45788 15401 48726
1332 48726 -6598 -50612 -3816 49183 12428 -47473 -22648 41942 30203 -35855 -36998 27883
1344 27883 40869 -19978 -43714 11072 44619 -3083 -44313 -5296 41681 11640 -38499 -17821
1356 -17821 34090 22414 -29795 -26104 26065 29679 -20066 -30995 15827 33338 -10503 -33977
1368 -33977 6591 34692 -1744 -34618 -3597 34628 9508 -33118 -13942 32280 19504 -28181
1380 -28181 -23485 24897 29381 -20071 -32884 14567 35360 -8136 -36633 976 36944 5866
1392 5866 -36241 -12078 33987 18405 -29469 -23915 24403 27965 -19186 -31299 13034 31830
1404 31830 -7362 -32798 232 31667 4771 -30626 -9917 26756 13205 -23619 -17056 19806
1416 19806 19863 -17003 -22111 12269 22010 -8842 -23292 4381 23216 -1478 -23144 -1516 22387
1429 22387 5534 -20548 -8819 19126 11945 -17313 -14127 14791 16228 -11305 -18428 7888 20305
1442 20305 -4090 -19641 1069 19479 3448 -17521 -6365 16818 9575 -13743 -11291 10833
1454 10833 12796 -7022 -13576 4326 13588 -1631 -12125 -52 10938 3108 -8956 -4150 7128
1467 7128 4192 -5239 -4269 3476 3568 -2986 -3691 1881 2437 -2026 -1652 1688 1039 -2393 -1421 2601 1336
1484 1336 -3512 -2510 2874 2163 -3389 -3567 2089 3729 -1927 -4544 830 4531 156 -3857 -1115
1499 -1115 2914 1223 -2453 -1373 1383 833 -519 -487 -169 -790 198 2560 806 -3573 -1572 4852
1515 4852 4113 -4485 -5359 4745 8243 -3087 -10107 1168 12056 1825 -12865 -4824 13517 8979
1529 8979 -11524 -11831 10421 15782 -7060 -18105 3442 19646 1252 -20154 -5917 19242 9904
1542 9904 -17351 -13710 14528 16929 -10984 -19263 7268 20422 -3159 -20755 -832 19372 4065
1555 4065 -18881 -7565 16754 9112 -15209 -11482 12525 12799 -10938 -14332 9251 14740 -7757
1568 -7757 -15678 5634 16388 -3868 -17984 1577 18464 208 -19609 -3006 20320 6654
1580 6654 -20455 -10202 20580 14288 -18736 -17987 16473 22118 -13000 -25928 9059 28969 -3847
1593 -3847 -30197 -2284 30782 8751 -29416 -14101 28076 20201 -23504 -24574 18971 28694 -13249
1606 -13249 -31463 7130 32422 -1061 -31744 -4979 30793 11043 -28088 -15651 24954 19671
1618 19671 -20315 -22597 15840 24796 -12108 -26410 7367 26324 -3401 -26506 -1380 25662
1630 25662 4530 -25238 -7863 23579 10379 -22584 -14549 20311 17322 -18866 -20827 15643
1642 15643 22522 -13029 -25481 8634 27771 -4587 -29450 81 29620 5416 -28883 -10905
1654 -10905 27351 16033 -25399 -20820 21725 25086 -16851 -28022 11422 30945 -5384 -31156
1666 -31156 291 31414 6195 -29725 -11602 27539 17007 -23739 -20440 19798 23647 -14968
1678 -14968 -25605 10580 27108 -5336 -27091 1028 26876 3916 -25241 -7495 23606 10863
1690 10863 -21706 -14162 19222 16721 -16037 -19336 12785 20888 -9516 -22101 6059 22849 -2312
1703 -2312 -23340 -1742 22621 5228 -21913 -9440 19678 11817 -17935 -15479 14879 17866 -11668
1716 -11668 -19666 7973 20587 -4215 -21259 291 20662 2928 -20042 -6552 18209 9394
1728 9394 -16342 -11945 13615 13996 -10774 -15096 8367 16314 -5528 -16185 2926 16478 28
1741 28 -16124 -2357 15315 4596 -14073 -6180 13183 8792 -11251 -10051 9899 11845 -7177
1754 -7177 -12361 5398 13261 -2910 -13792 485 13993 1763 -12937 -4382 11779 7070 -9969
1767 -9969 -8719 8593 9938 -6209 -10676 3367 11102 -1004 -11203 -1515 9524 2676 -8296
1780 -8296 -4857 6564 5969 -4902 -6683 2887 5844 -1099 -5317 -885 4107 1097 -3384 -1870 1760
1795 1760 1787 -492 -1816 -394 726 924 381 -887 -1528 886 2001 -584 -2422 -626 2806 1520
1811 1520 -3126 -2491 2876 3390 -1270 -3501 612 4481 215 -3931 -491 3635 1397 -2832 -2103 2279
1827 2279 2176 -1623 -1593 1497 981 -845 -387 1087 475 -1923 56 2836 -173 -3630 -363 4589
1843 4589 1425 -5527 -3181 5819 4752 -5870 -6583 4901 8530 -3453 -10705 1168 11834 738
1857 738 -12701 -4396 12129 7257 -11730 -10562 9693 12768 -7596 -15127 4110 16435 -542
1870 -542 -17080 -3009 16338 6104 -15139 -9407 13262 12170 -10850 -14280 7853 15511 -4662
1883 -4662 -15737 2013 15963 1091 -15196 -3184 14384 5602 -12849 -7420 11666 9013 -10052
1896 -10052 -9740 8803 11324 -7344 -11800 6386 12915 -4216 -13571 2733 14500 -862 -15001
1909 -15001 -1050 15613 3304 -16067 -6336 15648 9214 -14779 -11775 13575 14619 -11556 -17534
1922 -17534 8550 19451 -5553 -21486 1069 21885 2376 -22066 -7269 20927 10860 -19342
1934 -19342 -14944 16221 17964 -12829 -20720 8843 22325 -5027 -23100 193 22707 3737
1946 3737 -22021 -8239 20111 11600 -17669 -14387 15008 16759 -11573 -18421 8388 19837 -5232
1959 -5232 -19933 1853 19883 1343 -19112 -3927 18604 6640 -17217 -8777 16112 11925
1971 11925 -13720 -13700 12361 15354 -9715 -16585 7347 18080 -4179 -18933 1383 19633 1731
1984 1731 -18993 -4834 18639 8077 -17342 -11193 15855 13868 -13469 -16694 10247 18121 -7206
1997 -7206 -19799 3559 20263 -349 -20425 -3526 19498 7025 -18484 -10169 16166 12528
2009 12528 -14187 -15298 10836 16768 -8164 -18456 4706 18778 -1676 -18360 -1620 17762
2021 17762 4852 -16980 -7504 15245 9980 -13326 -11941 10630 13575 -8083 -14535 5730 15318
2034 15318 -2996 -15126 223 15133 2543 -14025 -4454 13104 6648 -11444 -8181 10083
2046 10083 9730 -8090 -10739 6406 11399 -4029 -11239 2353 11959 -334 -11438 -1033 11085
2059 11085 2860 -10065 -4466 9327 5535 -8434 -6476 7452 7651 -5965 -8519 4436 8918
2072 8918 -3116 -9210 1476 9071 -239 -9238 -1707 8712 2877 -8164 -4789 6841 5551 -6031
2086 -6031 -6500 4537 7392 -3300 -7698 1443 7703 49 -7624 -1572 6490 2644 -6079 -3758 4656
2101 4656 4548 -3398 -5113 2355 5038 -669 -4237 -186 3948 1194 -3084 -1699 2001 2004 -1015 -2151
2117 -2151 252 1928 910 -693 -1060 265 1603 748 -1305 -1381 1108 2206 -572 -2942 -249 3159
2133 3159 1570 -2956 -2455 2622 3527 -2050 -3936 1461 4561 -217 -4635 -1038 4441 1529 -4573
2148 -4573 -2699 3412 3000 -3024 -3784 2434 3741 -2033 -4084 1039 3563 -802 -3875 281 3565
2163 3565 -669 -4157 -105 3868 -183 -4262 -687 4717 888 -5108 -1233 5625 2409 -5813 -3829
2178 -3829 5695 4969 -5865 -6306 4932 7972 -3526 -9358 1966 10829 217 -11247 -1975 11509
2192 11509 4857 -10626 -7349 10184 9571 -8617 -11663 6282 13150 -3450 -14007 790 14517
2205 14517 2164 -14039 -4546 12984 7512 -11597 -9760 9470 11482 -7534 -12475 4818 13061
2218 13061 -2402 -13286 59 12953 2112 -12339 -4087 10864 5949 -10036 -7175 8650
2230 8650 7847 -7842 -9228 6305 9586 -5189 -10729 3918 11101 -2600 -11432 1031 11736
2243 11736 359 -12546 -2483 12596 4216 -12241 -6275 11644 8494 -10790 -10851 9454 12920
2256 12920 -7210 -14475 4822 15852 -1591 -16483 -1171 16900 4654 -15988 -7818 14829
2268 14829 11133 -12381 -13430 10266 15662 -6783 -16637 3672 17566 24 -17302 -3106 16369
2281 16369 6024 -14704 -8660 12879 10733 -10745 -12184 8342 13347 -5828 -13903 3506 13978
2294 13978 -1031 -13780 -1107 13111 2593 -12674 -4503 11490 5819 -10503 -7589 9185
2306 9185 8607 -8132 -9778 6726 10759 -5277 -11819 3425 12204 -1658 -12888 -396 12608
2319 12608 2304 -12800 -4723 12268 6947 -11247 -8891 9632 10586 -7726 -12182 5468 13240
2332 13240 -3002 -13630 616 14080 2179 -13124 -4329 12464 6641 -11011 -7971 9440
2344 9440 10206 -7172 -10972 5185 11864 -2749 -11519 1084 11370 1349 -10816 -3261 10411
2357 10411 4899 -9097 -5984 7610 7153 -5989 -8165 4757 8390 -3379 -8823 1536 8492
2370 8492 -19 -8540 -1366 8261 1943 -7669 -3204 6636 4512 -5809 -5419 4773 5595 -4309 -6220
2385 -6220 2541 6352 -1492 -6693 570 6336 509 -6328 -1536 5448 2274 -4858 -3172 4594 3463
2400 3463 -3830 -4078 2784 4444 -1840 -4703 1125 4680 -174 -4083 -178 3986 1061 -3834 -1616
2415 -1616 3478 1836 -2747 -2096 2468 2445 -1884 -2712 1741 3101 -598 -2812 304 2683 443 -2657
2431 -2657 -628 2237 1199 -1575 -1326 918 1757 -412 -1455 -36 1187 410 -768 -786 356 1067
2447 1067 247 -1193 -939 734 1220 -450 -1974 -366 1927 841 -2169 -1643 1968 2539 -1742 -3556
2463 -3556 886 3894 170 -4467 -1148 4019 2038 -3939 -3142 3518 3822 -2759 -4756 1743 5246
2478 5246 -668 -5237 -328 5169 1472 -4804 -2100 4573 3224 -3894 -3602 3152 4174 -2316 -4062
2493 -4062 2085 4358 -1086 -4090 1012 4631 -348 -4515 -42 4821 561 -4917 -943 5270 1761
2508 1761 -5193 -2513 5269 3812 -5070 -4938 4957 5962 -4287 -7279 2999 8186 -1825 -9196
2522 -9196 67 9399 1934 -9580 -4091 9170 6083 -8603 -7944 7138 9353 -5237 -10769 2943
2536 2943 11378 -650 -11426 -1607 11340 3625 -10450 -5978 9026 7687 -7505 -8832 5707
2549 5707 9637 -3926 -9997 1895 10150 26 -9913 -1196 9264 2823 -8430 -3882 7908
2562 7908 4983 -7039 -5635 6508 6348 -5580 -6961 4702 7761 -3934 -8337 3108 9017 -1811
2576 -1811 -9194 341 10231 1364 -10149 -2584 10204 4438 -9846 -6604 8863 8610 -7664 -10167
2590 -10167 5920 11378 -3536 -12357 1365 12995 1150 -13016 -3842 12028 6065 -10769 -8572
2603 -8572 9017 10081 -7305 -11350 4781 11869 -2505 -12347 -64 11774 2140 -11144 -3886
2616 -3886 10198 5459 -9003 -6863 7621 7716 -6185 -8422 4385 8740 -2924 -9104 1842 9289
2630 9289 -206 -9159 -834 8965 2191 -8176 -3356 8024 4579 -7383 -5446 6790 6818 -5497
2644 -5497 -7746 4455 8745 -2920 -9094 1443 9698 278 -9825 -1984 9321 3722 -8621
2657 -8621 -5323 7531 6558 -6349 -7486 4972 8478 -3387 -8907 1760 9105 -161 -8713 -1588
2671 -1588 8129 2746 -7390 -4211 6584 5029 -5642 -5957 4336 6452 -3341 -6654 1921 6649
2685 6649 -1141 -6940 -333 6566 1331 -6243 -2291 5698 3011 -5086 -3661 4488 4404 -3852 -5056
2700 -5056 2829 5508 -1891 -5507 817 5449 226 -5548 -1127 5223 2083 -4536 -2576 3698 3549
2715 3549 -2715 -3911 2256 4035 -1137 -4073 438 3734 501 -3284 -906 2946 1311 -2289 -1185
2730 -1185 1890 1737 -1444 -1499 1072 1319 -661 -1315 198 1074 -489 -1119 401 485 -606 -765 623
2747 623 774 -492 -1185 495 984 -525 -1414 205 1079 12 -1292 -576 983 215 -846 -680 631
2764 631 776 -542 -841 158 707 2 -156 -189 -370 107 560 -57 -957 -484 1333 958 -1169 -1415 1016
2783 1016 2040 -335 -2617 10 3098 678 -3039 -1679 3121 2718 -2622 -3548 2147 4381 -969
2798 -969 -4712 47 5142 1368 -4952 -2381 4741 3270 -3877 -4160 3118 4918 -2032 -5249 1094
2813 1094 5246 105 -5075 -1024 4816 2145 -4720 -2540 3861 3181 -3395 -3702 2848 3843 -2466 -4317
2829 -4317 1657 4249 -1253 -4511 891 4593 -194 -4984 -343 5115 789 -5586 -1512 5435 2491
2844 2491 -5417 -3527 4903 4656 -4712 -5585 3853 6447 -2611 -7453 1374 8133 220 -8269 -1803
2859 -1803 8291 3418 -7692 -5226 6954 6526 -5625 -7365 4161 8673 -2444 -8874 620 8896
2873 8896 1199 -8653 -2770 7938 4138 -7324 -5425 6150 6248 -4835 -6899 3708 7422 -2395
2887 -2395 -7599 1160 7545 -142 -7555 -869 7212 1846 -7040 -3033 6588 3670 -6026 -4727 5265
2902 5265 5498 -5014 -6439 3794 6918 -3008 -7761 1820 8250 -453 -8338 -1004 8422 2557 -8205
2917 -8205 -4180 7521 5675 -6612 -7193 5201 7901 -3951 -8806 2044 9287 -389 -9376 -1277
2931 -1277 8939 3189 -8083 -4306 7129 5719 -6132 -6645 4978 7563 -3237 -7882 2127
2944 2127 8055 -688 -7718 -418 7647 1755 -7182 -2653 6720 3859 -6023 -4438 5300 5132 -4311
2959 -4311 -5820 3243 6288 -2353 -7063 1280 6940 -341 -7051 -1042 6907 2366 -6697 -3464 5998
2974 5998 4353 -5242 -5389 4121 6294 -3111 -6816 1737 6662 -712 -6797 -654 6431 1777 -5976
2989 -5976 -2784 5471 3348 -4385 -4174 3495 4762 -2921 -4891 1822 5170 -786 -4846 69 4783
3004 4783 618 -4598 -1252 4533 1700 -3777 -2322 3457 2921 -3009 -3165 2841 3632 -2019 -3741 1562
3020 1562 4238 -928 -4257 161 4205 669 -4018 -1398 3876 2161 -3157 -2877 2634 3290 -1840
3035 -1840 -3647 899 3553 -489 -3651 -180 3337 1137 -2912 -1691 2369 1912 -1656 -2221 946
3050 946 2120 -353 -2112 -74 1725 392 -1400 -1088 838 770 -245 -734 117 470 212 -158 -339
3067 -339 -136 319 486 -249 -632 15 878 517 -923 -367 796 929 -360 -970 306 1279 231 -1214
3085 -1214 -157 1378 555 -868 -505 736 653 -510 -597 444 608 -305 -234 428 215 -480 -133 865 353
3104 353 -892 -424 1086 575 -1267 -920 1544 1715 -1457 -2137 1320 2442 -454 -3049 4 3417
3120 3417 753 -3679 -1409 3346 2473 -3286 -3482 2534 4112 -2138 -4666 1008 4641 -93 -5073
3135 -5073 -1176 4851 2219 -4483 -3074 3814 3830 -3089 -4319 2190 4621 -1433 -5160 311 5086
3150 5086 590 -4990 -1319 4667 1917 -4158 -2406 3912 3017 -3395 -3599 2804 3738 -2411 -4224 1884
3166 1884 4654 -976 -4844 570 5130 76 -5130 -1007 5174 1862 -5118 -2613 4892 3623 -4366
3181 -4366 -4452 3623 5298 -2804 -5811 2087 6443 -898 -6543 -487 6688 1801 -6646 -3014 5948
3196 5948 4199 -5610 -5251 4411 6099 -3250 -6735 2249 7035 -1053 -7318 -518 6950 1602 -6758
3211 -6758 -2955 6104 3773 -5517 -4585 4521 5752 -3724 -5961 2657 6230 -1586 -6534 511 6833
3226 6833 369 -6589 -1433 6174 2597 -6067 -3539 5361 4389 -4661 -5153 3937 5914 -2959 -6091
3241 -6091 1950 6748 -498 -6731 -475 6817 1689 -6512 -2819 6168 4095 -5370 -4785 4585 5614
3256 5614 -3454 -6160 2306 6306 -1271 -6707 -99 6678 1023 -6322 -2082 6074 2875 -5272 -3608
3271 -3608 4587 4465 -3867 -4998 2843 5403 -2053 -5736 1093 6035 -257 -5847 -837 5656 1725
3286 1725 -5297 -2521 4947 3357 -4330 -3979 3610 4699 -2894 -5247 1819 5604 -1057 -5593 -30
3301 -30 5607 1248 -5372 -2181 4856 3211 -4261 -3610 3498 4393 -2583 -4574 1945 4651 -909 -4427
3317 -4427 74 4498 1038 -4152 -1177 3792 2087 -3150 -2438 2598 2682 -2101 -3023 1449 2944 -1027
3333 -1027 -2905 493 3054 -70 -3061 -110 2763 462 -2642 -776 2369 1485 -2646 -1660 2084
3348 2084 1848 -1974 -2419 1422 2442 -990 -2671 615 2742 -220 -2542 -521 2448 1183 -2476
3363 -2476 -1464 2008 1479 -1578 -1983 804 2116 -289 -2005 -27 1980 659 -1387 -877 1207 1153
3379 1153 -881 -1070 487 1084 113 -658 -403 692 420 -230 -728 -306 526 414 -182 -599 275 908 250
3398 250 -1032 -398 919 1010 -795 -1045 393 1437 -41 -1513 -110 1485 537 -1580 -972 1128 1273
3415 1273 -1248 -1205 711 1342 -611 -1538 345 1500 -360 -1751 -110 1399 77 -1667 -403 1493
3431 1493 404 -1669 -864 1393 754 -1747 -1027 1587 1276 -1408 -1644 1405 2183 -1476 -2622 1000
3447 1000 2775 -709 -3212 136 3424 737 -3543 -1405 3479 2114 -3057 -2872 3100 3460 -2193
3462 -2193 -3819 1724 4280 -714 -4497 -108 4745 1308 -4351 -2161 4441 2890 -3481 -3454 2994
3477 2994 4282 -2448 -4637 1460 4742 -649 -5081 -180 4970 1101 -4626 -1794 4206 2427 -3802
3492 -3802 -3087 3165 3652 -2770 -4038 2088 4219 -1490 -4653 810 4669 -229 -5040 -643 4799
3507 4799 1424 -4367 -1795 4394 2645 -4340 -3382 3574 3992 -2968 -4678 2273 5145 -1677 -5450
3522 -5450 567 5580 504 -5559 -1682 5544 2466 -5169 -3354 4616 4436 -3817 -5057 3082 5600
3537 5600 -2117 -5865 926 6016 250 -6150 -1012 6001 2297 -5202 -3129 4949 3966 -3972 -4671
3552 -4671 3130 5199 -2150 -5490 1341 5508 -199 -5869 -665 5734 1359 -5244 -2240 4736 2953
3567 2953 -4443 -3942 3519 4385 -3009 -4982 1840 5189 -1062 -5392 260 5265 619 -5362 -1749
3582 -1749 4960 2318 -4426 -3022 3717 3573 -3158 -4206 2510 4713 -1852 -4853 1055 5073 12
3597 12 -4654 -650 4691 1734 -4187 -2149 4024 2821 -3204 -3151 2847 3601 -2124 -3920 1564 4241
3613 4241 -796 -4234 16 4610 617 -4135 -1310 4137 2067 -3542 -2521 3293 3299 -2619 -3405 1988
3629 1988 4079 -1229 -4098 515 4179 198 -4066 -960 3734 1682 -3552 -2096 2831 2415 -2438
3644 -2438 -2937 1601 3065 -1043 -3278 217 3135 307 -2765 -764 2556 1283 -2205 -1671 1710
3659 1710 1785 -1532 -1832 970 1564 -573 -1967 525 1528 -99 -1601 73 1652 165 -1131 -360
3675 -360 1244 397 -894 -399 945 702 -827 -733 900 937 -909 -1065 704 1188 -689 -939 551 1119
3693 1119 -147 -1159 -1 1223 393 -1056 -663 862 687 -689 -681 437 770 8 -769 -295 554 542
3711 542 -403 -686 -13 556 413 -616 -695 207 695 41 -876 -580 796 843 -651 -1284 252 1362 -33
3730 -33 -1569 -283 1723 786 -1899 -1225 1552 1528 -1133 -2083 676 2180 -213 -2305 -244 2195 770
3747 770 -2062 -1209 1913 1667 -1472 -1940 1238 2370 -588 -2229 277 2251 -86 -2017 -117 1874
3763 1874 504 -1940 -909 1820 1116 -2022 -1124 1651 1260 -1344 -1544 1470 2020 -1394 -2077 933
3779 933 2576 -621 -2983 380 2984 51 -3151 -752 3150 1260 -3009 -1982 2872 2741 -2560
3794 -2560 -3209 1895 3654 -1463 -4461 541 4399 316 -4418 -1355 4171 1716 -3797 -2751 3373
3809 3373 3548 -2740 -3935 1926 4365 -1141 -4588 334 4658 407 -4292 -1355 4038 1856 -3759
3824 -3759 -2445 3127 3068 -2500 -3187 2306 3621 -1744 -3851 1213 4113 -375 -3882 -90 3930 804
3840 804 -3790 -1375 3738 1935 -3490 -2444 3039 3255 -2778 -3741 2250 4050 -1398 -4342 683 4470
3856 4470 -13 -4802 -835 4625 1834 -4491 -2544 3826 3220 -3473 -3711 2650 4210 -1929 -4585
3871 -4585 1047 4842 -214 -4975 -744 4578 1540 -4399 -2342 3911 2890 -3437 -3435 2665 3768 -2091
3887 -2091 -4208 1482 4207 -855 -4367 54 4536 649 -4299 -1327 3879 2240 -3558 -2753 3208
3902 3208 3343 -2659 -3733 2020 4017 -1311 -4141 645 4235 276 -4116 -953 3904 1871 -3544
3917 -3544 -2240 3419 2999 -2623 -3117 2042 3371 -1312 -3649 807 3551 -281 -3465 -304 3320
3932 3320 946 -3051 -1479 2764 1533 -2463 -1994 2073 2304 -1840 -2661 1335 2627 -1161 -2904 473
3948 473 2542 -213 -3057 -221 3068 642 -3033 -1078 2486 1698 -2427 -2120 1880 2568 -1635 -3087
3964 -3087 915 2993 -327 -3085 -211 2893 732 -2792 -1319 2381 1992 -1883 -2163 1411 2515
3979 2515 -644 -2207 124 2121 430 -2061 -666 1534 955 -1244 -1220 1206 1332 -636 -1092 233
3995 233 1100 125 -942 -153 367 386 -391 -89 14 26 -176 225 114 -311 -88 418 461 -468 -688 385
4015 385 663 -463 -949 102 971 -121 -902 -494 726 616 -771 -752 429 819 -226 -949 -53 657
4033 657 -25 -517 -414 306 330 4 -339 -170 -36 337 209 -621 -465 367 533 -340 -1092 112 1081 124
4053 124 -1320 -807 1243 1202 -1134 -1550 785 1984 -378 -2004 -204 2318 723 -2312 -1208 1922
4069 1922 1806 -1339 -2209 1222 2473 -372 -2728 -68 2602 483 -2700 -1142 2398 1705 -1657 -1857
4085 -1857 1443 1912 -1322 -2356 509 2223 -236 -2402 -38 2284 400 -2349 -653 1898 836
4100 836 -1949 -1132 1888 1220 -1722 -1533 1616 1633 -1548 -2092 1355 2103 -1145 -2456 571 2829 -95
4117 -95 -3096 -279 3248 921 -3151 -1488 2938 2300 -2618 -2653 2184 3122 -1545 -3711 946 4006
4133 4006 -222 -3846 -562 3858 1318 -3654 -1799 3321 2685 -2769 -3050 2359 3644 -1398 -3800
4148 -3800 952 3947 -172 -3733 -590 3666 928 -3408 -1687 3136 1868 -2783 -2412 2159 2677
4163 2677 -1987 -3238 1513 3145 -1017 -3403 293 3310 -42 -3654 -791 3543 1185 -3362 -1879
4178 -1879 3053 2331 -2779 -2700 2125 3187 -1879 -3689 1039 3708 -438 -3871 -198 3899 915 -3443
4194 -3443 -1558 3353 2232 -2952 -2577 2578 3199 -1929 -3286 1398 3636 -667 -3488 252 3653
4209 3653 391 -3392 -955 3166 1540 -3091 -1912 2725 2400 -2266 -2709 1797 3161 -1484 -3377
4224 -3377 821 3569 -364 -3584 -745 3480 1035 -3363 -1496 2918 2268 -2487 -2841 2143 2968 -1442
4240 -1442 -3334 688 3136 -182 -3209 -509 3001 846 -3091 -1448 2685 1508 -2091 -2069 1692
4255 1692 2283 -1445 -2244 618 2194 -421 -2373 96 2211 313 -1841 -514 1802 670 -1884
4270 -1884 -785 1861 929 -1652 -1302 1432 1691 -1379 -1554 908 1880 -648 -1905 415 1825 -174
4286 -174 -2136 -261 2107 904 -1990 -1242 1751 1565 -1427 -1818 978 1887 -450 -2207 -20 2092
4302 2092 358 -1870 -921 1703 1041 -1209 -1444 954 1492 -483 -1579 49 1205 461 -1153 -630
4318 -630 942 621 -476 -767 95 738 176 -707 -355 57 215 -173 -510 -185 290 428 -130 -637 -204
4337 -204 503 322 -619 -478 455 712 -117 -953 -75 948 390 -631 -390 623 682 -224 -819 174 715
4356 715 -56 -586 -87 294 -3 -214 -279 227 125 -49 -10 -22 -42 -123 388 118 -523 -278 441 459 -493 -861
4378 -861 149 1036 -229 -1467 -181 1502 471 -1314 -814 1589 1324 -1104 -1757 882 2088 -452
4394 -452 -2082 -49 2177 569 -2210 -935 1865 1319 -1696 -1901 1221 2388 -1072 -2558 300 2269
4410 2269 173 -2394 -521 2290 855 -2006 -1210 1970 1555 -1537 -1640 1132 1903 -654 -2028 576
4426 576 1992 -141 -2034 -9 2107 269 -2207 -533 2085 1166 -1916 -1038 1893 1397 -1432 -1722
4442 -1722 1518 2023 -1251 -2394 809 2597 -400 -2740 45 2889 516 -2757 -919 2708 1546
4457 1546 -2476 -2060 2033 2424 -1729 -2862 1279 3057 -594 -3491 -14 3291 438 -3172 -1194
4472 -1194 2998 1755 -2734 -1784 2376 2471 -1741 -2893 1532 2916 -863 -3133 440 3127 279 -3028
4488 -3028 -834 2896 1215 -2628 -1703 2535 2126 -2230 -2273 1720 2744 -994 -3126 623 3220 -310
4504 -310 -2845 -246 2959 947 -3006 -1304 2625 1796 -2274 -2024 1959 2269 -1599 -2812 1044 2758
4520 2758 -477 -2940 -34 3159 419 -2989 -890 2825 1040 -2306 -1692 1969 1969 -1882 -2289 1552
4536 1552 2567 -966 -2377 442 2534 -188 -2885 -79 2744 633 -2575 -1071 2474 1502 -2080
4551 -2080 -1899 1986 2453 -1518 -2685 927 2708 -660 -2919 78 2929 462 -2631 -1059 2469
4566 2469 1608 -1946 -1885 1827 2211 -1214 -2313 960 2482 -307 -2310 -44 2224 617 -2067 -732
4582 -732 2030 1229 -1533 -1187 1198 1518 -823 -1424 690 1681 -473 -1254 303 1496 -89 -1450 21
4599 21 1073 308 -1138 -606 1125 460 -1112 -594 1140 899 -1040 -1178 578 1073 -791 -1199 543
4616 543 1319 -395 -1779 43 1497 294 -1266 -695 953 828 -1056 -1133 660 1084 -366 -1229 -32
4633 -32 1173 214 -1054 -316 964 605 -555 -773 494 675 -113 -596 -42 748 375 -525 -422 349 431
4652 431 50 -473 -83 436 338 -155 -606 -60 511 205 -480 -611 406 628 -275 -670 -42 681 287 -756
4672 -756 -432 564 451 -607 -674 192 683 -172 -927 -155 824 92 -636 -74 530 252 -748 -256 282 452
4692 452 -704 -407 339 430 -481 -366 454 444 -536 -611 600 743 -410 -889 491 1173 -166 -1222 18
4711 18 1200 -94 -1328 -483 1372 672 -1365 -998 1184 1450 -1167 -1570 1059 1765 -370 -1870 -50
4728 -50 2027 321 -1965 -770 1915 1178 -1740 -1505 1592 1899 -1019 -1961 723 2072 -421 -2175
4744 -2175 -79 2149 326 -2316 -943 1982 1254 -1806 -1417 1679 1725 -1226 -1980 925 1895 -691
4760 -691 -2050 293 2046 32 -2177 -476 2055 705 -2185 -1044 2018 1232 -1633 -1642 1642 1804
4776 1804 -1419 -2082 826 2170 -671 -2216 97 2464 299 -2311 -756 2329 965 -2328 -1472
4791 -1472 1931 1789 -1729 -2110 1252 2252 -899 -2558 448 2842 -218 -2538 -400 2810 957
4806 957 -2354 -1287 2244 1806 -1992 -2083 1463 2241 -1287 -2585 572 2514 -152 -2694 -162 2603
4822 2603 725 -2440 -1096 2315 1482 -2140 -1846 1950 2035 -1605 -2389 941 2381 -595 -2677 56
4838 56 2453 402 -2610 -775 2331 1196 -2326 -1451 1736 1879 -1642 -2062 982 1972 -865 -2270
4854 -2270 379 2026 94 -2279 -465 2241 729 -2140 -1167 1796 1306 -1582 -1542 1336 1596 -1044
4870 -1044 -1775 769 2129 -378 -2083 186 2203 242 -1952 -481 1858 912 -1741 -1056 1576 1349
4886 1349 -1364 -1585 1067 2056 -631 -2061 225 2088 -23 -1991 -383 1842 864 -1721 -816 1356
4902 1356 1087 -1138 -1575 948 1691 -666 -1637 353 1687 65 -1472 -396 1383 612 -1213 -721
4918 -721 1076 964 -811 -821 488 1023 -405 -1003 190 859 34 -816 -89 780 288 -700 -116 718 278
4937 278 -701 -313 826 388 -422 -585 454 420 -468 -480 563 555 -203 -442 195 874 -248 -604 -46 634
4957 634 173 -631 -145 482 305 -440 -399 243 572 70 -519 243 362 210 -302 -340 163 166 -158 -352 -40
4978 -40 129 293 -5 -281 -61 414 128 -347 -211 222 422 -155 -313 40 733 -10 -647 -509 609 477
4998 477 -475 -496 295 699 -228 -869 -63 1086 343 -854 -392 652 531 -686 -677 382 923 -526 -1063
5017 -1063 281 1061 -116 -963 -40 946 183 -761 -376 816 563 -835 -637 814 766 -641 -798 624
5035 624 934 -543 -976 551 1068 -274 -1166 197 1288 202 -1324 -343 1439 499 -1403 -915 1444
5052 1444 971 -1242 -1424 869 1382 -566 -1622 332 1866 -3 -1837 -432 1964 669 -1860 -976
5068 -976 1412 1371 -1382 -1704 949 1873 -543 -1833 361 1946 124 -2163 -313 1821 558 -1780
5084 -1780 -928 1527 1091 -1475 -1367 1131 1538 -844 -1829 641 1957 -261 -2135 0 1955 70
5100 70 -2002 -636 1909 889 -1642 -1071 1633 1459 -1494 -1510 1282 1818 -954 -1815 526 2231 -190
5117 -190 -2157 -343 2154 858 -2030 -1082 2233 1320 -1658 -1761 1398 2062 -988 -2031 616 2175
5133 2175 -413 -2241 -159 2048 422 -2015 -846 1911 1030 -1729 -1305 1444 1749 -1375 -1799 995
5149 995 1947 -493 -2023 225 2184 270 -2173 -388 2128 741 -1802 -1131 1800 1375 -1472 -1718
5165 -1718 1122 1712 -979 -1901 600 2044 -81 -1985 -148 2172 751 -2023 -886 1719 1280 -1274
5181 -1274 -1343 1305 1525 -903 -1754 399 1841 -204 -1791 -67 1776 318 -1627 -544 1433 949
5197 949 -1218 -942 1143 1141 -662 -1248 618 1083 -541 -1345 174 1315 10 -1283 -168 1346 105
5214 105 -1310 -474 1165 566 -1189 -728 1001 867 -806 -1284 472 1217 -537 -1409 224 1311 184
5231 184 -1342 -544 1327 871 -1182 -696 843 840 -692 -1060 515 1123 -174 -1117 -102 972 62 -935
5249 -935 -427 772 557 -510 -712 255 568 -385 -557 181 682 106 -376 -38 422 159 -178 -274 220 152
5269 152 -82 99 203 -124 -134 83 361 28 -162 170 62 -21 -322 99 260 82 -279 -258 218 156 -123
5290 -123 -155 60 177 -181 -389 -65 293 152 -266 -110 289 199 15 -144 43 192 165 30 -124 -114 -55 256
5312 256 -70 -170 -157 465 269 -337 -516 580 600 -446 -532 90 717 -52 -571 -286 965 441 -775 -701
5332 -701 572 973 -580 -1033 237 975 -208 -1151 -212 1014 429 -959 -643 847 893 -787 -834 362
5350 362 882 -222 -1154 14 930 -148 -874 -179 1021 327 -1050 -389 1180 533 -911 -755 943
5367 943 609 -785 -954 620 1165 -548 -1248 214 1264 -205 -1241 31 1322 413 -1329 -520 1423
5384 1423 644 -1030 -1063 1164 1282 -828 -1491 679 1604 -307 -1723 -11 1677 371 -1337 -609 1528
5401 1528 747 -1222 -1033 1047 1423 -992 -1444 553 1652 -430 -1682 122 1510 227 -1652 -221
5417 -221 1619 700 -1429 -886 1440 1060 -1188 -1344 897 1482 -674 -1693 268 1659 -162 -1820
5433 -1820 -192 1878 279 -1868 -613 1475 896 -1648 -1378 1170 1652 -959 -1820 824 1571 -433
5449 -433 -2005 -50 1816 426 -1717 -578 1553 933 -1328 -1265 1312 1326 -966 -1491 687 1664 -491
5466 -491 -1740 28 1815 114 -1510 -322 1524 657 -1535 -715 1471 1048 -1114 -1114 1111 1344 -829
5483 -829 -1327 632 1341 -412 -1430 233 1796 164 -1717 -494 1675 858 -1522 -1128 1531 1349
5499 1349 -1162 -1599 799 1746 -389 -1696 147 1570 87 -1915 -479 1703 852 -1430 -1133 1092
5515 1092 1231 -729 -1303 468 1472 -395 -1553 32 1196 292 -1155 -290 952 225 -1030 -550
5531 -550 891 374 -622 -674 645 743 -589 -621 479 729 -196 -738 47 873 -73 -816 248 962 99
5550 99 -1002 -278 1054 499 -713 -510 629 930 -344 -838 293 817 -286 -1147 -52 1057 334
5567 334 -890 -531 814 765 -689 -919 311 849 -237 -870 73 768 224 -551 -341 392 369 -324 -352
5586 -352 125 394 -36 -344 -24 236 132 -61 -81 151 137 -47 -59 -218 86 35 73 -54 -153 192 106 -96
5608 -96 -151 83 296 173 -229 -159 380 109 -186 -192 -25 291 -135 -316 102 330 -47 -557 -153 160 92 -209
5630 -209 -90 206 39 -181 180 152 155 -199 133 277 -15 -249 -53 396 147 -526 -237 498 493 -420 -520 305
5652 305 793 -537 -994 189 977 47 -911 -282 828 605 -931 -392 658 836 -699 -667 233 862
5670 862 -108 -1188 76 1043 159 -1151 -394 1005 653 -859 -563 595 615 -628 -987 580 969 -626
5688 -626 -1141 129 1143 -65 -1304 -83 1125 391 -965 -369 1287 790 -971 -862 877 1015 -722
5705 -722 -1220 625 1218 -164 -1337 -73 1533 263 -1301 -323 1176 946 -1091 -917 1111 1026 -933
5722 -933 -1217 588 1223 -494 -1439 256 1460 130 -1407 -269 1357 603 -1407 -801 1175 857 -998
5739 -998 -1061 801 1295 -912 -1364 497 1463 -56 -1411 33 1572 185 -1515 -577 1506 776 -1203
5756 -1203 -892 1302 1161 -1227 -1461 889 1661 -528 -1779 93 1660 9 -1682 -380 1622 791
5772 791 -1684 -1085 1266 1370 -948 -1415 786 1799 -727 -1578 38 1723 118 -1765 -393 1373
5788 1373 463 -1342 -789 1140 1013 -957 -941 881 1396 -484 -1058 211 1276 -280 -1320 30 1233
5805 1233 66 -1323 -357 1002 435 -1032 -474 1033 779 -1063 -1040 832 1161 -691 -1111 442 1402
5822 1402 -380 -1437 58 1411 429 -1274 -505 1260 756 -1168 -999 1106 1197 -573 -1482 260 1613
5839 1613 -63 -1361 -246 1390 426 -939 -734 1126 716 -979 -955 481 1254 -145 -1112 148 1066
5856 1066 64 -1073 -83 840 217 -662 -411 517 322 -449 -521 320 326 -242 -399 313 341 -408 -531 136
5876 136 504 -410 -472 139 623 -6 -658 -176 747 9 -826 -364 628 283 -479 -671 392 544 -338 -499
5896 -499 25 483 -54 -652 -197 644 390 -292 -335 304 460 -128 -295 44 346 -44 -173 -245 198 184 -181
5917 -181 -261 75 126 20 -44 -78 82 251 375 -74 -289 68 320 -142 -303 99 322 -110 -267 -189 336 157
5939 157 -467 -366 334 356 4 -393 71 506 -75 -374 64 454 67 -574 -190 510 255 -326 -383 249 466
5960 466 -194 -463 417 185 -209 -624 90 430 36 -593 21 441 35 -608 -360 653 376 -606 -232 454
5980 454 415 -598 -548 310 637 -359 -822 308 905 46 -1013 -101 961 331 -810 -592 885 599 -820
5999 -820 -594 800 925 -502 -892 485 1069 -91 -1001 -79 1295 194 -1206 -630 1337 477 -903
6016 -903 -642 732 1084 -636 -1157 350 1072 -376 -1318 208 1396 40 -1513 -434 1233 664 -994
6033 -994 -818 910 882 -736 -1061 445 1374 -421 -1281 290 1434 -29 -1330 -107 1442 498 -1378
6050 -1378 -690 1105 775 -1051 -984 716 1148 -434 -1252 455 1245 -300 -1288 -29 1395 230 -1170
6067 -1170 -481 1127 482 -1183 -710 1086 1143 -976 -1071 734 1369 -471 -1411 232 1280 77 -1410
6084 -1410 -161 1318 364 -1369 -682 1450 912 -1203 -1246 899 1351 -746 -1425 419 1574 -61 -1525
6101 -1525 -83 1664 507 -1505 -697 1572 1129 -1254 -1334 986 1400 -498 -1408 358 1461 -112
6117 -112 -1202 -260 1379 200 -1185 -617 1055 721 -818 -1141 716 930 -771 -1022 692 885 -216
6134 -216 -1035 123 958 -52 -1185 1 1050 263 -1013 -284 1063 362 -769 -615 883 764 -953
6151 -953 -987 535 985 -505 -1242 196 1199 71 -1291 49 1091 617 -1111 -651 825 806 -698
6168 -698 -914 448 1138 -189 -1101 29 1032 29 -1117 -360 804 533 -833 -798 501 748 -391
6185 -391 -728 199 774 -25 -568 -74 579 63 -502 -160 390 341 -369 -258 176 180 -293 -225 145 280 -207
6206 -207 -272 224 205 -125 -263 250 233 -205 -268 35 530 -106 -415 42 437 80 -326 -68 384 339 -265 -267
6228 -267 172 446 -58 -261 -6 593 116 -281 -124 -5 73 -155 -138 301 227 42 110 -84 104 18 -65 95
6250 95 24 169 112 -113 -88 86 111 38 -187 -32 332 277 -286 -343 -17 512 -5 -374 -70 502 207 -498 -201
6273 -201 488 347 -405 -645 228 599 -280 -573 187 485 69 -835 -175 419 261 -536 -356 542 351 -407
6293 -407 -499 434 609 -221 -647 208 878 -217 -793 77 708 -20 -555 31 928 257 -660 -209 681 634
6313 634 -758 -572 626 813 -294 -920 355 1003 -129 -1000 109 982 28 -1015 -313 947 505
6330 505 -782 -658 644 736 -592 -909 352 974 -247 -1215 120 1300 -55 -1244 -382 1109 558
6347 558 -1338 -636 895 777 -833 -915 831 1360 -574 -1182 346 1277 -28 -1343 -131 1231 319
6364 319 -1326 -630 1000 821 -930 -1043 928 1091 -684 -1093 215 1314 -143 -1459 -177 1249
6380 1249 212 -1255 -507 1121 557 -939 -959 958 1016 -917 -1045 793 1181 -242 -1193 133 1087
6397 1087 30 -1254 -242 1130 390 -1029 -497 1231 751 -940 -984 782 884 -665 -1298 361 1125
6414 1125 -136 -1261 86 1095 257 -1454 -474 1287 712 -1423 -918 979 1340 -909 -1364 729
6430 729 1315 -307 -1461 117 1409 275 -1360 -534 1378 753 -1186 -960 822 1010 -727 -1114 536
6447 536 1230 -413 -1228 8 1122 289 -1104 -328 955 306 -713 -517 865 676 -721 -751 664
6464 664 764 -459 -855 305 730 -94 -758 -128 938 79 -927 -143 785 202 -809 -403 847 413
6482 413 -598 -552 448 593 -496 -910 280 1166 -157 -1237 62 975 142 -914 -530 918 504
6499 504 -601 -701 441 904 -448 -700 93 960 144 -773 -309 828 326 -802 -499 636 484 -282
6517 -282 -649 173 465 -72 -594 61 474 263 -207 -93 246 377 -111 -307 35 173 -5 -197 -38 112
6537 112 -151 101 108 147 -153 91 189 -11 -187 145 264 117 -156 67 283 126 -144 -331 25 216 107
6558 107 -225 130 240 152 -330 -132 123 149 -103 -263 -63 31 37 -153 7 24 183 55 19 13 55 205 146 -36
6582 -36 -132 117 237 96 -342 -81 526 168 -694 -196 363 392 -267 -475 491 700 -200 -483 146 682 75
6603 75 -829 -253 606 221 -624 -502 333 474 -396 -425 412 724 -146 -673 -40 734 162 -629 -328 710
6623 710 426 -480 -585 574 532 -406 -732 392 550 -209 -526 270 688 -142 -820 -56 933 82 -891 -259
6643 -259 698 350 -726 -656 765 815 -455 -953 185 967 -156 -919 217 887 180 -1140 -399 944
6661 944 363 -906 -557 885 642 -692 -943 502 1019 -346 -961 212 1218 292 -1193 -173 1204
6678 1204 486 -1081 -490 884 572 -1035 -979 771 867 -590 -1385 527 1157 -179 -1346 -7 1373
6695 1373 294 -1196 -370 995 633 -1000 -901 917 1079 -692 -1091 415 1273 -295 -1094 199 1172
6712 1172 258 -1336 -568 1050 544 -912 -693 870 1020 -818 -1060 726 1021 -308 -1068 214 1227
6729 1227 33 -1198 -132 892 237 -1032 -428 1000 552 -700 -614 664 726 -688 -1012 389 767
6746 767 -277 -809 202 982 50 -1108 -232 1211 368 -1050 -706 921 751 -737 -975 607 1194
6763 1194 -417 -1172 340 1143 109 -1105 -545 1249 414 -1141 -624 891 957 -662 -1105 532 1079
6780 1079 -259 -1177 -21 946 170 -829 -121 969 504 -677 -530 564 595 -393 -484 301 706 -198 -526
6799 -526 210 550 -37 -543 124 498 -116 -698 -67 631 14 -819 -135 584 294 -465 -422 426 502 -544
6819 -544 -538 233 727 -243 -880 0 920 133 -655 -243 860 362 -475 -465 422 436 -277 -649 112 769 -47
6840 -47 -618 -70 412 253 -538 -287 304 231 -120 -367 121 240 83 -460 -73 217 264 -78 -78 78 -55 109
6862 109 -36 72 16 320 90 -94 86 89 184 -67 -4 -106 178 11 -180 -178 -44 161 50 -269 49 175
6884 175 8 -123 47 6 63 -143 -105 259 -11 -96 68 140 -44 63 -194 104 74 8 -51 306 72 -79 -157
6907 -157 366 81 -175 -219 70 534 -216 -256 151 344 178 -604 -141 364 250 -513 -283 535 361 -365 -623
6928 -623 253 640 -258 -533 61 713 78 -785 -110 557 154 -692 -484 591 592 -519 -559 283 619 -161
6948 -161 -757 233 589 -24 -788 -161 710 -94 -964 -311 911 578 -701 -400 428 775 -398 -740 380
6967 380 865 -49 -897 43 911 248 -1010 -206 922 491 -823 -494 676 802 -523 -726 328 963
6985 963 -373 -876 186 879 236 -936 -385 936 590 -897 -558 589 665 -764 -914 584 857 -332
7003 -332 -816 270 978 -320 -819 200 1066 19 -994 -321 873 519 -852 -840 897 810 -770 -832
7021 -832 514 858 -312 -1016 172 1164 63 -1267 -277 961 426 -1023 -700 986 968 -854 -1145
7038 -1145 331 964 -430 -1297 206 1256 -102 -1138 -327 1087 292 -968 -549 739 751 -567 -941
7055 -941 641 839 -435 -922 93 971 -116 -923 30 965 179 -984 -55 998 379 -669 -426 786
7073 786 622 -539 -533 593 907 -507 -765 74 846 -190 -838 124 968 225 -796 -280 795 334 -962
7092 -962 -798 601 829 -595 -1090 271 931 -158 -1330 -211 823 286 -740 -414 655 552 -566
7109 -566 -621 471 907 -522 -680 203 715 -80 -786 -170 560 292 -460 -62 470 265 -495 -309 230 594
7129 594 -239 -329 264 368 -53 -188 176 241 1 -606 146 349 -33 -446 -181 450 237 -411 -223 441 254
7150 254 -215 -250 126 510 -78 -736 243 498 147 -178 -130 342 216 -384 -248 158 424 -134 -229 152 236
7171 236 -21 -337 -136 154 -3 -30 -179 248 169 -67 -155 127 216 34 -68 -123 117 279 164 -159 6 161
7193 161 -81 69 -123 -29 102 102 -140 -289 192 75 -123 -31 301 240 43 -341 -137 255 -43 -176 143 288
7215 288 184 -125 -154 157 6 -195 -168 222 246 -134 -341 135 373 -48 -237 -120 271 -105 -437 26 111
7236 111 35 -251 -291 408 456 -717 -464 181 421 -167 -545 149 719 146 -584 -135 612 374 -498 -354 558
7257 558 409 -478 -432 329 418 -284 -547 113 678 142 -635 -107 500 -42 -583 -102 626 154 -493 -245 494
7278 494 373 -335 -626 314 846 -79 -782 -92 791 95 -857 -180 809 414 -705 -349 646 603 -626 -887
7298 -887 416 710 -105 -977 69 806 58 -897 -174 1016 398 -697 -528 579 849 -736 -755 324
7316 324 897 -290 -811 181 880 18 -896 -225 859 287 -539 -320 526 666 -563 -621 506 676 -456
7335 -456 -643 263 714 -212 -836 23 895 88 -958 -226 964 212 -801 -579 802 595 -556 -599 555
7354 555 890 -451 -917 243 869 -89 -967 -51 930 315 -965 -366 1022 816 -806 -759 443 731
7372 731 -286 -955 163 1017 142 -899 -112 981 319 -885 -612 784 555 -728 -873 637 687 -281
7390 -281 -710 396 743 -194 -522 135 726 240 -661 -139 597 92 -488 -457 466 447 -463 -369 305 497 -314
7411 -314 -554 330 846 -233 -520 -86 628 71 -817 -206 901 393 -701 -648 627 655 -482 -831 356
7430 356 567 -182 -819 51 630 188 -661 -147 749 355 -505 -541 276 452 -151 -612 184 643 -118 -608
7450 -608 -205 452 218 -519 -145 345 218 -321 -247 128 177 -293 -381 112 231 -51 -305 52 321 -127 -370
7471 -370 -50 324 -2 -321 -104 236 -115 -135 -90 199 187 -224 -141 193 100 -208 -267 38 277 -49 -147 29
7493 29 229 152 -196 -51 -62 57 -94 -111 159 256 12 -39 -86 19 -62 117 164 1 36 26 0 -80 -15 132 3
7518 3 20 141 111 137 -135 -148 -68 212 -94 -265 -122 291 94 -144 -141 231 178 -206 -329 28 311 92 -136
7541 -136 -35 278 -193 -316 -55 295 116 -351 -183 224 293 -158 -452 92 371 -159 -392 123 488 -133
7561 -133 -288 130 468 -125 -451 -168 495 281 -628 -349 349 356 -203 -464 192 561 -187 -647 158 608 -3
7582 -3 -588 -156 499 199 -516 -296 559 516 -413 -457 380 693 -308 -551 108 532 -98 -571 50 517 137
7603 137 -312 -214 610 188 -535 -301 146 553 -438 -621 222 646 -350 -712 128 610 -12 -854 -101 806
7623 806 97 -871 -470 806 596 -502 -707 455 676 -175 -635 125 879 166 -870 -6 744 486 -693
7642 -693 -532 650 738 -504 -590 427 477 -350 -715 321 750 -293 -939 -166 818 211 -572 -371 763
7661 763 377 -529 -344 500 565 -345 -431 348 672 -83 -635 143 568 -99 -833 -64 721 360 -786 -284
7681 -284 429 405 -570 -519 426 620 -301 -805 213 885 -246 -750 0 907 83 -760 -137 801 714 -464
7701 -464 -597 492 754 -316 -639 160 885 -211 -776 5 853 548 -664 -191 842 258 -478 -294
7719 -294 516 542 -342 -531 122 659 5 -523 -124 581 196 -466 -222 496 183 -482 -115 391 176 -363
7739 -363 -427 300 420 -170 -435 278 482 -116 -527 -28 297 90 -437 109 659 425 -499 -297 460 213
7759 213 -395 -403 306 548 -172 -622 173 621 219 -556 5 334 133 -432 -321 321 260 -474 -345 108 243
7780 243 -150 -262 66 390 84 -462 -147 277 205 -138 13 178 239 -217 -215 134 -21 34 19 -119 271 -127
7802 -127 -64 -3 53 -30 -147 52 236 49 -93 60 14 -107 -145 184 -33 -270 -161 -33 16 -147 -131 9 -26
7825 -26 -34 -65 -81 202 85 -7 -70 24 -11 46 -33 214 14 144 112 66 33 93 -128 144 138 -382 -191 172 106 37
7851 37 -39 94 75 -56 -179 16 280 -34 -288 -247 50 2 -221 -17 362 -1 -145 -259 49 339 -90 -384
7873 -384 50 603 166 -335 -2 404 158 -435 -24 401 26 -252 -155 343 470 -261 -455 339 322 -119 -361
7894 -361 -9 577 -83 -405 -53 535 240 -387 -360 409 289 -526 -404 285 383 -277 -382 184 738 -94 -755
7915 -755 -116 422 180 -547 -293 371 145 -324 -272 159 490 -286 -447 157 361 -18 -461 159 609 124
7935 124 -425 -78 618 209 -486 -287 462 291 -438 -290 477 621 -283 -483 128 662 -58 -531 -31 692
7955 692 79 -692 -320 658 544 -617 -407 629 528 -433 -651 432 685 -289 -637 85 842 102 -831
7974 -831 -311 671 442 -621 -517 425 537 -465 -658 287 630 -253 -681 -220 722 95 -450 -195 484
7993 484 238 -471 -332 379 438 -290 -636 519 527 -135 -465 -7 647 -2 -447 -176 514 32 -478 -163 572
8014 572 79 -558 -289 586 238 -313 -481 251 509 -205 -725 90 653 80 -788 -273 651 314 -606 -342
8034 -342 510 387 -374 -409 266 634 -277 -524 -85 471 94 -400 -268 387 365 -448 -317 287 436 -369 -456
8055 -456 260 532 -17 -314 -216 443 -41 -346 -52 502 169 -389 -233 412 73 -132 -141 160 219 -275 -204 330
8077 330 202 -22 -196 167 253 -24 -407 110 234 26 -386 -249 336 11 -322 -213 196 193 -88 -161 67
8098 67 294 -34 -320 -270 282 208 -216 -130 44 316 -155 -145 98 263 34 -200 112 280 -49 -25 -147 178
8120 178 -17 -234 -178 -104 336 -72 -75 -229 97 52 105 -55 95 -112 -80 150 -106 -143 -31 -67 -9 9 45 152
8144 152 -14 -172 -1 79 -24 15 -224 7 200 74 -108 28 -82 69 -92 20 -72 -177 46 -9 104
8165 104 -75 -57 92 164 -43 -89 31 179 78 -89 104 144 52 -47 -1 130 153 -293 -245 94 327 -335 -320
8188 -320 160 228 -8
8191h
$$ Imaginary data points
##PAGE= N=2
##DATA TABLE= (X++(I..I)), XYDATA
0 0 0 0 0 0 0 0 0 0 0 0 -8 8 -8 10 -16 16 -24 32 -33 40 -48 59 -72 81 -97 114 -130 150 -172 202 -228 259
32 259 -294 334 -375 423 -476 533 -593 663 -737 820 -908 1003 -1110 1229 -1353 1492 -1643
49 -1643 1813 -1993 2198 -2424 2674 -2957 3277 -3640 4059 -4545 5124 -5822 6681 -7773 9211
64 9211 -11196 14124 -18887 27929 -51111 237246 355143 -364108 -344827 232772 426377
75 426377 -160517 -441964 70806 453538 4672 -412768 -97252 388877 168497 -330604
85 -330604 -217175 288353 250566 -221404 -272936 167246 284559 -110967 -293679 64691
95 64691 279983 -24821 -269052 -10798 258089 42860 -250494 -68842 236554 99450
105 99450 -224308 -130446 206439 150586 -195611 -186012 165458 213865 -144362 -247476 103717
116 103717 263957 -58448 -281087 7619 288948 39811 -286069 -96921 264080 150044
126 150044 -240588 -202792 196857 232670 -148360 -259042 93000 277251 -34451 -277959
136 -277959 -18594 268732 75192 -239538 -119498 206677 156288 -169782 -181353 130211
146 130211 196381 -82817 -199710 41728 202827 336 -184461 -23388 170318 54901
156 54901 -147256 -73975 131813 89749 -109206 -97834 86061 104314 -66644 -105791 54817
167 54817 109231 -36640 -107318 22292 110189 -5706 -107554 -8234 100303 18587 -99163
178 -99163 -37211 90307 49020 -85204 -64367 69984 72616 -54513 -81083 37887 85828
189 85828 -25824 -90179 5582 82868 9018 -81632 -30350 68778 35264 -60552 -43210 45297
201 45297 49612 -32210 -53555 21464 51963 -9915 -45903 -707 37508 5515 -33585 -10434
213 -10434 27289 12624 -19815 -11457 14836 13676 -4832 -7107 7335 7934 -3913 -1635 4248
226 4248 621 -140 2747 644 -4165 -2726 9889 9773 -9539 -7272 15315 12262 -12229 -14214 14717
241 14717 24179 -15023 -32387 12648 35245 -8268 -41376 -1919 48416 9700 -55712 -18302
253 -18302 57484 32014 -52800 -49755 45715 62300 -42235 -75434 27036 79344 -13568 -91967
265 -91967 -10666 93940 27216 -92342 -45564 81224 63235 -70075 -81546 56179 92458
276 92458 -42636 -102197 18451 102113 1225 -104253 -20745 100370 35587 -91863 -48252
287 -48252 83769 65543 -70203 -75141 60435 82691 -47701 -86120 36641 91557 -24033
298 -24033 -96257 13249 103191 1926 -101308 -11048 105587 29997 -102731 -44173 105479
309 105479 64221 -100085 -82607 89522 102313 -74225 -120699 57619 137750 -35401 -147630
320 -147630 9866 156557 24247 -156213 -56509 149806 84492 -137172 -114496 113548
330 113548 138286 -90097 -161877 56800 172584 -22936 -176512 -14028 172106 47330
340 47330 -163700 -78616 145067 102478 -125013 -127947 94449 139292 -69686 -148722 40496
351 40496 148427 -15479 -146635 -8196 141776 30494 -131501 -49010 119173 63184
361 63184 -108496 -76457 96900 86951 -85284 -98023 73073 110594 -56746 -117190 44979
372 44979 128596 -25502 -132921 8165 142020 16091 -144858 -39954 142990 66572
382 66572 -133579 -91730 123448 119647 -104068 -139734 82932 160774 -49311 -171340 16362
393 16362 177128 17870 -174977 -51918 163345 83214 -146650 -113585 121681 136831 -92632
404 -92632 -151570 61211 158214 -29131 -160385 -3663 154269 29904 -146653 -57939 126285
415 126285 75475 -108970 -93763 87641 103002 -70141 -109554 49604 112026 -29763 -113520
426 -113520 10420 110391 1761 -108976 -16052 101804 28521 -98307 -44212 93539 57347
437 57347 -85316 -66039 76875 78979 -63622 -90350 52927 102532 -37732 -108494 19374
448 19374 111817 2300 -111853 -21064 112559 42180 -102782 -57794 92969 79512 -74131
459 -74131 -92777 58207 103203 -38298 -106892 16465 108120 6118 -106513 -26450 100173
470 100173 44759 -86105 -58327 71941 71074 -56653 -79538 41055 82558 -26035 -84823
481 -84823 6343 79308 6785 -76512 -20036 68911 27607 -61256 -36534 50507 43644 -41888
493 -41888 -49701 30918 48279 -24434 -50727 12819 48725 -6448 -50453 -1974 47012 8415
505 8415 -41945 -14542 37354 20538 -33485 -24579 29298 27334 -23522 -29990 15402 31304 -9516
518 -9516 -30469 6426 30329 35 -25683 -2988 25812 9872 -20431 -9674 17556 11142
530 11142 -12573 -11172 10430 12162 -7356 -10323 6030 10379 -1545 -6073 3067 6170 -1683 -3841
544 -3841 2810 3719 -2768 -3402 1872 1007 -4475 -1590 5534 1249 -6466 -2245 6918 2547 -8635 -3006
560 -3006 9754 2506 -13235 -7019 11542 7853 -15228 -13073 13662 13953 -15260 -19431 13738 24828
574 24828 -11510 -30672 6588 34167 -1877 -38078 -6326 39176 13116 -42285 -23702 40537
586 40537 33172 -35565 -41236 29130 51066 -19068 -56361 11302 62181 1376 -63066 -14710
598 -14710 62677 29008 -58202 -39934 52578 50851 -42035 -57602 33091 67930 -18517 -70767
610 -70767 8028 72790 6254 -69265 -18796 66560 30477 -63182 -39994 56742 48470 -46622
622 -46622 -55957 37751 63187 -29032 -66561 20416 68648 -10838 -72070 -2281 72307 11123
634 11123 -73919 -22715 69357 31280 -66497 -44524 61564 56431 -56550 -67019 45843 74122
646 74122 -34600 -83985 19205 89479 -7335 -95606 -10222 94746 28165 -91615 -46745
657 -46745 85919 63799 -76144 -77336 63495 90798 -46703 -101739 27341 108705 -8147
668 -8147 -110018 -11351 107059 32309 -99267 -49676 92791 68102 -78312 -78949 63587
679 63587 89960 -44591 -95778 28299 99759 -11805 -99099 -4537 96463 22594 -89712
690 -89712 -35734 84390 48817 -74245 -57163 64994 66955 -54054 -76412 41974 81294
701 81294 -31392 -85615 17702 87293 -5037 -90306 -8595 91081 22230 -88654 -37639
712 -37639 82038 50912 -76309 -66288 65365 76064 -55594 -88588 38585 95636 -22192
723 -22192 -101358 3443 101707 14427 -98947 -32899 92439 49744 -83952 -66096 69888
734 69888 77576 -54595 -87019 37727 92221 -20016 -93557 3499 93938 15529 -87667
745 -87667 -29743 80544 43894 -69328 -53834 58697 62739 -46587 -68147 34851 72739
756 72739 -20314 -72371 9803 73029 2860 -69060 -11134 66536 21216 -62007 -30435 55886
768 55886 38142 -49595 -44716 42215 49911 -34329 -54128 25986 59138 -15714 -61122 5916
780 5916 60826 2940 -60430 -14653 56080 22891 -54171 -33454 46812 40147 -39159 -47247 29155
793 29155 51659 -20364 -55127 10475 54543 -1329 -54647 -11631 50297 19262 -46615 -26681
805 -26681 38992 31637 -31424 -36432 23750 40394 -15509 -40499 8009 38509 -182 -36134
817 -36134 -6519 33441 11287 -29717 -14156 25232 18558 -18259 -19591 15396 22117 -10461 -19176
830 -19176 8117 19525 -2928 -18498 -333 17699 2418 -14830 -3149 12811 5157 -10127
842 -10127 -5833 10048 7571 -7347 -6335 5116 5584 -3214 -5658 1592 4216 -2505 -4219 1202
856 1202 1525 -685 -191 581 -618 -2433 694 4041 -2056 -6404 1088 5364 -2021 -8792 -1341 9534
872 9534 2129 -12564 -4687 11794 6810 -10766 -9645 10671 12700 -10419 -15524 8090 16804 -5064
886 -5064 -19564 1189 20718 1435 -20997 -3160 21764 8038 -20311 -11319 20846 16096 -18579
899 -18579 -17902 16819 21255 -13809 -24301 11618 28399 -7596 -30249 4233 32886 2534 -32593
912 -32593 -6473 34948 12775 -34344 -18800 32830 25728 -29678 -32645 24481 37977 -19092
924 -19092 -42812 12517 47282 -3787 -49857 -5756 50150 15451 -48948 -25930 44167 33305
936 33305 -40456 -42904 31638 49232 -23777 -55244 12550 57201 -2222 -57915 -8671 55933
948 55933 17984 -53695 -28702 47327 35898 -41322 -43725 31910 47521 -23942 -51003 15862
960 15862 53615 -6869 -53199 -1558 52893 10428 -50236 -17467 47630 23833 -44295 -30040
972 -30040 40431 37275 -34632 -42225 30187 48469 -22303 -50936 16201 56207 -6723 -59033
984 -59033 -1761 61320 12050 -60178 -22926 57584 34279 -53080 -44246 48029 54358 -38330
996 -38330 -61754 26706 68335 -13710 -72422 467 72000 11927 -70328 -26697 64198 39110
1008 39110 -57513 -50331 47317 57357 -35231 -63111 22095 66196 -10810 -68014 -2268 64389
1020 64389 12663 -60857 -24735 53947 32270 -48689 -38919 41114 43935 -32706 -47989 24052
1032 24052 51000 -16680 -52791 9477 52305 -2456 -52597 -5592 52668 13411 -51031 -19865
1044 -19865 48810 28186 -43237 -34436 39553 42560 -33404 -48227 26290 53050 -16202 -56027
1056 -56027 6364 58572 4543 -57679 -13650 55922 25420 -49924 -34521 43951 43875 -35530
1068 -35530 -49157 25908 52732 -15254 -55623 4035 55871 5883 -53333 -15490 48399 23966
1080 23966 -42432 -31090 35882 35639 -29489 -40050 20438 40818 -13487 -42873 5096 40854
1092 40854 -151 -39875 -6081 36892 11487 -34455 -16706 30910 20377 -27374 -24047 22361
1104 22361 26077 -19002 -29477 13964 31243 -8854 -32505 3899 32890 2245 -31484 -6761
1116 -6761 31070 12258 -28512 -17275 24953 21780 -20176 -24776 15561 27395 -9514 -27460
1128 -27460 5320 28834 1622 -26516 -5611 24623 10978 -20769 -13617 17233 15852 -13213
1140 -13213 -17075 9525 17858 -5125 -17107 2400 16047 832 -13645 -2314 12268 3838
1152 3838 -10995 -5285 8791 5257 -7833 -6361 5186 5361 -5170 -6134 4288 6105 -3554 -6386
1166 -6386 1661 5657 -948 -6206 -500 4649 -131 -5007 -1970 3110 2335 -2409 -2816 1008 1816 608
1182 608 -409 -1821 -495 2215 1467 -2410 -3840 1549 6268 -490 -7941 -1133 8935 4802 -8078
1197 -8078 -7213 9018 11117 -7037 -12560 5166 15756 -926 -17308 -3074 18176 6918 -16565
1210 -16565 -10175 15537 14884 -12131 -17849 10261 20909 -5526 -21281 974 21537 3104 -21554
1223 -21554 -6759 20306 9392 -18555 -12813 15773 15347 -13647 -17191 11630 17779 -9578 -19209
1236 -19209 6431 20043 -4731 -22710 1195 22404 267 -23320 -4103 23489 8005 -24746
1248 -24746 -12171 24544 16583 -23023 -21496 19580 26118 -16875 -31814 12049 35044 -6087
1260 -6087 -37880 -1470 39543 10006 -38646 -16866 37156 25000 -32231 -31535 26724 38513
1272 38513 -19308 -42493 11327 44510 -2143 -44030 -6099 43623 15059 -39614 -21247 35738
1284 35738 28333 -28805 -32679 22778 35948 -16284 -37477 9658 37871 -3006 -37474 -2574
1296 -2574 36731 8314 -34089 -12213 32189 16514 -29649 -20782 27274 24238 -24969 -28639 20851
1309 20851 31203 -17435 -35116 12501 38017 -7498 -41186 730 42583 6299 -43221 -14612
1321 -14612 41306 21369 -39420 -30187 33978 36601 -28533 -43124 20126 47584 -10880 -49779
1333 -49779 1613 50467 8289 -48668 -17864 45037 26336 -39284 -33859 31837 39173 -23660
1345 -23660 -42338 16006 44997 -6545 -44310 -802 43800 8842 -40058 -14652 36492 20358
1357 20358 -32127 -24445 28001 27917 -22906 -30069 18182 32509 -12459 -33202 8691 34830 -3967
1370 -3967 -34868 -841 34493 6472 -34184 -12251 32340 16508 -30287 -21433 26482 26570 -22740
1383 -22740 -31392 17565 34154 -11677 -36591 4248 36568 2057 -37270 -9500 34864 14913
1395 14913 -32132 -21345 26834 25910 -21840 -29887 16126 31424 -10342 -32453 3433 32023
1407 32023 2286 -31610 -7533 28875 11542 -25491 -15270 21938 18753 -18271 -20768 15033
1419 15033 22407 -10475 -22366 6550 23116 -2698 -23334 60 23018 3615 -21145 -6876
1431 -6876 20510 10795 -17753 -12564 16406 15277 -12940 -16954 9636 19476 -5953 -20215 2483
1444 2483 19561 1272 -18485 -4755 17309 8251 -15430 -10669 12402 12157 -8988 -13499 5503
1457 5503 13260 -3304 -13095 220 11149 1425 -10141 -4048 8185 4424 -6362 -4356 4382
1470 4382 3663 -3377 -3801 1952 2792 -2269 -2487 1406 1019 -2271 -1234 2599 1287 -2983 -1631 3310
1486 3310 2423 -2887 -2860 2650 3629 -2284 -4248 1601 4742 -208 -4137 -632 3732 1608 -2199 -869
1502 -869 2343 1660 -678 -411 362 -250 395 1926 146 -3208 -987 4296 2803 -4488 -4460 4996 7080
1519 7080 -3840 -8976 2714 11250 11 -13022 -3422 13175 6692 -12679 -10603 10999 13722
1532 13722 -8908 -16991 5347 18980 -1262 -20090 -3762 19544 7850 -18795 -12091 15732
1544 15732 14930 -13223 -18627 8822 19955 -5352 -20713 1137 19969 2476 -19102 -5662
1556 -5662 17897 8250 -16391 -10724 13767 11964 -11632 -13380 10075 14404 -8197 -14946 7083
1569 7083 16348 -4408 -16904 2829 18205 -691 -19089 -1221 19777 4653 -20368 -8226
1581 -8226 20955 12543 -19623 -15838 18070 20306 -14621 -23941 11396 27601 -6547 -29613 944
1594 944 30308 5396 -30220 -11692 28827 17260 -26046 -22307 21660 26876 -15993 -30448 10097
1607 10097 31890 -4367 -32523 -2114 31004 7960 -30043 -13995 26694 17603 -22933 -21220
1619 -21220 18036 23675 -13834 -25720 9448 26149 -5947 -26764 651 25749 2664 -25703
1631 -25703 -6215 24478 9158 -22984 -12304 21520 16010 -19362 -18915 17424 21571 -14556 -23924
1644 -23924 10840 26458 -6732 -28491 2465 29893 2997 -28997 -7930 28701 13853 -26302
1656 -26302 -18208 23820 23087 -19276 -26803 14219 29863 -8338 -31110 3041 31526 3239 -30194
1669 -30194 -8947 28800 14468 -25570 -18803 21530 21915 -17320 -24892 12413 26252 -8163 -27673
1682 -27673 2883 27039 1430 -26028 -5770 24314 9103 -22817 -12662 20062 15138 -17978
1694 -17978 -18422 13985 19816 -11359 -21664 7586 22410 -4117 -22943 280 23192 3639
1706 3639 -22309 -7357 20896 10657 -18908 -13809 16562 16390 -13309 -18878 9988 20542 -5968
1719 -5968 -20761 2468 21345 1394 -20013 -4547 19346 8194 -17413 -10664 15147 12877
1731 12877 -12062 -14243 9687 16020 -6702 -16055 4533 16691 -1132 -15871 -1233 15507
1743 15507 3333 -14807 -5414 13472 7307 -12229 -9683 10670 10867 -8706 -11965 6295 12762
1756 12762 -4150 -13727 1580 13855 574 -13933 -3750 12315 5551 -11289 -7966 9428
1768 9428 9216 -7584 -10472 4903 11124 -2304 -11275 -511 10438 2040 -9205 -4159 7305
1781 7305 5149 -5838 -6259 3971 6333 -1691 -5589 188 4805 1178 -3815 -1744 2739 1924 -1229
1796 -1229 -1854 -12 1585 1029 -47 -653 -855 1192 2235 -401 -2027 152 2778 1414 -2943 -2083
1812 -2083 3306 3050 -2256 -3457 1090 3833 -2 -4079 -405 3953 1244 -3137 -1724 2498 2215
1827 2215 -2125 -2074 1156 938 -1453 -958 961 294 -1748 -574 2327 -325 -3233 -46 3926 566
1843 566 -5300 -2461 5684 3715 -6267 -6039 5196 7260 -4366 -9655 2422 11257 -102 -12647
1857 -12647 -2661 12607 5969 -12176 -8916 10915 11695 -8778 -14059 5856 15984 -2192 -16653
1870 -16653 -994 17049 4854 -15490 -7551 14529 11031 -12109 -13218 9859 14789 -6305 -15492
1883 -15492 3571 16026 -324 -15184 -1936 15176 4724 -13753 -6384 12506 8246 -10677
1895 -10677 -9580 9423 10558 -8288 -11594 6742 12343 -5223 -13347 3502 13932 -1741 -14792
1908 -14792 -266 15111 2071 -16035 -4839 15558 7265 -15494 -10689 13969 13045 -12661 -16024
1921 -16024 10101 18609 -7189 -20428 3380 21425 422 -22026 -4965 21291 8915 -20277
1933 -20277 -12847 17959 16539 -14696 -19334 10848 21820 -6790 -22770 2690 23203 1727
1945 1727 -22348 -6065 21065 10097 -19165 -12956 16420 15803 -13110 -17701 10320 19381 -6541
1958 -6541 -19529 3737 19900 -99 -19574 -2832 18984 5243 -17990 -7863 16610 10536
1970 10536 -14767 -12629 13043 14800 -10896 -16057 8572 17444 -5768 -18875 2476 19085 6
1983 6 -19782 -3389 18602 6304 -18174 -9814 16649 12552 -14744 -15323 11981 17131 -8832 -19258
1997 -19258 5422 20195 -2445 -20695 -1491 20056 5431 -18970 -8704 17454 11736 -15274
2009 -15274 -13745 12589 16057 -9443 -17780 6486 18830 -3017 -18638 20 18225 3354
2021 3354 -17045 -5744 16410 8834 -14174 -10809 12295 12914 -9281 -14097 7220 15057 -4481
2034 -4481 -15191 1650 15255 1376 -14458 -3411 13816 5576 -12234 -7169 10837 9005 -9064
2047 -9064 -10307 7230 10970 -5406 -11483 3282 11483 -1453 -11721 -127 11364 1826 -10715
2060 -10715 -3684 9546 5042 -8943 -6233 7704 6883 -6928 -8042 5140 8749 -3711 -9118
2073 -9118 1937 9387 -904 -9207 -776 8935 2285 -8494 -3851 7560 4898 -6440 -6036 5271
2087 5271 6873 -3836 -7484 2544 8004 -557 -7583 -651 7301 2442 -6145 -3044 5344 4242
2101 4242 -3977 -4615 2935 5097 -1214 -4840 221 4533 1017 -3259 -1164 2702 1996 -1665 -2336 675
2117 675 2082 158 -1554 -1061 534 1472 271 -1661 -923 1262 1942 -852 -2730 -82 2907 617
2133 617 -3304 -2223 2746 2742 -2615 -3978 1825 4224 -860 -4678 -443 4693 1430 -4699 -2039 3879
2149 3879 2480 -3624 -3588 2733 3780 -2303 -3865 1552 3985 -765 -3580 714 3734 -392 -3863
2164 -3863 158 4055 -110 -3866 -439 4449 818 -4751 -943 5521 1907 -5461 -2940 5908 4572
2179 4572 -5381 -5921 5684 7475 -4376 -8381 2900 10139 -1066 -11112 -854 11392 3452
2192 3452 -11089 -5890 10499 8305 -9434 -10649 7474 12216 -5002 -13850 1964 14150 467
2205 467 -14556 -3483 13514 5913 -12550 -8651 10539 10765 -8648 -11934 5975 12510 -3788
2218 -3788 -13453 999 13253 907 -12691 -3039 11488 4886 -10415 -6463 9520 7391 -8343
2231 -8343 -8464 6824 9175 -5668 -10065 4268 10607 -3335 -11153 2158 11922 -131 -11938
2244 -11938 -1386 12747 3421 -12388 -5088 12012 7705 -11188 -9718 10055 11927 -8342 -13581
2257 -13581 6041 15355 -3042 -16064 321 16923 3031 -16367 -6169 15520 9526 -13733
2269 -13733 -12353 11260 14557 -8548 -16405 5394 17291 -1928 -17633 -1497 16969 4580
2281 4580 -15923 -7690 13781 9537 -12022 -11569 9658 12903 -7103 -13941 4421 13884 -2227
2294 -2227 -13707 -119 13281 1949 -12972 -3867 11926 5430 -11123 -6902 9807 8173 -8871
2307 -8871 -9388 7743 10439 -6007 -11094 4507 12070 -2384 -12511 699 12950 1396 -12937
2320 -12937 -3508 12374 5948 -11584 -7706 10632 9798 -8478 -11301 6619 12871 -4320 -13581
2333 -13581 1991 14007 827 -13444 -3116 12849 5510 -11625 -7547 10315 9035 -8259
2345 -8259 -10524 6085 11599 -3934 -11930 1784 11662 155 -11489 -2362 10581 4029 -9815
2358 -9815 -5647 8207 6532 -6963 -7671 5021 8117 -3992 -8590 2461 8646 -1115 -8713 -655
2372 -655 8157 1486 -7848 -2657 7171 3947 -6251 -4862 5365 5586 -4393 -6015 3212 6456 -2259
2387 -2259 -6622 1207 6652 273 -6369 -1007 5885 2040 -5008 -2620 4998 3431 -3918 -3891 3227
2402 3227 4303 -2032 -4539 1458 4619 -734 -4426 237 4079 661 -4060 -1384 3604 1658 -3089
2417 -3089 -2139 2556 1997 -2229 -2755 1550 2666 -1064 -2940 438 2558 -11 -2570 -765 2366 830
2433 830 -1954 -1541 1128 1381 -806 -1741 216 1331 93 -1230 -709 567 949 -114 -1290 -571 918
2450 918 1211 -587 -1963 -144 2184 501 -2224 -1297 2117 2367 -1896 -2764 1502 3650 -302 -4032
2466 -4032 -568 4355 1638 -4195 -2622 3801 3600 -2930 -4776 2337 5154 -1115 -5205 203 5530
2481 5530 899 -4939 -1757 4789 2801 -4096 -3406 3403 3947 -2899 -4081 2176 4276 -1537 -4517
2496 -4517 885 4549 -715 -4304 7 4350 323 -4927 -928 5084 1205 -5494 -2188 5319 3000
2511 3000 -5497 -4302 5004 5414 -4785 -6697 3660 7713 -2449 -9001 824 9454 840 -9774
2525 -9774 -3081 9436 4907 -8736 -6777 7798 8834 -5941 -10034 4221 11057 -1719 -11537
2538 -11537 -281 11480 2624 -10805 -4824 9818 7015 -8085 -8242 6892 9500 -4555 -9811
2551 -9811 3024 10071 -895 -10143 -657 9749 2129 -8869 -3237 8359 4462 -7640 -5183
2564 -5183 6971 5962 -5990 -6441 5216 7287 -4355 -8055 3467 8389 -2371 -9354 1073
2577 1073 9747 316 -10258 -2111 10290 3533 -10033 -5801 9449 7415 -8380 -9442 6667
2590 6667 10735 -4948 -12137 2438 12601 32 -12974 -2587 12478 5134 -11572 -7493 10100
2603 10100 9574 -8371 -10726 6044 11565 -3560 -12150 1097 12371 1048 -11647 -2942 10865
2616 10865 4986 -9411 -6173 8114 7595 -6723 -8232 5454 8838 -3866 -8792 2489 9223
2629 9223 -955 -8865 61 9290 1447 -8638 -2722 8360 3850 -7625 -4821 7149 6159 -6289
2643 -6289 -7529 5098 8274 -3784 -8953 2538 9620 -533 -9493 -1257 9549 2732 -9306
2656 -9306 -4449 7999 5948 -7307 -7254 5644 7846 -4294 -8725 2478 8843 -928 -8947 -916
2670 -916 8380 2233 -7910 -3381 6892 4417 -6160 -5440 4964 6206 -3602 -6394 2678 6714
2684 6714 -1517 -6853 567 6800 627 -6178 -1738 6200 2797 -5458 -3357 4888 4241 -4005 -4765
2699 -4765 3524 5485 -2193 -5502 1348 5666 -100 -5589 -725 5442 1449 -5003 -2381 4265 3398
2714 3398 -3426 -3730 2483 3885 -1713 -3691 806 3924 13 -3605 -536 3146 984 -2711 -1499
2729 -1499 1821 1443 -1884 -1592 1198 1439 -792 -1308 582 1072 -634 -1227 580 756 -658 -843 433
2746 433 758 -588 -985 590 1219 -399 -1222 422 1140 -127 -1269 -377 1355 354 -1080 -527 738
2763 738 690 -545 -951 205 699 -25 -203 57 -135 266 220 104 -478 -273 895 671 -1292 -1205 1264
2782 1264 1896 -598 -2304 292 2995 480 -3190 -1329 3090 2173 -3039 -3081 2458 4115 -1750 -4541
2798 -4541 627 4854 537 -5070 -1685 4856 2577 -4420 -3696 3375 4526 -2716 -5404 1695 5387
2813 5387 -498 -5350 -560 5132 1500 -4846 -2323 4203 2892 -3833 -3367 2940 3556 -2431 -4060
2828 -4060 2069 4183 -1304 -4219 987 4706 -637 -4697 137 4914 560 -5223 -1336 5425 2054
2843 2054 -5366 -3092 5301 4021 -4873 -5018 4290 6278 -3241 -6934 2216 7679 -800 -8025 -943
2858 -943 8552 2610 -7990 -4268 7340 5806 -6159 -7015 4937 8111 -3376 -8741 1586 9174
2872 9174 175 -9094 -2014 8322 3395 -7667 -4867 6638 5684 -5480 -6648 4379 7042 -3064
2886 -3064 -7540 1828 7513 -688 -7660 -399 7189 1407 -7057 -2586 6759 3274 -6283 -4270 5796
2901 5796 5264 -5030 -5791 4405 7024 -3417 -7490 2368 8226 -974 -8267 -333 8592 1881 -8522
2916 -8522 -3379 7828 5015 -7135 -6544 6175 7819 -4609 -8385 3052 9006 -1290 -9383 -447
2930 -447 9320 2185 -8709 -3656 7761 5050 -6627 -6262 5732 7058 -4271 -7452 2713 7852
2944 7852 -1174 -7946 9 7973 889 -7483 -2108 6615 3171 -6263 -4225 5608 4967 -4830 -5438
2959 -5438 3882 6150 -3068 -6638 1792 7028 -940 -7140 -423 7024 1771 -6915 -2769 6391 3727
2974 3727 -5702 -4970 4759 5853 -3789 -6488 2497 6649 -1294 -6737 205 6861 1239 -6369 -2151
2989 -2151 5806 3292 -4981 -3859 4245 4707 -3120 -4867 2430 4995 -1297 -4896 703 4716 276
3004 276 -4657 -739 4455 1615 -4057 -2093 3760 2590 -3313 -3134 2795 3332 -2151 -3729 1758 3860
3020 3860 -994 -4221 370 4254 276 -4062 -1329 3753 1685 -3632 -2570 2924 2965 -2290 -3506
3035 -3506 1615 3614 -782 -3724 -92 3365 707 -3087 -1427 2440 1865 -2072 -2174 1398 2253 -801
3051 -801 -2113 72 1904 515 -1386 -726 995 999 -474 -919 300 644 -5 -454 -79 -24 553 546 -324
3070 -324 -509 132 951 270 -603 -529 663 907 -719 -968 427 1327 -197 -1080 45 1364 310 -1098
3088 -1098 -613 927 710 -601 -530 745 590 -628 -440 396 220 -500 -327 560 197 -958 -316 1066
3106 1066 529 -1177 -841 1438 1228 -1703 -1964 1473 2198 -1060 -3098 252 3279 302 -3684 -1048
3122 -1048 3741 1845 -3345 -2800 2886 3790 -2275 -4363 1597 4650 -407 -4847 -480 4996 1605
3137 1605 -4722 -2682 4200 3499 -3498 -4231 2665 4490 -1678 -4760 1080 4932 65 -4826 -1038
3152 -1038 4689 1707 -4375 -2199 3931 2892 -3443 -3256 2841 3862 -2718 -3995 2149 4343 -1457
3167 -1457 -4748 699 5001 -280 -5033 -589 5086 1215 -5263 -2239 4944 3001 -4793 -3954 4007
3182 4007 4728 -3342 -5747 2373 6244 -1459 -6581 173 6800 1063 -6769 -2615 6367 3509 -5829
3197 -5829 -4636 4647 5525 -3860 -6691 2795 6783 -1464 -7133 250 7016 1142 -6884 -2162 6546
3212 6546 3237 -5770 -4256 5032 5355 -4090 -5659 3158 6326 -2191 -6410 1242 6610 33 -6606
3227 -6606 -909 6468 1937 -6039 -2966 5553 4029 -5131 -4690 4404 5537 -3446 -6208 2465 6623
3242 6623 -1287 -6757 79 6766 1043 -6692 -2186 6243 3494 -5736 -4482 4774 5135 -4033 -5846
3257 -5846 2770 6376 -1883 -6743 544 6534 337 -6472 -1584 5946 2545 -5623 -3436 4962 4154
3272 4154 -4214 -4675 3487 5106 -2551 -5446 1618 5708 -613 -5868 -398 5667 1300 -5448 -2138
3287 -2138 5387 3093 -4727 -3654 3970 4338 -3368 -5068 2447 5774 -1535 -5691 483 5639 638
3302 638 -5463 -1619 5339 2686 -4657 -3365 3960 4017 -2981 -4502 2088 4718 -1499 -4705 269 4508
3318 4508 324 -4386 -1314 3927 1654 -3509 -2069 2836 2449 -2615 -2846 1974 2889 -1583 -2915 754
3334 754 2815 -484 -3235 108 2999 318 -2861 -672 2674 1074 -2436 -1443 2555 1673 -2170 -2133
3350 -2133 1483 2414 -1371 -2641 801 2790 -604 -2721 108 2574 908 -2572 -1282 2060 1440
3365 1440 -1790 -1807 1307 2197 -731 -2069 480 1996 336 -1663 -599 1446 1182 -689 -1000 447
3381 447 1151 -163 -826 -204 826 684 -511 -659 -22 737 321 -503 -660 96 759 124 -944 -401 951
3400 951 905 -1063 -1117 473 1135 -421 -1402 199 1612 136 -1577 -672 1356 1060 -1282 -1432 974
3417 974 1405 -829 -1564 309 1503 -350 -1672 131 1698 327 -1463 -130 1539 344 -1541 -337
3433 -337 1574 787 -1594 -760 1571 1205 -1320 -1458 1674 1974 -1343 -2253 1250 2784 -912 -3195 205
3450 205 3443 283 -3496 -886 3680 1673 -3330 -2394 3029 3100 -2547 -3707 1851 4217 -1143 -4652
3466 -4652 366 4696 775 -4697 -1645 4418 2507 -4070 -3498 3211 3713 -2842 -4466 1900 4848
3481 4848 -1073 -4838 98 4789 587 -4908 -1623 4521 2236 -4307 -2912 3778 3308 -3200 -3915
3496 -3915 2593 4358 -1855 -4413 1030 4533 -589 -5003 -62 4736 907 -4419 -1442 4424 2403
3511 2403 -3955 -3056 3984 3778 -3207 -4366 2633 4709 -1805 -5258 858 5498 115 -5684 -896
3526 -896 5770 2276 -5393 -2939 4803 3870 -4180 -4774 3419 5403 -2524 -5826 1610 5963 -167 -6026
3542 -6026 -746 6045 1871 -5590 -2719 5203 3622 -4288 -4640 3549 4976 -2798 -5437 1813 5384
3557 5384 -951 -5714 -193 5805 966 -5569 -1909 4842 2717 -4447 -3597 4023 4259 -3280 -4521
3572 -4521 2554 5256 -1602 -5380 503 5668 207 -5273 -1041 5084 2025 -4660 -2770 4276 3515
3587 3515 -3533 -4000 2893 4314 -2013 -4731 1196 4967 -502 -4857 -348 4814 1097 -4617 -1716
3602 -1716 4132 2476 -3689 -2992 3230 3521 -2508 -3706 1980 4126 -1150 -4011 525 4164 48
3617 48 -4391 -1121 4073 1570 -3824 -2270 3404 2768 -3063 -3357 2318 3771 -1646 -3964 926 3998
3633 3998 -332 -4244 -473 3911 1207 -3810 -2009 3156 2518 -2780 -2781 2260 3214 -1276 -3325 603
3649 603 3171 116 -3119 -634 2838 1011 -2461 -1214 2096 1687 -1686 -1662 1343 2088 -752 -1847
3665 -1847 620 1780 -109 -1490 109 1568 286 -1365 -177 1269 260 -1157 -177 1052 389
3680 389 -987 -573 1121 713 -935 -980 677 999 -589 -1133 498 1289 -249 -1253 -201 1069 281
3697 281 -1395 -660 973 629 -764 -926 171 1052 -1 -930 -307 618 345 -430 -675 81 543 52
3715 52 -507 -531 455 708 -108 -803 -381 713 577 -743 -1054 607 1292 -400 -1518 -12 1650 759
3733 759 -1775 -1068 1529 1449 -1134 -1744 837 2158 -362 -2178 17 2256 800 -2186 -1080 2034
3749 2034 1641 -1618 -1729 1505 1898 -919 -2016 575 2187 -352 -2224 -103 2031 269 -1834 -482
3765 -482 1817 1090 -1869 -1149 1715 1479 -1531 -1554 1345 1854 -1291 -2086 1150 2247 -879 -2633 545
3782 545 2979 -207 -3161 -279 3216 842 -3352 -1726 3167 2192 -2745 -2947 2266 3472 -1726 -3794
3798 -3794 893 4392 -16 -4369 -886 4356 1543 -4010 -2364 3719 3085 -2929 -3664 2502 4152
3813 4152 -1502 -4509 784 4577 106 -4310 -917 4214 1579 -3986 -2243 3271 2850 -2904 -3208
3828 -3208 2532 3523 -1591 -3603 1242 3705 -692 -4046 32 4050 600 -3951 -1188 3996 1643
3843 1643 -3809 -2235 3274 2819 -2921 -3433 2436 3927 -1763 -4236 973 4582 -343 -4732 -531
3858 -531 4652 1236 -4610 -2030 4278 2772 -3674 -3499 3016 4079 -2226 -4483 1666 4560 -657
3873 -657 -4738 -173 4725 1144 -4382 -1966 4255 2507 -3648 -2987 3036 3651 -2264 -3949 1887 4241
3889 4241 -1036 -4386 362 4495 388 -4281 -1050 4209 1675 -3664 -2315 3446 3008 -3032 -3399
3904 -3399 2475 3908 -1734 -4021 982 4411 -83 -4227 -396 4256 1463 -3708 -2132 3397 2423
3919 2423 -2810 -2772 2370 3242 -1704 -3616 1117 3605 -683 -3319 -242 3372 541 -3215 -1085 2739
3935 2739 1327 -2552 -1829 1949 2065 -1777 -2505 1595 2549 -1222 -2729 812 2982 -379 -2891 -31
3951 -31 3001 593 -3066 -938 2790 1381 -2395 -1897 2118 2340 -1686 -2751 1258 2834 -700 -2916
3967 -2916 133 3161 451 -2897 -1175 2410 1771 -2004 -2128 1663 2451 -949 -2289 370 2135 81
3983 81 -2256 -486 1853 919 -1569 -1140 930 1235 -733 -1441 312 908 -127 -845 -193 552 30 -236
4001 -236 -207 377 -48 -115 47 74 -184 42 251 -20 -525 -419 461 387 -422 -797 326 876 15 -1014 -176
4022 -176 824 486 -788 -584 507 777 -420 -754 129 689 232 -428 -415 574 679 -226 -569 6 284
4041 284 492 9 -520 21 491 459 -351 -717 120 1186 149 -1244 -473 1467 763 -1079 -1214 816
4059 816 1821 -672 -1877 346 2238 602 -2267 -973 1974 1446 -1849 -2020 1219 2326 -741 -2668
4075 -2668 202 2566 331 -2736 -955 2367 1158 -2234 -1723 1697 1785 -1373 -1902 879 2221 -487
4091 -487 -2323 85 2307 -16 -2200 -440 1932 834 -1900 -892 1804 1180 -1619 -1192 1754 1566
4107 1566 -1513 -1829 1489 2057 -1217 -2361 980 2550 -535 -2969 208 3354 643 -2916 -1245
4122 -1245 2822 1669 -2870 -2437 2465 3039 -1914 -3516 1145 3687 -523 -4000 -181 3956 818
4137 818 -3820 -1508 3473 2237 -2981 -2863 2626 3269 -1947 -3563 1398 3765 -549 -3783 -112 3548
4153 3548 530 -3542 -1402 3343 1815 -3063 -2104 2461 2749 -2072 -2897 1640 3116 -1111 -3426 659
4169 659 3650 -200 -3500 -383 3389 1132 -3442 -1580 3335 2194 -2674 -2869 2434 3088 -1814 -3387
4185 -3387 1501 3726 -830 -3608 87 4040 608 -3746 -1232 3537 1878 -3232 -2111 2766 2839
4200 2839 -2190 -3177 1602 3552 -1065 -3589 733 3617 45 -3487 -855 3320 1181 -3088 -1576
4215 -1576 2789 2232 -2491 -2711 2052 2897 -1813 -3374 1061 3410 -535 -3662 -117 3596 630 -3543
4231 -3543 -1316 3268 2130 -2622 -2318 2190 2734 -1749 -3252 1121 3257 -620 -3361 -194 3184
4246 3184 619 -3077 -1161 2613 1563 -2290 -2027 1770 2078 -1336 -2240 892 2310 -513 -2333 66
4262 66 2294 165 -2104 -351 1973 665 -1602 -740 1404 952 -1488 -1128 1404 1359 -1433 -1390 1295
4279 1295 1850 -853 -1730 419 2056 -239 -2127 -27 2127 532 -2214 -954 1787 1415 -1692 -1906
4295 -1906 1237 1825 -763 -1981 212 1947 -66 -1958 -669 1965 776 -1377 -1355 1090 1451 -773
4311 -773 -1669 166 1488 121 -1495 -636 1093 818 -791 -828 269 770 -166 -588 -271 654 359 -130
4329 -130 -431 -260 306 456 -317 -481 147 484 219 -580 -481 461 758 -341 -764 13 907 203 -767 -428
4349 -428 630 421 -567 -740 380 733 -155 -600 -48 594 -31 -238 -335 259 281 -243 -220 125 -71 237
4369 237 384 -36 -309 -191 379 490 -574 -738 344 648 -434 -1404 93 1302 244 -1492 -524 1317
4387 1317 976 -1327 -1536 933 1775 -517 -2183 53 2138 231 -2255 -797 2122 1538 -1921 -1576
4403 -1576 1471 2167 -904 -2381 654 2512 79 -2448 -426 2361 975 -2095 -1133 2041 1552 -1824
4419 -1824 -1695 1490 1868 -936 -2062 857 2217 -486 -1968 29 2157 230 -2065 -407 2198
4434 2198 644 -2017 -980 1871 1261 -1829 -1564 1555 1818 -1379 -2290 1164 2468 -771 -2546 166
4450 166 2706 304 -3026 -746 2703 1361 -2333 -1749 2347 2343 -1920 -2573 1520 2970 -896 -3178
4466 -3178 256 3218 329 -3314 -866 3185 1384 -2665 -1904 2657 2244 -2032 -2813 1559 2845 -1101
4482 -1101 -3017 570 3271 -256 -3057 -507 3212 1021 -2946 -1495 2659 1870 -2316 -2265 1813 2736
4498 2736 -1618 -2887 986 3146 -349 -3013 14 3099 585 -3090 -1055 3018 1481 -2650 -1923
4513 -1923 2094 2253 -1811 -2679 1424 2813 -876 -2897 200 3020 212 -2966 -653 2981 1029
4528 1029 -2753 -1470 2287 1781 -1995 -2349 1705 2346 -1194 -2563 859 2792 -351 -2493 -8 2691
4544 2691 451 -2658 -908 2556 1321 -2108 -1640 2055 2263 -1582 -2453 1237 2709 -875 -2759 487
4560 487 2755 -3 -2815 -750 2606 1439 -2398 -1570 1870 1952 -1426 -2404 1236 2211 -743 -2522
4576 -2522 99 2383 396 -2140 -689 1947 1029 -1654 -1096 1286 1366 -860 -1419 820 1484 -464
4592 -464 -1463 181 1410 -132 -1347 60 1278 194 -1424 -289 1242 558 -1170 -666 1076 707
4608 707 -910 -943 785 987 -868 -1274 607 1321 -153 -1357 108 1572 164 -1520 -250 1238
4624 1238 616 -1283 -991 881 1042 -692 -1112 351 1356 -89 -974 -362 1058 487 -916 -842 553
4641 553 832 -241 -782 118 614 174 -538 -320 458 297 -201 -436 -40 306 272 -273 -227 -90 572 164
4661 164 -298 -190 372 471 -336 -723 113 688 73 -710 -328 560 516 -545 -609 469 667 -130 -766 131
4681 131 767 -107 -885 -139 538 316 -729 -170 546 341 -400 -491 470 427 -500 -551 425 426 -456 -589 489
4702 489 741 -533 -665 367 875 -175 -1206 224 1228 -81 -1096 -133 1400 452 -1349 -888 1338
4719 1338 1239 -1053 -1151 990 1634 -663 -1705 443 2048 52 -2172 -475 2089 981 -1993 -1188
4735 -1188 1720 1601 -1531 -1836 739 2115 -479 -2337 269 2203 128 -2027 -513 1932 855
4750 855 -1875 -1358 1653 1554 -1254 -1901 1151 1994 -906 -2151 497 2205 -45 -2121 -212 2193
4766 2193 625 -2116 -938 1946 1020 -1770 -1351 1593 1796 -1335 -1990 1063 2315 -598 -2164 350
4782 350 2506 7 -2511 -473 2367 847 -2274 -1421 2232 1726 -1859 -2051 1522 2399 -977 -2496
4798 -2496 729 2736 -237 -2745 -457 2754 579 -2667 -1104 2436 1377 -2020 -1875 1826 2184
4813 2184 -1466 -2302 876 2681 -396 -2673 -110 2654 358 -2660 -1103 2316 1179 -2258 -1383
4828 -1383 1877 1914 -1762 -2194 1223 2292 -814 -2823 456 2507 143 -2625 -566 2385 1065 -2191
4844 -2191 -1335 1906 1663 -1503 -1988 1290 2060 -994 -2451 713 2177 -21 -2279 -179 2257 812
4860 812 -2082 -868 1859 1315 -1675 -1420 1601 1637 -1117 -1843 926 1883 -496 -1915 61 1975 26
4877 26 -2094 -419 2056 590 -1942 -896 1624 1073 -1433 -1377 1257 1570 -1115 -1789 537 1850 -240
4894 -240 -1972 -187 1951 551 -1698 -885 1449 1058 -1314 -1406 1072 1594 -705 -1713 560 1660
4910 1660 -160 -1599 -286 1344 428 -1321 -804 1008 967 -1101 -1161 623 875 -405 -958 238 1045
4927 1045 -260 -899 98 712 -26 -735 -45 931 315 -438 -313 529 417 -627 -241 524 403 -373 -298
4946 -298 303 565 -569 -553 403 623 -49 -790 -108 566 91 -629 -93 663 159 -278 -527 69 427 -172
4966 -172 -483 -29 381 184 -505 -286 217 101 -125 -337 115 338 297 -254 -303 43 266 52 -375 -326 401
4987 401 442 -149 -397 112 534 85 -633 -187 496 537 -411 -505 417 930 -290 -873 105 965 125 -1081
5007 -1081 -385 1088 650 -804 -701 744 657 -450 -945 501 937 -10 -975 147 1093 82 -1082
5024 -1082 -89 1038 247 -782 -460 791 763 -707 -653 610 807 -754 -964 459 917 -402 -1233 183
5042 183 1166 -118 -1411 -140 1260 475 -1411 -635 1372 957 -1274 -1195 1015 1297 -875 -1565 663
5059 663 1724 52 -2094 -276 1735 324 -2005 -1029 1772 1132 -1336 -1403 1114 1602 -1000 -1673 843
5076 843 2030 -185 -2001 -55 1949 523 -1786 -619 1643 997 -1423 -1247 1278 1322 -773 -1414
5092 -1414 842 1764 -511 -1789 200 1931 89 -1786 -325 1951 747 -1805 -1059 1687 1394 -1618
5108 -1618 -1620 1228 1633 -864 -2056 513 2138 -362 -2132 116 2136 409 -2345 -859 1918 1274
5124 1274 -1861 -1541 1701 1602 -1259 -2155 801 2071 -591 -2234 116 2312 234 -2242 -524 1829
5140 1829 1095 -1799 -1220 1567 1636 -1366 -1878 1049 1829 -696 -1896 509 2023 29 -2055 -101
5156 -101 1888 506 -1972 -922 1957 1225 -1652 -1478 1355 1922 -943 -1886 621 2058 -353 -1936
5172 -1936 -10 2002 40 -2066 -689 1811 963 -1583 -1098 1459 1464 -843 -1656 568 1826 -354
5188 -354 -1742 -156 1451 184 -1590 -423 1547 833 -1240 -838 1161 899 -855 -1181 941 1230
5204 1230 -662 -1101 410 1237 -410 -1339 125 1361 -21 -1110 -683 1306 645 -1329 -906 1007
5220 1007 835 -1153 -971 831 1217 -536 -1350 282 1477 -62 -1232 -179 1380 427 -1080 -627
5236 -627 1137 862 -999 -1087 529 1307 -353 -992 98 1143 94 -978 -291 785 613 -693 -744
5253 -744 627 883 -195 -522 86 699 67 -293 60 260 -142 -396 -109 129 163 -154 -26 -1 17 -96
5273 -96 86 138 -180 -277 79 171 -319 -273 -28 204 142 -485 -220 180 287 -256 -274 128 302 -44 -360 -42
5295 -42 263 275 -258 -199 208 80 -92 23 33 132 85 89 -15 -99 51 304 205 -350 -125 379 182 -249 -219 430
5319 430 535 -179 -580 182 749 -6 -713 -295 770 476 -914 -650 811 889 -720 -979 317 1054 -240
5338 -240 -1134 -156 928 276 -1016 -528 817 464 -809 -720 618 909 -502 -1187 528 953 -217 -1067
5356 -1067 -89 1062 -132 -957 -382 956 575 -898 -663 887 979 -736 -827 566 886 -596 -971 433
5374 433 1066 -60 -1281 71 1433 429 -1259 -380 1303 489 -1327 -894 1105 1143 -964 -1429 692
5391 692 1451 -536 -1660 233 1674 346 -1737 -462 1595 734 -1312 -999 1401 1285 -1021 -1448
5407 -1448 857 1543 -473 -1639 355 1568 97 -1785 -436 1614 504 -1419 -824 1387 814 -1530
5423 -1530 -1326 1152 1577 -1016 -1629 756 1919 -254 -1673 45 1785 93 -1843 -467 1712 884
5439 884 -1573 -1238 1480 1519 -1109 -1569 775 1773 -487 -1897 325 2008 252 -1801 -635 1547
5455 1547 849 -1574 -860 1472 1320 -1085 -1441 808 1647 -486 -1693 243 1592 79 -1693 -304
5471 -304 1717 593 -1603 -830 1508 816 -1265 -844 1120 1422 -910 -1149 842 1373 -674 -1568 252
5488 252 1644 -26 -1899 -313 1746 569 -1672 -900 1179 1308 -1098 -1269 1228 1300 -640 -1620 150
5505 150 1732 -50 -1720 -517 1585 757 -1336 -990 1290 1079 -851 -1284 909 1273 -325 -1357
5521 -1357 124 1196 102 -1234 -430 1011 555 -1011 -707 820 410 -644 -542 439 687 -578 -781
5538 -781 612 718 -461 -602 49 819 -314 -833 36 1072 80 -737 -328 912 402 -1173 -572 668
5556 668 734 -696 -815 627 1025 -278 -824 -59 1088 249 -1222 -579 763 479 -617 -781 421 777
5574 777 -419 -819 137 668 30 -800 -340 657 195 -518 -500 301 408 -72 -279 -79 525 -31 -144 -253
5594 -253 124 120 108 -217 -277 58 117 112 -206 -337 163 194 -62 -168 -101 180 20 -215 -224 159 96 -146 -240 1
5618 1 312 -103 -355 177 443 51 -178 92 239 -21 -168 -78 158 134 -86 148 212 -287 -151 68 228 -56
5640 -56 -410 27 456 26 -449 -197 674 313 -522 -461 474 595 -395 -587 382 762 -114 -1002 -313 916
5660 916 389 -1097 -636 737 648 -729 -991 456 879 -417 -1156 232 1141 128 -1163 -480 1142
5677 1142 431 -859 -508 968 877 -696 -945 312 930 -361 -1024 413 1033 -206 -1174 -72 1119
5694 1119 190 -1268 -400 1150 687 -861 -637 808 1030 -676 -1184 645 1391 -540 -1346 315 1273
5711 1273 -30 -1460 -369 1345 485 -1408 -917 1165 1027 -1219 -1241 885 1396 -603 -1548 221 1443
5728 1443 -126 -1519 -236 1619 498 -1125 -730 1103 690 -1342 -1083 856 1220 -814 -1308 590
5744 590 1355 -292 -1230 13 1566 145 -1529 -292 1540 750 -1460 -932 1282 1144 -1061 -1245 909
5761 909 1409 -701 -1660 352 1698 -78 -1788 -329 1731 549 -1458 -970 1387 1238 -1346 -1338 930
5778 930 1474 -768 -1505 384 1730 -131 -1491 -293 1477 486 -1296 -813 1283 931 -1133 -931 812
5795 812 1143 -925 -1135 478 1273 -265 -1257 1 1143 24 -1129 -260 1143 425 -1171 -523 1232
5812 1232 669 -1065 -748 840 996 -656 -1334 445 1244 -434 -1436 234 1367 195 -1190 -582
5828 -582 1238 651 -1387 -987 933 1171 -870 -1336 582 1395 -205 -1400 -21 1435 311 -1254
5844 -1254 -657 963 823 -912 -970 577 1038 -434 -1006 200 1128 -235 -982 -63 655 195 -783 -408
5862 -408 695 490 -579 -335 334 297 -494 -334 477 434 -210 -394 186 535 -158 -595 186 640 -205 -562
5882 -562 110 739 -88 -728 -287 426 374 -601 -688 138 484 -259 -714 215 591 157 -605 -172 648 430 -417
5903 -417 -282 406 492 -278 -513 251 331 10 -286 -55 348 240 -150 -208 22 144 18 -177 27 -83 92
5924 92 -79 -37 -127 162 168 -207 -191 93 339 206 -391 -185 372 90 -302 -262 121 220 -124 -315 146 449 15
5947 15 -327 174 205 113 -308 -88 117 208 -665 -303 471 396 -383 -347 162 363 -291 -608 46 344 -76 -443
5969 -443 147 453 67 -511 -49 534 66 -459 -136 612 437 -613 -525 664 537 -513 -760 350 928
5988 928 -130 -826 -35 781 297 -826 -253 967 603 -850 -766 759 827 -686 -1010 301 1017 -255
6006 -255 -946 61 1182 315 -1213 -269 1180 485 -979 -613 834 911 -841 -1102 592 1065 -362
6023 -362 -1082 67 1268 -164 -1272 -369 1599 514 -1191 -669 1271 1033 -991 -1039 742 1293 -720
6040 -720 -1397 379 1391 -262 -1494 -19 1280 272 -1397 -590 1369 804 -1014 -889 971 1140
6056 1140 -831 -1067 464 1357 -294 -1274 92 1337 80 -1260 -248 1294 790 -1086 -644 983
6072 983 913 -1023 -937 876 1270 -591 -1462 500 1548 -214 -1651 -35 1452 417 -1453 -515 1397
6089 1397 772 -1428 -1083 945 1191 -1089 -1411 613 1700 -268 -1804 26 1658 167 -1563 -530
6105 -530 1397 978 -1124 -1083 956 1140 -675 -1264 480 1531 -292 -1593 -87 1470 342 -1122
6121 -1122 -597 1226 746 -898 -844 1027 919 -850 -901 633 861 -432 -1101 457 1311 -63 -944 -125
6139 -125 1173 106 -990 -186 1150 416 -806 -527 988 837 -760 -842 505 946 -548 -1395 155
6156 155 1075 -107 -1294 -278 1285 312 -1209 -634 843 1019 -733 -1264 743 1107 -477 -1318 124
6173 124 1190 149 -1023 -487 1009 666 -753 -626 654 907 -498 -633 142 933 -225 -679 -177
6190 -177 623 217 -615 -268 491 105 -391 -468 301 247 -401 -98 368 193 -270 -276 166 290 -179 -212 215 352
6212 352 -97 -310 5 500 -120 -559 189 348 193 -354 -77 390 150 -388 -350 194 292 43 -374 104 404
6233 404 106 -332 -145 326 93 -249 -26 189 263 -87 -239 -153 8 117 -46 -105 101 304 35 -119 35
6254 35 -8 320 -41 -436 -43 215 221 -318 -344 489 361 -148 -403 -48 342 79 -495 -209 433 395 -485 -460
6276 -460 494 530 -316 -530 309 566 -141 -592 -156 770 175 -680 -192 486 435 -521 -499 503 409 -457 -294
6297 -294 246 564 -64 -668 28 768 210 -712 -190 698 263 -744 -461 654 372 -477 -623 569 643
6316 643 -666 -948 572 746 -291 -1040 190 1110 60 -972 -176 863 462 -849 -618 898 730
6333 730 -601 -973 758 1316 -503 -1234 486 1060 -104 -1285 -331 1438 551 -1063 -689 925 783
6350 783 -1032 -929 624 989 -564 -1366 204 1392 -159 -1254 -85 1233 376 -1160 -464 1251
6366 1251 675 -864 -860 1063 990 -775 -1161 470 1115 -246 -1267 49 1379 132 -1319 -372 1182
6383 1182 565 -1161 -759 883 937 -919 -927 558 1170 -564 -1113 322 1354 -117 -1235 -34 1239
6400 1239 543 -1248 -635 1088 511 -1072 -916 726 776 -862 -984 511 1057 -499 -1150 380 1314
6417 1314 43 -1420 -390 1359 530 -1093 -708 1109 892 -921 -1312 752 1358 -360 -1418 119
6433 119 1455 -130 -1264 -292 1325 746 -1169 -796 1147 1071 -714 -1307 671 1309 -321 -1180 248
6450 248 1304 38 -1059 -385 1030 540 -963 -714 640 588 -743 -822 513 722 -527 -580 344 781
6468 781 -270 -897 272 859 -95 -757 -163 761 171 -693 -340 934 406 -709 -741 525 613 -471 -742
6487 -742 483 871 -107 -991 25 904 189 -975 -258 966 585 -831 -719 537 970 -410 -942 334
6505 334 1040 -2 -874 82 750 355 -735 -689 529 620 -322 -620 392 705 43 -466 -9 525 37
6524 37 -281 -77 436 -124 25 -34 100 234 -15 49 13 141 99 -197 -91 -116 -225 -38 17 2 -45 158 107
6547 107 246 -271 -138 223 209 -170 -313 181 165 50 -197 -63 128 152 -203 -256 184 204 -76 -106 -1 83
6569 83 -106 4 -23 -3 58 -1 165 -393 18 87 152 -123 -126 245 254 -247 -293 57 435 74 -429 -294 446 212
6593 212 -310 -416 412 477 -233 -624 156 674 -10 -711 19 735 197 -644 -403 624 466 -460 -673 350
6613 350 718 -159 -711 -83 609 153 -548 -213 446 392 -600 -338 565 605 -639 -745 309 657 -334 -743
6633 -743 233 652 -98 -854 -250 811 33 -896 -172 709 487 -898 -406 931 443 -513 -848 441 1141
6652 1141 -279 -915 179 1102 108 -849 -189 1163 238 -934 -447 840 661 -777 -800 542 1022 -404
6670 -404 -1165 350 1103 -36 -1164 -167 1256 294 -1147 -594 1049 584 -957 -729 795 978 -652
6687 -652 -1058 520 1064 -337 -1260 128 1191 -34 -1146 -364 1189 468 -1123 -693 775 910 -723
6704 -723 -913 589 1263 -362 -1285 67 1254 34 -1011 -438 1247 541 -1188 -880 1131 1005 -880
6721 -880 -873 528 1082 -531 -1237 248 1206 -207 -981 -208 1076 98 -907 -458 1092 534 -847 -698
6739 -698 761 822 -689 -855 475 1072 -545 -1087 175 928 202 -1065 -160 1024 349 -1098 -449 1029
6757 1029 717 -951 -850 680 950 -654 -1148 428 1144 -237 -1293 -81 957 316 -918 -622 970
6774 970 653 -887 -1115 517 1199 -410 -1010 95 857 -50 -1045 -253 839 361 -658 -317 619 526
6792 526 -422 -579 319 487 -298 -515 298 568 -198 -599 122 617 -133 -584 64 632 169 -774 -52 631
6812 631 156 -384 -287 644 510 -417 -515 488 612 -332 -632 190 776 320 -827 -279 668 768 -669 -531
6832 -531 207 543 -386 -648 48 681 -53 -476 152 415 188 -508 -212 258 310 -187 -359 -82 345 -229
6852 -229 -379 -42 149 -19 -191 -98 -89 156 -126 -72 -94 -78 -50 -115 -13 134 2 286 -73 -172 -54 237 105
6875 105 -148 -161 -17 130 -15 -8 193 212 164 -45 -187 379 171 -178 -11 205 124 32 -122 -49 93 -226 -176
6898 -176 81 292 -167 39 381 137 -418 -28 -10 37 -380 -60 235 394 -237 -424 182 462 -46 -511 -3
6919 -3 703 77 -442 -367 506 173 -561 -388 402 588 -264 -488 7 580 76 -590 -275 585 353 -721 -387
6940 -387 783 568 -495 -650 631 683 -352 -587 132 677 30 -593 50 709 383 -628 -229 703 442
6959 442 -715 -436 635 650 -522 -639 594 901 -262 -735 48 829 33 -997 -287 885 303 -966
6977 -966 -519 827 460 -643 -961 528 959 -367 -1066 -27 858 -55 -905 -260 1002 377 -991 -397
6995 -397 832 428 -863 -707 203 793 -471 -885 409 954 -150 -934 64 805 33 -1023 -378 963
7013 963 335 -962 -457 872 650 -725 -832 733 1005 -383 -1005 353 1119 -147 -1310 -182 1259
7030 1259 432 -1056 -478 1027 666 -759 -647 642 927 -286 -1230 242 1281 -168 -1173 -45
7046 -45 1000 232 -1082 -538 819 656 -786 -755 483 785 -425 -886 241 902 -249 -852 119 807
7064 807 45 -941 -414 645 490 -613 -382 736 655 -646 -588 589 736 -405 -850 314 848 -294
7082 -294 -920 155 885 121 -991 -212 683 602 -769 -815 802 980 -473 -1018 396 1101 -257 -991
7100 -991 -220 943 175 -746 -256 878 507 -602 -656 579 683 -524 -698 121 983 -42 -676 15
7118 15 535 189 -490 -232 514 417 -468 -239 234 215 -253 -392 282 174 -207 -368 119 411 -131 -465 175
7139 175 479 66 -390 158 482 215 -495 -159 504 177 -192 -292 414 412 -252 -326 212 551 -12 -434 -41
7160 -41 479 300 -391 -223 310 155 -177 -419 83 249 -190 -186 66 209 160 -241 -7 413 73 86 -93 85
7182 85 7 150 41 -325 64 147 130 -226 -150 2 -138 -32 -4 -83 145 76 -38 15 144 276 -115 -37 42 204
7206 204 31 -408 -391 273 20 -187 -126 174 223 -321 -74 -15 -4 -329 -160 117 50 -120 -289 3 309 -48
7228 -48 -279 -93 343 55 -440 -104 269 106 -314 -173 426 274 -490 -61 288 465 -316 -514 89 674
7248 674 106 -315 -120 601 217 -650 -273 585 431 -341 -315 465 639 -201 -646 152 640 19 -690 -28
7268 -28 863 27 -405 -382 581 419 -566 -457 433 379 -569 -607 136 631 4 -650 21 721 -43 -740 20
7289 20 796 281 -919 -597 495 513 -416 -727 640 705 -213 -840 368 989 111 -949 -160 1124 347
7308 347 -770 -450 774 646 -624 -675 564 947 -409 -690 224 853 61 -926 -65 868 156 -972
7326 -972 -420 806 278 -621 -698 692 336 -632 -536 383 727 -298 -781 273 722 -24 -981 -365 885
7345 885 25 -831 -479 610 535 -863 -684 743 728 -494 -1011 198 949 -271 -1060 -79 891 375 -1043
7364 -1043 -298 821 567 -517 -574 683 910 -450 -989 399 977 -153 -968 -280 1094 174 -874
7381 -874 -363 832 334 -581 -841 411 676 -379 -665 115 798 -121 -731 -43 667 -202 -673 -68 700
7400 700 164 -388 -306 623 366 -529 -281 574 569 -486 -415 374 747 -295 -762 181 559 -11 -732 -410 645
7421 645 278 -570 -381 624 650 -264 -618 432 665 -135 -785 1 836 -56 -721 -243 647 207 -371 -389
7441 -389 409 489 -465 -591 64 765 -13 -503 -101 707 -82 -384 -112 374 150 -477 -193 196 139 -83 -232
7462 -232 171 386 -61 -169 135 228 21 -249 57 199 -14 -359 -78 262 80 -97 -185 432 27 -239 6
7483 6 217 45 89 -195 -56 -2 -141 -194 -143 137 27 29 184 -78 106 -19 104 0 49 -111 -14 268 232 55
7507 55 -48 -57 -69 -113 193 -139 -230 70 40 57 -332 -38 -102 134 27 -7 4 199 -125 -272 -147 164 176 -164
7531 -164 -90 234 243 -77 29 60 72 -202 -102 157 254 35 -127 75 419 331 -221 -183 483 244 -387 -243 235
7554 235 342 -128 -130 174 494 -81 -270 311 334 117 -393 -103 542 139 -346 -392 324 302 -247 -203 377 364
7576 364 -366 -635 98 594 -24 -581 -80 576 57 -675 -365 446 348 -368 -533 420 489 -318 -704 122 642
7597 642 -61 -532 229 755 105 -506 -138 467 341 -540 -400 584 713 -387 -652 666 686 -181 -582 58
7617 58 660 -215 -799 33 699 89 -668 -417 716 337 -582 -525 601 882 -307 -819 259 924 29
7636 29 -872 -156 866 222 -715 -440 879 505 -723 -370 440 760 -127 -858 401 709 -316 -950 -280
7655 -280 741 261 -914 -189 826 389 -709 -494 524 639 -396 -630 301 734 -170 -404 70 747
7673 747 -91 -702 44 797 79 -698 -36 552 552 -468 -446 536 673 -446 -739 398 802 -383 -895 142
7693 142 836 89 -922 -282 796 186 -772 -518 466 576 -535 -607 362 688 -254 -908 151 855 241
7712 241 -838 -428 793 601 -571 -410 639 641 -437 -671 301 448 -188 -697 72 380 121 -530 -191
7731 -191 632 65 -449 -310 363 205 -492 -450 383 299 -181 -340 313 576 -87 -522 86 545 -62 -574 -39
7752 -39 410 116 -555 -472 440 239 -560 -528 363 382 -234 -575 11 530 53 -549 38 408 78 -331 -265 404
7774 404 357 -336 -141 208 411 -281 -151 116 217 1 -477 -5 423 218 -199 -203 99 -108 -208 -216 -133 209
7796 209 -190 -115 40 154 47 -28 238 -176 -100 -41 -45 67 -164 -221 20 73 75 -61 14 133 110 45 48 -16 9 -110
7822 -110 -61 307 -56 -90 -5 -9 8 -62 -123 27 271 4 45 105 0 21 33 171 -126 112 39 97 -115 -94 -176
7847 -176 155 78 -397 -346 334 54 -192 -223 -8 203 134 -150 -228 -22 32 -324 -210 493 81 -102 -344 145
7869 145 222 -110 -167 31 278 -153 -242 186 264 99 -232 -81 353 91 -363 -154 236 250 -409 -399 239 323
$$ [...]
8191b88
##END NTUPLES=NMR FID
##END=
