##TITLE=1H_LY-THF-mix
 CDCl3, 8 sc, 
 20.10.2020
##JCAMPDX= 6.0         $$ Bruker NMR JCAMP-DX V2.0
##DATA TYPE= NMR FID
##DATA CLASS= NTUPLES
##ORIGIN= UXNMR, Bruker Analytische Messtechnik GmbH
##OWNER= root
$$ XWIN-NMR		Version 3.5
$$ Tue Oct 20 13:41:35 2020 Russian Standard Time (UT+4h)  she@DPX200
##.OBSERVE FREQUENCY= 200.1315066352
##.OBSERVE NUCLEUS= ^1H
##.DELAY= (6, 6)
##.ACQUISITION MODE= SIMULTANEOUS
##.ACQUISITION SCHEME= undefined
##.AVERAGES= 8
##.DIGITISER RES= 18
##SPECTROMETER/DATA SYSTEM= spect
##.PULSE SEQUENCE= zg30
##.SOLVENT NAME= CDCl3
##.SHIFT REFERENCE= (INTERNAL, CDCl3, 0, 15.7039)
##AUDIT TRAIL= $$ (NUMBER, WHEN, WHO, WHERE, WHAT)
$$ ##TITLE= Audit trail, XWIN-NMR		Version 3.5
$$ ##JCAMPDX= 5.01
$$ ##ORIGIN= Bruker BioSpin GmbH
$$ ##OWNER= she
$$ F:/spectra/data/she/nmr/H-F/1/audita.txt
$$ ##AUDIT TRAIL=  $$ (NUMBER, WHEN, WHO, WHERE, WHAT)
(   1,<2020-10-20 13:40:33.25 +0400>,<she>,<DPX200>,
      <created by zg, POWCHK disabled, PULCHK disabled
       configuration hash MD5:
       00 E9 B6 7A A2 85 ED C7 34 08 36 98 17 FE 4E 26
       data hash MD5: 16K
       D3 37 D9 E7 9A B6 11 E9 64 BD B9 06 8A 8C 9C 49>)
$$ ##END=
$$ 
$$ hash MD5
$$ 9F 5F 16 A9 CF 44 D5 B6 A8 4B D0 9C B1 EE 44 D5
##$RELAX= 
##$RELAX= 
##$RELAX= 
##$RELAX= 
##$RELAX= 
##$RELAX= 
$$ Bruker specific parameters
$$ --------------------------
##$DU= <F:/spectra>
##$EXPNO= 1
##$NAME= <H-F>
##$PROCNO= 1
##$TYPE= <nmr>
##$USER= <she>
##$AMP= (0..31)
100 100 100 100 100 100 100 100 100 100 100 100 100 100 100 100 100 100 
100 100 100 100 100 100 100 100 100 100 100 100 100 100 
##$AQSEQ= 0
##$AQ_mod= 1
##$AUNM= <au_zg>
##$AUTOPOS= <>
##$BF1= 200.13
##$BF2= 200.13
##$BF3= 200.13
##$BF4= 200.13
##$BF5= 200.13
##$BF6= 200.13
##$BF7= 200.13
##$BF8= 200.13
##$BYTORDA= 1
##$CFDGTYP= 0
##$CFRGTYP= 5
##$CHEMSTR= <none>
##$CNST= (0..31)
1 1 145 1 1 1 1 1 1 1 1 1 1 1 1 1 1 1 1 1 1 1 1 1 1 1 1 1 1 1 1 1 
##$CPDPRG= <>
##$CPDPRG1= <>
##$CPDPRG2= <>
##$CPDPRG3= <>
##$CPDPRG4= <mlev>
##$CPDPRG5= <mlev>
##$CPDPRG6= <mlev>
##$CPDPRG7= <mlev>
##$CPDPRG8= <mlev>
##$CPDPRGB= <>
##$CPDPRGT= <>
##$D= (0..31)
0 1.2 0 0 0 0 0 0 0 0.06 0 0.03 0 0 0 0 0.0002 0 0 0 0 0 0 0 0 0 0 0 0 
0 0 0 
##$DATE= 1603186832
##$DBL= (0..7)
120 120 120 120 120 120 120 120 
##$DBP= (0..7)
150 150 150 150 150 150 150 150 
##$DBP07= 0
##$DBPNAM0= <>
##$DBPNAM1= <>
##$DBPNAM2= <>
##$DBPNAM3= <>
##$DBPNAM4= <>
##$DBPNAM5= <>
##$DBPNAM6= <>
##$DBPNAM7= <>
##$DBPOAL= (0..7)
0.5 0.5 0.5 0.5 0.5 0.5 0.5 0.5 
##$DBPOFFS= (0..7)
0 0 0 0 0 0 0 0 
##$DE= 6
##$DECBNUC= <off>
##$DECIM= 32
##$DECNUC= <off>
##$DECSTAT= 4
##$DIGMOD= 1
##$DIGTYP= 9
##$DL= (0..7)
0 120 120 120 120 120 120 120 
##$DP= (0..7)
150 150 150 150 150 150 150 150 
##$DP07= 0
##$DPNAME0= <>
##$DPNAME1= <>
##$DPNAME2= <>
##$DPNAME3= <>
##$DPNAME4= <>
##$DPNAME5= <>
##$DPNAME6= <>
##$DPNAME7= <>
##$DPOAL= (0..7)
0.5 0.5 0.5 0.5 0.5 0.5 0.5 0.5 
##$DPOFFS= (0..7)
0 0 0 0 0 0 0 0 
##$DQDMODE= 0
##$DR= 18
##$DS= 0
##$DSLIST= <SSSSSSSSSSSSSSS>
$$ [...]
##$SUBNAM2= <"">
##$SUBNAM3= <"">
##$SUBNAM4= <"">
##$SUBNAM5= <"">
##$SUBNAM6= <"">
##$SUBNAM7= <"">
##$SUBNAM8= <"">
##$SUBNAM9= <"">
##$SW= 16.880792210976
##$SWIBOX= (0..15)
0 0 2 0 0 0 0 0 0 0 0 0 0 0 0 0 
##$SW_h= 3378.37837837838
##$TD= 16384
##$TD0= 1
##$TE= 0
##$TE2= 300
##$TE3= 300
##$TEG= 300
##$TL= (0..7)
0 120 120 120 120 120 120 120 
##$TP= (0..7)
150 150 150 150 150 150 150 150 
##$TP07= 0
##$TPNAME0= <>
##$TPNAME1= <>
##$TPNAME2= <>
##$TPNAME3= <>
##$TPNAME4= <>
##$TPNAME5= <>
##$TPNAME6= <>
##$TPNAME7= <>
##$TPOAL= (0..7)
0.5 0.5 0.5 0.5 0.5 0.5 0.5 0.5 
##$TPOFFS= (0..7)
0 0 0 0 0 0 0 0 
##$TUNHIN= 0
##$TUNHOUT= 0
##$TUNXOUT= 0
##$USERA1= <user>
##$USERA2= <user>
##$USERA3= <user>
##$USERA4= <user>
##$USERA5= <user>
##$V9= 5
##$VALIST= <valist>
##$VCLIST= <CCCCCCCCCCCCCCC>
##$VD= 0
##$VDLIST= <DDDDDDDDDDDDDDD>
##$VPLIST= <PPPPPPPPPPPPPPP>
##$VTLIST= <TTTTTTTTTTTTTTT>
##$WBST= 1024
##$WBSW= 4
##$XGAIN= (0..3)
0 0 0 0 
##$XL= 0
##$YL= 0
##$YMAX_a= 1076452
##$YMIN_a= -951486
##$ZGOPTNS= <>
##$ZL1= 120
##$ZL2= 120
##$ZL3= 120
##$ZL4= 120
##$ABSF1= 10
##$ABSF2= 0
##$ABSG= 5
##$ABSL= 3
##$ALPHA= 0
##$AQORDER= 0
##$ASSFAC= 0
##$ASSFACI= 0
##$ASSFACX= 0
##$ASSWID= 0
##$AUNMP= <proc_1d>
##$AZFE= 0.1
##$AZFW= 0.1
##$BCFW= 1
##$BC_mod= 2
##$BYTORDP= 1
##$COROFFS= 0
##$CY= 11.3945322036743
##$DATMOD= 1
##$DC= 2
##$DFILT= <>
##$DTYPP= 0
##$F1P= 16.9975609425685
##$F2P= -3.02152046262296
##$FCOR= 0.5
##$FTSIZE= 0
##$FT_mod= 4
##$GAMMA= 1
##$GB= 0.15
##$INTBC= 1
##$INTSCL= 1
##$ISEN= 128
##$LB= 0.24
##$LEV0= 0
##$LPBIN= 0
##$MAXI= 10000
##$MC2= 0
##$MEAN= 0
##$ME_mod= 0
##$MI= 1.114404
##$NCOEF= 0
##$NC_proc= 0
##$NLEV= 6
##$NOISF1= 3.799351
##$NOISF2= 2.8
##$NSP= 1
##$NTH_PI= 0
##$NZP= 0
##$OFFSET= 15.70392
##$PC= 1
##$PHC0= -10684.98
##$PHC1= 6.200891
##$PH_mod= 1
##$PKNL= yes
##$PPARMOD= 0
##$PSCAL= 0
##$PSIGN= 0
##$REVERSE= no
##$SF= 200.130013532006
##$SI= 16384
##$SIGF1= 3
##$SIGF2= 2
##$SINO= 400
##$SIOLD= 16384
##$SREGLST= <1H.CDCl3>
##$SSB= 0
##$STSI= 0
##$STSR= 0
##$SW_p= 3612.71676300578
##$SYMM= 0
##$S_DEV= 0
##$TDeff= 0
##$TDoff= 0
##$TI= <>
##$TILT= no
##$TM1= 0
##$TM2= 0
##$TOPLEV= 0
##$USERP1= <user>
##$USERP2= <user>
##$USERP3= <user>
##$USERP4= <user>
##$USERP5= <user>
##$WDW= 1
##$XDIM= 8192
##$YMAX_p= 0
##$YMIN_p= 0
$$ End of Bruker specific parameters
$$ ---------------------------------
##NTUPLES= NMR FID
##VAR_NAME=  TIME,          FID/REAL,        FID/IMAG
##SYMBOL=    X,             R,               I
##VAR_TYPE=  INDEPENDENT,   DEPENDENT,       DEPENDENT
##VAR_FORM=  AFFN,          ASDF,            ASDF
##VAR_DIM=   8192,          8192,            8192
##UNITS=     SECONDS,       ARBITRARY UNITS, ARBITRARY UNITS
##FACTOR=    0.000296,      1,               1
##FIRST=     0,             0,               0
##LAST=      2.424536,      0,               0
##MIN=       0,             -951486,         0
##MAX=       2.424536,      1076452,         0
$$ Real data points
##PAGE= N=1
##DATA TABLE= (X++(R..R)), XYDATA
0@%%%%%%%qJ2mQj9J9k4M0m8N3o9Q9j05J23j51J84k15K50k97L49l99M63n39O15
31C27p01Q03r12J029j164J313j471J645j842K057k288K541k821L124l452L817
47B005m216M644n115N638o211O840p540Q325r200J0183j1305J2596j4094J5862
61H412j7989K0597k3886K8193l4097M2739n6752Q4168k28500Q13164K02940j361544
73e22555l69987J064788R04206p40962r97550K83791J031854R1346r94052n98918
83h48039Q20712Q87174m96905j073522J69434J143035J92122j165627n79870Q73054
93g8432P61980n77575q80574K27905R63962K09882p35803m60423N12556O83548
103F27026k38676q34922o5781Q33697L50960p02049n20899N67341O84317l62931
$$ plain form
0 0 0 0 0 0 0 0 0 -8 4 0 8 -11 8 -16 24 -24 29 -40 49 -56 67 -84 100 -115 135 -162 187 -212 251 -288 327
31 327 -374 429 -483 546 -618 695 -776 869 -973 1084 -1204 1337 -1484 1640 -1812 2005
47 2005 -2211 2433 -2682 2956 -3255 3585 -3955 4370 -4830 5353 -5952 6644 -7450 8412
61 8412 -9577 11020 -12866 15327 -18770 23969 -32783 51385 -177115 636049 838989 -522555
73 -522555 -892542 172246 1076452 335490 -662060 -378269 653585 744931 -249121 -848039
83 -848039 -27327 859847 362942 -710580 -541146 601889 794011 -371616 -951486 -78432
93 -78432 683548 105973 -774601 -546696 417266 627148 -108655 -569078 -56522 627026
103 627026 388350 -446572 -512353 321344 672304 -29745 -550644 16697 701014 338083
113C38083p81598N1785O50930J24367n50169l72391L37248N25129o1756n14219
123b52591j75841M49186L66397l70856n01612K31862N56007k3240m72122n8987
133b51797M58705J99396l21057k72648J21945K54107P241k72112j71742K07258
143d0704L03314p6574l77699p1354L52047J21412l42927k21381K27087K60744
153A33965r3895k00225N0549J91997Q5936r1665j66679j1048J85756R3802j82839
164d346j54253K04157K50260j37109k69234N1203K25944k8537k40894q0294J24352
175e8751J00495j8803r5809m6128J08157J24233q3357j97618J6948K20329J9712
186H9408k08518r290K32328Q9371j46226q6535J01324O7326p7389p9791k3821
$$ plain form
113 338083 -443515 -391730 259200 383567 -166602 -538993 -201745 323384 261628 -252591
123 -252591 -428432 20754 387151 16295 -485317 -253455 302552 279312 -192810 -251797
133 -251797 206908 406304 85247 -187401 -65456 188651 195892 -76220 -247962 -40704
143 -40704 262610 186036 -191663 -263017 89030 210442 -132485 -353866 -126779 133965
153 133965 40070 -160155 -109606 82391 168327 76662 -90017 -101065 84691 178493 -4346
164 -4346 -158599 45558 295818 158709 -110525 -59322 166622 138085 -102809 -183103 -58751
175 -58751 41744 22941 -72868 -118996 -10839 113394 30037 -167581 -150633 69696 89408
186 89408 -119110 -128400 103928 193299 47073 -39462 61862 129188 51799 -27992 -51813
197e1813K5213P5148J4131r0708l4135J03631M9513j39315j08828R5768P7243
208A5848r7828n1102J02851O2940l7889J049N0689j8309n6575L1662L7517o4173
220b3320k2029Q8070M4658l5841j6020J9345j0809l6556L388k3800q1995K6047
232f8862J04443l8468r9549O2154J40770l8265j77162J568J60905J025j25510
243g6951j6122J03860R7398j2840q6043k8998P4248R0413p7687j99596K6898K25378
255A19958Q718k14655m2942K18428R7798k14506j53133J36522J31649q0298j50839
266a43300q342J68186J22302r6006j63466L5825K24102L8450k73799j26681K51619
277B8890J84211j82910k01097J44453K43101p4869k44661k3982J67880P1437j34955
$$ plain form
197 -51813 -26600 48548 62679 -28029 -62164 41467 90980 -48335 -157163 -61395 15848
208 15848 -81980 -133082 -30231 32709 -5180 -4131 46558 28249 -28326 3336 40853 -23320
220 -23320 -45349 42721 87379 51538 35518 54863 44054 7498 10886 -12914 -94909 -68862
232 -68862 35581 -2887 -102436 -40282 100488 62223 -114939 -113371 47534 48559 -76951
243 -76951 -93073 10787 108185 95345 9302 -19696 54552 144965 67278 -132318 -105420 119958
255 119958 128676 -85979 -128921 89507 187305 -27201 -180334 -43812 87837 7539 -143300
266 -143300 -151642 16544 138846 42840 -120626 -84801 139301 177751 -96048 -222729 28890
277 28890 213101 30191 -170906 -26453 216648 141779 -102882 -126864 41016 112453 -22502
288b2502j63515O2589K27009M4328k20446j27186K12339K10523j91530k86743
298b55134J12303K93264j4545k43309l6915K27346J15925j45239j46935L7226
308e6013J39399L0120j66727j17301J53403J98446q0370k34801K1530K55560J8314
319A61560k65694j00413J88704J43227j04037j47700M6168J54625N6990r5955
329C7475j31303K5949J57121O543j85267n6617J98827J32151j57463j54392J21389
340e587J61290q0647j82611k0662J30474P9572o2804j14167J795J55978R3167
351A55798j45088j69399R1550J88874o0921k09184J7089K13304N6454j52905q2759
362i7187J04872J06850n2831j43161m9085J22701J30885q5480j82690N5526K45409
$$ plain form
288 -22502 -186017 -123428 103581 147909 -72537 -199723 12616 223139 31609 -255134
298 -255134 -142831 150433 135888 -107421 -144336 83010 198935 53696 -93239 -56013
308 -56013 83386 113506 -53221 -170522 -17119 181327 100957 -133844 -112314 143246 161560
319 161560 -104134 -204547 -15843 127384 23347 -124353 -78185 76440 133430 37475
329 37475 -93828 -67879 89242 95785 -89482 -146099 52728 184879 27416 -126976 -5587
340 -5587 155703 75056 -107555 -128217 2257 81829 19025 -95142 -93347 62631 155798
351 155798 10710 -158689 -67139 121735 60814 -148370 -131281 82023 138477 -14428 -97187
362 -97187 7685 114535 61704 -81457 -130542 -7841 123044 37564 -145126 -89600 155809
373A55809K5137k59947j14465K13013J50056j70820j85129R7001K06782J2372
383A29809j67161p8608J29471J42430q2695k21067j3513K45797R6303k37192j51551
394b07977K27495K31620j58714k81312N9416K66274J3560k38865j03914J72909
404a9508J92057o4319k12454j2731K20517R3377k24489k04922J73419K61403j18037
415H4313k80473N6920K99847M2469k75620j27580K02557J60636j26087k05059
425a68077J7208K29577J00563j85002j59997J38348K23471q0685k85669m40K78309
436A07606N5368k40164j01718K05920J67366j36823j89516M9398J60622J8241
446I6300j51291j11339J11171J76580l6540j81717j3977J95344O9826j98690j21692
$$ plain form
373 155809 180946 -79001 -193466 19547 169603 -1217 -186346 -89345 117437 129809
383 129809 -37352 -115960 13511 155941 73246 -147821 -161334 84463 180766 -56426 -207977
394 -207977 19518 251138 92424 -188888 -129472 136802 150362 -88503 -192417 -19508
404 -19508 172549 108230 -104224 -116955 103562 196939 -27550 -232472 -59053 202350 84313
415 84313 -196160 -139240 160607 203076 -72544 -200124 2433 163069 36982 -168077
425 -168077 -150869 78708 179271 -5731 -165728 -27380 196091 115406 -170263 -170703 107606
436 107606 162974 -77190 -178908 27012 194378 57555 -131961 -82563 78059 96300
446 96300 -54991 -166330 -55159 121421 84881 -96836 -110813 84531 154357 -44333 -166025
457a66025J58381J34373j05949j31140O8925J50090j703j15687m0614N9904N9498
468G0053l4553j11632j7486J24866O2698j02404q4603R1822J08110q4239j26075
479a03443N0147R5740l1234p1746J7131P4421K2607k8131j5921p715J0996K3338
491C6190l5048n0077L5637O0083j9345n3589K6875O5123l7350p6846K1110L7667
503A0430l9825l6479L3598L9470j5854j2420L2546M766k7021K683K233j8314R899
516a4288L0967o015k2174L7326N3009m1780o5527L4498M8973n3605o9577L0824
528c7369O2511j1109l6542R737K0156l234n827j9789l1495J7639N0636j5166n6107
541e5959L5025R9434l690r7044r400Q7110J4238q1720l8158M8897N1783q45l9078
$$ plain form
457 -166025 -7644 126729 20780 -110360 -41435 108655 106952 -8735 -49349 10555 70053
468 70053 35500 -76132 -93618 31248 93946 -8458 -93061 -1239 106871 22632 -103443
479 -103443 -53296 42444 11210 -60536 -43405 31016 53623 25492 9571 1856 12852 36190
491 36190 1142 -48935 -13298 46785 27440 -26149 726 65849 28499 -48347 -27237 10430
503 10430 -29395 -65874 -32276 7194 -8660 -21080 11466 16232 -10789 -8106 -5873 -24187 -14288
516 -14288 16679 10664 -11510 25816 78825 37045 -28482 6016 54989 1384 -68193 -37369
528 -37369 25142 14033 -22509 -12772 7384 4150 -1677 -21466 -52961 -35322 15314 148 -55959
541 -55959 -20934 78500 74810 -22234 -31634 55476 69714 -12006 -50164 -1267 50516 49671 10593
554A0593l1810K5286N8399k1348j09873k7201J07182M0290j12001n5742J20419
565D194R5924q4391j05756M7981J05239p343r7274m1962P3651J03150j0370j17856
577c4813k6467J34838P5170j40706j44707R3096J57116o8541j67757K7544J66871
588G1644K9914j44080q1332R5587J05132m9348j40725k5195J60928J14284j24566
599A2243j49332J02567K05760l8860k33593k8865K13058P3617j72008j13660J23179
610e894J57314n5742j73944k6604J42672Q2197j33586j72115P9775K19425r728
621A03770k20243m5864K25727J22246j92062j73055J26908J89425m4437j75815
631h3400k0215J70588J01992j12870j45495M3603J66218K785k08044q2749J90277
$$ plain form
554 10593 -21217 4069 62468 41120 -68753 -95954 11228 51518 -60483 -116225 4194
565 4194 100118 15727 -90029 -42048 63191 55848 -41426 -83388 -9737 93413 83043 -34813
577 -34813 -61280 73558 148728 8022 -136685 -43589 113527 44986 -122771 -95227 71644
588 71644 101558 -42522 -123854 -28267 76865 27517 -113208 -138403 22525 136809 12243
599 12243 -137089 -34522 171238 132378 -101215 -130080 82978 156595 -15413 -129073 -5894
610 -5894 151420 95678 -78266 -104870 37802 119999 -13587 -185702 -105927 113498 103770
621 103770 -116473 -162337 63390 185636 -6426 -179481 -52573 136852 92415 -83400
631 -83400 -103615 66973 168965 56095 -89400 -45797 120421 123206 -84838 -167587 22690
642B2690J35519j51402j76565J00832K03015m5255k07937l1467J58016Q4848j00440
653h146j22586N4866J64724L4143j37861q7441J18000J35387r9829j73576N4757
664f7562J79105J185j62897m5274J39873P6200j04958j12622J7621R7449L1462
675D9582r4485p9374P3482J27806j1738j33834k2943J38187M8867j23240p1785
686i9475R2580R8317l8036q4719J6029P8763K7547n4758p9157J251Q4902J8583
698F1827j00739n8758R2183R7142o7028j13825L1340R7994j0998q7137k4239O0244
710b1994N4676r162m2535p338N9288N5225n0451r1116K6167R9461p649j05004
722d0432j5204J01946M2436p9682o1135L4870M6894j5822n9574l5678L7111O7274
$$ plain form
642 22690 158209 6807 -169758 -68926 134089 88834 -119103 -150570 7446 92294 -8146
653 -8146 -130732 -75866 88858 123001 -14860 -102301 15699 151086 51257 -122319 -67562
664 -67562 111543 112728 -50169 -95443 44430 120630 15672 -96950 -79329 18120 49582
675 49582 -44903 -124277 -50795 77011 65273 -68561 -91504 46683 95550 -27690 -99475
686 -99475 -6895 91422 53386 -31333 -15304 63459 91006 36248 -42909 -41658 43244 61827
698 61827 -38912 -97670 -5487 91655 24627 -89198 -57858 40136 29138 -57999 -82238 -21994
710 -21994 32682 23520 -19015 -26353 32935 88160 37709 -53407 -27240 72221 64572 -40432
722 -40432 -55636 46310 88746 9064 -52071 -17201 29693 13871 -45703 -81381 -44270 23004
734B3004l686p2659r493R4391L9336r3754o2592P8126P6222n1751p1413L8739
746a5530Q1026N108n5150l0785K4006L9634j1696p0105l3228O6031N8492n7867
758f4p2684M8958Q2595l6274r3611O480P6013N999n3512r244M4599L9591k54k9147
772I445j5562K6708L3134k8237o1079J6259P0716n357o3299J45N8655K452o2612
785a8632j9864L3078M53k6232l150Q807J0689J7013Q872j5110j3784K0305J3205
798A5650l1714r709L7261J0941k1663P009L3477k720l5540K906K3572k7324l4829
811c2683J8612K1589j6649j4984J8333J6621j5513j5682J337n799L145J6038j3965
824a9600j8140L5403M8414j6530n0039J7214N9803j9569o7370N542N3163P027
$$ plain form
734 23004 19318 -53341 -62834 31557 70893 -22861 -85453 -7327 68895 17144 -54269 -15530
746 -15530 65496 70604 15454 -15331 8675 48309 36613 -33492 -66720 -689 57803 -64
758 -64 -72748 -23790 58805 22531 -71080 -64600 11413 17412 -36100 -45344 -745 38846 38592 9445
772 9445 -6117 20591 53725 25488 -35591 -19332 51384 46027 -17272 -17127 41528 43980 -18632
785 -18632 -38496 -5418 -4965 -31197 -34347 -25540 -14851 2162 11034 -4076 -17860 2445 15650
798 15650 -16064 -25773 11488 22429 766 7775 41252 38532 2992 5898 29470 2146 -32683
811 -32683 -14071 7518 -9131 -24115 -5782 10839 -4674 -20356 -19019 -24818 -21673 -5635 -19600
824 -19600 -37740 -2337 46077 29547 -20492 -3278 56525 36956 -30414 -24872 28291 35318
836C5318l6182j2618K8731K0676j5744l1862k3595J9298L7225l0103n9589K5057
848d3388Q0881N886p8009j7288Q1526K8069p2172m1563M3909N1193q029l9891
860h876k659L9507L0180k2570o0604m578O6242O152q4568l1459Q1297N9006o4465
873B605p1541M5576O8067k5748o7138j3078M7961M1827j7419m4864L103O5329
885C4680L6820o3241o4181N1035P1549m3465q4180K2575R1076Q779p7128k9339
897d5020N1489M0972k7657o7257k1076O0209N5211m2035p5348K8883J04665L261
909F6297j09503l0906R5491M8919p6781o5929N5552Q6568j0008p6648k5327O4057
921B1782O0897n1884j06420P413J18239L0818j19056o5272J12684J01448q3230
$$ plain form
836 35318 -864 -13482 15249 35925 20181 -11681 -35276 -15978 21247 -8856 -68445 -43388
848 -43388 37493 43379 -34630 -51918 29608 57677 -14495 -56058 -12149 39044 31015 -8876
860 -8876 -11535 27972 58152 35582 -25022 -29600 36642 42794 -41774 -73233 8064 67070 2605
873 2605 -68936 -23360 44707 18959 -48179 -61257 -13296 28531 11112 -33752 -30649 34680
885 34680 71500 8259 -55922 -4887 66662 23197 -60983 -38408 52668 61447 -15681 -45020
897 -45020 6469 47441 19784 -47473 -68549 -8340 46871 4836 -70512 -41629 63036 66297
909 66297 -43206 -74112 21379 70298 -6483 -72412 -16860 69708 59700 -16948 -42275 21782
921 21782 82679 30795 -75625 -68212 50027 80845 -38211 -103483 9201 110649 27419
932B7419j24535L6133J19528J282j10544m1769R1362Q8854m2680j07491M308J23646
944F5513M2287j29197r9829J02443J35101o6596j51776K8779J60534K3964j46301
955c5078p6242J01938J00045o0669j26420K715J36242O1426j15360j02619R1531
966b2491J42518n5328j75211K909J77569M6380j53949q4698J25626J28769p0687
977F1407j45983O291J31865M5282j18410j03624Q3063J46312l0346j56704j6638
988i7485J58771O3059j49520j09716J10240J30861o1025j35401J4819J38385M3401
999A06389j09079q6007O2430J10345k1008j33543k8388J34004P5813j05892j03083
1010i8019P8012J24419m8354j35604J930J13511L3462q6437o1805N9208Q7890
$$ plain form
932 27419 -97116 -60983 58545 59827 -50717 -92486 -1124 87730 45050 -62441 -58133 65513
944 65513 107800 -21397 -121226 -18783 116318 49722 -102054 -73275 87259 111223 -35078
955 -35078 -111320 -9382 90663 29994 -96426 -93711 42531 103957 -11403 -114022 -22491
966 -22491 120027 64699 -110512 -107603 69966 116346 -37603 -122301 3325 132094 61407
977 61407 -84576 -78285 53580 98862 -19548 -123172 -40109 106203 75857 -80847 -97485
988 -97485 61286 124345 -25175 -134891 -24651 106210 45185 -90216 -75397 62988 106389
999 106389 -2690 -88697 -26267 84078 63070 -70473 -98861 35143 110956 5064 -98019
1010 -98019 -20007 104412 56058 -79546 -77616 35895 69357 -17080 -78885 -19677 68213
1021F8213j2666q7858l2860P5832O3251o8852r2252M4456J05758o035r7425j7666
1033e8104Q9142L6023o9461n3203K8425N1656J758m8109k1737M2784N1740j5677
1045C5237o7056r270O8832J7946o9270l4791N3795M8109l0071m3136J8506L7542
1057B6373j475k7974k4510M233L2188J0902l2564k0705L7388M3334k6429m9668
1069b8907J5426M1075j1662l7115j793K7412J2937p234o812l542O291J6448j0802
1082A1722l6767j347L6046O085l4179q218L8908J6901k9314j6155J3547O585o230
1095b416n064n082K73J7302J8897j2657k1101J6292K0397k1983k7299J1947J9913
1108I419j0163j2870J2331J0119p146P75L171j5630r655J5037O785k1327o376
$$ plain form
1021 68213 55547 -32311 -65171 10661 73912 5060 -87192 -42736 63022 56987 -40438 -58104
1033 -58104 31038 67061 -2400 -55603 -27178 24478 26236 -21873 -43610 -826 50914 35237
1045 35237 -31819 -41089 27743 45689 -23581 -58372 -4577 43532 13461 -29675 -11169 26373
1057 26373 24898 -3076 -27586 -23353 8835 19737 -12827 -33532 3856 47190 20761 -28907
1069 -28907 -13481 27594 15932 -21183 -22976 4436 17373 10139 3327 -215 6076 22524 11722
1082 11722 -25045 -26392 9654 15739 -18440 -26658 12250 29151 -163 -16318 -2771 3814 -2416
1095 -2416 -7480 -12562 -12289 5013 23910 11253 -9848 6444 26841 4858 -22441 -10494 9419
1108 9419 -744 -13614 -1283 8836 1690 2465 5636 -9994 -19649 -4612 2173 -19154 -25530
1121b5530K9985J8724j7915j3169J0429Q043m583m706q053p644J5736K4089j2584
1134A2822k7582J5875L5915j7354m7583K270L9737r21l7531p098L2135K2940j2013
1147A1612k6406o349K4953K3967k5237m6586J7196O4949M023o1589j2479O4036
1159C2090K9754n7668m6244L3265M3087j6267m4599o564M2149L2356k8257n1730
1171c8628M979O0936J0653p4932l7469O9995O0368m6649o4539L2486P5112o031
1183D6281o9163j9884M7427L8754k4873n3398M476O5542K5729o0825n2756M7309
1195e381O6071m3337q7352J6552Q5140J1595p1537l0817N9001M8947l1072n7208
1207c9398l687N3770L3362m4388n0215L6206P3994o104p6942j3876P3593K4411
$$ plain form
1121 -25530 4455 23179 5264 -7905 2524 10567 5984 1278 -6775 -14419 1317 25406 12822
1134 12822 -14760 1115 37030 19676 -27907 -25637 14100 13179 -24352 -31450 685 23625 11612
1147 11612 -14794 -21143 3810 27777 2540 -44046 -26850 38099 42122 -19467 -31946 32090
1159 32090 61844 4176 -42068 -8803 34284 18017 -26582 -33146 9003 41359 13102 -38628
1171 -38628 -33649 27287 37940 -36992 -74461 -4466 55902 9253 -55286 -22800 52312 46281
1183 46281 -22882 -42766 4661 43415 18542 -34856 -30380 35162 60891 66 -52690 -5381
1195 -5381 60690 17353 -69999 -53447 31693 43288 -28249 -59066 -65 48882 17810 -39398
1207 -39398 -43085 10685 44047 -341 -50556 -14350 59644 53540 -23402 -37278 36315 60726
1219F0726o9739m4893M3670N2911j8550n2893k763M4793K5574l0973n3560L216
1231d2481N9553J3946n9416k9314N7811N4162l5652n5523K2575N3224o344m6493
1243a3952j6465L2072L3978j0139l7252r781L9801L1715m0992n9141J9896N8697
1255B8437q430o1974r805N9086L0796l9454l6474J6835L8115O395l7101k9458
1267d3032L0893N1485o654n5174m751O7128K3360o7129m4641M6427M9655l0988
1279A6579n7690Q559N5800J5677m1673l9172J8334N0648l417o4009k2188O3971
1291A419M9626m7636n7942M1713P3243j9198p3249n017O2891K4988m7423m0825
1303c7410K8109N5579J796n8471l1746M8152M5456m5527p0916K2766P7622k134
$$ plain form
1219 60726 -9013 -53906 -10236 42675 24125 -28768 -31531 13262 38836 7863 -45697 -42481
1231 -42481 17072 31018 -28398 -57712 99 54261 18609 -36914 -14339 38885 32541 -13952
1243 -13952 -30417 1655 35633 25494 -11758 -21539 18262 49977 8985 -50156 -30260 28437
1255 28437 20007 -41967 -51772 7314 38110 -1344 -37818 -20983 17132 23527 -13574 -43032
1267 -43032 -12139 39346 32692 -22482 -27233 39895 63255 -3874 -48515 -2088 47567 16579
1279 16579 -41111 -32552 23248 38925 -2748 -41920 -23586 27062 23645 -40364 -62552 1419
1291 1419 51045 3409 -54533 -12820 60423 41225 -32024 -37041 25850 50838 3415 -37410
1303 -37410 -9301 46278 48074 -10397 -42143 6009 51465 5938 -64978 -42212 35410 33276
1315C3276p4113j2587P0162L1998n3003m5984K9429N0435m244m7041j4942M7579
1327A0965M3997k8748n5742J3430O2488k415p2266k0354O2584L1379n0631m0035
1339d5348L5389M4187j8751m6077n823L2678J8527k2675l1452J4914M7400Q171
1351C1140m1972j5243M3520K5266m0607l2742L1025L4187j9065k9627J0855K7792
1363B4529j150k2426j2045L397R538q21j9697q372K2730J7703j6148j7953J7297
1376c418K1061j7681k1264J6245J7281j1037q733J4012J4829o277p741M956j607
1389A0626p207m39m088o136N015O770n916p461R362Q137j9185j4898J8394J1370
1403D344k0386j1292K2045K1303j0526j3585J1526J2036n321q612n376J524J2134
$$ plain form
1315 33276 -40837 -53424 16738 48736 -4267 -50251 -20822 29613 25369 -21672 -36614 10965
1327 10965 54962 26214 -29528 -16098 46390 43975 -28291 -48645 13939 45318 -5313 -45348
1339 -45348 -9959 34228 15477 -30600 -36423 -3745 14782 -7893 -39345 -24431 22969 31140
1351 31140 -10832 -26075 17445 42711 2104 -30638 387 34574 15509 -14118 -3263 24529
1363 24529 23379 953 -11092 -7695 1843 1022 -18675 -27047 -4317 13386 -2762 -20715 -3418
1376 -3418 17643 -38 -21302 -5057 12224 1187 -7546 6466 21295 15018 7277 12233 10626
1389 10626 3419 2980 -1108 -7244 -2229 4541 -1375 -8836 526 8663 -10522 -25420 -7026 4344
1403 4344 -16042 -27334 -5289 16014 5488 -8097 3429 15465 10144 1532 -3844 -2320 9814
1416I814M327j3103q135J7993J5749k3313k7087J6749K2498j9778k8354J0665
1428b1975L0251J683k1521l927J4364J0283k402j6422j0431J8086K2336j0501
1440I824k3735J1982L6131l529l8871m973L0069N118k8179j6564J7567K0785m434
1453A1191j8637j0928J2761K2179r652l7204l217L9535J6237l3915j9831L6567
1465E086L2556k3985l2789J0162K9326J683k6956j6028J9079L0084k255l6972
1477a1009j4767L8765K5266m2427m5166K6585N0537j2905n2077J679N1544J7414
1489C3439l7892l0217J9248L8263j871m1529j5412M3674M0552l0615n1675K0786
1501a3249O2047q255o9897j5727N9651K9585m7479m1583L0266M9579o951n0107
$$ plain form
1416 9814 14141 1038 -7097 10896 26645 3332 -23755 -7006 15492 -4286 -32640 -21975
1428 -21975 8276 9959 -11562 -15489 -1125 9158 6756 -9666 -20097 -2011 20325 9824
1440 9824 -13911 -1929 34202 30673 -8198 -13171 16898 22016 -6163 -22727 -5160 15625 11191
1453 11191 -7446 -18374 -5613 16566 6914 -30290 -33507 6028 22265 -11650 -31481 5086
1465 5086 37642 13657 -19132 -8970 20356 22039 -4917 -20945 -1866 28218 25963 -11009
1477 -11009 -25776 12989 38255 -4172 -49338 -22753 27784 14879 -37198 -35519 16025 33439
1489 33439 -4453 -34670 -15422 22841 20970 -20559 -35971 7703 48255 17640 -34035 -13249
1501 -13249 48798 40543 -29354 -45081 14570 44155 -3324 -44907 -14641 34938 27987 -22120
1513b2120j9354M0294L5916l1152n3368J6641O8035Q296o4183k2227O2656L8925
1525E8359n1170n4002K9423N7661p311n3472j3157M6262L5174k9492n2147N034
1537b8838N4459J0195o0589l2517N4428M9516l7342n6406K4124O0546o183n8213
1549b6820j4232M4931L0547k6368l9344J1617N0010J2684m5997l3806L5969M4320
1561D3511l0129n6618J3444N7438M189n0343j6088M2126K4401k9391l3431P251
1573b3640L2670J0132k8774k1140K4748L7894p916m2991l916M2289J0678m0369
1585a0335j9850L0651K7044j6197k5647P054K1614M102j6406k0066K548K3400
1597G912M280k4702j0982K6424K3084k0217k6552J3790K3484q145k1364j272J6138
$$ plain form
1513 -22120 -41474 -1180 34736 3584 -49784 -33143 34892 43188 -20995 -43222 19434 58359
1525 58359 7189 -46813 -17390 40271 32960 -20512 -33669 12593 47767 18275 -33872 -28838
1537 -28838 25621 35816 -24773 -57290 -2862 46654 9312 -47094 -22970 37576 31393 -26820
1549 -26820 -41052 3879 34426 8058 -31286 -19669 30341 43025 -2972 -36778 -809 43511
1561 43511 13382 -43236 -29792 27646 31835 -18508 -34596 7530 31931 2540 -30891 -23640
1573 -23640 9030 19162 -9612 -30752 -6004 31890 23974 -19017 -22933 19356 30034 -10335
1585 -10335 -30185 466 27510 11313 -14334 -7280 14334 18436 2030 -18036 -15488 7912
1597 7912 12192 -12510 -23492 2932 26016 5799 -20753 -6963 16521 8376 -12988 -14260 1878
1610A878J0540m448r012k956J0333J2978j2809k5164N283K5382q59k4554l859
1623a7267K5712J0625j8850j2392P395Q540l30r877r401P180J7873M175j8696
1636e313q358K3122J2749k5598j8810J6870K0101j0003j8881O508J8383L155j0138
1649C787j1193j033J2983N112j7340j3459J6352K3152r910k3582Q829K4991o195
1662A2494k5255k520J8497O510j1582p519O653J1395O025r680j5327M684J7019
1675A1394m354k2249k99K4269O776j8948n546J6757M854j3065o939M436K728j242
1689a428L69j016l33Q093N194j0531q834Q229O170j0056p672Q493P007m385O13
1704h7O504l656p154N806N095j1091q975J1751J0853p579p140P665P950m510p903
$$ plain form
1610 1878 12418 7970 -1042 -3998 6335 19313 6504 -18660 -13377 12005 11146 -13408 -17267
1623 -17267 8445 19070 220 -12172 -4777 3763 3433 -6444 -15845 -8665 9208 13383 -5313
1636 -5313 -13671 9451 22200 -3398 -22208 -5338 14763 4760 -14121 -7613 10770 13925 3787
1649 3787 -7406 -8439 4544 9656 -7684 -21143 -4791 18361 8451 -15131 -6302 18689 12494
1662 12494 -12761 -15281 3216 9726 -1856 -9375 -2722 8673 14698 5018 -10309 -5625 11394
1675 11394 7040 -15209 -15508 8761 15537 -3411 -8957 7800 12654 -411 -7350 -2914 -186 -1428
1689 -1428 -1059 -2075 -2408 5685 10879 348 -8486 -257 5913 -4143 -11815 -3322 3685 -700 -87
1704 -87 6417 2761 -4393 1413 6508 -4583 -13558 -1807 9046 1467 -5673 1992 9942 5432 -2471
1719b471k439L91M501K125q382o197J4681J4402j3472j9691J1329K2596j0603
1732F770k6830L501K4949O004j7105p618J3253J3778m271j6929r254J4383J6386
1745A7017j3595k4304J0453L2513j554l3888o892L1638J0149k9245j9379J7428
1757i659K4421l796k1586m632J9795J8000j2040k8654Q65L2175O132l2713j3446
1770b5138L2538K4645k4446k8924J5687K6845p763k8379q088K0419J8169j0326
1782E239k3091R01K7880J2463k8557k4696K2390K9291j5586l1162Q705L4499N157
1795B3433k6983j0007J7716J4522q095k2468o325K1671J7014j5638k5291R492
1807a0959L3633j979l7731r712K9710J4619k2667k0538J5290K5948m35j9232j0361
$$ plain form
1719 -2471 -4910 -4519 -18 2107 -6275 -12472 2209 16611 3139 -16552 -5223 17373 6770
1732 6770 -20060 -16559 8390 14394 -2711 -10329 2924 16702 12431 -4498 -13752 631 17017
1745 17017 3422 -20882 -10429 22084 20530 -13358 -20250 11388 21537 -7708 -27087 -9659
1757 -9659 14762 10966 -10620 -15252 4543 22543 10503 -18151 -17286 14889 21021 -11692 -25138
1770 -25138 7400 32045 7599 -21325 -5638 21207 13444 -14935 -23023 -2604 15565 5239
1782 5239 -17852 -16951 10929 23392 -5165 -29861 -7471 21820 6234 -24928 -16223 18276 23433
1795 23433 -3550 -13557 4159 18681 10586 -11882 -18207 3464 20478 4840 -20451 -10959
1807 -10959 22674 20695 -17036 -26748 2962 17581 -5086 -25624 -10334 15614 15179 -4053 -14414
1820a4414J4500K1001q772l0099j056L3023J3673k9719k1142K8653K8567k1728
1832A2487l4092N219K8929L658k6826j5595J8409K6017m020k9587r624L1605K0098
1845B6678l0677l1679K2939M0790r560m0198K829M1448J0427l3626k2583J9428
1857c784K6946q525l2545o565L1781K2705k5730l4802J6398M0486r568m6622n225
1870c5050M3782J6861l5092k1954K8443L1391j2260l2623k921K9774J5782k4391
1882A742k6876J6447L8925l033m1689p627L9658J5212l9002k8845K6806L1704
1894B3422j6014l2365M885L1239R616k4512k0791J4488K7916m571l2151n184L6203
1907A2181J9465k9475k3927K5125K9572j9439l3604O758K9182J247k5208j0256
$$ plain form
1820 -14414 86 21087 12315 -17784 -18840 14183 27856 -1863 -23005 5648 34215 12487
1832 12487 -21605 -16386 12543 16201 -10625 -26220 -7811 18206 14186 -15401 -25025 6580 26678
1845 26678 -3999 -35678 -12739 28051 18491 -21707 -18878 22570 32997 -629 -23212 -3784
1857 -3784 23162 14637 -17908 -24473 7308 30013 4283 -30519 -14121 26365 16797 -29825 -35050
1870 -35050 8732 25593 -9499 -31453 -3010 28381 16121 -16502 -19423 10351 26133 1742
1882 1742 -25134 -8687 30238 27205 -14484 -22111 17547 32759 -6243 -35088 -8282 23422
1894 23422 7408 -24957 -20072 11167 20783 -3729 -24520 -10032 17884 13313 -18838 -24022 12181
1907 12181 31646 2171 -21756 3369 32941 13502 -20102 -13344 15838 17085 -8123 -18379
1919a8379J8716J7768r306k2931m426K1328R774k2580j8266K0175K5625j1346
1931F152k4440Q909K7143j758k4414m147J7678Q342j0047j0054M911J2959M072
1944A5306j1811j2943O565J3923q556k0194L151J9613J012j6760j575J6854L254
1957G839j2838m552O963M219j235l022L50N628P873J47r822k258J0671M03j3705
1972c339l700J0605L626r771k631R594O29r281j488L066k497k081R87J354Q85
1987d042M265N045l490l996P101L873r320l451Q167L417p237j384R597J644r608
2002E81k077L874k361n326j160K48k40K957L934l969m196P941M768r676o177Q898
2018a981P420o204m592R237P771n132m001J602N32n53j511m620l337N490P822
$$ plain form
1919 -18379 337 18105 8799 -14132 -18558 2770 12544 -10036 -28302 -8127 17498 6152
1931 6152 -18288 -9379 17764 16006 -8408 -12555 5123 13465 3418 -6636 -1725 11234 15306
1944 15306 3495 -9448 -2883 11040 2484 -17710 -14559 5054 6066 -10694 -12269 4585 7839
1957 7839 -4999 -9551 -2588 1631 396 -2626 -2276 3352 11225 11372 1550 -708 9963 10366 -3339
1972 -3339 -7039 3566 7192 -2579 -5210 4384 5013 -4268 -5756 -2690 -5187 -7268 -6281 -4927 -4042
1987 -4042 223 5268 1778 -2218 4883 8756 -564 -4015 4152 7569 332 -1052 8545 10189 581
2002 581 -1496 2378 17 -5309 -6469 -6221 -6461 -3504 430 -3539 -7735 206 4974 -4702 -10879 -1981
2018 -1981 5439 -765 -5357 3880 11651 6519 2518 4120 4652 4099 2588 -2032 -5369 121 7943
2033G943n922j1525N941J2142o668j5267J001J2406J309r076o15R120O018o17
2047F190n117m365N910Q745n701j4032L002J9451J609k0064m086J8526O243j8029
2061a718j3700Q396J2770l754j2232l039J0951J2472n176j7752k64K0618N225
2074A2797k2307j1758K2854K0463j5769k0120J1677K2265l410k2429p645J4651
2086A269J2645q673j8922j6K2335R986k2348j9476J7153K3452j4754k8796P654
2099a8491L0210L181k3905p746K0916J6051j1021k0737n69K0752J1064j8493j9194
2112a7982J5099K7837p207l1469k965K9249O949k8420j6167J9157K0490q694k0119
2125a4242N42J9593J0043j4722k0266P396K5104J286k6164o750K7550J7627k1189
$$ plain form
2033 7943 2021 -9504 -3563 8579 1911 -13356 -12355 51 1360 -7716 -8331 789 6807 6190
2047 6190 1073 -3292 2618 11363 5662 -8370 -5368 14083 15692 -4372 -8458 10068 16311 -1718
2061 -1718 -15418 -7022 5748 1994 -10238 -13277 -2326 10146 4970 -12782 -13046 7572 12797
2074 12797 -9510 -21268 1586 22049 6280 -13840 -2163 20102 16692 -5737 -13382 1269
2086 1269 13914 5241 -13681 -13697 8638 18624 -3724 -23200 -6047 17405 2651 -26145 -18491
2099 -18491 11719 14900 -9005 -16751 4165 20216 9195 -11542 -12111 8641 19705 1212 -17982
2112 -17982 -2883 24954 17747 -13722 -16687 12562 19511 -8909 -25076 -5919 14571 5877 -14242
2125 -14242 -13700 5893 15936 1214 -19052 -11656 13448 14734 -11430 -18180 9370 26997 5808
2138E808k1307J3449K1111p586k1981l752J6620J1012r898j5250J786J8021O400
2151A4433k0297j6694J5432K0337r900k2060N555K4752M252j8941q238J2083J1765
2164A2479m204j5458m881J4321J3686q022j9162L016K3753J087k5962j0141J9371
2177a17J3482j4141j7029Q233J8780J997j4256j0264Q634J6496l298k1248l736
2190a6467K3383J3893j9263j8251J7324K2954j1554k5150L30K1093O490j7548
2202b766j2901J0649J8501N8k0890j0453J8920J6574j7740k3721J1116K8670k008
2215A4009k6789k725K5957R585j9434j6460R922J8190j264j8445p089J6611J7768
2228A9836j0897k4126M274K4829k47k6790q397K3518J3970j7500j4907J1955J7160
$$ plain form
2138 5808 -15499 -2050 19061 11475 -10506 -14258 2362 13374 3476 -11774 -9988 8033 14433
2151 14433 -5864 -22558 -7126 13211 3311 -18749 -13194 11558 15810 -3131 -11369 714 12479
2164 12479 8275 -7183 -12064 2257 15943 7921 -11241 -8225 15528 16615 -9347 -19488 -117
2177 -117 13365 -776 -17805 -9572 9208 11205 -3051 -13315 -4681 11815 8517 -12731 -16467
2190 -16467 6916 20809 1546 -16705 619 23573 12019 -13131 -12801 8292 14782 -2766
2202 -2766 -15667 -5018 13483 13541 -7349 -17802 1118 17692 -48 -23769 -12653 16017 14009
2215 14009 -12780 -15505 10452 20037 603 -15857 -5935 12255 10991 -7454 -14543 2068 19836
2228 19836 8939 -15187 -10913 13916 13669 -13121 -21518 2000 15970 -1530 -16437 -4482 12678
2241A2678l830j6780n067J2704J0555q036j4745L576K0418N184j9770r535J7043
2254D395J1290j5159j5238R386J4920m852j1561J610R729K878o187p510J065P409
2268B175J902q592m851J0197R675p728r299O854Q429o105r309L757O363k883l228
2283b643L963K681k076r44J008j810j810J91j094j656L435L421l012k287N916
2298C283K333q005m185P741L443r312l684J0099O779o921n914M394N029k382o038
2313c340l058L084O722J71p962j882J1256O369j2056j0531J0275J0488r183j1984
2327a1631N990J3918n95j0775k660P561O004m224j0732l108J1822Q425r896j1893
2341a1794R203J7307n548j8964O99J6328K178j4566o480J1020J1105l414j0877
$$ plain form
2241 12678 8848 -7932 -12999 -295 10260 2224 -12521 -8945 11473 16657 -3113 -12648 4395
2254 4395 15685 526 -14712 -5326 9594 4742 -6819 -5209 4520 7398 1211 -6299 -5234 2175
2268 2175 4077 -4515 -9366 831 10506 2778 -6521 333 8762 2657 -6652 -2895 3468 585 -2643
2283 -2643 1320 4001 1925 981 1989 179 -1631 -1440 -2534 -4190 -755 2666 -346 -2633 3283
2298 3283 5616 -2389 -6574 1167 4610 -4702 -8386 1713 8492 1571 -4343 51 5080 2698 -3340
2313 -3340 -6398 -3314 3408 3579 -4383 -6265 4991 11360 -696 -11227 -952 9536 353 -11631
2327 -11631 -5641 8277 7682 -3093 -5753 1808 7812 3588 -7144 -10252 1570 9995 99 -11794
2341 -11794 -2591 14716 9168 -9796 -9097 7231 9409 -5157 -11637 -617 10488 7074 -3803
2354c803k748R911R127j0147j6336M815J8904P70j9607m901K0246J0385j6208
2367D08j4093Q689J3436k379j4149l639J2072J1476m666j5215o47J8812N249k0517
2381e163j2994J6252J7885j1092j9982O649K0800R01j7696r557J0699J3496n367
2394D831j7298k727J9059J2852j5317j8651J2977K2827p841k5797q45K4708Q082
2407A6860j9097j2578J4414J7357m788j9556o017J6958J1928j4705k0376Q637
2419a0963K5872k04k6823n661K5416J1507k1342j8389J3597K0783m487j9240k255
2432a2189J8241J2977j2335j9561M322K1812J789k3931j0433K2584J7467j7664
2444C079k0642J1516K1063m933k1917n033J6903J0491j0322j3844M249J8758M926
$$ plain form
2354 -3803 -6551 3360 12487 2340 -13996 -9181 9723 10493 -9114 -14015 6231 16616 408
2367 408 -13685 -4996 8440 6061 -8088 -11727 345 11821 7155 -8060 -8707 10105 15354 -5163
2381 -5163 -18157 -1905 15980 4888 -15094 -8445 12355 13256 -4440 -13997 -3298 10198 4831
2394 4831 -12467 -15194 3865 16717 1400 -17251 -4274 18553 10712 -15085 -15930 8778 16860
2407 16860 -2237 -14815 -401 16956 12168 -7388 -13405 3553 15481 776 -19600 -10963
2419 -10963 14909 14705 -12118 -17779 7637 19144 -2198 -20587 -6990 13793 9306 -9934 -12189
2432 -12189 6052 19029 6694 -12867 -8545 13267 15056 -8875 -19308 3276 20743 3079
2444 3079 -17563 -6047 15016 10083 -11834 -16867 36 10527 205 -13639 -9390 9368 14294
2457A4294j8212j1191J5320J6361j2639k0228P928K2506o61j9164l964J5697P285
2470A3332j1464j2252K427J1623K976j1344q600J0373J4495n699j7253J236J6960
2483F810J897j6086n237J4295Q756p479p453M519Q023K18p022o456K835Q531m19
2498E732j0524j850J1286N228j0813p746P310O005o728o473L354N493J81j244
2512g89l15M16K717K525l624n151L339O322k084o077K550P309r81o215n77J930
2528A295j703j223m77k187o01M459K858n044l238O018L341o517l893M855L976
2543A919k215j802L461K460K41L04j786l212K084L228m081n929L770P621k436
2558C627p878J493N908k286n761p50L004P06o30Q24rJ235M595P0o323k57O494
$$ plain form
2457 14294 -3918 -15109 211 16572 3933 -16295 -8367 14139 13478 -5686 -9650 6047 13332
2470 13332 1868 -10384 -7957 3666 6642 -4702 -13302 -2929 11566 5867 -11386 -10150 6810
2483 6810 8707 -7379 -12616 1679 10435 2956 -4497 22 8045 8263 1241 -5215 -2380 6151 5732
2498 5732 -4792 -6642 4644 9872 -941 -8687 -1377 4628 -2100 -8573 -5219 274 455 -789
2512 -789 -1104 -688 2029 4554 930 -4221 -882 5440 3356 -2721 -171 7138 6157 -58 -635 1295
2528 1295 -408 -1631 -2108 -4295 -4896 -437 2421 -2623 -5861 157 3498 -3019 -6912 -2057 1919
2543 1919 -296 -2098 1363 3823 4064 4368 2582 -630 1454 4682 601 -5328 -1558 6063 3627
2558 3627 -4251 -2758 3150 864 -4897 -5647 -2643 -1937 -2567 -1743 -1752 -517 4078 4148 -2175 -2432 4062
2575D062N43o374j482P896K819n751j399L403n3k960j803j204j651J490K546k200
2591b118k836L935M050l954m413K879L200k463k172L427K825r61J275K003k691
2606A986j409L511K89o046k540N986K645n153k873M231J941k749l493j114L52
2621d436K145J481l340k381P058O306n654p007O402P886n237r351K861J0166J2
2636F911o627j997M681M306k250p844l815O419N610o563r950N640J3188k688j3290
2651h269l23J2711K771j1527n379Q432Q857k613p219n72Q269O589o879j1702K421
2666d433J3116J07j5158m111J4693P721j2368j0400P209R945m407j1211j658R045
2680a910P296m510q769J976J2952L807j3179q399J1756J1019q761j2460N722J4048
$$ plain form
2575 4062 4605 -1769 -3251 4645 7464 1713 314 3717 3664 704 -1099 -2303 -3954 -2464 82 -2118
2591 -2118 -4954 -1019 3031 -923 -5336 -2457 743 -1720 -3892 -465 2360 1399 2674 4677 1986
2606 1986 577 4088 4377 -1669 -4209 1777 4422 -731 -3604 627 2568 -181 -3674 -4788 -4436
2621 -4436 -2291 -810 -4150 -6531 527 6833 1179 -5828 574 8460 3223 -6128 -3267 6899 6911
2636 6911 284 -1713 2968 7274 5024 -2820 -6635 -216 5394 -1169 -11119 -5479 7709 5021 -8269
2651 -8269 -8592 4119 6890 -4637 -10016 -1584 7273 4660 -2559 -3131 5138 11727 4848 -6854 -4433
2666 -4433 8683 8790 -6368 -10479 4214 11935 -433 -10833 -3624 6321 1914 -9297 -10955 -1910
2680 -1910 5386 876 -7893 -5917 7035 10842 -2337 -10736 1020 12039 3278 -9182 -3460 10588
2694A0588k53j2537l591P390N827m813j0440j786R998O855q556j0585O907J4724
2708I728l435j6171r91J4452M869j1233o483Q618J0460j628r048l392P521P742
2722A1009o147j3367R44J4854L412j4412p729J3455J0045j0752j2930L782J1623
2735C787Q33j0047n456Q651J0693j464j2628l017J4021P456j3322j2515J0633
2748b375J6343n856j6669J885J6016K904j3680r729P550J0764k846j3349l221
2761a2263J3165J0705j0379j5083P601J7085l214j9176j851J8564P458j3695r016
2774a0099J0172J2437l644j3177l715J0974P825r136j2532M710J6127J03j7250
2787g205m081J5110O788j3847j0983R727J1921l992j0799J181J0381N094p243
$$ plain form
2694 10588 10335 -2202 -5793 1597 7424 2611 -7829 -9615 383 7238 -1318 -11903 -4996 9728
2708 9728 6293 -9878 -10869 3583 8452 -2781 -9264 -646 9814 8186 -862 -4254 3267 11009
2722 11009 4862 -8505 -7561 7293 10705 -3707 -11436 2019 12064 1312 -11618 -7836 3787
2735 3787 4620 -5427 -10883 -2232 8461 6997 -5631 -8648 5373 12829 -493 -13008 -2375
2748 -2375 13968 8112 -8557 -6672 9344 12248 -1432 -11161 -3611 7153 4307 -9042 -12263
2761 -12263 902 11607 1228 -13855 -6254 10831 7617 -11559 -13410 5154 12612 -1083 -10099
2774 -10099 73 12510 8866 -4311 -8026 2948 10773 1637 -10895 -6185 9942 10045 -7205
2787 -7205 -11286 3824 10612 -3235 -14218 -4491 7430 3438 -7361 -6180 4201 9295 2052
2800B052q795L398J0528J69j1528m300J2515Q343j0277r655P739R034n810j0762
2814g349J385Q139O23n972k348M051M986l84o499k640O358M528o426o009O361
2829a196Q427l960o792L564O429k850o113L83L615n41k712o0J566J595K41k289
2845f93k218K095K473l920m157L995N777k836m781M334N616l226n888K430M623
2860C624k227m189J215L620J552j166k429p48K817J584n180m432L923O234l831
2875C67o399L970P852k370p662N91O076J61m973j608L410M025K89l129k718L422
2891A304M973m142q177J605Q562R3q562p85Q215L363p361m171L572L568j395m184
2907c522j433L869N106p38o711m35Q434J820q839m991P188O244n567o366M340
$$ plain form
2800 2052 -6743 -3345 7183 7352 -4176 -8476 4039 12382 2105 -7550 189 9223 3413 -7349
2814 -7349 -5964 2175 2798 -3174 -5522 -1471 3515 3131 -3368 -6008 350 4878 -1548 -7557 -1196
2829 -1196 7231 3271 -3521 43 6472 3622 -2491 -2108 1507 966 -1746 -1806 -240 1355 1596 -693
2845 -693 -2911 -816 1657 -2263 -6420 -2425 3352 516 -4265 69 5685 2459 -3429 -999 3624
2860 3624 1397 -2792 -1577 2043 3595 2429 0 -748 2069 3653 -1527 -5959 -2036 4198 367
2875 367 -6032 -2062 5790 3420 -4242 -3651 2425 2586 -2387 -3995 -585 3440 3729 600 -2118 1304
2891 1304 6277 2135 -6042 -4437 4125 4218 -4344 -5129 3086 6449 -912 -5083 -1511 2057 662 -3522
2907 -3522 -4955 -1086 4020 3282 -3429 -3864 4570 6390 -2449 -7440 -252 5992 425 -5941 -1601
2922a601O797p05n409k435K280L785q12n885j739O595N950n886p467N122Q837
2937G427l730r708K27Q741K093o239l543M545N144Q1n808m438M997O222m013r396
2953g398K286J1000J539j0821k858R471M515p653o985L378P082O5o002l003M891
2968d93P960k512j0582p49J0626K985j0970o863J0277R540o976r802L931R973
2982F345k7r400m735O082P564k849q831p89J1449N587j0983r066Q224J1006o620
2997B957j2968K725J3361J212j0564l894Q088P027m931r265q42R243N105q105
3011h51q433P331J2566m225j2915M81J2581J645j2057n251R272P506m249q010
3025d609N31P763L612p300q244L877R705p91j1114j710J2230N293r876p011P261
$$ plain form
2922 -1601 5196 4491 -918 -3353 -1073 2712 1900 -3985 -5724 871 6821 935 -6532 -1410 7427
2937 7427 3697 -6011 -5784 2957 5050 -1189 -4732 -187 4957 5038 -770 -5208 -211 6011 1998 -7398
2953 -7398 -5112 5888 7427 -3394 -6252 3219 7734 81 -6904 -3526 3556 3621 -2381 -5384 -493
2968 -493 7467 4955 -5627 -6376 4250 7235 -3735 -10598 -321 9219 2243 -7559 -3628 6345
2982 6345 6318 -3082 -7817 -1735 5829 2980 -5851 -6640 4809 10396 -587 -9653 -1429 9577 2957
2997 2957 -10011 -7286 6075 7287 -3277 -7171 917 7944 3013 -6252 -7094 2149 7254 -851
3011 -851 -9284 -1953 10613 6388 -6527 -6046 6535 8180 -3877 -9128 144 7650 3401 -4609
3025 -4609 -4078 3685 7297 -3 -8247 -4370 5335 4544 -6570 -8280 3950 9243 -633 -7644 -383
3040c83P280m413q279J009P013L152l936n111J956P580O38q971n169P548O625
3055F539o686p858M742Q588j421p438j121N100K591l367m242K20N355M062m053
3070A011n687L891P763j594r489r37P849K569o632l957M948N373j694m692k583
3085c861L035M051j855p167p94Q720L827p373m866P332O558n510p428J890P227
3100C786Q21n574k912M198O041m46p668l212P497M691p688q770N498J0330l262
3115C330j0016J287R724J109q038m458M524O095j271o186j279P361O431n785q839
3130f011L868J0218k409j1226j063J0448L435q511m815O294N376l413o586j090
3144e485N292K975m314n258K885Q471L37q802j576Q887K940p634n016O701N794
$$ plain form
3040 -383 6897 2484 -5795 -4786 2227 5379 1443 -3668 -1712 5868 6506 -2465 -7634 -86 6539
3055 6539 -147 -8005 -3263 5325 3904 -3534 -4655 445 3036 -331 -4573 -4353 1002 5064 1011
3070 1011 -4676 -785 6978 5384 -4105 -5042 2807 5376 -1256 -5213 -265 5108 3414 -1278 -3861
3085 -3861 -826 3225 1370 -5797 -6591 2129 5956 -1417 -6283 1049 7607 2097 -5331 -3441 3786
3100 3786 4607 -967 -3879 319 6360 5914 -1754 -4966 2531 7222 -466 -9236 -3738 6592 3330
3115 3330 -6686 -5399 4325 5434 -2604 -7062 -2538 3557 2286 -3900 -5179 2182 8613 2828 -6011
3130 -6011 -2143 8075 5666 -5560 -6623 3825 7260 -1251 -6066 228 5604 2191 -4395 -5485
3144 -5485 -193 2782 -1532 -6790 -3905 4566 4903 -3899 -5475 3412 6352 -1282 -6298 403 6197
3159F197m079m543K474M163K40l826l042J072L178q11m284j249N484K850n331
3174a507l038M582L479m963l442L264L911k041k236K736K149k98j091m36J81J92
3190A442k06k055n26K706J478l595j714L957J152m991l114M605K148m404k251
3205e368M537L626k177l024J764K700j64k518j658J548M239M52m946j019O039
3220D031K266o822m848N077M866m759o159L098O283n45n352j155L608K774j832
3235E31m786m40O278L463n445m350O103P072m405q190K102P425n19p560j658N560
3251A181L894k705n350l63M919K436n615o201L379Q416j325q675M53R259K854
3266F557p735m345N485N197k732n410j17N765L844l459o208R35P510M75r731l874
$$ plain form
3159 6197 2118 -2425 49 4212 4452 626 -2416 -1344 1834 1023 -3261 -4510 974 3824 -1507
3174 -1507 -4545 37 3516 -1447 -4889 -1625 2286 245 -1991 745 2894 2596 1505 1069 1250 1442
3190 1442 1236 -819 -1345 1361 2839 -756 -2470 1487 2639 -2352 -5466 -861 1287 -3117 -5368
3205 -5368 -831 2795 618 -2406 -642 2058 1894 -624 -2282 -734 3505 3957 -989 -2008 4031
3220 4031 6297 -525 -5373 -296 4570 -189 -6348 -3250 3033 2488 -2864 -4019 -411 2363 531
3235 531 -4255 -4695 1583 5046 -399 -4749 1354 8426 4021 -4169 -2067 5358 4839 -2721 -4379 1181
3251 1181 5075 2370 -2980 -3343 1576 4012 -1603 -7804 -4425 3991 2666 -6009 -5556 3703 6557
3266 6557 -1178 -5523 -38 5159 2427 -2983 -3100 2665 6509 3050 -3158 -2223 5287 5762 -3969 -7843
3282g843Q118N446o603p189N353P378j562p178j813N132M250k641o167P12Q387
3297C780L900p276o083O682Q246n131j0364J862R680J050q858l457O558N371l113
3312B847p680j420O742M113n985p713M761J0638r64j0957l74J0726L642r053o513
3327g190O389P990k562p703o01P328M775o006q335K255Q950R5j1147l697J0409
3342I50O893q504p997N911Q601k497r333p94P612M610m611o106K398R178J297
3357G608q728m856P744O483o666q982M043R818j568r098p93O887K897n500n537
3372f248J891N609Q55m643l415N591O737l890p117J983P708j08p730j586P087
3387B724L083m502l062K314K863J4m357k614J722L691r77m751J42N745R38n099
$$ plain form
3282 -7843 275 5721 -882 -8071 -2718 4660 3098 -4080 -5893 -761 3489 848 -5319 -4607 3780
3297 3780 7680 404 -5679 1003 9249 4118 -6246 -4384 5296 6346 -2512 -5969 589 5960 2847
3312 2847 -4833 -6253 489 4602 -1383 -9096 -4335 6303 5339 -5618 -5992 4734 8376 -677 -7190
3327 -7190 -801 7189 4627 -3076 -3677 3651 8426 2420 -5915 -3660 5290 5385 -5762 -9459 950
3342 950 7843 -661 -8658 -2747 5854 3357 -5976 -6770 842 5452 841 -5265 -2867 6311 7608
3357 7608 -1120 -5976 1768 8251 1585 -7397 -3354 6464 4896 -4202 -4995 1892 4789 -711 -6248
3372 -6248 -4357 1252 2107 -2536 -5951 -360 6377 2487 -4630 -2647 5061 4953 -2777 -4363 2724
3387 2724 5807 1305 -1757 557 3420 3434 -923 -3537 -1815 1876 899 -3852 -3710 2035 2973 -2126
3403b126j990M111K402l523k110K754K044p41PK43K68M73L32j221k025J138J211
3420A247j207j811J912J439j787j046J216j81k295K55J864q38j972K590K621j154
3436H53j951J191K099j561j642M53J052M74N94o36j114J249K198k054m190R36
3452b049L749j018m312P58M399L83l492o92K538J260j895j502p8J498K429l85
3468A591k731P88M001N11n009j629L986J400l826k106L241K330j606j823L8R27
3484H3K95o28k164r61L235K267k565k311K848L514k421l143Q35K781n84j922M14
3501d27R48M42J373r02k306rK368n45l769m31L853J246l121p05K297J274j175
3518D11j632m92P69J337M87k333q80M232K436l606l508L143L509k682m689J310
$$ plain form
3403 -2126 -4116 -5 2397 -1126 -3236 -482 1562 821 828 1071 1339 1812 2144 923 -1102 36 1247
3420 1247 40 -1771 141 1580 -207 -1253 -37 -218 -2513 -2258 -394 -1232 -3204 -614 2007 853
3436 853 -1098 93 2192 631 -1011 -558 494 968 1562 926 -188 1061 3259 1205 -2985 -2049
3452 -2049 1700 682 -3630 -2872 1527 1910 -1582 -2274 264 1524 -371 -1873 -1951 -453 1976 1591
3468 1591 -1140 -352 3649 4160 -849 -2478 1508 2908 -918 -3024 217 2547 941 -882 -844 83
3484 83 378 -250 -2414 -3375 -140 2127 -438 -2749 99 3613 1192 -1951 -1116 1665 1081 -841 -427
3501 -427 521 963 2336 1434 -872 -881 1487 942 -2827 -3258 595 1841 -1280 -1985 312 1586 411
3518 411 -1221 -1713 -944 393 880 -1453 -2333 1899 4335 729 -2779 364 3873 1191 -3498 -2188
3534b188M401j26k582j398J761K575k34l925k345L397L876k674n411L065O588
3549D780j060o450m01N431J975n120l293L014L989J41l847k162L833M193l089
3564A934o806J151O876Q61p960j746P423L880n384m797L292M853j459n359j215
3579d456M299L965j933n220L03O798J442o981m056N825N025m693n928L225O664
3594D279o00n353j719L765K941k652m131n35N199L384n051m093M305O110l157
3609B692p180O64O771L87n398k139M121L971j438l990j029L848K611l582n137
3624d828K000O755q9o725j031O302L094n742m120K953M354j319m130q70L490L842
3640C936j762n148j63N390K002o384l796N446N368l636n520K413N811p3n243k188
$$ plain form
3534 -2188 2213 2087 -495 -1893 -132 2443 2209 -1716 -4061 -664 3212 538 -4873 -1808 4780
3549 4780 3720 -2730 -3131 2300 4275 -845 -4138 -1124 2865 3006 -841 -3003 830 5023 1934
3564 1934 -4872 -3721 3155 4016 -3944 -5690 1733 5613 229 -4568 -1276 3577 2118 -3241 -4456
3579 -4456 -157 3808 1875 -3345 -3042 3756 5198 -1783 -5839 -14 5011 318 -5610 -2385 4279
3594 4279 3679 -1674 -3393 372 3313 661 -3470 -4005 1194 4578 -473 -4566 -261 5849 2692
3609 2692 -4488 -3824 2947 3334 -2064 -4203 -82 3889 2451 -1539 -2568 1280 3891 309 -4828
3624 -4828 -2828 3927 3838 -2887 -3918 2384 5478 -264 -4384 -1431 2923 1604 -2526 -3396 94 3936
3640 3936 2174 -2974 -3137 2253 4255 -2129 -5925 -479 4889 1253 -4267 -1854 3957 3884 -1359 -3547
3656c547K912L690j487m598n73N523L166m686n498L651O016k446p276N12O833
3671B192J864n745k440M284L981j740m773j031M435K871l438n012K499P009o21
3686D335o932j043O724K008o121m016M081M448k143m024K34L997J987l445l766
3701c676J227M594L51n652j272O083L347m820l483L631M063k695m360M59L518
3716A315N39j841j717R10K669M41l484j946L188J666k935k884K851L570j789k878
3732b325J694K526m46k588J06J429R0j00k2k59P25J185q48j752M40J233j468j968
3750b348J811J608j813j174K034J470j877j769J318J407j447j043J519J339L04
3765A339l77o07K18J470j3k572j570K747J959k632k361K678L236k411l923Q86
$$ plain form
3656 -3547 -635 3055 1568 -3030 -3603 1920 5086 400 -5098 -1447 4569 2123 -5153 -4641 2192
3671 2192 4056 -1689 -4129 155 4136 2396 -2377 -3408 1027 3898 460 -4552 -2053 4956 4335
3686 4335 -2597 -3640 3084 5092 -1029 -5045 -964 3484 1341 -2683 -2449 1548 3535 90 -3676
3701 -3676 -2449 2145 2496 -3156 -4428 1655 5002 182 -3301 330 4393 1698 -2662 -2203 1315
3716 1315 1854 13 -1704 -794 1875 2316 -1168 -3114 74 1740 -1195 -4079 -1228 2342 553 -2325
3732 -2325 -631 1895 1449 -1139 -1033 396 486 386 364 105 830 2015 1167 -585 -145 1088 -380 -2348
3750 -2348 -537 1071 -742 -1916 118 1588 -289 -2058 -740 667 -780 -1823 -304 1035 1339
3765 1339 962 355 573 2043 2030 -542 -2112 635 2594 -38 -2399 279 3515 1104 -2819 -1933
3781a933L450o34l469l67K514K029n98k585l06K987K161l510l782L029N163k075
3797B074m973J133N765Km859j887L213K122k114l258m16L667K086k917l625K173
3813a814M707q19n914p67N980K315m911k529L943M315j808l996l55L164J924k562
3829H73m001R98N176R54n433k678M916L542m537m954K270N105p66m402o24L924
3845C63L014j861l685l84M632J915m169m130M055N396k069n943Q89N848N76n656
3861a209k916L280L172j333m135m00L812L353l364m714J626N588n6o251j473O513
3877A493L432m567l971L504M598j150m898j439L431L464k366m813L80N869J559
3892D526o060l792M726M625l996n953K321O221R8m566j514L581L655k089m391
$$ plain form
3781 -1933 1517 883 -2586 -2953 -439 1590 992 -1593 -1899 1088 3249 -261 -4043 -1014 4149 2074
3797 2074 -2899 -1766 3999 4001 -858 -2745 468 2590 476 -2782 -3198 469 2555 -362 -3987 -1814
3813 -1814 2893 2074 -3840 -4607 1373 3688 -1223 -3752 191 4506 2698 -1298 -1653 1511 3435 873
3829 873 -3128 -2130 3046 4000 -1433 -4111 805 4347 -190 -5144 -2874 2231 1465 -2937 -3561 363
3845 363 3377 1516 -2169 -2553 2079 3994 -175 -4305 -250 5146 3077 -2866 -1977 3871 4447 -1209
3861 -1209 -4125 -845 2327 994 -3141 -3541 271 3624 260 -4454 -2828 2760 2704 -3547 -5020 1493
3877 1493 4925 358 -3613 -109 4489 3339 -1559 -2998 433 3897 1531 -3282 -2902 2967 4526
3892 4526 -1534 -5326 -600 4025 29 -5924 -3603 2618 2716 -1850 -3364 217 3872 1783 -2608
3907b608k6M799K422m280m008L924N499k658o275P56N503L52n539k526M442L076
3923B853k051l558K2L830J587l408l425J971N319q76n320J41N647J977m655k875
3939b821L445L035k222l475K16L114J147j738k778P48L496l34m146j794L605K414
3955A912k929k752K520L747r74k549l84K146Q22j111j434j21K234J561j971k196
3971a479J794K727j636l875N04L039M6k833m12K021J141r25j240n55R92J742q78
3988A73k029m7L343P75k445o29K500J373k349j831J327J256o03j150j83J91J436
4005A108J81k192j126J997J365k708k299K464K683j002k582J192K700r3k141n43
4021i96J015R07J50j141p50J805J731j682k513P64K765j264l347J06L085R3k262
$$ plain form
3907 -2608 -2634 2165 4587 307 -3701 223 5722 3064 -3211 -2455 3048 3400 -2139 -4665 -223 2853
3923 2853 802 -2756 -2734 1096 2683 -725 -4150 -2179 3140 2264 -3056 -2915 2732 4709 54 -2821
3939 -2821 624 3659 1437 -2038 -1822 1292 2439 701 -2077 -1329 2167 1833 -2313 -4107 -502 1912
3955 1912 -1017 -3769 -1249 2498 1524 -1025 -1409 737 1559 448 -986 -1107 1127 2688 717 -1479
3971 -1479 315 3042 1406 -2469 -1965 1074 1120 -1713 -2125 -104 1037 112 -1128 -1683 -691 1051 173
3988 173 -1856 -1903 1440 2215 -230 -859 1641 3014 665 -1166 161 1417 814 -336 -519 -328 1108
4005 1108 1289 -903 -2029 -32 1333 -1375 -3674 -1210 1473 471 -2111 -919 1781 1688 -453 -996
4021 -996 19 926 1076 -65 -815 990 2721 1039 -1474 -710 2055 791 -2556 -2450 635 728 -1534
4038a534m27K235M77j247p04k35J336N09o90j267J430K265j38k638J67K469l47
4055A661k525m82K285O91k127n21J419L91n93q43m53M86M06l08r66O24J917J51
4073A213j933J3J926K78k140m93K100O67j881k72J647O84r55j285L74M55K74j200
4091e28r38M98J746l66j958J49K455M25l122p68K646J329k505j057K307J633j012
4108I34j255j6J486M05j323j630L05K292L00k809n17L006J249l090k407K530K133
4125A593j847k328J177K606L63j769j180J438J820n55k734m95K911J769k479k469
4141b179K685K720j827l558K56L626m69l103l37K087J736o95k254l48K333J356
4157B029k496k548J990L468q42l846Q47L761K94k964j681K122J744j419j976j27
$$ plain form
4038 -1534 -1961 274 751 -496 -1200 -1435 -99 410 -280 -1547 -117 2148 2010 -628 -461 2008 1661
4055 1661 -864 -1346 939 1630 -497 -1018 401 792 199 -644 -1097 -611 -205 -513 -1479 -855 1062 1213
4073 1213 -720 -707 1219 1497 -643 -1136 964 1631 -250 -522 1125 1809 854 -431 -57 398 672 -528
4091 -528 -1466 -968 778 412 -1546 -1397 1058 1483 -1639 -2407 239 1568 -937 -1994 313 1946 934
4108 934 -321 -337 1149 1554 231 -1399 -1094 1198 1498 -1311 -1828 1178 2427 -663 -3070 -540 1593
4125 1593 -254 -2582 -1405 1201 1564 -205 -1385 53 1873 1318 -1416 -1911 1000 2769 290 -2179
4141 -2179 506 3226 1399 -2159 -1903 1723 1254 -1849 -2186 -99 1637 942 -1312 -1660 673 2029
4157 2029 -467 -3015 -1025 2443 1601 -2245 -1398 2363 2657 -307 -1988 134 1878 459 -1517 -1644
4173a644K071J541j190k523P44K901l80l522j007L540J931k946k053K241K484
4188B188q51k416n10J970R99q74k623P03K895J032k777j955K795K504k724l253
4204b897J365L226l26k801m74K241K027j435k398k38K503J310k371k480K142L593
4220B987j414l420J69L771N43l717j264J961K301j500j919J96K246J173j806k468
4236b161R30L402q49l537n49M076J767l437k029K402K447j776k706J63K505O80
4252A328j509j618Q94L082j54l335q72K517J914k868k253K079L183j353k703M46
4268a222K632M79k270j210Q33J614J86j924j165K663J777k143k564J700K577j249
4284G14k884O56K328M22j460o27J292O74k13j223n43R53Q92n85j443O26J965l18
$$ plain form
4173 -1644 427 1968 778 -1745 -1001 1900 1520 -2002 -3009 531 2462 -484 -2537 -296 2188
4188 2188 1337 -1079 -1589 381 1380 506 -2117 -1414 1481 2513 -264 -2219 576 3080 356 -2897
4204 -2897 -1532 1694 1368 -1433 -1907 334 2361 926 -1472 -1710 793 2103 -268 -2748 -606 2987
4220 2987 1573 -1847 -1678 2093 2636 -1081 -2345 -384 1917 417 -1502 -1306 940 2113 307 -2161
4236 -2161 -1231 2171 1322 -2215 -2764 1312 3079 -358 -2387 15 2462 686 -2020 -1857 648 1328
4252 1328 -181 -1799 -905 2177 2023 -1312 -2184 333 2247 -621 -2874 -795 2388 1035 -1668 -1222
4268 -1222 1410 1889 -381 -1591 -758 856 1042 -882 -2047 616 2393 250 -2314 -614 1963 714
4284 714 -2170 -1514 814 1236 -224 -851 441 1115 902 -321 -864 89 981 396 -1047 -421 1544 1226
4302A226k133j85K082k97j683k06J356N9n42J17L87J41m5L7n19l59M28L71l32
4321i7k28Q52L52r25K10O78p38j093L43P21k71o98Q43Q43n64q30L35N59n30k47
4341d85r5J04N86O14n52p23Q00J376q12j854O69J607n71j966N07J902j70j162
4359b25k85N85K36l07p54o61J210J179p54j395O38J928J29k442m78K460K15j870
4377e91m07J484J014p34q63j35O44M81o25j236j85J390N34j374q21J640J096j570
4395b58j248Q63J090m04n98p9O93M19M07o28o84P86R88j018j396M57J804q44j090
4414g40K0J352J55r83p24R9N09M70p58o77L38J761M73j925p03K326N37j718j120
4433a308J121J802o46j146l13J003J101o38j681o44J813Q66k033j461J936K222
$$ plain form
4302 1226 -907 -1092 990 693 -990 -1196 160 219 -323 -206 181 322 277 314 -205 -564 -136 235 -97
4321 -97 -325 527 879 -46 164 842 104 -989 -646 75 -196 -894 -51 792 228 -602 -267 292 -238 -485
4341 -485 -580 -476 110 724 172 -551 249 1625 813 -1041 -372 1235 664 -1302 -795 1107 937 -225
4359 -225 -510 75 311 4 -750 -1411 -201 978 224 -1171 -533 1395 1524 -918 -1396 1064 1279 -591
4377 -591 -998 486 1500 766 -97 -232 412 893 268 -968 -1153 237 771 -603 -1424 216 1312 -258
4395 -258 -1506 -643 447 43 -555 -634 59 478 885 257 -427 359 1347 329 -1067 -610 1194 350 -740
4414 -740 -720 632 787 -196 -920 -821 -312 158 -600 -1277 -939 822 1295 -630 -1333 993 1530 -188 -1308
4433 -1308 -187 1615 969 -177 -490 513 1614 976 -705 -1349 464 1330 -703 -2164 -228 1994
4449A994j301k711P58K332j19j980p12J672J344l47j653j36K060J133j755k268
4465a689J297K695p65l379K51L214M80k583j469J590J849j201k287j32K210J365
4481A446j643j469J081K663k46l059r18L254J274k630k104K159K520r14k355r7
4497a038J873P46j201k363O67K184N09k318j334K279K078k012k497J466K311m79
4513H71k297K56J766J228q92j568N0J481P99j456j987J246K620r52k513P1K668
4530A391K56k493j072J289J307p45j328m5J472J248q06j580K70K409mk460q06
4547a697K478J296j555j720J268J900p43j873m03J014R35q62j547J03J836J128
4563A558k129j540J921K023j733k328J024K189Jj674q2J564J055p63j490j41J234
$$ plain form
4449 1994 693 -2018 -1260 1072 953 -1027 -1739 -67 1277 930 -723 -859 1201 2334 579 -1689
4465 -1689 -392 2303 1538 -1841 -1590 1624 2104 -479 -1948 -358 1491 290 -1997 -2129 81 1446
4481 1446 -197 -1666 -585 2078 1832 -1227 -2145 1109 2383 -247 -2351 -192 2328 1414 -941 -1038
4497 -1038 835 1581 380 -1983 -1316 868 1377 -941 -2275 4 2082 70 -2427 -961 1350 871
4513 871 -1426 -1170 596 1824 932 -636 -586 895 1694 238 -1749 -503 2117 1165 -1348 -1277 1391
4530 1391 1647 -846 -1918 -629 678 -67 -1395 -1440 32 1280 474 -1106 -836 1573 1569 -891 -1697
4547 -1697 781 2077 522 -1198 70 1970 1227 -646 -1049 -35 900 38 -1509 -1406 430 1558
4563 1558 -571 -2111 -190 1833 100 -2228 -1204 985 986 -688 -770 794 1849 1086 -404 -545 689
4580F89Q33j473j631J425K009p07k464J41K180Mk576k27J443J136r69j062O22
4597f27J081Q45r23j193M16J732k41k102K17K246K16j882o56J499P15j164j343
4614a164M56R32j21p26l29N55O42K0j138j07J044O81j652j14J546O76r91n90J212
4633H32M61j066q26O01O25l04m85J20j94K78k28j92lN78j58q87n32J493J49q74
4653f12j51J475M16j119p53J040O20n36o87K99P71mj61o25K08P20k91j613k33
4672a236J452L97j533n77J696R22j062j372O70J473o25j013k75J296Q39k96r96
4689b40m1J362K73j692j032J710J197j478j827J084J916k86k081k80J631M07j032
4706d09r18K43J628L24j442q04J724J520j419j951P85K227j58k270k67J916P91
$$ plain form
4580 689 1522 49 -1582 -157 1852 1145 -1319 -1178 1002 1006 -1570 -1797 -354 782 -187 -1249 -627
4597 -627 454 1299 376 -817 -401 1331 1090 -1012 -795 1451 1667 -215 -871 628 1343 179 -1164
4614 -1164 -708 224 103 -623 -952 -397 245 265 -873 -980 64 745 -907 -1021 525 1201 210 -380 832
4633 832 1293 227 -599 2 627 323 -162 -42 -236 42 -186 -378 -381 197 39 -848 -1380 113 262 -612
4653 -612 -763 712 1128 9 -744 296 916 380 -307 -8 763 759 598 -27 181 901 610 -1003 -1236
4672 -1236 216 613 -920 -1497 199 1121 59 -1313 -643 830 205 -808 -1083 213 1052 756 -240
4689 -240 -281 1081 1354 -338 -1370 340 1537 59 -1768 -684 1232 946 -1135 -1415 216 623 -409
4706 -409 -1327 -1084 544 868 -574 -1378 346 1866 447 -1504 -719 1508 1350 -920 -1187 729 1520
4723A520j167j319Q25J015Q5j541j205J497J541q13j967L86K506K68k724q46K230
4740B91J284j161j667Q48J710R2j325q31P48J334n01j974l87K358Q70k155j211
4757a677J455J892j072k111L56J704K58j189j099Q59J665L48j995p06J699J167
4773A554j144k132Q34K589k75k327k34J546J349j821j372P13J391M04j775j079
4789a779J358K093r17k493M14K664K27k426j093K153J285q87j623K13K071J59
4805A419j449j287Q88J770l43k416j24K311J102k183j616J875J757j295j922K20
4821a293K236L45j658q25P76J867k30j803p67J985J091j836j778J417K367q03
4837A091k202mJ899N58j461j446J065J382k06j254o47J496R14p69j448L9J952
$$ plain form
4723 1520 353 -966 -141 874 959 -582 -1787 -290 1251 438 -1529 -1143 1363 1631 -1093 -1939 291
4740 291 1575 414 -1253 -405 1305 1397 72 -759 -11 1323 822 -1152 -1539 819 1689 -466 -1677
4757 -1677 -222 1670 598 -1513 -1157 547 805 -384 -1483 -624 1041 1389 -606 -1312 387 1554
4773 1554 410 -1722 -888 1701 1426 -901 -1135 411 1760 -61 -1433 -720 671 1075 -700 -1779
4789 -1779 -421 1672 755 -1738 -1324 1340 1567 -859 -1952 201 1486 599 -1024 -811 1260 1419
4805 1419 -30 -1317 -429 1341 998 -1418 -1542 769 1871 -312 -1928 -53 1704 409 -1513 -1293
4821 -1293 943 1288 -370 -1195 -419 1448 1218 -585 -1352 633 1724 -112 -1890 -473 1894 1091
4837 1091 -1111 -1115 784 1342 -119 -1565 -500 882 676 -578 -1225 271 1185 416 -1032 -993 959
4854I59k3j964j72J585R49j300q37P90P95j91r11l81O69O13k00r21j0J142L03
4873H95j154p40R33N80o95o95P09N59o0k96j73LN11M0o54m49L82P40k40o92J69
4894c27J024j62p81j16M63J39l02l1k95J20P07L8n65l75Q36J42j180l12J160L88
4914E71o91l82N82N26l78j09l60n4K39J48m12k78O99O51l21r46O87O21o24r31
4934g62N05N15j84l32K31l7K9L35j17o31J00M31j02p47N91N83J9o43K20N90j91
4955D03p79J71K23J39k94P3O00l06p7J76k73m08K11L6l07K72N29n10k90N59L28
4976D76n56k74M69M32p32o66P94O12k46l32K86L23J10o67n70K24N16N7n87l62
4996f93R46R41j295j325Q36J428m44j582M08J409J98q47m96M99J007m97q06n76
$$ plain form
4854 959 936 -1028 -1200 385 1334 34 -803 -13 782 591 -320 -701 -32 581 381 -540 -550 592 895
4873 895 -259 -999 -66 514 -181 -876 -167 392 332 36 -137 -134 377 417 -237 -686 -304 436 196 -496 -327
4894 -327 697 535 -246 -362 101 240 -62 -93 -388 -268 439 477 -88 -463 373 515 -665 -977 183 571
4914 571 -120 -502 80 606 228 119 -241 -295 -56 92 -320 -598 101 752 431 -515 172 793 169 -762
4934 -762 -257 258 74 -258 -27 -64 -35 300 183 -448 -348 83 -19 -766 -175 408 427 -216 4 594 403
4955 403 -376 -205 18 157 -137 -64 536 230 153 329 56 -352 -141 -105 -412 -140 389 -121 -411 148 476
4976 476 -80 -354 115 547 -185 -851 -57 555 309 -23 263 586 696 29 -541 -317 199 256 -331 -693
4996 -693 253 1194 -101 -1426 -590 838 394 -1188 -780 629 827 -20 -516 -17 990 493 -313 -889
5014h89J061J081p58j598R74J815n63k112r1K033L02j968j024J553J223k24j671
5031h56K26J068P13j038j694O11K093j59k053N7K109O19j785j159J314J322p52
5048F36j881K74J343R91j192j254O62J425j19j926p67J869J384k204j146J632
5064b73K155j073j677K97J295M59j146j214P23J369Q1j346q55J713J169j354k012
5081a689Q76J686m51j801r4J923N35j098r80O76J068n2p92j162J090J930n97j764
5099f96K07J960J6j530j221J697N80r10j111M66J225j38p21q39O84R27j91j482
5117a077j64J565P43j123j274J439J566j156r88l75J420K05m96p43L85J066n7
5134I36j375n57J070J195j562j344P41J466k5j594J69J263J95r44m08L29J031
$$ plain form
5014 -889 172 1253 495 -1103 -129 1686 1123 -989 -1080 953 1255 -713 -1737 -184 1039 815 -856
5031 -856 -630 438 1151 113 -1581 -970 1123 964 -1089 -1032 1077 1696 -89 -1248 66 1388 636
5048 636 -1245 -971 372 1363 171 -1083 -421 1004 885 -1041 -1808 61 1445 -759 -1905 -273
5064 -273 1882 809 -868 -571 724 1183 37 -1177 -454 915 996 -350 -1205 508 1677 323 -1689
5081 -1689 -813 873 422 -1379 -1473 450 985 -113 -1093 -417 651 599 -193 -1355 -265 1665 1068 -696
5099 -696 -489 1471 1487 -43 -1264 433 1013 103 -1008 -542 683 545 -176 -1015 -331 596 405 -1077
5117 -1077 -1241 324 1067 -56 -1330 109 1675 519 -469 -844 576 781 285 -458 -73 993 936
5134 936 -439 -996 74 1269 -293 -1637 -896 570 545 -1049 -880 383 578 -366 -774 -445 586
5151E86k4j031k26Q64J376r74j193L54J423j94j625m16J407O61j170m36M01Q55
5169F38o67m58o04P08R27m03j061J84J412J69j131m26J226Q53j333p44Q03O32
5187G25k27n55K32M80K8q49j92O1J75M25j197l4Q70M73q33J9N73O16r78n46O72
5208f2O38m81k34N49rm7om2q0jj83m15k43P31J41p37n4R08J74j074n18J057K28
5231B40o82n01Q09O06k84k29K39L01O0l92o3k71O64J70q60m66J152N45r44q57
5251g63M58P08o73j082O80R10Q4r33K05L05N23O9o61p18P35J142q70q75P89J320
5271A353p23j324M85R98k88j020k71P18N28k91q70J91O42J70m65j160O57J233
5289E63m44r03j86J739J10r91n59R84L99m50p48J06N24L43k69n90L65M29J71j407
$$ plain form
5151 586 562 -469 -695 169 1545 571 -622 -268 1155 961 -664 -1080 327 988 -182 -618 -217 638
5169 638 -29 -487 -1091 -383 544 141 -920 -736 676 845 -286 -712 514 1367 34 -710 93 725
5187 725 498 -57 175 655 683 -166 -358 -297 -122 303 -894 -928 -58 415 -418 -399 174 790 -188 -734 -62
5208 -62 576 95 -139 410 401 354 348 306 226 225 42 -373 -616 115 256 -481 -535 373 547 -527 -1045 12 240
5231 240 -442 -943 -134 472 188 -41 198 499 559 167 104 -167 497 667 -193 -659 493 1038 94 -763
5251 -763 -305 403 -270 -1352 -672 238 322 -611 -406 -101 422 491 -170 -888 -153 989 119 -756 33 1353
5271 1353 630 -694 -209 789 501 -519 -790 -72 456 165 -705 -514 128 298 -167 -1327 -670 563
5289 563 119 -784 -970 769 879 -112 -671 313 712 262 -486 -380 144 487 218 -372 -7 422 593 -814
5309h14j01Q36M36o19p64P90O85m65k25m2J04M50O8n59m02R37P92p22p67N21R01
5330A040k49j284k7R04%m66l99j5Q82J09m01j180M79J091l64j295J81J751N13
5349A270j450o24J418O42j026j068K38J026M66r29q02M69J537k16j635n83J886
5366F19L35j666j074J335J620r37j586N55J180N23j091q42M93J584r3j688l88
5383a121J742J195j287j601P92J755o01k149J93J759M70j422r12P97J421m09j168
5400e46p17J167J293q48j737O30K252k57j881n01J927O13j538r01P66J361pj373
5418b97o86R48J147n00j748j2J841L32k009m46J622J426j160j537O39J365k05
5435G20j049n89P70J060o0j171m70J113J066j335j536Q87J763q87j474L01J171
$$ plain form
5309 -814 -915 -79 357 -262 -1026 -236 449 -16 -241 -283 -179 271 339 -220 -622 315 1107 385 -382 139 1040
5330 1040 791 -493 -520 384 384 -82 -481 -496 386 495 94 -1086 -607 484 120 -1175 -994 757 1270
5349 1270 -180 -804 614 1256 230 -838 -600 426 892 -37 -839 -370 1167 951 -684 -1267 619
5366 619 954 -712 -1786 -451 1169 232 -1354 -799 381 904 -187 -1029 -536 1048 955 -733 -1121
5383 -1121 621 1816 529 -1072 -280 1475 874 -1275 -1082 677 1147 -275 -1187 -390 1031 622 -546
5400 -546 -1263 -96 1197 349 -1388 -758 1494 1237 -644 -1145 782 1395 -143 -1044 -278 1083 1076 -297
5418 -297 -983 -35 1112 612 -1136 -1148 693 1025 -984 -1430 192 1618 458 -1079 -440 925 720
5435 720 -329 -918 -148 912 852 -319 -789 324 1390 55 -1481 -594 1169 282 -1192 -891 280
5452B80O91j350m53M19O50K24j012o25R16J291m74j495N67J435J74j708l19R08
5470A19Q65j089m80K65Q52R6o75o13K16R66J70j538j98J388O42j265o58J199R59
5489A221q83j161M32R77p0o17l83N17P44p0q24l46O69K48o63r16R07P40k13j000
5509f91L34R84j47r48J08L13L5j17l12J81L08M15p0p55J23R44n93n84j68J337
5529F97k90q57M41M93j9o18J67K30l66j68K37j04O1K65J56m31K25M8k14p43N54
5550b36O49l70q49O53Q66l63r55M37Q32k64q65j47N47J92j50j99L3N90N47p48
5570B00j107Q13J133r36j173L90J662j69j254m25J283N24j008q64L45Q42O23j182
5588c03o76R33J448p18j965N52J799j3j801n99J470J126j132j296P13J123R1j472
$$ plain form
5452 280 971 -379 -832 -413 237 461 -551 -1176 -260 1031 557 -938 -371 1064 1238 -470 -789 119
5470 119 984 -105 -585 -320 532 628 -47 -660 -444 522 692 -846 -1044 344 986 -279 -937 262 1221
5489 1221 338 -823 -391 586 516 -101 -484 33 777 707 -117 -463 206 454 -209 -1125 -218 522 309 -691
5509 -691 -357 627 480 -468 -360 -47 -12 -129 -441 -260 48 463 393 -362 -239 705 112 -472 -640 697
5529 697 407 -450 -9 484 465 -153 14 244 -122 -290 -53 -157 -96 169 325 -106 119 167 -47 -790 -236
5550 -236 413 43 -806 -153 713 350 -605 -168 664 400 -465 -612 -65 127 -23 -222 -189 401 948 200
5570 200 -907 -94 1039 103 -1070 -680 982 813 -441 -866 417 941 -67 -931 -586 256 879 -303
5588 -303 -979 -46 1402 684 -1281 -729 1070 1057 -744 -1343 127 1253 121 -1175 -462 661 752 -720
5606g20l97P94J321o09j479K48J894M05k116q91J654J210j296j461R47J590k4
5623A070j418l83R61J005p09j216m51J535J042j745j302J620J481p69j914K75
5639i18J827N7j824n25J464P19l91r06o7J154P31j227j374R48J739m56j991J8
5657a022J903M02j611r21J274N94l46j351L2J167O69n68j099q0J784J21j740n89
5675a381J647J180j255j128Q36J572n27j220n82R42Q65q33q79k0J328N00j190
5692a45r51P51J447p26j877M56J773l7j324n6R22R41j09j633j29J215Q63j288
5710I3j001O55J586k19k024j73J869O24j927p94R04J072m26j017j48R22R01p23
5728A74j105L49J639O9j606r78K139P47j150j086R99J164n16j286j59Q77K24o73
$$ plain form
5606 -720 -1117 -323 998 389 -1090 -842 1052 1457 -659 -1550 104 1314 18 -1443 -496 1094 1070
5623 1070 -348 -731 230 1235 526 -690 -1141 394 1436 -309 -1611 9 1490 721 -1193 -918
5639 -918 909 966 -858 -1383 81 800 409 -497 -564 590 1321 94 -1280 -332 1407 951 -1040 -1022
5657 -1022 881 1283 -328 -1249 25 619 273 -1078 -1046 121 790 222 -877 -957 827 948 -792 -1381
5675 -1381 266 1446 191 -937 -101 1471 944 -276 -858 84 949 116 -763 -783 545 1045 -145
5692 -145 -1096 -345 1102 376 -1501 -1045 728 691 -633 -689 233 1174 1065 -568 -697 518 1381 93
5710 93 -908 -253 1333 1114 -910 -1083 786 1410 -517 -1311 -407 665 239 -778 -926 -4 897 174
5728 174 -931 -582 1057 1126 -480 -1458 681 1428 278 -808 191 1355 839 -447 -606 271 495 -178
5746a78p55J32J033M44j141o73R77Q12o50j354R02J520o36j081K05J182K11p24
5764B26l31j1M46K18l35o13L11J144m20j369L10Q22j52q94k23N96M16l14m1n5
5784b69L29N2K22l28k96K41N46m44l11N01N21l95l19L88k55j20P7j25m13nP40
5805C37j79n35o8O03N0j036j10O75N00l69mM37j66O3L98l87m09O61M0n81k90P24
5827C54L97m82p93N95O07j074k05K00K86k74j6K33q3Q0M39l35n72N84P33m88m23
5848b37M95M12j08m52K69N4j5n54L25n15l4K56K63l45l04N77K23o00m53L82K30
5869a31l77K50K59ko0O69j01m67K1O14l30n95J8P21L98j267M72L21K06m92n51
5890d24j07L27K56j54j033M07J353o3j309k94J409M99j111p70J058R43k91q63
$$ plain form
5746 -178 -933 -801 232 676 -465 -1138 -161 651 1 -1353 -451 1069 433 -648 -443 739 950 226
5764 226 -105 -116 330 548 213 -400 -89 1055 635 -734 -424 398 246 -648 -871 -275 141 -173 -214 -269
5784 -269 60 112 334 6 -290 -49 497 53 -258 243 764 369 50 438 183 63 140 15 -398 -403 337
5805 337 158 -377 -445 158 208 -828 -938 -263 237 -132 -136 301 135 198 596 209 -200 461 501 -80 -370 354
5827 354 751 269 -524 71 678 -396 -601 -401 -115 -389 -405 -172 -255 -175 264 -71 -643 -59 674 186 -237
5848 -237 258 670 562 110 379 433 418 -136 189 -326 -360 -104 159 -186 -490 87 310 -290 -743 -361 -131
5869 -131 -508 -258 1 -1 -61 608 507 40 61 675 345 -250 -232 489 887 -380 92 413 619 127 -424
5890 -424 -531 -204 52 -102 -1135 -728 625 562 -747 -1041 368 867 -244 -1014 44 987 696 -167
5908a67j39J031N33q28j341M01J357Q4j762r54J906J343j501j723J021K048q21
5925D88j772o0J523O97p46j043P27J457K04j569j096J407J705j230k373R04K191
5942A414q1k143o83J901Q08j599j169N62J567R8j491n24J392J282p74j990K70
5959a160K501J39k243n58J875J230j244j603O06J469K00j865r61J187J289l79
5975D83j823l4J996O35j766j700J885J585j208j690Q04K005J05j253r63R14J332
5992A307m66j660n07J621J150j405j372R55J783k86k379L8J605L07j033r77O65
6009f54J312oj280m10Q33J412o98j906O59J805R0j539m59J566O03j018j245N07
6027d28J177j31j146o14J052P61j32j341l48J520N28j273j212J373J189p29j412
$$ plain form
5908 -167 -306 725 1258 430 -911 -510 847 931 -831 -1785 121 1464 -37 -1760 -739 1309 488
5925 488 -1284 -1344 179 876 130 -913 -186 1271 1475 -94 -1190 217 1922 692 -1681 -777 1414
5942 1414 1333 -810 -1493 408 1216 -383 -1552 -990 577 675 -816 -1340 52 1334 560 -1430 -1160
5959 -1160 1341 1480 -763 -1321 554 1784 540 -1063 -457 1012 1212 -653 -1614 -427 862 483
5975 483 -1340 -1374 622 1257 -509 -2209 -324 1261 53 -1637 -833 1172 1277 24 -939 -25 1307
5992 1307 841 -819 -1326 295 1445 40 -1332 -377 1406 1120 -1259 -1221 384 691 -342 -1319 -654
6009 -654 658 652 -628 -1038 -205 1207 509 -1397 -738 1067 1157 -382 -841 725 1328 310 -935 -428
6027 -428 749 618 -528 -1142 -90 671 539 -802 -1150 370 898 -375 -1587 -214 975 246 -1166
6044a166N45J669j7j280l48L94J006j71j253J31P28R90r84j294O66J468p40j488
6062a144pJ542K27r17n07N41R29l59l98o01P13O13l35j052J84J694k76j227K24
6081a56Q46J65j078m04K22Q11l39o61L86L69L2%n19K69K40K98q67k86Q42L03n76
6102a03l31Q95K68q57l41N34J49n26r5R23k35j67%Qk16j41Q4n60L06O36J31o51
6124b89J3J363p68q28l20J356L3j009k62J046K61m12o23J78O73j85k00m68k3Q98
6144D34J82j397N7J297N72j610m33J209Q50j126r29O77P37j28o07j09M50P95n27
6163C94j113k58J396P10j350j028J329J400j113j344K29J454m8j300l62R58Q09
6180G63l22r62k51J304J85q98j092Q96J188j26j702L15J702j24j115l60O89M33
$$ plain form
6044 -1166 -621 1048 1031 -249 -597 -203 803 632 -621 -490 238 1228 244 -1050 -384 1084 344 -1144
6062 -1144 -1151 391 618 -299 -806 -265 664 305 -93 -694 19 632 297 -755 -571 1123 847 -380 -156
6081 -156 690 855 -223 -627 -405 406 67 -594 -208 161 193 193 -326 -57 183 481 -386 -672 170 473 -103
6102 -103 -434 461 729 -128 -469 65 214 -312 -407 516 281 114 114 122 -94 -235 -151 -711 -405 231 362 -289
6124 -289 -276 1087 319 -509 -829 527 560 -449 -711 335 596 184 -439 -261 412 227 27 -441 -464 434
6144 434 616 -781 -724 573 1145 -465 -898 311 1161 35 -894 -217 520 392 -215 -324 126 921 394
6163 394 -719 -977 419 1129 -221 -1249 80 1480 367 -977 -748 706 658 -642 -1004 -46 763
6180 763 441 -521 -772 532 717 -181 -1273 -377 811 685 -1017 -702 1000 876 -239 -599 90 523
6198E23n52n07N1O51N96l30j059K49J220q5j205m76J373L42r24p71Q37P50l43
6217C40l30n56J44O04K75j037k35R76P24q39p07O78P57k51j340k4J183O2k35m49
6237b60P5N95L88o23p68L40J089p23j104J58J379L21j156n87J370M31o82j017
6255g74n2J026O47p14q56O31J209r8j463n23J364R08j574j144J321J044m34j358
6273h40J66J234Q3r78r03N57J244O2j240m38J560J162j411j366Q03J511n28j668
6291i90K74J528K15j043o11M77J044pj278p35J003J232j076j549Q07J795l34j624
6309h72P5J486K69j080j021R06J244l19n85n44Q14Q26n62j533K03J367l4j456
6327h16k94J491N98j139q11R21N39l86q74J42O33M81k49q90K89P25O11j000r16
$$ plain form
6198 523 -29 -536 -485 166 762 432 -627 -378 842 757 -448 -924 449 791 -133 -904 -67 683 340
6217 340 10 -546 -402 202 477 -560 -795 181 905 66 -641 37 794 543 -797 -821 362 424 189 -260
6237 -260 -185 410 798 175 -593 -253 836 113 -991 -833 546 867 -289 -876 494 925 243 -774
6255 -774 -826 200 847 133 -723 -92 1117 1019 -444 -967 397 1305 -269 -1413 -92 952 518 -840
6273 -840 -674 560 643 -335 -1238 -681 563 625 -615 -1053 507 1669 258 -1108 -305 1206 678 -990
6291 -990 -716 812 1027 -16 -627 -150 894 887 -391 -1126 -123 1109 33 -1516 -709 1086 752 -872
6309 -872 -797 689 958 -122 -1143 -237 1007 688 103 -441 373 1199 637 -896 -693 674 640 -816
6327 -816 -1110 381 979 -160 -971 -50 489 103 -771 -629 4 485 236 -654 -365 360 971 -29 -945
6346i45J070N68l56r19K73J156l44o94j60L79L89m52m46l61N74Q85o20q49L08
6365e44J289l99r62m4J039K67q18j07P90j16k58o6k32J88O76j33j084k0R45K22
6385F33p80n82J022L48r33m35J35O28k05l91J74L36M34K2m27k13L16O47o02o24
6405d97O77M05m45m49L79O52o50k90J4O5j48k46L45m1j52P59l50o15L69P43m11
6426A14q64Q18K94j41l59M25O05q29j78L59q1k49j20N23m62j27L54n9l77L45P3
6447F4n92J21Q7L23j40m24O03R36p96n30K40Q09Q2j000Q7K98L40l9l23m19P79
6468E06K30o49j083O68R04m98j318L78J457k04j173j03R79O68q03q46N50Q18N94
6487A075r15j092J224J181n52j679Q9J595lj660q92J633J163j144j385N29J470
$$ plain form
6346 -945 125 693 337 -582 -309 847 503 -191 -351 28 417 -35 -481 -842 -268 617 -3 -852 -544
6365 -544 745 346 -616 -660 379 646 -172 -279 511 395 137 71 -161 27 703 570 -514 -534 411 633
6385 633 -147 -729 293 641 -292 -727 -592 36 -169 -560 -386 -50 384 406 -21 -234 82 729 127 -497
6405 -497 180 585 140 -309 70 722 72 -218 -204 -139 -287 -533 -188 -229 -381 378 28 -587 -218 525 114
6426 114 -750 68 362 221 -138 287 892 63 -115 244 163 -86 -206 317 -145 -272 82 23 -354 -9 64
6447 64 -528 -407 -320 3 -137 -561 42 978 182 -348 -108 701 783 -217 -130 168 508 469 146 -273 506
6468 506 736 87 -996 -328 576 78 -1240 -862 595 391 -782 -885 94 762 -41 -887 -337 481 1075
6487 1075 160 -932 292 1473 921 -758 -669 926 923 -737 -1629 4 1167 23 -1362 -833 637
6504F37N5j562m76R41J157j53j495J11J716O26j958r46J766R64p43j712O99J463
6522A090O0j405o21J064R18o40j762J9J500Q31j568j201J492J447p36j579L70
6539g21J386L92j632n82J222J262l15j191l57J227Q80j388j397Q48J414m05j579
6556i36K02J423K77j439o11Q32O64j59j130j13R71Q67n04r11q5J781m6j428p41
6575a086J518R22j292j014O24J246k32p92n57L09P07l38o10j45O98P57o44q07
6593g36O13J033m19j114qJ213K36q14k62N34O34p1p25o56N42Q11o37r69K37J142
6613E84K13j515k15J167M3o94n02M10R40j7p08j72O13O21R3j272mR05L51j099
6633b58p71J374N67o19q51L91Q90m10p04l25K69K87K17n97r7R42L62q23n05L55
$$ plain form
6504 637 692 -870 -1346 -405 752 599 -896 -785 931 1557 -401 -1347 419 1383 640 -1072 -373 1090
6522 1090 1150 -255 -876 188 1106 466 -1296 -1277 223 1054 -514 -1715 -223 1224 488 -1091 -721
6539 -721 665 1057 -575 -1157 65 1327 1012 -179 -536 691 1571 183 -1214 -366 1048 643 -936
6556 -936 -734 689 966 -473 -1084 -252 412 253 -877 -990 -19 848 344 -567 -652 1129 1083 -345 -1086
6575 -1086 432 1354 62 -952 -328 918 686 -106 -663 -354 353 15 -595 -740 -42 715 71 -736
6593 -736 -123 910 491 -623 -631 582 818 4 -258 276 910 839 114 -542 0 811 174 -795 -558 584
6613 584 797 -718 -933 234 277 -417 -919 -509 431 414 -294 -466 147 768 861 -411 -415 490 841 -258
6633 -258 -1029 345 912 293 -558 -167 723 313 -391 -716 -447 -160 57 -540 -637 305 667 -156 -661 -306
6653c06Q69n38p09M16R61k9p73k0M95K05l02j65l21J92J78k06j99p3J003n33o98
6674e53L62M97l11n32K28N86pm14M85J53n32K26P8j41k30J50K89l30k30M62R2
6695C28n44J86P8j87l61J59M91k43o33P49o9k1l51N94j08j54p3mK63L3J46l2p3
6718A74M1M32p54n15K96J023o04n69L71O46m95l74K12J96j26l70j5QL79L14L8
6739C08n80K43Q52n92o21J48O74m9p53J88M76J74n34J52m7p8K41l03k58j05O13
6760A49L48n63m23P32Q2m72m80O64L18n20R6k23K12K89J18K4p61N44J82m34n31
6781f49J64P16R0o77j84R11J69o16m58J90K53j6o3k75J8J091j29j262R9J027K32
6802F31r78k74O22P54k88r17K71L60L97k88j092R4J077M73j263m30R48J172j055
$$ plain form
6653 -306 563 25 -684 -268 693 664 -109 -129 366 571 269 104 -217 -25 153 -53 -252 -325 678 145 -553
6674 -553 -191 306 -5 -537 -309 277 270 -144 341 494 -38 188 266 125 -105 45 334 4 -226 236 328
6695 328 -216 -30 48 -139 -500 -341 150 -93 -726 23 -46 -67 -418 176 68 -86 -159 -163 100 133 279 247 174
6718 174 215 647 -107 -622 -326 697 93 -476 -105 541 46 -328 -116 80 -46 -416 -431 -423 -44 270 308
6739 308 -272 -29 823 231 -390 -242 432 383 -370 -182 294 468 -66 86 39 -39 202 -101 -359 -464 149
6760 149 497 -66 -489 243 325 -147 -627 37 355 -165 -69 -292 -80 209 327 351 -410 134 316 -118 -649
6781 -649 -485 231 321 -356 -540 371 540 -76 -534 -344 -91 -107 -170 -445 -427 664 535 -727 -628 399 631
6802 631 -347 -621 1 755 467 -450 -179 181 578 290 -802 -708 369 842 -421 -851 97 1269 214
6821B14j108L97J563m92j379k00J198Q54j121n16J17J090M13j137j021J021J348
6838A241p70j619M27J655J3j493k73J092N55q15j051L64J043M40j075q43Q62J519
6856A272m43j735k19J791M13j776o38J659J211j185j154L26J185J72j221q05J074
6873g3R60j82j457l67J758O22j616q77Q37J503q46j300L94J243J92j031o12M96
6891c56Q76j61q95p13J604P61q28j260L42J709k36j849J91J526O4r80o97P79P52
6910F29k75p48l57O11P83l96j416J64J640k6j077k11P75R96j110q00O77P62j56
6929D65o59j75K95R63m08j119o5J141N95j366p42J119N56o39p36N16Q03l12m58
6948b26m52N44J37M05o64k46N95Q59o96q78M56Q26l10o94L0Q83J69p13l16J68
$$ plain form
6821 214 -894 -497 1066 574 -805 -1005 193 1047 -74 -590 -473 617 1030 -107 -1128 -107 1241
6838 1241 471 -1148 -721 934 947 -546 -819 273 828 13 -1038 -674 369 809 -266 -1109 -247 1272
6856 1272 829 -906 -1125 666 1079 -697 -1335 324 1535 350 -804 -478 707 879 -342 -1147 -73
6873 -73 887 705 -752 -1119 639 1261 -355 -1232 -395 1108 262 -1038 -644 599 791 -240 -852 -356
6891 -356 520 359 -536 -1249 355 1116 288 -972 -630 1079 843 -1006 -815 711 775 -205 -902 -123 629
6910 629 354 -394 -751 -140 643 247 -1169 -1005 635 609 -468 -679 96 1092 -18 -818 -141 621 465
6929 465 -194 -369 -74 889 481 -638 -703 438 1033 -333 -1075 44 600 -39 -775 -259 544 232 -226
6948 -226 -678 -134 3 408 -256 -502 93 952 256 -622 -166 660 350 -344 -314 569 738 25 -291 -123
6968a23M30j10k83o54L66N11k2q05J25J046L45j095J1P28K33q61l74O66J97l8
6988B93m31M79j38R5p1m34k67L97Q0k37k30N12J94l04k90K86L47n17o8J27L90
7009B13m35K49J15J31k22M59l34j35j0J94o15O6M38K0l73O1O52l36n70j46N22
7030e6P6n56K8O79O0m42J97M0L04J55j39p87K81Q30Rj067N0R01J94r38m12Q73
7052B80K71o03p40K73P24K94m64m14J20O60q5j035j17J215O96j098o45P90J205
7071A327p32j123L08R08l6p90l68M71R16l20j064k53P52Q60j099r77O55J230m59
7090B06j085J84J111N45r29m41M29N75j01n89l51J060K12k24r47L6P49P4j212
7109f98j84J040L97q02m60L93O34M4o28j56J24O10j00n81l72J252K33o17q07R89
$$ plain form
6968 -123 307 197 -86 -740 -374 137 115 -690 -565 481 826 -269 -258 470 703 -158 -532 134 331 293
6988 293 -138 341 203 298 227 -207 -474 -77 3 -234 -464 48 242 -62 -352 -66 281 -236 -304 -177 213
7009 213 -222 27 142 273 51 510 176 41 31 225 -390 -324 114 134 -239 -178 474 138 -432 -578 -56
7030 -56 20 -536 -508 171 231 -211 -14 26 330 485 346 -441 -160 670 679 -388 -338 563 757 -181 -593 280
7052 280 551 -52 -792 -519 205 499 35 -379 -259 401 316 -719 -836 379 1075 -23 -668 122 1327
7071 1327 595 -528 -220 688 652 -138 -506 -35 881 561 -503 -756 -4 856 -243 -1220 -565 665 206
7090 206 -879 -695 416 961 32 -409 20 595 494 -95 -446 614 826 602 -345 -309 440 514 -698
7109 -698 -882 158 555 -247 -707 -314 320 364 -264 -420 -296 314 214 -367 -739 513 746 129 -678 311
7129C11N11m93p64J58O92j77l26j87Q5N06j3l80p80O05N76o11n49L20R74L22r97
7150b17l32J086Q2o80k02K05L29L40l95n31L69L68L46j359m02J202M95j015q63
7169a174Q87R37n21q10J33P50M78q40l82K57O85L87j090k74P95R70q31r49K27
7188c65J043j05j004o3O83O54p15k28k40M41L69p86o77Q20P56m11o12N2J068o6
7208F14r50q6O80M17m56o03J81O51Q0m56j45m3O96k64q56j91Q61L31p63o00R45
7229D3L16l80n77N06K76nm07l98M38N64K79l92k44M23K65n87p34N32N16j84p07
7250d57K94N16k50k81M6j21L8J37k3m36K52N85J45n70J6N19l2m47k5K82J05m14
7272a21J38P1lJ9K69k27l87K55Qo0k91L26Lj23j28L80j45j27j6J53m9j59M98l6
$$ plain form
7129 311 822 329 -435 -277 415 238 -88 -275 -190 316 303 -77 -857 -252 324 -287 -836 -516 458 780 -217
7150 -217 -549 537 619 -61 -263 -58 271 611 216 -315 54 422 768 -591 -993 209 704 -311 -1174
7169 -1174 -287 650 129 -681 -548 202 680 -160 -542 -285 400 787 -303 -577 218 1188 357 -592 -365
7188 -365 678 573 -431 -494 189 843 128 -100 -340 101 470 -316 -993 -173 583 172 -440 -388 680 614
7208 614 -336 -422 258 675 219 -384 -203 448 528 72 -73 -116 580 316 -540 -731 130 461 -302 -902 43
7229 43 359 -21 -598 -92 184 179 -228 -626 -188 376 655 263 19 442 707 120 -614 -82 434 250 -457
7250 -457 -163 353 103 -178 -132 -253 -215 -78 -101 -537 -285 300 445 -125 -109 410 378 -69 -94 188 293 -121
7272 -121 17 88 85 104 373 146 -241 14 22 -38 -329 -3 0 -123 -251 129 -16 -143 -159 -6 -55 -214 284 248
7296B48p1m8L35K3o55J58J91K5m24J96m9K34l02J03q6P2l61N30m09l7l3L91j76
7319a45J63K46p6j03j15M0J67j93J33M37n08LK20j31l17r0N15K4m27J3j28M88
7341B16k82J0q3j22L99j74k96l8L69L55m76k59M48Q66p22o98M07M54r1n26k81
7362e24O09L30q7n10m20M68P63o33p07K16R08l34q15M55O35L31q44m69N96O71
7382F39m58n74p7N96N38n51p49N22P00j05j342K08J086P3q65l20P20O69n01q38
7402f29P7P34J80l68m93K71J098j50j126k79J191M62j123p85R16J117r31q37L48
7421c27P59K56p41n86L90R48k52j071O0P84M90p04q87Q11J210n02j508L06J126
7440E62J55j024k52M64O73j55o95j26N44O89p35j046O72R16j52j108j26J298K29
$$ plain form
7296 248 177 129 464 487 -168 -10 181 206 -218 -22 -71 163 -139 -36 -122 -50 -411 119 -290 -327 -360 31 -145
7319 -145 18 264 188 85 -30 10 177 -16 117 554 46 49 269 138 -179 -269 246 270 -157 -144 -272 216
7341 216 -66 -56 -139 -261 138 -36 -332 -370 -1 354 -122 -381 67 933 211 -487 -80 374 283 -243 -524
7362 -524 85 415 328 -182 -602 -134 629 -4 -711 -495 413 79 -736 -281 354 685 -159 -628 -32 639
7382 639 181 -393 -470 126 664 113 -636 -114 586 481 -861 -653 433 506 -359 -679 41 710 209 -629
7402 -629 -552 182 362 -6 -499 -228 870 720 -406 -685 506 968 -155 -940 -24 1093 162 -675 -327
7421 -327 432 688 -53 -639 -249 699 447 -624 -564 220 710 6 -881 -70 1140 638 -870 -564 562
7440 562 717 -307 -559 -95 578 423 -272 -398 146 835 100 -946 -274 642 490 -618 -744 554 783
7459G83n65q18N60K30j09l83L7L53L83k29p57K7R68j7r72l71J066L57o32l60L62
7480h7O38l95l77j63K45M07J6m03l32N50M34l84o29L42O42p83l34L44M67J8l10
7501i4j33M24j4o0k10j79O8N39j64n54K48N30p7o22j05O67q4m10j6N9L80L6n8
7524A71k78p1N72n7q60K87L49L09p71k41O32M92k12l99M7N20m12L8m41J79L00
7545A54J67n88L3L08K05l27n93P40K66m54k19J13M34J10k88mq3K14l3m5k28k5
7567a43J27K12m46L66O67o45j82j48K76j78k82O20Q6m56l1L57o9j56O2m3l2l96
7589d34L03L00j27K5K84o4k07K52O0l91l15N04j0j35m04N38J72n99j30K17N4p4
7611a81k10P2J70M0K65J10o82O71L08m23l87j47P86j07n18J34P45j78l69j30j11
$$ plain form
7459 783 218 -600 -40 190 81 -302 -265 88 471 242 -515 -488 480 463 -509 -880 186 543 -89 -449 -87
7480 -87 551 156 -221 -384 -139 268 284 -119 -451 99 533 149 -480 -138 504 -279 -613 -269 198 216 -94
7501 -94 -227 197 183 123 -87 -266 -198 341 177 -377 -129 401 324 -298 -403 264 180 -230 -246 -187 193 229 171
7524 171 -107 -178 394 337 -523 -236 113 422 -349 -590 42 534 322 -77 -30 490 78 116 -325 -146 154
7545 154 321 -267 -234 74 279 -48 -641 99 365 -89 -308 -195 239 349 61 57 -26 188 155 110 -118 -143
7567 -143 -16 196 -250 116 783 138 -44 -192 84 -94 -376 244 330 -126 -157 200 131 -25 37 -6 -38 -434
7589 -434 -131 169 42 67 351 287 80 332 392 1 -314 190 180 45 -359 179 351 -248 -378 -161 -107 -181
7611 -181 -391 -319 -149 -109 156 266 -416 255 563 140 -247 -394 392 285 -233 -99 646 468 99 -31 -142
7632a42J79r4k10l41M46N69m25m29J52M97Q1m90j30N97J51q03J09P12J06m12N4
7653A77j40j3K22j06k24j11N10m4l13k51L90J98l09l84K88P1OMo3j94L68J46k02
7676B6l32N65N1m83Q4L50J78n9m82J06L87k84r8j01k37J24L43j40m22J3O40j91
7698C8l08n1K87M30m80l41N72M15m52k50J76q9K61R5o08J37N35L2p43k69O18O46
7720F51m72j070N58N68k73n61K75M25L53m63m69K22N63L81p56l00J26N83l6r72
7740f67M38J166k55j158n9Q31J6j70q17L02N39K28n07o39N41O87n22q46L59Q23
7760B90J19p56l27P79Q06p46o33L54P17j05n33m06K52N23K05j022j61J172J4r68
7780d26k99M73J014p28q36N21R09l93l26m80N81K79L9o04J5O16M08p42n65P84
$$ plain form
7632 -142 37 -57 -267 -608 -162 407 -18 -447 -295 202 283 -207 -337 260 411 -392 -283 429 535 123 177
7653 177 37 24 246 140 -84 -195 315 271 -42 -293 97 295 -14 -398 -110 -39 -33 -29 -92 -286 82 228 26
7676 26 -306 259 310 -173 -89 261 439 380 -102 4 391 107 9 -92 -329 -205 138 -2 -424 -411 229 38
7698 38 -270 -321 -34 396 -84 -425 147 562 110 -140 36 -53 208 303 -305 -168 367 399 -344 -613 5 651
7720 651 179 -891 -333 235 -38 -599 -324 101 454 -9 -478 -256 307 688 -68 -368 -242 341 305 -667
7740 -667 -229 937 682 -476 -535 296 312 142 -675 -373 166 394 -113 -752 -211 476 -46 -892 -533 290
7760 290 409 -347 -674 105 911 165 -468 -114 603 498 -35 -441 -189 334 539 -483 -644 528 542 -426
7780 -426 -725 -252 762 34 -802 -281 628 235 -91 -571 10 289 328 -276 -261 355 763 21 -544 240
7800B40M31j92p42l16J211j94r34n9N48L03l84k98k94P38K84k93o44N03O67j58
7820D17m41lM10L56j045J4J99O82l50l59l6o1M45j60m18K36K45Q4n44n17Q81J55
7842A90l11m92M12O47m53o4Rj30M15j53j2j25L69K12m94m52N30K59m83m12N4M59
7864b5k5N5k42M3P4o6J80l99M02r0K90k96J28M86q8m84J77K55k29j08N1J79j78
7887I0j06L3J3j23p7K68k55o7K7k1j22k3O25p8n41L03N19m13k41K00L49j60j40
7910F0n6K75J5j19q5j80J20J60n3m80J92L03L1l38j70O91p3o77J68J88L61m03
7932g0o8J38J82P2k91P0Q2J5j45j47K14L03m3m66k18N59L7n09k17M75K81j42m66
7955c54L44J51J38m89J97j8J28J80m19l04N59M92m57m67M01L08j69n62l6O36q3
$$ plain form
7800 240 671 479 -263 -579 632 438 -496 -555 -7 296 -88 -386 -680 58 342 49 -595 -92 575 417
7820 417 -24 -27 383 739 -306 -292 -93 589 239 -120 -156 -217 228 68 -350 -114 131 215 -329 -846 35 190
7842 190 -121 -613 -201 446 -7 -71 -62 -192 223 70 58 -67 302 514 20 -432 98 357 -126 -538 -484 -25
7864 -25 -50 5 -237 -194 -120 -186 -6 -405 -3 -93 197 -99 29 515 427 -57 120 375 146 38 89 268 90
7887 90 -16 17 30 -93 -170 98 -157 -224 -197 -218 -340 -363 262 184 -357 -54 465 52 -189 11 360 200 60
7910 60 4 279 294 175 90 -90 30 190 137 -343 -151 152 183 -155 -325 366 293 -384 -216 -28 333 -70
7932 -70 -138 0 182 254 -37 33 115 130 -15 -162 52 355 312 -154 -372 187 224 -285 -502 -27 254 112 -354
7955 -354 -10 141 279 -210 -13 -31 97 277 -142 -446 113 605 148 -319 82 390 221 -341 -377 259 176
7976A76m48j93K11L82J20n19m5N20P4l36n40L54Q19k67r19M93P94k58o80N9J37
7997f6K71l84j48J3M70M52l95o36L58K81J2o37R8L52J21k12m23L64L89k78j05
8018a03M0K41N7l3n40L74J92J96n40j25M34J54k33o98L85M98j61l57p8K36P4L50
8040C63m52p8J62L63k62m83K48O28j05l07j61J35N01m80k84m9L93p4l2l24L19
8061B1M31j91m62k85N31J69m54j64N83K76m36p5r8K64J20j08m03J64L06J80n22
8082a53l52N45M95n66p81O07N05l43m12R4M34K20M2m45j25O83m18k76j60K32L95
8103B21K18r46K03Q06k14n17O1M6M04l41k2r2J88K61m66k0Q3M63l32m99K48N11
8125B64J3o39J47J98L94m68r0QL43j81J76l65K25J05M7l06l80M31K96l88k9J59
$$ plain form
7976 176 -272 -465 -254 128 248 -271 -316 204 278 -58 -598 -244 575 308 -611 -118 676 418 -262 -203 -66
7997 -66 205 -179 -327 -314 156 608 213 -423 -65 216 228 -409 -311 41 162 -50 -473 -109 280 2 -103
8018 -103 -63 178 235 202 -338 36 228 424 -116 -241 193 347 114 -584 -199 299 138 -219 -297 -61 13 363
8040 363 -89 -167 -5 358 96 -387 -139 489 384 77 -84 51 552 72 -212 -261 132 58 26 -298 21
8061 21 452 261 -201 -486 45 214 -240 -404 179 455 19 -56 -154 110 230 122 -281 -117 189 369 -153
8082 -153 -505 40 535 -31 -812 -205 300 -43 -455 -361 73 293 335 -110 -235 448 30 -246 -406 -174 221
8103 221 439 -507 -304 502 288 -229 -168 -122 282 -59 -81 -173 15 276 -190 -210 -127 336 4 -495 -247 264
8125 264 277 -362 -215 -17 377 -91 -181 -173 170 -11 165 -200 25 130 177 -129 -509 -78 218 -170 -199 -40
8147d0K47j23j87M92m10K41Ml07K4m1J74O0l62j00N32k25k45J10N11m21l21M14
8169B7J73l33LL08r5j4J27Q4j48k20J77M64m53j70M4K30r7p9J99j72q9K1
$$ plain form
8147 -40 207 84 -103 389 -21 220 224 -83 -59 -100 74 134 -228 -328 204 -21 -266 -156 355 -66 -387 27
8169 27 200 -133 -130 178 83 69 196 280 132 -88 89 553 100 -70 -26 204 107 28 227 55 -34 -13
8191a3
$$ Imaginary data points
##PAGE= N=2
##DATA TABLE= (X++(I..I)), XYDATA
0@%%%%%%qJ6qQk4K9k9M0n6O4p2R6j20J36j62K01k36K74l27L83m38N06n89O75p68
31d09Q79j002J131j275J439j616J807k023K258k510K789l097L430l790M189m627
47b427N100n615O186o816P506q274R134j0091J1167j2398J3813j5450J7380j9700
61a0485K2538k6108L0762l7102M6273o0778Q7208j50327N77278M57007j495334
72e59068k43617J112992O82872r47899r20395N34089J083139j04178j016561m05913
82g84539Q85400O92183p04033j025710L53082J144843O7350j131553l50890J052692
92A98825O84526p63059q60577L74809R33258M965q33781l03063O78742O12355
102G27000l65651p92597M6336P95237J61268q19579m61897O44987O35107m39423
$$ plain form
0 0 0 0 0 0 0 0 -8 8 0 8 -16 13 -16 24 -32 32 -40 56 -64 72 -90 111 -125 149 -178 205 -233 273 -316 359 -409
31 -409 470 -532 599 -676 763 -853 954 -1069 1189 -1321 1468 -1629 1801 -1989 2200 -2427
47 -2427 2673 -2942 3244 -3572 3934 -4340 4794 -5297 5870 -6528 7285 -8165 9215 -10485
61 -10485 12053 -14055 16707 -20395 25878 -34900 52308 -98019 479259 936266 -559068
72 -559068 -802685 310307 993179 45280 -875115 -341026 742113 637935 -378626 -784539
82 -784539 100861 793044 89011 -936699 -583617 561226 628576 -502977 -853867 198825
92 198825 883351 120292 -740285 -365476 567782 572747 -261034 -564097 114645 727000
102 727000 361349 -431248 -384912 410325 571593 -247986 -709883 -64896 570211 130788
112A30788p17209K23291P27331J5830o42284k87997M27669M59943j82744m94451
122c39833q705N37357L17453l98039m52855K79988N01054j63674n43838k8091
132b99183M85216J61190l66681k19168K29491K52129q9317l12620j35440K16428
142g7955K30878j35922l17924L9490M11926J28620l44409j82081K67699K20472
152B40794j78680k42553Q3594K28048N4207j08611j06888M5871J66377K0452k29131
163b6520j67146J64948J93107j69922k43877J22824K75193k7230k42477m7725
173a68825J58777O5150q9394j02873J16J36754J26317o1677j36981N9005K02881
184A89250k0444k48410m1865K07472M8046j77099o6886J48553R7061q8944q9821
$$ plain form
112 130788 -586421 -363130 364201 380031 -262253 -550250 -122581 337362 154618 -339833
122 -339833 -348538 188819 506272 108233 -344622 -64634 436420 272746 -271092 -299183
132 -299183 186033 347223 -19458 -238626 -9135 242994 153677 -158943 -294383 -77955
142 -77955 152923 17001 -300923 -261433 150493 279113 -65296 -247377 20322 240794
152 240794 62114 -180439 -96845 131203 185410 76799 -30089 15782 182159 202611 -26520
163 -26520 -193666 -28718 164389 -5533 -249410 -126586 148607 121377 -121100 -168825
173 -168825 -10048 55102 -34292 -137165 -137049 -295 126022 64345 -72636 -13631 189250
184 189250 168806 -79604 -121469 86003 134049 -43050 -109936 38617 135678 46734 -43087
195d3087j882J6505J8611k8856r2941j2405J24495P5811r1391o0757J24719Q6567
207A15389j17289q7107Q5422N3958n7782o177P2820J8737l4915K6605L3710p7572
219B5799o4099M8210J1564p0273k1764M6834K8766p066J3568L115o1361j188P1463
232B3568n0306j03536O7978J45396j8777j30251L8616J78926j1748j69144l1808
243f1086R2782M5391n6457q2622J5419J04608P0489p5552j60971K7186J88275
254A07462l9018k41452k8303K27484R4898j90782j04079J95875J46305j22874
264D5516j60211J5303J48123O4219j27779j23378R5210K18731J6632k53143r8385
275a59162K45288J28996k44648k09697J62189K36066r0877k26993M4428K16836
$$ plain form
195 -43087 -44969 -28464 -9853 -38709 -131650 -144055 -19560 56251 -35140 -95897 28822 115389
207 115389 -1900 -89007 -3585 50373 -7409 -13586 59234 77971 43056 69661 103371 25799
219 25799 -38300 9910 21474 -48799 -70563 -23729 5037 -2029 11539 14654 -46707 -47895 23568
232 23568 -26738 -130274 -62296 83100 64323 -65928 -27312 151614 139866 -29278 -61086
243 -61086 31696 77087 20630 -61992 -46573 58035 128524 52972 -107999 -80813 107462
254 107462 68444 -173008 -201311 26173 121071 -69711 -173790 22085 168390 45516
264 45516 -114695 -99392 48731 112950 -14829 -138207 -42997 175734 192366 -60777 -159162
275 -159162 86126 215122 -29526 -239223 -77034 159032 68155 -158838 -114410 102426
285A02426M2396j69009j41332P9215J86474j2322k16010o2250K46420J95628j90207
296F1429k51519J45063K76143q7359k90266k2329K41093R4230j69372j13979J05441
307a1425J44095j4060j75973j00847J42375J45707j21314k07837P1538K73222
317A45481J9260k55866o0366K19587J04277j67438j64465P1257J63831K3777j05147
328e812p7045P2086J48143k1784j94753n4578J73748Q4507j78856j33798J61990
339b6152J80889q8222j69968K3932J43943L1023j19014j12049L3032J49896O5815
350A13125j32033j14160J31767J82092q8017k20784J8990J99032J3584j80930
360g7334n6732J50531J15461o8270j25506o425J17701O9380j25266j69544P4775
$$ plain form
285 102426 144822 -24187 -165519 -86304 100170 87848 -128162 -190412 56008 251636 61429
296 61429 -190090 -45027 231116 143757 -146509 -168838 72255 166485 -2887 -116866 -11425
307 -11425 132670 118610 -57363 -158210 -15835 129872 8558 -199279 -127741 145481
317 145481 164741 -91125 -151491 68096 172373 4935 -159530 -88273 75558 99335 -5812
328 -5812 -82857 -10771 137372 115588 -79165 -133743 40005 124512 -54344 -188142 -26152
339 -26152 154737 66515 -103453 -79521 64422 95445 -23569 -135618 -102586 47310 113125
350 113125 -18908 -133068 -1301 180791 92774 -128010 -109020 90012 103596 -77334
360 -77334 -134066 16465 131926 63656 -61850 -68275 49426 118806 -6460 -176004 -101229
371a01229K30297K367k36641n4368K49043J31904k08769j89954J17148J85851
381A25649m6249j83170l1373J70153J29520r8526j83601K5507K19414L5911k62146
392i8911j32119K39409K06112j78222k41224J24243K83741k9524k73639p9681
402a79815J90606J39655j20355j97882M1650K38356O8232k17578j52751J89805
412g7K20196j67263k88771Q5382K97967O475k72961p0135K55884J49055j75221
423D0531j99206N4214K06204L7070k10243j21169J81755K11245r6314k53685L3969
434a15629K73112R193k80906r1166K21034J43469j58706j65395J11085J87019
444A33110j5913j66048q1502J17930J36668p9869j77216K4863K07662O1251j87451
$$ plain form
371 -101229 129068 131435 -105206 -159574 89469 221373 12604 -177350 -60202 125649
381 125649 79400 -103770 -135143 35010 164530 66004 -117597 -92090 127324 163235 -98911
392 -98911 -231030 8379 214491 36269 -204955 -80712 203029 173505 -100134 -179815
402 -179815 10791 150446 30091 -167791 -126141 112215 180447 -37131 -189882 -77
412 -77 220119 52856 -235915 -150533 147434 153909 -119052 -189187 66697 215752 40531
423 40531 -158675 -104461 101743 138813 -71430 -192599 -10844 200401 104087 -149598 -115629
434 -115629 157483 166676 -114230 -205396 15638 159107 401 -164994 -53909 133110
444 133110 117197 -48851 -130353 -12423 124245 44376 -132840 -107977 99685 160936 -26515
455b6515r4973J75138J15191j52160j50444P6856J41051k6991j21987m413J01331
466C2084N4608n0905r9293r112J04204K9018j19596o8206J10769J16388p0688
477B9271j08975P1016J06124n3670r8118J1028O7431P025m2881n435K5845K2971
489C1632J9755k9932n3586J7582L6759l9983n9728K8188P2918j4895n8173L7960
501a1503N8471l9385m8835K3840K8282k5363k0331L8166K6381j4429J0772J8141
513D4207j7405r620P765k3333l5330K0052M4247k7904m6914M8790O0823n0897
525A4481p2332K6961N1482l0601n2877J7507M3609J1852L700K666j0109J4142
537B0481L0157k9941o3872K1844Q2148j1235q7089R727J00844J1749r4684m1900
$$ plain form
455 -26515 -121488 53650 168841 16681 -133763 -56907 84144 57153 -64834 -69247 32084
466 32084 86692 35787 -63506 -72618 31586 60604 -58992 -127198 -16429 99959 29271
477 29271 -79704 -8688 97436 43766 -54352 -43324 24107 31132 -11749 -17184 8661 31632
489 31632 51387 21455 -32131 -14549 22210 -17773 -77501 -49313 23605 8710 -49463 -11503
501 -11503 46968 7583 -41252 -17412 10870 -14493 -34824 3342 29723 15294 26066 44207
513 44207 26802 17182 24947 1614 -33716 -13664 30583 2679 -44235 4555 65378 14481
525 14481 -57851 -30890 20592 -10009 -62886 -45379 -1770 10082 13782 16448 6339 20481
537 20481 50638 20697 -43175 -21331 60817 49582 -37507 -27780 73064 84813 -9871 -51771
549e1771M8437K9292l6108m9755j0342M5404O0386j1712p8062l458J02606K2366
561F7283j22253n5292J17482Q3717r0241q5502Q3201J16867k6855j10769k9990
572e2352P2039O0384n1470j13984j744J38835O1233j33392j11022J11990J42169
583A22686r6736j78275M1403J69047R598j42217l9442J38501J05094p2407j28735
594g1483K881J42822O2647j49565j29761J26256J91683o1370k17655K387K18183
605A17025L7092k12376j09453J39146J35614q4466j57978K8761J71753N9600j41211
616a6493j36516R8279J89844n1856k22074q794K39775J01670j98060j42792J63210
627A6193J77529j00084k00017j822J67983O2585j39745j16653Q7758J62085k0946
$$ plain form
549 -51771 -3334 25958 -10150 -59905 -70247 -24843 35543 23831 -54231 -57689 44917 67283
561 67283 -54970 -110262 7220 90937 696 -84806 -1605 115262 88407 -22362 -52352
572 -52352 19687 80071 28601 -85383 -87127 51708 112941 -20451 -131473 -19483 122686
583 122686 25950 -152325 -110922 58125 67723 -74494 -113936 24565 129659 57252 -71483
594 -71483 -68602 74220 136867 -12698 -142459 -16203 175480 114110 -103545 -101158 117025
605 117025 154117 -58259 -167712 -28566 107048 22582 -135396 -106635 65118 124718 -16493
616 -16493 -153009 -54730 135114 83258 -138816 -147610 92165 193835 -4225 -147017 16193
627 16193 193722 93638 -106379 -108201 59782 122367 -17378 -134031 -46273 115812 94866
638I4866j97352n5694J89786R7893j80019j56043J36514K08079n6850j95441J6187
649i8074J88235N4661j39702j16736P1055J45390o711j45085n0361J38634J18198
660A59504j11923j66903O4677J62757m1367j80845k5611J59863P3951j13725q6801
671a06423O7064J04807J642j06950o5452Q2668J07671l4017j18993P666J51002
682I0685M4667j33028o7937R6973P2068p7365j00590K6016Q8673J2920o0286n0280
694e7484K6861P7381k889j07825m8835R3416Q1495p1972r4756O4719J20907j3648
706F7370r2725j2257O5447L2305m1538n1568N106O0406M1370m8331p0716L6437
718h694Q8053l1061j18387j6191R7761K9487q6668m3405O8940O3604k1916n6471
$$ plain form
638 94866 -102486 -158180 31606 129499 -50520 -206563 -70049 138030 81180 -114261 -98074
649 -98074 90161 144822 5120 -111616 -40561 104829 98118 -46967 -97328 41306 159504
660 159504 47581 -119322 -54645 108112 66745 -114100 -139711 20152 94103 -19622 -106423
671 -106423 -39359 65448 67090 -39860 -105312 -22644 85027 51010 -67983 -60317 90685
682 90685 135352 2324 -65613 31360 103428 26063 -74527 -48511 40162 53082 -7204 -57484
694 -57484 -30623 46758 43869 -63956 -112791 -19375 62120 -9852 -104608 -39889 81018 67370
706 67370 -25355 -37612 27835 60140 18602 -32966 -27860 32546 73916 25585 -45131 -8694
718 -8694 79359 48298 -70089 -86280 11481 40968 -45700 -89105 -20165 43439 21523 -34948
730c4948j6711M1751M5828k3352o7584O028R7692L8083q4227m5948Q6726O3077
742A06415p6822q7837L5065P2267j6910o4723j1153M7129L9654j9912o2561k0861
$$ plain form
730 -34948 -51659 -9908 35920 12568 -55016 -48988 48704 86787 2560 -43388 43338 106415
742 106415 29593 -58244 -23179 49088 32178 -32545 -43698 3431 43085 23173 -39388 -60249
$$ [...]
8191C3
##END NTUPLES=NMR FID
##END=
