##TITLE=1H_LY-SAM
 
 8 sc, 
 4.05.2022
##JCAMPDX= 6.0         $$ Bruker NMR JCAMP-DX V2.0
##DATA TYPE= NMR FID
##DATA CLASS= NTUPLES
##ORIGIN= UXNMR, Bruker Analytische Messtechnik GmbH
##OWNER= root
$$ XWIN-NMR		Version 3.5
$$ Wed May  4 11:03:43 2022 Russian Standard Time (UT+4h)  she@DPX200
##.OBSERVE FREQUENCY= 200.13135
##.OBSERVE NUCLEUS= ^1H
##.DELAY= (6, 6)
##.ACQUISITION MODE= SIMULTANEOUS
##.ACQUISITION SCHEME= undefined
##.AVERAGES= 8
##.DIGITISER RES= 18
##SPECTROMETER/DATA SYSTEM= spect
##.PULSE SEQUENCE= zg30
##.SOLVENT NAME= CDCl3
##.SHIFT REFERENCE= (INTERNAL, CDCl3, 0, 15.7039)
##AUDIT TRAIL= $$ (NUMBER, WHEN, WHO, WHERE, WHAT)
$$ ##TITLE= Audit trail, XWIN-NMR		Version 3.5
$$ ##JCAMPDX= 5.01
$$ ##ORIGIN= Bruker BioSpin GmbH
$$ ##OWNER= she
$$ F:/spectra/data/she/nmr/H-F/1/audita.txt
$$ ##AUDIT TRAIL=  $$ (NUMBER, WHEN, WHO, WHERE, WHAT)
(   1,<2022-05-04 11:02:45.54 +0400>,<she>,<DPX200>,
      <created by zg, POWCHK disabled, PULCHK disabled
       configuration hash MD5:
       00 E9 B6 7A A2 85 ED C7 34 08 36 98 17 FE 4E 26
       data hash MD5: 16K
       22 A6 85 A7 80 06 F4 35 BC 8A 6F 8D DB C4 84 E5>)
$$ ##END=
$$ 
$$ hash MD5
$$ 4C 9D DB CF 2A 1B 5D 00 CC 33 94 D2 F6 E9 E3 7D
##$RELAX= 
##$RELAX= 
##$RELAX= 
##$RELAX= 
##$RELAX= 
##$RELAX= 
$$ Bruker specific parameters
$$ --------------------------
##$DU= <F:/spectra>
##$EXPNO= 1
##$NAME= <H-F>
##$PROCNO= 1
##$TYPE= <nmr>
##$USER= <she>
##$AMP= (0..31)
100 100 100 100 100 100 100 100 100 100 100 100 100 100 100 100 100 100 
100 100 100 100 100 100 100 100 100 100 100 100 100 100 
##$AQSEQ= 0
##$AQ_mod= 1
##$AUNM= <au_zg>
##$AUTOPOS= <>
##$BF1= 200.13
##$BF2= 200.13
##$BF3= 200.13
##$BF4= 200.13
##$BF5= 200.13
##$BF6= 200.13
##$BF7= 200.13
##$BF8= 200.13
##$BYTORDA= 1
##$CFDGTYP= 0
##$CFRGTYP= 5
##$CHEMSTR= <none>
##$CNST= (0..31)
1 1 145 1 1 1 1 1 1 1 1 1 1 1 1 1 1 1 1 1 1 1 1 1 1 1 1 1 1 1 1 1 
##$CPDPRG= <>
##$CPDPRG1= <>
##$CPDPRG2= <>
##$CPDPRG3= <>
##$CPDPRG4= <mlev>
##$CPDPRG5= <mlev>
##$CPDPRG6= <mlev>
##$CPDPRG7= <mlev>
##$CPDPRG8= <mlev>
##$CPDPRGB= <>
##$CPDPRGT= <>
##$D= (0..31)
0 1.2 0 0 0 0 0 0 0 0.06 0 0.03 0 0 0 0 0.0002 0 0 0 0 0 0 0 0 0 0 0 0 
0 0 0 
##$DATE= 1651647765
##$DBL= (0..7)
120 120 120 120 120 120 120 120 
##$DBP= (0..7)
150 150 150 150 150 150 150 150 
##$DBP07= 0
##$DBPNAM0= <>
##$DBPNAM1= <>
##$DBPNAM2= <>
##$DBPNAM3= <>
##$DBPNAM4= <>
##$DBPNAM5= <>
##$DBPNAM6= <>
##$DBPNAM7= <>
##$DBPOAL= (0..7)
0.5 0.5 0.5 0.5 0.5 0.5 0.5 0.5 
##$DBPOFFS= (0..7)
0 0 0 0 0 0 0 0 
##$DE= 6
##$DECBNUC= <off>
##$DECIM= 32
##$DECNUC= <off>
##$DECSTAT= 4
##$DIGMOD= 1
##$DIGTYP= 9
##$DL= (0..7)
0 120 120 120 120 120 120 120 
##$DP= (0..7)
150 150 150 150 150 150 150 150 
##$DP07= 0
##$DPNAME0= <>
##$DPNAME1= <>
##$DPNAME2= <>
##$DPNAME3= <>
##$DPNAME4= <>
##$DPNAME5= <>
##$DPNAME6= <>
##$DPNAME7= <>
##$DPOAL= (0..7)
0.5 0.5 0.5 0.5 0.5 0.5 0.5 0.5 
##$DPOFFS= (0..7)
0 0 0 0 0 0 0 0 
##$DQDMODE= 0
##$DR= 18
##$DS= 0
##$DSLIST= <SSSSSSSSSSSSSSS>
##$DSPFIRM= 0
$$ [...]
##$SUBNAM2= <"">
##$SUBNAM3= <"">
##$SUBNAM4= <"">
##$SUBNAM5= <"">
##$SUBNAM6= <"">
##$SUBNAM7= <"">
##$SUBNAM8= <"">
##$SUBNAM9= <"">
##$SW= 18.05172834244
##$SWIBOX= (0..15)
0 0 2 0 0 0 0 0 0 0 0 0 0 0 0 0 
##$SW_h= 3612.71676300578
##$TD= 16384
##$TD0= 1
##$TE= 0
##$TE2= 300
##$TE3= 300
##$TEG= 300
##$TL= (0..7)
0 120 120 120 120 120 120 120 
##$TP= (0..7)
150 150 150 150 150 150 150 150 
##$TP07= 0
##$TPNAME0= <>
##$TPNAME1= <>
##$TPNAME2= <>
##$TPNAME3= <>
##$TPNAME4= <>
##$TPNAME5= <>
##$TPNAME6= <>
##$TPNAME7= <>
##$TPOAL= (0..7)
0.5 0.5 0.5 0.5 0.5 0.5 0.5 0.5 
##$TPOFFS= (0..7)
0 0 0 0 0 0 0 0 
##$TUNHIN= 0
##$TUNHOUT= 0
##$TUNXOUT= 0
##$USERA1= <user>
##$USERA2= <user>
##$USERA3= <user>
##$USERA4= <user>
##$USERA5= <user>
##$V9= 5
##$VALIST= <valist>
##$VCLIST= <CCCCCCCCCCCCCCC>
##$VD= 0
##$VDLIST= <DDDDDDDDDDDDDDD>
##$VPLIST= <PPPPPPPPPPPPPPP>
##$VTLIST= <TTTTTTTTTTTTTTT>
##$WBST= 1024
##$WBSW= 4
##$XGAIN= (0..3)
0 0 0 0 
##$XL= 0
##$YL= 0
##$YMAX_a= 253933
##$YMIN_a= -252052
##$ZGOPTNS= <>
##$ZL1= 120
##$ZL2= 120
##$ZL3= 120
##$ZL4= 120
##$ABSF1= 10
##$ABSF2= 0
##$ABSG= 5
##$ABSL= 3
##$ALPHA= 0
##$AQORDER= 0
##$ASSFAC= 0
##$ASSFACI= 0
##$ASSFACX= 0
##$ASSWID= 0
##$AUNMP= <proc_1d>
##$AZFE= 0.1
##$AZFW= 0.1
##$BCFW= 1
##$BC_mod= 2
##$BYTORDP= 1
##$COROFFS= 0
##$CY= 11.3945322036743
##$DATMOD= 1
##$DC= 2
##$DFILT= <>
##$DTYPP= 0
##$F1P= 2.36226072786647
##$F2P= -0.459571619588291
##$FCOR= 0.5
##$FTSIZE= 0
##$FT_mod= 4
##$GAMMA= 1
##$GB= 0.15
##$INTBC= 1
##$INTSCL= 1
##$ISEN= 128
##$LB= 0.24
##$LEV0= 0
##$LPBIN= 0
##$MAXI= 10000
##$MC2= 0
##$MEAN= 0
##$ME_mod= 0
##$MI= 1.114404
##$NCOEF= 0
##$NC_proc= 0
##$NLEV= 6
##$NOISF1= 3.799351
##$NOISF2= 2.8
##$NSP= 1
##$NTH_PI= 0
##$NZP= 0
##$OFFSET= 15.70392
##$PC= 1
##$PHC0= -18475.69
##$PHC1= 11.60075
##$PH_mod= 1
##$PKNL= yes
##$PPARMOD= 0
##$PSCAL= 0
##$PSIGN= 0
##$REVERSE= no
##$SF= 200.130013532006
##$SI= 16384
##$SIGF1= 3
##$SIGF2= 2
##$SINO= 400
##$SIOLD= 16384
##$SREGLST= <1H.CDCl3>
##$SSB= 0
##$STSI= 0
##$STSR= 0
##$SW_p= 3612.71676300578
##$SYMM= 0
##$S_DEV= 0
##$TDeff= 0
##$TDoff= 0
##$TI= <>
##$TILT= no
##$TM1= 0
##$TM2= 0
##$TOPLEV= 0
##$USERP1= <user>
##$USERP2= <user>
##$USERP3= <user>
##$USERP4= <user>
##$USERP5= <user>
##$WDW= 1
##$XDIM= 8192
##$YMAX_p= 0
##$YMIN_p= 0
$$ End of Bruker specific parameters
$$ ---------------------------------
##NTUPLES= NMR FID
##VAR_NAME=  TIME,          FID/REAL,        FID/IMAG
##SYMBOL=    X,             R,               I
##VAR_TYPE=  INDEPENDENT,   DEPENDENT,       DEPENDENT
##VAR_FORM=  AFFN,          ASDF,            ASDF
##VAR_DIM=   8192,          8192,            8192
##UNITS=     SECONDS,       ARBITRARY UNITS, ARBITRARY UNITS
##FACTOR=    0.0002768,     1,               1
##FIRST=     0,             0,               0
##LAST=      2.2672688,     0,               0
##MIN=       0,             -252052,         0
##MAX=       2.2672688,     253933,          0
$$ Real data points
##PAGE= N=1
##DATA TABLE= (X++(R..R)), XYDATA
$$ [...]
1767b12p8Q88j441J598q82m02J253j216O99j64l79Q40q88M05K12n07M41k60Q1
1786a2J06k20J74K3j61O8J94l24J82M4k20M24n70L70K24p62Q37n35J00M32j017
1807f43J213o55l33J054j253J074m79n74J548j683Q96J76j058J645j688Q18O53
1824G11j777J920j269K18J028k044K114j020n28J681k098J746o03j002K217k274
1840i80J273J71j504K307k136Q72Q72k101K315j582K04J326k352K271j094n50
1856f88J858k347J851n21j083K199k290J329J98j580K237j942P85P40j915K189
1872A020j453R8J225j997J938r87m52J617j958J441l74q01J682j793J005K13j167
1889g43J535j323N81M89j340J440q42J3O83j129J140n54l24Q79r00O00j74l39
$$ plain form
1767 -212 -290 598 -843 755 -127 -529 724 -492 207 43 -336 504 -384 21 233 -274 167 -93 -12
1786 -12 94 -126 48 71 -90 -22 172 -152 30 74 -146 278 -292 78 302 -460 377 -158 -58 374 -643
1807 -643 570 -85 -418 636 -617 457 -22 -596 952 -731 165 341 -717 928 -760 58 711
1824 711 -1066 854 -415 -197 831 -1213 901 -119 -647 1034 -1064 682 79 -923 1294 -980
1840 -980 293 464 -1040 1267 -869 3 875 -1226 1089 -493 -289 1037 -1315 956 -138 -688
1856 -688 1170 -1177 674 153 -930 1269 -1021 308 506 -1074 1163 -779 6 746 -1169 1020
1872 1020 -433 -335 890 -1107 831 -156 -608 1009 -949 492 118 -683 999 -794 211 424 -743
1889 -743 792 -531 50 539 -801 639 -203 -190 493 -636 504 -50 -374 505 -395 205 31 -308
1907c08P39p07K55J69l29L57l14J04J84k50P6O0l9l6J01j78K09j4l24N04m19J68
1929HK18o55Q63n48j03O98j029J021n18m55J328j484R35j14q42J725j884R14N96
1948F74j666J978j708P11J031k561K613j298k85J631k732K902j299j303K998l028
1964a342K138o48j672L804l853J596J075k741L628l577J512K100m542M153k140
1979e09k0K487m870M911j662k328M273m369L620j230k996O088n244J739J368l587
1995b329N515n447J577L711o112N054k992L86L755p259O318j366l148N049n825
2010c113N402j509m673P960o056K183R82m440P865p260J386M801o878O147m773
2025a976J126N283r482P222j410k853N457p910P465j353o297Q888o462L327J35
$$ plain form
1907 -308 431 -276 -21 148 -181 176 -138 -34 150 -100 -24 36 -3 -39 62 -116 93 79 -245 259 -160 8
1929 8 226 -429 434 -114 -217 481 -548 473 -45 -500 828 -656 279 165 -677 1048 -836 78 674
1948 674 -992 986 -722 -11 1020 -1541 1072 -226 -511 1120 -1612 1290 -9 -1312 1686 -1342
1964 -1342 796 148 -1524 2280 -1573 23 1098 -1643 1985 -1592 -80 2020 -2522 1631 -509
1979 -509 -529 1958 -2912 1999 337 -1991 2282 -2087 1533 303 -2693 3395 -1849 -110 1258 -2329
1995 -2329 3186 -2261 -684 3027 -3085 1969 -1023 -637 3118 -4141 2177 811 -2337 2712 -3113
2010 -3113 2289 780 -3893 4067 -1989 194 1176 -3264 4601 -2659 -1273 3528 -3350 2797 -1976
2025 -1976 -850 4433 -5049 2173 763 -2090 3367 -4543 2922 1569 -4728 4160 -2302 1025 1160
2040A160n766J0242q020N32N240o882P339o455Q66P320j0634O835j358k292O202
2055D329r953Q198K9p459Q733o687M556mp581J1710p555j67M790o906Q994p733
2071b706k7Q747j0608O565k500j305P375j1828Q293Q48p051Q033p875O462J18
2086B541r156J2003o806M57L314p271J0929q240j251Q961r446O631m086r72Q909
2101F517j2397O934J514n902P461q993O911J594j0062J0734n617J124K616q186
2115e752J1558o835k670Q187q076O911m824j784R935j1437N309J171m457P483
2129D719r945O465K780r454Q930n489K636K161r026J1271n397k509O207p182P971
2144D138n380k567R735r562M487k79l159P855j0061N155L300p730P165n682L310
$$ plain form
2040 1160 -4606 5636 -2384 -1852 3388 -3494 3845 -2610 -1744 5576 -5058 1777 419 -1873 4329
2055 4329 -5624 2574 2603 -4856 3877 -2810 1746 1742 -5839 5871 -1684 -1851 2939 -3967 5027 -2706
2071 -2706 -2733 6014 -4594 1971 -529 -1834 5541 -6287 2006 2854 -4197 3836 -4039 2423 2541
2086 2541 -6615 5388 -1418 -961 2353 -4918 6011 -2229 -3480 5481 -3965 2666 -1420 -2392 6517
2101 6517 -5880 1054 2568 -3334 4127 -4866 2045 3639 -6423 4311 -1306 -182 2434 -5752
2115 -5752 5806 -1029 -3699 4488 -3588 3323 -1501 -3285 6650 -4787 522 1693 -2764 4719
2129 4719 -5226 1239 4019 -5435 3495 -1994 642 2803 -6223 5048 -349 -2858 3349 -3833 4138
2144 4138 -1242 -3809 5926 -3636 851 572 -2587 5268 -4793 362 3662 -4068 3097 -2585 725
2159G25K612r113R506l711j959M622o678P864m210l500Q429p248L736r19k953
2174b797P791q589L225L201n805N891n621K942L218q098P184k677q80L403o358
2189c970P174k927l383O340n480L845j601k820P058o714K173J996l903N139n416
2204b489K323L120o250N107k378Q0K710n658N626j686k659M314m115L415j219
2219B41k737N485m468J285J225k797M161m010J062K702m209L308j813J23K335
2234A893m266L561o93j766K718k973K558n92k215L572k653R10N15j884K999k597
2250i13M78J648k395K100j443J92J573k627K000m41p96J493j871J565k65j244
2266i46J830j374N90J99j032J541j182J33P92j070R29n86k2P39j011O44m6l80
$$ plain form
2159 725 3337 -5776 3730 19 -1940 2682 -3996 3868 -342 -3842 4587 -2661 1075 156 -2797
2174 -2797 4994 -3595 -370 2831 -2974 2917 -2704 238 3456 -4642 2542 -135 -1015 2388 -3970
2189 -3970 3204 277 -3106 3234 -2246 1599 -2 -2822 4236 -2478 -305 1691 -2212 2927 -2489
2204 -2489 -166 2954 -3296 1811 -567 -487 2223 -3435 2191 505 -2154 2160 -1955 1460 241
2219 241 -2496 2989 -1479 -194 1031 -1766 2395 -1615 -553 2149 -2060 1248 -565 -442 1893
2234 1893 -2373 1188 495 -1271 1447 -1526 1032 440 -1775 1797 -856 54 569 -1315 1684 -913
2250 -913 -435 1213 -1182 918 -525 -333 1240 -1387 613 172 -624 869 -1002 563 298 -946
2266 -946 884 -490 100 299 -733 808 -374 -241 551 -519 410 -176 -198 541 -470 174 128 -252
2284b52N58n70L53P5m46M71k22k9J56k05J83o0j18J80o0j38K00o8j05J95k33K18
2306H3k5l06N04l75N6K33m64O02m54l4N90p84N87k04k46P24r76O82K5o67R45q85
2328c89M98J97r46J246q80J43N94j110J250q01j45J030j375J084m08m60J240j493
2346g25R82Rr33J413j330O90L48j275J586j126K01P57j426J515q79k08J187j586
2364h00J281m38n87J395j581J010Pr84J512j373O27L88j233J526j125K08P79j387
2382g75J370p60j83J047j437J140l49n28J164j314Q75j2q23J224j072M87K60r23
2400f09J199q56J19N75r53R56n68q2P22r59P02k00k97O69p87N10K3m70O09n11
2420b08K59J01m35N29l06oJ79k67K82j74m3J87j44L1J0RkJ8p5M7J13k46K26j00
$$ plain form
2284 -252 306 -264 89 164 -282 189 -33 -62 94 -111 72 12 -106 74 14 -124 76 8 -97 98 -135 83
2306 83 58 -248 256 -119 -63 170 -294 308 -146 -180 410 -374 213 9 -237 487 -489 193 218 -449 496 -389
2328 -389 109 306 -640 606 -274 -131 463 -647 603 -198 -343 687 -688 396 -12 -472 768 -725
2346 -725 257 266 -667 746 -584 106 454 -821 765 -361 -160 597 -829 686 -193 -401 786 -800
2364 -800 481 43 -544 851 -730 280 287 -697 815 -558 69 457 -776 750 -375 -167 612 -775
2382 -775 595 -165 -348 699 -738 402 53 -475 689 -625 250 238 -585 639 -433 54 314 -609
2400 -609 590 -266 -147 428 -525 431 -137 -219 503 -456 246 46 -251 418 -369 141 164 -306 303 -208
2420 -208 51 152 -283 246 -60 -66 113 -154 128 -46 -89 98 -46 -15 -5 4 2 20 -55 -8 105 -141 85 -15
2444a5p3K92m39L69l6l41N51n68L72R3o40Q83o64J78L48q53J096p41j09Q72j160
2465e85J043n71l26J267j592J028n6q13J461j699J072L20j554J878j436O23N85
2482F45j895K373j438j74J403k057K187j334n59K340k683J719l82j045K513l060
2498a447J728O50k314K711k373J237R84l168L486j818k66J832l049L417j812j248
2514a450L417l437K253p12j519L838m197J890J117k868L510l422J702J704m400
2529b574M253k123o3K133m217M671k083j785L971m010L204j419j993N105n041
2544a971K078R70k915M412m759K155K364n114M612k746O38K426n516N600j976
2559B58k121M048m549M271j762k881O095n216K026P35l140N524n592J753L190
$$ plain form
2444 -15 -88 204 -235 134 98 -243 308 -260 112 205 -435 448 -216 -38 310 -543 553 -188 -297 575 -585
2465 -585 458 -113 -439 828 -764 264 208 -605 856 -843 229 549 -1005 873 -563 60 645
2482 645 -1250 1123 -315 -489 914 -1143 1044 -290 -849 1491 -1192 527 145 -900 1613 -1447
2498 -1447 281 931 -1383 1328 -1045 192 1176 -1992 1494 -324 -590 1242 -1807 1610 -202 -1450
2514 -1450 1967 -1470 783 71 -1448 2390 -1807 83 1200 -1668 1842 -1580 122 1826 -2574
2529 -2574 1679 -444 -507 1626 -2591 2080 -3 -1788 2183 -1827 1377 -42 -2035 3070 -1971
2544 -1971 107 1077 -1838 2574 -2185 -30 2334 -2780 1832 -914 -276 2150 -3366 2234 258
2559 258 -1863 2185 -2364 1907 145 -2736 3359 -1857 169 904 -2236 3288 -2304 -551 2639
2574B639n357M717l291R15L223o577N713j513k155M018n261N124j590l746O400
2589C259n053K381J13l417O542n998J366L232m950M997m329J294L868p018N456
2604A743j619j332L738o093N792j286m012N924m829L125m60l932P131n648R23
2619h35K807m442N418m876Q77M539o733M754j690q95M044o641N397m04m049N243
2635B514m683L487k49m575O984m750O25K225m181N792m836K08M613n842M216k214
2651f66m11M274o673M720j07l188M369m855L961j22m608O138l978J078J271l936
2667b733N897m388j78L915m704L959k646l35M338n970L698m8k362L821m764L509
2683A009N06m289M938l232J211J066l917N303l259o29L184l793L650k418p46M111
$$ plain form
2574 2639 -2718 1999 -1292 -377 2846 -3731 1982 469 -1686 2332 -2929 2195 605 -3141 3259
2589 3259 -1794 587 700 -2717 3825 -2173 -807 2425 -2525 2472 -1857 -563 3305 -3713 1743
2604 1743 124 -1208 2530 -3563 2229 943 -3069 2855 -1974 1151 691 -3241 3890 -1758 -835
2619 -835 1972 -2470 2948 -1928 -1051 3488 -3245 1509 -181 -1076 2968 -3673 1724 1320 -2729 2514
2635 2514 -2169 1318 1069 -3506 3478 -1272 -647 1578 -2603 3189 -1647 -1439 3174 -2668 1548 -666
2651 -666 -1077 3197 -3476 1244 1137 -2051 2318 -2537 1424 1302 -3306 2832 -1146 -68 1203 -2733
2667 -2733 3164 -1224 -1402 2513 -2191 1768 -878 -1213 3125 -2845 853 805 -1557 2264 -2500 1009
2683 1009 1515 -2774 2164 -1068 143 1209 -2708 2595 -664 -1293 1891 -1902 1748 -670 -1416 2695
2699B695m791K702j69j686L436m357K742Q02l416L691k766J443Q53l521M311k384
2715d15l60K087k995L337k129p59L246l503K134n62j089K891l542J963O66k353
2731a383K667k320J250Q32k817L053j555k04J438k336K559j334q44K328k330J486
2747D90m10r48K241k385J080N76j536J836j674P63P96j949J867r35l9Q97j621
2764i51J671p50n69J351j379R99l52n86J362j350O11K33p74J032r73M27M14r71
2782e55R33n03J1M42p83P61l06k67N87n80L82o7k88N30m48J25J76l02K90k05L4
2803c3J72k51J44K1j18R7m5j9Q0j10L6J21j99J13L0j48K17k31J12J60l77L50j39
2826a7r4L01m40M02j08k96N49n12K83M6m16O63n86J80L08n98O53m82N1M86q15
$$ plain form
2699 2695 -2096 606 437 -1249 2187 -2170 572 1374 -2042 1649 -1117 326 1179 -2342 1969 -415
2715 -415 -775 1312 -1683 1654 -475 -1234 2012 -1491 643 81 -1008 1883 -1659 304 970 -1383
2731 -1383 1284 -1036 214 1046 -1771 1282 -273 -477 961 -1375 1184 -150 -994 1334 -996 490
2747 490 80 -868 1373 -1012 68 644 -892 944 -730 33 829 -1120 747 -188 -227 670 -951
2764 -951 720 -30 -599 752 -627 372 20 -566 796 -554 57 290 -484 548 -425 2 416 -555
2782 -555 378 -125 -114 328 -455 306 0 -267 320 -260 122 55 -233 297 -151 -26 150 -152 138 -67 -33
2803 -33 139 -112 32 53 -65 32 -13 -32 48 -62 -26 95 -104 9 39 -109 108 -123 -11 149 -228 122 -17
2826 -17 -111 190 -250 152 44 -252 297 -215 68 114 -302 361 -225 -45 263 -335 318 -164 -113 373 -442
2847d42P21k96k13O32q33O72j43m91Q55q14M56Q6o61R73q07K43L78q31R40o42
2867b17L1O35j000Q85l82k49Q07j006P49j32n49R65r44N23J30p32J005q18K63
2886c6M20q87R42o12J0O09r56Q54l73k59P57r03O58j38m69Q61q33M28J31o18Q31
2907D17o90K23L38p11P30m45J7M44p13O42k57j99N00o01M71j14l03N45m81K43
2927E6N0l06M57l92J17J66l18L09k08L7J66k82K23o7l7R2j42J24k9n5K8J7%n5
2951d9O1m7Q4o8p4K15k14J25Rj79L40l49J28J85l95M51l45O1L45o30N86k49j47
2974a56N24p70O52j33m89Q14q08N22K6p07J122r18K67M08r25J184r40J08Q43j310
2994f86J154o29j50J064j611J277k56p43J342j528J145m7j241J832j462N80M31
$$ plain form
2847 -442 279 -17 -230 402 -431 241 98 -393 462 -352 104 190 -471 502 -305 -62 316 -515 425 -217
2867 -217 -186 449 -551 334 -48 -297 510 -496 253 121 -428 537 -407 116 246 -486 519 -299 -36
2886 -36 384 -503 439 -173 -163 446 -510 344 -29 -288 469 -434 224 86 -383 478 -355 73 204 -414 417
2907 417 -273 -50 288 -423 307 -138 -121 323 -390 252 -5 -204 296 -305 166 52 -251 294 -187 56
2927 56 106 -200 257 -135 -18 148 -170 139 -69 -32 134 -148 75 8 -29 63 -79 45 16 -39 -11 6 6 -49
2951 -49 12 -35 49 -19 -93 122 -92 33 42 -137 203 -146 -18 167 -228 223 -122 -61 284 -346 240 -9 -156
2974 -156 368 -402 250 117 -372 442 -366 156 182 -525 597 -321 -54 354 -571 613 -327 -219 624 -686
2994 -686 468 -161 -311 753 -858 419 163 -580 762 -766 379 332 -909 923 -539 41 472
3011D72j439K034j559J34J249j849J760j126j58J708k409J717l21r48J875k329
3027a189J671J32j887K450j921Q70N60k169K891j906o5J634k349K429j578m16
3043h43K481l043J999m44j052K483l142K041L70k301K828k422J362O32k836L524
3059A637k114j0J611k729L207k085n83K902l344K341r01r77L084l855K223M96
3075I03k372L060l016J793Q97l444L815k172J31J636l269L849k120j040L230l448
3091a567K609j140j312L775m149K029O68k409L383l531J840J403l827L809k220
3106f39L87J699l815M209j950j226L059l432L072j491j527M088m083J952L14k089
3122a472L647l978J842J565l631L554k480Q59J702m106M158j680j092K699l474
$$ plain form
3011 472 -967 1067 -492 -358 891 -958 802 -324 -482 1226 -1183 534 213 -735 1140 -1189
3027 -1189 482 614 -1273 1177 -744 126 686 -1483 1408 -498 -563 1071 -1278 1151 -427 -843
3043 -843 1638 -1405 594 150 -902 1581 -1561 480 850 -1451 1377 -1045 317 949 -1887 1637
3059 1637 -477 -487 1124 -1605 1602 -483 -1066 1836 -1508 833 -68 -1045 2039 -1816 407 903
3075 903 -1469 1591 -1425 368 1265 -2179 1636 -536 -405 1231 -2038 1811 -309 -1349 1881 -1567
3091 -1567 1042 -98 -1410 2365 -1784 245 913 -1496 1887 -1644 196 1599 -2228 1581 -639
3106 -639 -252 1447 -2368 1841 -109 -1335 1724 -1708 1364 -127 -1654 2434 -1649 303 617 -1472
3122 -1472 2175 -1803 39 1604 -2027 1527 -953 -94 1608 -2498 1660 -20 -1112 1587 -1887
3137a887L399j460j871M091l711J862O9k097L940l923J371J776l354L370k618
3152a043Q05K084m228L732j325r54K501l600L431j085k132L763l255J872j76k110
3168a720L975l563J024J491k756L182k774Q25K104l787L118j296m29K118l499
3183a987L205q26j843L021k826K009l66k047L616k942Q10J091k284K968k554M83
3199d72K042l168K535j191l14K050l220K562l72j614K439k456J795j06k050L054
3215A514k219N80Q29j963K673k080J44J760k430K004j123j98J820k644J904k58
3231C13j101J827k069J555m6j628K228j636O05M62j544K117j538P5J200j683J544
3248F81r63j63J423j904J285j90p16J323j550J040J41j206J491j087M16L95j193
$$ plain form
3137 -1887 1512 52 -1819 2272 -1439 423 492 -1605 2335 -1588 -217 1559 -1795 1575 -1043
3152 -1043 -238 1846 -2382 1350 25 -929 1572 -2028 1403 318 -1814 1949 -1306 566 390 -1720
3168 -1720 2255 -1308 -284 1207 -1549 1633 -1141 -316 1788 -1999 1119 -177 -606 1512 -1987
3183 -1987 1218 392 -1451 1570 -1256 753 387 -1660 1956 -986 -176 915 -1369 1599 -955 -472
3199 -472 1570 -1598 937 -254 -568 1482 -1738 824 452 -1162 1277 -1179 616 510 -1540 1514
3215 1514 -705 -125 704 -1259 1414 -666 -522 1238 -1192 812 -311 -509 1311 -1333 571 313
3231 313 -788 1039 -1030 525 479 -1149 1079 -557 48 510 -1034 1083 -455 -380 820 -863 681
3248 681 -282 -445 978 -926 359 169 -547 776 -774 266 407 -799 692 -395 21 416 -777
3265g77J480r17q6Q33j106J037n92k37J021j184P20o3m88Q87r84N70J80p46Q49
3284C97o31K33K68o82P57m35o6M29n72N20k65j50M80n26L01j5k16L77l89J94J07
3305A16k92K99j75K3J45k45K08m5j09J59j25M4M1j12J26l7r4J55q6k2R0j26J20
3328E8m2j20K23j78L1J21k14K36j69l4K61l34K29m2j74L44l88K27P8l37M25l17
3350a16R5J91m35M95k80p9L80n02M38j75k12N35n86L59%l67N90n67K57J88n30
3371c21O19m47P8L32o18O26l47q7M84o64N53j92k78O11o60M18Om23O61o11K71
3392A1K03n69O82m85Q6L56o36O32l40j00M91o50N19j70k59N86o35L88J5m03O07
3413C29n47K46J61n04N99m21O4K85n16N30k97p7L98m97L86j46j63M26m77K91J0
$$ plain form
3265 -777 703 -214 -300 533 -573 464 -128 -365 656 -528 192 129 -359 528 -456 114 294 -452 397
3284 397 -234 -1 267 -415 342 -93 -159 270 -302 218 -47 -197 283 -243 58 43 -173 204 -185 9 116
3305 116 -176 123 -52 -29 116 -129 79 34 -75 84 -41 3 44 -68 58 21 -73 82 -4 -26 64 -62 58
3328 58 16 -104 119 -59 -28 93 -121 115 -54 -88 173 -161 68 26 -148 196 -192 35 113 -224 201 -116
3350 -116 -21 170 -265 230 -50 -129 251 -251 187 12 -200 335 -251 108 108 -259 331 -236 21 209 -321
3371 -321 298 -149 -71 261 -357 269 -78 -165 319 -345 208 16 -262 349 -311 107 113 -310 351 -260 11
3392 11 214 -355 327 -158 -72 284 -352 280 -60 -160 331 -319 200 30 -229 357 -278 110 125 -278 329
3413 329 -218 28 189 -315 284 -137 -73 212 -304 226 -71 -148 250 -247 139 -7 -170 256 -221 70 80
3434H0k62L92l78J98Q3l05L62k55O4J23k67L14j86j6J63k17K11j16l6J67j95J29
3456E3o1k2R1j31R4j5k6K2m0P0p5L6j3rO6j36J35n0m7J24j86K02p0j07K36k63
3482a22J95m4j74L67l75J71R3l13M51m14J50K27m80N11l34K0L56o46N86k19k29
3503b23N53o84N74j49m30P86p38M09M4n52R11q28K70L82p82R05p18J51O04j077
3523e92R75m48j68P56j149J010k71n91J074j082P53p5q14J388j187L98M21j032
3541f34J360j129K03R09j468J280o68j61J091j671J341k59q23J390j487J083m2
3558C15j233J841j431M82N03j364J844j423J22J184j717J547r26j43J438k092
3574a053J547k85q36J549j857J406k7j458K012j581O98L62j548K212j607P4J243
$$ plain form
3434 80 -182 210 -168 30 113 -192 170 -85 -21 102 -165 149 -37 -53 110 -107 104 -12 -48 119 -76 53
3456 53 -8 -30 61 -70 24 9 -17 5 -35 35 -40 -4 -17 -26 40 -96 39 -11 -58 66 -120 82 12 -95 141 -122
3482 -122 73 29 -145 222 -153 18 111 -202 249 -165 -15 212 -268 243 -91 -71 285 -361 225 6 -223
3503 -223 330 -354 220 71 -359 427 -311 98 142 -410 501 -327 -57 325 -457 448 -270 -119 485 -592
3523 -592 383 -65 -233 523 -626 384 113 -478 596 -486 267 192 -622 766 -421 -23 398 -634
3541 -634 726 -403 -200 709 -759 521 -147 -308 783 -888 453 194 -629 761 -726 357 315
3558 315 -918 923 -508 -26 477 -887 957 -466 -344 840 -877 670 -256 -399 1039 -1053
3574 -1053 494 209 -627 922 -935 471 444 -1014 998 -583 115 477 -1071 1141 -466 -392 851
3591H51j811J808j229j48J716k294J594l60p83J756k241J556J44j656K116j729
3607g10Q81M59j942K507j587l2J302j981K122j352l82K023k401J614m42p85K014
3624A308k493J529K96j689K116j899J058N14k122K507j491O8J084j972K300j412
3640b98m52J936k210J630o85o71K106k502J408K58j443J996k009J141O19k130
3656a306K330j410K05R80k059K333j220o10J847k062J654p00q39K227k356J175
3672A89K84j348K003k058R91Q23k074K066j290K77R68k118K210r88n90J552j848
3689i51J649p14q46K033j972J005R0j054J840j900Q32P08j646J707j249M02Q48
3706G82j879J842p96m00J211j635J523n87q11J695j583Q66K0r73J694j598N52
$$ plain form
3591 851 -960 848 -381 -529 1187 -1107 487 127 -656 1100 -1141 415 559 -1097 1019 -710
3607 -710 171 630 -1312 1195 -392 -424 878 -1103 1019 -333 -715 1308 -1093 521 79 -706 1308
3624 1308 -1185 344 640 -1049 1067 -832 226 740 -1382 1125 -366 -298 786 -1186 1114 -298
3640 -298 -750 1186 -1024 606 -79 -750 1356 -1146 262 520 -923 1073 -936 205 824 -1306
3656 -1306 1024 -386 -181 799 -1260 1073 -147 -757 1090 -972 682 -18 -857 1370 -986 189
3672 189 473 -875 1128 -930 61 884 -1190 876 -414 -137 831 -1287 923 -65 -655 897 -951
3689 -951 698 -16 -862 1171 -801 204 294 -760 1080 -820 12 720 -926 781 -468 -66 782
3706 782 -1097 745 -51 -451 760 -875 648 61 -750 945 -638 228 248 -725 969 -629 -77
3723g7O81j362J451j112K63Q95j650J439n63l52J036j450J275l42p86J375j232
3740e11P28j7q38J406j208L63N07r89J137r02J85P20j201J006m26j76P19j101
3758e98R35k23n30Q97q70N74l3o23R95p96K25L30o92Q03o09P1N40q08O41k72j43
3779a86N54p59N52n0m05O10n69L42O7m72O28m28O1K59m45M92l11m4L55m52L29
3800A28j14j28L24l91K42J1k19K77k33J19O5k18K46j37j8J16j75J53o3n7J47j29
3822e4M1M2q0Q9n7qR3j05M5L9q9R6o1rR9j40Q8K3j16J48j24M6P5j89J76o9o7J75
3850A07k16J72k4j64K64k35R1Q0k28K88k10QK05l11K81j35p6K81l59K70l7k07
3872a55L45l46K01P0l14M07l06P4J79l66M08k52k3K84m03L47j52j35L61m35L07
$$ plain form
3723 -77 604 -758 693 -419 -156 739 -911 528 -35 -387 649 -801 474 132 -654 721 -511
3740 -511 217 200 -638 768 -440 -77 430 -559 578 -324 -139 581 -620 386 -40 -216 503 -598
3758 -598 337 114 -416 481 -389 185 152 -471 524 -272 -47 283 -409 394 -215 -144 396 -412 229 -43 -186
3779 -186 368 -391 161 111 -294 316 -253 89 156 -316 312 -116 -55 204 -241 251 -60 -104 251 -201 128
3800 128 14 -114 210 -181 61 72 -147 130 -103 16 81 -137 109 -28 -46 70 -105 48 -15 -72 75 -54
3822 -54 -13 29 -51 38 -19 -27 66 -39 6 45 -44 52 -9 -18 81 -59 29 52 -64 84 -40 6 81 -108 68 -1 -68 107
3850 107 -109 63 39 -125 139 -96 -5 75 -153 135 -75 -67 138 -173 108 -27 -103 178 -181 89 52 -155
3872 -155 190 -156 45 115 -199 208 -98 -24 155 -211 197 -55 -78 206 -197 150 -2 -137 224 -211 96
3893I6k3k48M08m08J99Q8l38M43l42Q2K03m07M36k70j8L06m34L77j55j27L60m35
3915b07L12m4k44M06l78K06O5l26M26l21Q7J83l69L80k31nK50l75L09j11j15K88
3937A86l57K43k6j98L17k96J56L9k31L13k40P6J03k47K78j92K4J54k33K14r8k2
3959c7J34j99J62l9q5J49j58J31l2q7J37j15N8mn2Q7j03N5Pl7N1o7O2j6k3M1o2
3986d2P7p2K6L1p2Q4q5L6O1j24J32r9L1Q0j87K17j16l6J71k45K28r8j07K68k97
4011a38K15m7j64L56l74J86P2k89L88l53J26J91m18M48k99K7K68m92N05k35j45
4032a72M26n33M39j50k72N87n90L24M1l63O13o16K71K31n77O45m82J43L40p25
4052d20P31l48j49N32p36O74k49l67P78p81M68qn15Q87q48L33L28p58Q80p06J79
$$ plain form
3893 96 73 -175 233 -175 24 112 -226 217 -125 -43 160 -247 189 -81 -99 207 -227 150 -5 -132 228 -207
3915 -207 105 61 -183 223 -155 51 116 -210 216 -105 -18 165 -204 176 -55 -60 190 -185 124 13 -102 186
3937 186 -171 72 46 -152 165 -131 25 64 -167 146 -94 -18 85 -162 116 -76 -52 102 -131 83 -15 -37
3959 -37 97 -102 60 21 -64 85 -73 58 26 -61 76 -39 19 15 -37 50 -53 2 9 -28 23 -44 18 2 -21 20 -42
3986 -42 35 -37 -11 20 -52 32 -53 -17 44 -80 52 -47 -16 64 -123 94 -22 -58 113 -132 96 -2 -109 159 -138
4011 -138 77 30 -134 222 -152 34 106 -183 205 -148 -22 169 -249 199 -100 -73 195 -297 208 -27 -172
4032 -172 254 -279 160 10 -262 325 -265 59 100 -263 350 -266 5 236 -341 304 -178 -35 305 -420
4052 -420 311 -37 -186 346 -390 284 35 -332 446 -335 133 125 -390 497 -351 -18 310 -448 432 -274 -95
4073i5N33j007R37m40j59O91j022R06k73n09R73r71O53p7o42J127j012L69L43
4092C25q24J058r13K56O17j120J022n36p8P30j186J049l17n05R78j072Q13j56
4110A41p27J249j072M30K84q78J220j035K18P15j194J108o66l9Q84j383J124k90
4128H9n30J066j252R48q9q93J363j115M71K67r95J420j104J55P63j195J166p77
4146b42l4R82j430J093l00m65J031j315R99p8q87J285j071N53J70r75J400j042
4164c26J51O37j070J172q28l2R61j324R95l31l58J012j318R23Pq43J182j050N80
4183A40K06j047J364r33J10O11j071J196p79j34R83j235R25l42l60J028j281Q19
4201B00N2p57J039j000N87K11r80J181p86J49M58r33J086o66j35P96j000Q22l66
$$ plain form
4073 -95 438 -569 368 -72 -231 460 -562 344 71 -438 535 -436 217 140 -502 625 -387 -18 325
4092 325 -499 559 -354 -98 519 -601 421 -115 -193 537 -649 400 83 -422 556 -516 297 141
4110 141 -586 663 -409 21 305 -573 647 -388 -170 545 -649 459 -207 -246 638 -745 379 89
4128 89 -441 625 -627 321 232 -661 702 -413 58 325 -670 750 -354 -199 564 -631 535 -242
4146 -242 -276 706 -724 369 69 -396 635 -680 319 241 -646 639 -432 121 291 -684 716 -326
4164 -326 -175 462 -608 564 -264 -296 665 -659 336 5 -353 659 -659 264 271 -572 610 -440 140
4183 140 346 -701 663 -270 -160 451 -620 576 -203 -337 646 -589 336 -6 -366 662 -619 200
4201 200 252 -505 534 -466 121 332 -648 533 -253 -104 354 -579 507 -159 -294 502 -498 324 -42
4220d2k77Q90j062O39L8n67Q71q94N10K19q21R44o49J59L66q35R37n16j65O64
4240D09q26P08l19k86Q02q74M89M4m88P59p64L72K48o89P39n04J25L38p09P38
4260C12l61j36N08o53N68k35k48N93o02L49ql22N56n37K39J67m53M87l65J20K17
4281A96m73M64k24q2L17m32L77j38j85L96l90K23J5k42L69l28J13J42k86L11k12
4302f9K5J92l09K68j11p4K16k64J93k5j43K20j86Q5L2j39J93j36K0Q9j54J36p8
4325a9nR0j15P1j2n1O0m5J6L7p1N1lm3M8l4J0L1m4N3pn4Q2o0K9K5q0R0p0lQ1j10
4357e2Q4k6m6J28j41O1K9j00J54j41M6P9j72J69r5qJ09j92J76n7r0J82j98J28
4381B7Mj49K34k09Q7Q1j94K30j73L2J47k44K24j04m7J88k57K01n0j24K41k60J53
$$ plain form
4220 -42 -319 571 -491 148 186 -381 490 -404 106 325 -496 448 -201 -42 324 -511 426 -90 -255 409
4240 409 -417 291 -28 -314 488 -386 103 147 -341 418 -346 26 274 -415 324 -180 -55 283 -426 312
4260 312 -49 -185 323 -330 238 3 -245 348 -254 95 87 -235 321 -216 23 190 -263 224 -141 -21 196
4281 196 -277 187 -37 -119 198 -234 143 5 -180 216 -174 49 64 -178 191 -137 -24 118 -168 143 -69
4302 -69 -44 148 -161 107 -4 -78 138 -126 67 42 -101 119 -67 18 50 -89 104 -32 -12 77 -77 59 -19
4325 -19 -24 66 -49 22 10 -41 19 -26 -10 27 -44 7 4 -39 9 -25 -15 16 -28 25 18 -36 46 -14 15 40 -40 50 -20 -23 58 -52
4357 -52 32 6 -40 88 -53 8 37 -63 91 -50 -4 75 -97 72 -23 -31 78 -114 62 5 -85 97 -101 27
4381 27 31 -118 116 -93 -6 75 -119 111 -62 -30 117 -127 97 -7 -54 134 -123 78 28 -96 145 -115 38
4404C8L3j92K74k40Q5J00k29K59j93K5J58k70K52j25o1K15k87K23n9j10K40k54
4426a18J52Oj75K71k27Q8R0k23K56j70K6J34k34K26j09n1J81k28J77n1j00K14
4448A35k23J25J4j39K10k03Q2P3j66J86j48K6J00j80J75q3k1R8j50J43o1n4J32
4471G1j43Q5j4n6J26j22O6J4p0R1p4M4J4p7Q2m7K0J5n1O6m4MJ8l5M6m4J5Qj6J4
4501Fm2M6k0pL4m7N2m7kO2q1O7l6j0P5j12Q9k2m4J10j36J01jj07J65j50P7L3j55
4530a02K15j73L5J17j99K26j52j3J84k71K25j01p2K28l07K25j5j83K79k92J83
4551C7K8k45L43k71P9J32k97L72k54MK56l78L38j73p9L33m35L10n2j93L64m24
4573b05K90L4l45M57l62J36J54m30N23l46OL08m83M70k60j06M51n67L98p9k51
$$ plain form
4404 38 71 -121 153 -87 -2 98 -131 128 -65 -40 118 -152 100 -25 -86 129 -158 65 6 -104 136 -118
4426 -118 34 40 -135 136 -91 -3 87 -136 120 -50 -24 110 -124 102 -7 -58 123 -105 72 21 -79 135
4448 135 -88 37 51 -88 122 -81 1 74 -92 94 -54 -28 72 -108 67 -16 -37 61 -89 54 -7 -61 71
4471 71 -72 13 -1 -57 69 -53 13 27 -43 48 -26 18 32 -45 37 -10 10 25 -26 40 -4 0 18 -17 29 -15 0 8 -8 6
4501 6 -36 10 -10 -17 17 -30 22 -25 -27 35 -46 21 -15 -25 50 -62 27 5 -39 71 -65 36 35 -72 93 -57 20 53 -102
4530 -102 113 -60 -25 92 -107 119 -33 -46 138 -133 92 -9 -81 147 -160 65 50 -133 146 -146 37
4551 37 65 -180 163 -108 -29 103 -194 178 -76 -72 184 -194 144 -29 -108 225 -210 100 48 -145 219 -205
4573 -205 85 119 -226 231 -131 5 159 -271 252 -94 -88 220 -263 207 -53 -159 292 -275 123 44 -207
4594b07N09n82L48P1m38N82m82K00J99n38O33l98J1L40n56N76l19j44N39o25M39
4615A58j39k36N77o58L71Q4m35N97n67K92J75o00O74m21M3L26o08O62l58j59N60
4636C38o69N18j90k73O64p06L70J06m71O60o39L08K44o63P19m63O9L71p16P36
4656C13l41j99N84o94N65j94l22P14p34L91M6m33P02o72K70K57o16O55m57R4L55
4677B84o95O85l21j44M79o37N66k09l05O47o39L81ml81O71o49K57K50n76O30m59
4698a69J13L53o78O38k90j41M79o50N66j75l15O16o09L61nm00O70n92K04K32n14
4719c06N87m52R9L42o20N46k52p7L96n81M96j43k71N04m98L36k9l31N48m63J64
4740eJ61l93M92l88O9K88m77M19k18m7L34m75L80r2k12L89m31K89jl07M50l71
$$ plain form
4594 -207 302 -280 68 139 -299 283 -199 1 200 -338 295 -103 -92 248 -308 268 -51 -195 344 -281 158
4615 158 19 -217 360 -298 73 157 -278 319 -248 44 219 -381 293 -128 -85 241 -367 295 -63 -222 338
4636 338 -331 187 -3 -276 388 -318 52 158 -313 347 -292 16 260 -403 316 -147 -78 293 -423 313
4656 313 -28 -227 357 -337 228 34 -288 426 -308 83 129 -304 398 -274 -4 253 -363 292 -165 -71 284
4677 284 -411 274 -47 -191 288 -349 217 8 -297 350 -289 92 88 -293 378 -271 -14 236 -340 290 -169
4698 -169 -56 297 -381 257 -33 -174 305 -345 221 46 -269 347 -262 99 94 -306 364 -228 -24 208 -306
4719 -306 281 -171 -72 270 -350 196 -56 -133 263 -318 178 35 -236 268 -230 106 77 -254 294 -169 -5
4740 -5 156 -237 255 -133 -64 224 -253 166 -52 -99 235 -240 140 48 -164 225 -206 83 82 -225 225 -146
4762a46J32J27l33M20l15M2K50l99L49j81n6K88l92K96n6j67L12l28K11J9k35
4783a62L27k65J03Q0k26K86k13L7J42k36K35j33k3J76k43J75l2j03J71j95J29
4804C0Rj46J96j56N9N8j51J74j20kJ13j56J30p2k7J26j56J12j6n2J03j10N6K4
4828B6q6J05o7J1M3p7Q0m0j6O0n4L5pj9L2l6kJ7k4J6Mk0K6k2mL3l4QJ5k9M1l2
4860a7kL8n8M9j8j4N1o0M5Mn3Q1o7K3J9o5R6o1PN0j02J02m6k6R1j21P8k6m2R6
4890E2j19O2K7q9J19j04L8N7j26J34p8nR4j45J27m9n9J25j32R5rp8J55j52O5L9
4916D4j19J52j17L5P2j52J50p7j0J07j63J42o1n3J34j61R5kr9J53j49P8K6j13
4940h8J52j20L9O0j34J41p5j7J09j53J29n1m3J24j39R5j6o3J26j38P5K3j02J30
$$ plain form
4762 -146 -14 113 -220 200 -115 -73 177 -222 127 -54 -110 178 -214 82 26 -141 171 -157 54 73 -162
4783 -162 165 -100 3 83 -143 143 -70 -33 109 -127 108 -25 -48 128 -115 60 28 -75 96 -99 30
4804 30 39 -107 89 -67 -8 50 -101 73 -47 -49 64 -92 38 -34 -61 65 -91 21 5 -47 56 -54 2 26
4828 26 -60 45 -22 -11 32 -45 35 -5 -21 39 -15 20 13 -6 26 -10 -12 5 -19 -3 1 -19 7 -15 -19 14 -20 -12 3 -26 15 -17
4860 -17 -19 19 -39 10 -8 -22 29 -31 14 18 -35 46 -21 2 21 -44 52 -9 -2 48 -54 48 2 -24 67 -54 24 -2 -44 52
4890 52 -67 -5 22 -67 52 -52 -14 43 -83 51 -27 -32 62 -83 44 -5 -64 61 -71 24 15 -63 92 -60 5 44
4916 44 -75 77 -40 -5 67 -85 65 -12 -22 85 -78 64 3 -50 84 -77 18 16 -83 70 -79 -1 25 -88
4940 -88 64 -56 -17 43 -91 50 -25 -42 67 -86 43 -8 -51 73 -66 29 13 -50 76 -62 13 36 -66 64
4964F4j05L2N9j12J29p4kO5j10R6m3l9R7j17P0nn6Q7r5N8J2n9P3n6K0K6n9O9m2
4993a7MK8m9O0l8OL7m3K4j6jK4k7J9j2R%j6J1j0LMjMrPj1jJ0l1L9k1rK0k2M1m5
5030b9J2L8n4L0lk2N5o9M8Kn6R3p7M1L2r3J20r0jQ6j20J19p5k2J16j47J11k5p8
5059e8J38j50R5J4j37J74j60Q4N2j64J90j22J1J11k02J94r7n3J69k07J65n1q8
5082i2K15k20J24J3j38K26k23R7Q4k11K42j67K6J47k64K51j20o8K11k73K38q4
5104A4j47K93k91J58J9j96L12k94J15J29k79L07k21M4J80l41L18j46o6K44l32
5125a80K99q4j88L44l30J97Jk25L70l25J11J37k98L43k43M3J91l45L20j76l8K42
5147A66l61L08j02j54L20l55K39j6k40L91l34J23J14k99L85l03M9K45l96L58j83
$$ plain form
4964 64 -41 -9 50 -62 67 -7 -9 56 -54 42 -1 -40 57 -60 10 5 -51 36 -59 -1 11 -48 25 -31 -11 15 -44 25 -17
4993 -17 -13 15 -34 26 -12 -6 31 -12 12 -4 -5 19 -8 11 -1 8 8 -8 3 -7 -4 0 -1 3 -6 1 -10 -11 -1 -32 7 -14 -23 -3 -25 16 -29
5030 -29 -17 21 -33 -3 -6 -28 27 -42 6 8 -48 45 -32 9 41 -52 68 -22 -23 63 -57 62 -13 -35 81 -66 45 20 -58
5059 -58 80 -70 25 39 -98 76 -84 0 52 -112 78 -44 -33 78 -124 70 -27 -80 89 -118 47 -4 -92
5082 -92 123 -97 27 40 -98 128 -95 2 86 -125 117 -50 -24 123 -141 110 -10 -78 133 -140 98 14
5104 14 -133 160 -131 27 46 -150 162 -132 -17 112 -167 140 -81 -37 143 -198 120 -26 -92 152 -180
5125 -180 119 35 -153 191 -139 58 59 -166 204 -121 -10 127 -171 172 -71 -28 163 -182 138 -38 -76 166
5147 166 -195 113 11 -143 177 -178 61 45 -195 196 -138 -15 99 -200 185 -118 -69 176 -220 138 -45
5168d5n3L02m25L48r6j92L59l71K55j5k74M27l47J35R8l12M08l02L8K32l63L42
5190A49k12k9K83m08L21r4j44L07l68K56mk57L72l12J33Q5k85L89k84M6K06l31
5212a81L20k04k0K80l81K93r2j37L13l74K50J6k54L68l19J40R2l01L75k54J5J91
5234A36l18L26j94m1K60l49K66q9j21K93l33K10J2k03K87k66J29P2k45K99k04
5255g3M0J42k58K72j63l1K10k71K15p5q1K07k56J68J4j68K35k15J06N7k11K51
5277A15j65J2J22k20K17j13m7J80k25J73n4q8K03k25J34J7j29J93j93R0O4j63
5299a02J85j21J9P7j54J60q6j9J15j32J17n1m9J27j44Q1Jo6J16j16O0J8r9J01
5323C8q0J5M7p8Q7n0j2O6q0O8k4l5P9p1L5J6n3O7n6J4L2n9O2k4mK3m8N1j7j6L1
$$ plain form
5168 -45 -98 204 -221 127 31 -161 198 -173 82 67 -207 220 -127 8 106 -206 202 -100 -62 170 -193 149
5190 149 -63 -92 191 -217 104 10 -134 173 -195 61 57 -200 172 -140 -7 78 -207 182 -102 -56 150 -181
5212 -181 139 -65 -85 195 -186 107 15 -122 191 -183 67 83 -171 197 -122 18 110 -191 184 -70 -55 136
5234 136 -182 144 -50 -91 169 -180 86 -3 -124 169 -164 46 58 -145 142 -124 5 77 -168 131 -73
5255 -73 -33 109 -149 123 -40 -71 139 -132 83 8 -73 134 -122 46 60 -108 127 -88 18 75 -136 115
5277 115 -50 -38 84 -136 81 -32 -79 101 -124 49 -5 -93 110 -115 19 36 -93 100 -93 -3 61 -102
5299 -102 83 -38 -19 58 -96 64 -22 -41 74 -58 59 8 -41 86 -58 23 24 -42 74 -42 18 36 -63 38
5323 38 -42 -27 20 -58 29 -21 -33 33 -47 21 -3 -38 41 -30 5 21 -32 35 -21 -7 25 -34 28 4 0 23 -25 26 9 -7 24
5354B4l5K6mj5K2j6LJ6k4NKj7J3kk1K2j5mK3k1K2j8j1L5k3J2j2j0M3l5J6J8l9
5387b0N7l2mK6m7M8l1mL5n1L8j5k1O3n5K8Mm0O3p8K8L7p3P0n3JN9q5O8k2l3O4
5419B5p2N9j8m6R4q4M7Jo1R9o6J7L9p6Q3m3j2O7r3P8l4k3P3r6N9Mm2P2p9L7J5
5450B4o1Q3q0K8L0o7P2m2%L9q0P5l4k3O5p1N0km3Q6p7L2K0n1P6n5QK8o0O2k7j5
5482a0N4p0N6k7j1N4p0M0ql0N5m7J0Ll4M3l4J3K5l7L1j5PJ4l4L3j7j0J2nJokJ2
5516dJ0lkJ0oQqnK0k5J4Kk2L4k9K3ok2L2l1QJ5l3M3l2j5L4m2L0j4j7N6n6M1j0
5551bl2P3p6K4L2n4P2o5K1M7q0Q4n6pO8r6Q8l3n0J01j07P3jp8J25j20O2K6j07
5580f8J30j04J5Q5j58J37o0j7J00j62J41m6o9J48j66J18mj10J64j42P2L5j27J87
$$ plain form
5354 24 -11 15 11 -4 18 2 5 21 -3 2 4 -13 0 -2 -23 -1 -16 -20 3 -18 4 -14 -25 10 -13 -1 -13 -23 20 -15 1 19 -20
5387 -20 37 5 1 27 -20 28 -3 -7 28 -23 15 0 -21 42 -13 15 19 -21 42 -36 -8 29 -44 26 -27 -26 33 -52 16 -6 -39 25
5419 25 -47 12 -6 -52 42 -42 5 6 -55 44 -22 -5 34 -42 41 -2 -14 53 -40 38 4 -19 54 -42 17 21 -21 51 -28 9 24
5450 24 -37 46 -34 -6 24 -43 29 -13 -13 26 -54 21 -13 -36 29 -42 8 6 -37 49 -28 4 24 -27 49 -6 2 30 -30 32 5 -10
5482 -10 44 -26 30 3 -8 46 -24 16 8 -22 33 -14 -4 -1 -35 8 -26 -13 12 -25 6 -9 -2 12 -22 11 -6 -16 -4 -9 -8 -14 -16 -4
5516 -4 6 3 1 11 5 13 5 0 20 -5 9 11 -11 23 -6 17 11 -11 21 -10 -2 13 -20 23 -9 -24 10 -32 -2 -16 -33 23 -33 8 -2
5551 -2 -34 39 -37 -13 19 -35 37 -28 -7 40 -40 44 -12 -19 49 -47 41 8 -42 59 -48 25 24 -54 71 -49 13 39 -68
5580 -68 62 -42 -27 58 -100 37 -23 -40 60 -102 39 -7 -76 72 -94 24 20 -90 74 -68 4 39 -88 99
5604I9j45L2Q0j65J77r6k4J29j97J72m5q5J77k08J51j3j35K18k01Q6N3j83K24
5627A01j74L0J26k25K33j38j5J75k65K08n3j06K19k53J78Mj77K62k30J15O1k10
5649a34K66k05M8J33k31K55j68k7K00k71K16p1r6K33k75J74%j59K51k45J27M4
5671F5k24K87k07M9J18k50K76j66j9J98k78K32j06q2K66l12J97Nj79K78k61J46
5693C3O9k53L03k15M5J34k72L03j81l7K22k92K48j09r5K58k97J84j0j60K63k65
5715a24J28P8k31K67j94N4J08k47K71j44m4J85k53K28r5r5K46k59J65qj44K50
5737A42k51J28P0k24K68k02N7J26k52K63j38m5J74k49K22j04r5K33k41J66l6j29
5759a17K34k20R8N3j78K27j68N5J00k22K13j18lJ32j98J78p1p5J76j85J29j5j22
$$ plain form
5604 99 -46 -14 66 -99 78 -18 -42 87 -110 62 17 -68 109 -99 52 39 -96 122 -79 7 60 -123 101
5627 101 -73 -43 83 -142 91 -47 -62 113 -152 56 3 -103 116 -137 41 45 -132 130 -100 15 76 -134
5649 -134 132 -73 -25 108 -123 132 -36 -63 137 -134 82 11 -85 148 -127 47 47 -112 139 -106 21 65
5671 65 -159 128 -79 -30 88 -162 114 -52 -71 127 -151 81 -25 -107 159 -153 44 49 -130 148 -113 33
5693 33 102 -151 152 -63 -18 116 -156 147 -34 -71 151 -141 107 -2 -97 161 -136 48 38 -122 141 -124
5715 -124 4 82 -149 118 -76 -22 86 -161 110 -34 -78 107 -146 82 -13 -108 138 -121 44 36 -108 142
5737 142 -109 19 89 -135 133 -69 -12 114 -138 125 -13 -58 116 -133 89 -15 -110 123 -118 48 12 -117
5759 -117 117 -103 -5 48 -130 97 -71 -16 84 -138 75 -43 -46 86 -112 66 -5 -80 96 -89 40 25 -97
5782i7K05j81P8N3j47J79j34M2P5j75J83r8k2J16j67J45n5p4J53j63J00qj07J74
5806G5j39M9M6j21J52j16L0P9j27J25p7oR3j21R9k2o5J13j13P3Jp2J03r4L3K6
5832B4o8R9p7J8N2q9P6l2k3O1r3P2j7m3O1n0L3Qn6O5n3J9J9l8N0m7J7L0n4N2j6
5863@pL4m1L0kk5L2k2J3Rk9K6j7j3K4j7RJj9K4pj2QrJ0joOj9LJ3j1J5rrJ8k1O
5901a5J1k0L4k0%K9k9J9pjK7l8L7j9j7L3k9J8Mk8L4l5J8J8m5L6l3J1K1m5L7k2
5933a6kL4m3K8kk5M4m4J6K2m4M4l0RK6n6O3k7j2N0o0N9j7k3M6n9M5rk9M7m7L5
5965B3J0m6M0m3J3K7n8M9k0rM0m8K3j7oL7m3L6lk4L2l1J3Oj8L1k8OK0k4L5k9N
5998aJ3j8K4j9RMj7J3njJ4j8K7k0j6L2k0rkkJ2j7RnKPpQnPRj0j%J5qj5K0j1OJ1
$$ plain form
5782 -97 108 -73 5 58 -89 90 -44 -2 73 -102 81 -17 -39 77 -90 55 0 -74 79 -84 16 8 -99 75
5806 75 -64 -15 31 -90 62 -54 -24 55 -72 53 -24 -30 63 -58 41 19 -46 67 -46 27 28 -44 59 -35 -2 24
5832 24 -44 55 -22 -4 48 -41 35 3 -20 41 -52 20 3 -40 21 -29 4 12 -44 21 -32 -13 6 -32 18 -29 -12 18 -36 16 0
5863 0 -7 27 -14 16 14 -11 21 -1 12 21 -8 18 1 -12 12 -5 4 5 -14 10 3 -9 -1 -10 0 -1 -7 -1 -20 -17 -4 -15 0 -9 -18 0 -21 -15
5901 -15 -4 -24 10 -10 -10 19 -10 9 2 1 28 -10 27 8 -9 24 -5 13 17 -11 23 -12 6 24 -21 15 -18 -7 14 -31 6 -16
5933 -16 -18 16 -27 1 -1 -26 18 -26 -10 12 -32 12 -18 -9 17 -39 24 -3 -15 35 -25 34 17 -6 40 -19 26 17 -12 35 -12 23
5965 23 33 -13 27 -16 -3 24 -34 15 -5 -14 26 -22 1 -16 -22 15 -28 8 5 -19 13 -18 -5 1 -17 14 -14 -8 12 -12 23 -6 -1
5998 -1 12 -6 18 -1 8 12 -5 8 3 2 16 -2 25 5 -11 21 1 -8 -10 -12 0 -17 -8 -13 -11 -4 -11 -3 -8 -1 8 -2 -3 -3 12 4 -11 9 -2 4 15
6039A5l1M0l1PL0n3N0k9lL7n0L7j0j5L8m2K6ql8N8n8L4Pm7N5n0K3J5m4N7m8J0
6071a8L4o2O2k1k2P1q6O7j5m2R2r1M8Mo3R9p8K5M3r7J06p4QP6j21J08o6j9Q8j29
6101g3J04k6n4J16j27P3Pr5J40j21N1M8j18J35q2j0Q4j38J39o5l8J30j56J23l4
6126A3o7J59j63Q4K1j15J62j52P0N9j53J67j15J9Q3j65J68p4o1J46j78J44n5p5
6150g8J72k02J22J1j24J96j66O6O8j75J94j42L6J04k02K01r1m5J53j91J66n2r6
6173g5J98k00J11J1j27J95j83P5Q0j80J97j41J3J20k06J83q8l4J45k05J69n7r7
6196i6J91j89J18J4j41K11j93P3P7j76K15j58K6J31k16J94r8l4J62k20J83n0j02
6219g8K01k21J45mj38K17j84O4P1j77J99j43J8J23k06J90j09m0J62k06J61l9r2
$$ plain form
6039 15 -16 24 -7 0 30 -23 27 -2 -5 32 -18 19 9 -6 32 -10 16 8 -30 28 -30 4 11 -36 19 -31 -8 7 -37 20 -28 -18
6071 -18 16 -46 16 -5 -27 44 -42 25 10 -32 60 -31 17 21 -42 57 -21 4 47 -50 56 -18 -10 66 -55 53 -13 -32 56 -73
6101 -73 31 5 -49 67 -60 13 20 -75 65 -56 -5 43 -75 60 -22 -32 52 -86 53 -12 -50 80 -76 47 13
6126 13 -54 105 -58 26 47 -68 94 -58 12 71 -82 85 -30 -11 72 -93 75 1 -60 86 -92 52 -3 -78
6150 -78 94 -108 14 25 -99 97 -69 -3 65 -110 84 -58 -22 82 -120 81 -10 -55 98 -93 73 21 -75
6173 -75 123 -77 34 45 -82 113 -70 5 85 -95 102 -39 -26 94 -112 71 -17 -51 94 -111 58 1 -96
6196 -96 95 -94 24 38 -103 108 -85 -12 65 -111 104 -54 -28 103 -113 81 -17 -51 111 -109 74 24 -78
6219 -78 123 -98 47 43 -95 122 -62 2 73 -104 95 -48 -30 93 -113 77 -32 -72 90 -116 45 6 -86
6242h6J85j91J20Lj24J98j74P2N2j54J99j33J6J09j77J68r4k7J55k09J56m8p4
6265e8J58j72J19Lj30J83j41M0N4j52J84j23JJ04j65J56q1k9J24j72J37l1p7J33
6289F5j34R6Nj11J53j19N1N2j19J36q9JQ0j35J29n7k6J03j33Q8l1n2J09j15P4
6314B1J9j04J19r9M6L6j09J18o3nO3r9R4m2k5Q1j01O6k2l9Q6q9N4J8o9P9n5J9
6342bL5o8P5l2j6M2o4N9j2l3O0n9K2Mm5O7m6JK8n1N8l9mL1m9L7j1j6M4m3L5j3
6374ej4L7l0PJ7m7M1k5NK9k2J5j3pL0l2K2J1l5L8l4J5J4k0QoqK4k1%Mk2K5j9M
6409a4J4j5J3rj1L1k5MJ5l3M0k6kL2m2L4rj1K5k2J5%pL3k8J1Jj9L1k7JJ1l2M0
6443A9k7JK0l1K2j0j0K3l8K9j0j6M4m0K4Ql7N3m5J6J8l2K4mj3L4l5K7ok4M5l6
$$ plain form
6242 -86 99 -92 28 31 -93 105 -69 3 55 -99 100 -33 -17 92 -85 83 -11 -38 117 -92 64 16 -58
6265 -58 100 -72 47 50 -80 103 -38 2 56 -96 88 -35 -34 70 -95 61 -20 -49 75 -97 40 9 -68 65
6289 65 -69 27 32 -79 74 -45 6 58 -61 75 -14 -13 67 -68 61 4 -22 81 -52 36 5 -47 62 -53 21
6314 21 40 -64 55 -44 2 38 -71 47 -16 -21 42 -57 37 -5 -30 51 -50 16 -6 -45 41 -48 6 24 -45 34 -21 -2
6342 -2 33 -35 40 8 -8 34 -30 29 17 -16 44 -15 7 11 -34 33 -13 -12 16 -35 23 -16 -20 11 -38 -1 -12 -28 16 -27 8 -5
6374 -5 -19 18 -12 -5 12 -35 6 -19 -14 15 -7 8 -5 -12 18 -14 8 19 -16 22 -12 3 17 -3 5 -1 -9 15 -6 -6 -2 -24 1 -18 -14
6409 -14 0 -15 -2 -11 -22 9 -16 -12 3 -30 10 -16 -18 14 -28 6 -3 -14 11 -11 4 4 -3 30 2 13 14 -5 26 -1 0 11 -21 19
6443 19 -8 -7 13 -18 4 -6 -16 7 -31 -2 -12 -28 16 -24 0 8 -29 24 -21 -5 13 -19 5 1 -12 22 -13 14 8 -16 29 -7
6475gK1Mk5L7l5PNk6M2l8J3J3k1K9k4%K0l3J6Jk7L4l0K2nj6K5k8J8Ok0L4k8J2
6509dnlJ9pLK0k3NOj2J3j1J4j3nJ2j8K4j8j0J7j7J9j0oJ8j8%l%K%J0rKQoPj4l
6549a6K0j8J5j5mK6k1J6Ok0L5k7K1Lk2L0k7RJl2L6j2mJ5l5M0k0lK0n1L8rk0K7
6583Bl0K5mk8N8n8L5Lm1P5o4K2K2n7O4m0QL3n8O5k5k3N1o0O5k7l6O2q5P0pm2R2
6616F7q5K4J4o6R6p8J1M1q0Q3n0pN5q6Q0l1j8Q0j07P7%p0Q9q0N5J8q4J01p4J6
6646iM9q0R9o5j8R1j17R8m6k6R0j17Q6rp1J13j20O2J4q2J21j16M1M7j17J43r1
6673c0JQ6j46J33o2l0J16j33J01k4o1J27j36P4J5q8J30j05L4N5j21J33q1j3R2
6698F7j35J10m4m6J18j36Q7lo8J13j20P0J5j04J35j18M9N0j28J44r0jR6j47J36
$$ plain form
6475 -7 14 18 -7 30 -5 2 7 -19 23 -15 -2 11 -10 19 -5 -5 15 -18 -2 -1 -28 6 -24 -2 -7 -23 2 -26 -8 -2 -22 12 -16 -4
6509 -4 -9 -12 7 0 3 23 0 5 11 -1 12 1 15 2 -3 9 -9 15 -3 -13 4 -13 6 -4 -10 8 -10 -10 -13 -13 -11 -11 -1 -10 -8 0 -6 1 -13 -16
6549 -16 4 -14 1 -14 -18 8 -13 3 9 -11 24 -3 18 21 -1 29 2 11 12 -20 16 4 0 15 -20 20 0 -3 17 -34 4 -5 -25 2
6583 2 -28 -3 -7 -35 23 -35 0 3 -38 37 -27 -5 17 -40 24 -16 -8 25 -33 32 7 -16 35 -25 40 13 -23 39 -46 24 17 -25 67
6616 67 -18 6 20 -46 50 -28 -17 24 -56 27 -23 -30 25 -61 19 -12 -30 50 -57 20 20 -50 39 -41 14 32 -52 49 -25 -9
6646 -9 40 -40 59 -6 -24 67 -50 48 2 -24 66 -51 35 26 -45 68 -52 10 24 -58 63 -53 -12 35 -82 61 -30
6673 -30 -29 57 -89 44 -18 -48 68 -65 36 12 -49 78 -58 16 31 -57 73 -32 2 57 -64 69 -12 -25 67
6698 67 -68 42 -2 -48 70 -66 21 18 -50 63 -57 13 28 -76 59 -59 -10 40 -88 56 -34 -35 61 -86 50
6723E0p6k4J18j37J04k5n9J44j45P4K7j15J47j19M0N7j29J34r0JQ0j22J26o8m6
6748e3J17j32R5k4o2J26j29O9J3r1J21j02M4M3j13J30p4j8J02j41J16m0m2J08
6772F3j20R2k4o4J24j16O8J9r1J17j09M0N2j08J20q5QP3j13R6m9k7P5r7P7j2o1
6799e2Q7r2N1K7p0J01q7K5M7j00R7n1mO4r6P2k4j9Q0r8N9%m9Q5p0K9J1m7P3o7
6829a8J6M6p3O7m2lM7p2N8k4l6O3p4N5j2m8P4n9L1Ol8O9n6PM0o3O3k3k1L5l7K9
6861GPl8N7k9MRl0L9k7LK1m2M1l1J1K7n0L4j1j7L4m1K0Ml8L4k5J4Qk0K8j8KJ5
6895Bl4L6kj3K4l0K3Jj6L5l0J2J0k0K1j3j3K7k1NnPRk0KOjjklJ0l2K5Kk2K8k1
6932a4Kkj3L7k6J1Pk1L2j9kK2l5K8%j5K5j6PPj6K5j8JMk8L5j6lK3l3J2%rJ9k7
$$ plain form
6723 50 -26 -50 68 -69 35 10 -49 95 -50 24 51 -64 83 -36 4 61 -68 66 -24 -23 57 -65 61 -7 -53
6748 -53 64 -68 27 3 -59 67 -62 7 20 -71 50 -52 -8 35 -78 52 -22 -40 62 -79 37 -3 -45 63
6772 63 -57 35 11 -53 71 -45 23 42 -49 68 -41 -1 51 -57 63 -22 -14 59 -54 42 -7 -34 41 -56 21 9 -52
6799 -52 35 -57 -6 21 -49 52 -35 -10 37 -63 34 -17 -21 43 -53 19 -5 -24 56 -42 17 17 -32 53 -17 12 23 -24 49 -18
6829 -18 -2 44 -29 38 -4 -7 40 -32 26 2 -34 29 -45 10 -2 -50 24 -35 -4 2 -36 33 -23 -16 24 -39 24 1 -20 15 -22 7
6861 7 14 -24 33 4 8 17 -13 26 -1 2 23 -19 22 -9 2 29 -21 13 2 -15 19 -22 -2 2 -36 -2 -27 -13 -5 -25 3 -15 -13 2
6895 2 -32 4 2 -11 13 -17 6 7 -9 26 -4 8 18 -2 19 6 -7 20 -1 4 -1 6 15 -5 -3 3 2 1 -1 -4 6 -26 -1 1 -21 7 -14
6932 -14 -12 -14 -27 10 -16 -5 2 -19 13 -6 -8 14 -21 7 7 -8 17 1 8 15 -1 24 6 7 11 -17 18 2 -1 22 -11 1 1 -8 11 -16
6968a6K1j7qK7l7K8nj0K4j7J0J0k4K4j1j1K5l2K7j3JK5k6J0J1j4K4k3J7lk4L4
7000B7l5NJ7j3J1j9OJ0k3J7lnNj5Rj1jJ8k3K5pnJ3j1J3lj2J1n%kkJ4qJ0Ok0K9
7038B3k0J2Kj9K8k8LPj6K9j5oK5l2K6k7j0K3k6L0j5qK2l5K5rpK2k0J3Kj5K6k2
7072a2J1Jj3K9j9NOk5L1j4QJ2l4M9l8j3L1l7L2rj1L8n9M1j8k4N7m8K2Jm8N4m3
7105c7K0K4m7M8l0MK8m7O1l6oM7o8N3k3k7P3n8L1J2m1O6o2L0J8p0P7n8K3L5p5
7136c5O8m2mN2p0O0l3k9O9q6O0ln1Q8q6L6K6q0Q9o0J4M1q7R6m8jO2r5R2l9m2J07
7168F9j06N9Lo5R9r6M2K2q0J03q0K9L7j02J08p0%O6j03J00m9l5J03j23P8no4J11
7196E1j07N8K5r1J20r0K5M1r3J15p3jP2j17J09m7l4J09j25Q7j8o2J07r9O0lp6
$$ plain form
6968 -16 5 -12 -20 7 -30 -2 -7 -17 7 -10 0 10 -14 10 -1 -12 13 -19 8 -5 -4 21 -5 5 16 2 26 3 20 17 -7 27
7000 27 -8 -3 14 1 12 -7 -1 9 -14 3 0 -5 0 -15 -6 -17 -18 0 -23 2 -5 -10 3 -8 5 2 -10 1 -4 -4 -6 -8 6 -2 8 14 -6 23
7038 23 3 15 17 -2 26 -2 1 8 -8 21 6 0 25 -7 19 -8 -18 5 -21 9 -6 -14 8 -27 -2 -11 -18 4 -16 -3 -1 -16 10 -12
7072 -12 -1 0 -13 16 -3 2 8 -17 14 0 8 20 -14 35 -3 -16 15 -22 10 1 -10 28 -31 10 -8 -32 25 -23 -1 0 -48 6 -37
7105 -37 -17 7 -40 8 -22 -18 10 -37 24 -12 -18 29 -39 14 -9 -36 37 -21 10 22 -19 47 -15 15 33 -37 40 -18 5 40 -35
7136 -35 33 -9 -13 39 -31 29 -4 -33 36 -50 10 7 -44 44 -42 -6 20 -60 29 -31 -17 24 -63 33 -15 -16 46 -49 43 4 -38 69
7168 69 -37 22 25 -40 59 -37 5 27 -53 50 -30 -1 36 -66 42 -28 -28 38 -65 35 -14 -49 54 -69 9 4 -60 51
7196 51 -56 2 27 -64 56 -34 -9 32 -61 54 -19 -20 52 -65 44 -3 -37 72 -53 34 16 -46 61 -38 22 19 -57
7223e7J13q7J3O2j06J04o7rN8r8R7l7m3R9j15R9j6p3J10j03N3K8r7J26r3K2M9
7250C2j00J17o7j1Q4j19J04l5l3Q9j10Q0j7n6J10j28P6J7r1J18r5K2L6r8J19p3
7276b9j3Q2j17R5m1j7Q4j00O8Oo4R9r2L8L1q0J10r1K4M7q8R9o8jP7j15R4m3j7
7305b2O9r7P3j0m9Q6q7M6J0o4R2p0J3L2q5Q7n2oN4p3O9j7l3O6o3M0Qn2P1o9M5
7336A2Rn8Q2n0jM0o8O1k7k5O8p3L8ok9O8p0L8Rm5O1n6K0J0m4O4n0QL8n7M8l7k
7369b4M2m1L8j1l4M7l7K0J1m1N9l9OK9l7M0k1j9M2m4L6j4k7M2l6J2Nl8O1l6PJ5
7401A3l9M1k7lJ6k4L5k0j3L3m5K4J5l3L6k5RJ5k8L4k1nK8k7K3j2rM1l0J9pj9K1
7434A6j8LJ9l4K8j6j0K2l2K7j2j5K6k5J0J2k8K6j0LJ5j8K2j2qL0l2J3oj6L5l6
$$ plain form
7223 -57 56 -31 -18 44 -62 42 -25 -34 24 -74 23 -14 -57 42 -73 26 10 -63 47 -56 -3 25 -72 54 -39 -17 32
7250 32 -68 49 -18 -29 55 -64 40 5 -28 61 -49 31 14 -42 68 -60 16 33 -58 60 -35 -13 23 -75 44 -29
7276 -29 -42 40 -77 18 -23 -40 44 -56 12 18 -46 53 -39 -1 30 -50 60 -31 -7 40 -48 51 -17 -18 59 -56 38 -5 -22
7305 -22 47 -50 23 13 -36 50 -37 9 19 -45 47 -23 -10 22 -63 24 -28 -34 20 -53 16 -1 -34 32 -31 9 17 -35 36 -33 12
7336 12 21 -37 45 -5 -6 34 -34 27 0 -25 43 -30 8 2 -27 41 -29 9 18 -27 34 -22 -2 8 -36 28 -22 -14 24 -33 15 -22 -24
7369 -24 18 -23 15 4 -30 17 -20 0 11 -30 29 -10 -4 25 -12 28 7 -12 30 -14 22 8 -19 23 -13 -1 4 -34 27 -9 -2 13
7401 13 -26 15 -12 -15 1 -23 12 -8 -21 12 -33 -9 6 -27 9 -16 -7 8 -20 14 -7 -12 16 -11 12 0 -9 32 2 21 14 -5 16
7434 16 -2 1 20 -14 14 -2 -12 10 -22 5 -7 -22 4 -21 -11 1 -27 -1 -11 -8 7 -11 11 -1 -9 21 -11 2 -4 -20 15 -21
7466b1K1J1k3L3j6KLj9K1j2MJ2l1L1j6j0K6k9K1j3j5L1j9nQk3K3k0K0qk4L3k0
7499b4QK1k1K1poK6k6K0j0rK0k0RMj8L1k9J4Kj3K0k2J1jj1J7j6qK9k8J4rj1K5
7534Ck2J7j1rK7k9J5jrK6k4K0kj8L7l3J8Rk4K8lnJ2l4L6j3mJ5k8J6mqJ6k3J6j5
7570hnL9l5J9j1j9L1k4J2J5n3N5k9%J2j5K2j9NJ0k5L5k2LL1n2M6k4JL2l4K4nk5
7604a3M2m3K3Lk7L2m4QL8m8M5k2j1L3m9M4l1ML4n3L9j8k1N9n4M0mk8N5o2K0K4
7636A5m1N9n4K3J6n5P2m3LN9p5N1k2k0N3o7M9rm8P1o5M1Jn9Q9p7K3J8o1Q0m7p
7668b7M9q1Q8n0j3P9q4N6j2m0P6q6N5Pn4Q4p0K0L7o3Q3o0NO1j01Q3l5l2R4j03
7698c4O6j3m6Q7r2N5%q0R8p7L0L4r2J05p3QN5q6R2m4j0P0j00P5j9n1R9p7M1J3
$$ plain form
7466 -21 0 11 -12 21 5 7 10 -9 12 0 4 16 -15 16 0 -10 16 -13 8 -5 -20 11 -8 -13 -5 -28 -5 -25 -5 -13 -37 -4 -24
7499 -24 -16 5 -16 5 -2 -8 18 -8 12 2 -7 13 -7 2 6 -12 19 -10 4 6 -7 13 -9 2 1 -10 7 -9 -17 12 -16 -2 -11 -22 3
7534 3 -19 -2 -13 -22 5 -24 -9 -10 -19 7 -17 3 1 -17 20 -13 5 14 -10 18 15 10 22 -12 24 11 7 22 -6 10 6 -2 14 -9 7 -8
7570 -8 -13 26 -9 10 -1 -20 11 -13 -1 14 -39 16 -13 -13 -1 -16 6 -13 -8 2 -23 12 -10 -7 24 -28 18 -6 -5 27 -7 17 12 -13
7604 -13 29 -14 9 12 -15 17 -27 -19 19 -29 16 -6 -17 16 -33 11 -20 -16 18 -35 4 -14 -35 24 -30 10 6 -22 33 -29 -9 15
7636 15 -26 33 -21 2 18 -37 35 -8 -5 54 -21 30 8 -12 41 -26 23 14 -34 37 -28 13 14 -45 44 -33 -10 8 -53 27 -20 -27
7668 -27 22 -59 29 -21 -34 45 -39 17 5 -35 41 -45 10 17 -37 47 -23 -3 34 -29 54 -6 -1 60 -41 42 7 -25 69 -34
7698 -34 32 19 -27 60 -32 23 23 -57 41 -36 -6 28 -64 41 -32 -24 31 -55 37 -7 -17 53 -47 28 9 -42 57 -20 21 34
7728C4p7J04q2L5K9q1R1o2ON7r9R1n7j9Q8j01O6j2m7R1r9N3J3p4J00q5K2M7r9
7757f7J06o5PO8j05R9m8k8Q6j01Q5k0n6R8r2O0Mo5J05r1L4K7q6R1n8J1M0q2Q1
7786C8k9m5R0j04O9j4n2Q9q1L6Pn9R6p5J6L4o1Q3n0%N2j00P7k6j8O8q4P7k3m3
7816c2Q8q1L0K6o6Q4o6J6L6p4P1m7jN4p7O0k4l0O2q6O3%n5P7q1M9J9n5O8n2J9
7847eK7n7N6l3j5N3p2O1j8k8P0n9K9Rm5O5m3J3L0p0O6m6RK6m8N1l4k0N7m8K8j8
7879ij6M4n3K7Rl8N5l5KK6m1N5m0kL4l8K5lj9L9m4L2Pl4L4j5JK1m0M0l0KL3l6
7913gK1ll1L6j8KOk7L5l4QJ7m2M3k6nK8l0K3oqL3l2K1Nj4K0j9ROj8L7l8J3J2k7
7949a0L1k3j0M0l5Pjj2L0j9KJ4k7L0k4LJ5k6K7k4oL0m1K1j2pK6j7J9Kk3L8k4K0
$$ plain form
7728 34 -43 61 -21 14 43 -38 53 -9 -3 54 -45 46 -11 -30 58 -43 23 11 -36 55 -44 9 22 -52 48 -37 -15 32 -67
7757 -67 39 -26 -19 49 -56 43 -5 -33 53 -48 37 17 -39 59 -33 27 31 -34 71 -20 14 41 -45 46 -12 -1 39 -43 38
7786 38 9 -36 54 -50 19 5 -47 42 -39 -3 4 -55 41 -34 -18 16 -45 38 -12 -12 40 -60 17 -9 -27 41 -43 34 11 -32
7816 -32 56 -25 5 31 -35 49 -17 -1 35 -39 32 -15 -16 38 -39 21 -3 -33 29 -57 6 6 -49 28 -53 -4 15 -40 28 -24 -5
7847 -5 22 -35 21 -12 -27 26 -46 15 -3 -31 39 -20 9 18 -27 38 -5 8 38 -32 34 -12 -3 23 -25 26 -8 -28 29 -19 9 -9
7879 -9 -25 19 -34 -7 2 -36 19 -16 -14 12 -29 26 -14 -16 18 -20 5 2 -17 22 -22 10 17 -17 17 2 3 24 -16 24 -6 -4 29 -7
7913 -7 14 11 -20 16 -2 0 6 -21 14 -20 -12 5 -37 6 -20 -25 3 -27 -4 -10 -18 15 -17 4 9 -5 15 -4 5 11 -7 30 -8 5 17 -10
7949 -10 21 -2 -12 28 -7 0 -1 -13 17 -2 0 14 -13 17 -7 -4 11 -15 12 -12 -18 12 -29 -8 -20 -27 -1 -18 1 3 -20 18 -6 14
7983A4J0m2L9j5mJ8l0L3j4jJ4k7K6qk3L0k8J4Rk1L0l8J5jj4K8j9j7K7l3L4k7M
8016a7J3j8K9oj8K8k2J8Rl2K6l0J8K1l5L2qj6L1k5K1j6rK1k2Qkj5L7m0K6jk7L2
8050A1l0J0Qj3J7j5%J7l6L8j7MJ9l1L2j8%K9l0J6rj8L7l2L3j9j0K8k6K0Pk7L2
8083B7k6K0kj6K6k4nK3l4L2k9j0K8l7L1qkK4l2K5qk2M2l9K3Kk4M2m4L0Nk7M1l4
8117bPK3l9L2pj1K9m4L2pk9N3n0K8jk3M2m4J8Qm0N0m2J4J9m7M3l3J3K5n2O8m1
8150hnM5n3L4nl7P2o1M0nl8N9n4L3J4n2N2m1QK6n7Q0n1mM3o6N8j4l5N2n8L8Om6
8184c0N9o2K8J4n4P4o2
$$ plain form
7983 14 24 -18 21 6 2 20 -10 23 9 8 22 -5 21 13 -10 20 -8 6 15 -6 24 -14 1 0 -14 14 -5 -22 5 -28 6 -21 -17
8016 -17 -4 -22 7 1 -17 11 -11 7 16 -16 10 -20 -2 19 -16 16 8 -8 23 -2 19 3 -6 15 -7 1 -1 -16 21 -19 7 6 -21 11
8050 11 -19 -9 -1 -14 3 -12 -12 5 -31 7 -10 -6 13 -18 14 -4 -4 25 -5 11 2 -16 21 -11 22 3 -7 21 -5 15 22 -5 27
8083 27 1 21 19 3 29 5 0 23 -11 21 -8 -18 10 -27 4 -4 -6 18 -14 11 3 -19 23 -16 7 9 -15 27 -17 13 18 -9 32 -2
8117 -2 5 28 -11 21 14 3 32 -12 20 13 -16 37 -13 15 14 -9 33 -11 7 15 -25 25 -17 -3 16 -31 12 -21 -8 17 -35 33 -8
8150 -8 -13 32 -21 13 8 -29 43 -18 22 17 -21 38 -16 17 31 -21 31 -10 -2 24 -33 47 -4 -8 35 -31 27 13 -22 30 -28 10 16 -30
8184 -30 29 -33 -5 9 -45 29 -33
8191c3
$$ Imaginary data points
##PAGE= N=2
##DATA TABLE= (X++(I..I)), XYDATA
0@%%%%%%%%%%Qj6J6j6K4l2M0n6O5p4R5j18J36j60J92k24K57k98L47m03M64n28
32b81O01o81P70q71R82j103J233j378J537j709J898k105K330k575K847l143L463
49A815l814M200m627N098n619O200o851P585q418R375j0490J1806j3385J5322
63H197j7766K0959k5329L1732m2164O3097j73100K40570J7927j58190R8273k40913
75a76707L42862k57484m6605L81468k80816L3250p7335K895L02064l95557J88124
86A6159J39781k56590J08405j68452K69612Q4581l96879K60592p6057j4665Q7344
97E3831j62893L10356k21428j76129K96807j27347J15337j27800m4648K72037
107A88123l31414P7756J57486r0077J09379k73620J49963J38070k60649K08755
$$ plain form
0 0 0 0 0 0 0 0 0 0 0 0 8 -8 8 -8 16 -16 24 -32 33 -41 54 -64 72 -88 104 -120 137 -161 186 -217 247 -281
32 -281 320 -361 409 -462 520 -583 650 -728 809 -900 998 -1107 1223 -1352 1495 -1648 1815
49 1815 -1999 2201 -2426 2672 -2947 3253 -3598 3987 -4431 4944 -5546 6260 -7125 8197
63 8197 -9569 11390 -13939 17793 -24371 38726 -134374 106196 124123 -34067 64206 -176707
75 -176707 166155 -91329 -137934 243534 -37282 -4032 -81367 -78472 223592 -171965 16159
86 16159 155940 -100650 7755 -160697 108915 193496 -203383 57209 -18848 -33513 53831
97 53831 -109062 201294 -20134 -196263 100544 -26803 88534 -39266 -83914 188123
107 188123 -143291 -65535 91951 1874 111253 -162367 -12404 125666 -134983 73772
117G3772n2381j2064P062k02746L22478o7889j61308J47439j20365J35752j09022
128c9272n9034K78968k20198o847M2073m3936J68917k06143Q5643J10475k20214
139a09568J13218l1112P6895M2212k33239J84106j5620q2500J01745r1184J31605
150H6558r7091j09440K05535r6566K3149k637n7355J31944j65321M8308J25950
161I3034j16191M9663r0577N5868Q5536j55876J17189r849o0285M5073q5076J36455
173F4964k9899j02221J12214p1544L0746n338l6159J27153j20411j2792O7564
184B4277m8728P2768p4124J7522N9285j15210P0668P961r927L0811r4546P7400
196A8157r98n6180P3248m2178K5638k2373m7374R6287m5108m436K2283m3587M7915
$$ plain form
117 73772 21391 9327 16389 -186357 136121 68232 -93076 54363 -66002 69750 -39272
128 -39272 -98306 180662 -39536 -46383 -4310 -48246 120671 -85472 171 110646 -109568
139 -109568 3650 -27462 49433 91645 -141594 42512 26892 -55608 46137 -45047 86558
150 86558 -10533 -119973 85562 -11004 12145 9508 -47847 84097 -81224 -32916 93034
161 93034 -23157 26506 -64071 -8203 77333 -78543 38646 28797 -31488 13585 -71491 64964
173 64964 35065 -67156 45058 -26486 4260 -1078 -37237 89916 -30495 -43287 24277
184 24277 -24451 48317 -25807 -8285 51000 -64210 6458 14419 4492 35303 -59243 18157
196 18157 17159 -39021 34227 -7951 17687 -4686 -52060 44227 -881 -5317 16966 -26621 21294
209B1294m5603J6017N4848o7044K1699j3422K945L8640n4433M1001j808m0582
221b6448L3110k2381L4687k719m1905M1076k7108M458J9566j9434L0698l6388
233a2788o119L2808k2023K1775j3217p921J7965l1017K4135Q318j4341J1979k4368
246a4814J3245O342j2805K2786j4697m255K062r494K2716p051n004N175j4469
259a0263R882K42J669Q710j4657J240K07p72J0428m566K25l291o632P139J923
274A484K810p3p135p76K01M021M500k156l419k513m36K442M250N34k248l877k590
291d981M748J867J051P77n703l30p14K871O464n065j233k019j956O164j576L055
307C420o55p611L585q08L645L145o174K668m144q00O563k119L260m371m276N193
$$ plain form
209 21294 -24309 -8292 46556 -20488 1211 -12211 -9266 29374 -25059 15942 14134 -26448
221 -26448 6662 -15719 18968 16249 -25656 15420 -11688 -7230 12336 -7098 23600 -12788
233 -12788 -18907 13901 -8122 13653 436 -7485 10480 -20537 3598 11916 -2425 9554 -14814
246 -14814 -1569 4773 -8032 14754 57 -4198 -2136 -11630 11086 4035 -969 4206 -10263
259 -10263 -381 -139 1530 10240 -4417 -3177 -2970 -3742 6686 2120 2345 -946 -7578 -439 1484
274 1484 4294 4221 -2914 -3690 -3489 532 5032 2876 -543 -3056 -3492 -1050 3200 3734 1486 -2391 -4981
291 -4981 -233 1634 2685 3462 -2241 -2571 -3285 -414 6050 985 -248 -2267 -4223 1941 365 3420
307 3420 2765 -4846 -1261 -2069 1576 4721 -1453 1215 -2929 -3729 2834 715 3975 -396 -4672 521
323E21k414M371Q21m512J658m650L183M301k759J977m210r36K606j153M384j082
339B106l325j6j496L207J734j161j16k353j065J957J884O20o59l096n8J798p17
356g56L267j064k457Q17l530N108J159l580L757n666J937J876l582Q611o788j731
372b622M300o286R163m983j323P756j2869P645J43k938R774j4916Q368K052j0935
387g671J4644j0082N403J555j5879K0697r835j761J0038j6074J7397j2621l561
400g750K1971k2319J1539m231o699K1817k7383J5962O895k1822K0943j9364J4845
413D404P261l0922L2361j5123l631J4507k4262L3807k1240j3332L4016k9116J8871
426G601r440r577L6125m4444J7945J4962k4835K7415l4263K2102J5583m6308M1511
$$ plain form
323 521 -1893 2478 3299 -1213 445 -4205 -1022 3279 520 2497 -1713 -2649 -43 -1196 3188 2106
339 2106 -1219 -1235 -2731 476 2210 1049 933 -1420 -2485 -528 1356 1976 1317 -1779 -1837 -39 -756
356 -756 2511 1447 -1010 -193 -3723 1385 2544 -1036 2721 -2945 -1008 868 -2714 5897 -891 -2622
372 -2622 1678 -4608 4555 -428 -1751 6005 -6864 781 924 -2014 7760 -7156 1212 3264 -7671
387 -7671 6973 -3109 2294 3849 -12030 8667 -1168 -2929 7109 -8965 8432 -4189 -7750
400 -7750 14221 -8098 3441 -790 -7489 14328 -13055 2907 9802 -12020 8923 -10441 4404
413 4404 11665 -19257 13104 -2019 -5650 8857 -15405 18402 -2838 -16170 17846 -11270 7601
426 7601 -1839 -11416 24709 -19735 -1790 13172 -11663 15752 -18511 3591 19174 -27134 14377
439A4377j4924j660J3283l8952N1869k1422k3737M0845l3406K7443j9012j5572
451b0868N7046n4592J3201J5755k4120L9221n2230K7000K9604o0545M2578j8569
463f519R570J7583o1362O6415j7062l2598M1999l7755M5618k9294l1781P6542
475D1356n5987J0736R390k2778N6756p2323K3268M6560o2741L9448l1040K1568
487D213K8786q2762P0533o128l2844L3663m7930O6284k7350n1120Q2264m7606
499i997J2895m184k5723P9477q0134P609N3034n2528M1163m9663K7163M7940r7276
512e0224O0969J143j9779K9159o8855Q1652j5192o6780P7005l9958K7279j8596
524b177m1092J01813p5764o542M7367m1341N3240p1062K2203P0085r7857M6010
$$ plain form
439 14377 -547 -2207 11076 -27876 23993 2571 -21166 19679 -13727 13716 -5296 -20868
451 -20868 36178 -18414 -5213 10542 -13578 25643 -26587 413 30017 -30528 12050 -6519
463 -6519 3051 20634 -40728 25687 8625 -23973 18026 -19729 25889 -3405 -35186 41356
475 41356 -14631 -3895 5495 -17283 39473 -32850 -9582 36978 -25763 13685 -17355 4213
487 4213 32999 -49763 20770 14642 -18202 15461 -32469 33815 6465 -44655 37609 -9997
499 -9997 2898 -1286 -27009 52468 -27666 -20057 32977 -19551 21612 -28051 -888 47052 -50224
512 -50224 10745 11888 -7891 21268 -47587 34065 18873 -47907 29098 -10860 16419 -2177
524 -2177 -43269 58544 -17220 -23762 23605 -17736 35504 -35558 -13355 56730 -41127 4883
536D883m194k082L4671r1260Q3459M072o9707N9320l9442M7822k0611o2123J06551
549E1359n6393j3222K9309l3726P1240p8642K351P9943p8667L3301j9259R699
561b707M9253j03376O6822K0595n5582M1702n0175O3008r354p8668R5961l6489
573I90o349R591l8960Q9635p2722j7127P5554n7904L3897l8773J0443O7907j02991
586d6809M5754K2585l4488L6023o7061O6939Q568q2596P3866k5923J1170q61n2460
599d5293R4270n2722k7896N6171l9750M3081m9098k301P6205q2249K5232J2352
611H002j5424L8696p5215N3219K4861o8992M8059k4942K5534R68o2180Q2701k9776
624E511k6670L3737l2059N2939m6468j6944P1725n8391J6354k395o773M6963p3891
$$ plain form
536 4883 689 -1393 33278 -57982 25477 29549 -40158 19162 -20280 27542 6931 -55192 51359
549 51359 -5034 -18256 11053 -22673 48567 -30075 -27724 52219 -26448 6853 -12406 -2707
561 -2707 46546 -56830 9992 30587 -24995 16707 -33468 29540 20186 -58482 37479 990
573 990 -5359 4232 -34728 54907 -17815 -34942 40612 -17292 16605 -22168 -11725 56182 -46809
586 -46809 -1055 21530 -12958 23065 -43996 22943 31511 -51085 22781 -3142 8028 7167 -45293
599 -45293 48977 -3745 -31641 24530 -15220 27861 -21237 -23538 52667 -29582 -4350 8002
611 8002 -7422 31274 -43941 9278 34139 -34853 13206 -11736 13798 14766 -47414 35287 5511
624 5511 -21159 12578 -19481 33458 -13010 -29954 41771 -16620 -266 -2661 -9434 37529 -36362
637c6362L4647K9861m9057L3612l2625L1943J0325o4269O3114j5395j4658J8060
649I196l4846N6456l3512k5644N5548l7379J7530j3663q722N0306n8260J6564
661f426K3573k8724K6630l6360K6106J8949n2695L9315q810k778J0961l5313M7196
674B1624j7399k4848L5424k3289J9666j5305j2933M3795l8752O502J3437j5830
686g908K4349l3624J5889K0514l6522K3626r462M091J0360l2644L3702p020j6931
699a1580K0194j8301K0437j0878j4858L1748k2669M361M277j0412K2032k4491
711a0140O476J5467k0819J4202r858M508J0272k3367J8558k015q427J0561j3342
724g924J4528m533j1577J7585j0903L387O67p162J4590j2944J342Q474r721P948
$$ plain form
637 -36362 -1715 28146 -20911 12701 -19924 12019 22344 -41925 21189 5794 -8864 9196
649 9196 -25650 30806 -2706 -28350 27198 -10181 7349 -6314 -15036 35270 -22990 -6426
661 -6426 17147 -11577 15053 -21307 4799 23748 -28947 10368 1558 -1220 9741 -25572 21624
674 21624 4225 -20623 14801 -8488 11178 -4127 -17060 26735 -12017 -5515 7922 -7908
686 -7908 16441 -17183 -1294 19220 -17302 6324 -3138 953 11313 -21331 12371 5351 -11580
699 -11580 8614 -9687 10750 -128 -14986 16762 -5907 -1546 2731 -7681 14351 -10140
711 -10140 -3664 11803 -9016 5186 -4672 -164 10108 -13259 5299 3284 -5143 5418 -7924
724 -7924 6604 2071 -9506 8079 -2824 563 1230 -5932 8658 -4286 -2944 5530 -4191 3757
738C757o906J946P355j2274Q125q96l150N404q034P351r10n890P375n022K538
753G69J87m162O775m871K34K873l661L701k792J41K810l733K343m07q55J680j992
770i60J257N6r84J105n49j10K89o4k27L32k02j0N15j302J334j04j285J778j544
789f75J023Q6j908L128k247M0J655k521K960k289j49L046m073K776p43j210L301
806B200m477L100K89l247M204l611K005Q50m058N219l375J71K571m318M683k907
822g01p65M156n120L740j182j865M492n192L215L80l478M768m198J962J382m210
838b616M947l321L17K612m337M263k268q27L436m349L274q30j819L574l772K270
854E54K68k557L512k815R87J056k568K963j930RJ653k309J926q54m87J580j789
$$ plain form
738 3757 -3149 -1203 6152 -6122 2003 1107 -2043 3361 -4673 2678 1768 -4122 3253 -1769 769
753 769 956 -3206 3569 -1302 -1068 1805 -1856 1845 -947 -806 2004 -1729 614 207 -648 1032 -960
770 -960 297 353 -631 474 -75 -185 104 40 -187 145 -57 -67 448 -854 480 376 -909 869 -675
789 -675 348 434 -1474 1654 -593 -553 1102 -1419 1541 -748 -897 2149 -1924 852 109 -1101 2200
806 2200 -2277 823 1112 -2135 2069 -1542 463 1313 -2745 2474 -901 -730 1841 -2477 2206 -701
822 -701 -1466 2690 -2430 1310 128 -1737 2755 -2437 778 1158 -2320 2448 -1750 212 1594 -2616
838 -2616 2331 -990 -673 1939 -2398 1865 -403 -1230 2206 -2143 1131 301 -1518 2056 -1716 554
854 554 822 -1735 1777 -1038 -51 1005 -1563 1400 -530 -521 1132 -1177 749 -105 -592 988 -801
871h01J014O3p73J006p73J89L79n53K38K12m00K69J60p71J018m85m45J189j557
890h21J391l32j442K667k303Q28P54k309L536l056L46K782m115L567k185k83L909
907B934o153M523l63l058M925n954M802P4n972Q007n525J864J787o418R714p099
923a912n87O822q349P693n632o61R443j2879P777j32m849Q896j2398R481J559
938D272j1715J2944q582M330K019j2088J7380j0245k626R871j1591J2997j0215
951c249k328J6366j8261R156o94n064J3685k0060J2549N185j6248J5334j1962
964e591Q502L172j9690K3737j0565m168J0313j5019K0581j4403o498K3007k0982
977g604J0688m226m876K1213k8477J3499Q904j8022J7302j8593J4241O547k8407
$$ plain form
871 -801 213 276 -497 509 -264 -75 304 -249 -11 201 -199 70 230 -541 477 -8 -453 736 -821
890 -821 570 238 -1204 1463 -840 -12 742 -1567 1969 -1087 -741 2041 -2074 1493 -692 -975 2934
907 2934 -3219 1304 941 -2117 2808 -3146 1656 1730 -4242 3765 -1760 104 1891 -4527 5187 -1912
923 -1912 -2499 4323 -4026 3667 -1965 -2626 6817 -6062 1715 1583 -3266 5630 -6768 2713 4272
938 4272 -7443 5501 -3081 1249 3268 -8820 8560 -1685 -4311 5560 -6031 6966 -3249
951 -3249 -5577 10789 -7472 1684 990 -4074 9611 -10449 2100 7285 -8963 6371 -5591
964 -5591 2911 6083 -13607 10130 -435 -4603 5710 -9309 11272 -3131 -9629 13378 -7604
977 -7604 3084 -1142 -6018 15195 -13282 217 9121 -8901 8401 -10192 4049 10596 -17811
990a7811K7913j0211k663R021k0912K9949j6338j2188K6746k1175J4303r919o766
1003a0051L0400l3394J0743J0565j6023J9912k6741J6764J3329l3809K6229r587
1015a663J884Q543k8950L5749j2447j7051K4902k0044K0380j4311j2523L7963
1027B2432l2401O957P928j2892K5677l4748J5179K0308l4463K3153j3173Q413
1039B370J1203l8208L8120p678j7283K0554k2640K9445j6199j9936M1613k8604
1051g243P081J187j2001L4238l9396R885K3734k9632K1222k0286J2571J7600m3499
1064b4539L3266l088j2273J5736k7780L4930j1321k6140L7427k1871J0074m931
1076e10j5053M0450l6019K253K1898k2108K1811k6613J1347K4551m2568K5373
$$ plain form
990 -17811 10102 -109 -2772 6249 -14663 15286 -1052 -13240 13506 -7669 6634 -3285 -10051
1003 -10051 20349 -13045 -2302 8263 -7760 12152 -14589 2175 15504 -18305 7924 -1663
1015 -1663 221 8764 -20186 15563 3116 -13935 10967 -9077 11303 -3008 -15531 22432
1027 22432 -9969 -3012 4916 -7976 17701 -17047 -1868 18440 -16023 7130 -6043 2370
1039 2370 13573 -24635 13485 5807 -11476 9078 -13562 15883 -316 -20252 21361 -7243
1051 -7243 -162 1025 -10976 23262 -16134 -6249 17485 -12147 9075 -11211 1360 18960 -24539
1064 -24539 8727 5639 -6634 9102 -18678 16252 4931 -21209 16218 -5653 4421 -510
1076 -510 -15563 24887 -11132 -8879 13019 -9089 12722 -13891 -2544 22007 -20561 4812
1088D812k370n103J4415l4156L5904m504k7558L0135j9154J6645q173k0738M3127
1101B3282k9672j100J5238j7170K6846l0976O468K8402l6330J9310o957J171J7344
1114A5856l8384L0757J759k2903K1673j9924K1788n827k5555L8224k0246q50P588
1127C956j5358L0095k7884p89K6641k6228J5016j1185K687K0659l5936K1574M752
1140H000j5601J5810k1533K2171r42k5956K9648j3804K636K514j6337L0460k1836
1153d770m658K0555j8397J5404j4706J070K2256k9825J4426K509q349J4121k3270
1166a3634J9035L294k1713K0496j1390O844J071j7531K6175j4055n117J2957j3089
1179f657J5610j3501k309J9653k0517Q736j79m276J2966k0030J2321N363j5063
$$ plain form
1088 4812 2442 -2661 11754 -22402 13502 8998 -18560 11575 -7579 9066 893 -19845 23282
1101 23282 -6390 -7490 7748 -9422 17424 -13552 -7084 21318 -15012 4298 -2659 -1488 15856
1114 15856 -22528 8229 9988 -12915 8758 -11166 10622 4795 -20760 17464 -2782 -3632 3956
1127 3956 -11402 18693 -9191 -9980 16661 -9567 5449 -5736 -3049 17610 -18326 3248 8000
1140 8000 -7601 8209 -13324 8847 7905 -18051 11597 -2207 429 2943 -13394 17066 -4770
1153 -4770 -9428 11127 -7270 8134 -6572 -5502 16754 -13071 1355 3864 -4485 9636 -13634
1166 -13634 5401 8695 -13018 7478 -3912 2932 4003 -13528 12647 -1408 -6525 6432 -6657
1179 -6657 8953 -4548 -6857 12796 -7721 1015 836 -3440 9526 -10504 1817 7180 -7883
1192g883J2835r526P277K085j5623J8495p674l415P239j0036J3753r560m088J4298
1206H177j2695O336k413k816J1489j4910P054M073q705Q620q815O150K923j1647
1220g179J1456m767n96L851q119J0432n531l500Q363p332N060k690k383Q185q742
1235c492L407K063m325N375n963L296K511o494N616k521J81K124m877N417k166
1250A52k017L752l411K723j296j543L905l568J271O95j713K457k534J093J095
1265A061k236J901j027J84P50j532J491n84l82Q09p56N24k19j17L41l28J05O2
1283D7O4l60L82j8l76N46o48O76k19p49J442j228M16L57j055J721j670M31J201
1302I60k025J851j170O2J512k666K315o33j108K149k538K062l64j878L125k644
$$ plain form
1192 -7883 4952 -4574 2703 4788 -10835 7660 -14 -3429 3810 -6226 7527 -2033 -6121 8177
1206 8177 -4518 1818 -595 -3411 8078 -6832 222 4295 -4410 4210 -4605 1545 4468 -7179
1220 -7179 4277 -490 -1086 2765 -5354 5078 -453 -3953 4410 -2922 2138 -552 -2935 5250 -3492
1235 -3492 -85 1978 -2347 3028 -2935 361 2872 -3622 1994 -527 -346 1778 -3099 2318 152
1250 152 -1865 1887 -1524 1199 -97 -1640 2265 -1303 -32 663 -1050 1407 -1127 -34 1061
1265 1061 -1175 726 -301 -117 633 -899 592 8 -374 435 -321 203 -16 -133 208 -120 -15 47
1283 47 111 -249 133 115 -261 285 -363 313 94 -655 787 -441 -25 332 -723 998 -672 -241 960
1302 960 -1065 786 -384 -322 1190 -1476 839 206 -902 1247 -1291 771 407 -1471 1654 -990
1318i90J124O01k256L274k709N62J815l079K984j867j06K372l630K956q96j307
1334a152K887l406K473k30k231L514l106J448P39k714L574k748N83J786l214L228
1350A431j877k93K368l379K813r63j257K821l096K050j31j867L019k725J171P89
1366H74k244K726k091M70J400k517K331j151l20J588k253J870n01j002J778j677
1382g19J034m3j073J660j278K97N32r32J022p07k7P00p90L95J4k30L43k90m8L58
1402B18k52j12M01m71L28R5p00J013p17J0P19j291J421p26n98J666j853J327l09
1421A69j185K527k562J043Q72k180K819k615R02J900l763L420j697k75K481m447
1437b591M286j273k383M223m297L416q96l297O277n317J673J651m069O058n778
$$ plain form
1318 -990 134 735 -1521 1753 -956 -394 1421 -1658 1326 -541 -647 1725 -1905 1051 155 -1152
1334 -1152 1735 -1671 802 572 -1659 1855 -1251 197 936 -1778 1796 -952 -369 1417 -1797 1431
1350 1431 -446 -739 1629 -1750 1063 100 -1157 1664 -1432 618 487 -1380 1639 -1086 85 874
1366 874 -1370 1356 -735 -265 1135 -1382 949 -202 -522 1066 -1187 683 182 -820 958 -719
1382 -719 315 272 -801 859 -419 -122 410 -522 500 -207 -234 466 -324 71 85 -145 198 -92 -140 218
1402 218 -34 -146 255 -216 112 207 -493 520 -197 -187 532 -759 662 -64 -662 1004 -849 478 169
1421 169 -1016 1511 -1051 -8 864 -1316 1503 -1112 -210 1690 -2073 1347 -350 -625 1856 -2591
1437 -2591 1695 422 -1961 2262 -2035 1381 485 -2812 3465 -1852 -179 1472 -2597 3461 -2317
1452b317J463M280o898N723l314J69M622q519P172j265l977O175p020O259j244
1467A309o267R825p038K171J706o005R975q543O70O908q848P441n435M73P810
1482F152j2547Q579n61m677P604j0459R250m26r720J2274q087L587J053q766J4614
1497G870j0596n79Q436j0038J0304q890M30J1700j5946R432j133l907R601j5270
1511h586J2068J133j2285J3308r731O646N27j2672J8576j0848j614Q084j0784
1524f178J4118j1702j576J5318j6696R010k699k900J2679j9270J1870L892j2836
1537f970J2655j1749R405J929j6820J9814r131j655O588j2340J8158j2566m629
1550g311J7067j5706R629n673k696J6642k1932J0505M976j1297J2784j5650J1888
$$ plain form
1452 -2317 -854 3426 -3472 2251 -1063 -894 3728 -4791 2381 1116 -2861 3314 -3706 2553 1309
1467 1309 -4958 4867 -2171 0 1706 -4299 5676 -2867 -2197 4711 -4137 3304 -2131 -1658 6152
1482 6152 -6395 2184 1623 -3054 4550 -5909 3341 2915 -6805 5469 -2618 969 2022 -6744 7870
1497 7870 -2726 -3305 5131 -4907 5397 -3493 -3063 8637 -7309 2123 990 -2917 6684 -8586
1511 -8586 3482 4615 -7670 5638 -4093 2553 3080 -9592 8984 -1864 -3478 4606 -6178
1524 -6178 7940 -3762 -5338 9980 -6716 2294 -405 -3305 9374 -9896 1974 5866 -6970
1537 -6970 5685 -6064 3341 5270 -11550 8264 -867 -2522 4066 -8274 9884 -2682 -7311
1550 -7311 9756 -5950 3679 -1994 -4690 11952 -9980 525 5501 -5796 6988 -8662 3226
1563C226M351j9665J9153q524J002M913j5503K1789j1604o976J5997j4154J2130
1576F135q827m315K0151k1394P913M009q603J3980j8946J1188P836j9601J5944
1589E470q292L751N059j8600K1751p927q037J3017j2915J4418r299p362K1164
1602A2198j8118N875J722o838J5979k0233Q566R731j7016J3342j0035O107O504
1615G784k0486J9705n411o067R717j3759J7025q408r591J9426j4602O568j778
1628A23o547J8132j9262N385R058j2874J2069j2308O398Q729j9681J5329l733
1641H18l167P620j4666J6480n024j0426J5391j1041P148k891p636J7768j5120
1654d746K260P100r373J1386j2360M268R903j6332J0967l509q22P011j4703J3885
$$ plain form
1563 3226 7577 -12088 7065 -1459 -457 4456 -11047 10742 -862 -7838 8159 -5995 6135
1576 6135 -2692 -7007 13144 -8250 -337 3672 -4931 9049 -9897 1291 9127 -10474 5470
1589 5470 -2822 929 5988 -12612 9139 1212 -6825 6192 -6723 7695 -1604 -8966 12198
1602 12198 -5920 -45 1677 -5161 10818 -9415 -849 8882 -8134 5208 -4827 1280 7784
1615 7784 -12702 7003 1592 -4475 5242 -8517 8508 100 -9491 9935 -4667 1901 123
1628 123 -6424 11708 -7554 -2169 6889 -5985 6084 -6224 174 8903 -10778 4551 818
1641 818 -2349 5271 -9395 7085 2061 -8365 7026 -4015 3133 242 -7394 10374 -4746
1654 -4746 -2486 4614 -4759 6627 -5733 -1465 8438 -7894 3073 -436 -1258 5753 -8950 4935
1668D935k180q852J1078r430Q331k883q432J5528j1070J718L795p140J1552j1485
1682d535K205Q922j1945Q283m712P12O977j3237J0262p34n951P600q485P949j514
1697A797p932J1529p281J689J823n912R975q277K09O774p838O057m305K84O363
1712D955r798O265m5l588N300o933N829l0o150P411m666J851Q76m904P536n174
1728a265l59M105m859M751l650j53M870o274L745n12j684L724n169L745L81l721
1744b325M191l095J711N34l386M510k668k54K049k735K931j997m36K729l059J750
1760D50l02q77K018k472J423M66j685J737j275N95M49j449J589p67k16P55r14
1777d75Q42m22k58P43o95L10M8k42L07k56R8R6j56OJ93j96m2K89l47K82j65j52
$$ plain form
1668 4935 2755 -6097 4981 -4449 3882 999 -7433 8095 -2975 -1257 2538 -4602 6950 -4535
1682 -4535 -2330 6592 -5353 2930 -1782 -1070 5907 -7330 2932 2198 -3753 3847 -4638 3311 1797
1697 1797 -6135 5394 -1887 -198 1625 -4287 5688 -2589 -2380 4394 -3444 2613 -1692 -1408 4955
1712 4955 -4843 1422 1377 -2211 3089 -3844 1985 1955 -4195 3216 -1450 401 1277 -3627 3909 -1265
1728 -1265 -1624 2481 -2378 2373 -1277 -1430 3440 -2834 911 399 -1285 2439 -2730 1015 1396 -2325
1744 -2325 1866 -1229 482 1016 -2370 2140 -528 -782 1267 -1468 1463 -534 -970 1759 -1300 450
1760 450 148 -729 1289 -1183 240 706 -979 758 -517 78 527 -922 667 -100 -316 439 -475
1777 -475 367 -55 -313 430 -265 45 93 -149 158 -98 0 96 -60 -54 139 -57 -99 190 -157 125 -40 -192
1799a92O21p99M28K07o56Q39q61M79L80j178J295p45j7P30j353J518p85m99J442
1818H54j617J213m00p80J834j952J004L48j389J900j763P62Q14k030K148j298
1834c52L1J284k204K164r79p03J926k249J704m33j185K330k313J193L76j714K354
1851A230k009P09R79k191K337j471JJ481k333K140r50o84J955k311J671l09j169
1868i24K141k151J166L41j637K132j702N89P95j849K028j234p2J220j785J648
1884G06p78n20J530j712J127j96p60J436j490P63L03j059J241r69L77M29j077
1901f49J101n36j14N32p55P28l05k91O00m93K49m0j85L52k57nJ38m3o8P3o2RJ88
1924A67l91L52k4l29N46o18L99J79p90R81p09J63N29j200J374p39l13J131j489
$$ plain form
1799 -192 429 -370 58 265 -391 448 -413 66 446 -732 563 -182 -199 531 -822 696 -89 -588 854
1818 854 -763 450 50 -730 1104 -848 156 504 -885 1015 -748 14 828 -1202 946 -352
1834 -352 -321 963 -1241 923 -56 -759 1167 -1082 622 189 -996 1334 -979 214 590 -1124 1230
1851 1230 -779 -70 909 -1282 1055 -416 -415 1066 -1267 873 -77 -761 1194 -1117 554 245 -924
1868 -924 1217 -934 232 573 -1064 1068 -634 -45 750 -1099 929 -305 -377 843 -942 706
1884 706 -72 -592 938 -774 353 157 -603 833 -657 106 409 -650 591 -378 -1 428 -649
1901 -649 452 -84 -198 334 -421 307 2 -289 311 -182 67 27 -158 194 -63 -68 70 27 -41 32 -30 -21 167
1924 167 -224 128 104 -225 321 -297 102 281 -509 472 -237 -74 455 -745 629 -110 -423 708 -781
1943g81J389o33p44J915k001J112M7j219K249k403J105R41k297K491j954P28J342
1960A287l195L228j455o28K134l197L301j436j693L749l583K205m18k043M385
1975B641m437J654J664l465M020l701J450K546n337M703j979o13K998n259N256
1990B141j623l029N168m696L358q68l399O753n776J489K255m261N687n498J542
2005g57M256p054N506k583k22M081p642O842j353l998N922n964N161j394n014
2020d213Q798o659J806J839m888P957p487J404N582p889O316m141O24N513r980
2035e418P701r77m016O123p689P112j159o894R834o642K371J132n974J0227q183
2050b452J77O431p775O969n569M71P564j1289P142m89l531O480r506Q035R3q243
$$ plain form
1943 -781 608 -25 -769 1146 -855 257 304 -915 1334 -1069 36 977 -1320 1171 -783 -55 1287
1960 1287 -1908 1320 -135 -763 1371 -1826 1475 39 -1654 2095 -1488 717 299 -1744 2641
1975 2641 -1796 -142 1522 -1943 2077 -1624 -174 2372 -2965 1738 -241 -854 2144 -3115 2141
1990 2141 518 -2511 2657 -2039 1319 451 -2948 3805 -1971 -482 1773 -2488 3199 -2299 -757
2005 -757 3499 -3555 1951 -632 -854 3227 -4415 2427 1074 -2924 2998 -2966 2195 801 -4213
2020 -4213 4585 -2074 -268 1571 -3317 4640 -2847 -1443 4139 -3750 2566 -1575 -951 4562 -5418
2035 -5418 2283 1306 -2710 3413 -4276 2836 1677 -5217 4617 -2025 346 1478 -4496 5731 -2452
2050 -2452 -2275 4156 -3619 3350 -2219 -1748 5816 -5473 1669 1180 -2351 4129 -5377 2658 2751 -5492
2066e492R688o551L510N86p493J1904p989n85N958p408Q459p239j2R052j1408
2081e020O685j492k195P288j1516Q402J075q083Q735p252N408M33r126J2381o919
2096a196n61M561p303J0045p721j440R656j0131O044k589j737Q593j2140O910
2110I91K234p141P713p896N908J686j0121J1174n378j58L541p798J0817o706k820
2125c954Q966q501O113l742j911R545j1483N364J940n358P286q997O038K673r709
2140e730R289m932J455K589q463J0818n362k966P019p144O837m461k544R531r641
2155c705M049R22l875P247r056M772L472q222P217m612K073K783q506R124l411
2170B72k729N287o232O693l583l397Q386p267L107Q1l196P069p909L075L381o153
$$ plain form
2066 -5492 4196 -2355 1155 1741 -5752 6152 -1837 -2422 3536 -3872 4587 -2652 -2664 6388 -5020
2081 -5020 1665 173 -2022 5266 -6250 2152 3227 -4856 3879 -3373 2035 2468 -6658 5723 -1196
2096 -1196 -1757 2804 -4499 5546 -2175 -3615 6041 -4090 1954 -635 -2372 6221 -5919 991
2110 991 3225 -3916 3797 -4099 1809 3495 -6626 4548 -830 -988 2553 -5245 5572 -1134 -3954
2125 -3954 5012 -3489 2624 -1118 -3029 6516 -4967 397 2337 -3021 4265 -4732 1306 3979 -5730
2140 -5730 3559 -1373 82 2671 -5792 5026 -336 -3302 3717 -3427 3410 -1051 -3595 5936 -3705
2155 -3705 344 1266 -2609 4638 -4418 354 3826 -4396 2821 -1791 282 3065 -5441 3683 272
2170 272 -2457 2830 -3402 3291 -292 -3689 4697 -2570 537 618 -2578 4491 -3418 -343 3038 -3115
2186c115N658m670K287K998p645P027k399j515L664n740O346k698l275O377n310
2201b010L084q72k715O392o274J960K382m138M601m417J833K930n941M834j782
2216a33o34K744m885M848j396k739M344l692K539o43k537M901m034R20J615k794
2232a576L504l240Q21K495l957K979j287k62K111l623L093n69j776K588k500J957
2248G58l82j895L122k335O47O85j678K412k093L96J463k131J715r74pJ283k087
2265a101J612k75q27J290j368J036j00j006J455j020K65L39p95J017p43PO43p84
2283c55N44k10j39M73n88L36P4l21L10j76M1Q5j68J33J4j61J26O3j93J83j02O
2305b5J94l89L50l1l44M97m16K30R6n22P55n51L1M49p06P57n09j07P70j036P49
$$ plain form
2186 -3115 2543 -2127 160 3158 -4487 2540 141 -1374 2290 -3450 2896 198 -3077 3300 -2010
2201 -2010 1074 202 -2513 3879 -2395 -435 1947 -2191 2410 -2007 -174 2756 -3185 1649 -133
2216 -133 -767 1977 -2908 1940 544 -2195 2149 -1543 996 353 -2184 2717 -1317 -397 1218 -1576
2232 -1576 1928 -1312 -491 2004 -1953 1026 -261 -523 1588 -2035 1058 489 -1287 1301 -1199 758
2248 758 376 -1519 1603 -732 -85 600 -1078 1334 -759 -363 1100 -1031 684 -290 -297 986 -1101
2265 -1101 511 236 -591 699 -669 367 267 -739 716 -304 -39 300 -495 522 -221 -214 429 -355
2283 -355 189 -21 -160 313 -275 61 135 -186 124 -52 -11 74 -94 39 53 -108 18 81 -112 71 -31 -25
2305 -25 169 -220 130 99 -245 252 -164 66 162 -360 395 -156 -125 324 -382 375 -134 -241 529 -507 242
2326B42j81m15R26j132P71P7q70J183j008M71L21j111J397r51P2P72j270J312
2344F06p67k40J166j484J117l19o13J353j519R45J09j073J502j305N72M62j348
2361h36J601j078R4Q84j485J460p79l02J230j570J209l25o87J395j490R12R0j046
2379g23J496j261M81M76j221J447j020J19Q22j330J230o24k32J009j337J007k13
2396A26n73J065j135P26N2q15J115q80L30K96q16J020p15L5N47p96P29m09j04
2415b02O08p60N05q9k71M88n46L50M5l49L89k75J33N2k29K63r8n5O1qK0k9pk2
2439b6J47j90M2J53k59K99k53lL63n47M43j54k03N68p72N61J4n88Q42q11M96J92
2461C14r46J226q37J30N53j152J403r01k19J201j501J241o12m39J595j984J242
$$ plain form
2326 242 61 -354 572 -560 211 288 -582 601 -407 64 385 -726 671 -280 -208 564 -706 606
2344 606 -161 -401 765 -719 398 79 -534 819 -700 245 354 -719 783 -522 50 512 -836
2361 -836 765 -313 -219 665 -820 640 -139 -441 789 -781 428 103 -584 811 -679 233 323 -723
2379 -723 773 -488 -7 469 -752 695 -325 -206 616 -714 516 -108 -340 669 -668 339 126
2396 126 -447 618 -517 209 261 -554 561 -319 11 307 -509 511 -204 -169 378 -418 311 -98 -202
2415 -202 406 -354 151 62 -209 279 -267 83 128 -221 168 -107 26 78 -151 112 14 -41 20 12 32 3 -4 -26
2439 -26 121 -69 -27 126 -133 166 -87 -90 273 -274 169 15 -188 380 -392 169 183 -405 437 -374 122 314
2461 314 -632 594 -243 -113 440 -712 691 -210 -429 772 -729 512 -100 -539 1056 -928 314
2478C14L4j085J752j964J234M24j926K263j588N46P88k235K745j601l85J824k370
2495a230K309j346p50K762l098J788r7j403K788l268J794R33k825L049k354J030
2511H2J243l562L889j839p04K334l278L455j775j502L936l838K178l27j820M053
2527B525m472J990J476l414L742l334J593J850m783M674k108n07K494m342M772
2542B156k145k084M543m324L017j095k171N352n373K042J522l430M490m600K025
2557g5K634n634M906k376J2K723n556N661j867k691M708m612L811j384l084O413
2573C589n488J729J474l569N398n390J660L540n926M852k799M00L328o611N900
2588B087j426k731M475n122M770j490l827O760n254J990O93l554O368n980J343
$$ plain form
2478 314 348 -737 1015 -949 285 709 -1217 1046 -542 4 792 -1443 1302 -299 -684 1140 -1230
2495 -1230 1079 -267 -1017 1745 -1353 435 338 -1065 1723 -1545 249 1182 -1643 1406 -948 82
2511 82 1325 -2237 1652 -187 -891 1443 -1835 1620 -155 -1657 2279 -1559 619 292 -1528 2525
2527 2525 -1947 43 1519 -1895 1847 -1487 106 1956 -2827 1847 -261 -768 1726 -2616 2156
2542 2156 11 -2073 2470 -1854 1163 68 -2103 3249 -2124 -82 1440 -1990 2500 -2100 -75
2557 -75 2559 -3075 1831 -545 -533 2190 -3366 2295 428 -2263 2445 -2167 1644 260 -2824 3589
2573 3589 -1899 -170 1304 -2265 3133 -2257 -597 2943 -2983 1869 -930 -530 2798 -3813 2087
2588 2087 661 -2070 2405 -2717 2053 563 -3264 3496 -1758 232 925 -2629 3739 -2241 -898
2603h98L659n440M920l792R75L880p140N593j250k060M045n777N406j109m330
2618c318O389m780K401J69l970O950n584O13L508m856N024m202N85M614o933M734
2634A344j074j602M100o237N139k50m423N582m418K834O6m454O901m750L14K738
2650A810m245N313m431J77M662o022M073j642p89M081o350M624M3l590M526m403
2666b163L367M0m505O133l863N43J805l852N351m005l33M165m862L567j904o87
2682a203M139n696L493L40k832L828m182K949O48m256M906k922O20J405l679M856
2698B414l005p79L371l751L181j928p87L847m600K524J41j895L191l848K465P79
2714A320l381L634k443R96R50l203L951k186n36K248k818K812j719p58L051l313
$$ plain form
2603 -898 2761 -2679 2241 -1551 -576 3304 -3836 1757 507 -1553 2492 -3285 2121 1012 -3318
2618 -3318 3071 -1709 692 861 -3109 3841 -1743 -1130 2378 -2478 2546 -1656 -1071 3543 -3390 1344
2634 1344 270 -1332 2768 -3469 1670 1420 -3003 2579 -1839 995 1061 -3393 3508 -1242 -928 1810
2650 1810 -2435 2878 -1553 -1376 3286 -2736 1337 -305 -1094 2987 -3363 1261 1304 -2286 2240 -2163
2666 -2163 1204 1244 -3261 2872 -991 -448 1357 -2495 2856 -1149 -1482 2683 -2179 1388 -516 -1203
2682 -1203 2936 -2760 733 1073 -1759 2069 -2113 836 1484 -2772 2134 -788 -168 1237 -2442 2414
2698 2414 -591 -1370 2001 -1750 1431 -497 -1284 2563 -2037 487 628 -1267 1924 -1924 541 1320
2714 1320 -2061 1573 -870 126 1076 -2127 1824 -362 -898 1350 -1468 1344 -375 -1133 1918 -1395
2730a395J831j43j274K611l076J669P85k389K511j866Q01R13k560K738j297m50
2746e91J533k085K098j034q44K180k117J172j35r45J948k044Q83O21j482J604
2762G62j314N52O88j668J628p61j70Q50j326J337o04m86J169j151P41j70n00J054
2780F31j071M76K63o95P90o58K49L41p50O95l00r9L77n31M64j45k48M35l46J43
2800B1M6k00K79k10J2J61j76P6K3o7Q4n5n4J48j20k2J74k05J22j6j19K80l22J27
2824a3J79l57L55k44M0K75n29M80j67j97M58n64M64r7l93O91o20K82J36n32P60
2845D07o42J53M19p52P60m84j6N73r09P83k62l26P42q98O83r7n73R51q75M49J77
2866B63p48J003p89J96M86r24R45n91l6O78j008Q54l24l39Q69r96O79o8n96R79
$$ plain form
2730 -1395 436 293 -981 1630 -1446 223 1008 -1381 1130 -736 65 978 -1582 1156 -141 -591
2746 -591 942 -1143 955 -79 -923 1257 -860 312 177 -768 1180 -864 19 640 -842 762
2762 762 -552 0 688 -980 648 -113 -283 567 -759 578 -26 -512 657 -494 247 77 -423 631
2780 631 -440 36 299 -396 394 -264 -15 326 -424 271 -29 -128 249 -282 182 37 -211 224 -122 21
2800 21 67 -133 146 -64 -52 109 -67 9 32 -35 49 -6 -60 88 -32 -54 120 -85 37 21 -98 182 -140 -13
2824 -13 166 -191 164 -80 -40 235 -294 186 19 -178 280 -284 180 83 -310 381 -239 43 179 -353 407
2845 407 -235 -82 337 -415 345 -139 -155 418 -491 292 30 -296 446 -452 231 134 -439 512 -363 86 263
2866 263 -485 518 -271 -75 411 -513 432 -159 -195 483 -525 329 5 -334 535 -461 218 150 -446 533
2886E33r18M49K19p68R66p41J97M52q90R00n19q2O26r01P86l08l14P58q27N62
2906A80p9m58P94p24L32J69n68P31n87J62L42o46O28l61j2L73n93N16j72k12M31
2927B46m60L33p7k37M23l70J62M8k00L02k78Q2J22j80J41r8L3P1j12N8MOm0L2
2951A1prM8j35J81q0r6K15k48K23p8j95M13m17K04P7l48N44m88J31L19n97O40
2974C08m56J7N41q70P36k76k72P41r89P97j05o61J048r93O04O8q73J365j098K56
2994a12N66j119J358j041P7J040j560J303o15k73J253j835J424k00r66J571j670
3011g99J180K8j461K112j590M62O53j647K204j640%J571k142J847j043l41J958
3028A352k666J817j21j282K108k390J629K90k200K763j949O53P97k340L050j982
$$ plain form
2886 533 -385 64 283 -485 481 -260 -63 389 -501 399 -120 -202 424 -477 309 1 -313 445 -382 180
2906 180 101 -357 437 -287 45 214 -354 377 -210 -48 294 -352 276 -85 -97 276 -317 199 27 -185 246
2927 246 -214 119 42 -195 228 -142 20 68 -132 170 -108 -26 96 -84 57 -41 -8 63 -49 9 13 19 -21 11
2951 11 4 -5 43 -92 89 9 -87 128 -120 103 25 -170 243 -174 30 107 -241 303 -185 -54 265 -332 308
2974 308 -148 -131 410 -460 276 0 -272 469 -520 277 172 -489 559 -434 170 238 -635 730 -368 -112
2994 -112 454 -665 693 -348 -271 769 -791 512 -103 -376 877 -958 466 266 -700 871 -799
3011 -799 381 409 -1052 1060 -530 -68 585 -1062 1142 -498 -498 1073 -1069 778 -265 -606 1352
3028 1352 -1314 503 382 -900 1208 -1182 447 737 -1463 1300 -649 4 801 -1539 1511 -471
3044d71k37J981k587K439j489n27K668l294K069k30j322K606l198K081M79k621
3060a653L075k379J164P73k956L707k204k21J960k856L124j982p19L180l588K262
3076F87n52j255L166l875K187P74k793L245k829J500J103l642M013k090k93K037
3092A383l348L717j990j250L561l644K414p72j497L822m221J980R86k766L419
3107A794l318J676J498m009L957k077N4J873l734M122j915j398L357l487K764
3122A157j199j595M130m156J818P09k361L544l720J682J729l880L623k164M13
3137b70J894m049M085j542j470L050l421L018j155k004M213l742J561N48k315
3152a599L781l691J218K008l598L305k235M82K130m148L673j147j261K626l370
$$ plain form
3044 -471 -708 1273 -1314 1125 -364 -891 1777 -1517 552 322 -1000 1606 -1592 489 968 -1653
3060 -1653 1422 -957 207 980 -1976 1731 -473 -694 1266 -1590 1534 -448 -1167 2013 -1575 687
3076 687 135 -1120 2046 -1829 358 1132 -1661 1584 -1245 255 1358 -2284 1729 -361 -654 1383
3092 1383 -1965 1752 -238 -1488 2073 -1571 843 71 -1426 2396 -1825 155 1141 -1625 1794
3107 1794 -1524 152 1650 -2359 1598 -479 -425 1448 -2286 1836 -79 -1477 1880 -1607 1157
3122 1157 -42 -1637 2493 -1663 155 864 -1497 2047 -1673 9 1738 -2142 1481 -683 -270
3137 -270 1624 -2425 1660 118 -1352 1698 -1723 1295 140 -1864 2349 -1393 168 716 -1599
3152 -1599 2182 -1509 -291 1717 -1881 1424 -811 -329 1801 -2347 1326 179 -1082 1544 -1826
3167a826L126r74k133L795l187J582J04k077L742l415R24J692k883K978k387O11
3183c28K061l721L051j045p65K181l228K901o84j963L112k663J582k8k043L437
3199A857k776N72J403k386K717k173K82K080l139K368q49n92K018k961K336k40
3215E17j745K463k199J437N5j949K869k065L90R94j893K354j812Q1J719k327J801
3232F90q62l23J678k405J736j63j155J736j788J254M9j521K065j454L94N83j418
3249i04J843j308k6J223j601J321o78k86J306j693J090j7q15J233j284Q00K09
3266D13j138J354r01K13M56j038J223p28j59Q17r95Q17l87k75Q75r94N71L1m71
3285c16P26p38M13J60o18O84m49J08K37n21N80l11r4L74m34L31j19j45L55l65
$$ plain form
3167 -1826 1300 326 -1807 1988 -1199 383 487 -1590 2152 -1263 -339 1353 -1530 1448 -939 -328
3183 -328 1733 -1988 1063 18 -747 1434 -1794 1107 423 -1540 1572 -1091 491 463 -1580 1857
3199 1857 -919 -347 1056 -1330 1387 -786 -504 1576 -1563 805 -44 -636 1382 -1579 757 517
3215 517 -1228 1235 -964 473 528 -1421 1448 -617 -227 767 -1126 1228 -584 -503 1216 -1111 690
3232 690 -172 -495 1183 -1222 514 351 -804 932 -856 398 447 -1074 991 -463 -69 514 -904
3249 -904 939 -369 -395 828 -773 548 -130 -416 890 -803 287 270 -545 688 -596 204 413
3266 413 -725 629 -272 -59 397 -641 582 -146 -305 512 -483 334 -53 -328 547 -447 124 155 -316
3285 -316 410 -328 85 245 -373 311 -138 -30 207 -314 266 -45 -139 235 -199 132 13 -132 223 -142
3305a42J77N7k14K59k12P2J06k08J52j0q8J15j10N4N1j41J23j2r9J33q6OR1j67
3329i3J62k8j50K24j93Q8O5k29L16k17j9K37l22K88j22j28L61m33K66K0k78M16
3351B31m05K00J54m45N02l40M0K88n27N42k82j29M59n68M49j46k60N72o02L48
3371H1M7m06O02n57K26K33n69O49m38M6L82o57O31l13j38N24o77N24j43l02O23
3392C68o59L85O0m72O73n77K30K26n76O62m26J9L72o31N91k85j40N02o23M60j10
3413D9k90N60n78L40N2m12N69m66J80J73m63N39l44K1K78m55M54k44q3L48m27
3434a99L16j02j47L50l95K40J5k23L16k98J63N8k46K79j81N7P7j89K23j49%J04
3456F9j29J30j03J6O1q1O9n4M4j2m0N3m3P1q4K5Q4j51J45j07J8J15k21K31j17
$$ plain form
3305 -142 35 92 -122 137 -75 -3 103 -105 47 37 -51 64 -46 8 59 -82 41 29 -70 63 -23 -17 74 -93
3329 -93 69 41 -109 115 -78 10 75 -154 162 -55 -74 163 -159 129 7 -121 240 -193 73 93 -185 231
3351 231 -174 26 180 -265 237 -103 -63 225 -302 240 -42 -171 288 -280 169 23 -237 335 -267 81
3371 81 128 -278 324 -233 -7 226 -343 306 -132 -86 296 -361 270 -43 -181 343 -334 190 47 -255 368
3392 368 -291 94 154 -318 355 -222 8 234 -342 320 -106 -87 285 -346 245 -40 -180 322 -301 159 49
3413 49 -241 319 -259 81 133 -279 290 -176 4 177 -286 253 -91 -70 208 -247 207 -37 -120 228 -199
3434 -199 117 15 -132 218 -177 63 78 -145 171 -127 36 94 -152 127 -54 3 80 -109 114 -35 -35 69
3456 69 -60 70 -33 -17 44 -37 32 -22 22 10 -30 23 -20 51 -33 -8 76 -75 70 -37 -19 96 -125 106 -11
3481a1m8J99l16L03j15j57L46l81K78l5k78N02m72J83J56m20N78n10J48L38o37
3502c49O34l96qM72p88P16k56k89O56q02O71j64n15R23q33M30R2o48J030r20K86
3523e8M71r29R97p46J25O97j221J072m32k77Q78j257J080k45p45J262j176P25
3541B21K3r48J533j287L41O24j209J421j106J24J063j660J360n73l23J229j760
3558i27J387j85j013J572j533J022M9j346J984j497L77O67j458J868j423O8J337
3575I49j887J572q27k35J493k166J570j88j016J659j846J360L0j578K157j582
3591e35N30N53j636K236j597k8J458j969J775j052l04J841k424J590j55j035J862
3608A110k186J464K80j884K291j677O55O49k006K523j563j96J505k038K018j226
$$ plain form
3481 -11 -59 140 -176 127 12 -145 201 -180 98 63 -215 287 -185 -2 154 -266 312 -198 -50 288 -349
3502 -349 285 -111 -119 353 -435 281 25 -264 392 -410 261 97 -418 505 -328 102 194 -454 576 -344 -58
3523 -58 413 -516 481 -265 -140 557 -664 408 -24 -301 577 -680 400 155 -590 672 -504 221
3541 221 244 -704 829 -458 -117 507 -702 719 -387 -263 800 -860 500 -73 -396 833 -927
3558 -927 460 275 -738 834 -699 323 372 -974 1010 -487 -110 557 -901 967 -456 -388 949
3575 949 -938 634 -193 -428 1065 -1101 469 281 -735 924 -922 438 468 -1110 1047 -535
3591 -535 -5 548 -1088 1148 -449 -477 981 -988 787 -265 -569 1272 -1152 438 283 -752 1110
3608 1110 -1076 388 668 -1216 1075 -602 53 702 -1304 1219 -344 -540 965 -1073 945 -281
3624b81m49K085k477J560k70r19K007k427J474L90j814K148j762Q99N76k110K524
3641A154j470q3J241j973K178j302n11K029k259J510m59q21K095k444J339M35
3657F59j653K024j833R34P20k193K361j290n2J170k047K207j104p35J971k063
3673i24J471m85r26K191k285J069M56j459J938j859Q45Q42k067K042j136P2J024
3690H09j981K063r10o67J616j774J453n78q37J960j914Q99K36j123J729j718P16
3707b1P67j678J652j059J88R10j799J727o63n62J299j546J316m18q71J699j530
3724e89P06J92j010J598j456M39P70j395J348r12J35Q84j550J329m49m24J003
3741F19j289J079k60p60J309j140N76Q9p87J255j080K91N22r43R97p34J04O69
$$ plain form
3624 -281 -730 1355 -1122 438 168 -751 1256 -1171 303 693 -1121 1027 -735 164 740 -1370 1154
3641 1154 -316 -399 842 -1131 1047 -255 -766 1263 -996 514 55 -766 1329 -1115 224 659
3657 659 -994 1030 -803 131 851 -1342 1019 -271 -323 847 -1200 1007 -97 -832 1139 -924
3673 -924 547 62 -864 1327 -958 111 567 -892 1046 -813 32 874 -1193 849 -287 -215 809
3690 809 -1172 891 -19 -686 930 -844 609 31 -806 1154 -760 139 375 -748 981 -737 -21
3707 -21 746 -932 720 -339 -151 759 -1040 687 24 -538 761 -785 531 113 -758 941 -589
3724 -589 117 309 -701 897 -559 -120 650 -745 603 -309 -174 710 -840 489 40 -384 619
3741 619 -670 409 149 -611 698 -442 134 223 -564 691 -389 -98 424 -519 478 -256 -152 517
3759E17j090R06l43k40O98r32P50j30n44Q59p60M14R1o12Q72o63J20L84o53P02
3779C46m80j9N38p30N32j63k01N05o36M34J2m12N50m50K12J07m19N22l41J0K50
3800A67l77L66k02o1K97l54K36l8j33K36k53J39N5j89K04j33K7Q8j48J45p2n0
3822e0J15q7L8J1n9Q8n2m9J13r9M0K5q6J22r4j6J23j51Q6Mj02J73j74P1Q9j87
3848a08J85j12pJ53k47K16n7j26K38k51J57K4k20L23k53N9J44k76L16k16rK42
3870A75l58L01j08j34L20l84K68j7k51L93l43J59J06l46M28l09N4K05l87M12k43
3891e9m5L11m32L58j26j59L85m40K80Jk70M34l98J85J23l75M55l34O9K30m09M04
3913A88k30n1L06m31L56j18j68L62m04K64lk58L96l52J59J10l27L91k93O6J98
$$ plain form
3759 517 -573 333 -10 -250 448 -484 266 136 -408 451 -309 105 196 -416 456 -207 -87 297 -356 346
3779 346 -134 -153 385 -345 187 24 -177 328 -308 126 138 -274 276 -174 38 145 -274 248 -93 -83 167
3800 167 -210 156 -46 -107 190 -164 72 34 -99 137 -116 23 78 -111 93 -40 -13 75 -73 72 0 -50
3822 -50 65 -22 16 27 -32 56 4 -45 68 -31 9 34 -52 70 -24 -40 83 -68 18 22 -80 93 -81 -10 79 -108
3848 -108 77 -35 -42 111 -136 80 23 -103 135 -116 41 65 -155 168 -85 -26 118 -158 158 -58 -67 175
3870 175 -183 118 10 -124 196 -188 80 63 -188 205 -138 21 127 -219 209 -100 -46 159 -228 184 -59
3891 -59 -104 207 -225 133 7 -152 233 -207 73 74 -196 238 -160 25 148 -227 228 -106 -37 193 -216 188
3913 188 -42 -93 213 -218 138 20 -148 214 -190 74 71 -187 209 -143 16 126 -201 190 -103 -37 161
3934A61l47L33j92l5K60l58K82j00j07K51k92K12j9j73K71k43J27L3j97K81k14
3955f6O0Q5j80J97j54L3J22j95J67r0rJ05j64J44n4l4R6j21R9m9m6Q7o2O4m6J
3981a0M3o2N5m2L8j1n0R8q7L8J0o8J27j29N9L1j09J71j72P6P6j78K00j64N0J16
4007A06k53K75j53n0K20l12K96j32j42L42l76K64m1k17M22m34K07J12l66M77m13
4028a68J55K30n14N31l06nL20n59N56k56j86N05n85M73j55l05O55o63L50P8m51
4049c00O78o54K76K86o76P10m78Q3M16q12P98l55k18O34q16P07k34m40Q93q49
4069c51M58O7o00R67q94L02M35q77R30o74J33N97j095R93l98k64P66j045R17k65
4089A02n76J050r87N92j8o79J173j051L49M22r04J067q70K09O74j191J053m91
$$ plain form
3934 161 -186 147 -45 -80 180 -178 104 4 -103 148 -144 68 49 -124 147 -96 31 64 -133 148 -66
3955 -66 -6 79 -101 96 -58 -25 97 -98 69 -21 -30 75 -89 55 1 -33 63 -58 41 -8 -54 33 -29 35 -11 -10
3981 -10 33 -29 26 -16 22 11 -39 59 -28 10 20 -48 79 -50 9 40 -69 102 -70 6 82 -96 104 -60 -10 106
4007 106 -147 128 -25 -75 145 -167 129 -3 -145 197 -179 85 44 -173 249 -185 22 134 -232 245 -168
4028 -168 -13 217 -297 234 -72 -77 243 -316 240 -16 -202 303 -282 191 36 -269 386 -277 73 151 -300
4049 -300 378 -276 0 286 -390 320 -158 -75 341 -471 327 -28 -246 388 -428 279 45 -395 498 -351
4069 -351 107 174 -426 541 -353 -51 384 -493 437 -237 -104 493 -602 391 -7 -271 495 -550 367 102
4089 102 -474 576 -411 181 163 -516 657 -394 -45 377 -527 540 -330 -121 553 -638 415 -76
4107g6j65P96j214J061k75o13J078j075P35o6p95J319j102L65M00r55J231r89
4125c40J45Q34j300J118n71j52R38j412J119k08o84J145j209Q59k6r56J417j099
4143c82L81L60j023J376j064J14Q44j236J109o58j00R77j416J062k19n49J042
4160F18j231R16l6r16J299j020M39K61r91J356r86O7P49j112J111p23j09J002
4178F94j357R70k32m82J054j285Q70P8r42J218r86M70K82j053J346q78K1O77j054
4197e89J111o87j73R94j220Q43k38m08R96j199P59R4p72J012q91M63K45r41J127
4216E26p13O4M99q96R88n86j74P96r54P14k53l25Q62r98N74Q6o07Q34p89M11K47
4237C06q13R12n65N8M35q09Q58m42k13O92p94O11k06l40P63q03M30J03m98O98
$$ plain form
4107 -76 -241 555 -659 402 127 -486 592 -483 252 186 -609 710 -392 -27 373 -582 649 -340
4125 -340 -195 639 -661 457 -114 -266 672 -740 379 171 -513 632 -577 282 256 -700 717 -382
4143 -382 -1 359 -664 712 -352 -238 606 -630 479 -179 -279 698 -718 344 125 -424 618
4160 618 -613 303 267 -649 650 -370 69 330 -661 695 -291 -224 525 -587 524 -199 -308 694
4178 694 -663 307 75 -407 647 -638 232 310 -632 586 -400 70 352 -701 645 -233 -212 465 -589
4197 -589 522 -165 -338 656 -564 279 41 -367 629 -570 189 283 -489 523 -368 95 340 -601 526
4216 526 -187 -123 376 -520 468 -118 -292 504 -450 264 11 -314 548 -450 124 210 -397 437 -352 59 306
4237 306 -507 405 -160 -102 333 -476 382 -60 -273 419 -375 236 30 -310 453 -350 80 183 -315 383
4257C83o61L07K40o48O83m26N0L49o45O48l05j65M76n65M58j65k45N45n43K92
4277F3L2l13M76m43J81J94m28M35k77L9K28m36M20j81j05L01l71K96p7j90L60
4298B04l19J48M9k24L17k65P1J45k75K65j41k6J78k51J99m3j11J82j79J21kj33
4320i0J86j35K3N9r6J07p9JP9r6N3kk6M8n4L4K3m6L1oj7L1k4lM4p5N8lm1N9p5
4351c2N0Qq9J14p0KO0j10J26o3n1J17j27R1j2q0J59j59Q1L8j44J83j36K8J11k11
4377a16J96q7m7J71k21J64l7j17K27k24J18L9j75K41j96P1R0k25K50j74J3J64
4399A25k63K26r8p8K28k71J91k4j53K54k54J45L7j87K60k20Q1R8k37K62j68QJ53
4422A15k47K35j09o8K24k63J97m8j27K44k60J48K6j90K56k14P5J07k34K42j55
$$ plain form
4257 383 -278 29 269 -379 304 -122 -72 277 -368 280 -25 -190 286 -279 179 14 -231 314 -229 63
4277 63 95 -218 258 -185 -4 190 -238 197 -80 -41 187 -249 171 -10 -115 186 -185 111 34 -156 204
4298 204 -115 33 82 -142 175 -90 -19 126 -149 116 -25 -51 127 -124 75 32 -79 103 -76 45 43 -90
4320 -90 96 -39 -16 43 -53 54 -25 -24 55 -41 12 10 -16 32 -22 12 35 -11 20 14 -3 28 4 1 45 -30 28 25 -16 43 -32
4351 -32 18 26 -63 51 -19 -17 43 -67 59 -4 -55 62 -65 26 14 -66 93 -66 15 53 -91 92 -44 -16 95 -116
4377 -116 80 -7 -54 117 -104 60 23 -94 133 -91 27 66 -109 132 -64 7 97 -128 122 -52 -39 125
4399 125 -138 88 -10 -88 140 -131 60 36 -117 137 -117 28 65 -122 138 -82 -1 97 -140 122 -46 -38 115
4422 115 -132 103 -6 -74 150 -113 84 36 -91 153 -107 41 67 -123 133 -81 -6 101 -133 109 -46
4443d6J0J36k24K13r8n3J67k14J55l3j00J99k05J13K0j25J97j68O7O1j49J55j08
4466c0J5Q7j50J31n1m3J10j32J10m8m2J12j13P3k0n2R2q9N3lm4O2n5L8Km9O7n0
4494a9K6oj4K3k0K4k6J8J4m1N2l4J2K4o0P1n8RK7n9R6o7mO5j13J21o6j4R9j69
4524h9J34k3r0J59j80J27J4j60K19j82Q3N4k06K64j95L0J50k60K76j68l1K13k92
4547a53K53r7r5K78l49K42ok28L36l10J86M6k85L92k95O5J56l30L97k74k5K91
4569A95m02L55j67r8L61m77L22k0k56M22m48K81O9l97N08l91J26J97m66N50l52
4590h8k9L68n28M92k55j43N20o18M01l6l15N60n91L34J09m94O13m66J72K09n62
4611c47O56l97m0L94n83N66k93j71N71o56M46j04k83N99o65L66J22m88O13n19
$$ plain form
4443 -46 -36 100 -124 89 -9 -62 105 -109 46 13 -87 112 -93 20 40 -85 112 -56 11 72 -77 78 -30
4466 -30 -15 72 -78 53 2 -41 69 -63 47 -1 -43 69 -44 29 9 -43 49 -40 13 10 -34 28 -27 11 13 -36 31 -19
4494 -19 7 1 -13 10 -10 14 -12 6 20 -21 31 -3 9 33 -27 44 -14 -5 22 -37 59 -8 -12 53 -60 61 -5 -19 80 -89
4524 -89 45 22 -68 91 -89 38 52 -108 111 -71 12 66 -140 124 -71 -41 109 -151 125 -43 -74 139 -153
4547 -153 100 3 -92 186 -163 79 73 -155 181 -129 57 103 -182 210 -85 -20 136 -194 203 -71 -96 195
4569 195 -207 148 -19 -117 244 -233 89 69 -187 235 -213 68 137 -260 248 -143 -17 180 -286 264 -88
4590 -88 -117 251 -277 215 -40 -183 337 -281 120 84 -231 329 -262 72 181 -313 300 -166 6 215 -347
4611 -347 309 -88 -128 266 -317 249 -44 -215 356 -300 146 42 -241 358 -307 59 181 -307 306 -213
4631b13K28K26o29P00m08j6M01o42O38l29j93N99o80M82j07l31P00p35L66J39
4651A96n21O80o00K51K75o84P22m25JM08p03O97l20k28O05o90N23j47l40P10o97
4672b87L47R4m57O66o23K50K76o33O47l99M3L62o71O56k78k01N33o34N20j64l26
4693b79O65o43L29N5m21O49n96K07K93n93O13m23N8L88o84O23k47j92M95o21N12
4714A88j31l48O30n85L13N1m04O19n33J71K60n16N51m00O5L39n80N05k14j28M06
4735B59n30M41j06k83M86m63K72Ll26N17m37J33J96l88M42l31M0K92m70L99j72
4756b6j00L30m47L61o6k53M16l86K28L4l02M39l46R3J58l34L89k64J6K49l62K97
4778A24j34p3K71l60K56l9j68K76k72J62J9k04K91k20N8R1k16K46j67J6J56k32
$$ plain form
4631 -213 15 241 -388 312 -96 -112 289 -353 285 -44 -237 362 -318 164 57 -274 426 -309 57 196
4651 196 -325 355 -245 6 281 -403 319 -106 -105 303 -400 297 -23 -251 354 -336 187 40 -300 410 -287
4672 -287 60 154 -303 363 -260 -10 266 -367 280 -119 -76 286 -385 271 -7 -208 325 -309 211 47 -279
4693 -279 386 -257 72 127 -294 355 -241 -34 259 -334 279 -144 -86 302 -382 241 -6 -198 297 -324 188
4714 188 57 -291 339 -246 67 118 -286 333 -200 -29 231 -285 266 -134 -69 270 -310 195 -19 -147 259
4735 259 -271 170 64 -219 267 -196 76 79 -247 270 -167 -34 162 -226 216 -115 -75 217 -253 146 -26
4756 -26 -126 204 -243 118 52 -201 215 -171 57 91 -211 228 -118 -25 133 -201 188 -76 -60 189 -173 124
4778 124 -10 -83 188 -172 84 45 -123 153 -119 43 62 -142 149 -71 -13 78 -138 108 -59 -43 113 -119
4800a19J82q6l4J71k18J41j6r6J75j82J10J8j27J65j21K5O3j37J64r3j2R4j22
4823e5R0l0m1R7j20P4Oo1Q2p4M3J0o3O4k7pL0l4K6j3k6M0j7mK0k5K0Kk5L4j4j4
4855a2L5l1K3Ll2M3l7NK8n5O6m2pM9p3M7Jm6O7p2M6Ro2Q9p1L2L2r4J08p3j4Q4
4887D6j09R7l9l5J01j14Q7j0p6J35j40O6L6j13J37j04K7P0j38J37q0j2J09j53
4911g5J34n7n1J34j61J00%r2J53j36O8L3j30J60j15J8P9j49J56q5k2J16j55J33
4935E6n0n1J30j50J04oq9J38j35P1L3j13J48j25M1O8j38J32q3lR5j42J24n5m3
4960d3J20j38Q5mp9J24j16N9L5j03J21q1NN5r0R3n8j4P4r0O1j4l6Q3q1N9j2m6
4988c1P8q3M7J7n7O0l8QK2m4M6k9LJ8l2K3j5kJ3j6QJkljN%Mj1J3Jj7K1k2J8Pk6
$$ plain form
4800 -119 63 -23 -57 114 -104 37 21 -75 100 -82 28 46 -81 84 -37 -12 51 -86 78 -15 -27 67 -55
4823 -55 35 5 -36 61 -59 15 21 -40 42 -32 11 21 -42 22 -5 -12 18 -16 10 -3 -29 11 -6 -10 10 -15 5 7 -18 16 2 -12
4855 -12 23 -8 15 18 -14 29 -8 -3 25 -30 36 -6 -13 36 -37 10 11 -35 32 -40 6 15 -47 42 -29 3 35 -59 49 -24 -38 46
4887 46 -63 34 -5 -40 61 -53 34 24 -52 83 -57 9 45 -68 69 -35 -8 62 -76 61 -19 -31 78 -75
4911 -75 59 2 -49 85 -76 24 24 -68 85 -51 17 50 -80 80 -35 -17 62 -87 69 -16 -38 78 -77 56
4935 56 6 -45 85 -65 39 33 -56 82 -53 18 51 -62 86 -39 2 70 -68 64 -19 -22 73 -69 55 0 -43
4960 -43 77 -61 24 20 -59 65 -51 8 43 -60 61 -20 -15 40 -50 43 -15 -29 45 -45 16 2 -34 49 -32 27 15 -31
4988 -31 47 -36 11 28 -29 31 -7 1 23 -21 25 -4 -1 17 -15 8 -7 -9 4 -12 -4 -3 -5 -8 -9 -4 -4 0 -11 2 3 -14 7 -15 3 10 -16
5025a6L6k1J1J1l8M1k5oM2n5M5j3k6O3q5O2j1n2R1j04N9K2q9J13r9M6M9j31J38
5054E8p2j6R1j42J39p8m5J40j61J22j7q5J78j92R6M0j42J80j69O7Q2j89J99j19
5078c5KJ37k15K09j09o0J92k25J63m8j15K41k48J31M0j83K56k39R7J01k44K66
$$ plain form
5025 -16 20 -1 10 21 -17 24 -1 -7 35 -20 25 12 -14 49 -36 26 15 -37 54 -50 9 31 -58 55 -44 2 51 -80 58
5054 58 -14 -30 61 -81 58 -20 -65 75 -86 36 19 -66 112 -80 16 56 -86 94 -75 -8 74 -115 84 -35
5078 -35 -33 104 -111 98 -11 -71 121 -104 59 11 -104 137 -111 20 60 -123 133 -106 -9 92 -152 114
$$ [...]
8191a9
##END NTUPLES=NMR FID
##END=
